##TITLE=1H_LY-805.40
 CCl4, 8 sc, 
 1.4.2019
##JCAMPDX= 6.0         $$ Bruker NMR JCAMP-DX V2.0
##DATA TYPE= NMR FID
##DATA CLASS= NTUPLES
##ORIGIN= UXNMR, Bruker Analytische Messtechnik GmbH
##OWNER= root
$$ XWIN-NMR		Version 3.5
$$ Mon Apr  1 16:00:38 2019 Russian Standard Time (UT+4h)  she@DPX200
##.OBSERVE FREQUENCY= 200.1316
##.OBSERVE NUCLEUS= ^1H
##.DELAY= (6, 6)
##.ACQUISITION MODE= SIMULTANEOUS
##.ACQUISITION SCHEME= undefined
##.AVERAGES= 8
##.DIGITISER RES= 18
##SPECTROMETER/DATA SYSTEM= spect
##.PULSE SEQUENCE= zg30
##.SOLVENT NAME= CDCl3
##.SHIFT REFERENCE= (INTERNAL, CDCl3, 0, 15.7039)
##AUDIT TRAIL= $$ (NUMBER, WHEN, WHO, WHERE, WHAT)
$$ ##TITLE= Audit trail, XWIN-NMR		Version 3.5
$$ ##JCAMPDX= 5.01
$$ ##ORIGIN= Bruker BioSpin GmbH
$$ ##OWNER= she
$$ F:/spectra/data/she/nmr/H-F/1/audita.txt
$$ ##AUDIT TRAIL=  $$ (NUMBER, WHEN, WHO, WHERE, WHAT)
(   1,<2019-04-01 15:59:26.45 +0400>,<she>,<DPX200>,
      <created by zg, POWCHK disabled, PULCHK disabled
       configuration hash MD5:
       00 E9 B6 7A A2 85 ED C7 34 08 36 98 17 FE 4E 26
       data hash MD5: 16K
       AC 4E A4 F5 FB B7 54 9F 29 9D 8E 57 87 01 3B 6B>)
$$ ##END=
$$ 
$$ hash MD5
$$ 49 90 E6 EA FC 55 BF 4F 72 DA D3 A4 50 A9 8E A3
##$RELAX= 
##$RELAX= 
##$RELAX= 
##$RELAX= 
##$RELAX= 
##$RELAX= 
$$ Bruker specific parameters
$$ --------------------------
##$DU= <F:/spectra>
##$EXPNO= 1
##$NAME= <H-F>
##$PROCNO= 1
##$TYPE= <nmr>
##$USER= <she>
##$AMP= (0..31)
100 100 100 100 100 100 100 100 100 100 100 100 100 100 100 100 100 100 
100 100 100 100 100 100 100 100 100 100 100 100 100 100 
##$AQSEQ= 0
##$AQ_mod= 1
##$AUNM= <au_zg>
##$AUTOPOS= <>
##$BF1= 200.13
##$BF2= 200.13
##$BF3= 200.13
##$BF4= 200.13
##$BF5= 200.13
##$BF6= 200.13
##$BF7= 200.13
##$BF8= 200.13
##$BYTORDA= 1
##$CFDGTYP= 0
##$CFRGTYP= 5
##$CHEMSTR= <none>
##$CNST= (0..31)
1 1 145 1 1 1 1 1 1 1 1 1 1 1 1 1 1 1 1 1 1 1 1 1 1 1 1 1 1 1 1 1 
##$CPDPRG= <>
##$CPDPRG1= <>
##$CPDPRG2= <>
##$CPDPRG3= <>
##$CPDPRG4= <mlev>
##$CPDPRG5= <mlev>
##$CPDPRG6= <mlev>
##$CPDPRG7= <mlev>
##$CPDPRG8= <mlev>
##$CPDPRGB= <>
##$CPDPRGT= <>
##$D= (0..31)
0 1.2 0 0 0 0 0 0 0 0 0 0.03 0 0 0 0 0 0 0 0 0 0 0 0 0 0 0 0 0 0 0 0 
##$DATE= 1554119965
##$DBL= (0..7)
120 120 120 120 120 120 120 120 
##$DBP= (0..7)
150 150 150 150 150 150 150 150 
##$DBP07= 0
##$DBPNAM0= <>
##$DBPNAM1= <>
##$DBPNAM2= <>
##$DBPNAM3= <>
##$DBPNAM4= <>
##$DBPNAM5= <>
##$DBPNAM6= <>
##$DBPNAM7= <>
##$DBPOAL= (0..7)
0.5 0.5 0.5 0.5 0.5 0.5 0.5 0.5 
##$DBPOFFS= (0..7)
0 0 0 0 0 0 0 0 
##$DE= 6
##$DECBNUC= <off>
##$DECIM= 24
##$DECNUC= <off>
##$DECSTAT= 4
##$DIGMOD= 1
##$DIGTYP= 9
##$DL= (0..7)
0 120 120 120 120 120 120 120 
##$DP= (0..7)
150 150 150 150 150 150 150 150 
##$DP07= 0
##$DPNAME0= <>
##$DPNAME1= <>
##$DPNAME2= <>
##$DPNAME3= <>
##$DPNAME4= <>
##$DPNAME5= <>
##$DPNAME6= <>
##$DPNAME7= <>
##$DPOAL= (0..7)
0.5 0.5 0.5 0.5 0.5 0.5 0.5 0.5 
##$DPOFFS= (0..7)
0 0 0 0 0 0 0 0 
##$DQDMODE= 0
##$DR= 18
##$DS= 0
##$DSLIST= <SSSSSSSSSSSSSSS>
##$DSPFIRM= 0
$$ [...]
##$SUBNAM2= <"">
##$SUBNAM3= <"">
##$SUBNAM4= <"">
##$SUBNAM5= <"">
##$SUBNAM6= <"">
##$SUBNAM7= <"">
##$SUBNAM8= <"">
##$SUBNAM9= <"">
##$SW= 24.9336934301222
##$SWIBOX= (0..15)
0 0 2 0 0 0 0 0 0 0 0 0 0 0 0 0 
##$SW_h= 4990.01996007984
##$TD= 16384
##$TD0= 1
##$TE= 0
##$TE2= 300
##$TE3= 300
##$TEG= 300
##$TL= (0..7)
0 120 120 120 120 120 120 120 
##$TP= (0..7)
150 150 150 150 150 150 150 150 
##$TP07= 0
##$TPNAME0= <>
##$TPNAME1= <>
##$TPNAME2= <>
##$TPNAME3= <>
##$TPNAME4= <>
##$TPNAME5= <>
##$TPNAME6= <>
##$TPNAME7= <>
##$TPOAL= (0..7)
0.5 0.5 0.5 0.5 0.5 0.5 0.5 0.5 
##$TPOFFS= (0..7)
0 0 0 0 0 0 0 0 
##$TUNHIN= 0
##$TUNHOUT= 0
##$TUNXOUT= 0
##$USERA1= <user>
##$USERA2= <user>
##$USERA3= <user>
##$USERA4= <user>
##$USERA5= <user>
##$V9= 5
##$VALIST= <valist>
##$VCLIST= <CCCCCCCCCCCCCCC>
##$VD= 0
##$VDLIST= <DDDDDDDDDDDDDDD>
##$VPLIST= <PPPPPPPPPPPPPPP>
##$VTLIST= <TTTTTTTTTTTTTTT>
##$WBST= 1024
##$WBSW= 4
##$XGAIN= (0..3)
0 0 0 0 
##$XL= 0
##$YL= 0
##$YMAX_a= 321830
##$YMIN_a= -230477
##$ZGOPTNS= <>
##$ZL1= 120
##$ZL2= 120
##$ZL3= 120
##$ZL4= 120
##$ABSF1= 10
##$ABSF2= 0
##$ABSG= 5
##$ABSL= 3
##$ALPHA= 0
##$AQORDER= 0
##$ASSFAC= 0
##$ASSFACI= 0
##$ASSFACX= 0
##$ASSWID= 0
##$AUNMP= <proc_1d>
##$AZFE= 0.1
##$AZFW= 0.1
##$BCFW= 1
##$BC_mod= 2
##$BYTORDP= 1
##$COROFFS= 0
##$CY= 11.3945322036743
##$DATMOD= 1
##$DC= 2
##$DFILT= <>
##$DTYPP= 0
##$F1P= 18.9103706918063
##$F2P= -1.10871071338519
##$FCOR= 0.5
##$FTSIZE= 0
##$FT_mod= 4
##$GAMMA= 1
##$GB= 0.15
##$INTBC= 1
##$INTSCL= 1
##$ISEN= 128
##$LB= 0.24
##$LEV0= 0
##$LPBIN= 0
##$MAXI= 10000
##$MC2= 0
##$MEAN= 0
##$ME_mod= 0
##$MI= 1.114404
##$NCOEF= 0
##$NC_proc= 0
##$NLEV= 6
##$NOISF1= 3.799351
##$NOISF2= 2.8
##$NSP= 1
##$NTH_PI= 0
##$NZP= 0
##$OFFSET= 15.70392
##$PC= 1
##$PHC0= -9366.969
##$PHC1= 12.80026
##$PH_mod= 1
##$PKNL= yes
##$PPARMOD= 0
##$PSCAL= 0
##$PSIGN= 0
##$REVERSE= no
##$SF= 200.130013532006
##$SI= 16384
##$SIGF1= 3
##$SIGF2= 2
##$SINO= 400
##$SIOLD= 16384
##$SREGLST= <1H.CDCl3>
##$SSB= 0
##$STSI= 0
##$STSR= 0
##$SW_p= 3612.71676300578
##$SYMM= 0
##$S_DEV= 0
##$TDeff= 0
##$TDoff= 0
##$TI= <>
##$TILT= no
##$TM1= 0
##$TM2= 0
##$TOPLEV= 0
##$USERP1= <user>
##$USERP2= <user>
##$USERP3= <user>
##$USERP4= <user>
##$USERP5= <user>
##$WDW= 1
##$XDIM= 8192
##$YMAX_p= 0
##$YMIN_p= 0
$$ End of Bruker specific parameters
$$ ---------------------------------
##NTUPLES= NMR FID
##VAR_NAME=  TIME,          FID/REAL,        FID/IMAG
##SYMBOL=    X,             R,               I
##VAR_TYPE=  INDEPENDENT,   DEPENDENT,       DEPENDENT
##VAR_FORM=  AFFN,          ASDF,            ASDF
##VAR_DIM=   8192,          8192,            8192
##UNITS=     SECONDS,       ARBITRARY UNITS, ARBITRARY UNITS
##FACTOR=    0.0002004,     1,               1
##FIRST=     0,             0,               0
##LAST=      1.6414764,     0,               0
##MIN=       0,             -230477,         0
##MAX=       1.6414764,     321830,          0
$$ Real data points
##PAGE= N=1
##DATA TABLE= (X++(R..R)), XYDATA
0@%%%%qJ6j6J6k4L2m0N6o6P6r8J21j45J75k08K43k83L31l84M42n11N89o71P63
$$ 0 0 0 0 0 -8 8 -8 8 -16 16 -24 32 -34 42 -56 65 -80 95 -113 130 -153 178 -206 236 -275 314 -357 406
28D06q66R80j104J241j395J563j746J946k165K408k673K960l279L633m023M454
$$ 406 -460 520 -584 657 -738 825 -921 1025 -1140 1268 -1405 1555 -1724 1909 -2114 2340
44B340m931N466o068O751p531Q429r481J0734j2255J4145j6564J9784k4316L1200
$$ 2340 -2591 2875 -3193 3558 -3973 4456 -5025 5709 -6546 7599 -8965 10819 -13497 17703
58A7703m2987O8404k06079J60129K77139m81167K53016J61617m38252J21886L35341
$$ 17703 -25284 43120 -162959 -2830 274309 -206858 46158 207775 -230477 -108591 226750
69B26750k95485K3408J85278k24698j6242J96990r9140l438M6543r0075M2196
$$ 226750 -68735 -45327 139951 -84747 -100989 96001 -3139 -6577 39966 -50109 -7913
80g913M6701p8829O0435N705p5256O9510J3364p6882M3846J2716j7409J8359l2020
$$ -7913 38788 -40041 20394 26099 -49157 20353 33717 -43165 681 13397 -4012 14347 -17673
93a7673K4293J5539q4628R0452N0523j75605Q3040J20198j98501P6349J64081
$$ -17673 6620 22159 -62469 27983 78506 -97099 -14059 106139 -92362 -16013 148068
104A48068k54514J0650K43270j79026l3270J95404j88927n9395K17610r2053l6521
$$ 148068 -106446 -95796 147474 -31552 -64822 130582 -58345 -117740 99870 7817 -28704
115b8704J20521j56319j7194J53085r8396M5653R6995k29024L4534J97105j77314
$$ -28704 91817 -64502 -81696 71389 -27007 18646 115641 -113383 -78849 118256 -59058
126e9058L2269J89870k46745m3110K56291j46565p1764K24081j31027j38526J94850
$$ -59058 -26789 163081 -83664 -126774 129517 -17048 -88812 135269 4242 -134284 60566
137F0566j7020j14606J08669K178r0837M6025K9562l3392n204K3730K0171m7361
$$ 60566 43546 -71060 37609 39787 -51050 -5025 24537 -8855 -14059 9671 29842 -17519
149a7519j5211O5170l7286k6154Q5897n6045n8547J00913m1594m5994J20561p2097
$$ -17519 -32730 32440 -4846 -31000 54897 -1148 -59695 41218 -376 -46370 74191 2094
161B094q7167J39085m4802p4253J56233p8430j34377J82723j4823j39315J64794
$$ 2094 -85073 54012 9210 -65043 91190 12760 -121617 61106 46283 -93032 71762
172G1762j6501j83458J49712N5956j54468J03969M6004j62479O6972Q9313r4124
$$ 71762 55261 -128197 21515 77471 -76997 26972 72976 -89503 -22531 66782 -27342
183b7342K7005L9837p7348K1213L8193k9467K0669m554k6030K7428k0434p112
$$ -27342 -337 39500 -37848 -16635 21558 -7909 12760 8206 -17824 9604 -10830 -17942
195a7942N3021l3302k5376M6164l3931j4581N6077k8814j3727L8710m5844p169
$$ -17942 35079 1777 -23599 22565 -11366 -25947 30130 1316 -12411 26299 -19545 -26714
207b6714N3965k8652J778K7433o1377J0437N8043m3678P454L5170o5547P243N3567
$$ -26714 27251 -1401 377 27810 -33567 -23130 34913 -8765 -1311 33859 -31688 -24445 29122
220B9122l9770J6477K7914o8951J5199M6616m2005K7851J9812p5897L4356M5531
$$ 29122 -10648 5829 33743 -35208 -20009 26607 -15398 12453 32265 -43632 -9276 36255
232C6255o7728L4855M3847q7225K0712O2631p0842J3415O4382p1668j0456O8444
$$ 36255 -31473 3382 47229 -39996 -19284 43347 -27495 -14080 50302 -21366 -31822 36622
244C6622m1990k0645N1979k1976k1852K9694j2283j4788K0923O175q207j1981
$$ 36622 -5368 -26013 25966 3990 -17862 11832 -451 -15239 5684 11859 3652 -8329
256h329r91J4311o864K807J9085k7706j4083L1133j0855j091L2749l7683k6471
$$ -8329 -9320 4991 -1873 934 20019 -7687 -21770 9363 -1492 -2583 30166 -7517 -33988
269c3988M5583o440j0155L5598l8173l0503N4282p476k3101M4121k5789m4810
$$ -33988 11595 5155 -5000 30598 -7575 -38078 16204 8728 -14373 29748 3959 -40851
281d0851M8252P848k7586L3542j2483m4001L4592J9465k3956J2159k084k1486
$$ -40851 7401 15249 -12337 21205 8722 -35279 -687 18778 -5178 6981 4897 -16589
293a6589J6187O293q305J0632p934r330J2604n944m67J4957j6092n919K1409j1228
$$ -16589 -402 5891 -2414 8218 284 -9046 3558 -2386 -2853 12104 -3988 -9907 11502 274
307B74j1860J6961l188m918J2045j0874j1360J3200N577j440n32q228j501K303
$$ 274 -11586 5375 2187 -2731 9314 -1560 -12920 280 5857 4417 3885 -4343 -5844 -3541
321c541J991J2978j909j8542J343L115J222K0453m736k8371O842J0472n174J6939
$$ -3541 -1550 11428 9519 -9023 -7680 -4565 -3343 17110 12374 -15997 -9155 1317 -3857 13082
335A3082Kk7071N768R995q420J7738O004k9854p9J5331m447J1463M140k6348L20
$$ 13082 13084 -13987 -8219 1776 -6644 11094 17098 -12756 -12835 2496 -1951 9512 13652 -12696 -12376
350a2376J8157m857K049N852j4398l106R786m87L898K022j1832j768P830K061
$$ -12376 5781 924 2973 8825 -5573 -8679 1107 620 4518 6540 -5292 -7060 770 2831
364B831J980m226p813O565N838n734m05R06k676M565K285n756q54J788r34L043
$$ 2831 4811 585 -7228 -663 5175 -559 -964 -58 -2734 1831 4116 -1640 -2494 -706 -1640 1403
380A403M046k735q117l021R311P731l662n485o761k595J4174Q046j1611l997M29
$$ 1403 5449 2714 -5403 -8424 887 8618 4956 -529 -7290 -9885 4289 12335 724 -3273 -2844
395b844o679R932J3463j0506q154J107o257R585J7833j2338j6321N534L110M069
$$ -2844 -9523 409 13872 3366 -4788 -3681 -9938 -353 17480 5142 -11179 -5645 -2535 1534
409A534J0419q290j4003N380O070k70N710j090j2090k161R546N687j703m532n955
$$ 1534 11953 3663 -10340 -4960 1110 840 6550 5460 -6630 -8791 755 6442 4739 207 -5748
424e748j353J0205O817r993o893N991J256K61N487n612p878O614L516k306M749
$$ -5748 -7101 3104 9921 -72 -6965 -974 282 543 6030 418 -7460 -846 2670 364 5113
439E113l931j1036O320J1065j944n117n221l243Q062R129l689r286l450M590N121
$$ 5113 1182 -9854 -3534 7531 5587 470 -4751 -7994 68 9197 5508 -3778 -7228 -2638 2483
454B483J784J290n916r494N466J0018p11k29n362j2264Q731J6417p187p943J591
$$ 2483 4267 5557 -359 -9853 -4387 5631 4920 4691 -671 -12935 -4204 12213 5026 -2917 -1326
469a326n883M292J3133o565q463M306k787j74J0357j320r027j573J820N723M189
$$ -1326 -7209 -2917 10216 3651 -4812 -506 -3293 -3467 6890 5570 -3457 -5030 -3210 2513 6702
484F702n854n412K66L863O955l576q792M748K390m085P291k17j1221N330M617
$$ 6702 848 -4564 -4298 -435 6520 2944 -5848 -1100 1290 -2795 4496 4279 -6942 -1612 3005
499C005o267Q088J392j6266N118J2423o307J6P90j1124O764J2225r178l937M408
$$ 3005 -3262 4826 6218 -10048 -4930 7493 1186 1202 1992 -9132 -2368 9857 679 -3258 1150
514A150n070J834P531l294l013r07k681M746M729k208l419n703K360J1310l737
$$ 1150 -3920 -2086 5445 2151 -862 -1769 -4450 296 5025 2817 -602 -6305 -3945 7365 3628
529C628p186M223l676p82J1205n973p404J0498m866p379J4177k223j1382R533
$$ 3628 -3558 665 -3011 -3793 7412 1439 -5965 4533 -333 -7712 6465 4242 -7140 2393
543B393j182o585J2214m633j2848J3581L611j0645O423k429q443J3476J961j2385
$$ 2393 1211 -5374 6840 2207 -10641 2940 6551 -4094 2329 -100 -8543 4933 6894 -5491
557e491O266J101q425Q395L298o875K979k759m104R916K57p648K303j768J686
$$ -5491 775 1876 -6549 1846 5144 -1731 1248 -1511 -5615 4301 4558 -3090 -787 -2555 -869
572h69R177q676p918R713m17j866Q136p435p897Q336k16k21Q481p075r214M712
$$ -869 8308 -368 -8286 1427 1010 -856 7280 -155 -8052 284 68 -153 8328 1253 -7961 -3249
588c249K165N769L907j3351j517R646n944K624P734j3218J124J3370j2432k714
$$ -3249 -1084 4685 8592 -4759 -6276 3370 -2574 50 7784 -5434 -4310 9060 -3372 -6086
602f086J4194j1088m320J6880o166r055O370n978J110J5202n798r870R73l258
$$ -6086 8108 -2980 -7300 9580 3414 -5641 729 -5249 -4139 11063 5265 -4605 -3632 -6890
616f890Q159R518j1885j544N569j1792O099J4929j3269l922R883j0225K207J4434
$$ -6890 1269 10787 -1098 -2642 2927 -8865 -2766 12163 -1106 -5028 4855 -5370 -3163 11271
630A1271j3139q121J2862N18p01J450j1644P33J0423j636M067p84j5709L938J0212
$$ 11271 -1868 -9989 2873 3391 2690 4140 -7504 -6771 3652 2016 6083 5299 -10410 -6472 3740
645C740n442Q849L888k1990k14J6547l140M39K899j1249R52P617l057J830j817
$$ 3740 -1702 7147 11035 -10955 -11169 5378 2238 2677 5576 -5673 -4721 2896 -161 1669 -148
660a48l753R872m461r579J3935m836j4728K2684M418k4808J0234N331j9152J9924
$$ -148 -3901 5971 1510 -8069 5866 1030 -13698 8986 13404 -11404 -1170 4161 -14991 4933
674D933J5859k9005k057J5794j1259L841J4019j1726o123M740k079M980K270n244
$$ 4933 20792 -8213 -10270 5524 -5735 -1894 12125 399 -5724 -984 -3063 1917 4187 -1057
688a057K159m445j143J3996p618j3560J4104K792q556R199n096j1755J2005L250
$$ -1057 1102 -3343 -4486 9510 1892 -11668 2436 5228 -3328 5871 775 -10980 1025 4275
702D275m449O875q326o881J0417m434L265J4181k0348r272K4058q335r434K1360
$$ 4275 -174 6701 -1625 -8506 1911 -2523 742 14923 -5425 -14697 9361 1026 -8408 12952
716A2952j2214j6325K4501k134j9336J6226L731j5083P852N215o788o10j479N094
$$ 12952 738 -15587 8914 6780 -12556 3670 7401 -7682 170 5385 -1403 -2013 -3492 1602
730A602M176r052M643J678j6111J4698J5388k6019J453K0289k0529q37K4200j6772
$$ 1602 5778 -3274 1369 3047 -13064 1634 17022 -8997 -7544 12745 -7784 -8621 15579 -1193
744a193q956J8975j0426o925J6932n693q364O224k096L744J927j0735P041M974
$$ -1193 -10149 8826 -1600 -8525 8407 2714 -5650 574 -1522 2222 4149 -6586 455 5429
758E429j2229Q858M813j5633R098P594j5995P510Q911j3103L044L573n724R553
$$ 5429 -6800 2058 6871 -8762 336 7930 -8065 -555 8356 -4747 -1703 1870 -3854 5699
772E699m588r684J5825o043j2132K1576p952j8354K7681m776k7567K8696N830
$$ 5699 1111 -8573 7252 1209 -10923 10653 2701 -15653 12028 7252 -20315 8381 14211
785A4211l2478J9294J3265k6809J1409J3334k1327N159J3325j1359j522L914J12
$$ 14211 -18267 1027 14292 -12517 -1108 12226 -9101 -3942 9383 -1976 -3498 416 528
798E28L162p859J679J1313j3913j032J7364j5675l478K1699j7349q992K5400j1315
$$ 528 3690 -4169 -2490 8823 -5090 -6122 11242 -4433 -7911 13788 -3561 -12553 12847 1532
812A532j2871J9920p827q687J6200j0145n051J6615j1936m273J5024j3101N39
$$ 1532 -11339 8581 754 -7933 8267 -1878 -6929 9686 -2250 -6523 8501 -4600 -4061
825d061J6454j9287j731K1859j6152n352J8880j3300m779J5553j0194j241J0856
$$ -4061 12393 -6894 -8625 13234 -2918 -8270 10610 -2690 -7469 8084 -2110 -3351 7505
838G505j2018J217P731r373J0196J294k0852J6382R452k4554J5415J1192k8920
$$ 7505 -4513 -3296 4435 -4938 5258 6552 -14300 2082 11534 -13020 2395 13587 -15333
851a5333J4639J6564l0373J0798K1385k8012L608K1153k0636k61J5075j3676M399
$$ -15333 -694 15870 -14503 -3705 17680 -10332 -6724 14429 -6207 -6468 8607 -5069 -670
864f70J0129j5251K034O225o868J0551j145j4089J2191m74j3054J6608P79j4806
$$ -670 9459 -5792 -3758 2467 -4401 6150 5005 -9084 3107 2633 -10421 6187 6966 -7840
878g840J2603l674j2860J8880j485j4477J5507m284j2432J6740o568j0595K2731
$$ -7840 4763 1089 -11771 7109 5624 -8853 6654 2370 -10062 6678 110 -10485 12246
891A2246p997j7185J9842n409j3842K2500m690j6583J8862n013j6700J9036J731
$$ 12246 4249 -12936 6906 1497 -12345 10155 5465 -11118 7744 2731 -13969 5067 6798
904F798j2103J0606n623q287J3807m606n160J2049q409l923J1085j1910N28J6912
$$ 6798 -5305 5301 -322 -8609 5198 592 -4568 7481 -928 -4851 6234 -5676 -5148 11764
918A1764j4652l657J6974j4019m595J6697j2175j380J8234j5092q140J5930q254
$$ 11764 -2888 -6545 10429 -3590 -8185 8512 -3663 -5043 13191 -1901 -10041 5889 -2365
931b365k339J4478j0091m050R656j1350j52J4578o509k290M169j0742L276R003
$$ -2365 -4704 9774 -317 -4367 5289 -6061 -6213 8365 1856 -434 3735 -7007 -3731 5272
945E272p715M507M750j1890K735K619p181J2984L360j6599O730K983j2911J3663
$$ 5272 -2443 2064 6814 -5076 -2341 278 -6903 6081 9441 -7158 -428 2555 -10356 3307
959C307O279j6146R418K872j9618J2873J2939j6796M869O879j6411P079J1464
$$ 3307 9586 -6560 2858 5730 -13888 -1015 11924 -4872 -3 6876 -9535 -2456 9008
972I008j4211L392J0312j2062p75P919n964J921M887o448P66L453l472M47J79
$$ 9008 -5203 -1811 8501 -3561 -4336 3583 -2381 -460 4427 -2021 -1255 2198 -1274 -827 -648
987f48N36L972m867k201O654m562k316P465n614p91J0476r986o984J3627l361
$$ -648 -112 3860 -1007 -3208 3446 -1116 -3432 4033 -1581 -2372 8104 -1882 -8866 4761 1400
1002A400n736J1896o307r895J1531k163p088J4104j264j4431N809K975m305Q641
$$ 1400 -4336 7560 1253 -8642 2889 726 -6362 7742 6478 -7953 -2144 831 -3474 5167
1016E167m8r907L367K015m113M951K613l462o59l051l4N968o87j992Q21l651J165
$$ 5167 5119 -4788 -1421 594 -3519 1432 4045 583 -76 -3127 -3161 2807 2120 128 949 -2702 -1537
1033a537M408m516O42N911o037l103O021k041m44M987n565l002O989j801l886
$$ -1537 2871 -1645 -1003 4908 -1129 -4232 1789 -252 -696 4291 -1274 -4276 2713 912 -2974
1048b974N359m74m360J947L05n46L406o35m622n29L660K478k224j995J693j825
$$ -2974 2385 1911 -2449 -502 -197 -743 2663 2028 -2594 -3123 537 3015 791 -1204 489 -1336
1064a336j409N317j78l964L316k640n456R424L667j0375J779M251o768M475O430
$$ -1336 -2745 2572 2394 -1570 1746 -894 -6350 3074 6741 -3634 -1855 2396 -4372 103 6533
1079F533r245l34P764p496j970J0628l288o965N253p12l708O558N00p413K787
$$ 6533 -2712 -3046 4718 -2778 -4748 5880 2592 -4373 880 168 -3540 3018 3518 -3895 -1108
1094a108M702n475j083O392j510m545L185l20l769N828K261q349J770O101o681
$$ -1108 3594 -1881 -2964 3428 1918 -2627 558 238 -3531 2297 4558 -3791 -2021 4080 -2601
1109b601m06Q229m646l810N814m531k624J0506k295r395N600K297n568M838K586
$$ -2601 -3007 5222 576 -3234 2580 -1951 -4575 5931 3636 -5759 -159 2138 -3430 1408 3994
1124C994o649J473K900m465J653N986l628n229K618K725j318Q93Q29m073J90M929
$$ 3994 -2655 -1182 1718 -2747 -1094 4892 1264 -3965 -1347 1378 60 953 1782 -2291 -2101 2828
1140B828k891k716O176j618o685M852K923m569L144N04o380M123M255o030Q23
$$ 2828 -63 -2779 3397 1779 -4906 -54 2869 -1700 1444 1948 -4432 -309 3946 -2084 -1261
1155a261M266l698q11J847j124J740R09k791k73L81J188J935l676l6M713m847
$$ -1261 3005 -693 -1504 343 -781 959 1868 -923 -1196 -815 373 2308 -1368 -1404 3309 -1538
1171a538k292P428k556l294N588n082l622J0525k200q103P257p1o976O469J650
$$ -1538 -3830 3598 1042 -2252 3336 -1746 -5368 5157 2957 -5146 2111 2040 -4936 1533 3183
1186C183o201M496P12o844L764N051l711j954Q67L89J37L74J322k038j336M064
$$ 3183 -3018 1478 2190 -4654 -890 4161 450 -1504 -637 -248 -111 263 1585 -453 -1789 2275
1202B275k894l588Q577j129r282P189J991q646Q614J768j2756R019N831j4701
$$ 2275 -619 -4207 4370 3241 -6041 1148 3139 -5507 3107 4875 -7881 1138 6969 -7732
1216g732O754R302j3423L119Q218j2260M273J0478j2663l49J0293q187j004P520
$$ -7732 -978 8324 -5099 -1980 6238 -6022 -1749 8729 -3934 -4283 6010 -2177 -3181 4339
1230D339n504J35M138o171J332M739l065J014j425l205O214j072m921O684k071
$$ 4339 -1165 -1030 3108 -3063 -1731 3008 -57 957 -468 -3673 2541 1469 -3452 3232 1161
1245A161n685P065k460l943R631m568q080R613r18n391P696m168m576Q820m796
$$ 1161 -4524 2541 81 -3862 5769 1201 -6879 2734 1816 -3575 4121 -47 -4623 4197 -599
1260e99l714R388n065l290P098p293R88J0358j1068j222J1272j0800N45J1790
$$ -599 -4313 5075 10 -3280 3818 -3475 -2487 7871 -3197 -4419 6853 -3947 -3402 8388
1274H388j3454J427J3912j6495k17J7877j4700k857J6100j5180j663J8669j4901
$$ 8388 -5066 -3639 10273 -6222 -6439 11438 -3262 -6119 9981 -5199 -6862 11807 -3094
1287c094m935J8529j2328o578J6510q875m791J3695j0057n408J3513n303m544
$$ -3094 -8029 10500 -1828 -8406 8104 -771 -5562 8133 -1924 -7332 6181 878 -3666
1300c666P352n213l35M796n678L144L183o879M169j25n974J0767k320j1741J2543
$$ -3666 3686 -1527 -1862 2934 -2744 400 3583 -3296 873 748 -5226 5541 3221 -8520 4023
1315D023p18j1825J4490j924j4192J6446k171j6612J8966R40j8554J5600Q0j6329
$$ 4023 3305 -8520 5970 4046 -10146 6300 4129 -12483 6483 7423 -11131 4469 4549 -11780
1329a1780J8991m48j9300J8029O98j8482J7563J069j6901J7233k030j8149J9602
$$ -11780 7211 6763 -12537 5492 6190 -12292 5271 6340 -10561 6672 4642 -13507 6095
1342F095J180j8161J6175m03j6207J7187o86j6002J6902j39j6575J3756J202j1519
$$ 6095 7275 -10886 5289 4886 -11321 5866 5180 -10822 6080 5941 -10634 3122 4324 -7195
1356g195J2632k490j1554J2619j042q873R740k430n541P828n406j796R452p145
$$ -7195 5437 2947 -8607 4012 2970 -5903 3837 1407 -4134 3694 -1712 -3508 5944 -1201
1370a201j351O328q657N126P314j4652O303R261j7391P853J1474j9737R092J2284
$$ -1201 -2552 3776 -4881 245 7559 -7093 -790 8471 -8920 -1067 10407 -9330 -238 12046
1384A2046k4829R801J8901k6121N077J9837k4904M646K1452k5205K034K3267k3184
$$ 12046 -12783 -2982 15919 -10202 -5125 14712 -10192 -5546 15906 -9299 -7265 16002 -7182
1397g182j624K2647j8601k368J8964j7431j371J8985j5393l732J5576j1209j657
$$ -7182 -8806 13841 -4760 -7128 11836 -5595 -6966 12019 -3374 -7106 8470 -2739 -4396
1410d396J1590j0396L51R211j0023M35P510n732K694Q92p229O710J82o262R084
$$ -4396 7194 -3202 -2851 6360 -3663 -3228 4282 -1450 1244 2136 -5093 1617 1799 -4463 4621
1425D621k861p398J0569o211p125J7638n717j2555J5126n839j0481J8980n585
$$ 4621 1760 -5638 4931 -1280 -8405 9233 3516 -9039 6087 248 -10233 8747 3162
1438C162j2758J8463p030j4907K0045k787j2926J7759p247j4502K0579m440j5129
$$ 3162 -9596 8867 1837 -13070 6975 4188 -8738 9021 1774 -12728 7851 3411 -11718
1451a1718K0508l450j6582J7596l739j5170K0421p31j8129J5628J127j6519J2666
$$ -11718 8790 5340 -11242 6354 2615 -12555 7866 7135 -10994 4634 5761 -10758 1908
1464A908L674j1784J0325J023j2864O774M159n756M350M51l365K042l426j26M823
$$ 1908 5582 -6202 4123 5146 -7718 -944 3215 -2541 1809 2260 -1105 937 -2489 -2615 2208
1479B208j940K376K69q949M907M507q578P735N356j3266M343L887j2468J2019
$$ 2208 268 2644 2913 -6036 -1129 3378 -5200 2535 7891 -5375 -1032 2855 -9613 2406
1493B406R271j8113M909Q445j7470Q041J4006j6674M485J1262k0467K208J8195
$$ 2406 11677 -6436 -1527 6918 -10552 -2511 11495 -5179 -694 10568 -9899 -7691 10504
1506A0504j2997n13J3263j4521l018J3543r449j035J3762q286o697O880m382J76
$$ 10504 -2493 -3006 10257 -4264 -7282 6261 -3188 -4223 9539 1253 -5444 1436 -2946 -2770
1520b770Q132m287j928L174n281m04M142m76L019l67o413J881J421k245M852O6
$$ -2770 5362 1075 -853 2321 -2960 -3364 778 302 3321 2954 -3459 -1578 -157 -2402 2450 2516
1536B516l296L583m270m929Q245R14l627N390m704n946P800k042l478J0820l041
$$ 2516 -780 2803 -1467 -6396 1849 2763 -864 4526 -178 -6124 1676 -366 -3844 6976 3935
1551C935r545N886j946l582J1904k217r220P234k452p713J0351J668o542O663
$$ 3935 -5610 276 -1670 -5252 6652 4435 -4785 2449 -3 -7716 2635 4303 -2239 4424
1565D424l893r033R775K496p073O673K50q570M504J059m912P642K195q233J077
$$ 4424 531 -8502 1273 3769 -3304 3369 3619 -4951 -447 612 -4300 3342 5537 -2696 -1619
1580a619J559k865L860J851k815J046j152k817J801J675J650P2m243R71K392l663
$$ -1619 -60 -2925 935 2786 -29 1017 -135 -2952 -1151 524 2174 2246 -1997 -1026 1366 -2297
1596b297J744L334l855K019J898p576K553O729o085O97N598p170o83O213n655
$$ -2297 -553 2781 -1074 945 2843 -4733 -2180 4549 -1536 -839 4759 -2411 -3094 3119 -2536
1611b536Q18Q363p117m380O981k804j680O329l475k920M874l344k959N807J21
$$ -2536 -1718 6645 -472 -4852 2129 -675 -2355 3974 499 -2421 2453 -891 -3850 1957 2078
1626B078k393J224k334l39L157j623K5J953k092k01K80k022L594J852m916Q97
$$ 2078 -315 909 -1425 -1764 1393 -230 -205 1748 -344 -545 -265 -2287 1307 3159 -1757 -860
1642h60J926k884K351J382l947K821J402n546K594L727l888R57J106l976L180
$$ -860 1066 -1818 533 1915 -2032 789 2191 -3355 -761 2966 -922 35 1141 -2835 345
1657C45K598n032J386K771l523J165J598k812K414O81m233K302K425k909J135
$$ 345 2943 -2089 -703 2068 -1455 -290 1308 -1504 910 1591 -2642 -340 2085 -824 311
1672C11K3k353L480j14m152L628J230l869K187L20k978M000J26m736L180J815
$$ 311 334 -2019 1461 1347 -2805 823 2053 -1816 371 691 -2287 1713 1839 -2897 283 2098
1688B098l918J766J115k439K230R6l142K656J294k757M97K36J91J967k128j771
$$ 2098 -1820 -54 1061 -1378 852 948 -2194 462 1756 -1001 -504 -268 -77 1890 -238 -2009
1704b009K829p47o96K348k222n70K922l348p67N567k341k950L058k317n84N044
$$ -2009 820 73 -623 1725 -497 -1067 1855 -1493 -2260 3307 966 -1984 1074 -1243 -1827 3217
1720C217k885k825M852k043l544M169J97j653K453k614k371M268J43k062J449
$$ 3217 332 -2493 2359 316 -3228 941 1138 -515 1938 -676 -3047 1221 1364 -698 751
1735G51q57p87J201j346J049K191k528p05Q82j241K678R59m677J893K818m178
$$ 751 -106 -893 308 -1038 11 2202 -326 -1031 -149 -1390 1288 2247 -2430 -537 2281 -1897
1751a897J136L199l816J245K242n072K078M908m898j153L653k831N17L364l714
$$ -1897 -761 2438 -1378 -133 2109 -2963 -885 4023 -875 -2028 1625 -1206 -689 2675 -1039
1766a039k01L320l125p90L515p88r88P0j874J641K176j732m17l2o62J622p52q57
$$ -1039 -1240 2080 -1045 -1835 1680 892 -96 -26 -1900 -259 1917 185 -232 -264 -926 696 -56 -913
1784i13L001j532l102K730Q0r82L469k650l692N012j64l569M018j13m139L135
$$ -913 2088 556 -2546 184 264 -718 2751 101 -3591 1421 1257 -2312 1706 1593 -2546 589
1800E89l10k686N033j94n507K272J653j843K620o29k904K538n30k153L370K39
$$ 589 279 -2407 2626 2432 -3075 -803 850 -993 1627 998 -1906 632 102 -2051 1319 1558
1816A558k093J068k132m59M712j433k677K332j328j311L132j069p07K637k943
$$ 1558 -535 533 -1599 -2058 2654 1221 -1456 876 -452 -1763 1369 300 -407 2230 -713
1831g13k294L729N41o89N48k678N7K769j481J18J735k246j97Q65j684K877J582
$$ -713 -3007 722 1263 574 1122 -1556 -1499 1270 -211 -93 1642 -604 -801 64 -1620 1257 2839
1848B839m504K34J958j586K427L15l992K618R91m223L431K429m440J664M24m107
$$ 2839 -1665 -1431 527 -1059 1368 1683 -2309 309 1300 -2923 508 2937 -1503 161 585 -3522
1864c522M891K418o349J816K589m346K436K726m043J767J267m736K108L525k157
$$ -3522 1369 3787 -2562 -746 1843 -2503 -67 2659 -1384 383 1650 -3086 -978 2547 390
1879C90Q5r29j799L228j60j746K821j786k359L262j884m38N700m351m227N778
$$ 390 475 -454 -2253 975 815 -931 1890 104 -2255 1007 -877 -1315 4385 34 -4193 1585
1895A585j317k089N493l575l659N959k720l001O870j883m426L822k304q89O444
$$ 1585 268 -1821 3672 97 -3562 2397 -323 -3324 3546 1663 -2763 1059 -1245 -2134 4310
1910D310l753l663M922k461j587N099k813j243L636m595o33N936k582j082K049
$$ 4310 557 -3106 1816 -645 -2232 2867 54 -1189 2447 -2148 -2781 3155 573 -509 1540
1925A540m572K033M377n034J547L343o343J881L900n439M150L318r760K926O472
$$ 1540 -3032 -999 3378 -1656 -109 3234 -3109 -1228 2672 -2767 1383 4701 -5059 -2133 4339
1940D339o906K728M333q649K755N210p520L537N617q408J102L984n365M677L099
$$ 4339 -2567 161 4494 -4155 -1400 3810 -3710 -173 5444 -2964 -1862 2122 -3243 1434 4533
1955D533q550L202L712o688M735K821p116M428R64p620O935L469p964L613R81
$$ 4533 -4017 -815 2897 -3791 944 3765 -3351 1077 2041 -5579 1356 4825 -3139 474 1455
1970A455o074O539J446p043N460J01o607N913P47m197N915l415n967Q054m51m483
$$ 1455 -4619 1920 3366 -3677 1783 1884 -4723 1190 1937 -2260 3655 240 -5727 2327 1876 -2607
1986b607O204l791m352P828l671k942Q941n320n329P852m063j238R187p954m191
$$ -2607 3597 -194 -4546 3282 -389 -3331 5610 290 -5039 2813 -1250 -2488 6699 -1255 -5446
2001e446J0167o210k475J0667p565l754R861q001k305J2920p587n814R854n943
$$ -5446 4721 -1489 -3964 6703 -862 -4616 5245 -2756 -5061 7859 272 -5542 4312 -1631
2015a631k472J0585o964m057R343o070l098R008m621k049N515o690N59P719o039
$$ -1631 -4103 6482 -482 -4539 4804 -1266 -4364 4644 23 -2026 3489 -3201 -2642 5077 -962
2030i62l76M308o530K704M766p022L812L746r279L595M563o615N918J443j0678
$$ -962 -1338 2970 -3560 -856 3910 -3112 700 4446 -4833 -1238 3325 -3290 2628 4071 -6607
2045f607O631L891q816P580K263j0970O830J691r261J0776K492j2943O802K060
$$ -6607 24 3915 -4901 2679 4942 -6028 802 2493 -6768 4008 6500 -6443 359 2419
2059B419r051J0668J496j1928Q426Q00j0605J0528K561j0217P682j182r374J1397
$$ 2419 -6632 4036 5532 -6396 2030 2830 -7775 2753 5314 -4903 2779 1597 -7777 3620
2073C620J147j0427Q200k29q397R273o11p784Q948j753p800Q528n85n639O645
$$ 3620 4767 -5660 2540 2311 -6086 3187 2576 -5208 3740 1987 -5813 2715 2130 -3509 3136
2088C136l582l855Q637l730m027O843m775j655P292o309K54P870r238r67Q859
$$ 3136 -446 -4301 4336 606 -3421 3422 -1353 -3008 4284 -2025 -1771 6099 -3139 -4106 4753
2103D753p425J748Q141j1731P79R636j0564K469J1008j1921k43Q400j1582M337
$$ 4753 -2672 -924 7217 -4514 -3735 5901 -4663 -2194 8814 -3107 -3350 5050 -6532 -2195
2117b195J2553j3234r92R400j1373K721J1567j1016P48Q013j2493K086J1440q645
$$ -2195 10358 -2876 -3868 5532 -5841 -3120 8447 -2569 -1821 6192 -6301 -4215 7225 -1420
2131a420N42N675j0196L069P922q575K445N150q403L058L632o676N495J937q506
$$ -1420 -878 4797 -5399 -2330 5592 -2983 -538 4612 -3791 -733 2899 -3777 1718 3655 -4851
2146d851N704K059o792O089p35o619Q716j180p809Q725j552p199R212k751o479
$$ -4851 853 2912 -3880 2209 1474 -5145 3571 2391 -5418 3307 1755 -5444 3768 1017 -5462
2161e462J1239m222q815J1198k664o876J1630m637q170J1865m929p737J3992l250
$$ -5462 5777 1555 -7260 3938 1274 -5602 6028 1391 -6779 5086 157 -7580 6412 3162
2175C162r142J0204m880o648J3901l703q794J0468m341p438J1569k373n686Q919
$$ 3162 -5980 4224 -656 -7304 6597 2894 -5900 4568 227 -7211 4358 1985 -3701 5218
2189E218n919o275J0844k125m363O872n643l099Q388m739j696P525o137k087O190
$$ 5218 -701 -6976 3868 1743 -2620 4252 -1391 -4490 3898 -841 -2537 4988 -1149 -3236 2954
2204B954n150J557N794q383Q71O541p000K245N074q512L620N078r794M603O378
$$ 2954 -2196 -639 5155 -3228 -2357 4184 -2816 -571 4503 -4009 -389 4689 -5105 -502 5876
2219E876j0050L579M695r576O218N423j1675N068N752j0857N243N888j0311N363
$$ 5876 -4174 -595 4100 -5476 742 6165 -5510 -442 5310 -5547 -304 5584 -4727 636
2233F36M161j1537O458O582j0480M241M078j0009O201M894r942N312M268r998
$$ 636 4797 -6740 -282 6300 -4180 61 4139 -5870 331 5225 -4717 595 4863 -5135
2247e135M302M691p064M670J967q611N040L619o357L994J195n764M423J58m467
$$ -5135 -833 3858 -3206 1464 3431 -5180 -140 3479 -2878 1116 2311 -3453 970 1128 -3339
2262c339O116n84n741M570j095k588O722l325m860O839k745l645P536l261l663
$$ -3339 2777 2193 -3548 1022 -73 -2661 4061 736 -4124 2715 -30 -3675 3861 600 -3063
2277c063O422m858k792R445m132m858O859m173k438Q542n014l769P998m899l762
$$ -3063 3359 -1499 -4291 5154 1022 -3836 3023 -1150 -3588 4954 -60 -3829 4169 -730 -4492
2292d492Q493l444l323O455n282k471Q518l929l576O130l878k003O037m301j122
$$ -4492 4001 557 -2766 3689 -1593 -4064 4454 525 -3051 3079 -799 -2802 3235 -1066 -2188
2307b188O350m950k397N496l141m51M672m560q69M586m116l22M928l066n14J789
$$ -2188 4162 -788 -3185 2311 -830 -1281 3391 -1169 -2038 2548 -1568 -1890 3038 -28 -542 1247
2323A247m217K269M072m006L47J516l939K825K019m064L156J055o065L506K932
$$ 1247 -2970 -701 3371 -635 -288 1228 -2711 114 2133 -1931 1225 2280 -3785 -279 2653
2338B653m598K957O68n723N007K705o699K743K227m922M019K131o130L035J902
$$ 2653 -1945 1012 1680 -4043 964 3669 -3030 -287 1940 -2982 1037 3168 -2962 73 1975
2353A975n716M161L527n354J080Q67l993M503K506n248J297J551l265K201J195
$$ 1975 -3741 420 3947 -1407 -327 540 -3453 1050 3556 -1692 -395 1156 -2109 92 1287
2368A287k372K442k32l377K307M07j584K574q85j453K686k776k365M752K82j550
$$ 1287 -1085 1357 1125 -2252 55 462 -1122 1452 567 -886 1800 -976 -3341 1411 1693 143
2384A43J861l793j668N377r21j601L402l257k917M069p60j48L738m004l003M751
$$ 143 2004 -1789 -3457 1920 999 -602 2800 -457 -3374 695 -65 -213 3525 -479 -3482 1269
2400A269q23j568L107k657r65M293k771k491L969j437j177L724j994k060K287
$$ 1269 446 -1122 1985 -672 -1637 2656 -115 -2606 1363 -74 -1251 2473 479 -1581 706
2415G06k242k33M815j155l097N09j094R51L361j724j412J044j621J68J771o57
$$ 706 -1536 -1769 3046 1891 -1206 -697 -1791 -840 2521 797 -615 429 -1192 -1024 747 90
2431I0R78K7k929J201J700j869Q67Q62j674J921l04l950K422K608k014J268k13
$$ 90 1068 1095 -1834 -633 1067 -802 65 927 -747 1174 870 -3080 -658 1950 -64 1204 991
2448I91l898K250J941k298K481R91m735N00K396j204K143L41m251J281K575k033
$$ 991 -2907 -657 1284 -1014 1467 2458 -2277 -1777 619 -585 1558 1899 -2352 -1071 1504 -529
2464e29L78J116j708Q91O44j810R30O68j440R09Q87o85Rj375n55K747N55j438
$$ -529 -151 965 -743 148 792 -1018 -88 580 -860 49 936 251 260 -1115 -1670 1077 1632 194
2482A94m66j017M39K153j004n74J234j356q57J617m28M00Q68k267J2K311j443
$$ 194 -272 -1289 -850 1303 299 -275 959 -397 -1254 363 -65 335 1203 -1064 -1052 1259 -184
2499a84o96J672j144M11J400k704j41K972j303r44J535j423k59J800j519o7K365
$$ -184 -880 792 -352 59 1459 -1245 -1386 1586 283 -661 874 -549 -808 992 -527 -594 1771
2516A771j744j672J922K43m45N20j134l20J529j66j103L92O60j30q13J73Q67n51
$$ 1771 27 -1645 277 520 75 595 -539 -859 670 504 -599 -207 453 323 -490 -317 550 -1
2534aq3L48j096P16J700k341o43L013j427j523K286r37j021K653j708k214L583
$$ -1 -84 264 -832 -116 1584 -757 -1400 1613 186 -1337 949 12 -1009 1644 -64 -2278 1305
2551A305Nk901J896K58j928K112k4k122J982L57k366J310J221j175L5m44m09J726
$$ 1305 1310 -1591 305 563 -1365 747 723 -1399 583 940 -1426 -116 1105 -70 -35 -479 -888 838
2569H38L70j724l75O32N59K54n94Q2J7p49N21P23m63O14q75j679K206J374k223
$$ 838 1208 -516 -891 -259 300 554 -40 42 59 -690 -169 554 91 705 -170 -1849 357 1731 -492
2588d92jM59q27J791J84k497J095J233j687J015O39j872R46K10j260K398J20l475
$$ -492 -493 -34 -861 930 1114 -1383 -288 945 -742 273 912 -960 -14 196 -1064 1334 1454 -2021
2606b021J215J541j149J877n43l698K481K362k807P64J280k921P08K425j674L23
$$ -2021 -806 735 -414 1463 920 -2778 -297 2065 -742 22 1302 -1619 -911 1514 -160 163
2622A63R68k623n1L063M8j909o79J79R90Q70k6j341j217J389J175j321Q90N78
$$ 163 1131 -1492 -1543 1520 1568 -341 -1020 -841 149 1019 993 -348 -1565 -176 999 -322 568 1146
2640A146k999N99K812j243q2P52l458J245M298k812j793K353j861R1L566k671
$$ 1146 -1853 -1254 1558 315 233 985 -2473 -1228 3070 258 -1535 818 -1043 -952 2614 -57
2656e7j812L185j801j207M030j317l099K139k58m06L017j889l239K307J554o43
$$ -57 -1869 1316 -485 -1692 2338 1021 -2078 61 -197 -603 2414 525 -2714 -407 1147 504
2672E04M59j451r59J553J71J70O27j686n80J005R4J493J04l324J9K599j25J97
$$ 504 963 -488 -1447 106 277 447 1074 -612 -1192 -187 -93 1400 1504 -1820 -1801 798 673 870
2690H70k42k499J038K188j256K2N99j860M47J221l36R76q20k582J908J891j410
$$ 870 628 -1871 -833 1355 99 121 720 -1140 -693 528 192 1168 348 -2234 -326 1565 155
2707A55L07p59j768K998R42l162J233P61k408K160J336k927J088P77k811K430
$$ 155 462 -297 -2065 933 1875 -1287 -54 707 -1701 459 1795 -1132 -44 733 -2078 352
2723C52K515l787n40J719j120J897J143l899J42K514j148N38J138k261l37J262
$$ 352 2867 -920 -1460 259 -861 1036 2179 -1720 -1578 936 -212 326 1464 -797 -1134 128
2739A28n48J212P83k473o36J180P58J098j091j986J154P31j93Q70j039r62J515
$$ 128 -420 792 1575 -898 -1534 -354 404 1502 411 -1575 -421 310 117 987 -52 -1014 501
2756E01q78n70K760j374k272K147k9r60K238j623k277L519M2k541J725j68j411
$$ 501 -377 -947 1813 439 -1833 314 285 -675 1563 -60 -2337 1182 1224 -1317 408 240 -1171
2773a171K278o73j891K288n32j683K316k25j504J444j546m10L720j543k846K305
$$ -1171 1107 434 -1457 831 299 -1384 932 707 -797 647 -899 -1309 2411 868 -1978 327
2789C27n11q58L099j558k533K835m48j990L045n1k614J073k82l98K790j049k430
$$ 327 -184 -1042 2057 499 -2034 801 353 -1637 1408 1357 -1257 -184 -466 -864 1926 877 -1553
2806a553J279J28K0J410j514m89J479j547q1K263j000o46N78j743J159K206k406
$$ -1553 -274 -146 -126 1284 -230 -719 760 -787 -868 1395 395 -251 327 -1416 -257 1949 -457
2823d57j52J439k039J150J354k760J735J970m289Q23L318k971N97K377l959P82
$$ -457 -609 830 -1209 -59 1295 -1465 270 2240 -2049 -1226 2092 -879 -282 2095 -1864 -1082
2839a082L476l528l9L557k969r12K537j822P66K200l254k75K466j717N76J404
$$ -1082 2394 -1134 -1173 2384 -585 -1497 1040 -782 -16 2184 -1070 -1345 1121 -596 -20 1384
2855A384k531J057J315l111J464K592k619r9J089j914J495J465k289N08R92j820
$$ 1384 -1147 -90 1225 -1886 -422 2170 -449 -548 541 -1373 122 1587 -702 -194 798 -1022
2871a022P09N80n43J881j258k637K582M27j431K276j423k349L341o01k308L533
$$ -1022 -313 267 -276 1605 347 -2290 292 719 -712 1564 141 -2208 1133 532 -1776 1757
2887A757p08l281K666j02j381L349k099l287M248l0k471L162j891k853M485l93
$$ 1757 1049 -2232 434 332 -1049 2300 201 -3086 1162 1132 -1339 1823 -68 -2921 1564 1171
2903A171l138M058j046m443L476J454k154K226j154l373K887J383j636R86n90
$$ 1171 -1967 2091 1045 -3398 78 1532 -622 1604 450 -2923 -36 1347 -289 697 107
2918A07r27J271j222J17K198j562m82J552k095K51J989k102Q21K703l167j284
$$ 107 -820 451 -771 -654 1544 -18 -500 1052 -1043 -792 1197 -905 -84 2619 -548 -1832
2934a832J709r28K280J725m217k59J947k271K367K543l908K45J283l520K911L591
$$ -1832 -123 -1051 1229 2954 -1263 -1522 425 -1846 521 3064 -844 -599 684 -2836 75 3666
2950C666m673m37K541k396J484J988m065Q39L021k427O32R65l335J469K153k002
$$ 3666 -1007 -1444 1097 -1299 185 2173 -1892 -1053 1968 -459 173 1138 -2197 -728 1425 -577
2966e77K194K80n077J204L446j109J468k70m607J357K964j318R66K74k295N46
$$ -577 1617 1897 -3180 -1976 1470 361 1829 1559 -3048 -1691 1273 -45 921 1195 -1100 -554
2982e54J01m23K219o15j806K036q92j386K172j732n65M670j661l890J799o06j04
$$ -554 -453 -876 1343 728 -1078 958 66 -1320 852 -880 -1445 3225 1564 -2326 -527 -1133 -1237
2999a237M465j485l335J621j672m77M843q07k511J097k884R6N517j981k956K717
$$ -1237 3228 1743 -1592 29 -1643 -2120 2723 1916 -595 502 -2382 -2286 3231 1250 -1706 1011
3015A011j592r68L543k110j907L474q65j521K358j720j667K149j46J005J192l734
$$ 1011 -581 -1549 1994 -116 -2023 1451 586 -935 1423 -297 -1964 185 39 1044 2236 -1498
3031a498j114K699j04J581Q30m382J20K802j831J114K209l106m37J571j822J653
$$ -1498 -2612 87 -17 1564 2394 -1988 -1868 934 -897 217 2426 -680 -1117 454 -1368 285
3047B85J533l043R25J729k282P50K55k164L162J713m295O58J047k504L023J976
$$ 285 1818 -1225 -300 1429 -853 -103 152 -2012 1150 2863 -1432 -774 273 -2231 792 2768
3063B768l615O25N40k936K570K808k522l57n83j351L032P21k634J265j32j643
$$ 2768 -847 -222 318 -2618 -48 2760 238 -119 -702 -2053 979 1700 -934 331 199 -1444
3079a444K411l85k127K663o49k288L016p3k772J773P7j077K713j273k682K148
$$ -1444 967 582 -1545 1118 469 -1819 1197 1124 -1648 125 202 -875 1838 565 -2117 31
3095C1M79q18J611j608j004K412j385r12K725j401j354K195j478k39K556k374
$$ 31 510 -308 1303 -305 -1309 1103 -282 -1194 1531 130 -1224 971 -507 -746 1810 -564
3111e64q73K983j430r16J612j874N40K599k780n37K648k192NK474k456O0K450
$$ -564 -1437 1546 116 -800 812 -1062 -522 2077 -703 -1240 1408 -784 -779 1695 -761 -701 1749
3128A749k963o0L465k239j138K020j479K78J907k134k78J837j245L8O98j166J322
$$ 1749 -1214 -1274 2191 -48 -1186 834 -645 -367 1540 -594 -872 965 -280 -242 456 -710 612
3145F12K18k348J562R45k051J547L58k330K101K17k953K802J212l094J054N42
$$ 612 830 -1518 44 989 -1062 485 843 -1487 614 831 -2122 680 1892 -1202 -148 394
3161C94k011K725L82l238J994O24k402K006M72k070J977l65k412K730M25k637
$$ 394 -1617 1108 1490 -1748 246 870 -1532 474 946 -1124 853 488 -1924 806 1231 -1406
3177a406J689K57j335K037j337j859K941j08j699J898j476j221L045j329j325
$$ -1406 283 540 -795 1242 -95 -1954 987 879 -820 1078 -398 -1619 1426 97 -1228
3192a228L233j924k408L230l79j405K579j926k197L665j37k349J619j94j044J740
$$ -1228 2005 81 -2327 903 524 -881 1698 -228 -2425 1240 1103 -1246 373 179 -865 875
3208H75p35r33J406j069j52J522j092K84M49k392J616K406k716j79J340k109J710
$$ 875 140 -793 613 -456 -608 914 -178 106 555 -1837 -221 2185 -531 -710 630 -1479 231
3225B31J883l401O40K168k956R72K422k885M96J696k868J512K509l613j72K598
$$ 231 2114 -1287 -647 1521 -1435 -463 1959 -926 -430 1266 -1602 -90 2419 -1194 -1366 1232
3241A232j760P17J222k947O27K383j658O8R27j683O78N24j026J794l48k500J743
$$ 1232 -528 189 1411 -1536 -909 1474 -184 -116 811 -872 -194 330 -696 1098 750 -1750 -7
3258gO14j145J930j233k585L340N34k922K078K09k635K447M10k390K114J17k571
$$ -7 607 -538 1392 159 -2426 914 1448 -1474 604 813 -1822 625 1035 -1355 759 876 -1695
3275a695J895R08j533Q47p90q33K491o02j734J400n83l30J977j561r70K230j522
$$ -1695 200 1108 -425 422 -368 -1201 1290 688 -1046 354 -229 -559 1418 -143 -1113 1117 -405
3292d05q57K865j369j102J696j922J74L290k362j696K703j348m23K508k184q29
$$ -405 -1262 1603 234 -868 828 -1094 -920 2370 8 -1688 1015 -333 -756 1752 -432 -1261
3308a261K749j861r76K833j130j298J472j019P8J697j742l23J426q83M71L72k045
$$ -1261 1488 -373 -1349 1484 354 -944 528 -491 -413 1284 -458 -781 645 -238 233 605 -1440
3325a440J603J148k586J169J343k432J185J131k606J783J491l493R96K477k462
$$ -1440 163 1311 -1275 -106 1237 -1195 -10 1121 -1485 298 1789 -1704 -708 1769 -693
3340f93L49J241k093J140J635k536M20J406j491N64O79j218J035N2j773J412P59
$$ -693 -344 897 -1196 -56 1579 -957 -537 869 -622 -58 621 -597 438 490 -1283 129 888
3357H88j186O02n72q52K191m86j715J690k66j355J716m63j034K157j183k005K660
$$ 888 -298 304 -268 -1120 1071 585 -1130 560 294 -1061 655 192 -842 1315 132 -1873 787
3374G87N6j740J643o98j307K270n44j727J905J7j683J100M5m95J276j167q04J786
$$ 787 843 -897 746 48 -1259 1011 467 -1260 645 662 -1021 79 124 -371 905 -262 -1066 720
3392G20n20o21R10j087K46J652j970k13K118j403n07J526j250j38J655j555n41
$$ 720 200 -421 489 -598 -352 1300 -670 -883 1235 -168 -675 851 -399 -537 1118 -437 -978
3409i78K027r14r02R80l96M41N00j397J47J029o50K61J56r07Q92R8j315J234O74
$$ -978 1049 135 -767 213 -183 258 758 -639 -492 537 -113 148 304 -603 289 387 -928 306 980
3428I80j627M48L00p15J413j26j938J197Q29j221P86n1j045J274k10j349J668
$$ 980 -647 -199 101 -614 799 673 -1265 -68 761 -460 326 275 -770 504 294 -1055 613
3445F13K00j708P97L61o55J203n78j440J399M97j026M34k56j21J033r04m98J306
$$ 613 813 -895 -98 263 -392 811 233 -1207 192 689 -337 97 -159 -280 753 -151 -649 657
3463F57o22o55J206p18j10J153j583k87K233q46j233R52m93O2J315j199n53J230
$$ 657 35 -620 586 -132 -242 911 -672 -959 1274 428 -805 147 -346 -284 1031 -168 -721 509
3481E09p09j20R24p93L06L30j655J152J507j904O4Q50j418J281R25k387P22J619
$$ 509 -200 -320 604 -189 117 447 -1208 -56 1451 -453 -389 461 -957 324 1249 -1138 -416 1203
3499A203j843K83J328j495L89Q75j731R36J351j877n3J129p83O54K00j559Q27
$$ 1203 -640 -357 971 -524 -135 740 -991 -55 1296 -581 -634 495 -288 366 566 -993 -166
3516a66J009j250K64M04o22Q22l34r71J446k43j231J322j26q70J273j045j103
$$ -166 843 -407 -143 261 -361 461 127 -844 602 359 -872 450 324 -546 727 -318 -1421
3533a421K549m6k166J189j74r41K063l74j803J645k13j724J939M45j289Q19r01
$$ -1421 1128 1082 -1084 105 -69 -1010 1053 679 -1124 521 308 -1416 523 968 -321 498 -403
3550d03q76K366k87j702J272k07r06J476p89q51J785n93j148J397m25o65J034
$$ -403 -1279 1087 800 -902 370 163 -743 733 -56 -907 878 285 -863 534 109 -556 478
3567D78q74j9J746j537r40J684n49k46J273j498l52J853j158p69J510l69n37O22
$$ 478 -396 -415 1331 -206 -1146 538 -11 -257 1016 -482 -834 1019 -139 -908 602 233 -304 318
3585C18p43K74P08j064M28P48r99N58j71j575K032J312k723M14J310k134J122
$$ 318 -425 -151 557 -507 -79 669 -330 228 57 -1518 514 1826 -897 -483 827 -1307 -185
3602a85J781k240L60J490k617M73K607j505n38R13j575P20J628j784M5J432j354
$$ -185 1596 -644 -284 1206 -1411 -938 1669 164 -374 539 -1036 -316 1312 -472 -427 1005 -349
3619c49n7R71j266O91J059j638R1J350j067l86Q41j73L75k02j026N92L69j78O13
$$ -349 -406 565 -701 -10 1049 -589 -498 852 -215 -601 240 67 442 240 -786 -194 175 -3 610
3638F10q89n59J676o87j351J926o0j587J305o7j203J522j99j652J517P36j529
$$ 610 -279 -838 838 151 -1200 726 666 -921 384 317 -886 636 437 -1215 302 1038 -491
3655d91L35r6k15J355p05r09J274o18q33J688o81o99J799j339j520K631j18j906
$$ -491 -156 -252 -467 888 183 -726 548 -70 -903 785 104 -595 1204 -135 -1655 976 858 -1048
3673a048J417j0j315J458j97j335J601K31j570O29J22k92R43n55p39J197l86r79
$$ -1048 369 359 -956 502 305 -1030 571 802 -768 -139 -17 -309 634 79 -660 537 151 -828
3691h28J066J53m91M24n82m93J217J57q49o0N9M56j4p64Q67L01j375N62O39r77
$$ -828 238 391 -100 324 -258 -751 466 623 -226 -286 -227 229 215 -549 318 619 -756 -194 445 -532
3711e32R90N32k349Q26J876j871M5J452j366n2J156j399L03J639j462n50J107
$$ -532 458 990 -1359 -533 1343 -528 -483 969 -397 -449 707 -692 -389 1250 -212 -762 345
3728C45n51M02O25j487M72R83j570L47J504j152j79O50j242N66J658j327q76R65
$$ 345 -206 196 821 -666 -194 789 -781 -434 1070 -82 -261 389 -853 -287 1371 44 -832 133
3746A33j69j07N03l83O3L1n74M10N26k28K59r45n06J554J64j275P00R8p86P10
$$ 133 -36 -143 360 -23 40 71 -503 -93 433 205 464 -481 -987 567 731 -544 156 254 -532 178
3766A78m4o16J146k56j290P68L30l33O50p08o03J538o59j081J631j6j365R89l90
$$ 178 134 -482 664 408 -882 -114 216 -117 533 -175 -778 760 101 -980 651 635 -730 259 -131
3785a31p83J936k08k025J037O34r97Q40L09j001M53j77p30J394L92r63k63m31
$$ -131 -914 1022 814 -1211 -174 460 -537 303 612 -389 64 -113 -843 551 943 -20 -283 -714
3803g14J65J585m45j023O45m37n54J074Q4j72L56j081n05J196M11l06r1o72K93
$$ -714 -549 1036 591 -432 213 -224 -778 296 380 208 564 -517 -1022 174 585 279 188 -484 -191
3822a91N69q01L22P85q15l1K43q38Q60R44j509M4J209j086j94R05p48L58Q94j444
$$ -191 378 -423 -101 684 -131 -162 81 -757 103 1047 -462 -418 791 -295 -489 416 -332 26 920 -524
3842e24o6J345q09l74Q68n89K18N79j231m9J202n52l27P44m75o7K06q28O11J080
$$ -524 -590 755 -54 -428 440 -149 69 648 -583 -632 570 18 -309 435 -40 -107 99 -729 -118 962
3862I62n66p07j22j17O53M53n00L45k89j022L37P38K33O53q80j410Q03P42j81
$$ 962 396 -311 -433 -550 103 556 56 401 112 -910 -573 165 398 1051 171 -1239 -436 306 125
3881A25M81k42q75M48j96l67J365K8j193K57O5k05P59m55o34J266j07j140L60
$$ 125 606 364 -511 -63 -259 -626 739 767 -426 -169 -104 -309 450 -5 -639 627 520 -620 -260
3900b60J17p5J065n59q59P03l02n64J051K70n61K20p16m38J574l0j142L99K58
$$ -260 -143 -218 847 288 -571 132 -170 -734 317 587 26 246 -470 -908 666 636 -506 -107 151
3919A51k29K37k17l73P01J43n09J13j09j15K7O0O15K60j162n18O15M22P62j51
$$ 151 -78 159 -58 -431 270 413 -96 17 -92 -207 -180 -120 495 755 -407 -925 -310 112 874 723
3939G23j488L4Q56j91K86M98q65k44K09k89Q76M42j297j36O84r9M31l29r87Q74
$$ 723 -765 -731 125 -66 220 718 -147 -391 -182 -471 405 847 -450 -586 98 -1 430 101 -886 -12
3959a2Q63j005o2L18n27M85N53p87K34J65j050M85J190m50n48j69k57Q67N81r78
$$ -12 851 -154 -216 102 -425 60 613 -174 60 225 -825 -340 850 400 -148 -317 -574 293 874 -104
3979a04n66M64K84K17j19l25n2p8K03M46l3j68n61n21J122R39j075o79M37j82
$$ -104 -670 -206 78 295 176 -149 -201 -279 -76 370 337 169 -392 -913 209 1148 73 -606 -169 -351
3999c51O68P01j502k25J188p24m7J230q83q17Q60l28Q4J212j087j205J319M71
$$ -351 317 1018 -484 -709 479 -245 -292 938 55 -762 98 -230 -146 1066 -21 -1226 93 564
4017E64n10O3l51k02P37l6m48J49Q6M4j62nM74m12n78P06M05n77L08o68o26J673
$$ 564 54 117 -234 -436 301 265 -183 -34 52 96 -66 -71 403 -9 -587 119 524 -53 255 -413 -1039 634
4039F34N07j711J78M67o60R26L50j052L04J05q18Q92O39p31j59m08N3J348n61
$$ 634 1141 -570 -392 75 -585 341 691 -361 -57 48 -770 122 761 30 -129 -537 -484 864 303
4058C03r55Q34k09l39J136r38p51J734o68j071J623k91j323J261k52p83J597n58
$$ 303 -652 182 -27 -366 770 -168 -919 815 147 -924 699 408 -915 346 94 -689 908 350
4076C50j703J773M45j485Q42o7q43J164P7j371P40N77o86K11J05j17J5m12L83
$$ 350 -1353 420 865 -620 222 155 -688 476 553 -818 -78 499 -187 24 129 12 27 -385 -2
4095bO60p46J29j86r62J687Q04k424O02J445k003P95J659k440K84K183k373l0
$$ -2 658 -88 41 -145 -1107 580 1384 -1040 -438 1007 -996 -201 1458 -982 -698 1485 -888 -918
4113i18K687k019j035K283j123n69J813j477o96K113o94j132Q95l15P4P77r25
$$ -918 1769 -250 -1285 998 -125 -694 1119 -358 -1054 1059 365 -767 128 -187 -113 664 -261
4130b61q9P70q24L50N51r25O41P9j442J527Q62k049N53N30j238J613O38k652J026
$$ -261 -350 420 -404 -54 497 -428 213 292 -1150 377 1239 -810 -257 273 -965 648 1286 -1366 -340
4149c40J420j840P70J151j940L67J067j312P83R50j735MR07j48M52n29q23J084
$$ -340 1080 -760 10 1161 -779 -412 655 -657 126 1076 -659 -655 252 104 556 27 -796 288
4167B88j63m23R89r24n80J870j117j178K572j065j946K609l17j832K206o59k208
$$ 288 125 -298 691 -233 -813 1057 -60 -1238 1334 269 -1677 932 615 -1217 989 330 -1878
4184a878L010J97k981J667P98j899J572N84k248J059Q83j458O82Q93j205r5K02
$$ -1878 1132 1329 -1652 15 813 -1086 486 1070 -1178 -119 764 -694 -12 881 -324 -419 -217
4201b17K22O55m49o00J76k66J007M07j850N81J244j824O58J697k071N5J722k076
$$ -217 5 660 211 -389 -213 -479 528 935 -915 -334 910 -914 -256 1441 -630 -575 1147 -929
4219i29L32K473k295r09K396j110o70J728j362n72J835q80q62J287k80l90M56
$$ -929 -597 1876 -419 -1328 1068 -42 -712 1016 -346 -918 917 37 -825 462 182 -208 248
4236B48n22L02M25r58M77N77r61O54r3j197J597N81k205Q51J031j677J074P71
$$ 248 -274 28 453 -505 -28 549 -412 242 149 -1048 549 1130 -1075 -224 807 -870 204 975
4254I75k042R87J152k114O49J772j636k97J005q98L15R74j131j39O57k11Pj47
$$ 975 -1067 -80 1072 -1042 -393 1379 -257 -554 451 -447 -132 842 -289 -428 229 18 25 -122
4272a22Q4O12q08m19J153n01j18R80j395m77K184j128j077K153r22j444K017m36
$$ -122 -38 574 -234 -653 500 -1 -119 861 -534 -1011 1173 45 -1032 1121 199 -1245 772 336
4290C36j348K159q09k068K264M76j775J030R7j291J280K74j273O78M51p79J07
$$ 336 -1012 1147 338 -1730 534 1010 -765 265 362 -929 351 625 -648 30 481 -298 -191
4307a91L00N2N9o44K98O09o12J71J27r58J134Q15j927J59J385j252L37J147j737
$$ -191 109 161 220 -424 -126 483 -129 42 169 -789 345 1160 -767 -608 777 -475 -138 1009 -728
4326g28J42J452j241j5J584j317q64J211j23R7L68j196r2J156j47L2k80p36O06
$$ -728 -586 866 -375 -390 1194 -123 -987 224 101 198 566 -630 -722 434 287 319 39 -697 -91
4345i1N04o38O77Kj370O35O34n04Q36l77j689J267J065j165K27J74r90J010M62
$$ -91 413 -225 452 454 -916 -281 353 -151 685 308 -1381 -114 951 -214 13 187 -803 207 669
4364F69j268N78M68r50M20N75o33l6p4P5O29N5p49l34k9R19Q63j360m63P62n46
$$ 669 -599 -21 447 -503 -83 492 -141 -177 -251 -176 453 508 -241 -575 -604 315 1178 -182 -645 117 -429
4385d29L30J123j176l95J083j137R0J805j179j196J302m1k53Q82j114p77J622
$$ -429 -99 1024 -152 -547 536 -601 -511 1294 115 -1081 221 180 -73 809 -305 -1082 540
4402E40J45q33K65m77j78Q82n9o5R5q24j11Q07K06K05l59j258P17R99n93j59J61
$$ 540 685 -148 117 -360 -538 344 285 220 315 -509 -620 187 393 598 239 -1019 -302 697 104 -55 106
4423A06n05N94L11j047K62O24n84M07M01r12L3M3j48J183K32j459l44L22M02J152
$$ 106 -399 195 506 -541 -279 345 -239 168 569 -343 -310 -267 -415 768 1000 -459 -803 -481 -79 1073
4443A073n23j269N28Q9m19J119l9r74O43l48n82J346o7j509J010O00r51M10k60
$$ 1073 550 -719 -191 -102 -521 598 559 -415 228 -120 -702 644 577 -932 78 678 -273 137 -123
4462a23q75J452P31j335k56K91m88O30O16m31r6m46l67O47N40m6l84q29N23R25
$$ -123 -998 454 1185 -150 -406 -115 -603 27 643 212 116 -330 -697 -50 490 444 60 -769 -246 679
4482F79p33k91M70m37N32O30j405k04J143n19J20R78j097p42O81l6N43R54j347
$$ 679 -54 -345 125 -312 220 850 -555 -759 384 -135 -15 963 -134 -876 -195 -231 312 1266 -81
4501h1j023Q15L00M01K70j035o2O00m50J52M73n57J96K09n80N02K75j139N13J160
$$ -81 -1104 -289 11 412 682 -353 -415 185 -265 -113 360 -197 -1 208 -372 130 405 -734 -221 939
4521I39p59l23k4q26J147J171j346m96N57n56M46Q77p41k97J96m06L00Q22l68
$$ 939 180 -143 -167 -993 154 1325 -21 -517 40 -516 -70 807 66 -231 -35 -441 -141 681 313
4540C13o62j31M83O45l85o95J30J03M25P08j171n81J185n58j81J402p32j357J135
$$ 313 -349 -480 3 648 263 -432 -302 -199 226 934 -237 -818 367 -191 -372 1030 298 -1059 76
4559G6m2m95J563o96j865J422Q14j029M73o0r47R28M14r42L84K62o18L31L16k07
$$ 76 34 -461 1102 406 -1459 -37 777 -252 221 161 -786 142 556 -386 -2 260 -358 -27 289 82
4579H2j4m60L2Q92q1n81q2l76O87R27j064m96N30k34J97P70p87k96M73o32L08
$$ 82 68 -392 -360 532 451 -130 -212 -588 99 1026 -38 -534 -4 -238 -41 729 -58 -354 119 -513 -205
4600b05J380r28j033O29k16N48P72j145n43R44j25j59L89m32o9L54m96L75M24
$$ -205 1175 247 -786 -157 -373 175 947 -198 -741 203 78 -81 308 -124 -193 161 -335 40 464
4619D64p25J06L54m68P34j4j524R36J174j276N6N70j119O30J114j392L5R86j041
$$ 464 -261 -155 199 -269 465 451 -1073 -137 1037 -239 -183 387 -732 -102 1012 -380 -345 641 -400
4638d00j13J187n48m68M19m14K84O93o53m83K08M47M90m56o95L70J32k99Q04k19
$$ -400 -513 674 126 -342 77 -337 -53 640 -13 -496 -288 159 649 193 -502 -132 0 -299 505 286
4658B86o22L49m16j38J427l10j200N79r6k72J259n97j008J269k57j155J110K63
$$ 286 -336 13 -403 -541 886 576 -624 -45 -141 -413 846 249 -759 510 253 -902 208 471
4676D71r23Q68j73j138J127L72j181O72N34q98N3K16l84Q64j2q28K5K32J65L89
$$ 471 -452 416 243 -895 232 604 -577 95 629 -269 -216 0 -384 480 468 -360 -335 -103 62 451
4696D51m89k66N22m53j44Q07k30l36K15n45L09J015p83n78N40j91J63N11o84L8
$$ 451 -38 -304 218 -235 -379 428 198 -138 77 -468 -159 856 73 -505 35 -156 7 518 -166 -128
4716a28N05p55NR92m52l03K98p23L28J068q53m00Q02m73k88O61l33M9M96q29l07
$$ -128 377 -378 -373 619 167 -136 162 -561 -233 835 -18 -418 384 -89 -377 284 -49 0 496 -333 -640
4737f40R99j11k47J90n58J49N89n07Q7N00n08k56K89j98M35L06p72j98O43j55
$$ -640 359 248 1 191 -367 -218 371 -136 -49 451 -57 -313 -24 -222 213 519 -253 -451 192 37
4757C7O9L3k54K24k3n54N04M13m26n8j72k46P20J87o41K30M6m70L86J73j16L76
$$ 37 106 139 -115 109 86 -468 36 449 23 -35 -207 -453 267 454 -187 43 89 -381 5 178 62 438
4779D38n34o42P94M34n16J76k24n54R25R1p82N74J39q66L44O41n45L02j4q14N28
$$ 438 -96 -738 56 490 -26 150 -74 -628 297 388 -394 180 319 -547 -203 438 -107 195 181 -633 -105
4800a05O89o21k34L70o8o6J96j99oK83j38l16K3N19j96m15L92J02m19K07J04k99
$$ -105 584 -37 -271 99 31 -35 161 -38 -44 239 101 -215 -192 327 131 -284 108 210 -209 -2 102 -197
4822a97N57m1j039L87R11m89j20K28o65J87Q71o41j33O89o84m96Q89L23m59k2
$$ -197 360 319 -720 -333 578 89 -31 197 -468 -281 590 -51 -184 505 -179 -675 214 537 78 56
4842E6l49k24P99L36p86j74L65j2p8K47J4k87q0K31j45J48K40n21k63P44J02n72
$$ 56 -293 -517 282 618 -168 -342 23 11 -67 180 194 -93 -173 58 -87 61 301 -220 -483 261 363 -209
4864b09O4J34J1L19k92m97M70L90l52j32J20j58O2J08P1J00k08l26O0K66N51k83
$$ -209 -145 -11 0 319 27 -470 0 390 38 -94 26 -132 -70 38 109 209 1 -325 -265 1 552 269
4886B69q48J68O51m0J2%p08K47N72l94O6O47r50m60J069k1k98K57m75m77J200
$$ 269 -579 -411 240 200 212 212 -496 -249 323 -71 -5 642 -308 -768 301 280 -18 239 -236 -713 487
4907D87J04r35K02L53m24J17L89l87o6L01j98k16M88P6o80J69P43l54n22K99l9
$$ 487 591 -344 -142 211 -213 -96 293 -94 -160 141 -57 -273 215 291 -389 -220 523 169 -353 -54 -93
4928i3j8P89n67r50Q27M30o10M36M5q36L79M82l97L95J86j176N5J019m6j80j73
$$ -93 -111 678 111 -839 -12 418 -192 244 289 -547 -168 314 -83 312 498 -678 -623 396 350 170 -3
4949cn05K23O39L6m34r4LJ19k6K33J66n43k24N58q8R9J61q36mJ157k85r17O23
$$ -3 -508 -285 354 390 -44 -138 -135 -16 -42 191 357 -186 -410 148 60 159 320 -516 -520 637 352 -565 58
4972E8J09m31O01o3p99O37K06o10L97L70p08k01N23J20k5k53l29N4N91L52m54
$$ 58 167 -264 337 274 -525 112 318 -292 105 475 -233 -434 89 209 184 -69 -398 -344 247 599 145
4993A45o56L46K78k85M75N5q06K34L77n66P83L17j398J15J153m72j65N73j062
$$ 145 -511 -165 113 -172 303 358 -448 -214 163 -403 380 697 -701 -586 567 95 -70 503 -559
5012e59L6J361q40n85J006l78n46P84n0n46M68j70m21P56J12p29q6M06K60j58
$$ -559 -523 838 -2 -587 419 41 -505 279 229 -317 151 -19 -440 316 428 -301 -387 19 279 121
5032A21k14r4J69J2K75k26n76O95M8o26P01J13q73L04L37k43M98p8j203N29R47
$$ 121 -93 -187 -18 -6 269 43 -533 162 210 -416 285 398 -475 -171 166 -77 421 343 -860 -331 616
5053F16m91m4O8o73L70N86n16J26K14o23R6L85j2J66l44l75N97J53m00K26k95
$$ 616 125 81 149 -524 -154 432 -84 42 256 -367 -271 114 102 268 -76 -451 146 299 -101 125 -170
5074a70j52Q55n16o11R60j20p20P17jp49P64j47p40R65L62j258K47O06m92L18
$$ -170 -322 533 17 -594 366 246 -474 243 242 -507 257 110 -630 335 697 -561 -314 292 -200 118
5094A18J44p53L22O25m74k73L85j16j7m7K65m4l20m0J87k8M85p9j041N02P51o59
$$ 118 262 -491 -169 456 -18 -291 94 -22 -39 -86 179 135 -185 -225 -38 -66 419 340 -701 -199 552 -107
5116a07Q0M15q19J73Q80r40NJ126r55o06J258l48n30P86m46n48J055j96q69O18
$$ -107 -27 388 -431 -258 622 -318 -313 813 -142 -748 510 162 -368 418 -28 -576 479 283 -586 32
5136C2L67n62J81J4k43L47L1k74L2K04L2l17q3M96J2n68K38J73j92L53j46p25
$$ 32 399 -163 18 32 -211 136 167 -107 -75 129 161 -156 -239 257 269 -299 -61 112 -80 273 127 -598
5158e98O65M18p48K13M54p20K00M05o10L23M01p55k4Q41l33k60J76k21J67K89
$$ -598 67 485 -263 -50 404 -316 -116 289 -321 2 403 -352 -376 465 132 -128 48 -173 -6 283
5178B83k68k41K32O0J2k37L9M40l96l22N42L7l63M97l83l28Q54j94q88P55L30
$$ 283 15 -226 6 66 78 -159 -120 320 -76 -398 144 181 -182 315 -68 -396 458 264 -624 131 461
5199D61q82M96J59p13O62K36q63L21N45o18kM36k99Q5L9l74J74L68p4j95j48K73
$$ 461 -421 75 234 -479 183 419 -444 -123 422 -196 -198 238 -61 24 63 -311 -137 231 157 -38 -186 87
5221H7J51l95Q7L06k95j3J93m11K79O14r32j38R79n47l11P66o02k62R80o08n24
$$ 87 238 -157 -70 236 -59 -72 121 -290 -11 603 -329 -467 512 -35 -346 420 -182 -444 536 -72 -596
5242e96J043j94q39O54K16n63N17j22n24N24J46l20j26K38J18r1l53K52J48k99
$$ -596 447 253 -586 68 284 -279 238 116 -408 116 262 -58 -184 54 172 81 -272 -20 128 -171
5262a71K33M9m16M95J48q84N40O26r05mO06o44K22O96r20j3R78p45k96P23k93
$$ -171 62 111 -305 190 338 -546 -6 620 -285 -289 317 -327 -105 591 -329 -342 636 -109 -405 318 25
5283B5k27M40l76n2M91k75l76M05J07j2k01j91K64Q7j12J99l00j94O13m05l19
$$ 25 -202 238 -138 -190 301 26 -350 55 162 150 -51 -242 22 109 -3 196 -104 -298 315 -90 -409
5304d09R42k18r40P04P3n68Q34j10r79Q14M50j133L53O86o63J90L33p33K75M37
$$ -409 533 315 -625 79 152 -416 418 308 -671 143 593 -540 -187 499 -164 26 359 -374 -99 338
5324C38m19m6M61k22l84o5L48K91j84j17j05k13L48L69o60K36M85p87j1O48m47
$$ 338 -81 -127 334 112 -272 -337 11 302 118 1 -104 -317 31 400 -260 -24 461 -326 -337 311 -136
5345a36J6N42o98j0Q63o71m55Q97k07k29L60m67k56P56j17m13M35j06l64J45J15
$$ -136 -120 422 -276 -286 577 -94 -549 348 141 -88 272 -195 -451 305 188 -225 210 104 -260 -115 0
5366@K50Q2m65j13J37L8K45j21m35N01J64o22K21L69m52K75K16o07K81L54o11
$$ 0 250 332 -133 -246 -109 -71 174 53 -382 119 283 -339 -118 251 -201 74 290 -317 -36 318 -293
5387b93J52O09l48l29J05j30L17K11l03r0KP6R2k40J64L63n50j18N77k27j70N00
$$ -293 -141 468 120 -209 -104 -234 83 294 -9 -99 -97 -21 71 -169 -5 358 -192 -310 267 40 -130 370
5409C70o09o3R18o12o07Q33p9l81N72l96n21R40j14o59O66L9o51K89J74j88K91
$$ 370 -239 -302 616 4 -603 230 151 -230 342 -54 -575 365 251 -408 258 297 -354 -65 109 -79 212
5430B12j1n06L5N36j47k31L9K27j39j32K32j67j01M00k84m12Q25p5q57N96L61
$$ 212 201 -305 -270 266 119 -112 -73 154 15 -117 115 -52 -153 247 -37 -449 376 301 -556 40 401
5451D01p26M13J97q34O71M22j046L23O81p78J67L70n59K61L66o63K39M48m67n3
$$ 401 -325 88 285 -549 122 544 -502 -179 502 -276 -109 261 -298 -37 329 -334 -95 353 -114 -167
5471a67K16k36K92J23n47K37K50k21P9k4k06M65j83k99L98j07j68J84k13L3M55
$$ -167 49 -187 105 228 -319 -82 168 -53 26 2 -204 261 78 -221 177 70 -98 86 -127 -94 361
5492C61m62k81N80n8k50K21k56m2M85m10j13N16k74r2J74l36K10M86o85P5N79
$$ 361 -101 -382 198 140 -110 111 -145 -187 298 -112 -225 291 17 -75 99 -237 -27 459 -226 -151 428
5513D28o32o1N49n29K00O80j038j09J037n34k96P15n34k19P46n12k42P80k93n50
$$ 428 -204 -265 284 -245 -45 635 -403 -512 525 -9 -305 410 -124 -343 403 -109 -351 429 136 -414
5533d14N18qj94L24l44j11M66j00k59j4j6K85j9l23K69m1j84L15k02j26N28l52
$$ -414 104 96 -98 226 -118 -229 237 137 -122 -136 -152 133 114 -209 60 19 -165 150 -52 -178 350 -2
5555bo05Q57R2p20N77p8o04Q60r5r54Q49K43q39M53K22o26N46J36p64O24J83p83
$$ -2 -607 250 342 -378 199 121 -483 377 282 -672 177 420 -419 34 256 -370 176 312 -452 172 355 -428
5577d28K31M75l63K63p5n76L93M63n19J53P9j74J28j9j44L11l8m39J83J48K4J60
$$ -428 -197 278 -85 178 103 -473 -80 383 -136 17 96 -78 50 31 -113 198 160 -279 -96 52 76 236
5599B36m19m8M86k18j13J16j72J10K61m69J57M95o18k2M54l28J23K21n99J47O14
$$ 236 -183 -231 255 37 -76 40 -132 -22 239 -230 -73 422 -196 -218 236 -92 31 252 -347 -200 414
5620D14n67j32N44m09J21M15o95Q7P57o93j33O64m65n8M29m13K8N63n77k83N59
$$ 414 -153 -285 259 -150 -29 386 -309 -222 535 -158 -291 373 -92 -150 279 -134 -106 457 -120 -403 156
5641A56p5j21J47l29J6M20k10j08K35q4j24k9M3K11M1l40l9K08K8J20l18j23N08
$$ 156 81 -40 107 -222 -206 214 4 -104 131 47 -77 -106 -63 148 189 -151 -190 18 46 166 -152 -275 233
5664B33j94k80L94j59j61L86l34j44O65k81n40N17k4k85M66k33l54O08j74n66
$$ 233 39 -241 153 -6 -167 219 -115 -259 406 125 -415 102 78 -207 259 26 -328 280 106 -460
5684d60N31J81m66L20m9m15N24Q7n31L38J62m91K46P5q1K05Kn40K50M07k28j08
$$ -460 71 252 -214 106 57 -358 166 253 -278 60 222 -269 -23 52 -29 176 178 -362 -112 295 67 -41
5706d1M6n1J20r0r3K36m4j03j04j0K67J66m54O0J48j11J32O3m04L50J64n69J53
$$ -41 5 -46 74 -16 -109 127 83 -20 -124 -134 133 299 -155 -95 53 -58 74 137 -267 83 247 -322 -169
5729a69N11l83n5J61l23K98L83o14m7N49l45j49L06j45J9K33n13P9M45j59k07
$$ -169 342 -41 -96 65 -258 40 423 -191 -238 311 -34 -183 123 -22 -3 230 -283 -204 241 82 -125
5750a25J64j18P6Q6k50Q4L02l22n1J22k3K26m0l85K07K72j97RK5p8J33j17k39
$$ -125 39 -79 -3 83 -167 -83 219 -103 -154 -32 -55 171 131 -254 -47 225 28 37 62 -16 117 0 -239
5773b39L20J54l15M9j5j6K55j62k30K45j7k07J69n1J35K11m19j41N12r7l24K68
$$ -239 81 235 -80 -31 -46 -62 193 31 -199 46 29 -178 -9 -60 75 286 -133 -274 238 141 -183 85
5795H5j21j06M01l80j25N97l23l33M68n0j82L26l38k91O91j09l84J68J13k74J69
$$ 85 -36 -142 259 -121 -246 351 28 -305 163 113 -69 257 -81 -372 319 210 -174 -6 107 -167 2
5816BK1j26K96q7k20M7O8R5m6k34J74J89l24O6J80k17K37mn22L34M29m13r5L06
$$ 2 23 -103 193 106 -114 -67 1 96 50 -184 -10 179 -145 -79 101 -116 121 117 -405 -71 358 -55 -150 156
5840A56l12R9J87m46K97L77n57q6M08o1kK4l30J60K87k58j8N8P8j6j06p7K83q0
$$ 156 -156 -57 130 -316 -19 358 -199 -285 123 62 60 84 -246 -86 201 -57 -75 -17 61 45 -61 -138 145 65
5864F5k27K24k5r2K84l25l34O10J15n82L72J20m96M29j7m09M27K13p18K17L89
$$ 65 -162 62 37 -55 229 -96 -430 180 295 -287 85 205 -291 138 121 -288 139 352 -366 -149 240
5885B40k53o0K30k09O0J37l80J20L23Nk27k01J42K05j97J62L4k22L6J04l63L97
$$ 240 -13 -73 157 -52 8 145 -235 -115 208 213 -14 -215 -73 132 -65 97 131 -91 -55 49 -314 83
5907H3L57n41j95N32l45N4M18n63J4N22l63l61O26p9l47L05j12j25K57j31k18
$$ 83 440 -101 -296 236 -109 -55 363 -200 -186 336 -27 -388 238 159 -188 117 5 -120 137 6 -212
5928b12L15J42k43j72NK47L6k18Q5O7j41J65r3j52M15M9n69J27L72l69R7K43l08
$$ -212 103 245 2 -170 -165 82 118 -100 -15 52 -89 76 -17 -169 246 295 -274 -147 225 -144 -47 196 -112
5951a12J43L06o75N5O25k69j36J79l52J16K27j16%K41j86k72M4K79K35k91j30
$$ -112 31 337 -338 -283 342 73 -63 116 -236 -120 107 -9 -9 232 46 -226 -182 97 332 41 -89
5972h9P2j8o3K54k12m1L86l21l75N96l9l73L83k3m61M68L2o13M82L87o80P2L27
$$ -89 -17 -35 -98 156 -56 -97 289 -32 -407 189 150 -223 160 137 -324 144 176 -437 45 432 -248 -176 151
5995A51l27J41J79l10M8L27j96j90J89J53j15k01J70J11j86M6Q2k61L51K50o93
$$ 151 -176 -35 144 -166 -118 209 13 -177 12 165 50 -151 19 130 -56 -10 72 -189 162 412 -281
6016b81M4N24l08j68M82m60o2N80n04j31P53k98o27N33P9m15M65j49m11M47J15
$$ -281 -237 287 -21 -189 293 -167 -229 351 -153 -284 469 171 -456 77 156 -259 206 57 -354 93 208
6037B08m62J88K93k19j19O5j6J21M8r4j79J60K12j84k17M28rn71L28K11l91L70
$$ 208 -254 -66 227 8 -111 -46 -62 59 107 13 -166 -6 206 22 -195 233 224 -347 -19 192 -199 171
6059A71N6o49L67M66n52j3M02l40q3L70k91o9M74l34k75L62L7k13R8l0J36K6k15
$$ 171 227 -422 -55 411 -141 -154 248 -92 -175 195 -96 -165 309 -25 -300 62 99 -114 -16 -46 90 116 -99
6082i9RR6P0P9k69q6K84l2l22L27O9k21K17o5l71N15P3o68L61L10l88P8J36l36
$$ -99 -90 6 76 155 -114 -200 84 52 -270 57 126 -95 122 57 -314 201 274 -394 -33 277 -111 -33 103 -233
6106b33K29L05m50K5K45j21j31J63O3mj34r1J04R2J48j10m05K26L00l28K6L12
$$ -233 -4 301 -149 -124 121 0 -131 32 95 91 -43 -134 -30 62 210 100 -305 -79 221 -107 -81 231
6128B31l16q4M59m78k6N88m44l32O92j38m59M82j52l04O02j81n58L92K71l76R1
$$ 231 -85 -169 290 -188 -214 374 -70 -402 290 152 -307 175 23 -281 321 140 -418 -26 245 -131 -40
6149d0J68j89j8J12q9N5K07j77k05J39K34k2m02J87K2j03L04j48l22L85O7m10
$$ -40 128 -61 -79 33 -56 -1 206 29 -176 -37 197 175 -227 -40 -18 -121 183 35 -287 98 165 -245
6171b45K88K89n92M4L72k42K19J88o82J15N81l08j08J76j81k6L01k18k4J66j36
$$ -245 43 332 -260 -216 156 -86 133 321 -361 -246 335 27 -81 95 -86 -112 189 -29 -53 113 -23
6192b3j02O9J48J9j58j76L21m4r2J08k31k1M28j67l84L65k6k27L18j2l12K29K7
$$ -23 -125 -56 92 111 -47 -223 98 54 -38 70 -161 -182 246 79 -305 60 34 -193 125 113 -199 30 57
6215E7l19L96J39m19r4K41J2O8M8l03NK01N8r2k8J17j88j87K96J98k75M3N2j87
$$ 57 -262 134 273 -146 -240 1 13 81 129 -174 -169 32 90 -2 -30 87 -101 -288 8 206 -69 -26 26 -161
6239a61L47K2n18J52M72l56NK55l61M4L89l97J1M23l65k90M16J03k22J82k45j10
$$ -161 186 208 -310 -158 314 -42 -37 218 -143 -99 290 -107 -96 327 -38 -328 88 191 -31 151 -94 -204
6261b04K98R1l44N3J66j2j31K5J23m7r1J18j5o7J60k21j85M88l6l18R4L7j46L63
$$ -204 94 185 -159 -106 60 48 -83 -58 65 18 -73 45 30 -37 123 -98 -283 205 169 -149 -55 -18 -164 199
6285A99n0m17L23Q3l57K20J76j37j25k8m0K44R3k02n2o2J91J06k15m5K46k30l
$$ 199 149 -268 55 138 -219 1 177 40 -85 -113 -153 91 184 -18 -70 -132 59 165 -50 -95 151 -79 -82
6308h2J79j71K7K50m16K9N12l23k69M11j54j40K90j33k62M84p2m66L40J75l08
$$ -82 97 -74 -47 203 -213 -184 328 5 -264 147 -7 -147 143 10 -252 232 160 -306 34 209 -99
6329i9J60k9j82J87R1k97nL33o2l12J06K26j18m0R7j98M8K90k33k68M83M7m93
$$ -99 61 32 -150 37 128 -169 -174 159 97 -215 -109 117 -1 -41 56 -142 -94 196 -37 -305 178 225 -268
6352b68L63O9l21K72R4n91M25K80n22J41K97k95j14K99k50J08L20m13j51M53q0
$$ -268 95 164 -157 115 209 -382 43 323 -199 -58 239 -56 -170 129 -121 -13 307 -106 -257 196 116
6373A16j96J72j41j2J18m0o6J31m4j51pJ12K18j90k03Q9J27KJ15j86j62L14n1
$$ 116 -80 92 -49 -61 57 17 -49 82 38 -113 -120 -8 210 20 -183 -94 33 35 150 -36 -198 116 65
6396F5k82L23K2k73K18k7j05K05j02l15K74J36j11n4r9M9K62j17j38O9p0j0J84
$$ 65 -217 106 128 -145 73 46 -59 146 44 -271 3 139 28 -26 -125 -76 186 69 -69 0 -70 -80 104
6419A04j31L5K52m91mN93j91l96L21k24l3N67l20m34M26mk68L55J8l62J30O3j98
$$ 104 -27 8 260 -231 -235 358 167 -229 92 -132 -165 402 82 -352 74 70 -198 157 175 -187 -57 6 -192
6442a92L54J45n05l4K67R7Q6k45j28R8J07Q7p8j48R5j5k32L80J37m67J01J91k65
$$ -192 162 307 -198 -232 35 132 218 -27 -155 -57 50 137 59 -89 6 -9 -241 139 276 -191 -90 101 -164
6465a64L29J35o95K21N91m60K9K49n93K35M50l32j17M30m75j73O55j66j96M1k21
$$ -164 165 300 -395 -174 417 -43 -14 235 -358 -123 327 -5 -122 308 -167 -340 315 149 -47 -6 -227
6486b27J15M59k39j76j0j5J74J21k59R2J1k41L16M9k30J52k44j66O53%n28N6R4
$$ -227 -112 347 108 -68 -78 -93 81 202 -57 35 46 -195 121 170 -60 92 -152 -318 335 335 -193 -137 -43
6509d3r2L63q3m32L17Q8l57L52J53m17J40p4j04M50l5n38K24J13L1J75l16j86
$$ -43 -135 228 145 -287 30 118 -239 113 266 -151 -11 -85 -189 261 226 -312 -88 25 56 231 -85 -271
6531b71L24O9k06K48j81j53L38j31j37M67l84m46N99Q9k15J01k81r9M64j4k85
$$ -271 53 122 -84 164 -17 -170 168 37 -100 367 -17 -463 136 225 10 111 -170 -269 195 181 -104
6552a04K07j46j20L01q4o1J49l29n0M01p7o2k2k83K60L62m24p9K77k52J09K19
$$ -104 103 -43 -163 138 54 -7 142 -187 -237 164 87 25 3 -280 -20 342 -82 -161 116 -136 -27 192
6574A92l25J79K20n81J64M80l42o0J60l17K70L52n52j2L55k23L3J10k44J37J47
$$ 192 -133 46 266 -315 -151 329 -13 -73 87 -230 40 392 -160 -172 183 -40 -7 103 -141 -4 143
6595A43k62P0J65j47M1j6p4L00j38l96L67Mj37K16j84j81M30j55k24L76m7m22
$$ 143 -119 -49 116 -31 10 -6 -80 220 82 -314 53 57 -80 136 -48 -229 201 46 -178 198 151 -271
6617b71L14n3j00L65k40l21L40M1k07K51j79j23L54j38k86L96l8k54K10j87P8
$$ -271 43 -10 -110 255 15 -306 34 75 -132 119 -60 -183 171 33 -253 143 105 -149 61 -126 -48
6638d8L09l20j70L73j09j69L20j92r4K20k58r1M61j37k11J11p3J33J30l59J9J73
$$ -48 261 -59 -229 144 35 -134 186 -6 -100 120 -138 -229 232 95 -116 -5 -78 55 185 -174 -155 18
6660A8n4M9R7j71R9K1k53K40K25l67O4N7j82L33Rm51K26K08k59J64m6k01K21J19
$$ 18 -36 13 110 -61 38 59 -194 46 271 -96 -32 25 -157 176 185 -266 -40 168 -91 73 27 -174 47 166
6684A66l83K65J00k86P0J72j12J10j71k09K99J80k18M0j55p0L93k0k73J31j28
$$ 166 -217 48 148 -138 -68 104 -8 102 -69 -278 21 201 -17 23 -132 -202 191 171 -102 29 -99
6705i9j05K84n8O1M2l07j03N08K0k94k9l5j3L97k22j65J50r7J8J44k9k5k2l06
$$ -99 -204 80 22 83 125 -182 -285 223 243 -51 -80 -115 -128 269 47 -118 32 -65 -47 97 68 43 21 -285
6729b85L10K44k64m0j5j42L35J54m26k0L18k39O3J93l26Q5K06l50K10K51l85p9
$$ -285 25 269 5 -35 -50 -192 143 297 -129 -149 169 -70 -7 186 -140 -55 151 -199 11 262 -123 -202
6751b02K28L7N8J8m14R0M26q0j84kp5R0Q2j6P3j47j78K08N6P6M3l68j79M40O0
$$ -202 26 63 121 139 -275 -185 241 161 -23 -25 -100 -10 72 56 129 -18 -196 12 68 144 187 -181 -360 80 140
6776A40j34J13k43r3L67K4k33J85j36k90L21J89j41O1k23j23L85K1k29o4N4L7
$$ 140 6 119 -124 -217 150 174 -59 126 -10 -300 21 210 69 130 -93 -216 169 190 -39 -103 -49 -12
6798a2J81k14j21K52j13m8K41j46q6P9j81Q9M03k73l06K33KN8K04k67j95K53k5
$$ -12 169 -45 -166 86 -27 -75 166 20 -66 13 -168 -79 324 51 -255 -22 -20 38 242 -25 -220 33 8
6821Hl3J50n9j91N6O4R8Kk20o4J53J93N6k38k55K60Q1j8P8j59j61J78O0j68L83
$$ 8 -25 125 66 -125 -69 -5 93 95 -125 -189 -36 157 213 -25 -280 -20 61 43 121 -38 -199 -21 39 -129 254
6846B54On50J49K59j56J71l6l77K44K92l61J6K67k00q7K01j08j3J94k87j7K54
$$ 254 260 -290 -141 118 -38 133 97 -280 -36 256 -105 -89 178 -22 -109 92 -16 -29 165 -122 -139 115
6868A15k5j25o2N3J65k4j78L6J4L3O4j99O2K10k05p3J97k9o3J44k26K4L04j60
$$ 115 90 -35 -97 -44 121 97 -81 -45 -31 2 66 -133 -71 139 -66 -139 58 29 -34 110 -116 -92 212 52
6892E2k35K55P0k23J44q7n9J53q7j27K18O8k44J5kQ2K43k21j35J03pM8O6q9J1
$$ 52 -183 72 142 -81 63 -24 -83 70 -17 -144 74 142 -102 -87 -89 -7 236 15 -120 -17 -24 24 90 1 12
6917A2P4k02j2K70k6k78J59r3P6K59k58j36K09j4j15J63j6j23P3q0KJ38Pj54j33
$$ 12 86 -116 -128 142 116 -162 -3 -96 -20 239 -19 -155 54 40 -75 88 72 -51 22 -58 -56 82 89 -65 -198
6942a98J85J81o7k18O6P5p6J34k05n7K95j07j74L11k5l00J74J25k34K20N8m86
$$ -198 -13 168 101 -117 -51 24 -52 82 -123 -180 115 8 -166 145 120 -180 -6 119 -115 105 163 -323
6964c23K64L12k88l1J48k49J32K75l16L6J92k60J1K05l2j14pm5O8K81j40k56P
$$ -323 -59 253 -35 -66 82 -167 -35 240 -76 -40 152 -108 -97 108 76 -38 -45 -90 -22 259 119 -137 -130
6987a30J92Qj0k3j0j11j0J58oj7P6k92L6K96j8j72L1n8Q3K13k77l7J18lj79K41
$$ -130 62 70 60 37 27 -84 -94 64 58 41 117 -175 -139 157 139 -33 -2 -60 23 236 -41 -78 40 37 -142 99
7013I9n7r7N5p7J3J87j24j15N0J13P9J1l11K0K59j24k5J87j78J3J61k44N4K62
$$ 99 42 -55 0 -77 -64 123 -1 -116 -66 47 126 137 -174 -154 105 -19 -44 143 -35 -22 139 -105 -51 211
7037B11k27j59K03L7n2M5j78q6K99L8k02l9J39j11N0J24l4l7j33lM0K27P9m94
$$ 211 -16 -175 28 65 13 58 -120 -206 93 131 -71 -110 29 -82 -32 92 58 21 -112 -115 -75 152 231 -263
7061b63J17J67nj5J56k17o9K21n5k22K73N3l73K05K10k71P7P6k26K00J94l75K6
$$ -263 -146 21 16 1 157 -60 -129 92 37 -185 88 141 -232 -27 183 -88 -11 65 -161 39 233 -142 -116
7084a16K21j51m7J77p8k5L0r8M3J41jj42j30K40M0j04r7Q8m1J32J2k25J7K45j36
$$ -116 105 -46 -93 84 6 -19 11 -87 -44 97 96 -46 -176 64 104 0 -97 -9 -50 82 94 -131 -114 131 -5
7109en4J91j22j70J18N8mJ65p0l45K08J69r7O4j76k5J40Lm1M4l9mq3J5J99j5k39
$$ -5 -59 132 10 -160 -42 16 12 177 107 -238 -30 139 42 106 -70 -95 45 48 7 51 12 8 -75 -60 139 124 -115
7136a15N4M4J6N4m5j60J93R5k41m8L57k04j12J77j36N5J07j66j3K29K1k54J8J21
$$ -115 -61 -17 -1 53 8 -152 41 136 -105 -153 204 0 -112 65 -71 -16 91 -75 -88 141 162 -92 -74 47
7160D7l4L9l5r6N4Q4Kj40J22Q0k18k1K46n8j33O9n9m8K72q7k55J70J35k20Q8J04
$$ 47 13 52 17 -79 -25 59 61 -79 43 123 -95 -116 130 72 -61 8 -51 -99 173 86 -169 1 136 -84 4 108
7186A08j93R2N5k42K00J49j87j16J60Rj2M8j64K0J06Jn6K0J09l3j72j3K23p6o
$$ 108 -85 7 62 -180 20 169 -18 -134 26 35 23 71 -93 -73 33 34 -22 -2 107 74 -98 -111 112 36 30
7211C0Jq3J7K20k21p9K81k22j29K58nj68J87p1j76J48J62k69O0J07n1J2Jn2K8
$$ 30 31 -52 -35 185 -36 -115 166 -56 -185 73 68 -100 87 16 -160 -12 150 -119 -59 48 -3 9 10 -42 -14
7236a4Jl9l1Q4O6r0r5J32N8j09p8J84j30P7J00k20qK45j77n7K12j07l7P7j13M2
$$ -14 -13 -52 -83 1 67 -23 -118 14 72 -37 -115 69 -61 16 116 -104 -112 133 -44 -101 111 4 -33 44 -69 -27
7262b7K49l07r9K76n3l2j4q3OJ88l9j25R9j46R0K1j02K17m6k75Q7K70j33j5o4
$$ -27 222 -85 -184 92 39 7 -7 -90 -84 104 65 -60 39 -107 -17 4 -98 119 73 -202 -115 155 22 7 -57
7287e7j19J35K94l58l3J48j9K3O4p2r3P8j17P8J20Lj52jrK34rk35KM4K7J93j89
$$ -57 -176 -41 253 -105 -138 10 -9 14 78 6 -87 -9 -126 -48 72 75 -77 -78 -87 147 138 -97 -95 -51 -24 169 -20
7314b0j59L04j51r4K77q1l12K73q5j0L38j98m37L32J91j94J23l4k99K72N1j36
$$ -20 -179 125 -26 -120 157 76 -236 37 -48 -58 280 82 -355 -23 168 -26 97 63 -236 36 87 -49
7336d9R3j4k00R6J46m1L9j25q3J52J94j95l9j94K27J14j05k5P6k03N7K30r9q7
$$ -49 44 30 -170 -74 72 31 70 -55 -138 14 208 13 -26 -220 7 121 16 -9 67 -136 -79 151 52 -35
7360c5O5j55%L52j60j56J5pO1K08k44r5K51o9M1O9k59RJ24j33J72J19k52k6K29
$$ -35 30 -125 -125 227 67 -89 -74 -81 -20 188 -56 -151 100 31 72 141 -118 -109 15 -118 54 173 -79 -105 124
7385A24j59J69J8l33NK61p1m4O8j91J16J48j85L9J57j20l6R7r0P8j13n3J70K8
$$ 124 -35 134 152 -181 -176 85 14 -30 38 -153 -37 111 -74 -35 122 2 -34 63 -27 51 -62 -115 55 83
7409H3j05m5qN8P0J2j64J41m6j6J56j46k3Q6j30j19L55n6k68J62Lk7J13o9k40
$$ 83 -22 -67 -75 -17 53 65 -99 42 -4 -20 136 -10 -33 53 -77 -196 159 103 -165 -3 0 -27 86 17 -223
7434b23K59R8k33P0J20j97J39Qr7J38r9m0K5Q6M8l7k24J40J65j21j14J77j51R1
$$ -223 36 134 -99 -29 91 -106 33 41 -56 82 -17 -57 -32 54 102 65 -159 -19 146 25 -89 88 -63 28
7458B8R7k43L3J62r0j9J52j37l3J30k00J29J35j49j21O1M0J9R4k24J64K6o5K2
$$ 28 125 -118 -85 77 -13 -32 120 -17 -50 80 -120 9 144 -5 -126 -65 -25 -6 88 -136 28 54 -11 11
7482A1P2j09L3Mp0J97p1j65J2P7NJ00r2j07R6J41r8j45J76n2o4R8n0K4j9r3O5
$$ 11 83 -26 7 11 -59 138 67 -98 -86 -9 -4 96 4 -103 -7 134 36 -109 67 15 -49 49 -1 23 4 -89 -24
7509b4Q8N4q4k30J71J61j12o0j8n7J58J39j78q7J93j94n2K18l9n9JL3r9K09q1
$$ -24 64 118 34 -196 -25 136 24 -36 -54 -111 47 186 8 -79 114 -80 -132 86 47 -12 -11 22 -77 132 51
7534E1k36J60J29j13l6pMM2J3l9m2K2N4l6M2J03Lk51P8J4O3O8p1j54K36K4j52
$$ 51 -185 -25 104 -9 -45 -52 -48 -6 7 -32 -74 -52 2 -34 8 111 114 -137 -59 -45 18 86 15 -139 97 121 -31
7561c1n0R0p3J23J1n5K9k4j42L5J28N5j08n6o0K00P4j12p6L6l1J19j34P3P5j21
$$ -31 -81 9 -64 59 70 15 44 20 -122 -87 41 96 -12 -68 -128 72 146 34 -42 -6 -37 82 -52 21 96 -25
7587b5q6J72k4q2M6j11Q7P5L9k21J18O7o3J0n5m9J79pq2K0L1qr1M6P4j3j34Q7
$$ -25 -111 61 37 -45 1 -110 -23 52 91 -130 -12 55 -8 2 -53 -102 77 70 -12 8 39 31 -60 -14 60 47 -87 0
7615@M8j1K6p0j29J40P1j64J02P0j65J17J5q4N9M8k51J42J37m5k9q3k5P2P9m9
$$ 0 48 37 63 -7 -136 4 75 -89 13 83 -82 35 50 -34 25 73 -178 -36 101 56 27 -56 -81 -9 70 21
7641B1j10P9K8n9oK8M6O8k10Q7P3J9k5n1m0Q5j2j37J04J08j73Q9l5PN5J9j05N
$$ 21 -89 -10 18 -41 -47 -19 27 95 -115 -28 45 64 39 -12 -52 33 21 -116 -12 96 -77 12 -23 -16 39 58 -47 -42
7669d2J39k08J6J15l5P6rj90J97j1n0K5n6qJ44j62rJ71r3q7O6LnJ98k94q7K94
$$ -42 97 -111 -95 20 -15 61 52 -138 59 48 -2 23 -33 -41 103 -59 -68 103 10 -77 -11 -8 -13 185 -109 -196 98
7696I8j3j60J44j01q2J84n1r6K14r3j30J05M5j17J56j43j41K38j8m6M3n5J1K8
$$ 98 85 -75 69 -32 -114 70 19 -77 137 44 -86 19 64 -53 103 -40 -181 57 39 -7 36 -19 -8 20
7720B0n1%J58r2j07P1o5O3J19j37L1J63j85p9J60q5M2L7j60L1K25j57l7J36j34
$$ 20 -31 -31 127 35 -72 -1 -66 -3 116 -21 10 173 -12 -91 69 -16 26 63 -97 -66 159 2 -35 101 -33
7745c3K4Q5j31L7R6j31n9K13j49P9R9k75J09J83k41N9J84k15OJ54j50O8J40k54
$$ -33 -9 76 -55 -18 78 -53 -112 101 -48 31 130 -145 -36 147 -94 -35 149 -66 -60 94 -56 12 152 -102
7769a02lJ36q3L6J68k99J12O5j30N2J33p5l3M3m6Q1Rk08J56M3j03M6n0p3K92r7
$$ -102 -105 31 -52 -16 152 -147 -35 30 -100 -48 85 10 -23 20 -26 55 64 -144 12 55 -48 -2 -52 -125 167 70
7795G0k73K26Qr3J51j18j34L60j14k97L08Qk14J48m6j01K86j63k01K74l3j07J68
$$ 70 -203 23 31 -62 89 -29 -163 197 83 -214 94 102 -112 36 -10 -111 175 12 -189 85 52 -55 113
7818A13j44j37K85j13j15J92m3q2K9m2J1K22k08j05K64j54RO1r8j8K15j69r6K29
$$ 113 -31 -168 117 4 -111 81 38 -44 -15 -57 -46 176 -32 -137 127 -27 -18 43 -55 -73 142 -27 -123 106
7842A06j28l0J00j29R9J05j74O0J04j80J6N1j49K42P5l27M6K64k31Q7Q1j79Q8
$$ 106 -22 -52 48 -81 18 123 -51 9 113 -67 -51 0 -149 93 168 -159 -113 151 -80 7 88 -91 -3
7865cQ9k12R1J53k00k9J74j54J49P7k67N5K08j51P8nj99J50J00k38J28J50k19
$$ -3 86 -126 -35 118 -82 -111 63 -91 58 135 -132 -77 131 -20 58 53 -146 4 104 -134 -6 144 -75
7888g5L9M0k4P2j2j62J69J0j45Q8mk9J50q3k20K38Kq0Q8Qj79J76q6j79L59j26
$$ -75 -36 4 -20 52 40 -122 47 57 -88 0 -4 -33 117 34 -186 52 54 -26 62 70 -109 67 -19 -198 161 35
7914C5k04J89k5l7K12j40j84K02oj46J62p7n9J84j38j1J75j58p2J02n3Q2M0r4
$$ 35 -169 20 -5 -42 170 30 -154 48 42 -104 58 -19 -78 106 -32 -43 132 -26 -98 4 -49 33 73 -21
7938b1r8J56Jq9J41j08l1J62j64K4J89p5j83K06p7o8M0o3Q6J25j81j6j4K3J23
$$ -21 -119 37 38 -51 90 -18 -49 113 -51 -27 162 87 -96 110 33 -35 5 -58 28 153 -28 -44 -58 -35 88
7963H8K7k39N2J78k37R9Mq5P0N2j40J99O1j48m1Q0o7O6J0j44J87j9j40Q0L2m9
$$ 88 115 -124 -72 106 -131 -32 -28 -113 -43 9 -131 68 129 -19 -60 20 -47 19 29 -115 72 53 -87 -7 25 -24
7989b4O3j21M3P3l6j3Ol2N1l3Rj24K02n0m7N4l0q8J44r5M8P8k6q2O7n1K3Nr0L6
$$ -24 39 -82 -39 34 -2 -15 -9 -41 10 -23 -14 -138 64 14 -33 21 -9 -97 47 -48 0 78 52 -30 37 -14 9 14 -76 -40
8019d0J13j9j25P9k8Q1R2j17j19Q3o2j4J45m9k2L0r5J23on9q8Q7O0q4O9Qn9L6
$$ -40 73 54 -71 8 -20 61 153 36 -83 0 -62 -76 69 20 -2 28 -67 56 50 -9 -97 -10 50 -34 35 43 -16 20
8047B0m0n2O6j2O9j13j8P0L3j2KlN4q7pJ2L0omk6Q8l4m0K5loK0m0JN2j5l7m2Q0
$$ 20 -20 -72 -6 -18 51 -62 -80 -10 23 11 13 10 64 -23 -30 -18 12 6 2 -24 64 30 -10 15 12 6 26 -14 -13 39 24 -13 -55 25
8081B5L6l0r3J02o1L6J0o7N1K4n0KN9k8QL3r0nJ04n4k3j0N1l7m3L5J9M6j40L9
$$ 25 61 31 -62 40 -21 15 25 -42 9 33 -17 -15 44 16 24 57 -33 -38 66 12 -11 -21 30 -7 -50 -15 4 50 -90 -51
8111e1R3j10J69q5j34J44Qj23P4J3KJ4K0r4J23N4j65j0J55j27pRJ6L6l4K6k2j5
$$ -51 42 -68 101 16 -118 26 34 -89 -15 -2 0 14 34 -60 63 117 -48 -58 97 -30 -37 -28 -12 24 -10 16 -6 -21
8139b1N8m8q1J70o8K7k9J0o9J30o0o1Q1P1j45qP2K0l6K9l9k9K7kr0Q0R0j35L7
$$ -21 37 -11 -92 78 10 37 8 18 -51 79 19 -42 39 110 -35 -43 29 49 13 42 3 -26 1 -1 -91 -11 79 -56 -19
8168a9O2q3L7J7o0J3R3q7l9J09j3k4L1p4K2N6k0p8j2J31m7n5r
$$ -19 43 -40 -3 14 -46 -33 60 -27 -66 43 30 6 37 -37 -15 41 21 -57 -69 62 15 -40 -49
8191d9
$$ Imaginary data points
##PAGE= N=2
##DATA TABLE= (X++(I..I)), XYDATA
0@%%%%%%%%%%%%%%%%kOrJ3j6J8k2K7l3L8m6N4o3P3q4R7j10J26j42J60j80K04k31
$$ 0 0 0 0 0 0 0 0 0 0 0 0 0 0 0 0 0 -2 4 -5 8 -8 10 -12 15 -18 20 -26 28 -35 38 -46 51 -59 67 -75 85 -95 109 -122
39a22K59k87L17l52L89m29M71n16N64o15O69p22P71q08Q27q08P06m17l23K316
$$ -122 137 -150 167 -185 204 -225 246 -270 294 -321 348 -374 397 -411 416 -392 314 -103 -426 1890
59A890r030N9870K69100m35661o871L48648l90918q709M27834k38616j61847K65477
$$ 1890 -7140 52730 321830 -113831 -120702 227946 -162972 -171681 256153 17537 -144310 121167
71A21167j55307r9268K40326n8857j03694Q8668o3482O2Q3679p3574J0268N1173
$$ 121167 -34140 -133408 106918 48061 -55633 33035 -30447 -30385 53294 -20280 -10012 41161
83D1161q2221L7640M9702q4602K3044M7895l9915J2139j0612n229L6562n9955
$$ 41161 -41060 -3420 46282 -38320 -15276 32619 -7296 4843 -5769 -10998 25564 -34391
95c4391L0832Q3228j44642R073J69594j53105l2256K03627j80513q7090K78397
$$ -34391 -3559 79669 -64973 -55900 113694 -39411 -71667 131960 -48553 -135643 142754
106A42754j06950j54794K10444r1515j39891K34427k4993j44377J26139p4400
$$ 142754 35804 -118990 91454 -61 -139952 94475 69482 -74895 51244 -23156
116b3156p9915J85452m8691o7987J16853j55244m2342K45075j14715r6217K05487
$$ -23156 -103071 82381 33690 -34297 82556 -72688 -115030 130045 15330 -80887 124600
127A24600j56737j31928K81890n7015j79259K06203l9884j98606J84643O0234
$$ 124600 -32137 -164065 117825 60810 -118449 87754 47870 -150736 33907 94141
137I4141j66952P6737N4380j11065L2211N9367m3526j0355K4582J0964l2470k3681
$$ 94141 -72811 3926 58306 -52759 -20548 38819 -4707 -15062 9520 20484 -11986 -35667
149c5667O0994o725n3939O7424j3839q4009Q8733J3074q6214R0842j1549j20182
$$ -35667 25327 18602 -35337 32087 18248 -65761 22972 36046 -50168 40674 29125 -91057
161i1057J19303K7640j23674J11996J190j65072J45256O9674j80741R9665O8093
$$ -91057 28246 55886 -67788 44208 45398 -119674 25582 95256 -85485 14180 82273
172H2273j95149R4805J33049j70233K9475J08533j51112J7333J38942r3417k8723
$$ 82273 -112876 -18071 114978 -55255 -25780 82753 -68359 -51026 87916 -5501 -34224
183c4224P3236o4650n075O6041l3045n432J4804l2231K0574N826k2427M2987j3846
$$ -34224 39012 -25638 -30713 35328 2283 -3149 11655 -20576 -2 5824 -16603 26384 12538
196A2538m6639M5432m698l4759N3165q877m1508L9769j8693k6574N8997j3380
$$ 12538 -34101 11331 6633 -28126 25039 16162 -25346 14423 -4270 -30844 28153 14773
208A4773l1433L3857l6257j1031O9621l0657k9799M5495m2640j5769O9668k7880
$$ 14773 -16660 17197 -19060 -30091 39530 8873 -20926 24569 -18071 -33840 35828 7948
220G948k1653L9731m9970p615O7748l3538j1439L7267o0019O162P0716n6937p056
$$ 7948 -13705 26026 -23944 -31559 36189 2651 -8788 28479 -31540 -25378 45338 -11599 -18655
233a8655O3317o9240j3509Q4694n1174k6949P5519m8849m0778P8088j9293m7045
$$ -18655 44662 -24578 -38087 46607 -4567 -31516 44003 -4846 -45624 32464 13171 -33874
245c3874N3193m095m0091L0319K762k3023K0254Q454j5803q058J769J4953r50
$$ -33874 19319 15224 -24867 5452 8214 -14809 5445 13899 -1904 -9962 -8193 6760 5810
258E810q175J3879j6063j9538L3727L024j9509K4112j9893l3907M7355J1892l2268
$$ 5810 -2365 11514 -4549 -24087 9640 12664 -6845 17267 -2626 -36533 10822 22714 -9554
271i554K3925j5444l8281N2426J3872m3571K8564k102n0149M2531K9413m2604
$$ -9554 14371 -1073 -39354 13072 26944 -16627 11937 9835 -40314 2217 31630 -10974
283a0974J4946P529m3825K7487L4830l2956k165J0934k0549J1909J5873j4622
$$ -10974 3972 11501 -32324 -4837 29993 -2963 -5128 5806 -14743 -2834 13039 -1583
295a583L608q6j2565J2488K206q130J2495q368j2604K0675k805j8119J6392M256
$$ -1583 2025 1939 -10626 1862 4068 -4062 8433 65 -12539 8136 5331 -12788 3604 7860
309G860j2732Q798l668j2890J4440Q631q315k664m886r10P503J836N283k050j8166
$$ 7860 -4872 3926 258 -12632 1808 10439 2124 -540 -5426 -6336 1167 3003 8286 6236 -11930
324a1930J942J3055k90R072k877k7601O189K2113o463L682K876k5440L078K1524
$$ -11930 -9988 3067 2777 11849 8972 -18629 -12440 9673 3210 6892 9768 -15672 -12594 8930
338H930p766M339P883k7116l136K5499k635j892M969k1593k288K4882k850q294
$$ 8930 1164 5503 13386 -13730 -16866 8633 5998 4106 9075 -12518 -14806 10076 7226 -1068
352a068N911j0169m853J4147J157l102J543r259j946J1108J676k867k962n856
$$ -1068 4843 -5326 -10179 3968 5125 2023 3566 -5693 -7639 3469 5145 2278 -684 -6540
366f540N475P679o571l233L663j556K083K744n916j477M293K2R02K253l753o077
$$ -6540 -1065 6614 43 -3190 473 -1083 1000 3744 -2172 -3649 644 666 1568 3821 68 -6009
382f009J59R491N955p433p532j337J567J1441O263j4258p241O582j149N567J1323
$$ -6009 -5850 3641 9596 2163 -5369 -6706 -5139 6302 12565 -1693 -8934 -2352 -3501 2066 13389
397A3389j1739j2428O663J384M790J3234j2252j8958R868J0621n81M380p108j3846
$$ 13389 1650 -10778 -4115 -2731 2059 15293 3041 -15917 -6049 4572 3991 8371 1263 -12583
411a2583P654J1052k643jj093j0023j46J1889M297o018n853k317J811Q694M415
$$ -12583 -4929 6123 3480 3479 2386 -7637 -7783 4106 8403 2385 -3468 -5785 -3974 4720 9135
426I135j0603p620Q387M701l133K428l292p511O800O431n010N80j030q446N852
$$ 9135 -1468 -9088 -701 4000 867 3295 3 -7508 -708 5723 713 1293 263 -8183 -2331
441b331J1948m780q810j693R56P520O813o702r940q7P350N325j317k722m400n716
$$ -2331 9617 4837 -3973 -5666 -4710 2810 9623 2921 -7019 -7106 244 5569 4252 1530 -2870 -8586
457h586O325J1105l419o175k471o407P576J5919q614j3442M696Q62J597J0919
$$ -8586 -2261 8844 5425 -750 -3221 -9628 -2052 13867 5253 -8189 -3493 -2631 -1034 9885
471I885o118j2124N942L033k276P678j111j0831K57N795L822J735o588n386L599
$$ 9885 3767 -8357 -2415 618 -1658 6020 4909 -5922 -5665 130 3952 5687 -901 -6287 -2688
486b688M822L533l492q780M069O504m773K527K252j0401L091R052o488J536M361
$$ -2688 2134 5667 2175 -6605 -2536 3968 -805 1722 3974 -6427 -3336 5716 -772 764 5125
501E125j3268K078J5835o536o792M228o417L188J3107q821q860P381q78j072P280
$$ 5125 -8143 -6065 9770 3234 -3558 670 -5747 -2559 10548 1727 -7133 248 -630 -1702 5578
516E578l387n848J626j20L360M270m440m221j488K653R412k946j0463M241K065
$$ 5578 2191 -3657 -2031 -2151 1209 5479 1039 -3182 -4670 -2017 7395 4449 -6014 -1773 292
531B92l061Q558k479j0787Q952J715r994J0495L043j4399O722N764r458P639J413
$$ 292 -2769 5789 3310 -7477 1475 3190 -6804 3691 6734 -7665 -943 4821 -4637 3002 4415
546D415j4068J0187Q961j3733K013M677q752R116N979j4661K435P387q300M638
$$ 4415 -9653 534 9495 -4238 -2225 2452 -6300 2816 8795 -5866 -3431 3956 -4344 294
560B94O545r160J75K455m415P447K395j0080J741L258j066O255n393r688J0306
$$ 294 6839 -2321 -2146 309 -4106 3341 5736 -4344 -2603 655 -411 5844 451 -9237 1069
575A069M235o647M938l271r325R352M508n036N054m327j0191P486O184Q7J590
$$ 1069 5304 -1343 3595 324 -9001 351 4859 -177 4877 550 -9641 -2155 4029 4116 5706
590E706j0579l881J3011k217m033Q181q818m377J4817p335r046J5004m546j0102
$$ 5706 -4873 -8754 4257 2040 -1993 6188 -2630 -7007 7810 475 -8571 6433 1887 -8215
604h215J5507j743j4598P777J741l147J2240m546j4264M523L318L760Q077j1291
$$ -8215 7292 5549 -9049 -1272 469 -2678 9562 5016 -9248 -4725 -1407 2353 10430 -861
618h61p059R887n511K67J5230j0835j0660J3004l831m386J3896q470j2123J4768
$$ -861 -7920 1967 -3544 -3277 11953 1118 -9542 3462 -369 -4755 9141 671 -11452 3316
632C316L771p778J309o470m94J3066j440m106O82j1398K503J5326n061j317N068
$$ 3316 7087 -691 618 -5852 -6346 6720 5280 1174 1856 -9542 -7039 8287 3226 1909 6977
647F977j7351k171K1650j882q307L564p544j143J0944k595k652J451m237O112
$$ 6977 -10374 -12545 9105 7223 -1084 2480 -5064 -6207 4737 2142 -510 941 -3296 2816
661B816N30j1476R868L843j5827J4557J0716k6616K995J7210j5974Q108J9255
$$ 2816 3346 -8130 1738 5581 -10246 4311 15027 -11589 -8594 8616 -7358 750 20005
674B0005k7476r785K4573n400n542J4355r921j0888R577J301P52L279o697MJ164
$$ 20005 -7471 -17256 7317 1917 -3625 10730 809 -10079 -502 799 1551 4830 -1867 -1863 -699
689f99k883J0102k666j5402J2065R064j3058L748J997j2151J0293Q643r979K461
$$ -699 -3582 6520 3854 -11548 517 9581 -3477 271 2268 -9883 410 9053 -926 1535
703A535k245q631J1391K111n163J0625j2523j4018K4639J229j8631J6570j710
$$ 1535 -710 -9341 2050 4161 -1002 9623 -2900 -16918 7721 8950 -9681 6889 5179
716E179k1174K0417P684k4042J0813J1903j7510L430J0285q788j668K807K065
$$ 5179 -15995 4422 12106 -11936 -1123 10780 -6730 -3300 6985 -1803 -3471 -664 1401
729A401M226q083q87P045j1135O175J7983k2100q370K5460j1991j1492K5150r390
$$ 1401 5627 -2456 -3343 3702 -7433 -1258 16725 -5375 -13745 11715 -276 -11768 13382 3992
743C992j8313K0176j527j4081J5981m14j3842P758K392k038L784q463K112R500
$$ 3992 -14321 5855 4328 -9753 6228 5814 -8028 -270 2122 84 3868 -4595 -2483 7017
757G017j1031J803J0108j3975K125J3481j4213J31J3923j2268k589R903o244L703
$$ 7017 -4014 -2211 7897 -6078 -3953 9528 -4685 -4554 9369 -2899 -5488 4415 -1829 1874
771A874J834j2006J1259L117j6442J5155L419k2924J9351Q452l0930J8188J8711
$$ 1874 3708 -8298 2961 6078 -10364 4791 8210 -14714 4637 13089 -17841 347 19058
784A9058l3859P792K5103k6121j08K2039j8933l417J8913j0356o791Q723p98N85
$$ 19058 -14801 -7009 18094 -8027 -8135 13904 -5029 -8446 10467 111 -6680 2043 1245 1830
798A830l505k327J0966p827p771J7666p586j2436K0959p356j7396K4060j533k1378
$$ 1830 -1675 -4002 6964 -863 -8634 9032 1446 -10990 9969 2613 -14783 9277 7744 -13634
812a3634J8121K093j6404J4579j123j2694J5837m086j2337J6090n090r018J7399
$$ -13634 4487 6580 -9824 4755 3632 -9062 6775 2689 -9648 6442 1352 -7666 9733
825I733j0902j0913K3397q163j5248J9953n038j3130J6930l790r617J2744o996
$$ 9733 -1169 -12082 11315 3152 -12096 7857 2819 -10311 6619 2829 -6788 5956 -1040
838a040n555J2549o968N76P575j7842P404J8099k2876K692K0563k5111J543K5814
$$ -1040 -6595 5954 -1014 -438 7137 -10705 -3301 14798 -8078 -5386 15177 -9934 -8391 17423
852A7423k5083l161K8955k2077r534K7470j4512j1004K0667q753n852J4028j2056
$$ 17423 -7660 -10821 18134 -3943 -13477 13993 -519 -11523 9144 391 -5461 8567 -3489
865c489m097J2942o062K549M169j4824P229Q334j4418R798Q106j8335O751O573
$$ -3489 -7586 5356 -706 1843 6012 -8812 -1583 6751 -7667 2131 10237 -8098 -1347 5226
879E226j4898J3098O920j9492R839N814j6663J2411M080j5988J6489J669k3012
$$ 5226 -9672 3426 10346 -9146 693 6507 -10156 2255 6335 -9653 6836 8505 -14507
892a4507J5843O846j9163J6197N080k2543J3405O370k0017J4318J0067j8100N749
$$ -14507 1336 8182 -10981 5216 10296 -12247 1158 7528 -12489 1829 11896 -6204 -455
905d55L286j1417J1825K319j1284J0159k168j0001J1810m294o545J6843q339j2195
$$ -455 2831 -8586 3239 5558 -5726 4433 2265 -7736 4074 -220 -6765 10078 1739 -10456
919a0456J7847n975j2293J8108m335j0595J7394q121j4906J7877l39j0123J3491
$$ -10456 7391 1416 -10877 7231 2896 -7699 9695 1574 -13332 4545 4206 -5917 7574
932G574n102j0960J1510m154n200J5115m260r776O532n384n60J2067o376k646
$$ 7574 2472 -8488 3022 -1132 -6332 8783 4523 -5253 1279 -4105 -4665 7402 1026 -1620
946a620P106j0076j168R225n814N520O533j7176J400J1378j1078O300J1289j7197
$$ -1620 5486 -4590 -5758 3467 -2347 3173 9706 -7470 -6070 5308 -5770 530 11819 -5378
960e378J208J0766j6087N802J8398j6784m407J3112j2433K61J6028j1911m206
$$ -5378 -4170 6596 -9491 -3689 14709 -2075 -6482 6630 -5803 -5542 10486 -1425 -5631
973e631J3421r273n720J1456l551k825O380n215k233N531k886j058K421o11K287
$$ -5631 7790 -1483 -7203 4253 702 -2123 4257 -958 -3191 2340 -546 -1604 817 206 2493
988B493k653m022O455r43n361P038j480n304Q857m732r961J3255K256j0806Q488
$$ 2493 -160 -4182 2273 1330 -4031 3007 1527 -3777 5080 348 -9613 3642 5898 -4908 3580
1003C580n35j2491J0208M739j0352Q939K823j5965M346R595n690L607K142j0740
$$ 3580 3045 -9446 762 5501 -4851 4088 6911 -9054 -4708 4887 -803 2804 4946 -5794
1017e794J972O622m150K270L558n209j650L14J01N365k56m554Q23j031j83M946
$$ -5794 -3822 2800 -1350 920 4478 -731 -2381 -2067 -1966 3399 3143 -1411 -588 -1619 -1802 3144
1033C144k838k385N687l769n057O881N89l715M068k844m552O883P57n887M043
$$ 3144 306 -2079 3608 -161 -5218 1663 2252 -1463 2605 -239 -4791 2092 2849 -3038 1005
1048A005J507n397J696K512j439J825l51m428M31M328J533k785k640J763L48j624
$$ 1005 2512 -2885 -1189 1323 -116 1709 1358 -3070 -2639 1689 3222 437 -2203 -440 -92 -1716
1064a716L897R43n435J617J067m708O504N098j0864j260Q083m678K17P435p658
$$ -1716 2181 3124 -2311 -694 373 -4335 2169 7267 -3597 -4857 3226 -1452 -1235 6200 -1458
1079a458l966R312l797n118R854r17r509M721L193m782M141K176p537J124O442
$$ -1458 -5424 3888 91 -5027 4827 3910 -5599 -878 2315 -2467 1674 3850 -3687 -2563 3879
1094C879m347k819O205m25n784K457K331l649L351L249p602o76P990m414l503
$$ 3879 -468 -3287 2918 2493 -3291 -834 1497 -2152 1199 4448 -3154 -3830 4160 -254 -3757
1109c757Q221k480o830N850j47m777Q234J52j0866M317O251o009J688M287o457
$$ -3757 4464 1984 -4846 1004 857 -3920 4314 4466 -6400 -2083 4168 -1841 -153 4134 -2323
1124b323n81N252l165m47N435l101n808L334M204k007q53J013k713m96M867j338
$$ -2323 -2904 2348 -817 -1264 4171 1070 -4738 -1404 2800 793 -60 953 -1760 -2256 2611 1273
1140A273m185M735N63o920L515N318n227J81K819n400J985N963n597j777N574
$$ 1273 -2912 1823 2386 -4534 -1019 4299 -928 -747 2072 -3328 -1343 4620 -977 -2754 2820
1155B820k747k584L304m69J8J206k763m42J848M19J091k360j542M488k273l865
$$ 2820 73 -2511 793 324 342 1548 -1215 -1657 191 610 1701 -659 -2201 2287 14 -3851
1171c851O731l8o189M546q08n305Q653R88j0377N209M294p808L875M664p215J695
$$ -3851 2880 2842 -3347 1199 391 -4914 3739 4727 -5650 -441 3853 -3955 -80 4584 -2631 -936
1187i36L825o356K042O320m392l417K330R98m0R4L60j022j728L057k35m251N864
$$ -936 2889 -3467 -1425 4895 503 -2914 -584 414 374 468 828 -194 -1922 1135 900 -3351 2513
1204B513J716r919M349O518q911L522O256j2070L656J0615j3114M55J3403j1469
$$ 2513 4229 -5690 -1341 5177 -3734 -212 6044 -6026 -2370 8245 -4869 -4414 8989 -2480
1218b480l302J2240q771k166J2842r596n921J2750m823n840R182l191m127N771
$$ -2480 -5782 6458 -2313 -4479 8363 -1233 -7154 5596 773 -5067 4115 924 -3203 2568
1232B568l883j271O227k937j951J345k912M389J647o591M343J702p326N463K109
$$ 2568 -1315 -2586 3641 704 -1247 98 -2814 1575 3222 -3369 974 2676 -4650 813 2922
1247B922o584O703j55j0116Q047M052q565N198O70p392P626l2p261Q230q43p644
$$ 2922 -3662 3041 2886 -7230 817 4869 -3696 1502 2172 -5220 2406 2374 -4887 3343 2500 -5144
1263e144P417k231l871J0353o724o933J2869n436o351J3182p764o502J5692r861
$$ -5144 2273 42 -3829 6524 -200 -7133 5736 300 -6051 7131 -633 -7135 8557 -1304
1277a304q213J9497q175j1870J7655p017j0269J9352p440j3498J9016m484j4041
$$ -1304 -9517 9980 1805 -10065 7590 573 -9696 9656 2216 -11282 7734 3250 -10791
1290a0791J6778j733j2150J3169l325j0801J3763n80r972P735j129m449O438l467
$$ -10791 5987 4254 -7896 5273 1948 -8853 4910 4330 -5642 2093 964 -3485 2953 -514
1304e14j103N552o334P09M556o341N817K816j3071Q037O777j4061Q571O090j6760
$$ -514 -1617 3935 -2399 -1690 2866 -3475 2342 5158 -7913 124 6901 -7160 1411 7501 -9259
1319i259J0237P395j8866J1719J0136k1523Q515J0792j8625J0851R420k2074J0464
$$ -9259 978 8373 -10493 1226 11362 -10161 -1646 9146 -9479 1372 10792 -11282 -818
1332h18J1459k0952R962J1150k0124R452Q686k0387J2425J1027k1669Q858R999
$$ -818 10641 -10311 -349 10801 -9323 129 8815 -11572 853 11880 -9789 -931 9068
1345I068j8798J0276R037j9162J0150Q879j9167Q474R836j4845P140N050j4132
$$ 9068 -9730 546 9583 -9579 571 9450 -9717 -1243 8593 -6252 888 5938 -8194
1358h194Q925N812j2395O693L424r324O550J37n925Q879l245o551Q482m457j314
$$ -8194 731 6543 -5852 841 4265 -5059 1491 1628 -4297 4582 1337 -5214 3268 -1189 -2503
1373b503R881j1253j348J4100j3273j318J6862j5594k045J8635j8921j988K4912
$$ -2503 7378 -3875 -5223 8877 -4396 -5714 11148 -4446 -6491 12144 -6777 -8765 16147
1386A6147k0087p968K6056j7060q713K6547j6966j1152K7562j4502j3775K6033
$$ 16147 -3940 -11908 14148 -2912 -11625 14922 -2044 -13196 14366 -136 -13911 12122
1398A2122j0131j3951K1741r072j1380K0889q421j2611J7948m987r505J3511n638
$$ 12122 1991 -11960 9781 709 -10671 10218 1797 -10814 7134 2147 -7358 6153 515
1411E15o424J1499o316m640J0322m398k400M328o377L349M890p863N186K252j0153
$$ 515 -5909 5590 -726 -5366 4956 558 -1842 2486 -3891 -542 4348 -3515 1671 3923 -6230
1426f230P716J456j0453J3446J095j7566J1760M137j4806J4310L197j8533J3468
$$ -6230 1486 2942 -7511 5935 7030 -10536 1224 5361 -9445 4865 8062 -10471 2997
1439B997L436j8988J5603P000j9028J1784L312j8770J5852O057k0241J4227O409
$$ 2997 6433 -12555 3048 10048 -8980 2804 6116 -12654 3198 9255 -10986 3241 9650
1452I650k1359J2179P372j8558J3861Q146k1885R297J0321j8063P306J1110j4042
$$ 9650 -11709 470 7842 -10716 3145 11291 -10594 -1297 9024 -9039 -1733 9377 -4665
1465d665M101O828j3398L881R388p304R13L183n103J389J13j609N424j356j868
$$ -4665 -564 6264 -7134 -3253 6135 -1169 -256 2927 -2176 -787 -674 -2283 3141 1785 -83
1480h3J756o645K116Q351p300J415P916j2217q89J0257r258M324J2550j7076k923
$$ -83 1673 -4972 -2856 5495 -1805 -390 7526 -4691 -5580 4677 -4581 -257 12293 -4783 -7706
1495g706J4953j2509j9J8093j3968n808J5696j4120n028K2054q615j0304J4649
$$ -7706 7247 -5262 -5281 12812 -1156 -6964 8732 -5388 -10416 11638 3023 -7281 7368
1508G368q600q994J6217l685p781J3041m850j1413Q942Q07l499P667k890n864
$$ 7368 -1232 -10226 5991 2306 -5475 7566 2716 -8697 245 1052 -2447 5220 2330 -3534
1522c534M183k356j757N926k54o48J40n892J388M655k352K267J474n274J857l28
$$ -3534 649 -1707 -3464 2462 2208 1560 1700 -4192 -2804 1851 -501 1766 3240 -2034 -177 -505
1538e05m825P330L522o919K506o97o859P319K680o385P123R4j1829N136M563n349
$$ -505 -5330 2000 5522 -1397 1109 412 -6447 872 3552 -2833 4290 4384 -7445 -2309 2254 -3095
1554c095Q116P49j2197N003L727q158P661N377r951K777J393q990P910O746r373
$$ -3095 5021 5770 -6427 -1424 2303 -5855 1806 7183 -2768 9 1402 -7588 322 7068 -2305
1569b305K367L769r010K700N661n291L932L825r175n32N350k226J783K703m038
$$ -2305 62 3831 -5179 -2479 3182 -2109 1823 5648 -3527 -4059 1291 -935 848 3551 -487
1584d87m55O71k315K182K528l03o16l366m2L908k343m32M299l369j154L431n318
$$ -487 -942 -271 -2586 -404 2124 1821 1205 -2161 -2203 1705 -638 -1070 3229 -140 -1294 2137 -3181
1601c181J91Q326m694l596O523m646l618P862k661l138P807m616p080P934P93
$$ -3181 -2990 5336 642 -2954 3569 -1077 -4695 3167 506 -2632 5175 559 -6521 1413 2206
1616B206m666N304j240n314M804l62m310N424J448m517Q07l08j047L312n84j679
$$ 2206 -2460 2844 1604 -3710 1094 732 -3578 1846 3294 -1223 -416 -724 -1771 1541 957 -722
1632g22J994j467j223J541j037J719K352m778o92L798k163L56K643l719N47L190
$$ -722 1272 -195 -1418 123 -914 805 3157 -1621 -2313 1485 -678 -322 2321 -1398 -851 2339
1648B339m626O76N265l833j548L020k967J202L784m665p40M434k928o65L078k523
$$ 2339 -2287 -1611 3654 -179 -1727 1293 -1674 -472 3312 -1353 -2093 2341 -587 -1252 1826 -697
1664f97K89K192l802R55L811l160n57J802k238J932J440m260K003K974m318O51
$$ -697 -408 1784 -2018 -1063 2748 -412 -969 833 -1405 527 1967 -2293 -290 2684 -1634 -983
1680i83K481l052K071J935m956J595L718m044O7K850k541O94J584l093J334K482
$$ -983 1498 -1554 517 2452 -2504 -909 2809 -1235 -1168 1682 -859 -165 1419 -1674 -340 2142
1696B142l033k38J597m44J199j209k280K821O58j995J801r04j889L083j430k142
$$ 2142 -891 -1129 468 24 1223 14 -2266 555 1213 -782 1019 115 -1774 1309 -121 -2263
1712b263N027r86m873L129L58k066M295j197m622M253L53m494L641J944l435J436
$$ -2263 2764 1778 -3095 34 392 -1674 2621 1424 -3198 1055 1408 -3086 555 2499 -936 500
1728E00o70k685L953J331l445Q81M01j417J440l16k21K074k019j664K081m47Q44
$$ 500 -170 -2855 1098 2429 -1016 -135 266 -1151 289 -27 -248 1826 -193 -1857 224 -223 621
1745F21J504m025K38M195l365p98M181k967j155L598l546j24N476l896l279M813
$$ 621 2125 -1900 -1662 2533 -832 -1630 2551 -416 -1571 2027 -1519 -1643 3833 -63 -3342 1471
1761A471j079j705L545k410k074L935j602k107L698k26k559O76n10P32K381j976
$$ 1471 392 -1313 2232 -178 -2252 1683 81 -2026 1672 1446 -1113 -437 -947 -215 2166 190
1777A90j372R84l41R70K40j500J986k76l532K490J784k143J911q80m081M273J985
$$ 190 -1182 -198 -539 431 671 -829 1157 881 -2651 -161 1623 -520 1391 511 -3570 703 2688
1794B688m740K405J869m770J973K186l182K909J379o030J588L977k497P95O98
$$ 2688 -2052 353 2222 -2548 -575 1611 -1571 1338 2717 -3313 -1725 2252 -245 550 1248
1809A248l341J766J401k618K329J303l332N75J33j000L965m91m272K089P23k107
$$ 1248 -2093 -327 1074 -1544 785 2088 -1244 -669 -536 -1536 2429 1938 -2334 -245 478 -1629
1825a629K798K11k422K121j282k756L935J376k457J62j248m14L120p25j455J840
$$ -1629 1169 1380 -1042 1079 -203 -2959 976 2352 -105 57 -1191 -1605 1515 790 -665 1175
1841A175j611j096K048q59R69J867m140p84L718j073K31J345l847J046L010l671
$$ 1175 -436 -1532 516 -343 626 2493 -1647 -2431 1287 214 445 1790 -2057 -1011 1999 -1672
1857a672J295L742m551n36K989l276K425L738o270m31M983l553J77M049l971n20
$$ -1672 -377 3365 -1186 -1722 1267 -2009 416 4154 -2116 -2547 2436 -1117 -940 3109 -862 -1382
1873a382L075l717O12M759k782j794Q90j448K503J190k950J712p5l138L027M40
$$ -1382 1693 -2024 -1412 3347 565 -1229 -339 -1787 716 1906 -1044 668 593 -2545 482 922
1889I22k231M147k097n630N779J658m437L888q81n346N483N71n044N561L75o536
$$ 922 -1309 2838 741 -4889 890 2548 -1889 1999 1118 -4228 1255 1826 -3218 2343 2718 -3818
1905c818L562J151k793N114j642n802M897O38l693M551o97l912L768j852k473
$$ -3818 -256 895 -1898 3216 1574 -4228 669 1307 -2386 2165 1468 -2444 1324 -528 -3001
1920c001O175j267m101K900k197j67N416m030j777M897m663q30O200m317j44N099
$$ -3001 3174 1907 -2194 706 -1491 -1658 3758 -272 -2049 2848 -1815 -2645 3555 -762 -906 4193
1936D193p768l01R124n571k016O420o545j009Q063n822j022P464p009k297P187
$$ 4193 -3575 -3876 5248 -323 -2339 4081 -2464 -3473 4590 -1232 -2254 5210 -1799 -4096 3091
1951C091l974L89N185p821K4P015n673P82N415o973Q98M838o979L379O427q684
$$ 3091 -883 -494 4691 -3130 -3106 3909 -1764 -982 4433 -2540 -1642 3196 -3783 -404 6023 -2661
$$ [...]
8191B4
##END NTUPLES=NMR FID
##END=
