##TITLE=1H_LY-805.24
 CCl4, 8 sc, 
 1.4.2019
##JCAMPDX= 6.0         $$ Bruker NMR JCAMP-DX V2.0
##DATA TYPE= NMR FID
##DATA CLASS= NTUPLES
##ORIGIN= UXNMR, Bruker Analytische Messtechnik GmbH
##OWNER= root
$$ XWIN-NMR		Version 3.5
$$ Mon Apr  1 14:33:32 2019 Russian Standard Time (UT+4h)  she@DPX200
##.OBSERVE FREQUENCY= 200.1316
##.OBSERVE NUCLEUS= ^1H
##.DELAY= (6, 6)
##.ACQUISITION MODE= SIMULTANEOUS
##.ACQUISITION SCHEME= undefined
##.AVERAGES= 8
##.DIGITISER RES= 18
##SPECTROMETER/DATA SYSTEM= spect
##.PULSE SEQUENCE= zg30
##.SOLVENT NAME= CDCl3
##.SHIFT REFERENCE= (INTERNAL, CDCl3, 0, 15.7039)
##AUDIT TRAIL= $$ (NUMBER, WHEN, WHO, WHERE, WHAT)
$$ ##TITLE= Audit trail, XWIN-NMR		Version 3.5
$$ ##JCAMPDX= 5.01
$$ ##ORIGIN= Bruker BioSpin GmbH
$$ ##OWNER= she
$$ F:/spectra/data/she/nmr/H-F/1/audita.txt
$$ ##AUDIT TRAIL=  $$ (NUMBER, WHEN, WHO, WHERE, WHAT)
(   1,<2019-04-01 14:32:34.73 +0400>,<she>,<DPX200>,
      <created by zg, POWCHK disabled, PULCHK disabled
       configuration hash MD5:
       00 E9 B6 7A A2 85 ED C7 34 08 36 98 17 FE 4E 26
       data hash MD5: 16K
       22 28 A9 28 CB D3 25 3C 96 B1 EC F0 2F 05 06 5C>)
$$ ##END=
$$ 
$$ hash MD5
$$ C9 CF AC 05 48 4E B7 20 79 04 7B 5D 06 9A 36 A8
##$RELAX= 
##$RELAX= 
##$RELAX= 
##$RELAX= 
##$RELAX= 
##$RELAX= 
$$ Bruker specific parameters
$$ --------------------------
##$DU= <F:/spectra>
##$EXPNO= 1
##$NAME= <H-F>
##$PROCNO= 1
##$TYPE= <nmr>
##$USER= <she>
##$AMP= (0..31)
100 100 100 100 100 100 100 100 100 100 100 100 100 100 100 100 100 100 
100 100 100 100 100 100 100 100 100 100 100 100 100 100 
##$AQSEQ= 0
##$AQ_mod= 1
##$AUNM= <au_zg>
##$AUTOPOS= <>
##$BF1= 200.13
##$BF2= 200.13
##$BF3= 200.13
##$BF4= 200.13
##$BF5= 200.13
##$BF6= 200.13
##$BF7= 200.13
##$BF8= 200.13
##$BYTORDA= 1
##$CFDGTYP= 0
##$CFRGTYP= 5
##$CHEMSTR= <none>
##$CNST= (0..31)
1 1 145 1 1 1 1 1 1 1 1 1 1 1 1 1 1 1 1 1 1 1 1 1 1 1 1 1 1 1 1 1 
##$CPDPRG= <>
##$CPDPRG1= <>
##$CPDPRG2= <>
##$CPDPRG3= <>
##$CPDPRG4= <mlev>
##$CPDPRG5= <mlev>
##$CPDPRG6= <mlev>
##$CPDPRG7= <mlev>
##$CPDPRG8= <mlev>
##$CPDPRGB= <>
##$CPDPRGT= <>
##$D= (0..31)
0 1.2 0 0 0 0 0 0 0 0 0 0.03 0 0 0 0 0 0 0 0 0 0 0 0 0 0 0 0 0 0 0 0 
##$DATE= 1554114754
##$DBL= (0..7)
120 120 120 120 120 120 120 120 
##$DBP= (0..7)
150 150 150 150 150 150 150 150 
##$DBP07= 0
##$DBPNAM0= <>
##$DBPNAM1= <>
##$DBPNAM2= <>
##$DBPNAM3= <>
##$DBPNAM4= <>
##$DBPNAM5= <>
##$DBPNAM6= <>
##$DBPNAM7= <>
##$DBPOAL= (0..7)
0.5 0.5 0.5 0.5 0.5 0.5 0.5 0.5 
##$DBPOFFS= (0..7)
0 0 0 0 0 0 0 0 
##$DE= 6
##$DECBNUC= <off>
##$DECIM= 24
##$DECNUC= <off>
##$DECSTAT= 4
##$DIGMOD= 1
##$DIGTYP= 9
##$DL= (0..7)
0 120 120 120 120 120 120 120 
##$DP= (0..7)
150 150 150 150 150 150 150 150 
##$DP07= 0
##$DPNAME0= <>
##$DPNAME1= <>
##$DPNAME2= <>
##$DPNAME3= <>
##$DPNAME4= <>
##$DPNAME5= <>
##$DPNAME6= <>
##$DPNAME7= <>
##$DPOAL= (0..7)
0.5 0.5 0.5 0.5 0.5 0.5 0.5 0.5 
##$DPOFFS= (0..7)
0 0 0 0 0 0 0 0 
##$DQDMODE= 0
##$DR= 18
##$DS= 0
##$DSLIST= <SSSSSSSSSSSSSSS>
##$DSPFIRM= 0
$$ [...]
##$SUBNAM2= <"">
##$SUBNAM3= <"">
##$SUBNAM4= <"">
##$SUBNAM5= <"">
##$SUBNAM6= <"">
##$SUBNAM7= <"">
##$SUBNAM8= <"">
##$SUBNAM9= <"">
##$SW= 24.9336934301222
##$SWIBOX= (0..15)
0 0 2 0 0 0 0 0 0 0 0 0 0 0 0 0 
##$SW_h= 4990.01996007984
##$TD= 16384
##$TD0= 1
##$TE= 0
##$TE2= 300
##$TE3= 300
##$TEG= 300
##$TL= (0..7)
0 120 120 120 120 120 120 120 
##$TP= (0..7)
150 150 150 150 150 150 150 150 
##$TP07= 0
##$TPNAME0= <>
##$TPNAME1= <>
##$TPNAME2= <>
##$TPNAME3= <>
##$TPNAME4= <>
##$TPNAME5= <>
##$TPNAME6= <>
##$TPNAME7= <>
##$TPOAL= (0..7)
0.5 0.5 0.5 0.5 0.5 0.5 0.5 0.5 
##$TPOFFS= (0..7)
0 0 0 0 0 0 0 0 
##$TUNHIN= 0
##$TUNHOUT= 0
##$TUNXOUT= 0
##$USERA1= <user>
##$USERA2= <user>
##$USERA3= <user>
##$USERA4= <user>
##$USERA5= <user>
##$V9= 5
##$VALIST= <valist>
##$VCLIST= <CCCCCCCCCCCCCCC>
##$VD= 0
##$VDLIST= <DDDDDDDDDDDDDDD>
##$VPLIST= <PPPPPPPPPPPPPPP>
##$VTLIST= <TTTTTTTTTTTTTTT>
##$WBST= 1024
##$WBSW= 4
##$XGAIN= (0..3)
0 0 0 0 
##$XL= 0
##$YL= 0
##$YMAX_a= 393080
##$YMIN_a= -315861
##$ZGOPTNS= <>
##$ZL1= 120
##$ZL2= 120
##$ZL3= 120
##$ZL4= 120
##$ABSF1= 10
##$ABSF2= 0
##$ABSG= 5
##$ABSL= 3
##$ALPHA= 0
##$AQORDER= 0
##$ASSFAC= 0
##$ASSFACI= 0
##$ASSFACX= 0
##$ASSWID= 0
##$AUNMP= <proc_1d>
##$AZFE= 0.1
##$AZFW= 0.1
##$BCFW= 1
##$BC_mod= 2
##$BYTORDP= 1
##$COROFFS= 0
##$CY= 11.3945322036743
##$DATMOD= 1
##$DC= 2
##$DFILT= <>
##$DTYPP= 0
##$F1P= 18.9103706918063
##$F2P= -1.10871071338519
##$FCOR= 0.5
##$FTSIZE= 0
##$FT_mod= 4
##$GAMMA= 1
##$GB= 0.15
##$INTBC= 1
##$INTSCL= 1
##$ISEN= 128
##$LB= 0.24
##$LEV0= 0
##$LPBIN= 0
##$MAXI= 10000
##$MC2= 0
##$MEAN= 0
##$ME_mod= 0
##$MI= 1.114404
##$NCOEF= 0
##$NC_proc= 0
##$NLEV= 6
##$NOISF1= 3.799351
##$NOISF2= 2.8
##$NSP= 1
##$NTH_PI= 0
##$NZP= 0
##$OFFSET= 15.70392
##$PC= 1
##$PHC0= -9369.474
##$PHC1= 13.20026
##$PH_mod= 1
##$PKNL= yes
##$PPARMOD= 0
##$PSCAL= 0
##$PSIGN= 0
##$REVERSE= no
##$SF= 200.130013532006
##$SI= 16384
##$SIGF1= 3
##$SIGF2= 2
##$SINO= 400
##$SIOLD= 16384
##$SREGLST= <1H.CDCl3>
##$SSB= 0
##$STSI= 0
##$STSR= 0
##$SW_p= 3612.71676300578
##$SYMM= 0
##$S_DEV= 0
##$TDeff= 0
##$TDoff= 0
##$TI= <>
##$TILT= no
##$TM1= 0
##$TM2= 0
##$TOPLEV= 0
##$USERP1= <user>
##$USERP2= <user>
##$USERP3= <user>
##$USERP4= <user>
##$USERP5= <user>
##$WDW= 1
##$XDIM= 8192
##$YMAX_p= 0
##$YMIN_p= 0
$$ End of Bruker specific parameters
$$ ---------------------------------
##NTUPLES= NMR FID
##VAR_NAME=  TIME,          FID/REAL,        FID/IMAG
##SYMBOL=    X,             R,               I
##VAR_TYPE=  INDEPENDENT,   DEPENDENT,       DEPENDENT
##VAR_FORM=  AFFN,          ASDF,            ASDF
##VAR_DIM=   8192,          8192,            8192
##UNITS=     SECONDS,       ARBITRARY UNITS, ARBITRARY UNITS
##FACTOR=    0.0002004,     1,               1
##FIRST=     0,             0,               0
##LAST=      1.6414764,     0,               0
##MIN=       0,             -315861,         0
##MAX=       1.6414764,     393080,          0
$$ Real data points
##PAGE= N=1
##DATA TABLE= (X++(R..R)), XYDATA
$$ [...]
$$ plain form
311 -1903 3472 2335 -3611 -2007 -63 1550 3053 -405 -1767 -1990 -2432 4002 4724 -3021 -2703 -1197
327 -1197 -1932 5216 4317 -5102 -2458 505 -1479 4494 3395 -5050 -1777 539 -1432 4746 2919 -5833
343 -5833 -1701 1850 -461 3571 1440 -5677 -817 2997 -360 1561 964 -3730 -790 2304 462
358 462 890 -379 -2829 -39 2264 823 -310 -1496 -1149 1398 1287 -297 -868 -992 -61 1342 636
375 636 -451 -1030 -906 868 1623 330 -992 -1878 -426 2434 1408 -1120 -1277 -1292 278 2684 663
392 663 -1753 -877 -784 201 2658 669 -2296 -1112 -149 824 2452 -40 -2780 -701 1023 962 1171 -468
410 -468 -2125 -327 1265 827 463 -558 -1601 -281 1519 1074 -460 -1186 -691 421 1335 504 -1195
427 -1195 -1045 436 767 529 163 -930 -861 816 845 110 -286 -1021 -583 1143 1003 -486 -887 -683 197
$$ packed form
311a903N375j137n946J604J944J613J503l458j362k23m42O434P22p745L18J506
327a197p35P148q99r419K644K963j984N973j099q445L273K316j971O178j827q752
343e833M132L551k311M032k131p117M860L814l357J921n97m694K940L094j842
358D62M28j269k450K790K303j441j133j186L47K547j11j584n71j24R31J403p06
375F36j087n79J24J774P55j293j322q86J452K860j026k528j57j5J570K406k021
392F63k416Q76R3R85K457j989k965J184R63R73J628k492k740K079J724o1K09j639
410d68j657J798J592m38l64j021j043J320J800m45j534p26M95J112R14q31j699
427a195J50J481L31k38l66j093O9J677K9p35l96p35M38J726j40j489m01K04Q80
$$ plain form
446 197 1271 390 -794 -839 -136 613 874 51 -625 -694 -94 956 835 -503 -889 -391 247 1091 426 -934
466 -934 -552 246 331 601 112 -859 -333 353 259 366 -75 -720 -189 468 402 122 -540 -517 274 441 137 -160
488 -160 -559 -80 438 117 -39 -3 -465 40 589 75 -164 -156 -415 148 699 -172 -447 -34 -126 297 385 -371
510 -371 -327 188 45 142 269 -307 -331 133 172 168 43 -321 -61 171 254 172 -191 -301 304 196 -81 184 -169
533 -169 -280 229 58 -120 194 -179 -245 390 92 -256 158 -100 -57 401 -110 -372 217 55 -52 264 -178
554 -178 -257 252 51 -78 147 -151 -310 86 74 11 71 -194 -120 232 66 -106 -2 -124 181 204 -109 -80 -11
577 -11 -85 188 205 -130 -94 -22 -103 255 168 -175 -21 -101 29 293 -18 -115 35 -112 -154 259 -29 -197 164 12
601 12 -165 218 -111 -277 213 140 -94 52 -176 -149 239 98 -32 -55 -165 -78 226 64 -38 68 -204 1
$$ packed form
446A97J074q81j184m5P03P49K61q23o76o9O00J050j21j338l86M98O38Q44o65j360
466i34L82P98Q5K70m89r71N26O86r4J07m41o45N31O57o6k80o62K3P91J67l04k97
488a60l99M79N18l21j56L6m62N05N49n14k39Qk59N63N51q71k75M13r2M23Q8p56
510c71M4N15j43R7J27n76k4M64L9mj25l64K60K32Q3q2l63j10O05j08k77K65l53
533a69j11N09j71j78L14l73o6O35k98l48M14k58M3M58n11k62N89j62j07L16m42
554a78p9N09k01j29K25k98j59L96j2o3O0k65P4L52j66j72J04j22L05K3l13K9O9
577a1p4K73J7l35L6P2q1L58q7l43J54q0J30K64l11r7J50j47m2M13k88j68L61j52
601A2j77L83l29j66M90p3k34J46k28K7L88j41j30k3j10Q7L04j62j02J06k72K05
$$ plain form
623 1 252 -51 -132 26 -159 8 202 -80 -179 28 108 99 11 -118 -13 87 59 206 28 -195 -102 51 37 271
647 271 61 -313 -53 77 38 187 -15 -86 91 -21 9 131 -65 -61 195 -33 -81 167 -180 -104 309 -4 -206
670 -206 39 -76 -154 247 15 -241 32 -7 -76 111 51 -17 -50 -61 13 88 -30 -58 22 -72 93 123 -160 25 134
695 134 -75 -13 100 -45 -38 49 -34 70 -42 -176 17 60 7 93 -51 -214 144 37 -46 62 -16 -163 180 20
719 20 -112 137 -27 -69 61 18 -2 -5 -46 37 43 -124 23 24 -124 57 77 -197 -40 90 -135 35 88 -165 -82
744 -82 64 -22 18 54 -102 48 -8 -14 13 -115 -29 135 17 -86 96 21 -136 46 -29 9 76 -29 -90 72 27
769 27 -61 103 -52 11 37 -112 101 81 -123 17 110 -124 20 127 -140 19 155 -119 -108 121 -59 -48 26
792 26 -88 -17 -16 -80 65 -33 -110 77 -41 -45 127 -17 -88 48 -10 -22 45 -33 -51 96 2 6 85 -48 26 109 -76
$$ packed form
623AK51l03q1J58j85J67J94k82r9K07Q0rq8j29J05J00k8J47j78k23R3J53j4K34
647B71k10l74K60J30l9J49k02p1J77j12L0J22j96MK56k28m8K48l47P6M13l13k02
670b06K45j15p8M01k32k56K73l9o9J87o0o8l3j1P4P5j18k8Q0r4J65L0k83J85J09
695A34k09O2J13j45PQ7q3J04j12j34J93M3n3Q6j44j63L58j07q3J08p8j47L43j60
719B0j32K49j64m2J30m3k0lm1Q3Oj67J47Jj48J81K0k74J57J30k25J70N3k53Q3
744h2J46q6M0L6j56J50n6oK7j28Q6J64j18j03J82p5j57J82p5L8O7j05o1J62m5
769B7q8J64j55O3K6j49K13k0k04J40R3k34J44J07k67J59J36k74J1K29j80J1P4
792B6j14P1Jo4J45r8p7J87j18mJ72j44p1J36n8j2O7p8j8J47r4MP9j33P4Q3j85
$$ plain form
819 -76 55 77 -136 32 88 -47 46 70 -68 46 101 -11 -2 85 -38 10 -6 -59 41 54 -48 37 -57 20 67 -27
845 -27 -77 103 -31 -50 179 -36 -64 54 -45 -79 105 -6 -86 97 -53 -38 48 -42 -16 74 -95 -36 -51 -4 -5 33
871 33 -78 66 -32 -95 99 38 -90 78 31 -88 63 23 -2 -7 -33 -45 55 -47 -5 114 -37 -84 66 -32 -50
896 -50 69 -32 -25 49 -83 6 105 -7 -44 14 -83 -7 56 -39 15 57 3 23 -44 -25 -26 34 -93 33 2 -64 38 31 2
925 2 20 2 -44 47 -19 -80 30 -35 -84 94 -26 -30 44 7 -16 35 -5 27 95 -33 83 90 -28 40 26 17 67 19 -64 1
955 1 53 8 88 39 -59 49 26 -40 63 55 -58 10 -25 -46 -10 60 -70 53 -4 -68 -29 -13 18 1 -19 -32 0 -88 -50
984 -50 64 -49 -2 33 -16 17 52 -28 -3 47 -51 29 -3 -5 -58 73 -66 39 15 -30 28 77 -32 -35 -24 -80 43 37 2
1013 2 36 5 -42 23 50 5 51 -25 -73 -29 -22 24 103 26 -28 36 -2 17 43 47 -34 -9 -39 -20 26 39 47 4 -23 -8 10 59
$$ packed form
819g6J31K2k13J68N6j35R3K4j38J14N5j12RQ7j23M8j6n3J00J3j02Q5r4P7M7r4
845b7n0J80j34j9K29k15k8J18r9l4J84j11q0J83j50J5Q6r0K6R0j69N9j5M7jL8
871C3j11J44r8o3J94o1j28J68m7j19J51m0k5nk6j2J00j02M2J19j51m7J50r8j8
896e0J19j01PP4j32Q9R9j12l7N8r7P6O3r5N4M2n4K0o7J9jO0j27J26l1o6J02pk9
925BJ8j8m6R1o6o1J10o5m9J78j20mP4l7k3N1m0L2O8j28J16Pj18O8j4rN0m8q3O5
955AN2m5Q0m9r8J08k3o6J03qj13O8l5k1L6P0j30J23n7o4L9J6L1j7k0j3L2q8L8
984e0J14j13M7L5m9L3L5q0K5N0r8Q0l2kn3J31j39J05k4m5N8M9j09lJ1n6J23ol5
1013BL4l1m7O5K7m5M6p6m8M4PM6P9p7n4O4l8J9K6Mq1K5l0J9M6J3Qm3k7J5J8M9
$$ plain form
1045 59 20 -40 -35 -43 -10 43 -11 -79 -37 23 76 -37 68 3 30 -16 44 26 -15 48 -33 54 -7 -34 10 -63 -32 38 27 33 29
1076 29 3 -69 52 -18 -43 72 2 -10 34 19 -24 -18 -17 -18 8 12 -47 -33 11 -46 -17 35 9 -1 9 5 -47 10 32 -104 39
1107 39 -5 -33 17 14 13 -6 -3 -31 -18 14 -40 -44 -25 6 31 74 55 -44 78 19 18 75 -12 -27 -30 55 -66 18 -9 26 30 17 68
1140 68 3 70 -31 -56 -3 22 -22 13 -40 -26 -39 41 -23 13 8 -8 -86 78 -11 -27 54 -23 -60 -74 24 39 -20 -32 -44 1
1170 1 17 -2 -115 -42 61 -8 -48 19 6 13 -7 -47 -44 -26 58 -1 -20 6 -45 19 -24 3 57 -66 23 -12 8 48 7 -34
1200 -34 -36 0 41 -48 -14 28 23 18 -33 18 -27 46 -52 38 54 87 -36 -11 58 -71 -28 25 -28 -18 -5 -33 5 83 31 27 -27
1231 -27 -3 4 -17 6 41 -23 -10 -3 7 29 44 -32 -20 42 40 11 -4 -46 40 53 -54 -30 56 46 -14 9 -3 63 51 5 -21
1262 -21 35 -23 52 19 -5 31 23 -24 23 38 -37 45 -17 -64 30 -26 -24 101 -27 5 51 -3 -48 -14 -14 -6 -26 13 -67 22 7
$$ packed form
1045E9l9o0NqL3N3n4o8M2O0N3j13J05o5K7m6O0j8m1O3q1Q7o1k7M4p3L1P0j1Om
1076B9k6p2J21p0k5J15p0j2M4j5m3OJjK6Mn9J4M4n7K9N2k6j0J0mn2N7K2j36J43
1107C9m4k8N0ljj9Lk8J3L2n4mJ9L1K5M3j9r9J22n9jN7q7j5lQ5j21Q4k7L5Mj3N1
1140F8o5O7j01k5N3K5m4L5n3J4j3Q0o4L6nj6p8J64q9j6Q1p7l7j4R8J5n9j2j2M5
1170AJ6j9j13P3J03o9m0O7j3Pk0m0LJ8Q4n9j9K6n1O4m3K7N4j23Q9l5K0M0m1m1
1200c4kL6M1q9L4M2nnn1N1m5P3r8R0J6L3j23K5O9j29M3N3n3J0J3k8L8P8n2mn4
1231b7K4Pk1K3L5o4J3PJ0K2J5p6J2O2kk9j5m2Q6J3j07K4Q6j0o0K3j2O6j2m6k6
1262b1N6n8P5l3k4L6qm7M7J5p5Q2o2m7R4n6KJ25j28L2M6n4m5L4%Qk0L9q0Q9j5
$$ plain form
1293 7 -20 73 -51 -7 14 20 0 11 -2 42 2 27 32 -44 85 31 10 44 19 -41 35 30 -60 -10 75 -21 -4 99 -77 10
1323 10 94 -18 41 65 16 7 16 -44 -3 48 -109 14 -41 -67 -41 6 -83 -39 75 -41 -12 -13 -29 5 24 -26 7 -13 -16 23
1353 23 78 -3 32 31 4 28 -59 -25 -3 -5 -11 69 -51 44 7 -46 0 33 -17 52 32 -67 60 -3 -102 64 103 -58 42
1382 42 18 -45 73 75 -98 50 -28 -47 106 63 -85 88 38 -82 -18 -23 -98 23 27 -44 94 32 -41 44 14 -36 96
1409 96 -10 -69 -2 39 -72 40 -40 -67 -29 -23 7 -21 -32 -85 -75 21 21 29 -61 37 9 -92 13 -7 -87 68 -10 -79 71
1438 71 47 4 49 -30 -28 71 -27 -80 66 8 9 67 -30 3 22 22 70 44 -7 -64 5 51 -34 64 -27 -21 13 5 -37 85 -3 -26
1470 -26 -6 -20 -20 35 16 0 -8 -6 80 -109 39 -7 24 12 -16 -48 -8 12 17 12 -28 10 18 79 24 -17 59 -72 20 48 -23 -16
1502 -16 22 18 -52 15 -34 35 34 1 45 47 16 -58 -15 -38 59 79 -16 14 1 14 39 -16 19 -29 59 6 48 17 -66 21 -34 18
$$ packed form
1293Gk7R3j24M4K1Ok0J1j3M4m0K5Np6J29n4k1L4k5o0P6nr0N0Q5r6J7J03j76Q7
1323A0Q4j12N9K4m9rRo0M1N1j57J23n5k6K6M7q9M4J14j16K9jj6L4J9n0L3k0lL9
1353B3N5q1L5jk7K4q7L4K2koQ0j20R5l7n3M6L3n0O9k0r9J27o3r9J66L9j61J00
1382D2k4o3J18Kj73J48p8j9J53m3j48J73n0j20O4np5J21Mp1J38o2p3Q5l0n0J32
1409I6j06n9O7M1j11J12q0k7L8OL0k8j1n3J0R6%Qr0R8k8j01J05k0q0J55p8o9J50
1438G1k4m3M5p9KR9r8n3J46n8JN8r7L3J9%M8k6n1n7O9M6q5R8r1OL4qm2J22q8k3
1470b6K0j4%N5j9j6qKQ6j89J48m6L1j2k8l2M0K0Nnm0L8QO1n5m1P6j31R2K8p1P
1502a6L8mp0O7m9O9jl3M4Kl1p4M3k3R7K0r5L0j3J3K5n5L5m8Q8n3M2l1q3Q7n5N2
$$ plain form
1534 18 54 21 -20 -23 -3 -12 55 78 5 44 -45 9 8 -24 47 26 22 48 -72 25 105 15 -77 36 -32 35 25 5 -54 -51 84
1565 84 -71 3 7 38 -24 9 -30 33 46 -40 17 12 28 -2 -27 22 -47 3 11 -56 -49 -21 45 -8 19 -23 58 33 -65 -16 2 35
1597 35 6 -5 5 3 -39 23 -21 -2 35 -33 -6 53 30 4 7 2 42 -21 -13 68 26 -58 0 66 46 20 32 -23 22 5 7 45 30
1630 30 -82 60 0 -41 42 66 -20 -26 33 19 -66 -27 6 -42 14 35 -58 10 -28 -33 20 -55 20 85 -32 28 23 2 -3 28 13
1661 13 -28 -77 -14 -102 3 -11 34 -20 11 -35 8 -11 -20 -48 59 56 2 31 -73 16 -1 15 -47 37 -28 18 6 37 -10 6
1691 6 -18 -2 67 31 0 5 20 -8 35 6 -21 -35 31 -24 -20 -9 10 -9 6 -9 -124 -4 50 5 1 35 -37 -3 34 -25 6
1722 6 -59 18 -67 -31 52 67 16 -124 -4 35 -36 34 9 -13 -10 54 -46 -71 8 -40 -27 12 18 102 3 -10 -8 -71 -41 21 68
1753 68 -14 95 39 55 -27 0 -50 15 -55 -15 40 29 3 -1 -3 -3 31 -26 16 33 -63 -54 14 -11 -65 9 -29 51 -36 14 37 25
$$ packed form
1534A8L6l3m1lK0rO7K3p3L9q9N4jl2P1k1mK6j20R7Q0r0r2J13o8O7j0k0n9LJ35
1565H4j55P4ML1o2L3l9O3J3q6N7nJ6l0k5M9o9N0Qo7PK8O6n3K7m2Q1k5r8M9J8L3
1597C5k9j1J0km2O2m4J9L7o8K7N9k3k6LnM0o3QQ1m2q4N8O6k0k6J2n5M5j7KL8j5
1630C0j12J42o0m1Q3K4q6oN9j4q5L9L3m8N6K1r3O8l8nN3p5P5O5j17O0nk1nL1j5
1661A3m1m9O3q8J05j4M5n4L1m6M3j9rk8J07ln4K9j04Q9j7J6o2Q4o5M6j2L1m7J6
1691Fk4J6O9l6l1NJ5k8M3k9k7j4O6n5MJ1J9j9J5j5j15J20N4m5mL4p2L4L7n9L1
1722Fo5P7q5L6Q3J5n1j40J20L9p1P0k5k2LO4j00k5P9m8J3L9OQ4r9j3Ko3L0O2M7
1753F8q2J09n6J6q2K7n0O5p0M0N5j1k6mk%L4n7M2J7r6RO8k5n4P4l8Q0q7N0K3j2
$$ plain form
1785 25 62 15 30 2 21 -76 -65 -14 -50 19 -15 39 -34 2 14 4 38 -18 -24 -54 -22 19 40 -38 42 -54 -35 -12 8 -13 -16
1816 -16 5 40 17 26 34 -7 23 -43 21 37 -3 -50 27 18 10 -12 -37 -29 -35 21 -18 -45 3 7 14 25 30 16 40 54 28 -10 50 9 -4
1851 -4 33 42 -47 6 79 35 26 80 -21 18 -7 10 -10 27 11 58 -43 14 8 15 3 -23 -4 28 12 -16 24 -7 26 12 -9 -31
1883 -31 20 -64 -17 45 -13 14 3 -23 30 54 51 -8 23 -19 29 15 -57 -27 14 -1 -8 21 9 -36 16 18 31 -28 35 -39 41 10
1915 10 45 -33 -45 9 9 28 36 5 4 -43 -36 -55 -49 -10 22 98 -19 104 -3 15 8 57 15 -68 28 -8 -19 14 -27 -49 11 -23
1947 -23 -29 -3 20 5 38 20 -30 38 -13 11 1 54 -32 35 -26 7 54 -8 9 20 -19 13 -18 -13 4 -32 -25 45 0 40 40 43 3
1980 3 31 -8 -9 31 -38 46 60 49 -45 37 -4 -30 -6 -35 75 33 -11 31 42 -32 -62 -55 -37 65 42 17 23 9 -6 22 40
2011 40 -67 69 25 4 6 11 -2 -59 -20 3 -38 -41 2 7 102 -14 13 1 36 26 -12 -23 -65 -6 55 -25 -9 15 12 -68 -40
$$ packed form
1785B5L7m7J5k8J9r7J1N1l6O9l4N4p3L6J2j0L4n6ol0L2M1K1p8Q0r6J9K3K0k1l
1816a6K1L5k3RQm1L0o6O4J6m0m7P7rqk2k5QoN6l9k7M8MPJ1Nj4K4J4k6l8O0m1j3
1851dL7Rq9N3P3m4rN4j01L9k5J7k0L7j6M7j01N7oPj2k6J9L2j6k8M0l1L3j4k1k2
1883c1N1q4M7O2n8K7j1k6N3K4ln9L1m2M8j4p2L0M1j5pK9j2m5N2KJ3n9O3p4Q0l1
1915A0L5p8j2N4%J9Ql1jm7Pj9OL9L2P6j17J23j07J8pM9m2q3R6l6j1L3m1k2O0l4
1947b3oK6K3j5L3j8n0O8n1K4j0N3q6O7o1L3M7o2J7J1l9L2l1NJ7l6PP0m5M0%Lm0
1980CK8l9jM0o9Q4J4j1r4Q2m1k6K4k9J10m2m4M2J1p4l0PJ8J02k3k5Oj4j5K8J8
2011D0j07J36m4k1KNj3n7L9K3m1lM3NR5j16K7j2L5j0l8j1m2N9O1q0J6K4lq0K8
$$ plain form
2042 -40 12 -2 7 -26 30 -30 24 -46 -39 55 -20 61 -17 66 55 -18 62 39 21 34 11 67 1 2 35 -7 16 -1 -9 -75 53 -3
2074 -3 27 -17 14 -42 -79 -10 -51 -43 18 -2 13 -34 -21 56 36 -42 -7 -25 50 29 -20 39 -30 14 9 42 42 23 -40 52 0 0 -6
2107 -6 44 -20 22 -2 21 25 29 61 -1 -30 29 34 27 -13 12 18 6 -4 13 -18 -11 50 2 -8 -24 2 -42 9 36 8 5 -20 28 -14
2141 -14 -14 13 -46 23 38 -23 -24 -14 -39 -49 16 -10 15 -63 -1 -41 -18 -8 1 2 7 39 -2 27 -55 -16 23 31 -13 -20 -50 27 47 -4
2175 -4 45 0 -26 -3 9 14 39 -37 -76 19 -7 -10 6 30 31 -18 -42 -17 -18 -51 23 2 33 -42 -14 48 -51 -4 -74 -2 -119 -23
2207 -23 43 24 -2 -16 -17 -44 12 24 39 18 -5 14 -7 -4 -41 30 48 -8 1 -10 19 46 34 -15 37 54 -44 27 22 5 5 -3 -15
2240 -15 47 -37 35 20 -58 14 20 35 66 -25 -16 4 7 -64 -11 39 12 6 -44 -25 -38 42 2 20 -9 -1 -6 -67 -102 -29 38 -57 19
2273 19 -53 1 -2 19 -1 -35 -39 0 45 51 34 -46 28 -7 19 -20 32 25 29 43 -2 55 41 -22 19 -17 21 38 -6 25 23 6 -56
$$ packed form
2042d0N2j4Rl3N6o0N4p0PR4p5Q1p8Q3j1p3Q0k3j8J3k3N6o6JL3m2K3j7qo6J28n6
2074cL0m4L1n6l7O9m1QO1k0J5m7J3P7k0p8L5j8P5k1m9N9o9M4nL3%j9o3R2n2%o
2107fN0o4M2k4K3MML2o2k9N9Npm0K5Oj2j0J7l1PO1m8j0j6K6m4N1K7k8lk5M8m2
2141a4%K7n9O9J5o1jJ0k5j0O5k6K5p8O2m0K3J0RJNL2m1K9q2L9L9Qm4pl0P7K0n1
2175dM9m5k6K3J2NK5p6l9R5k6lJ6K4Jm9k4K5jl3P4k1L1p5K8O2r9M7p0P2j17R6
2207b3O6j9k6j4jk7N6J2J5k1k3J9k1Ll7P1J8n6Rj1K9K7j2m9N2J7r8P1nj7%qj2
2240a5O2q4P2j5p8P2OJ5L1r1RK0Lp1N3N0k7on0J9j3Q0m0J8k9Qno1l5P3O7r5P6
2273A9p2N4lK1k0l4mL9M5Oj7q0P4l5K6l9N2pMJ4m5N7j4o3M1l6L8J7m4L1kj7o2
$$ plain form
2306 -56 0 -30 8 -32 2 5 33 11 1 -9 13 34 -18 39 -1 25 -4 -1 -32 -74 21 28 25 20 -78 -22 39 6 -12 6 43 5 -28
2339 -28 -13 18 14 9 15 -2 -11 11 -17 82 14 19 36 -52 26 -33 54 -10 36 1 -4 -6 -29 -33 -24 -8 -31 73 48 18 65 -15 -52 -27
2373 -27 -80 -40 -60 13 45 0 23 -26 49 -7 -9 7 -73 26 -52 15 26 -25 -27 -48 -25 53 -20 3 -5 58 26 -6 -6 19 3 -45
2405 -45 11 -92 19 23 -45 8 -36 39 13 33 -31 22 -2 -16 18 -13 6 33 12 57 12 14 -38 -1 40 52 53 13 0 -36 2
2436 2 21 -28 39 -2 22 17 51 19 -1 27 4 -49 45 -21 24 38 69 -56 -25 -43 -48 -11 -21 37 -15 38 28 27 18 46 4 53
2468 53 -22 23 -12 3 -13 5 -36 -37 26 -25 35 -20 26 18 5 -17 41 0 -16 -18 53 -32 18 95 -3 42 -42 -25 -4 -25 5 -16
2500 -16 5 -7 -30 -4 59 14 3 -1 3 -1 32 -59 25 -81 -24 -39 56 -49 -10 -16 91 27 68 6 -36 28 -52 -45 -32 -6 -38
2531 -38 -46 35 26 26 51 35 15 47 19 -6 -57 4 20 39 16 -60 62 -22 11 19 0 -29 14 7 63 40 -38 -23 49 -29 -37 59 -41
$$ packed form
2306e6N6l0L8m0L4LK8k2j0j0K2K1n2N7m0K6k9Ll1m2R5Plnr8N6O1l3j8J8L7l8l3
2339b8J5L1mnOj7rK2k8R9o8NJ7q8P8n9Q7o4M6l5nkk3mRJ6k3J04k5l0M7q0l7K5
2373b7n3M0k0P3L2m5K3m9P5n6kJ6q0R9p8O7J1n1kk1K3P8p3K3qO3l2l2%K5j6m8
2405d5N6j03J11Mo8N3m4P5k6K0o4N3k4j4L4l1J9K7k1M5m5Kn2L7M1J2Jm0j3l6L8
2436BJ9m9O7m1K4nL4l2k0K8k3n3R4o6M5J4L1j25L1j8nL7j0N8n2N3j0jrK8m2M9
2468E3p5M5l5J5j6J8m1jO3n1O0n5M6qj3k2N8m1j6kP1q5N0P7r8M5q4J7K1k1L0k1
2500a6K1j2k3K6O3m5j1mMmL3r1Q4j06N7j5R5j05L9oJ07o4M1o2m2O4q0PJ3K6l2
2531c8qQ1r%K5j6k0L2k8k5n1O1J6J9k3p6J22q4L3Qj9k9M3pN6k3p8J5P2p8qR6j00
$$ plain form
2564 -41 34 -36 6 14 -19 -65 -16 35 -48 7 -35 23 1 45 19 -46 3 32 -48 -5 -20 -21 -53 68 -9 -52 -3 -12 -22 -43 -9
2595 -9 -40 16 -32 -26 33 -46 14 21 16 41 82 -3 -10 6 -18 5 40 -35 26 -2 10 4 12 -56 29 45 -44 31 51 -22 -49 76 27
2628 27 27 40 -4 1 -15 -31 1 13 -24 -14 20 23 -39 13 26 -29 -60 -45 -44 20 63 16 26 -17 -42 31 1 -20 -17 7 -2 47 9
2661 9 24 17 49 32 -20 27 12 71 -23 40 42 -20 -58 -29 19 -38 -27 17 -21 32 -13 -42 -17 -10 -5 68 -36 -43 -38 20 -50 -30 11
2694 11 -26 -15 23 -11 30 108 -36 -11 -32 2 17 -3 27 3 17 -10 -22 28 -2 -76 17 9 46 -4 102 13 17 55 30 76
2724 76 -14 45 26 57 29 -17 35 35 49 64 29 4 15 -35 -19 21 46 16 -36 -23 -34 35 6 54 29 -15 -55 21 -58 -29 2
2755 2 26 11 26 12 -64 27 26 -41 -9 54 -70 8 -8 33 -74 10 -25 18 -22 13 31 -56 21 -90 62 3 74 -22 21
2784 21 -20 12 30 14 -35 -35 0 -1 -38 -17 11 -16 36 -57 -25 -8 38 9 13 39 -29 -6 -22 -20 52 -23 -19 -35 37 -56 -59 30 1
$$ packed form
2564d1P5p0M2Ql3m6M9N1q3N5m2N8k2M4k6o5M9K9q0M3j5jl2J21p7m3M9rj0k1L4
2595il1N6m8ON9p9O0PnK5M1q5pJ6k4K3L5p5O1k8J2oQo8Q5J6q9P5K0p3k7J25m9
2628B7%J3m4Nj6j6L2J2l7J0L4Lo2N2J3n5l1J5JO4M3m7J0m3k5P3l0k1LK4rM9l8
2661IJ5pL2j7n2M7j5N9r4O3Ko2l8K9M8n7J1M4l8N3m5k9K5PNP3j04pNN8p0K0M1
2694A1l7J1L8l4M1P8j44K5k1L4J5k0L0k4J4k7j2N0l0p4R3qL7n0J06q9ML8k5M6
2724G6r0N9j9L1k8m6N2%J4J5l5k5J1n0J6M0K5l0n2J3j1O9k9M8k5m4m0P6p9K9L1
2755BK4j5J5j4p6R1jo7L2O3j24P8j6M1j07Q4l5M3m0L5J8q7P7j11J52n9P1r6M3
2784B1m1L2J8j6m9%L5jl7K1K8k7N2r3L2J7M6k9MK6o8K3j6KP2p5Mj6P2r3lQ9k9
$$ plain form
2817 1 -53 14 -27 20 -42 -62 -15 26 -31 -58 26 -42 31 -4 -54 62 -54 27 -17 -4 46 -71 51 -22 -1 -33 -7 -36 -7
2846 -7 7 -13 -5 -53 77 -12 -28 35 -53 -24 45 -24 24 20 -5 -21 5 1 -3 47 17 38 -20 3 -21 -7 21 -48 26 -53 -24 39
2878 39 -5 10 1 -11 -74 42 15 -10 51 -33 -24 -22 -2 -66 -43 21 0 16 13 -14 36 -12 -21 8 47 23 -31 7 40 0 30 12
2910 12 -20 -39 -9 2 25 -13 29 23 66 37 34 20 -7 5 5 63 -26 -48 0 56 0 69 17 -39 50 15 21 -64 -60 23 43 -2 39
2943 39 -19 22 -1 -30 3 -43 56 -44 21 35 37 -32 -18 -22 -28 8 -60 -39 21 2 -13 29 11 -51 42 49 16 22 -28 -15 -27 8
2975 8 15 -30 14 16 -6 12 -8 -30 -1 8 -3 11 -5 6 23 -21 -44 34 46 -1 37 -85 -64 -14 -53 29 -22 -25 3 10 -22 20 -53
3008 -53 -1 -27 -37 36 19 -14 -41 3 -38 15 6 -57 -15 9 -75 -9 43 -58 -22 -22 -35 46 -29 30 33 2 -18 24 47 46 14 51
3040 51 -25 55 -61 27 43 -24 59 47 44 -2 18 -61 -6 25 47 8 -44 25 -36 76 -51 21 85 71 -42 12 39 -77
$$ packed form
2817An4O7m1M7o2k0M7M1n7k7Q4o8P3l5n0J16j16Q1m4J3N0j17J22p3K1l2K6k9K9
2846gJ4k0Qm8J30q9j6O3q8K9O9o9M8mk5j6K6mmN0l0K1n8K3k4J4K8o9P4p9K9O3
2878C9m4J5rj2o3J16k7k5O1q4RKK0o4K3O4k1J6lk7N0m8rK9L9k4n4L8L3m0L0j8
2910A2l2j9L0J1K3l8M2oM3k9lj4k7J2%N8q9k2M8N6n6O9n2n6Q9l5Oq5MQ3K0m5M1
2943C9n8M1k3k9L3m6R9j00O5J4Ko9J4moL6o8K1O0j9j5M2j8o2R3Pl3On0J3j2L5
2975HPm5M4Kk2J8k0k2K9Rj1J4j6J1J7m4k3P8J2m7L8j22K1N0l9Q2n1lK8Pl2M2p3
3008e3N2k6j0P3j7l3k7M4m1N3ro3M2K4q4O6N2j01L6%j3Q1p5N9Ll1k0M2K3jl2L7
3040E1p6Q0j16Q8J6o7Q3j2lm6K0p9N5L1K2l9n2O9o1J12j27P2O4j4j13N4K7j16
$$ plain form
3068 -77 -80 -7 -17 28 5 -59 -9 -45 -18 66 -18 16 2 10 -30 13 -32 25 -29 -21 -40 -13 21 47 -8 -87 -5 47 -44 -9 1 43
3100 43 47 -13 1 89 33 39 41 22 -16 -20 8 -47 -1 25 -19 -22 -11 -2 -7 21 -35 -38 -27 47 17 24 39 21 -3 -1 -32 -8 -33 -19 -74
3135 -74 4 -1 -20 -5 -92 8 6 -72 -21 26 38 -68 -16 -24 -11 16 -35 -39 25 -16 19 -3 -4 14 34 6 8 12 64 -55 15 26
3167 26 20 -8 36 -24 -9 18 1 42 -54 -62 -41 10 25 -74 6 -21 -25 -18 1 7 -101 12 -4 -40 -8 19 -81 28 5 12 -12
3198 -12 26 -8 -15 -24 -7 -26 11 3 94 -26 -19 -24 55 -17 -25 15 15 18 56 -46 6 -16 -4 61 42 54 24 -20 20 34 22 39 -4
3231 -4 11 0 13 11 31 6 5 27 8 -6 -7 -12 11 -40 17 -36 52 -28 28 14 -43 -35 14 -24 -27 -4 63 14 10 -4 8 -3 59 31
3265 31 6 -18 23 47 -3 59 13 24 -14 -1 23 -8 -29 60 -84 14 101 24 -21 -24 20 -46 25 26 -70 -24 -78 25 27 -6 -13
3296 -13 5 2 30 84 -65 2 65 -4 27 75 30 -7 3 -25 -6 -16 -16 -26 -29 -7 24 -36 8 32 -46 16 15 13 -3 78 50 -37
$$ packed form
3068g7lP3j0M5k3o4N0l6K7Q4q4L4j4Qm0M3m5N7n4Qj9K7L4K6n5p9Q2N2r1L5J0M2
3100D3Mo0J4Q8n6OKj9l8mK8n5M6K6m4lJ1RnK8n6lJ1P4l0PJ5j8k4Kl1K4k5J4n5
3135g4P8nj9J5q7J00kp8N1M7J2j06N2qJ3K7n1mO4m1L5k2jJ8K0k8KMN2j19P0J1
3167B6ok8M4o0J5K7j7M1r6qK1N1J5r9Q0k7mPJ9Oj08J13j6l6L2K7j00J09k3Pk4
3198a2L8l4prJ7j9L7qR1j20PnP9p2qM0%LL8j02N2k2J2O5j9J2l0m4M0J4j2J7m3
3231dJ5j1J3kK0k5jK2j9j4jnK3n1N7n3Q8q0N6j4n7QM9l8lK3O7m9mj4J2j1O2k8
3265C1k5k4M1K4n0O2m6J1l8J3K4l1k1Q9j44R8Q7p7m5lM4o6P1Jr6M6n4J03Kl3p
3296a3J8lK8N4j49O7O3o9L1M8m5l7J0k8J9j0%j0lK2L1o0M4K4p8O2jkj6Q1k8q7
$$ plain form
3328 -37 -18 14 27 81 -34 3 -9 0 60 34 70 -7 4 -20 25 -8 29 30 -27 7 19 -65 -46 -52 47 80 5 -8 4 -9 -32
3359 -32 20 -8 18 -48 4 15 28 -13 -12 1 18 -60 18 -6 12 35 -10 -27 -25 -7 13 -13 -25 34 -41 -7 -22 40 -4 38 29 -20
3391 -20 10 -50 -29 41 -13 -21 19 -20 46 63 -4 -12 -13 -33 25 -52 -34 11 22 20 -16 -34 4 22 -45 41 39 1 -10 6 30 3 39
3424 39 -45 -14 36 -58 -3 27 -25 8 1 13 -56 -19 51 42 -11 -10 -43 0 23 -34 -21 28 2 -20 -42 -21 -41 -19 12 -53 30 74
3456 74 -20 28 18 -32 -29 2 -38 58 23 26 54 50 -8 -32 9 5 28 -23 -40 -29 4 -20 -15 32 -15 -19 30 -44 -1 -21 -24 37 5 8
3490 8 22 5 -42 -11 -25 -59 -21 -23 -18 17 -45 -46 -16 -63 -50 41 22 35 -15 -4 -22 5 -31 30 35 -6 -14 -36 55 5 40 -4 32
3523 32 -2 -11 13 -5 -39 4 -53 -47 58 16 -10 -16 39 4 46 68 9 20 13 9 40 0 18 24 -65 9 18 -4 -7 -39 -6 19 -67 -49
3557 -49 42 -64 0 24 0 75 24 73 47 2 4 44 11 -34 -51 -2 -27 -13 31 18 28 -41 -5 52 17 8 -8 15 -22 5 21
$$ packed form
3328c7J9L2J3N4j15L7j2RO0k6L6p7J1k4M5l3L7Jn7L4J2q4J9oR9L3p5j3J2j3k3
3359c2N2k8K6o6N2J1J3m1JJ3J7p8P8k4J8K3m5j7KJ8K0k6j2N9p5L4j5O2m4M2rm9
3391b0L0o0K1P0n4qM0l9O6J7o7qjk0N8p7J8M5J1kl6j8L8J8o7Q6kl8j1J6K4k7L6
3424C9q4L1N0r4N5L0n2L3pJ2o9L7P0rn3Jl3M3K3n7J3M9k6k2k2K1k0K2L1o5Q3M4
3456G4r4M8j0n0LL1m0R6l5LK8mn8k4M1mK3n1j7J1L3k4NM7m7mM9p4M3k0lO1l2L
3490HJ4j7m7L1j4l4L8kNL5o2jL0m7J3R1j9J3n0J1j8K7l6O1Nm1qk2R1n0L5m4L6
3523C2l4rK4j8l4M3n7OJ05m2k6oN5l5M2K2n9J1pmL1m0J8Oq9P4Rk2ll2L3K5q6J8
3557d9R1j06O4K4k4P5n1M9k6m5KM0l3m5j7M9k5J4M4j3J0o9L6N7l5rj6K3l7K7J6
$$ plain form
3588 21 27 10 12 -12 -14 -11 -21 -49 46 25 3 41 -19 -76 -9 34 -46 5 28 61 30 89 9 87 21 -81 10 -2 -7 10 14 8 -15
3621 -15 -17 20 -11 4 20 -9 20 -31 -16 -38 -32 8 19 -29 6 25 -12 59 -4 22 32 30 -7 13 -19 -5 9 33 -1 3 -1 68 -7
3654 -7 1 14 -41 5 33 -16 11 11 0 -14 -13 -3 6 -34 -100 3 21 30 -8 48 -21 -76 43 21 -7 4 -65 22 -18 0 62 29
3686 29 59 25 -50 -5 50 72 16 27 29 -33 35 12 31 26 -46 46 -38 12 50 62 32 50 46 -18 27 26 -16 58 62 22 -29 45 -9
3719 -9 -18 -44 26 53 -18 33 -17 26 27 51 58 -28 15 23 32 2 48 -29 -1 4 -51 0 -48 -53 -27 25 -60 -40 -28 57 -35 -21 25 25 32
3754 32 3 53 -47 -10 25 45 7 -16 84 59 24 38 -3 115 -57 -3 58 -40 12 22 -13 33 -48 37 10 -24 45 -11
3782 -11 -18 -2 9 -5 19 10 17 -35 5 39 12 -2 36 -12 -24 21 5 -41 7 30 10 -12 -15 -24 -31 17 -3 -62 -3 62 -22 -47 -26
3815 -26 -18 -58 -1 43 -9 -24 33 -23 17 1 -77 -15 -15 17 -11 41 10 9 2 9 3 4 29 -41 -29 18 56 8 46 58 3 53 107 15
$$ packed form
3588B1Oj7Kk4kLj0k8R5k1k2L8o0n7O7M3q0N1K3L3l1N9q0P8o6j02R1j2nJ7Mok3
3621a5kL7l1J5J6k9K9n1J5k2OM0J1m8L5J9l7P1o3K6J0kl7K0l2J4J4K4l4MmO9p5
3654gQJ3n5M6K8m9K7%j1j4JJ0Rm0o6J03J8Rl8N6o9n5J19k2k8J1o9Q7m0J8O2l3
3686B9L0l4p5M5N5K2n6J1Ko2O8k3J9np2R2q4N0L8J2l0J8mo4M5jm2P4Mm0n1P4n4
3719irk6P0K7p1N1n0M3JK4Pq6M3QRl0M6p7K8Nn5N1m8nK6N2q5K0J2Q5r2J4M6%P
3754C2k9N0j00L7L5K0l8k3J00k5l5J4m1J18j72N4O1r8N2J0l5M6q1Q5k7l4O9n6
3782a1pJ6J1j4K4rPn2M0L4k7j4L8m8j2M5j6m6M8K3k0k2lrpM8k0n9N9O5q4k5K1
3815b6Qm0N7M4n2j5N7n6M0j6p8O2%L2k8N2l1jpPoJK5p0J2M7L8m8L8J2n5N0N4r2
$$ plain form
3849 15 -110 4 7 69 17 41 -20 -31 53 -55 45 6 -43 -1 15 15 2 -55 27 11 -55 13 2 54 38 5 33 -8 9
3878 9 55 -57 -5 -7 -17 -11 27 5 -6 8 4 20 -38 5 15 -44 -14 92 38 24 22 -18 -42 -7 22 28 -2 38 14 27 -27 -27 1
3911 1 -18 -70 -12 41 -6 4 -17 31 49 -5 15 -29 29 23 35 0 48 14 -7 -45 -21 16 -7 -20 -10 -21 -31 -21 -3 12 42
3942 42 -25 -7 8 22 -28 40 -24 -21 -20 -26 6 78 -1 41 64 29 3 94 40 -19 -10 33 -1 -1 8 7 24 -49 -10 -7 22 23 18 -52 1
3977 1 -23 22 20 35 48 -28 7 -24 4 67 58 -68 58 -33 66 2 -14 -20 -1 1 -15 -65 -17 20 44 -29 32 35 -52 47 109 3
4009 3 -18 -10 -59 -12 -8 3 55 23 4 4 -6 41 -8 -1 -30 -16 10 44 21 -21 5 -17 -31 8 53 -53 23 -10 -25 43 61 -48
4041 -48 29 53 -7 58 4 -15 41 29 -7 2 24 59 -41 78 -29 4 32 52 -17 45 -25 2 20 32 0 -8 -3 68 5 3 -6
4072 -6 -38 39 2 87 3 76 5 -15 19 32 55 9 -48 -9 18 -69 43 5 -42 43 64 -13 -23 -10 -15 31 7 -41 -12 47 15
$$ packed form
3849A5j25J14LO2n2K4o1j1Q4j08J00l9m9M2J6%j3n7Q2j6o6O8j1N2j6l3K8m1J7
3878IM6j12N2kj0OL8k2j1J4mJ6n8M3J0n9L0J06n4j4km0k4L5K9Ol0M0k4J3n4%K8
3911Aj9n2N8N3m7J0k1M8J8n4K0m4N8oJ2l5M8l4k1l8K4L7k3j3J0j1j0J0J8J5L0
3942D2o7J8J5J4n0O8o4LJoL2P2p9M2K3l5k6R1n4n9RM3l4%RjJ7p3L9LK9Jnp0N3
3977Ak4M5kJ5J3p6L5l1K8O3rj26J26r1R9o4j6oJ9Kj6n0M8L7K4p3O1Lq7R9O2j06
4009Ck1Qm9M7MJ1N2l2j9%j0M7m9Pk9J4K6L4k3m2K6k2j4L9M5j06P6l3j5O8J8j09
4041d8P7K4o0O5n4j9N6j2l6RK2L5j00J19j07L3K8K0o9O2p0K7J8J2l2qNP1o3kr
4072fl2P7l7Q5q4P3p1k0L4J3K3m6n7L9K7q7J12l8m7Q5K1p7j0J3nM6k4m8K9N9l2
$$ plain form
4103 15 -45 -33 -24 48 -29 -24 5 8 33 -33 -53 42 56 28 3 3 -22 -5 13 -34 67 10 -25 46 -3 34 27 1 -57 25 -23 3
4135 3 85 41 30 36 -17 -10 18 30 34 73 1 27 -6 -9 12 -7 -40 -38 67 18 -9 0 -21 9 22 -20 15 -3 -63 -30 5 4 -78 -9
4169 -9 6 -21 32 8 9 -12 -58 25 69 33 -35 21 20 -23 7 -15 -18 -16 -52 23 8 4 24 -28 20 12 18 -17 27 21 -40 28 16 32 -16
4204 -16 62 -13 -3 -37 -12 28 112 48 -20 61 34 30 -50 22 -51 -20 7 62 27 -56 -60 -20 78 25 3 13 -67 -65 -64 1 -2 17 -18
4237 -18 -1 -25 -39 48 -36 20 -54 38 -2 16 -31 -10 31 -34 62 14 -42 -38 -14 -31 27 13 -26 -1 1 46 -7 24 50 113 -13
4268 -13 -45 24 -2 -52 24 40 16 -33 40 -4 -62 66 -19 -34 71 -6 0 47 64 12 -33 6 4 0 -14 45 -45 -29 62 -12 -44
4299 -44 -32 20 -52 20 -14 -17 76 26 14 -16 -15 -8 -23 11 -38 33 -2 54 -14 5 30 33 20 -33 -38 27 49 -34 -30 33 60 -25 65
4332 65 -14 -26 17 40 -13 10 23 5 -27 -29 -31 -25 34 64 -25 28 18 72 -53 -53 -9 -10 -33 -64 54 -11 -5 5 53 -1 -45 -59
$$ packed form
4103A5o0J2RP2p7NK9LK5o6k0R5J4k8k5%k5J7J8m7J01n7l5P1m9L7pk6n8Q2m8K6
4135CQ2m4j1On3PK8J2ML9p2K6l3lK1j9l3KJ05m9k7Rk1L0J3m2L5j8o0L3L5jq2O9
4169iJ5k7N3k4Jk1m6Q3M4l6o8N6jm3L0k2lKl6P5j5mK0n2M8qOl5M4oo1O8j2J6m8
4204a6P8p5J0l4K5M0Q4o4o8Q1k7mq0P2p3L1K7N5l5q3mM0R8n3k2J0q0KJO5lJ9l5
4237a8J7k4j4Q7q4N6p4R2m0J8m7K1M1o5R6m8n6MK4j7N8j4l9K5KM5n3L1K6O3j26
4268a3l2O9k6n0P6J6k4m9P3m4n8J28q5j5J05p7OM7J7n2m5L9kmj4N9r0J6R1p4l2
4299d4J2N2p2P2l4lR3n0j2l0JPj5L4m9P1l5N6o8J9K5Lj3n3nO5K2q3MO3K7q5R0
4332F5p9j2M3K3n3K3J3j8l2kkON9L0q9N3j0N4j25%M4jk3l1J18o5OJ0M8n4m4j4
$$ plain form
4364 -59 18 -9 -9 -22 63 33 55 65 -1 -16 23 -1 23 -2 -6 9 -48 40 74 11 -3 34 -22 8 -10 -16 2 29 -10 -49 36 -9
4396 -9 -7 -22 38 20 1 -50 -33 19 -56 -26 7 -25 -12 -36 67 -7 5 16 87 46 -36 -34 -51 -15 5 -42 26 -27 -13 55 1
4427 1 -4 -3 15 8 18 -57 36 20 -15 48 -32 56 46 39 -15 5 63 53 -8 -64 32 18 -14 -2 19 88 38 19 -3 20 7 13 0
4460 0 8 -34 -35 35 48 18 -6 -66 -34 41 -56 -38 -19 11 -25 50 42 -76 -100 20 46 -34 8 31 -23 -6 15 -15 23 -67 58
4491 58 -34 40 -3 21 1 0 -39 -39 65 14 14 30 -24 -18 35 44 17 -16 72 -24 4 87 8 10 12 5 43 31 1 18 -15 28 100 1
4525 1 -10 -36 -4 -24 32 -70 -9 -4 50 -3 -25 10 0 48 44 -40 -12 -15 -35 -12 39 22 -87 -18 9 87 5 -8 -10 -37 6 23
4557 23 -25 27 40 50 16 3 74 -6 1 12 74 5 17 31 25 41 -18 -68 10 12 23 29 43 7 21 5 -40 -60 -1 -30 -49 9
4589 9 7 20 -9 30 -7 -6 36 27 -27 -58 8 12 52 -4 -32 -40 17 38 -9 15 -31 -5 -12 -28 34 24 11 -20 41 35 6 46 28 -9
$$ packed form
4364e9P7k7%j3Q5l0K2J0o6j5L9k4K4k5mJ5n7Q8L4o3j4L7n6L0j8oJ8K7l9l9Q5m5
4396iKj5O0j8j9n1J7N2p5L0L3l2J3k4J03p4J2J1P1m1q2Kj7L6K0m7O8n3J4O8n4
4427AnJJ8pJ0p5R3j6l5O3q0Q8j0pn4K0N8j0o1n6R6j4l2J2K1O9n0j9k2K3j3Oj3
4460@Qm2jP0J3l0k4o0L2P5r7J8J9L0l6P5qj18k4J20K6q0M2K3n4J7K1l0L8r0J25
4491E8r2P4m3K4k0jl9%J04n1%J6n4ON3Rk7l3Q8r6K8Q3p9KKpL8j2l0J7l3M3P2r9
4525Aj1k6L2k0N6j02O1NN4n3k2L5j0M8mq4K8lk0K3N1j7j09O9K7P8q2j3kk7M3J7
4557B3m8N2J3J0l4j3P1q0PJ1O2o9J2J4oJ6n9n0P8KJ1OJ4l6J4j6m5k0N9k9j9N8
4589IkJ3k9L9l7JM2rn4l1O6MM0n6k8qN7K1m7K4m6K6pj6O2j0j3l1O1ok9M0j8l7
$$ plain form
4623 -9 8 -7 16 47 26 -13 -12 19 50 32 37 39 10 6 24 69 -72 58 9 33 -51 40 15 8 39 -34 23 -53 -43 13 36 -6
4655 -6 8 -20 -12 43 -14 10 -43 40 -5 -16 37 -6 -19 62 -10 48 -31 11 17 19 77 21 -52 -22 23 24 10 -5 -39 -18 -57 -35 1
4688 1 -47 -25 -10 29 -63 23 -31 4 -6 -57 49 -24 -65 58 69 14 -4 -10 -61 -28 11 -94 -13 -18 -52 40 -7 -25 -35 -82
4718 -82 37 35 -39 6 -30 51 -57 -4 -12 -15 10 15 1 14 -11 42 35 -39 21 -41 -42 -18 -21 50 -4 -19 -3 2 50 45 8 -3 -16 9
4752 9 78 -49 -18 74 -37 49 -37 -45 -4 14 52 -40 10 2 -10 72 -27 -28 9 26 -28 -20 15 -2 19 23 10 8 -48 17 -16 -11 -33
4785 -33 2 30 20 21 -36 -20 -20 48 -41 -22 -67 20 9 -12 14 21 14 63 -12 -11 4 1 -55 -11 24 -43 -2 -2 -20 19 7 -33 27 19
4819 19 -6 13 -32 -5 50 12 -19 -15 -27 0 -6 -17 12 -26 -9 2 -32 -16 -8 48 -13 -48 17 -5 -77 17 -21 -21 -79 5 57 10
4851 10 30 -29 52 15 67 -15 -30 -26 31 -11 23 2 33 -28 23 66 -6 38 30 29 -33 -9 -13 23 20 -24 -18 14 -53 15 47 -20 13
$$ packed form
4623iJ7j5K3L1k1l9JL1L1j8NKk9mJ8M5j41J30m9K4q4R1k5pL1p3N7p6J0N6K3m2
4655fJ4k8QN5n7K4n3Q3m5j1N3m3j3Q1p2N8p9M2OKN8n6p3L0M5Jj4j5l4K1l9K2L6
4688Am8K2J5L9r2Q6n4L5j0n1J06p3m1J23J1n5j8on1L3L9j05Q1nl4R2m7j8j0m7
4718h2J19kp4M5l6Q1j08N3qlK5Nj4J3k5N3pp4O0o2jK4lP1n4j5J6NM8nl7j1j3K5
4752IO9j27L1R2j11Q6q6qM1J8L8r2N0qj2Q2r9jL7J7n4QL5j7K1Mj3kn6O5l3Nk2
4785c3L5K8j0Jn7J6%O8q9J9m5Q7j1k1K6PpM9p5JJ5ln6M4L5o7M1%j8L9j2m0O0q
4819A9k5J9m5K7N5l8l1Mj2K7oj1K9l8J7J1l4J6QN6o1l5O5k2p2R4l8%n8Q4N2m7
4851A0K0n9Q1l7N2q2j5MN7m2L4k1L1o1N1M3p2M4qjo2K4mL6lm4OL2o7O8L2o7L3
$$ plain form
4884 13 55 -86 31 51 -21 49 -26 28 -26 47 5 -35 38 -30 -10 9 -42 -36 27 -41 -11 24 -70 -35 -2 -4 16 34 49 26
4914 26 -7 16 -21 -47 -42 4 6 78 -62 -15 33 -35 -34 30 24 45 -3 38 61 54 -17 -8 6 16 -32 2 1 25 25 -12 23 76 70 22
4948 22 -17 32 12 21 -30 -10 -39 -36 -16 -26 19 -72 -71 -13 45 7 75 -8 -6 -10 -16 0 -10 -30 -22 14 -22 72 9 -8 98 -94 12
4981 12 -25 -52 -10 3 12 -7 23 31 -18 -16 12 17 13 -10 7 16 92 41 -37 -9 -17 2 30 -26 -4 -38 -2 -1 29 6 -21 13 7 -26 -40
5016 -40 52 -18 6 -68 -33 -25 -40 -27 8 5 18 47 23 -32 -71 62 3 -28 -5 -37 72 -10 -14 22 -20 -81 -52 10 51 34 -22
5047 -22 47 -18 -48 -3 -4 4 22 0 -41 72 20 -34 5 37 64 -41 -45 34 -26 -28 -80 -50 19 86 23 -60 -16 -10 16 27 -19 -35
5079 -35 -30 -33 16 -11 52 -36 15 18 11 54 -54 -9 26 -23 -51 -68 18 8 -76 -3 33 3 -30 44 21 16 -55 -12 -30 -1 -21 -67
5111 -67 -8 25 51 65 23 -57 26 -20 -8 -22 29 48 15 39 -53 -5 31 9 -33 27 -2 3 3 -8 5 -18 78 -41 30 77 6
$$ packed form
4884A3M2j41J17K0p2P0p5N4n4P3m2m0P3o8K0J9n1OO3o8L0L5r4L5L3kK0J8J5k3
4914B6l3K3l7k6NM6KP2j40M7M8o8JO4oK1m8M1K3pp1RJ4J0m8L4jK4%l7L5N3om8
4948B2l9M9k0Rn1K0k9LK0j0M5r1JN8N8l8O8q3KmoJ6j0k0QL6l6R4o3j7J06j92J06
4981A2l7k7M2J3Rj9L0Qm9KK8Nmk3J7RP6n1p8K8qJ9K8n6K2l4L6JL0k3k7L4ol3j4
5016d0R2p0K4p4L5Qj5J3L5lJ3K9k4n5l9J33n9l1K3l2J09q2mL6m2o1K9O2M1j7n6
5047b2O9o5l0M5jQJ8k2m1J13n2n4L9L2K7j05mP9o0kn2L0O9O7o3q3M4OK6J1m6j6
5079c5NlM9k7O3q8N1LpM3j08M5L5m9k8j7Q6j0q4P3L6l0l3P4k3np1M3j8K9k0m6
5111f7N9L3K6J4m2q0Q3m6J2j4N1J9l3K4r2M8L6k2m2O0k9N%j1J3k3R6j19P1M7p1
$$ plain form
5142 6 -1 -39 -17 0 17 12 47 10 -4 78 62 -3 -62 7 -15 -83 45 -55 22 -27 77 -9 7 -22 4 11 -2 23 29 -12 -10 13
5174 13 -38 -6 44 16 16 29 40 17 -47 -46 -2 0 65 -15 12 28 -3 70 74 38 -19 73 -18 13 -60 61 25 11 -11 -11 12 7 -9
5207 -9 23 12 -82 -13 -46 -19 -23 5 16 -10 -16 -39 -45 8 -1 31 -8 -6 66 -8 60 28 21 -24 20 54 33 -6 10 -45 0 5 5 24 -6
5242 -6 43 -18 6 11 -21 29 14 59 -29 42 36 6 -22 -55 65 53 -57 -18 17 19 26 21 36 -17 25 23 -28 -22 21 -3 -52 10 -36
5275 -36 -43 -21 22 7 28 24 -9 -85 -14 -50 -45 -47 -5 23 -26 -30 -36 -22 -69 42 -7 32 -10 6 1 -34 -9 -9 28 -18 36 -35 15 -16
5309 -16 32 51 7 -20 29 60 -23 35 -41 -2 16 -77 -24 -59 13 -29 41 8 -8 22 -5 29 -24 2 -53 -33 -26 -10 33 5 -47
5340 -47 -26 -25 -17 30 34 -34 -73 -5 -60 51 55 36 -9 -21 2 8 17 -12 -5 -13 28 15 31 2 -33 29 24 21 63 -17 1 -36 15 37 -12
5375 -12 -33 28 8 -27 21 32 16 -31 -21 -14 -34 9 -36 26 27 -96 -26 -1 22 -24 3 9 -89 -13 -48 -76 22 -40 2 53 48 4
$$ packed form
5142Fpl8K2J7J7nL5l7j4Q2j6o5n9O9k2o8J28j00P7m9J04q6J6k9K6Pj3K5Om1KK3
5174A3n1L2N0k8%J3J1k3o4JM4KO5q0K7J6l1P3Ml6n7R2r1L1p3J21l6j4k2%K3nj6
5207iL2j1r4O9l3K7mK8J1k6ok3oN3rL2l9KP2p4O8l2pm5M4L4k1l9J6n5M5N%J9l0
5242fM9o1K4Nl2N0j5M5q8P1ol0k8l3J20j2j10L9L5KPnJ5n3M2kn1OM3k4m9O2m6
5275c6pK2M3j5K1ml3p6P1l6NkM2K8m9moJ4m7J11m9L9m2J6nl5K5%L7m6N4p1N0l1
5309a6M8J9m4k7M9L1q3N8p6L9J8r3N3l5P2m2P0l3j6L0k7L4n3K6n5K0PJ6M3k8n2
5340d7K1JQM7Mo8l9O8n5J11Mj9m5j2K3ORk9PqM1j3J6k9l5O2nlM2q0J8l7N1K2m9
5375a2k1O1k0l5M8J1j6m7J0Pk0M3m5O2Jj23P0K5K3m6K7Or8P6l5k8R8o2M2N1nm4
$$ plain form
5407 4 -81 4 -42 -90 39 53 -9 5 42 68 53 18 -24 15 27 76 58 47 25 35 1 -36 -24 14 -30 -12 49 -13 78 -8
5437 -8 -14 -5 10 -1 -35 10 -52 4 19 21 70 -5 -48 -22 54 30 -13 -26 -38 -46 6 31 -25 5 8 2 -26 -51 1 -36 -25 40 18 -38
5471 -38 -48 9 -23 -9 10 60 28 36 -11 21 -49 -14 81 -45 -4 -12 -29 -16 35 14 -47 -32 38 5 49 57 -10 -21 -1 8 -3 46
5503 46 -3 -41 -2 13 48 -34 12 -33 -1 -52 10 15 -10 11 11 0 -58 54 -40 -69 -53 -12 -13 -52 4 -36 -8 -31 20 -9 -9 -66
5535 -66 51 -62 -8 -13 12 9 -17 9 -40 -29 -27 10 40 -28 45 23 -30 -52 -26 -11 -2 26 -30 -14 76 37 -24 46 -25 61 21
5566 21 -5 48 -9 42 5 -47 50 -1 -27 42 20 11 -9 13 26 19 -51 -24 57 -5 -25 9 -21 -38 -35 -8 45 -1 31 -47 -75 21
5598 21 63 -29 -16 32 40 -28 64 -48 15 11 69 -16 -12 -1 -5 9 38 -23 39 20 -41 -16 35 -32 10 11 32 -33 -9 -22 -32 10
5630 10 -32 29 -42 52 40 33 -78 17 25 -31 -37 -46 -3 -1 -10 -31 -27 31 -30 53 -31 -10 15 -24 60 -15 2 -8 67 -55 35 61 -2
$$ packed form
5407Dq5Q5m6m8J29J4o2J4L7K6j5l5m2L9J2M9j8j1k2J0l4l7J2L8m4J8O1o2R1q6
5437hoRJ5j1l4M5o2N6J5KM9p5m3K6P6k4m3j3j2qN2K5n6L0Lok8k5N2l7J1O5k2n6
5471c8j0N7l2J4J9N0l2Qm7L2p0L5R5j26M1qj7J3N1k1o1J5P0l3M4Qo7j1K0Rj1M9
5503D6m9l8L9J5L5q2M6m5L2n1O2Nk5K1%j1n8J12r4k9J6M1jl9N6m0K8k3N1k9%n7
5535f6J17j13N4nK5lk6K6m9J1KL7L0o8P3k2n3k2K6J5RK8n6J6R0l9o1P0p1Q6m0
5566B1k6N3n7N1l7n2R7n1k6O9k2rk0K2J3pp0K7Q1o2k0L4l0j7LK7N3m6L2p8k8R6
5598B1M2r2J3M8Qo8R2j12O3mN8q5MJ1mJ4K9o1O2j9o1K5N1o7M2JK1o5K4j3j0M2
5630A0m2O1p1R4j2pj11R5Qn6orM3Krk1MN8o1Q3q4K1K5l9Q4p5J7j0P5j22R0K6o3
$$ plain form
5663 -2 0 -47 -53 -15 -13 49 -5 -53 -26 -3 14 34 -15 47 -27 -35 -2 1 19 7 -16 -16 -5 -47 -11 53 34 -42 -54 -86 -48 28 7 -47
5697 -47 -58 22 18 20 -35 -15 20 62 35 -42 -14 -41 -31 12 -49 74 -2 10 27 -21 -42 -23 -1 -31 43 25 -60 22 -29 -31 22
5728 22 -9 39 44 15 -2 22 16 14 -39 2 9 -48 -36 4 6 -1 61 20 -66 28 -1 -8 -16 1 -10 -42 -72 -27 20 48 48 -14 4 -25 -4
5763 -4 -19 8 10 69 16 -60 -48 77 -54 -67 55 15 44 -28 11 -77 -10 10 20 -14 -25 21 11 21 -28 2 -31 -22 44 7
5793 7 -12 -13 -48 -38 30 -20 -6 -19 13 -26 -34 79 -10 26 9 -11 -9 33 27 16 -48 -6 23 -1 2 -47 -11 -28 -11 61 26 13 -29
5826 -29 -14 14 9 -41 53 30 17 23 -18 -58 29 5 -57 15 24 -50 -20 26 97 15 -45 81 0 49 3 -26 0 -5 28 -7 16 -34
5858 -34 -26 9 -14 7 37 17 8 -9 38 78 -38 30 -12 -64 -47 -74 -40 -6 -7 -35 -22 -9 25 61 -40 -60 16 -3 -9 -41 -49 -3
5890 -3 33 -8 -17 -36 -19 64 5 2 3 -67 12 56 -11 -25 47 -11 6 -28 -19 64 -18 -26 14 6 -5 51 31 -18 -7 26 -2 -6 38 -42
$$ packed form
5663bKm7oL8KO2n4m8K7K3J7K0m9O2p4qL3LJ8j2k3%J1m2L6O4j9p6j2l2L8P6k1n4
5697d7j1Q0mKn5K0L5M2k7p7K8k7J0M3o1J23p6J2J7m8k1J9K2l0P4j8q5Q2n1kN3
5728B2l1M8Nk9j7K4okn3M1Pn7J2M0KpO2m1q6R4k9pqJ7j1l2l0M5M7K8%o2J8k9K1
5763dj5K7KN9n3p6J2J25j31j3J22m0K9p2L9q8O7K0J0l4j1M6j0J0m9L0l3RO6l7
5793Gj9jl5J0O8n0J4j3L2l9qJ13q9L6j7k0KM2oj1o4M2K9k4Lm9L6j7J7P2l5j3m2
5826b9J5K8nn0R4k3j3Om1m0Q7k4o2P2Rp4L0M6P1q2o0J26q1M9m6k9K6nL3l5K3n0
5858c4QL5k3K1L0k0rj7M7M0j16O8m2n2J7k7L4L4jk8J3J3L4L6j01k0P6j9ol2qM6
5890cL6m1rj9J7Q3n9lJp0P9M4o7j4P2n8J7l4RQ3q2qM0qj1N6k0m9J1L3k8mM4q0
$$ plain form
5924 -42 -16 17 79 -9 -21 -51 -15 5 -5 -49 73 -21 36 16 10 -27 16 12 24 -73 19 26 -27 -3 -1 -15 -40 50 -24 50 -12 -4
5956 -4 21 37 0 18 55 3 5 -80 -18 -83 35 -26 48 -2 -50 5 55 -41 -17 54 -31 20 -2 -21 -17 -26 8 31 -79 -41 -20
5987 -20 11 54 3 64 44 -10 3 7 -25 -25 52 0 -12 -68 -51 -29 -52 -26 20 -43 32 27 -43 7 74 40 -31 -21 -44 -6 13 17
6019 17 -21 -90 6 37 -13 -22 55 37 -53 17 -3 -31 0 9 -8 41 5 13 33 -13 -18 -14 -31 17 -35 -43 -11 4 50 38 -92 5 13
6052 13 -31 32 37 -57 36 43 -5 -13 -31 2 35 -15 0 -3 14 25 -30 80 -32 -2 1 -2 3 7 -8 10 62 30 -15 5 -54 2 98
6085 98 4 -48 48 32 11 20 -35 -9 14 -19 -5 9 -36 79 68 -16 7 -14 -19 79 -13 21 27 -15 -66 77 22 -4 30 5 -8
6116 -8 -41 43 -73 23 15 16 -30 24 23 53 -14 -31 -2 9 14 -23 36 -12 -49 76 55 -42 14 30 -16 -34 9 -41 31 54 10 -88
6148 -88 -3 16 10 18 8 -29 -12 -97 -6 78 3 19 23 61 62 16 32 22 64 -45 -46 16 30 -28 26 -28 -4 7 17 21 0 -29 -56
$$ packed form
5924d2K6L3O2q8j2l0L6K0j0m4J22r4N7k0ol7M3mJ2r7R2Pn3K4Kj4k5R0p4P4o2Q
5956dK5J6l7J8L7n2Kq5O2o5J18o1P4n0m8N5N0r6K4P1q5N1k2j9MrL4K3j10L8K1
5987b0L1M3n1O1k0n4J3Ml2%P7n2j2n6J7K2k3K6M6o3P5np0N0O7l4p1J0k3L8J9M
6019A7l8o9R6L1n0rP7j8r0P0k0k8L1Rj7M9l6QK0m6nMj7M8n2qL2J5M6j2j30R7Q
6052A3m4O3Nr4R3Pm8qj8L3L3n0J5lJ7J1n5J10j12L0LlNMj5J8N2l2m5K0n9N6R6
6085I8r4n2R6j6k1Rn5K6K3l3J4J4m5J15j1q4K3k1nR8r2L4Om2n1J43n5k6L4k5j3
6116hl3Q4j16R6qJm6N4jL0o7j7K9J1Nl7N9m8l7J25k1r7N6J6m6j8M3n0P2K3m4r8
6148h8Q5J9oQj0l7J7q5R1Q4p5J6ML8Jm6J6j0M2j09jO2J4n8N4n4K4J1J0Mk1k9k7
$$ plain form
6181 -56 -40 4 41 11 -75 0 -5 -10 -31 -16 41 22 17 29 -35 67 -35 -16 -27 24 -40 34 19 -6 -17 -9 44 -42 55 -7 -8 11
6213 11 61 -5 11 2 -70 24 -18 3 39 10 42 41 26 -24 -27 -19 -15 12 -34 16 -41 -47 -44 -26 -47 20 4 -6 27 -29 49 -1 13 27
6247 27 -4 -74 -21 17 -55 21 63 -29 22 -51 -19 9 -24 40 16 0 25 -76 -8 7 23 -10 13 30 9 5 74 -40 61
6276 61 -62 30 -27 6 41 67 42 63 1 28 54 10 41 -12 -21 -26 3 28 7 -30 12 19 -6 2 -27 36 12 -23 19 -10 29 -1
6308 -1 14 -22 -36 30 49 -42 45 59 -8 62 56 3 -19 -26 -22 -3 4 10 2 -19 37 -32 34 4 -61 34 23 28 -7 9 -9 25 0 26
6342 26 30 -39 2 -19 -34 1 20 59 10 -13 -47 -19 -20 -9 24 5 62 34 -20 -5 -6 -45 -13 -3 -3 36 9 -40 22 -20 2 -77
6374 -77 17 -45 -47 -37 17 50 56 15 1 -51 15 -27 -44 17 17 25 -21 35 18 -71 -2 -9 33 -34 5 65 -27 -24 26 -26 -12 15 25
6407 25 7 16 -7 14 43 66 44 -38 30 15 24 37 -26 -25 -12 -7 7 40 54 11 -27 -21 -6 16 -25 28 -16 39 -16 -6 -17 -3 -10
$$ packed form
6181e6J6M4L7l0q6P5nnk1J5N7j9nJ2o4J02j02J9j1N1o4P4j5k5j1QN3q6R7o2jJ9
6213A1N0o6J6rp2R4m2K1L6k9L2jj5n0lQMK7m6N0n7oLJ8k1O7j6j0L3n6P8n0J4J4
6247B7l1p0N3L8p2P6M2r2N1p3L2K8l3O4k4j6K5j01O8J5J6l3K3J7k1mO9j14J01
6276F1j23R2n7L3L5K6k5K1o2K7K6m4L1n3rnK9K5k1l7M2Pk5Qk9O3k4l5M2k9L9l0
6308aJ5l6j4O6J9r1Q7J4o7P0on3k2pMJ9POqk1N6o9O6l0o5R5j1Nl5J6j8L4k5K6
6342B6Mo9M1k1j5L5J9L9m9k3l4K8jJ1L3j9N7k8n4J5jl9L2J0%L9k7m9O2m2K2p9
6374g7R4o2kJ0N4L3Om1j4n2O6m2j7O1%Qm6N6j7q9O9pM2o7L9O0r2LN0n2J4K7J0
6407B5j8Rk3K1K9K3k2q2O8j5RJ3o3JJ3NJ4L3J4m3l8OJ5K2m1N3m4N5n5J0j1J4p
$$ plain form
6440 -10 41 1 -15 -33 -7 40 11 -24 24 51 -2 -5 42 12 33 -30 56 12 32 29 -3 -8 34 1 37 -3 -43 42 65 59 -9 55
6472 55 -18 44 14 -22 23 11 -53 14 -42 30 39 -70 -35 -13 59 -8 29 77 -20 15 -16 17 36 10 -23 65 22 -17 -33 -1
6502 -1 45 -1 39 -10 11 -33 -20 -12 33 38 -28 -80 7 -28 -19 45 -10 101 15 -23 22 58 77 10 2 -61 15 34 9 13 -11 18 -25
6535 -25 30 -30 3 46 13 2 18 46 -23 1 -2 9 -1 -10 -4 -3 18 -7 7 -57 39 5 -13 -9 71 -24 60 64 39 -13 -4 -39 -25 0
6569 0 26 10 15 -17 48 48 10 34 44 5 -15 10 68 43 55 84 -9 69 -21 53 -4 12 0 36 34 0 40 51 10 63 16 -5
6601 -5 -8 20 15 11 31 -37 -3 -44 13 13 -31 -12 -13 72 5 -1 66 33 16 21 4 -44 15 3 -7 19 -28 -15 -20 -35 -2 -26 -11 -5 70
6636 70 -8 -10 7 -97 -51 16 -23 22 16 -38 23 -3 6 -2 -13 18 68 24 13 13 -20 59 -7 10 -32 -44 -6 -13 -12 11 25 -20 6
6669 6 -77 -42 31 13 -27 0 -18 -47 3 -38 -31 14 -48 -48 -6 10 11 -13 1 -8 6 39 -18 42 25 13 14 75 -29 9 -20 16 -27
$$ packed form
6440a0N1m0j6j8K6M7k9l5M8K7n3lM7l0K1o3Q6m4K0ll2nM2l3L6m0m0Q5K3oo8O4
6472E5p3O2l0l6M5j2o4O7n6P2Rj09L5K2P2o7L7M8r7L5l1L3J9k6l3Q8m3l9j6L2
6502aM6m6M0m9K1m4J3QM5No6n2Q7l5RO4n5J11q6l8M5L6J9o7qo3P6J9k5Mk4K9m3
6535b5N5o0L3M3l3j1J6K8o9K4lJ1j0rOJK1k5J4o4R6l4j8MQ0r5Q4Mk5n2Rl5J4K5
6569@K6j6Nl2O5%l8K4J0l9k0K5N8k5J2K9r3P8r0P4n7J6j2L6kl4M0J1m1N3m7k1
6601elK8nmK0o8L4m1N7%m4J9jQ5o7oO7l3j7Nj7m8N9j2j0K6m7J3nj5L3k4J5OP5
6636G0p8kJ7j04M6O7l9M5on4O1k6Rqj1L1N0m4j1%l3P9o6J7m2j2L8pJK3J4m5K6
6669Fq3L5P3j8m0K7j8k9N0m1PM5o2%M2J6Jk4J4rJ4L3n7O0j7j2JO1j04L8k9L6m3
$$ plain form
6702 -27 -27 -10 -63 -56 -1 24 6 -27 15 19 11 -23 -16 0 17 -35 -28 -23 -40 35 -9 13 -36 29 -8 -44 5 -27 -83 19 32 -53 -16
6735 -16 20 -10 15 55 -44 64 10 -19 18 39 -30 -17 -17 57 28 -88 3 -50 -32 32 -37 -39 39 28 38 30 18 78 -44 15
6765 15 14 -33 39 41 9 -4 -27 -11 31 -29 25 37 37 30 5 8 16 -17 -53 -10 11 -18 -11 37 12 30 -1 42 59 -53 -16 11 15 1
6799 1 35 9 22 13 -32 -9 9 19 18 33 -2 -31 18 58 41 -10 -19 16 -22 5 44 10 9 -41 21 20 51 9 59 17 -5 20 -32
6832 -32 20 28 -4 1 53 25 -34 25 73 -37 -28 -20 27 6 27 -23 75 20 5 -4 -54 81 -10 21 -22 23 30 -18 -17 17 -30 8 -29
6865 -29 -85 -40 -18 6 2 -26 13 -7 -44 -4 1 18 21 -56 -41 -9 38 31 9 1 -9 0 -18 26 8 -23 76 9 8 15 53 -6 32 -5
6899 -5 -14 29 -10 -15 -35 18 69 32 -59 10 27 4 -14 -26 17 -93 -48 -8 14 -29 -16 -24 -15 -33 -14 -15 1 35 -11 -52 -13 -39 -22
6932 -22 76 -12 71 -24 -52 -52 4 -32 2 -26 81 -49 -18 28 0 -17 48 18 3 11 -18 19 -54 -23 29 -7 -74 28 59 -28
$$ packed form
6702b7%J7n3PN5K5j8l3M2Mql4PJ6J7n2PNj7P5m4K2m9O5l7l6M9l2n6J02J3q5L7
6735a6L6l0K5M0r9J08n4k9L7K1o9J3%P4k9j16R1n3J8O4o9kP8j1J0qj2O0j22N9
6765A5jm7P2Kl2j3k3J6M2o0N4J2%pk5LQl3l6M3K1k9PM8k5J8l1M3J7j12L7K7Mj4
6799AL4k6J3rm5K3J8J0jJ5l5k9M9M0j7n1rL5l8K7L9l4jn0O2jL1m2N0m2k2K5n2
6832c2N2Ql2NN2k8n9N9M8j10RQM7k1K1n0R8n5j5rn0J35r1L1m3M5Pm8JL4m7L8l7
6865b9n6M5K2K4mk8L9k0l7M0NJ7Lp7J5L2M7pk2qj0Rj8M4j8l1R9o7jPL8n9L8l7
6899erM3l9nk0N3N1l7r1O9J7k3j8j2M3j10M5M0K2m3J3qRj8J9jJ6L4m6m1L9k6J7
6932b2R8q8Q3r5k8%N6l6L4k8J07j30L1M6k8j7O5l0j5Qk9L7p3L1N2l6o7J02L1q7
$$ plain form
6962 -28 62 -8 28 50 47 22 43 9 -26 7 27 -11 15 -47 10 1 -13 -22 -46 15 76 26 11 -55 -15 -22 27 21 9 -34 -37 -32 -53 -12
6996 -12 5 31 -37 -17 -32 -11 -32 -44 42 -19 -12 14 -40 20 62 33 -11 13 -15 26 12 46 -36 26 19 65 -14 31 41 8 -10
7027 -10 26 13 1 -24 9 29 -25 11 34 29 18 -27 4 10 40 13 62 16 28 78 2 -17 2 16 11 6 -11 -23 -24 -53 22 34 -39
7060 -39 27 42 -23 -3 11 -28 28 -2 72 34 5 3 15 3 56 10 18 87 -48 21 11 1 10 36 -35 -38 -9 12 -20 26 8 -60
7092 -60 19 -11 -13 12 -2 -12 -43 61 -14 -2 -26 -34 42 -15 34 -28 -4 -29 27 -28 -14 -49 25 -55 -29 30 -27 12 -3 21 -18
7123 -18 -24 19 50 -42 4 -22 -24 20 23 -40 -60 -6 87 -27 -7 37 14 -13 -13 -49 37 -52 5 9 62 45 72 -12 -49 -24 0 19
7155 19 48 66 1 38 -8 38 37 44 43 2 -60 27 -56 64 -80 34 -25 -12 -34 14 52 -44 -2 39 26 25 -51 23 69 31 2
7186 2 12 64 8 -14 -18 46 54 -14 -6 51 -54 61 -16 56 -12 28 25 -24 40 62 -33 2 -31 -21 23 9 -26 42 9 49 26 -5
$$ packed form
6962b8R0p0L6K2lk5K1l4l5L3K0l8K6o2N7rj4rk4O1O1n0j5o6M0pM9oj2m3lNk1M1
6996a2J7K6o8K0j5K1k1j2Q6o1PK6n4O0M2k9m4K4k8M1j4L4q2O2pM6p9M5J0l3j8
7027a0L6j3j2k5L3K0n4L6K3nj1m5L1OL0k7M9m6J2N0p6j9J9J4nnj7j2jk9P5J2p3
7060c9O6J5o5K0J4l9N6l0P4l8k9kJ2j2N3m6QO9j35O9j0j0RK6p1lK9K1l2M6j8o8
7092f0P9l0kK5j4j0l1J04p5J2k4qP6n7M9o2K4k5N6n5J4l5P4q0K6N9n7L9j5K4l9
7123a8oM3L1r2M6k6kM4Lo3k0N4R3j14K0M4k3k7%l6Q6q9N7MN3j7K7q4l7K5K4J9
7155A9K9J8o5L7m6M6jPjm1o2Q7q3J20j44J14n9J3k2M8L8r6M2M1j3jp6P4M6l8k9
7186BJ0N2n6k2mO4Qo8QN7j05J15p7P2o8M0lm9O4K2r5L5l3J0M4j4l5O8l3M0k3l1
$$ plain form
7218 -5 110 -3 -34 -34 30 6 -37 -7 -36 -5 47 -18 -18 2 -38 -19 25 29 -12 32 55 -10 -46 -5 30 17 8 26 0 15 -70 14
7250 14 5 -18 25 -27 -17 -72 0 23 59 -19 0 -20 59 24 -19 100 1 -51 31 43 -21 -72 -9 -37 2 41 -2 10 19 -7 -16
7281 -16 4 17 -58 -60 29 43 2 20 -9 -8 43 -36 -13 32 -19 -5 -15 -24 -81 -68 20 -39 6 -26 -9 -31 1 15 59 37 -46 14
7313 14 -67 -31 51 -32 21 -54 -27 52 27 32 21 -37 -35 23 53 36 31 -42 14 -26 19 2 -47 21 -28 36 23 79 35 38 -25 -9
7345 -9 7 73 -11 -20 26 24 -47 -19 23 -2 -18 -49 -27 -7 -54 20 10 -6 -35 -35 -19 -7 -94 -38 -31 -45 -6 -33 -12 -64 -42 -60 -10
7378 -10 -38 -35 -46 1 -50 34 32 68 47 23 18 -37 35 -8 -50 9 5 -5 34 4 -53 13 -43 -8 12 1 41 81 -39 20 17 -23
7410 -23 -4 -20 27 -27 -54 -3 95 -13 -4 -30 3 46 10 10 -14 -14 -42 67 -20 -118 -47 -44 -58 -51 -70 1 11 12 14 -46 -116 56
7442 56 -1 30 13 2 16 -13 12 -13 7 63 63 -1 -74 -19 -12 -9 -8 -29 -32 26 -10 12 -38 41 35 10 19 -23 38 -19 -17 50 -89 12
$$ packed form
7218eJ15j13l1%O4k4m3L0k9L1N2o5%K0m0J9M4Mm1M4K3o5l6M1L5j3rJ8k6J5q5Q4
7250A4rk3M3n2J0n5P2K3L6p8J9k0P9l5m3J19r9n2Q2J2o4n1O3k8L9L9m3J2Rk6r
7281a6K0J3p5kQ9J4m1J8k9JN1p9K3M5n1J4j0rn7J3Q8n9M5l2J7k2L2J4M4k2q3O0
7313A4q1L6Q2q3N3p5K7P9k5Nj1n8KN8L0j7np3N6m0M5j7m9O8m9O4j3N6m4Lo3J6
7345iJ6O6q4rM6kp1K8M2k5j6l1K2K0m7P4j0j6k9%J6J2q7N6Pj4L9k7K1n2K2j8N0
7378a0k8Lj1M7n1Q4kL6k1k4nn5P2m3m2N9mj0L9l0n7O6n6L5K0j1M0M0j20N9lm0
7410b3J9j6M7n4k7N1R8j08Rk6L3M3l6%k4%k8J09q7r8P1Lj4Pj9P1J0JKo0p0J72
7442E6n7L1j7j1J4k9K5k5K0N6%o4p3N5PLJk1lN8l6K2n0P9ok5Rm2O1n7KO7j39J01
$$ plain form
7476 12 -41 -16 -26 -11 1 -35 -16 -28 16 24 22 -4 11 -14 -25 14 16 30 34 -17 19 -12 -22 67 16 -43 -36 34 3 -72 9 43 9
7509 9 -48 3 38 -75 19 -40 -15 -98 18 11 33 -22 -7 13 -9 93 -21 11 34 47 -19 -1 -24 69 33 -16 -39 -27 -48
7538 -48 -24 28 -17 -7 6 23 -42 -2 54 65 45 31 -11 -8 -24 62 41 -45 12 29 11 88 -52 14 23 -16 -43 23 6 69 6
7569 6 3 -3 0 0 46 -12 13 20 40 -56 -30 53 5 57 -12 15 -2 -2 19 31 -35 69 -36 60 -13 41 -51 45 61 20 -47 36 22
7602 22 8 3 17 41 -32 -14 22 -32 21 23 65 18 -27 20 17 0 0 20 32 34 44 22 10 30 12 52 1 -7 67 -67 -23 9 -16
7635 -16 -1 15 65 24 21 -12 4 24 71 40 57 -3 -6 -17 6 -10 -49 -4 -37 -9 -3 -44 -6 59 19 3 -44 -25 44 66 -20 28
7667 28 -26 -32 -83 -24 -24 13 -11 65 -41 -25 -46 -7 38 -35 78 51 19 24 17 -12 35 -28 30 -4 -50 27 47 33 -8 -26 2
7698 2 19 12 40 25 -20 -25 -49 -62 33 5 38 -7 8 16 4 -7 -14 16 -4 31 19 -68 13 -14 -68 -25 -35 28 5 -46 51 39 -10
$$ packed form
7476A2n3K5j0J5J2l6J9j2M4Qkk6J5k5j1L9KJ4Mn1L6l1j0Q9n1n9PP0l1p5Q1L4l4
7509In7N1L5j13R4n9K5q3J16pK2n5J5K0k2J02j14L2K3J3o6J8k3R3l6m9k3J2k1
7538d8K4N2m5J0J3J7o5M0N6J1k0j4m2Lj6Q6k1q6N7J7j8P7j40O6Rl9k7O6j7O3o3
7569FloL%M6n8K5PK0r6K6Q3m8N2o9K7j7%K1J2o6J04j05R6p3N4r2R6J6m1o7Q3j4
7602B2j4nJ4K4p3J8L6n4N3KM2m7m5M7lj7%K0J2KJ0k2j2K0j8M0n1qP4j34M4L2k5
7635a6J5J6N0m1ll3J6K0M7l1J7o0lj1K3j6l9M5l3K8Om1L8O5m0j6m7J9O9K2q6M8
7667B8n4on1N9%L7k4P6j06J6k1L9M5p3J13k7l2Npk9M7o3N8l4m6P7K0j4m1j8K8
7698BJ7pK8j5m5nk4j3R5k8L3m5J5Qj2j1pL0k0L5j2q7Q1k7n4M3j0O3k3n1R7j2m9
$$ plain form
7731 -10 -17 72 -20 43 -37 -34 59 -45 -56 19 -51 -37 -9 -45 -52 42 6 37 -25 35 -35 -23 -9 25 12 59 -11 -23 -30 11 30 3
7763 3 47 -30 47 13 7 15 -24 -76 44 12 2 32 25 5 -15 -14 14 -29 26 45 -9 36 44 -38 -5 13 13 6 -8 -57 32 -46 -46 23
7797 23 49 18 -30 39 34 -63 36 -7 -39 56 30 -2 -4 -51 52 -4 -47 -4 29 26 9 42 27 8 1 -12 26 32 5 -43 20 22 -5
7830 -5 -7 52 26 64 -24 44 13 -50 -60 18 -8 -57 -25 62 10 23 77 -22 -52 -72 1 -20 -13 -36 -10 -5 40 -19 24 -3 -21 -4
7862 -4 -64 70 -13 25 -6 63 52 -9 -23 -11 -49 52 11 -6 65 -68 -40 53 52 -10 -45 43 53 37 22 -14 -5 49 15 12 2
7893 2 -62 56 -6 3 30 10 -31 -31 -4 -6 44 1 -36 3 -52 18 -7 27 -28 22 42 -12 -45 38 91 -25 -20 14 -11 -3 34 0
7925 0 -30 17 5 52 5 -25 -30 -41 14 -19 0 28 66 6 -28 -2 4 7 12 12 3 -54 0 10 -1 -16 -24 42 -25 3 -11 18 50 62
7959 62 3 -59 -31 -49 86 76 23 52 -8 -7 -20 15 -22 33 2 26 -40 20 -17 -14 33 22 -64 12 42 -26 1 8 -52 -64 -39
$$ packed form
7731a0pQ9r2O3q0LR3j04j1P5p0J4K8l6pR4l6L1o2O0p0J2J4L4j3M7p0j2pM1J9k7
7763CM4p7P7l4oQl9n2J20l2j0L0pk0k0JK8m3N5J9n4M5Qq2L3J8%pj4m9Q9p8%O9
7797B3K6l1m8O9nr7R9m3l2R5k6l2km7J03n6m3M3L3lj7L3j5j9pj3L8Ok7m8O3Kk7
7830ekN9k6L8q8O8l1o3j0P8k6m9L2Q7n2J3N4r9l0k0P3k1Pk3K6NM5n9M3k7j8J7
7862do0J34q3L8l1O9j1o1j4J2l8J01m1j7P1j33K8R3jo2l5Q8J0j6j5l6RN4l4lj0
7893Bo4J18o2RK7k0m1%K7kN0m3l7L9n5P0k5L4n5N0K0n4l3Q3N3j16NL4k5QL7l4
7925@l0M7j2M7m7l0nj1N5l3J9K8L8o0l4K6OLN%rn7N4J0j1j5qO6o7K8j4K9L2J2
7959F2n9o2K8j8J35j0n3K9o0Jj3L5l7N5l1K4o6O0l7LM7j1q6P6L0o8K7Po0j2K5
$$ plain form
7990 -39 -21 53 25 17 -4 11 -5 48 -9 37 47 -15 -42 -70 65 40 -2 27 -10 32 19 -4 28 55 -11 25 -35 -47 -29 26
8020 26 -17 -3 -28 46 19 23 -48 -4 -5 -25 -31 -65 -12 -51 -21 9 51 14 5 -19 56 52 -12 -22 -32 -16 28 2 9 -31 -15 15 -20
8053 -20 26 -24 -44 14 -21 44 7 -1 -62 -2 32 24 8 0 10 44 18 -44 -5 -19 25 -16 40 3 -40 -16 -25 36 -28 8 50 -24
8085 -24 58 -85 -3 26 24 -76 -52 -18 -7 -88 -4 -27 64 -20 -22 2 -44 2 9 -77 -41 -5 23 29 26 -35 -38 -52 -15 0 48 70
8117 70 33 -57 -100 -57 90 85 14 21 13 -23 -34 91 -17 47 -1 -26 40 -29 30 32 -27 -16 41 41 -17 -43 2 21 -40 39 23
8148 23 -48 -40 28 13 -33 8 51 4 -17 18 -14 -25 5 13 4 -47 -42 -43 1 -20 16 27 13 2 -53 88 -9 -36 -2 35 10 -2
8180 -2 25 -52 2 34 -10 -51 61 -65 -17 36 62
$$ packed form
7990c9J8P4k8qk1J5j6N3n7M6J0o2k7k8J35k5m2K9l7M2j3k3L2K7o6L6o0j2J8N5
8020B6m3J4k5P4k7Mp1M4jk0ol4N3l9L0L0M2l7rk4P5mo4j0j0J6M4k6Pm0J6L0l5
8053b0M6n0k0N8l5O5l7qo1O0L4qj6qJ0L4k6o2L9j4M4m1N6l7m3K4rO1o4L6M2p4
8085b4Q2j43Q2K9kj00K4L4J1q1Q4k3R1q4kK4m6M6Pq6L6L6K8Olo1lj4L7J5M8K2
8117G0l7r0m3M3J47np1Pql6j1J25j08O4m8k5O6o9N9Kn9J1N7%n8k6M5J9o1P9j6
8148B3p1QO8j5m6M1M3m7k1L5l2j1L0Qrn1NjM4k1L6J1j4j1n5J41r7k7L4L7k5j2
8180bK7p7N4L2m4m1J12j26M8N3K6
8191F2
$$ Imaginary data points
##PAGE= N=2
##DATA TABLE= (X++(I..I)), XYDATA
$$ plain form
0 0 0 0 0 0 0 0 0 0 0 0 0 0 0 0 0 0 0 0 0 2 -4 4 -4 10 -12 12 -15 19 -22 25 -30 35 -42 48 -55 63 -72 80 -92 101 -113
41 -113 126 -138 153 -168 185 -199 213 -228 241 -248 247 -230 187 -97 -88 471 -1321 3491 -10822 72702
61 72702 393080 -155240 -119359 259432 -240333 -147672 331438 -40268 -149237 152055 -93051
72 -93051 -105124 165339 -5326 -67843 51887 -51587 4082 69271 -68102 -9219 52334
83 52334 -41362 28229 39600 -76431 -21345 48875 20676 -416 -20575 3724 -21756 -40656
95 -40656 97300 28730 -134650 59158 67282 -135056 80440 96468 -192866 41248 162257
106 162257 -144784 -1177 110380 -152360 17118 159620 -95312 -21124 46570 -117744
116 -117744 58959 113074 -88835 25050 -307 -142331 117759 105892 -139831 51859
$$ packed form
0@%%%%%%%%%%%%%%%%%%%KoQqJ4k2K4k7L4m1M7n5O5p7R0j03J18j35J52j72J93k14
41a13K39k64K91l21L53l84M12m41M69m89M95m77M17k84RN59j792M812j4313Q3524
61G2702L20378n48320L5881L78791m99765R2661M79110l71706j08969L01292k45106
72i3051j2073K70463j70665o2517J19730j03474N5669O5189j37373N8883O1553
83E2334r3696O9591J1371j16031N5086P0220k8199k1092k0159K4299k5480j8900
95d0656J37956o8570j63380J93808Q124k02338K15496J6028k89334K34114J21009
106A62257l07041J43607J11557k62740J69478J42502k54932P4188O7694j64314
116a17744J76703N4115k01909J13885k5357j42024K60090j1867k45723J91690
$$ plain form
126 51859 39552 -169905 92314 132531 -143860 14696 85509 -127183 16876 118469 -77239
137 -77239 -32688 66667 -31338 -22181 34484 -7071 -16604 10520 21654 -11046 -36657 22658
149 22658 20478 -28281 27858 6260 -56929 30140 25976 -37204 38623 -6505 -65854 62721
161 62721 19108 -64414 58400 -7589 -85877 92881 29622 -105255 60729 24583 -101571
172 -101571 77562 57178 -108384 28442 46479 -78733 41386 58699 -74033 -1194 35705
183 35705 -34664 19616 24619 -34640 5201 6835 -15565 21051 -968 -16207 18903 -10026
195 -10026 -14484 23188 -5956 -9799 17536 -8663 -8594 6971 -6329 11260 7128 -18277 5723
208 5723 -1560 -12839 30238 1321 -33729 17810 3177 -22265 32428 5441 -36133 14945
$$ packed form
126E1859j2307k09457K62219M0217k76391J58556P0813k12692J44059J01593j95708
137g7239M4551R9355r8005R157N6665m1555r533K7124J1134l2700k5611N9315
149B2658k180m8759N6139k1598o3189Q7069m164o3180P5827m5128n9349J28575
161F2721m3613q3522J22814o5989p8288J78758o3259j34877J65984l6146j26154
172a01571J79133k0384j65562J36826J8037j25212J20119J7313j32732P2839L6899
183C5705p0369N4280N003n9259L9841J634k2400L6616k2019j5239L5110k8929
195a0026m458L7672k9144l843K7335k6199O9J5565j3300J7589m132k5405K4000
208E723p283j1279M3077k8917l5050N1539j4633k5442N4693k6987m1574N1078
$$ plain form
220 14945 4061 -16862 29568 -531 -29827 15816 -1527 -9634 29151 -12849 -23174 27293
232 27293 -9289 -15735 33726 -12515 -25745 30977 -5028 -22691 28135 -3515 -25114 23418
244 23418 4808 -21697 10591 4967 -10333 9273 2266 -10843 460 4701 3565 -133 -5111
257 -5111 104 -1613 -400 10709 -1732 -10723 2901 -862 1079 13205 -7049 -12842 7107 -649
271 -649 1582 13659 -11900 -12363 12878 -2484 -2152 16070 -11058 -15064 14339 969 -4778 12465
285 12465 -8093 -13601 12537 3895 -5779 5504 -4177 -6471 7544 1045 -2591 2920 -4224 -1516
299 -1516 5653 -1913 -920 2000 -4580 1550 5833 -4383 -2811 2700 -819 1714 2334 -4122 -2197
314 -2197 1992 1771 1962 -1132 -2936 -712 -266 3259 4044 -3963 -4245 1206 436 3467 3631 -5808 -3891
$$ packed form
220A4945j0884k0923M6430l0099k9296M5643j7343q107L8785m2000j0325N0467
232B7293l6582o446M9461m6241j3230N6722l6005j7663N0826l1650k1599M8532
244B3418j8610k6505L2288n624j5300J9606p007j3109J1303M241j136l698m978
257e111N215j717J213J1109j2441q991J3624l763J941J2126k0254n793J9949p756
271f49K231J2077k5559m63K5241j5362L32J8222k7128m006K9403j3370n747J7243
285A2465k0558n508K6138q642r674J1283r681k294J4015o499l636N511p144K708
299a516P169p566R93K920o580O130M283j0216J572N511l519K533O20o456J925
314b197M189k21J91l094j804K224M46L525P85q007k82N451p70L031J64r439J917
$$ plain form
331 -3891 3156 443 2356 2913 -5478 -2931 3268 158 2387 2545 -6088 -2588 4359 622 986 1121
347 1121 -5152 -1214 4739 97 -633 764 -3134 -894 3473 673 -712 -444 -2144 228 2783 425
363 425 -1281 -1241 -598 1587 1396 -907 -1070 -429 352 1381 273 -1019 -875 -286 1101 1461 -398 -1479
381 -1479 -1134 261 2370 1079 -1980 -1451 -95 763 2261 360 -2513 -903 590 604 1976 262
397 262 -2716 -969 1194 1003 1499 -485 -2932 -273 2062 863 155 -791 -1901 128 1917 593
413 593 -419 -747 -1143 240 1672 711 -1084 -1199 -138 865 1095 78 -1324 -958 823 952 19
430 19 -319 -767 -542 984 897 -294 -562 -608 -169 1271 847 -994 -961 -58 575 1030 78 -1190 -676 341
450 341 781 607 -329 -823 -401 331 955 534 -727 -888 28 546 779 158 -1114 -615 627 548 250 -128
$$ packed form
331c891P047k713J913N57q391K547O199l110K229J58q633L500O947l737L64J35
347A121o273L938N953m642p30J397l898K240M367k800j385K68j700K372K555k358
363D25j706M0O43K185j91k303j63O41P81J029j108j292J44N89J387L60j859j081
381a479L45J395K109j291l059N29J356Q58J498j901k873J610J493J4J372j714
397B62k978J747K163j91M96j984k447K659K335j199p08r46j110K029J789j324
413E93j012l28l96J383J432r61j795j15J061J003K30j017j402L66J781J29r33
430A9l38m48K25J526q7j191k68m6M39J440m24j841L3R03O33M55r52j268N14J017
450C41M40j74r36m94M22P32O24m21j261j61R16N18K33o21j272M99J242p9k98l78
$$ plain form
470 -128 -762 -300 680 343 46 -168 -601 -111 699 344 -180 -482 -394 435 519 -75 -297 -400 -13 555 98
491 98 -321 -73 -287 -38 579 -49 -387 -133 -83 96 590 -229 -660 125 181 101 298 -296 -436 266 224 -17
513 -17 161 -341 -292 281 246 61 -18 -324 -64 328 93 35 -229 -285 234 278 -97 -4 -61 -263 310 189 -260
536 -260 68 5 -224 261 141 -384 30 -7 -65 257 -36 -387 210 203 -121 153 -99 -286 250 193 -146 94
558 94 -107 -301 230 195 -127 6 -158 -93 231 33 -119 39 -66 74 191 -149 -168 63 7 74 248 -134
580 -134 -128 65 14 161 163 -298 -216 32 38 178 21 -286 5 70 -106 134 -3 -241 135 167 -198 82 20 -175
604 -175 154 211 -193 -63 -22 -140 258 108 -176 -119 -77 -40 297 52 -117 79 -151 -102 269 12 -236 129
626 129 -9 -81 154 -85 -148 101 109 -33 35 -156 -100 126 -10 169 -8 -266 4 224 59 128 -2 -240 -85
$$ packed form
470a28o34M62R80l37k97k14m33M90Q10l55n24l02Q8Q29Q4n94k22j03L87N68m57
491I8m19K48k14K49O17o28l38K54N0J79M94q19m31P85N6q0J97n94j40P02m2k41
513a7J78n02M9N73l5j85p9l06K60L92k35n8k64n6N19M4l75R3n7k02N73j21m49
536b60L28o3k29M85j20n25M14l7n8L22k93l51N97pl24K74k52j87N36n7l39K40
558I4k01j94N31l5l22J33j64O5L24j98j52J58j05J40J17l40j9K31n6O7J74l82
580a34OJ93n1J47Km61Q2K48OJ40j57l07K91O5j76K40j37k38L76L2l65K80o2j95
604a75L29N7m04J30M1j18L98j50k84N7M2L7L37k45j69J96k30M9L71k57k48L65
626A29j38p2K35k39o3K49Qj42O8j91N6K26j36J79j77k58K70K20j65O9j30k38J55
$$ plain form
649 -85 230 45 -61 -16 -111 -29 73 -128 75 -33 -107 88 41 -150 146 -36 -123 232 62 -285 146 74 -202
672 -202 194 122 -301 -19 144 -52 110 29 -147 -31 14 30 177 -51 -79 121 -52 -20 118 -149 -66 104 -67
695 -67 -10 -11 -112 -15 123 -57 -2 -35 -106 52 49 -56 107 -115 -196 177 81 -82 50 30 -180 102 102 -106 62
720 62 27 -83 5 -19 -86 32 -22 -7 142 -125 -54 132 -67 42 198 -119 -42 168 -93 -1 140 -141 -26 136
744 136 43 -3 147 -82 -40 27 -72 59 57 -87 81 34 -105 59 62 -89 37 101 -58 11 -4 -54 63 -3 -10 13
770 13 -21 -26 80 -29 -32 66 -108 -101 128 -107 -64 130 -109 -79 146 -51 -59 131 -26 -73 106 -59 -21 16 37 30 -61
797 -61 35 40 -31 -56 127 -38 -89 71 -11 -80 67 -5 -179 121 52 -50 10 1 -40 12 -56 -20 74 -29 8 58 -60
824 -60 -28 148 -111 -45 133 -35 -26 14 -38 -31 59 28 -21 44 -52 -4 24 91 94 -10 -91 68 36 -36 117 10 -59 122
$$ packed form
649h5L15j85j06M5r5Q2J02k01K03j08p4J95m7j91K96j82q7L55j70l47M31p2k76
672b02L96p2m23K82J63j96J62q1j76J16M5J6J47k28k8K00j73L2J38k67Q3J70j71
695f7N7jj01R7J38j80N5l3p1J58lj05J63k22q1L73r6j63J32k0k10K82%k08J68
720F2l5j10Q8k4o7J18n4J5J49k67P1J86j99J09J56l17P7K10k61R2J41k81J15J62
744A36r3m6J50k29M2O7r9J31kj44J68m7j39J64Lj51J26O4j59O9j5n0J17o6pK3
770A3l4nJ06j09lR8j74PK29k35M3J94k39L0K25j97qJ90j57m7J79j65L8L7K1pr1
797f1R6Np1k5J83j65n1J60q2o9J47p2j74L00o9j02O0rm1N2o8L6R4j03L7N0j18
824f0L2J76k59O6J78j68RM0n2PR0l1m9O5r6M8K8O7Lj04q1J59l2p2J53j07o9J81
$$ plain form
852 122 0 -76 137 20 -170 68 44 -59 11 5 -9 108 5 -7 45 -76 2 31 -87 -16 6 -67 -40 6 -53 -59
878 -59 3 -118 -11 73 -60 29 19 -43 52 -23 -31 56 13 -123 61 -32 -81 139 31 -99 69 -7 -114 129 18
903 18 -73 -32 -21 -35 45 23 -43 35 -82 -27 46 -109 45 81 -12 14 81 -73 -50 76 22 -13 -51 3 21 69 -33 55
931 55 12 -53 20 35 7 72 -8 14 -35 10 -42 94 59 -14 -5 -47 -63 12 -6 -11 12 -78 3 50 29 99 9 -65 -18 60 -71
962 -71 87 -10 -71 -5 80 -9 34 86 -45 4 -18 -7 -68 17 -21 21 -16 3 -34 -17 19 -45 -12 -36 -49 6 18 17 -3 -45
992 -45 22 -24 9 7 -32 68 35 14 53 58 -25 16 35 -84 11 -23 -68 36 86 -63 -20 8 -30 50 13 -59 -22 -42 -5 67
1022 67 38 33 -15 18 -21 8 3 1 30 -9 -30 -12 9 -9 -11 8 19 15 -19 20 11 40 41 14 -23 23 65 -26 5 -15 23 15 1 -1 -17
1057 -17 -74 -24 37 24 -6 33 -11 -48 57 7 11 8 -18 -11 5 -25 -8 8 -13 -19 -2 -5 9 39 29 -7 34 42 -72 -43 30 -24
$$ packed form
852A22j22p6K13j17j90K38k4j03P0oj4J17j03j2N2j21P8K9j18P1K2p3K7M6n9o
878e9O2j21J07Q4j33Q9j0o2R5p5qQ7m3j36J84r3m9K20j08j30J68p6j07K43j11
903A8r1M1J1j4Q0k2o6P8j17N5P3j55J54L6r3K6O7j54K3J26n4l5l8N4J8M8j02Q8
931E5m3o5P3J5k8O5q0K2m9M5n2J36l5p3Rm2j6P5j8nK3r0Q1M7k1P0r0p4M7P8j31
962g1J58r7o1O6Q5q9M3N2j31M9k2J1o1Q5l8M2l7J9l7J7L6o4L3k4j3N5J2jk0m2
992d5O7m6L3kl9J00l3k1L9Nq3M1J9j19R5l4m5J04N0j49M3K8l8Q0l7p2L7k0L7P2
1022F7k9nm8L3l9K9nkK9l9k1J8K1j8kJ9J1ml4L9rK9Jk7l7M6M2r1L1k0L8qj4kj6
1057a7n7N0O1j3l0L9m4l7J05n0Mlk6PJ6l0J7J6k1oJ7lJ4L0j0l6M1Qj14K9P3n4
$$ plain form
1089 -24 41 0 15 -59 -4 -25 -73 29 34 -38 -61 0 -70 28 -12 7 -17 26 38 4 72 -54 -29 44 -11 49 79 32 -14 36
1119 36 -31 60 84 27 -3 -78 18 -28 42 -13 10 11 -13 -2 1 -62 95 17 -7 30 54 80 43 22 41 17 18 -19 -31 -14 -36
1150 -36 4 -48 27 19 -15 23 51 13 21 -39 -6 -55 4 34 21 23 -27 15 -40 26 82 2 28 91 69 6 -49 -30 21 43 -6 -25
1182 -25 22 28 37 31 90 6 -13 2 -21 -13 49 47 -4 14 38 -49 -23 -1 -1 50 39 -25 83 -4 -1 -17 51 23 18 27 -53 62 43 -68
1216 -68 23 55 27 -6 4 -15 10 -14 -41 -94 -27 -4 -70 75 -17 -2 -25 -67 -8 131 72 4 -8 -17 4 -29 53 -33 -1 -29
1246 -29 23 13 23 -2 11 32 15 18 -16 20 -3 -19 45 7 -40 -29 -23 59 -49 -76 -76 -14 -91 26 36 -63 -17 -17 -15 82 42 -77
1278 -77 -1 1 -54 -31 45 -91 56 -60 -54 17 1 36 -35 83 -116 57 -54 -8 10 7 -12 12 0 -5 -52 -13 10 -7 -99
1307 -99 24 61 -58 4 -46 -88 98 3 -61 25 -51 -25 -6 -97 -40 110 -19 -94 76 37 -30 16 26 11 80 6 -40
$$ packed form
1089b4O5m1J5p4N5k1m8J02Np2k3O1p0R8m0J9k4M3J2l4O8j26K5P3n5O0L0m7m6N0
1119C6o7R1K4n7l0p5R6m6P0n5K3Jk4J1Lo3J57p8k4L7K4K6l7k1J9k4Jl7j2J7k2
1150c6M0n2P5ql4L8K8l8Qo0L3m9N9L0j3Kn0M2n5O6N6q0K6O3k2o3n5J9N1K2m9j9
1182b5M7ORoN9q4j9J5k3QO2kn1J8K4q7K6K2%N1j1o4J08q7Lj6O8k8nRq0J15j9j11
1216f8R1L2k8l3J0j9K5k4k7n3O7K3o6J45r2J5k3m2N9J39n9o8j2rK1l3Q2q6L2k8
1246b9N2j0J0k5J3K1j7Ll4L6k3j6O4l8m7J1OQ2j08k7%O2p7J17J0r9M6%KR7m0j19
1278g7P6Kn5K3P6j36J47j16OP1j6L5p1J18j99J73j11M6J8lj9K4j2nm7L9K3j7r2
1307i9J23L7j19O2n0m2J86r5o4Q6p6K6J9r1N7J50j29p5J70l9o7M6J0j5O9p4m6
$$ plain form
1334 -40 85 -21 -86 68 -65 -69 111 19 -1 112 -50 41 48 -54 -14 35 27 18 37 -24 -14 -19 30 -23 61 -36 0 31 -8
1363 -8 -15 17 -1 20 -40 -15 6 4 20 -7 -67 -38 38 -53 -3 37 -38 43 13 0 -18 19 -47 49 91 -105 6 58 -33 -3 81
1394 81 -84 54 136 -88 41 21 -101 -33 63 6 72 33 -53 4 -24 28 -20 7 4 -6 -1 -44 31 36 23 72 -57 29 19
1423 19 -41 57 11 -74 65 21 -55 76 0 -20 36 12 -19 26 43 -54 -28 46 -101 -40 33 -15 -25 39 20 25 -2 -16 80
1452 80 63 -152 22 -6 -47 27 33 -23 -21 36 -47 62 36 -57 68 14 -38 23 12 27 -27 18 -53 74 10 13 -82 -3 3 -3
1482 -3 19 -30 25 13 105 21 -10 -3 -29 -43 4 -22 -46 65 10 -8 64 8 -35 -30 -41 -58 54 -24 -88 48 -20 -70 35 -38
1512 -38 40 -16 -7 -98 41 -65 40 31 -38 9 57 -18 -10 47 -19 -28 -32 35 0 101 -25 61 -52 28 -37 -41 -25 31 -25 -50
1542 -50 21 -33 -15 21 62 28 35 -61 41 60 60 55 -2 57 -66 -30 6 -27 35 -4 10 -6 -7 -40 44 -44 1 16 -108 -43 144
$$ packed form
1334d0J25j06o5J54j33mJ80r2k0J13j62R1Pj02M0M9qrJ9o1J0nM9n3Q4r7L6L1l9
1363hpL2j8K1o0K5K1kJ6k7o0K9P6r1N0M0p5Q1l0j3j8L7o6R6M2j96J11N2r1L0Q4
1394H1j65J38Q2k24J29k0j22O8R6n7O6l9q6N7k8N2m8K7lj0Nm3P5Nj3M9j29Q6j0
1423A9o0R8m6q5J39m4p6J31p6k0N6k4l1M5J7r7K6P4j47O1P3m8j0O4j9Nk7j4R6
1452H0j7k15J74k8m1P4On6KN7q3J09k6r3J25n4n2O1j1J5n4M5p1J27o4Lr5P9Oo
1482cK2m9N5j2R2q4l1Pk6j4M7k6k4J11n5j8P2n6m3Nj1j7J12p8o4J36o8n0J05p3
1512c8P8n6Rr1J39j06J05ro9M7M8p5QN7o6rmO7l5J01j26Q6j13Q0o5mJ6N6n6k5
1542e0P1n4J8L6M1l4Pr6J02J9%nn7N9j23L6L6l3O2l9J4j6jl3Q4q8M5J5j24O5J87
$$ plain form
1573 144 -2 12 31 -44 45 -17 6 19 -11 -49 -27 -7 38 -6 53 -34 51 -24 7 -2 1 -36 20 12 16 10 1 -15 2 -1 26 -51 -68
1606 -68 -21 31 -31 -11 -32 33 16 26 7 18 23 -12 23 38 19 -14 40 -27 -13 0 72 -3 -15 89 18 -17 31 -6 55 22
1636 22 37 36 -2 -6 -23 7 -3 4 3 22 51 -15 15 -55 7 44 19 72 -1 37 37 -28 8 -26 3 -43 25 -48 1 32 -25 64 19
1669 19 3 1 8 68 24 19 -50 -23 64 14 -38 32 -53 6 10 24 -8 -24 -12 31 -1 -22 35 24 35 26 -28 -23 84 -62 -50 17
1701 17 -13 4 27 -28 -66 10 26 -32 -29 -8 -37 9 -7 -14 -61 -34 -73 44 -13 59 -8 -53 -42 84 -46 -56 -14 -33 15 29
1731 29 15 -26 53 -49 18 47 27 16 21 -14 1 -34 -40 27 -14 -59 -20 11 -12 46 -24 19 -13 -12 31 11 9 44 -3 9 -13 -10
1763 -10 6 -16 -3 4 4 -36 9 30 -50 -12 20 12 58 40 7 -28 14 -22 -6 36 2 -41 -30 -37 -13 -40 -38 9 49 89 -43 26
1795 26 35 -62 -35 52 -40 -23 -24 24 -17 -36 11 -19 -24 -3 6 17 30 22 -33 9 -30 37 -32 -25 3 -35 -35 -53 -11 -48 51 46 31 3
$$ packed form
1573A44j46J4J9p5Q9o2K3J3l0l8K2K0M5m4N9q7Q5p5L1rLl7N6qMorj6J7lK7p7j7
1606f8M7N2o2K0k1O5j7J0j9J1Nl5L5J5j9l3N4o7J4J3P2p5j2J04p1l5M8l7O1l3
1636B2J5jl8mj7L0j0PjJ9K9o6L0p0O2L7k5N3p3L8%o5L6l4K9m6O8p3M9L1n7Q9m5
1669A9j6kPO0m4no9K7Q7n0n2P0q5N9MJ4l2j6J2M3l2k1N7j1J1rn4NJ07j46J2O7
1701A7l0J7K3n5l8P6J6n8LK1k9M6j6pm7K7l9J17n7P2o7m5J1J26j30j0M2j9M8J4
1731B9j4m1P9j02O7K9k0j1Nl5J5l5oO7m1m5L9L1k3N8p0M3l2JM3k0kL5m7J2k2L
1763a0J6k2J3P%m0M5K1q0L8L2qM6j8l3l5M2l6J6M2l4m3J1pK4k7KM7M0M0j32O9
1795B6Rr7K7Q7r2J7jM8m1j9M7l0nK1RJ1J3qn5M2l9O7o9PK8l8%j8M2l7R9nj5k8
$$ plain form
1829 3 -37 18 15 -31 3 -25 40 54 19 -16 -12 66 -43 37 13 -30 -23 39 -38 55 12 19 -22 20 50 4 -14 42 10 0 29 3
1861 3 21 23 -5 -35 23 -27 49 24 -34 9 -15 -36 -12 37 -24 20 3 -24 14 -5 11 -67 1 -21 -56 -38 1 39 -41 -4 17
1892 17 -74 -39 46 16 14 31 39 -21 32 -28 -3 13 -33 -36 3 46 -18 40 -4 -39 -4 -20 5 1 73 32 11 60 16 -21 -13 41 -18
1925 -18 -16 6 23 -8 79 56 26 -23 -13 23 54 20 -27 44 -7 -4 -34 -9 -15 51 3 40 16 15 -17 -6 -30 15 30 -18 -21 16 6
1958 6 -41 33 -43 -27 -16 8 4 14 -31 11 2 -62 -2 5 -23 64 39 -21 18 -3 2 42 -24 -42 30 20 -29 36 38 -53 -38 -1 -12
1991 -12 50 41 -20 51 -16 -20 9 -12 -6 -24 -16 -14 22 8 -28 -57 -72 35 -21 -94 -14 -21 -40 -36 10 -63 34 -44 -18 -9 -15 15 -13 40
2025 40 -12 50 16 26 -5 -23 11 -27 46 -26 15 4 44 -1 16 16 17 30 -23 -15 32 55 -17 -48 -16 46 27 -29 65 25 -33 -13
2057 -13 4 -12 -6 46 -31 3 -1 34 8 -7 14 73 -31 -23 10 -43 23 2 26 -43 -2 19 31 7 38 41 -27 43 -14 10 28 0
$$ packed form
1829Cm0N5lm6L4k8O5J4l5l5MP8j09Q0k4m3PO2p7R3m3Pm1M2L0m6j8N6l2j0K9k6
1861CJ8Kk8l0N8n0P6k5n8M3k4k1K4M9o1M4j7k7L8j9J6p8O8k2l5J8L9L8q0L7K1
1892A7r1L5Q5l0kJ7Qo0N3o0K5J6m6lL9M3o4N8m4l5L5j6K5mP2m1k1M9m4l7QN4n9
1925a8KK2J7l1Q7k3l0m9J0L6L1l4m7P1n1Ll0K5oO6m8L7k4jl2J1k4M5J5m8lL7j0
1958Fm7P4p6J6J1K4mJ0m5M2ro4O0Pk8Q7k5o0L9k1NM0o6j8P2j0m9O5Kr1J5L7j1
1991a2O2ro1P1o7mK9k1Oj8QKL6j4l6k9j5J07n6p3Q0pj9MM6p3R7p8K6RoL0k8N3
2025D0n2O2l4J0l1j8L4l8P3p2M1j1M0m5J7%JJ3n3QM7K3p2l1L2O2j9n6R4m0n8K0
2057a3J7j6ON2p7L4mL5k6j5K1N9j04QL3n3O6k1K4o9M1K1J2k4L1Lo8P0n7K4J8k8
$$ plain form
2089 0 -70 54 56 -35 -28 13 -25 23 31 -39 -11 -11 30 60 -2 33 -17 9 -43 -18 -94 -2 29 -15 27 -26 23 6 -65 -57 54 -3
2121 -3 -43 65 65 25 -2 -48 9 6 -19 7 -43 -63 19 4 17 19 12 -31 -3 1 37 28 17 31 60 -63 18 14 -21 16 65 -21 -12 98
2155 98 -19 47 -25 -28 -34 36 21 42 13 -46 30 16 33 -65 36 5 33 -16 15 -24 -7 19 55 -54 -10 9 -24 49 -1 -39
2185 -39 -46 6 -20 -37 -23 16 -9 -32 -21 -7 8 -22 2 7 40 4 -14 -28 25 -21 -9 -24 -21 97 -24 -51 -36 9 -23 -67 55
2216 55 57 -28 -9 12 -21 33 40 -34 5 -1 12 75 16 -4 -22 -45 9 -38 -12 -3 14 -5 12 -4 24 -43 -47 43 -64 91 -14
2247 -14 16 1 28 27 13 51 -11 54 -27 -10 -22 81 18 -29 -34 -24 1 -94 17 58 34 13 43 7 -32 -5 -54 30 -30 -17
2277 -17 4 -3 -36 65 -20 -50 21 36 35 -11 11 4 12 52 16 65 52 -9 53 64 -23 78 9 -13 -15 7 -10 -3 53 -84 23
2308 23 -30 -35 -17 7 7 41 12 -51 -38 -8 56 60 -49 -65 28 14 21 33 26 31 6 -37 18 32 -14 -46 7 43 8 -53 -36 48 -34
$$ packed form
2089@p0J24Kr1PM1l8M8Qp0K8%M1L0o2L5n0K6n2K5p6R2L1m4M2n3M9j7p1QJ11n7
2121cm0J08%m0k7m6N7lk5K6n0k0Q2j5J3Kpm3K8ML6rj1J4K9j23Q1ml5L7M9q6RJ10
2155I8j17O6p2loP0j5K1k9n9P6j4J7r8J01l1K8m9L1l9J7K6L6j09M4J9l3P3n0l8
2185c9pN2k6j7J4L9k5k3J1J4J5l0K4NL3l6j8j4N3m6J2j5LJ18j21k7J5M5l2m4J22
2216E5Kq5J9K1l3N4Pp4L9oJ3O3n9k0j8k3N4m7K6RJ7j9J7j6K8o7mR0j07J55j05
2247a4L0j5K7jj4L8o2O5q1J7j2J03o3m7nJ0K5r5J11M1k4k1L0l6l9K7m9Q4o0J3
2277a7K1pl3J01q5l0P1J5jm6K2pQM0l6M9j3o1O2J1q7J01o9k2kK2j7PN6j37J07
2308B3n3nJ8K4%L4k9o3J3L0O4Mj09j6R3j4PJ2pNk5m3N5J4m6l2N3L6l5o1J7Q4q2
$$ plain form
2341 -34 -21 30 -58 -46 -43 -3 10 45 27 -50 50 -88 -25 26 51 30 10 98 -32 -11 -27 -42 51 -5 -49 31 -58 26 -22
2370 -22 -35 -14 -12 -37 9 3 12 -45 41 55 -1 1 -6 73 -12 27 -29 9 70 -28 -18 -82 -34 34 -2 59 -2 15 -30 -111 21 34
2402 34 -27 12 45 -25 -24 27 -28 44 15 75 55 -53 14 -7 30 -15 64 21 -13 14 -8 57 1 -1 -17 -36 21 17 4 26 -25
2433 -25 -36 50 6 -4 60 -1 -9 -64 2 26 -3 -1 -84 -29 -53 -27 33 23 -2 54 34 53 -23 17 28 -2 47 49 -5 31 11 35
2465 35 16 -22 75 66 41 -4 -15 0 32 6 -27 10 -11 -28 8 4 47 21 21 -10 -7 -38 58 -33 -24 -83 82 -27 5 -39 -22 -47
2497 -47 10 16 65 18 44 3 -48 -19 -13 14 -48 -36 -14 -2 -21 9 59 0 40 -24 -16 -24 -21 -26 -90 8 -27 -45 -22 67 -22 18 12 14
2531 14 -28 18 12 60 33 -27 0 -19 50 -100 -39 62 -30 -44 -15 32 -42 -36 -22 4 -29 -69 -33 26 64 15 38 -53 2 18
2561 18 63 -36 -32 53 -23 -23 2 15 -12 15 10 25 -6 -8 -4 -49 -5 -39 26 39 -4 -44 26 28 -33 11 -17 -42 -36 21 9 6 31 -39
$$ packed form
2341c4J3N1q8J2LM0J3L5j8p7J00j38O3N1K5k1k0Q8j30K1j6j5R3n6m4Q0q9Q4m8
2370b2j3K1Kk5M6oRn7Q6J4n6KpP9q5L9n6L8O1r8J0o4M8O8l6O1o1J7m5q1J32J3
2402C4o1L9L3p0JN1n5P2k9O0k0j08O7k1L7m5P9m3l4K7k2O5n6kj6j9N7mj3K2n1
2433b5j1Q6m4j0O4o1qn5O6K4k9Kq3N5k4K6O0j0k5N6k0J9p6M0J1l0M9Kn4L6k0K4
2465C5j9l8R7rk5m5j1J5L2k6l3L7k1j7L6mM3k6%l1Ll1R6r1Rn9J65j09L2m4J7k5
2497d7N7OM9m7K6m1n1K9OK7o2J2K2J2j9L0N0n9M0o4QqLno4R8l5j8K3Q9q9M0oK
2531A4m2M6oM8k7o0K7j9O9j50O1J01r2j4K9M7p4OJ4K6l3m0L6N9L8m9K3r1N5J6
2561A8M5r9MQ5p6%K5J3k7K7nJ5l1kMm5M4l4O5J3m3m0P0Ko1M4k8k5ON7j2lK5p0
$$ plain form
2595 -39 6 37 -2 49 -37 -59 -41 -73 53 -29 -60 -11 -62 1 -4 -15 -6 52 -15 37 5 -70 38 -36 86 0 6 -83 -3 -44
2625 -44 -30 -14 -9 86 -14 49 9 -13 0 93 18 -19 66 -62 -61 22 -19 -63 36 -13 -29 53 45 -32 -43 64 -17 -27 -42 -44 -4
2656 -4 -23 -35 46 -14 15 -56 -44 6 40 -16 -40 5 -7 33 -60 29 27 2 104 -30 -31 -35 -81 36 74 26 29 10 1 -26 -21 19
2688 19 64 -26 -22 21 -37 -40 -18 18 -36 12 24 -6 -49 -6 -23 -12 -29 26 42 10 -57 49 -50 -43 -21 -57 2 42 -24 33 23
2719 23 -28 19 -51 54 -25 18 -47 -30 23 -5 -46 13 -5 -4 -7 -41 39 2 62 -45 41 49 -15 9 -22 8 52 -3 25 2 53
2750 53 -58 -64 64 -14 -39 -4 31 -13 11 5 33 -81 17 -13 -10 -13 -55 11 -5 -46 -15 -10 4 -59 -14 -27 32 -38 -7 35 -43
2781 -43 4 11 49 60 -22 14 -18 4 -7 7 11 18 27 18 -20 -19 28 18 -49 -49 -50 25 -12 81 37 -49 17 -1 46 -31 75 -2 39 -29
2815 -29 -49 -52 -42 -14 7 61 -26 19 30 -47 64 61 -3 -14 -41 7 -9 21 -37 -2 0 48 3 33 -2 -30 11 6 8 -4 30 -16
$$ packed form
2595c9M5L1l9N1q6k2J8l2J26q2l1M9n1O3nj1RN8o7N2l2p5J08p4J22q6Oq9Q0m1
2625d4J4J6NR5j00O3m0k2J3R3p5l7Q5j28JQ3m1m4R9m9j6Q2qp7j1J07q1j0j5kM0
2656dj9j2Q1o0K9p1J2N0L4n6k4M5j2M0r3Q9kk5J02j34jmm6J17L8m8Lj9rk7NM0
2688A9M5r0MM3n8lK2L6n4M8J2l0m3M3j7J1j7N5J6l2o7J06r9PK2l6N9M0o6N7j0
2719B3n1M7p0J05p9M3o5J7N3k8m1N9j8Jll4Q0l7O0j07Q6Qo4K4l1L0M4n5K8k3N1
2750E3j11oJ28p8k5L5L5m4K4oK8j14R8l0Llm2O6j6m1L1NJ4o3M5j3N9p0L1M2p8
2781d3M7PL8J1q2L6l2K2j1J4MPRrl8JM7j0o7%jP5l7R3m4q6O6j8M7p7J06p7M1o8
2815b9k0lJ0K8K1N4q7M5J1p7J11lo4j1k7M8j6L0n8L5KM8m5L0l5k8M1nKj2L4m6
$$ plain form
2847 -16 0 14 12 37 65 -34 39 50 -10 64 -55 12 41 14 -45 -28 -37 -6 -18 -9 25 19 -2 -4 16 37 54 -14 -30 17 44 -29
2879 -29 25 -36 -23 8 -11 -57 -21 -54 28 13 38 -5 28 -34 41 -36 44 55 35 -21 -21 -15 -1 -52 23 -24 -3 -53 11 -28 -10
2910 -10 14 27 -19 35 -6 9 -2 -8 55 11 -5 -17 -44 -38 96 -69 20 -24 -3 -28 -36 65 -11 23 -26 -75 -22 16 -3 -27
2940 -27 -7 10 35 0 -7 18 0 79 44 41 2 -65 73 -45 -27 31 10 70 22 -47 -40 3 36 37 -34 8 33 18 9 30 -15 55
2972 55 -7 23 -28 -3 -20 -6 -57 -42 -49 -43 38 18 -11 -16 9 23 12 -8 -27 2 29 42 -53 55 48 4 -29 38 35 -20 24 -50
3004 -50 -80 -6 58 -34 14 -13 -64 -42 43 -40 -3 16 3 53 -31 5 8 19 13 -21 -6 40 27 3 15 41 14 -15 -2 63 -22
3035 -22 30 19 -46 7 -12 10 -27 72 -57 0 -28 -14 27 -2 39 58 26 -27 10 0 41 -32 4 -16 22 14 47 -75 -17 -4
3065 -4 -22 10 -56 -26 -16 -64 -75 1 26 -16 -51 84 26 -34 -5 15 -16 -73 30 2 -27 26 0 12 12 -46 -11 -61 -51 3
$$ packed form
2847a6J6J4kK5K8r9P3J1o0P4j19O7K9k7n9J7rL1j2RL4ok1kK0K1J7o8j6M7K7p3
2879b9N4o1J3L1j9m6L6l3Q2j5K5m3L3o2P5p7Q0J1k0n6%OJ4n1P5m7K1n0O4l9J8
2910a0K4J3m6N4m1J5j1oO3m4j6j2k7OJ34j65Q9m4K1k5qJ01p6L4m9m9N3L8j9k4
2940b7K0J7K5l5pK5j8P9l5ll9o7J38j18J8N8k1O0m8o9PM3L3Jp1M2K5j5rK1m5P0
2972E5o2L0n1K5j7J4n1J5pOQ1k0k9nK5J4j1k0j9K9K7J3r5J08pm4l3O7ln5M4p4
3004e0l0P4O4r2M8k7n1K2Q5q3L7J9j3N0q4L6LJ1ol4J5M6j3k4J2K6k7k9J3O5q5
3035b2N2j1o5N3j9K2l7R9j29N7k8J4M1k9M1J9l2n3L7j0M1p3L6k0L8qL3j22N8J3
3065dj8L2o6L0J0m8j1P6K5m2l5J35n8o0K9K0l1n7J03k8k9N3k6J2%n8L5n0J0N4
$$ plain form
3095 3 -76 4 0 9 32 41 78 6 15 19 -3 -85 -43 27 -38 2 42 -41 8 6 2 -25 22 -54 -43 22 31 89 12 -42 47 -14 -91 40
3129 40 -100 35 -42 -18 -3 -33 -15 -24 27 24 28 -52 -6 -6 -21 29 -2 1 -58 28 45 55 -21 -20 -27 38 -36 16 43 -6 33 -8 3
3162 3 -20 -42 2 4 53 5 -22 -37 -53 -4 -17 -14 107 27 71 0 -6 50 11 -18 -47 -40 31 6 -5 20 4 8 16 48 -8 47 13
3195 13 7 60 -2 25 32 25 -26 15 -48 33 15 -10 0 -9 50 -53 31 -14 1 -6 -29 56 4 -34 41 3 -61 -35 -8 -13 -71 42
3227 42 -22 -44 -5 45 -35 -17 -39 -34 1 -42 -60 -13 -10 -70 15 -10 -56 -37 -3 9 -38 2 -1 -36 30 -3 -1 -34 -16 -44 19 -38
3259 -38 46 -27 -18 66 2 11 -41 -37 18 27 17 -14 31 6 21 14 -48 -19 29 51 26 40 32 26 1 -7 3 75 -48 28 58 -36 11 3
3293 3 19 22 24 43 32 -9 -1 -15 -56 -8 57 -41 -14 -7 3 10 11 28 -32 -28 2 -38 2 -23 44 33 42 28 16 3 -11 34 23 11 52
3328 52 3 9 -17 -6 13 29 -28 26 -5 54 -43 -21 -15 -6 45 4 -31 -6 -30 -11 39 -8 -57 -29 46 5 -10 -33 7 -20 -20 -23 -4
$$ packed form
3095Cp9Q0mRK3RL7p2RMk2q2M2P0o5M0M0q3M9kmk7M7p6J1O5RN8p7n4Q9o1p7J31
3129D0j40J35p7K4J5l0J8rN1lMq0M6%j5N0l1Ln9Q6J7J0p6JpO5p4N2K7m9L9m1J1
3162Ck3k2M4KM9m8k7j5j6M9j3LJ21q0M4p1oN6l9k9k9PP1k5j1K5j6MQL2n6N5l4
3195A3oN3o2K7Ppn1M1o3Q1j8k5J0rN9j03Q4m5J5pk3Q5n2l8P5l8o4K6K7nn8J13
3227D2o4k2L9N0q0J8k2NL5m3j8M7Lo0Q5k5m6J9L4J2m7M0ll5O6l3Kl3J8k8O3n7
3259c8Q4p3RQ4o4Rn2MN5Rj0l1M5k5J5po2K9M8K2k5J4qok5qJ0P2j23P6L0r4M7q
3293CJ6LKJ9j1m1Qj4m1M8O5r8K7PJ0PJJ7o0ML0m0M0k5O7j1Rj4j2j3j4M5j1j2M1
3328E2m9Ok6J1J9J6n7N4l1N9r7K2ORN1m1l5K5k4J9N0m7m9K8P5m1j5k3M0k7%lJ9
$$ plain form
3361 -4 2 12 82 9 -42 -6 -47 59 -9 -67 -53 -21 -6 -18 58 7 20 -31 -23 -28 -31 26 1 -41 -13 7 -42 -19 -63 -23 12 21 41
3394 41 16 -1 6 -1 21 -22 0 -25 11 -37 -24 20 27 -5 -27 26 13 23 -39 14 -104 -2 8 -28 -33 10 -33 9 -7 43 -29
3425 -29 20 -16 18 31 -40 6 -6 -43 54 -17 -18 53 2 27 -17 40 43 -44 -1 -32 -15 107 10 -27 14 24 -5 -56 55 20
3455 20 -25 46 -24 -49 -23 -3 -48 27 -14 -18 -41 -44 28 17 58 -6 78 13 -34 6 -66 -26 46 -22 -8 39 -15 33 -22 -15 -33 18
3487 18 18 -24 -34 -12 -58 12 -34 27 10 4 -22 -5 -23 10 -21 0 22 67 8 -15 -19 18 -8 -32 49 18 -59 14 -20 -16 -47 -26
3519 -26 10 -35 -31 17 -33 -10 -66 18 -16 22 -41 56 45 32 -26 -2 35 -44 24 -6 33 -8 80 -18 28 42 90 -15 -1 -64
3549 -64 1 20 -44 -76 45 -12 -16 -13 -13 30 -37 52 -32 -38 -18 -41 19 -29 23 -6 38 28 -18 -9 16 -21 10 18 1 -69 33 28 -65
3582 -65 34 -77 -24 -22 31 -9 -20 -76 -19 -15 -12 -6 -23 45 3 15 34 46 -38 63 99 21 3 -2 -37 6 -31 30 8 -17 2 -29
$$ packed form
3361dOJ0P0p3n1L6m1J06o8n8J4L2J5j2P6n1J3n1QnlN7k5m2K8K0m9K3m4M0L5RK0
3394D1k5j7PpK2m3K2k5L6m8J3M4Pl2k2N3j3J0o2N3j18J02J0l6nM3m3M2j6N0p2
3425b9M9l6L4J3p1M6j2l7R7p1jP1n1K5m4N7Lq7M3l1J7J22r7l7M1J0k9n1J11l5
3455B0m5P1p0k5K6K0m5P5m1mk3lP2j1M1o4Q4o5m7M0p2M0P2o8J4M7n4M8n5Pj8N1
3487A8%m2j0K2m6P0m6O1j7ok6J7j8L3l1K1K2M5n9k3mL7k6k4Q1l1p7P3l4Ml1K1
3519b6L6m5MM8n0K3n6Q4l4L8o3R7j1j3n8K4L7p9O8l0L9m1Q8r8M6J4M8j05J4o3
3549f4O5J9o4l2J21n7mL%M3o7Q9q4oK0k3O0m8N2k9M4j0m6RK5l7L1Qj7p0J02nr3
3582f5R9j11N3KN3m0j1n6N7MLOj7O8m2J2J9J2q4J01L6p8j8nl5M3l7O1k2k5J9l1
$$ plain form
3614 -29 1 16 7 -56 89 -4 -32 21 -6 -22 -1 -45 18 11 16 7 11 68 -1 -6 14 15 -26 -32 -15 -23 -3 13 18 37 -32 8 -90 32
3648 32 5 -7 5 24 -30 73 -23 -38 0 16 24 -38 79 53 18 7 -11 47 -8 23 52 -5 8 -9 -74 -16 39 23 57 -18
3678 -18 32 3 25 2 9 -11 -2 54 33 -7 33 -37 30 3 25 5 21 4 -13 7 22 -14 10 46 -63 41 -16 37 -23 13
3708 13 -91 35 22 0 -32 5 -6 0 -3 -22 -35 3 -26 -11 -2 21 -62 11 4 10 34 50 21 -18 1 -3 -1 0 27 -9 6 53 -20
3741 -20 -34 -41 -19 -25 -50 -4 -5 -19 19 41 36 62 29 17 1 -3 15 4 -45 37 16 23 -33 30 4 1 -7 17 -25 -24 11 -4 -17 39 -26
3776 -26 19 -9 41 59 -21 41 -51 5 -16 58 15 -59 -19 -31 -44 12 16 0 30 -23 6 10 -27 23 34 -43 -18 28 19 -28 -14 38
3808 38 12 -2 -13 -47 27 -29 -32 28 -41 78 51 -13 39 2 -56 49 30 43 -73 26 -40 30 60 -10 36 1 -14 -7 6 12
3838 12 -8 -1 29 -5 -52 -16 5 -5 19 18 18 -71 60 -29 3 43 -22 -31 14 45 -4 -29 -12 -20 6 -5 -40 -6 -4 -23 32 31 -4
$$ packed form
3614b9L0J5ro3J45r3k8N3k7j6K1m4O3pNrMN7o9nK0Jm1oJ7qK0J6NJ9o9M0r8J22
3648C2k7j2J2J9n4J03r6j5L8J6Qo2J17k6l5j1j8N8n5L1K9n7J3j7o5N8N5j6L4p5
3678a8N0k9K2k3Pk0RN6k1m0M0p0O7k7K2k0J6j7j7K0J5l6K4L6j09J04n7N3o0L6
3708A3j04J26j3k2l2L7j1Olj9j3L8k9J5RK3q3P3pOK4J6k9l9J9mKJK7l6J5M7p3
3741b0j4pK2ok5M6jj4L8K2nK6l3j2j6mJ8j1m9Q2k1Pn6O3k6lqK4m2JL5j5j3N6o5
3776b6M5k8N0J8q0O2r2N6k1P4m3p4M0j2j3N6Mj6L0n3K9Ml7N0J1p7K5M6rm7J4N2
3808C8k6j4j1l4P4n6lO0o9J19k7o4N2l7n8J05j9J3j16R9o6P0L0p0M6l5j5PJ3O
3838A2k0PL0l4m7L6K1j0K4j%q9J31q9L2M0o5rM5L1m9k5J7qK6j1l5L4Kj9N5jl5
$$ plain form
3871 -4 106 -42 8 35 71 24 -6 41 59 -1 -17 -19 -10 52 -28 6 51 -76 51 -68 -52 38 -45 72 104 -38 15 -13
3899 -13 42 19 -12 3 5 -28 49 -43 -22 5 2 -43 -80 -33 -4 -20 48 23 33 -6 1 -51 -12 31 -36 78 -41 -31 -29 5 -13
3930 -13 -2 -4 -14 58 -56 44 5 58 36 15 -4 1 29 -12 -42 41 26 46 32 4 -16 57 -40 -41 34 -28 -36 -34 2 60 34 -60
3962 -60 15 -24 24 5 36 17 55 -8 -42 -14 10 30 -3 13 15 -28 42 -13 1 5 -11 48 30 34 36 33 -9 -54 55 51 -28 -43 25
3995 25 -28 -33 1 -26 -9 25 9 35 25 54 39 15 -11 17 -31 55 -31 -22 35 24 8 16 -33 -1 26 -10 -18 -13 -56 43 -1 20 50
4028 50 41 41 -15 -5 -1 103 -14 40 -7 -18 -58 61 10 -4 -3 -32 44 -33 27 67 44 26 -25 29 39 32 57 16 -3 15 10 -17
4060 -17 -4 -37 0 69 24 46 -36 34 -28 -2 5 -2 7 24 20 -19 1 66 51 17 -27 -38 -24 -60 -11 -2 11 8 -32 7 -28 27 16
4093 16 -43 -29 0 -21 -4 18 20 38 -58 18 44 -53 14 -35 11 -7 -18 -85 28 30 -15 19 -2 17 16 32 13 34 55 -16 13
$$ packed form
3871dJ10j48N0K7L6m7l0M7J8o0j6kRO2q0L4M5j27J27j19J6R0q3J17L2j42N3k8
3899a3N5k3l1J5Kl3P7r2K1K7lm5l7M7K9j6O8k5J0l9Pn2L9M3o7J14j19J0KL4j8
3930a3J1kj0P2j14J00l9N3k2k1j9NK8m1l0Q3j5K0j4k8k0P3r7jP5o2qKL6N8k6r4
3962f0P5l9M8j9L1j9L8o3l4K8K4K0l3J6Km3P0n5J4Mj6N9j8MKlm2m5J09mp9j5O8
3995B5n3nL4k7J7L4j6K6j0K9j5k4k6K8m8Q6q6RN7j1j6Qm9L2K7l6qNm3R9m4K1L0
4028E0r%n6J0MJ04j17N4m7j1m0J19n1j4Jk9P6p7O0M0k3j8n1N4J0pK5m1j9J8nk7
4060a7J3l3L7O9m5K2q2P0o2K6PpRJ7ml9K0O5j5l4m4j1J4l6M9RJ3lm0L9l5N5j1
4093A6n9J4K9k1J7K2KJ8r6P6K6r7O7m9M6j8j1o7J13Km5L4k1J9jJ6j9K1K1p1K9
$$ plain form
4124 13 34 -24 21 3 -16 -71 -13 25 23 6 -27 11 5 -24 15 1 -23 -1 -21 90 -14 -6 7 35 -34 34 -6 1 1 -21 13 29
4156 29 21 50 4 -6 -16 -33 -35 -8 6 -18 -12 16 -42 16 49 13 13 -56 -6 37 29 23 -20 61 19 -2 -39 -11 30 -69 70 -34
4188 -34 -3 61 23 -11 -9 -19 10 -76 14 -7 -46 25 -40 30 60 50 -82 46 7 -24 28 67 49 32 24 7 -45 40 33 27 -36
4219 -36 9 11 -13 16 14 -22 22 -12 18 40 8 -34 -42 -24 -12 48 57 -24 6 28 -4 -50 -19 -11 29 50 47 20 59 -22 -41 64 -58
4252 -58 18 32 52 45 15 -30 76 -49 25 -1 -80 -19 27 46 16 5 11 21 -49 31 11 -19 10 20 18 -33 3 -56 -23 48 -21
4283 -21 -7 -11 9 -7 54 85 -7 -21 81 23 -34 2 17 -65 -36 33 -36 -41 -31 10 10 -40 17 10 3 14 -19 8 31 -6 17 9 -79
4316 -79 -6 -64 -24 -55 28 51 16 -61 29 47 29 -41 -6 36 15 -39 6 -17 -18 -13 36 63 -82 42 29 -20 18 33 19 69
4346 69 -1 -9 6 -11 -38 8 100 4 28 69 0 25 -63 -45 -12 -17 -84 -64 21 28 63 -2 -10 -33 -42 82 -28 48 23 -2 -37 -27
$$ packed form
4124A3K1n8M5j8j9n5N8L8kj7l3L8ok9L9j4k4K2k0J11j04QJ3K8o9O8m0P%k2L4J6
4156B9qK9m6j0j0j7kK7J4k4OK8n8N8L3l6%o9N0M3qom3Q1m2k1l7K8M1r9J39j04
4188c4L1O4l8l4Kj0K9q6R0k1l9P1o5P0L0j0j32J28l9l1N2L9j8j7qj7n2Q5poo3
4219c6M5Kk4K9kl6M4l4L0K2l2m2qJ8J2O0Rq1L0K2l2m6L1QM0K1lk7L9q1j9J05j22
4252e8P6J4K0pl0m5J06j25P4k6p9O1M6J9l0j1OJ0p0Q0k0l0K9J0kn1L6n9L3P1o9
4283b1J4mK0j6O1L1r2j4J02n8n7L6J5q2K9O9o9nJ0M1%n0N7ppJ1l3K7K3l7K3qq8
4316g9P3n8M0l1Q3K3l5p7R0J8j8p0L5M2k1n4M5k3jNM9K7j45J24j3m9L8J5j4N0
4346F9p0qJ5j7k7M6R2r6K4M1o9K5q8J8L3no7K0Q5PL5o5qk3rJ24j10P6k5k5l5J0
$$ plain form
4378 -27 55 39 10 3 -11 -6 11 -3 26 13 -14 -6 -16 -34 1 -23 17 52 22 -13 -2 8 49 -27 -28 1 -22 -5 -2 -18 26 14 -12
4411 -12 -32 7 -1 4 -32 8 14 -8 25 16 -52 27 54 -3 70 0 21 13 -20 25 33 48 -5 -2 -21 -11 -15 51 2 17 20 -20 -7 11 4
4446 4 7 0 18 -70 25 10 39 -39 33 19 -9 0 -45 -48 -11 50 37 63 19 14 -3 3 -53 30 -23 -3 56 12 25 -31 13 68 5 51
4480 51 18 11 32 4 -18 47 31 70 0 21 -14 -15 1 -71 4 -6 -64 13 -45 -30 -8 -19 21 38 9 -29 66 54 17 -2 7 -51
4512 -51 -41 -40 17 40 -6 16 9 -12 25 14 -17 -64 -35 -27 1 -37 16 -19 -21 23 18 -16 7 8 -10 -40 -10 1 12 -55 12 57 -89
4545 -89 -8 -8 -25 -12 12 42 -10 23 23 40 20 21 30 -43 24 77 40 -10 8 1 1 9 -8 29 -110 -13 -11 38 9 25 2 62 53 -10
4579 -10 68 -20 1 -18 28 2 29 -29 14 7 -1 -40 -44 9 -32 14 4 16 -28 -27 -64 29 -4 -30 28 13 19 -27 -12 0 -14 12 -33
4612 -33 44 -12 -8 8 27 20 74 -40 15 -19 -21 19 30 -55 25 32 -35 -13 56 -5 24 33 37 14 -16 24 -57 -28 32 -11 20 42 -6
$$ packed form
4378b7Q2j6k9pj4NJ7j4K9j3k7Qj0j8L5k4M0L5l0l5J1J0M1p6jK9k3J7Lj6M4j2k6
4411a2k0L9qNl6M0Ok2L3ro8P9K7n7P3p0K1ql3M5QJ5n3Lj9J0mO6m9J5Lm0J3J8p
4446DLpJ8q8R5j5K9p8P2j4k8Rm5lL7O1j3K6m4nj7On6Q3n3K0N9m4J3n6M4N5o3M6
4480E1l3pK1k8k2O5j6L9p0K1l5jJ6p2P5j0n8P7n8J5K2j1M0J7k9l8R5j2l7j9Rn8
4512e1J0JN7K3m6K2pk1L7j1l1m7K9QK8l8N3l5kM4nl4K3Jj8l0L0J1J1o7O7M5j46
4545h9Q1%j7J3K4L0n2L3%J7k0JRp3O7N3l7n0J8p%Qj7L7j39R7KM9k9J6k3O0ro3
4579a0P8q8K1j9M6k6K7n8M3pql9mN3m1M6j0J2m4Jl7R3l3k6N8j5Om6J5J2j4K6m5
4612c3P7n6MJ6J9pN4j14N5l4kM0J1q5Q0Po7K2O9o1K9RMk3l0M0q1K9O0m3L1K2m8
$$ plain form
4645 -6 15 -28 -14 61 -13 -36 11 27 -67 -33 -11 -69 19 15 -9 15 -6 48 -30 -26 -20 -1 3 31 -54 45 23 -15 -55 12 -24 -29 79
4678 79 -9 -24 40 -4 -36 -25 -8 0 -4 -23 17 77 43 28 -8 -8 -9 23 -14 21 -31 -52 10 -31 -7 33 18 17 -86 55 54 8
4710 8 83 12 24 -35 58 5 -27 -24 -59 -81 -18 -12 15 -39 -30 -35 -6 0 -15 22 -30 63 23 37 -11 4 -25 -45 1 -22 1 -26 -2
4743 -2 18 17 -12 26 3 -33 18 41 37 -17 20 30 22 0 2 0 9 -17 -11 35 -40 -18 3 -24 64 -22 -3 21 26 -46 19 7 -55 -48 -60
4778 -60 61 -42 -24 25 -30 39 15 -26 20 13 46 33 24 -7 38 -30 -13 3 44 10 -48 0 -71 -36 22 3 20 -14 -61 -11
4808 -11 40 40 44 36 50 14 -17 -13 43 8 -37 4 35 37 58 -1 -1 -44 42 -29 5 -45 22 -22 -58 78 -2 -60 -71 45 -65 -2
4840 -2 33 -79 -34 36 23 16 -6 4 -14 30 -51 27 -5 29 94 3 3 -5 11 -40 59 -53 -25 77 -39 -9 20 96 20 -13
4870 -13 -62 -9 24 14 -34 -11 16 25 69 -18 23 11 -28 21 9 21 -1 13 18 9 -30 -86 28 5 10 22 -4 -2 -37 -5 18 -28
$$ packed form
4645fK1m3J4P5p4k3M7J6r4L4K2n8Q8mk4K4k1N4p8MOJ9MK8q5R9k2l8m0O7l6nJ08
4678G9q8j5O4m4l2J1J7Qmj9M0O0l4j5l6%jL2l7L5n2k1O2m1K4M0j5jj03J41jm6
4710HP5p1J2n9R3n3l2Ll5k2O3OK7n4RnK9Oj5L7n2R3m0J4m8J5k9k0M6k3K3k7K4
4743bK0jk9L8k3l6N1K3mn4L7J0qk2KkRk6OM6p5K2K1k7Q8q6J9K4Np2O5j2o2Pj2
4778f0J21j03J8M9n5O9k4m1M6pL3j3rl1M5o8J7J6M1l4n8M8p1L5N8j9J7l4m7N0
4808a1N1%MqJ4l6l1MN6l5m5M1L1KK1n9%m3Q6p1L4n0O7m4l6J36q0n8j1J16j10O3
4840bL5j12M5P0j3pk2J0j8M4q1P8l2L4O5r1%qJ6n1R9j12K8J02j16L0K9P6p6l3
4870a3m9N3L3j0m8K3K7RM4q7M1j2l9M9j2J2k2J4Nrl9n6J14k3NJ2k6Kl5L2K3m6
$$ plain form
4902 -28 -35 42 1 12 1 -28 7 -45 -19 -6 43 23 -5 -10 42 -67 -47 -24 -10 -14 -78 -30 3 -6 -34 13 -37 49 30 111 51 21
4934 21 24 11 -22 -11 37 -14 56 16 18 64 -8 -76 -11 33 -5 68 85 -9 45 3 33 -12 -3 20 -15 11 18 24 74 -10 -27 27 -34
4967 -34 -8 32 -25 -19 -56 26 1 25 -19 41 -4 -7 15 8 -39 -7 24 -21 -18 -45 40 -24 16 -15 -11 59 31 31 57 40 42 -20 36 49
5001 49 -15 -20 5 22 45 6 -30 -24 -42 -6 4 -12 19 4 23 -16 -66 -9 -19 -8 14 10 0 48 17 47 -29 -48 -21 -64 -59 19
5033 19 60 -66 -3 1 -8 -4 -10 29 -35 98 38 -6 24 39 -1 -49 -6 8 -3 -18 -39 37 -30 4 5 17 -18 11 -36 -43 3 -14
5065 -14 -1 -2 9 67 8 -37 -27 -54 3 23 27 -39 14 -4 -47 17 69 -18 -18 -51 -31 -22 7 -13 63 58 6 -21 -31 -34 -4 25 12
5098 12 11 0 -14 -21 -15 10 -1 -36 -26 19 52 5 31 21 -1 50 28 17 31 17 -23 26 -47 22 35 -27 47 9 63 -16 66 17
5130 17 -18 52 -70 -21 29 16 -12 -47 -40 10 53 -48 -1 -119 -14 42 -19 -44 -37 -24 -23 61 -48 58 -43 -76 -31 32
$$ packed form
4902b8pP7m1J1j1k9L5n2K6J3M9k0k8nN2j09K0K3J4mo4M8L3rk8M7n0Q6j9Q1o0l0
4934B1Lj3l3J1M8n1P0m0KM6p2o8O5M4l8P3J7r4N4m2L0m5RK3l5K6PON0q4j7N4o1
4967c4K6M0n7Ol7Q2k5K4m4O0m5lK2pm7L2L1m5Lk7Q5o4M0l1MP0k8%K6j7Ko2N6J3
5001D9o4nK5J7K3l9l6Oj8L6J0j6L1j5J9l9n0N7j0J1K2mj0M8l1L0p6j9K7m3NP8
5033A9M1j26O3MrMoL9o4J33o0m4L0J5m0m8M3J4j1j5k1P6o7L4JJ2l5K9m7pM6j7
5065a4J3jJ1N8n9m5J0k7N7K0Mo6N3j8m3O4N2q7%l3K0RK9k0P6nn2k7j0lL0K9j3
5098A2jj1j4pOK5j1l5J0M5L3m7K6j0k2N1k2j1J4j4m0M9p3O9J3o2P4l8N4p9Q2m9
5130A7l5P0j22M9N0j3k8l5PN0M3j01M7j18J05N6o1k5PJ3JQ4j09J06j01l3M5O3
$$ plain form
5158 32 14 -25 -17 -55 -36 -5 19 10 -10 6 -41 4 -5 28 58 16 -41 66 -37 -82 -8 -26 -2 -20 3 -4 11 -14 -47 1 24
5189 24 -19 22 -25 8 -1 37 41 6 -41 -42 42 3 39 42 7 -17 61 -44 -25 -14 -42 1 28 -37 -30 14 -3 9 14 -13 20 5 6
5222 6 -69 -30 -29 45 -17 -16 44 28 -15 39 50 40 -5 -7 49 28 -21 50 13 17 1 6 8 44 45 46 9 25 24 54 41 -24 18 -32 5
5257 5 -23 3 7 24 61 -37 50 -35 -100 19 5 17 -10 -14 -23 -37 -9 -88 26 27 22 13 35 -29 4 -59 38 20 6 -25 16 15 -22
5290 -22 13 42 53 34 -21 -2 -22 13 -24 -6 -27 -34 37 37 15 -39 0 -20 -16 -9 9 10 -2 -26 83 6 8 60 24 16 -8 30 37 -76
5324 -76 -53 -4 -61 74 -4 -5 28 35 -20 -50 62 43 55 -80 -19 40 -40 -30 14 -28 -20 -6 39 -42 -51 13 -33 20 11 -93 28
5355 28 20 18 35 -34 18 -54 5 16 -8 -48 -32 50 -16 42 28 10 4 -6 -6 -22 -13 59 -29 -6 17 38 -20 41 30 -27 13 -38 -49
5388 -49 -16 -52 -26 49 -10 2 27 76 -43 8 0 -36 37 -1 -25 8 49 -11 -40 23 7 27 46 -5 8 -20 -36 24 -16 34
$$ packed form
5158C2j8l9Ql8J9L1K4rk0J6m7M5rL3L0m2n7J07j03m5P4j8K4j8K3pJ5k5l3M8K3
5189B4m3M1m7L3rL8Ml5m7jQ4l9L6Ll5k4P8j05J9J1k8M3K7o5PM4j7J2Nk7L3j5J
5222Fp5L9JP4o2JO0j6m3N4J1j0m5kN6k1m9P1l7Mj6NKL6JJl7J6jL0j3o5M2n0L7
5257Ek8K6MJ7L7r8Q7q5o5J19j4J2k7mrj4K8p9J14JnrK2o4L3o3R7j8j4l1M1jl7
5290b2L5K9J1j9n5J9k0L5l7J8k1pP1%k2n4L9k0MPJ8Jj2k4J09p7KN2l6qk4L8Pj13
5324g6K3M9n7J35p8jL3Pn5l0J12j9J2j35O1N9q0J0M4m2QJ4M5q1rO4m6N3rj04J21
5355B8qkJ7o9N2p2N9J1k4m0J6Q2o6N8j4j8oj0%j6RP2q8K3K3K1n8O1j1n7M0n1j1
5388d9L3l6K6P5n9J2K5M9j19N1ql6P3l8k4L3M1o0k9O3j6K0J9n1J3k8j6O0m0N0
$$ plain form
5418 34 -37 -19 -60 -6 56 -7 41 50 -9 -4 -28 1 -14 -26 -62 -44 -12 57 13 -5 -64 24 -2 -16 -37 -2 32 -31 -15 -14 -17 20
5450 20 -40 53 48 -23 31 82 31 -18 -32 42 31 16 23 33 17 -40 54 -22 25 33 -36 50 -13 20 -2 -27 29 39 21 27 -9 -1 -40
5483 -40 -62 -14 9 24 10 -24 19 0 7 38 -32 23 -34 45 -46 18 37 -18 -23 48 -73 -42 -75 -28 5 -29 25 -42 13 2 42
5514 42 6 -20 46 -6 -10 -41 41 -107 -27 23 -4 21 -1 -2 16 47 17 8 0 -64 25 30 35 1 50 -13 -33 3 -27 5 23 -8 -13
5547 -13 17 77 30 25 70 54 2 26 26 18 20 -16 -10 -67 6 5 -13 49 38 56 -4 -13 -10 39 39 -75 -7 -102 24 4 25 29 36 -41 -37
5582 -37 34 25 32 26 -12 -91 -17 10 -31 -1 3 -43 36 -13 -54 18 66 10 28 -45 5 -3 -34 -10 43 -55 -25 58 15 -17 -22 79 -35
5615 -35 16 8 58 -10 2 -49 -33 -28 36 19 -37 39 -18 -40 -25 15 -10 6 16 36 15 -5 10 -10 -46 -31 50 -19 66 78 12
5646 12 18 -22 19 20 11 69 16 46 7 34 15 -52 -2 -11 25 -41 -46 -38 -36 6 -13 -15 22 -12 -52 -9 16 -1 12 19 -38 -41 6 16 -2
$$ packed form
5418C4p1J8m1N4O2o3M8Rn9Nk4K9j5j2l6J8L2O9m4j8n9Q8k6j4k1L5L4o3J6JlL7
5450B0o0R3np1N4N1n1m9j4P4j1j5PJ0j6n7R4p6M7Qo9Q6o3L3k2k5N6J0j8Ol6Ql9
5483d0k2M8K3J5j4l4M3j9PL1p0N5n7P9r1O4J9n5nP1j21L1l3M7L3l4N4o7N5j1M0
5514D2l6k6O6n2ml1Q2j48Q0N0k7K5k2jJ8L1l0rqo4Q9NNl4M9o3k0L6l0L2J8l1n
5547a3L0O0m7nM5j6n2K4%qKl6On7P3jj8O2j1J8o0rLM9%j14O8r5J26k0K1MPp7M
5582c7P1rPol8p9P4K7m1L0Mm6P9m9m1P2M8n6J8p3N0ql1K4N3r8L0Q3m3l2nJ01j14
5615c5N1qN0o8J2n1J6NO4j7n6P6n7k2J5M0k5J6J0K0k1k0J5k0l6J5Q1o9Q5J2o6
5646A2Om0M1JrN8n3L0l9K7j9o7N0rL6o6nQKM2j9kL7l4m0M3K5j7J3Pn7lM7J0j8
$$ plain form
5681 -2 23 9 15 -34 -18 32 -58 -34 -5 33 71 -33 5 4 8 1 11 -6 -5 71 19 45 58 30 53 -42 -4 26 2 9 -25 32 47
5714 47 -17 24 -51 -10 -1 73 5 3 -3 -7 4 -49 57 20 75 -22 7 -1 -7 -50 14 4 -43 30 84 48 -3 3 -43 -69 71 22 -5
5747 -5 -9 28 35 -43 15 2 18 14 -42 -2 16 -13 21 16 98 -21 -9 90 21 29 27 -5 51 2 -51 -34 34 3 6 -22 3 -2 -24 -18 26
5782 26 44 -30 85 12 -21 -26 66 2 -14 -17 30 -30 12 -2 1 17 -42 18 -1 -15 -38 -78 5 32 -60 32 37 32 -25 16 -32 9
5814 9 50 -8 -22 -61 -1 1 -18 -82 26 -40 -1 -19 -88 12 -23 -5 -57 56 -2 -2 -24 53 -8 29 7 18 -10 15 -19 30
5844 30 -27 -39 61 -22 -4 -70 2 19 -11 -4 13 12 -5 2 53 -18 22 45 -38 -8 8 -31 5 26 -30 -24 -69 -34 -2 -9 39 -22
5876 -22 13 47 -25 103 43 -68 8 17 7 -2 20 -10 -50 55 -46 68 -52 47 -59 28 -25 8 22 41 17 -54 -1 44
5904 44 -79 -28 -34 32 19 -25 12 -112 -19 -54 52 -38 4 -3 43 -6 19 29 -12 -2 24 25 -3 -17 -22 5 4 8 18 -15 9 -26
$$ packed form
5681bK5j4Om9J6N0r0K4K9L8L8j04L8jMpJ0j7JP6n2K6J3k8K3r5L8L0k4Pl4N7J5
5714D7o4M1p5M1RP4o8komJ1n3J06l7N5r7K9qom3O4j0m7P3N4l6n1Om6k6J40m9k7
5747emL7Pp8N8j3J6mn6M0J8k9L4nQ2j19J2R9o9Qkl2N6m9n3J7O8l1Lk8K5nk2OM4
5782B6J8p4J15p3l3nR2o4j6lM7o0M2j4LJ6n9O0j9j4k3m0Q3K7r2R2Nnn7M1m8M1
5814IM1n8j4l9O0Kj9o4J08o6L9j8o9J00l5J8n2J13n8%k2P7o1L7k2J1k8K5l4M9
5844C0n7j2J00q3J8o6P2J7l0PJ7jj7PN1p1M0K3q3L0J6l9L6K1n6Om5L5L2pM8o1
5876b2L5L4p2J28o0j11P6Rj0rK2l0m0J05j01J14j20R9j06Q7n3L3J4J9k4p1N3M5
5904D4j23N1oO6j3m4L7j24R3l5J06r0M2pM6m9K5J0m1J0K6Jk8j4nK7jMJ0l3K4l5
$$ plain form
5936 -26 -51 -20 14 51 -15 10 -7 28 -61 1 -54 -20 -26 -16 13 -11 -13 -14 21 -15 -27 53 17 -26 -35 31 3 15 -17 -37 -74 16
5968 16 27 6 -1 21 -26 37 40 28 -18 33 -21 5 24 -7 -19 31 -27 46 -6 -42 -16 1 -3 -12 -36 49 15 -100 1 78 -33
5999 -33 -16 38 22 -11 41 -61 -30 -38 30 -49 -38 -20 -41 -27 41 9 -1 -15 -30 -78 -27 -13 -7 -13 25 -80 -2 -34 -6 -18 -41
6030 -41 -57 30 -5 38 54 -29 -28 20 29 -35 39 36 -10 -36 20 -8 29 -40 34 0 40 -131 19 47 21 -50 36 -30 -12 5 8
6061 8 34 -45 -87 22 9 25 -31 -31 40 24 34 -45 8 -32 72 -74 10 -17 -15 43 -23 14 -9 -2 -15 51 -4 47 -33 -10 38
6092 38 -29 27 40 -51 35 2 6 -11 61 28 44 -6 -18 -22 -11 -16 -7 -36 4 36 51 -9 -25 2 -29 18 -31 17 51 -34 14 -14
6124 -14 -46 5 -21 -62 -16 -11 12 77 -13 -12 5 -8 -54 -15 1 -8 27 56 -42 31 -12 15 28 -74 9 16 -39 -7 46 -68 -21
6155 -21 7 22 -17 -34 37 -23 -23 -26 34 7 -49 1 -30 -53 21 -12 -30 -13 -5 20 6 0 -4 -22 60 -23 -29 -10 -1 41 6 15 -30 -16
$$ packed form
5936b6k5L1L4L7o6K5j7L5q9O2n5L4oJ0K9k4kjL5l6j2Q0l6m3rO6k8J2l2k0l7R0
5968A6J1k1pK2m7O3Lj2m6N1n4K6J9l1j2N0n8P3n2l6K6J7mrk4Q5l4j15J01P7j11
5999c3J7N4j6l3N2j02L1qO8p9J1J8k1J4O8l2j0j4j5m8N1J4OoL8j05P8l2K8j2k3
6030d1j6Q7l5M3J6q3JM8Ro4P4lm6k6N6k8L7o9P4l4M0j71J50K8k6p1Q6o6J8J7L
6061HK6p9m2J09j3J6n6%P1j6J0p9N3m0J04j46Q4k7KN8o6L7k3Pj3O6n5N1q0K3M8
6092C8o7N6J3r1Q6l3Mj7P2l3J6n0j2mJ1nRk9M0L2J5o0j6K7l1M7m9M8L4q5M8k8
6124a4l2N1k6m1M6NK3O5r0JJ7j3m6L9J6rL5K9r8P3m3K7J3j02Q3Pn5L2N3j14M7
6155b1K8J5l9j7P1o0%lO0k7n6N0l1k3P4l3j8J7QK5j4omj8Q2q3oJ9RM2l5Rm5J4
$$ plain form
6189 -16 2 35 8 36 -17 8 -11 -4 61 -4 31 -26 8 1 35 -10 -46 -8 -26 -7 42 -31 63 19 9 54 28 34 -1 23 -40 4
6221 4 -48 19 7 -28 -10 -18 -28 -55 -51 -12 3 20 7 27 -10 -38 24 -42 -51 65 -54 16 -80 -20 -11 -38 -7 18 10 -13 -36 33
6253 33 18 -16 -2 15 18 -21 26 -15 -15 40 -23 -62 -44 -19 40 -25 -61 -78 -20 -61 -13 -17 -24 -33 -4 -36 -44 56 54 -40 3 8 -23 -4
6287 -4 -46 -39 12 23 17 -61 39 -42 12 42 -66 -13 -11 -8 19 -1 -50 39 7 55 16 33 16 -33 -44 -18 -19 -42 66 -29 -12 7
6319 7 -68 50 -43 31 -30 -6 35 -28 6 -47 15 -70 40 -5 -25 41 44 -6 -38 -21 60 7 -41 -17 19 -1 54 -41 -79 -20
6349 -20 4 -52 -59 6 7 -8 37 -24 45 80 12 -53 5 6 -31 -40 -19 -38 8 -20 6 -62 -12 -47 39 86 51 24 35 -61 33 -9
6381 -9 -75 -32 30 -44 -38 -51 -27 33 -15 -34 57 -59 3 31 -5 -14 -32 -10 41 104 -7 19 -10 -1 -17 2 -46 24 19 24 23 23 -41
6414 -41 -15 2 -30 47 -12 24 -7 34 -43 6 7 14 -50 -25 22 -52 16 23 14 36 10 -36 -24 -46 -8 37 -17 -11 -79 9 9 7 58 -23
$$ packed form
6189a6J8L3k7K8n3K5j9PO5o5L5n7L4pL4m5l6L8j8J9M9p3R4m4j0M5k6Ol5K4o3M4
6221Dn2O7j2l5J8qj0k7ML9J5J7j3K0l7k8O2o6rJ16j19P0r6O0Rk7L1K5qk3k3O9
6253C3j5l4J4J7Ll9M7m1%N5o3l9J8K5N9o5l6j7N8m1M8mprK9l2qJ00kr4M3Nl1J9
6287dm2PN1J1op8J00q1N4L0j08N3KLK7k0m9Q9l2M8l9J7j7m9j1K6jk3J08r5J7J9
6319Gp5J18r3P4o1K4M1o3L4n3O2q5J10m5k0O6Ln0l2J7Q1n3m8K4L6k0N5r5l8N9
6349b0K4n6pO5Jj5M5o1O9L5o8o5N8Jl7rK1j9M6k8K6o8N0l5Q6M7l5k7J1r6R4m2
6381io6M3O2p4Oj3K4O0m8j9R1j16O2K8l6rj8K2N1O3j11K6k9Rj6J9m8P0nNj%o4
6414d1K6J7l2P7n9L6l1M1p7M9JPo4K5M7p4O8PrK2k6m6J2k2L8M5n4Oo8Q8%kN1q1
$$ plain form
6448 -23 18 11 -11 -106 -23 33 -67 27 12 34 6 -15 -13 49 15 -78 6 27 12 3 -14 -20 -14 -34 8 -4 79 -14 14 1 -28 48
6480 48 25 29 -29 -8 10 4 -20 -41 31 -38 1 105 1 74 -1 -40 5 -2 -58 98 0 -24 -2 88 27 28 30 -6 -61 34 26 -1
6512 -1 40 4 12 0 32 -48 -8 -56 31 5 37 49 45 -23 -44 20 18 6 23 -66 -19 -61 22 -45 32 14 31 40 45 16 -37 19 -53
6545 -53 25 9 27 -55 -48 -30 32 -3 68 28 -53 38 28 1 25 -11 15 -39 23 61 17 -52 5 10 -24 33 35 -29 -15 -55 43 52
6577 52 -14 2 20 14 19 34 -21 27 0 -4 57 -14 -24 21 -24 -34 21 1 27 29 46 -16 27 28 -13 6 39 -6 -34 -8 -64 -8 7
6610 7 69 14 -11 5 -16 7 -33 42 14 -29 -16 8 28 -58 9 41 -35 -5 -58 30 -22 -35 11 29 13 10 22 -20 34 -60 -3
6641 -3 73 -18 29 -16 40 -14 43 2 -20 -10 -7 -2 -38 8 39 -7 -11 -27 -50 -74 -17 -10 -19 -26 30 -43 -1 14 -29 17 -25 -14 36 -33
6675 -33 -2 89 66 -34 -26 28 -13 59 14 55 -17 10 -49 28 30 5 -65 33 -24 27 9 -48 58 12 -19 -51 62 -17 41 16
$$ packed form
6448b3M1pk2r5Q3N6j00R4j5K2k8k1KO2l4r3Q4K1j5rj7oOk0M2j2Q3r3K8j3k9P6
6480D8k3Mn8K1J8ok4k1P2o9L9J04j04P3p5l9M5pn6J56r8k4K2R0o1JKl6n5R5qk7
6512aM1l6Qj2L2q0M0m8Q7k6L2J2mo8k1O4kj2J7q9M7m2Q3o7P7j8J7RNk9n3N6p2
6545e3P8j6J8q2PJ8O2l5P1m0q1R1j0k7K4l6K6n4O2L8m4o9N7Nl4N7Ko4J4m0R8R
6577E2o6J6J8oNJ5n5M8k7mO1p1j0M5m5j0N5k0K6KJ7o2M3Jm1J9L3m5k8K6n6N6J5
6610GO2n5k5J6k1K3m0P5k8m3J3K4K0q6O7L2p6L0n3Q8n2j3M6J8j6lJ2m2N4r4N7
6641cP6r1M7m5N6n4N7m1k2J0LNl6M6L1m6mj6k3k4N7PrpN6p3M2J5m3M6m2J1N0o9
6675c3L1R1k3j00QN4m1P2m5M1p2K7n9P7Kk5p0R8n7N1j8n7J06m6l1l2J13p9N8k5
$$ plain form
6705 16 -42 -40 -29 42 -38 9 13 2 -23 29 40 -36 28 11 -19 37 -10 -41 78 -41 -65 -14 -13 -25 13 -7 -13 -30 -34 -26 0 2 -18
6738 -18 -88 41 34 -44 3 23 -78 56 10 -48 -17 38 -1 34 -30 -4 -19 -18 5 13 65 48 -18 -31 5 -38 -29 -19 35 11 -10
6769 -10 4 4 14 20 6 41 -26 57 -47 8 12 -1 -5 7 -1 -26 -13 -61 -27 30 -10 -39 51 -28 18 -43 43 -17 -52 29 5 -9
6801 -9 -23 0 -3 -39 4 -7 15 1 -70 18 17 70 25 10 -25 36 -50 -2 13 -17 16 7 -11 -5 51 -31 37 -23 -14 -27 4 -24 -53
6834 -53 29 4 -11 38 -25 -6 55 -21 -4 46 -35 -14 12 -17 15 13 25 23 29 33 -13 -68 -27 -14 37 -10 -17 28 22 13 -4 36 -11 -3
6868 -3 -15 -21 21 -18 27 -54 -32 9 47 -22 100 36 17 51 -72 -72 -5 50 -39 12 7 24 31 -10 38 83 -43 8 19 21 53 36
6900 36 -15 6 -71 -4 -57 -1 7 12 8 -50 -1 -36 -35 -11 -8 -14 -77 -10 -3 -23 -41 -47 -75 -6 -28 38 69 40 -6 -5 32 -28 -1 73 24
6935 24 78 32 3 -43 -32 -18 8 -30 16 -2 -24 23 12 23 -37 -56 64 -26 -44 53 -35 -66 28 44 0 53 25 20 52 2
$$ packed form
6705A6n8KJ1P1q0M7Mj1k5N2J1p6O4j7l0N6m7l1J19j19k4N1Jj2L8k0oj7mQK6Kk0
6738a8p0J29pp8M7K0j01J34m6n8L1N5l9L5o4K6j5JK3QN2j7o6j3L6m3RJ0N4k4k1
6769a0J4%J0Oj4L5o7Q3j04N5Mj3mJ2qk5J3m8L4N7m0k9R0p9M6o1Q6o0l5Q1k4j4
6801ij4K3ll6M3j1K2j4p1Q8jN3m5j5l5O1q6M8J5l0L3rj8ON6q2O8o0Rj3L1k8k9
6834e3Q2k5j5M9o3J9O1p6J7N0q1K1K6k9L2kJ2kOMm6n5M1J3N1m7pM5orj7M0m7Q
6868cj2oM2l9M5q1K2M1L8o9J22o4j9L4j23%O7N5q9N1nJ7Pm1M8M5j26N1J1KL2j7
6900C6n1K1p7O7n3N6QNmn8M9l5JK4Loo3O7Pk0j8ok8O9k2O6L1k9m6JL7o0K7P4m9
6935B4N4m6k9m6J1J4K6l8M6j8k2M7j1J1o0j9J20r0j8R7q8l1R4J6m4N3k8nL2n0
$$ plain form
6965 2 10 115 -4 58 23 24 6 -16 18 43 38 -14 -18 -18 16 9 2 -38 -12 13 38 54 -6 42 18 16 -13 5 10 -39 -52 18 46 -13
6999 -13 17 -25 -57 -38 19 -13 20 -38 -25 -59 14 11 -9 29 -60 9 -18 -31 15 20 36 -7 22 43 -18 12 42 -31 -15 4 -69
7030 -69 33 37 -39 24 -30 -28 3 -88 -4 32 22 18 48 -64 -2 -34 -25 21 -2 -19 63 41 6 17 3 5 -42 14 25 13 56 -28
7062 -28 44 20 29 3 -6 17 -3 41 -23 13 14 16 14 -20 -15 10 -12 18 62 -5 28 -49 33 63 12 59 -24 -19 -29 1 70 33 -19 -7
7096 -7 24 -1 -7 15 -26 42 46 11 -19 -4 -53 22 -23 -5 2 -1 -7 40 2 52 32 0 36 -15 14 -16 -13 39 65 2 9 -1 -28 42
7130 42 -6 33 67 -12 35 39 24 -35 41 -20 50 23 -4 -5 12 -6 22 -52 -12 34 -106 4 -19 12 8 12 -57 -28 -22 -23 -9 7
7162 7 7 -18 20 23 31 -40 32 77 -26 -28 17 63 -25 -6 -8 7 -4 -36 -63 27 24 20 -5 14 16 21 -21 -23 44 50 36 -35 73 -31 33
7197 33 12 -19 18 -60 1 -10 36 68 -10 6 -4 7 -27 -43 -41 50 -57 -7 0 -50 6 -8 -81 51 -36 14 -7 -2 10 -32 -10
$$ packed form
6965BQJ05j19O2l5Jj8k2L4K5nn2m%L4ppm0K6K5K5J6o0M8k4kk9J8Nm9j3P0K8n9
6999a3L0m2l2J9N7l2L3n8J3l4P3lk0L8q9O9k7j3M6NJ6m3K9K1o1L0L0p3J6J9p3
7030f9J02Mp6O3n4KL1r1Q4L6j0mL0j12O2l2RM6k3j7Q2k2l5J1j4Km7N6J1j2M3q4
7062b8P2k4Rk6rK3k0M4o4L6JKkl4NK5k2L0M4o7L3p7Q2L0n1M7q3Nj0L0O9l7n2J2
7096gL1k5oK2m1O8Ml5l0J5m9P5m5J8PloM7l8N0k0l2L6n1K9l0LN2K6o3Pj0k7P0
7130D2m8L9L4p9M7Mj5n9P6o1P0k7k7jJ7j8K8p4M0M6j40J10k3L1mMo9K9OjJ4J6
7162G%k5L8LQp1P2M5j03kM5M6q8J9kJ5j1l2k7R0lmk5J9KNm2kO7Oj4p1J08j04O4
7197C3k1l1L7p8O1j1M6L2p8J6j0J1l4j6KR1j07N0Pn0N6j4p3J32q7N0k1NJ2m2K2
$$ plain form
7228 -10 9 39 -10 -3 6 19 10 -21 -8 -18 24 11 86 23 17 50 43 24 6 15 -11 24 18 69 27 -24 64 17 16 6 -15 -5 -4 30 -1
7263 -1 -39 9 29 -34 -5 -28 -7 37 -16 -5 -61 -9 15 -9 -9 38 29 18 -29 -18 -34 11 7 -14 4 -22 -3 37 -21 2 8 -8 -28
7296 -28 -38 -31 -71 -16 6 -40 42 -33 -21 62 21 53 20 5 -69 -9 3 -5 -9 28 -19 -2 19 50 -10 -13 -20 -14 13 -64 -16 42 1
7329 1 -6 -57 -12 -15 29 -21 23 -16 -47 1 -51 13 15 -32 -19 -25 -31 67 46 -3 -6 22 -19 61 -3 -11 -44 -40 7 -25 -42 -72 7 -2 -70
7364 -70 -23 -3 16 -5 35 -4 -9 -28 22 10 -5 -27 -2 -76 -12 -3 32 36 19 7 19 28 -13 -42 19 -44 48 1 -16 11 -13 26
7396 26 46 3 -28 -39 11 14 43 17 52 57 -57 -5 -27 1 -9 44 15 32 46 -19 14 -30 -13 10 80 -14 76 33 39 -3 24
7427 24 25 18 42 -19 -17 27 -2 -18 12 6 8 12 48 -47 65 -22 -40 48 11 -55 -49 41 23 97 53 -33 -47 7 -40 -15 96 48 45
7460 45 -17 -3 72 11 41 31 33 -8 -34 20 20 54 21 -14 60 -12 -37 -70 45 -4 -20 -28 -16 -28 62 -24 2 -29 -34 -5 24 23
$$ packed form
7228a0J9L0m9PRJ3rl1J3j0M2j3P5o3oL3pj9j8Rk6L5oN1m2n1Q8m7jj0k1J0JL4l1
7263al8M8K0o3K9k3K1M4n3J1n6N2K4k4%M7rj1m7J1j6M5mk1J8k6J9M0n8K3Oj6k0
7296b8j0Pm0N5K2m6Q2p5J2Q3m1L2l3j5p4O0J2qmL7m7J7K1L1o0lpOK7p7M8N8m1
7329Apn1M5lM4n0M4l9l1M8n2O4Km7J3ooR8k1m9lK8m1Q0o4ql3MM7l2j7l0P9ro8
7364g0M7K0J9k1M0l9nj9N0j2j5k2K5p4O4RL5Mj7j2J2Rm1k9O1o3R2m7j7K7k4L9
7396B6K0m3l1j1N0LK9k6L5Nj14N2k2K8j0N3k9J7J4o5L3m4J7K3P0r4R0m3Om2K7
7427B4JpK4o1KM4k9j6L0oKML6r5J12q7j8Q8l7o6OR0j8P4m4q6j4N4m7K5J11m8l
7460D5o2J4P5o1L0j0Km1k6N4%L4l3l5P4p2k5l3J15m9j6qJ2j2R0q6K6l1nK9K9j
$$ plain form
7492 23 -20 -3 -6 43 2 -37 19 8 30 14 26 -27 35 -12 7 23 -29 7 -14 4 0 -15 -23 24 3 16 -19 -41 -22 -54 18 -23
7524 -23 -59 11 -64 -14 -28 27 -6 -21 9 -27 -3 21 -29 1 4 2 45 2 1 -26 54 8 -24 -28 20 8 40 15 54 11 0 71
7556 71 -42 10 37 76 85 -1 24 4 15 4 8 -14 40 37 5 0 25 -52 -14 -4 3 -9 7 31 31 -2 -17 -25 -40 -2 2 -32 31 -47
7590 -47 -14 -113 -33 0 19 71 -46 -76 -21 -73 -9 12 49 6 45 -44 35 66 -22 20 64 5 -10 12 -26 25 -62 -37 -28 -58
7620 -58 -43 9 -3 57 36 40 20 9 -14 19 48 33 -4 -31 60 10 -9 4 30 45 11 8 77 -1 -47 -7 12 -31 -9 11 25
7651 25 -1 34 12 -16 -13 -4 -7 -13 2 -61 7 14 3 -32 46 -16 -4 26 3 -46 18 1 18 -34 -74 -39 38 21 20 -27 21 -23 31
7684 31 0 -36 -21 -36 5 60 -33 -13 24 -27 -25 -68 9 -14 -36 -24 18 13 -10 -12 19 74 -43 43 -78 51 -1 25 -12 15
7714 15 -16 1 88 -15 -49 -45 -14 -41 -49 -23 -7 0 -6 29 9 21 12 29 45 48 -18 23 -5 29 6 1 70 9 -52 -20 -62 -29 -25 5
$$ packed form
7492B3m3J7lM9m1l9N6j1K2j6J2n3O2m7J9J6n2L6k1J8mj5qM7k1J3l5k2J9l2P2m1
7524b3l6P0p5N0j4N5l3j5L0l6K4K4n0L0LkM3m3jk7Q0m6l2mM8j2L2k5L9m3j1P1
7556G1j13N2K7L9Rq6K5k0J1j1Mk2N4ll2nK5p7L8J0Pj2J6K4%l3j5qj5L8Ml4O3p8
7590d7L3r9Q0L3J9N2j17l0N5n2O4K1L7m3L9q9P9L1q8M2M4n9j5K2l8N1q7K5Rl0
7620e8J5N2j2O0k1Mk0j1k3L3K9j5l7k7R1n0j9J3K6J5l4lO9p8m6M0J9m3K2K0J4
7651B5k6L5k2k8LRloJ5o3O8Pj1l5P8o2J2L0k3m9O4j7J7n2m0L5P7j7jm7M8m4N4
7684C1l1l6J5j5M1N5r3K0L7n1Km3P7k3k2J2M2nk3kL1N5j17Q6j21J29n2K6l7K7
7714A5l1J7Q7j03l4ML1k7qK6J6PoL5k0J2rJ7J6Lo6M1k8L4k3nO9o1o1L2m2L3ML0
$$ plain form
7748 5 12 14 18 22 -13 25 88 8 16 23 -64 -19 -21 -48 -26 -35 -29 -11 0 -30 -1 -35 -3 34 -35 -45 -78 3 -19 24 -45 -20 -9 8 -20
7783 -20 -13 33 6 -56 24 66 6 77 -7 38 -3 -26 -10 -22 65 -51 -20 -39 54 58 -13 1 18 28 38 44 93 -38 29 -46 -78
7814 -78 18 -37 10 -8 -37 -4 -31 33 -7 -32 -15 25 6 -34 -29 -28 -19 -53 -32 28 38 18 20 33 27 54 -14 -15 -58 -21 -34 -14 30
7847 30 16 -23 8 -47 -12 -4 51 -85 -31 16 5 1 5 -78 9 -37 44 29 -49 -2 -52 28 5 13 10 24 29 4 12 7 -20 -56 70
7880 70 -8 50 -18 34 4 -4 90 -16 27 17 3 -20 -30 2 -39 -33 22 -64 -32 35 5 34 8 -18 -4 65 -37 2 31 -72
7910 -72 -42 20 29 -26 59 67 -11 10 24 38 -40 -35 -100 -3 29 -20 -39 46 -11 -3 67 -31 -25 2 54 -22 -9 55 -3 28 31 41 -2
7943 -2 81 -45 7 -5 -19 -10 20 -2 17 -11 -7 5 -26 -47 12 -29 -43 -34 6 43 36 -33 -42 -36 9 12 9 -20 -7 4 42 -61 16 -12
7977 -12 -25 -39 -1 10 23 -45 0 -25 11 3 -9 31 4 36 47 -28 -8 44 -21 -47 37 -31 -2 -26 -37 -1 -47 -11 13 -19 -21
$$ packed form
7748EPKMMl5L8O3q0QPq7M5kk7K2rOJ8J1l0K9l4L2L7o9j0l3Q1k2M3o9K5J1J7k8
7783b0PM6k7o2Q0M2o0P1q4M5m1k3J6j2Q7j16L1j9R3Mp1J4J7J0J0OM9j31O7p5l2
7814g8R6n5M7j8k9L3k7O4m0k5J7M0j9m0NJRl4K1O0J0k0KJ3oK7o8jm3L7j3K0M4
7847C0j4l9L1n5L5QN5j36N4M7j1mMq3Q7m6Q1j5p8M7n0Q0k3QlJ4Nk5Qnk7l6J26
7880G0p8N8o8N2l0qR4j06M3j0j4k3j0L2m1ON5q6L2O7l0K9k6k6J4O9j02L9K9j03
7910g2L0O2Rn5Q5Qp8K1J4J4p8No5R7L2m9j9Q5n7QP0r8OK7N2p6J3O4n8L1LJ0m3
7943bQ3j26N2j2j4RL0k2J9k8MJ2l1k1N9m1j4RM0L7po9rOM5Llk9J3J1L8j03P7k8
7977a2j3j4L8J1J3o8M5k5L6qj2M0k7L2J1p5K0N2o5k6Q4o8K9k4j1L6m6L6K4l2k
$$ plain form
8008 -21 -88 -4 24 16 31 29 65 -70 -63 -25 17 27 -2 13 49 -14 -23 -30 -47 46 44 17 6 -15 -37 -10 -32 -81 60 -47 -9 42
$$ packed form
8008b1o7Q4K8qJ5kL6j35PL8M2J0k9J5L6o3rpj7R3kk7j1k1k2K7k2m9J41j07L8N1
$$ [...]
8191e0
##END NTUPLES=NMR FID
##END=
