##TITLE=1H_LY-805.1
 CCl4, 8 sc, 
 1.4.2019
##JCAMPDX= 6.0         $$ Bruker NMR JCAMP-DX V2.0
##DATA TYPE= NMR FID
##DATA CLASS= NTUPLES
##ORIGIN= UXNMR, Bruker Analytische Messtechnik GmbH
##OWNER= root
$$ XWIN-NMR		Version 3.5
$$ Mon Apr  1 14:38:24 2019 Russian Standard Time (UT+4h)  she@DPX200
##.OBSERVE FREQUENCY= 200.1316
##.OBSERVE NUCLEUS= ^1H
##.DELAY= (6, 6)
##.ACQUISITION MODE= SIMULTANEOUS
##.ACQUISITION SCHEME= undefined
##.AVERAGES= 8
##.DIGITISER RES= 18
##SPECTROMETER/DATA SYSTEM= spect
##.PULSE SEQUENCE= zg30
##.SOLVENT NAME= CDCl3
##.SHIFT REFERENCE= (INTERNAL, CDCl3, 0, 15.7039)
##AUDIT TRAIL= $$ (NUMBER, WHEN, WHO, WHERE, WHAT)
$$ ##TITLE= Audit trail, XWIN-NMR		Version 3.5
$$ ##JCAMPDX= 5.01
$$ ##ORIGIN= Bruker BioSpin GmbH
$$ ##OWNER= she
$$ F:/spectra/data/she/nmr/H-F/1/audita.txt
$$ ##AUDIT TRAIL=  $$ (NUMBER, WHEN, WHO, WHERE, WHAT)
(   1,<2019-04-01 14:37:14.23 +0400>,<she>,<DPX200>,
      <created by zg, POWCHK disabled, PULCHK disabled
       configuration hash MD5:
       00 E9 B6 7A A2 85 ED C7 34 08 36 98 17 FE 4E 26
       data hash MD5: 16K
       2D C6 E6 3B 53 6C 46 BF 8F E7 A2 8A 9F F4 70 BC>)
$$ ##END=
$$ 
$$ hash MD5
$$ 57 1E F5 25 C0 52 7D 3E 89 22 6F DA 57 9B 90 02
##$RELAX= 
##$RELAX= 
##$RELAX= 
##$RELAX= 
##$RELAX= 
##$RELAX= 
$$ Bruker specific parameters
$$ --------------------------
##$DU= <F:/spectra>
##$EXPNO= 1
##$NAME= <H-F>
##$PROCNO= 1
##$TYPE= <nmr>
##$USER= <she>
##$AMP= (0..31)
100 100 100 100 100 100 100 100 100 100 100 100 100 100 100 100 100 100 
100 100 100 100 100 100 100 100 100 100 100 100 100 100 
##$AQSEQ= 0
##$AQ_mod= 1
##$AUNM= <au_zg>
##$AUTOPOS= <>
##$BF1= 200.13
##$BF2= 200.13
##$BF3= 200.13
##$BF4= 200.13
##$BF5= 200.13
##$BF6= 200.13
##$BF7= 200.13
##$BF8= 200.13
##$BYTORDA= 1
##$CFDGTYP= 0
##$CFRGTYP= 5
##$CHEMSTR= <none>
##$CNST= (0..31)
1 1 145 1 1 1 1 1 1 1 1 1 1 1 1 1 1 1 1 1 1 1 1 1 1 1 1 1 1 1 1 1 
##$CPDPRG= <>
##$CPDPRG1= <>
##$CPDPRG2= <>
##$CPDPRG3= <>
##$CPDPRG4= <mlev>
##$CPDPRG5= <mlev>
##$CPDPRG6= <mlev>
##$CPDPRG7= <mlev>
##$CPDPRG8= <mlev>
##$CPDPRGB= <>
##$CPDPRGT= <>
##$D= (0..31)
0 1.2 0 0 0 0 0 0 0 0 0 0.03 0 0 0 0 0 0 0 0 0 0 0 0 0 0 0 0 0 0 0 0 
##$DATE= 1554115033
##$DBL= (0..7)
120 120 120 120 120 120 120 120 
##$DBP= (0..7)
150 150 150 150 150 150 150 150 
##$DBP07= 0
##$DBPNAM0= <>
##$DBPNAM1= <>
##$DBPNAM2= <>
##$DBPNAM3= <>
##$DBPNAM4= <>
##$DBPNAM5= <>
##$DBPNAM6= <>
##$DBPNAM7= <>
##$DBPOAL= (0..7)
0.5 0.5 0.5 0.5 0.5 0.5 0.5 0.5 
##$DBPOFFS= (0..7)
0 0 0 0 0 0 0 0 
##$DE= 6
##$DECBNUC= <off>
##$DECIM= 24
##$DECNUC= <off>
##$DECSTAT= 4
##$DIGMOD= 1
##$DIGTYP= 9
##$DL= (0..7)
0 120 120 120 120 120 120 120 
##$DP= (0..7)
150 150 150 150 150 150 150 150 
##$DP07= 0
##$DPNAME0= <>
##$DPNAME1= <>
##$DPNAME2= <>
##$DPNAME3= <>
##$DPNAME4= <>
##$DPNAME5= <>
##$DPNAME6= <>
##$DPNAME7= <>
##$DPOAL= (0..7)
0.5 0.5 0.5 0.5 0.5 0.5 0.5 0.5 
##$DPOFFS= (0..7)
0 0 0 0 0 0 0 0 
##$DQDMODE= 0
##$DR= 18
##$DS= 0
##$DSLIST= <SSSSSSSSSSSSSSS>
##$DSPFIRM= 0
$$ [...]
##$SUBNAM2= <"">
##$SUBNAM3= <"">
##$SUBNAM4= <"">
##$SUBNAM5= <"">
##$SUBNAM6= <"">
##$SUBNAM7= <"">
##$SUBNAM8= <"">
##$SUBNAM9= <"">
##$SW= 24.9336934301222
##$SWIBOX= (0..15)
0 0 2 0 0 0 0 0 0 0 0 0 0 0 0 0 
##$SW_h= 4990.01996007984
##$TD= 16384
##$TD0= 1
##$TE= 0
##$TE2= 300
##$TE3= 300
##$TEG= 300
##$TL= (0..7)
0 120 120 120 120 120 120 120 
##$TP= (0..7)
150 150 150 150 150 150 150 150 
##$TP07= 0
##$TPNAME0= <>
##$TPNAME1= <>
##$TPNAME2= <>
##$TPNAME3= <>
##$TPNAME4= <>
##$TPNAME5= <>
##$TPNAME6= <>
##$TPNAME7= <>
##$TPOAL= (0..7)
0.5 0.5 0.5 0.5 0.5 0.5 0.5 0.5 
##$TPOFFS= (0..7)
0 0 0 0 0 0 0 0 
##$TUNHIN= 0
##$TUNHOUT= 0
##$TUNXOUT= 0
##$USERA1= <user>
##$USERA2= <user>
##$USERA3= <user>
##$USERA4= <user>
##$USERA5= <user>
##$V9= 5
##$VALIST= <valist>
##$VCLIST= <CCCCCCCCCCCCCCC>
##$VD= 0
##$VDLIST= <DDDDDDDDDDDDDDD>
##$VPLIST= <PPPPPPPPPPPPPPP>
##$VTLIST= <TTTTTTTTTTTTTTT>
##$WBST= 1024
##$WBSW= 4
##$XGAIN= (0..3)
0 0 0 0 
##$XL= 0
##$YL= 0
##$YMAX_a= 282423
##$YMIN_a= -226121
##$ZGOPTNS= <>
##$ZL1= 120
##$ZL2= 120
##$ZL3= 120
##$ZL4= 120
##$ABSF1= 10
##$ABSF2= 0
##$ABSG= 5
##$ABSL= 3
##$ALPHA= 0
##$AQORDER= 0
##$ASSFAC= 0
##$ASSFACI= 0
##$ASSFACX= 0
##$ASSWID= 0
##$AUNMP= <proc_1d>
##$AZFE= 0.1
##$AZFW= 0.1
##$BCFW= 1
##$BC_mod= 2
##$BYTORDP= 1
##$COROFFS= 0
##$CY= 11.3945322036743
##$DATMOD= 1
##$DC= 2
##$DFILT= <>
##$DTYPP= 0
##$F1P= 18.9103706918063
##$F2P= -1.10871071338519
##$FCOR= 0.5
##$FTSIZE= 0
##$FT_mod= 4
##$GAMMA= 1
##$GB= 0.15
##$INTBC= 1
##$INTSCL= 1
##$ISEN= 128
##$LB= 0.24
##$LEV0= 0
##$LPBIN= 0
##$MAXI= 10000
##$MC2= 0
##$MEAN= 0
##$ME_mod= 0
##$MI= 1.114404
##$NCOEF= 0
##$NC_proc= 0
##$NLEV= 6
##$NOISF1= 3.799351
##$NOISF2= 2.8
##$NSP= 1
##$NTH_PI= 0
##$NZP= 0
##$OFFSET= 15.70392
##$PC= 1
##$PHC0= -9367.43
##$PHC1= 11.80026
##$PH_mod= 1
##$PKNL= yes
##$PPARMOD= 0
##$PSCAL= 0
##$PSIGN= 0
##$REVERSE= no
##$SF= 200.130013532006
##$SI= 16384
##$SIGF1= 3
##$SIGF2= 2
##$SINO= 400
##$SIOLD= 16384
##$SREGLST= <1H.CDCl3>
##$SSB= 0
##$STSI= 0
##$STSR= 0
##$SW_p= 3612.71676300578
##$SYMM= 0
##$S_DEV= 0
##$TDeff= 0
##$TDoff= 0
##$TI= <>
##$TILT= no
##$TM1= 0
##$TM2= 0
##$TOPLEV= 0
##$USERP1= <user>
##$USERP2= <user>
##$USERP3= <user>
##$USERP4= <user>
##$USERP5= <user>
##$WDW= 1
##$XDIM= 8192
##$YMAX_p= 0
##$YMIN_p= 0
$$ End of Bruker specific parameters
$$ ---------------------------------
##NTUPLES= NMR FID
##VAR_NAME=  TIME,          FID/REAL,        FID/IMAG
##SYMBOL=    X,             R,               I
##VAR_TYPE=  INDEPENDENT,   DEPENDENT,       DEPENDENT
##VAR_FORM=  AFFN,          ASDF,            ASDF
##VAR_DIM=   8192,          8192,            8192
##UNITS=     SECONDS,       ARBITRARY UNITS, ARBITRARY UNITS
##FACTOR=    0.0002004,     1,               1
##FIRST=     0,             0,               0
##LAST=      1.6414764,     0,               0
##MIN=       0,             -226121,         0
##MAX=       1.6414764,     282423,          0
$$ Real data points
##PAGE= N=1
##DATA TABLE= (X++(R..R)), XYDATA
0 0 0 0 0 0 -8 8 -8 8 -8 16 -24 24 -32 40 -48 57 -72 82 -97 114 -137 157 -185 211 -243 277 -316 361
28 361 -409 462 -520 584 -656 733 -817 910 -1012 1124 -1249 1382 -1531 1695 -1878 2078
44 2078 -2303 2552 -2833 3157 -3529 3957 -4464 5067 -5809 6740 -7952 9594 -11960 15672
58 15672 -22354 38039 -143575 -942 232128 -167810 66892 144482 -226121 -48325 196686
69 196686 -82266 -9471 95167 -110114 -27742 103325 -47533 -3240 24665 -61412 48370
80 48370 61160 -85261 -11074 26543 -33577 54486 62041 -76849 -63623 29663 38019 5187
92 5187 21939 15305 -91215 -45736 127074 9053 -87962 80683 -19656 -124827 134344
103 134344 55209 -167597 70326 79584 -127989 70636 64617 -156055 43097 96132 -79053
114 -79053 53748 14866 -142327 66942 73830 -69357 85246 -16283 -169367 107386 87128
125 87128 -116344 82272 33209 -176212 72368 117514 -117301 19995 76219 -108098 3996
136 3996 97180 -53467 -38736 44546 -163 -8924 10700 -6468 -24294 -6843 48171 16890
148 16890 -50334 197 9058 -25577 44145 23347 -52007 6530 -1736 -21189 64346 -9871
160 -9871 -64550 55668 -10601 -51177 95068 -23271 -104605 104680 19955 -107425 89626
171 89626 17044 -128261 87215 63638 -111499 43949 41494 -100346 47988 67399 -73220
182 -73220 7463 23601 -47148 37746 24191 -47445 20702 3692 -32036 41237 972 -42370
194 -42370 33029 5490 -33425 28449 6979 -32861 11594 18432 -5933 -10108 -4840 11556 -4399
207 -4399 -3121 28114 -25810 -33752 53177 2816 -43975 41536 -5317 -54974 53048 20361
219 20361 -52105 29725 1520 -46605 47927 16289 -45244 24449 -6922 -28925 54520 -8373
231 -8373 -47976 45278 -7725 -38737 58965 -8177 -58303 49665 8551 -46407 43911 5465
243 5465 -57177 30182 29560 -29355 7637 2641 -24782 15869 19816 -8761 -9477 -8759 5133 11850
257 11850 -2491 3733 -6051 -19084 14613 16274 -9472 567 -11032 -12238 27023 7668 -16540
270 -16540 3393 -16380 -3793 40492 -9756 -27263 21188 -16059 -14129 49901 -8029 -40775
282 -40775 24270 -4675 -18197 45078 -4088 -45795 19586 10734 -12654 24759 -7744 -30299
294 -30299 18554 7902 -7712 15855 -12538 -19355 19376 4155 -4360 11713 -17431 -14919 24652
307 24652 7733 -11162 -380 -8914 -3071 17416 5841 -10049 -9465 -1944 8422 6014 2292
320 2292 -762 -17301 -5215 21964 5145 -7576 -740 -16281 -1640 28199 -101 -16146 1814
333 1814 -9553 354 24721 -4504 -14866 4355 -10092 2009 26403 -8478 -19416 6271
345 6271 -3900 4773 22541 -14430 -21529 12255 4041 328 13179 -11202 -16872 9575 6740
358 6740 2228 6826 -11631 -13722 8645 11299 3741 -3678 -13638 -4046 11919 8564 -1334 -8307
372 -8307 -8033 2961 8747 5483 -1931 -10910 -5761 7350 8700 5132 -5699 -17053 -172 16925
386 16925 5428 -3100 -7578 -13573 5896 18680 -984 -7509 -4488 -10146 6380 18657 -2116
399 -2116 -10941 -5951 -6037 11405 18029 -8346 -16196 -1964 3487 11551 9265 -12154 -13110 2824 6729
414 6729 8227 4104 -11269 -11811 3290 11446 8380 -3606 -13802 -7047 8698 14040 2183 -12604
428 -12604 -10062 3012 9458 8399 -2038 -13087 -5649 6677 8366 6422 -4619 -15567 -2594
441 -2594 12926 8917 -169 -10633 -12870 6187 15814 2290 -7032 -9351 -5566 9615 11722 -1953
455 -1953 -7350 -8108 -2850 12268 10704 -5891 -10759 -6642 4215 15220 3801 -12791 -8485 1173
469 1173 7642 9889 -2548 -11446 -3576 3462 7182 6654 -5273 -10530 -2001 5995 10015 2367 -12191
484 -12191 -7906 5576 7866 5388 -4017 -12229 -160 9103 2872 1295 -3718 -10030 2218 9411
498 9411 1500 -396 -5900 -9197 7238 11364 -2894 -5431 -4898 -2562 10616 6243 -8903 -4243
512 -4243 675 36 6955 2701 -7415 -3190 570 2816 6939 -1461 -8250 -1949 2605 7017 4232
527 4232 -9500 -5981 5544 2184 3092 2075 -9560 -1743 7695 -2134 1099 3931 -8867 -1053
541 -1053 8522 -2271 -560 343 -7991 5778 9829 -8491 -4006 2114 -3718 8958 6624 -13509
555 -13509 -2615 6179 -4016 6231 6931 -11338 -3789 4827 -1325 5783 2782 -10223 -843 6019
569 6019 700 1023 -5110 -4532 8956 3673 -4824 -999 -5977 -1205 12401 2395 -5756 -2154 -8070
584 -8070 49 14014 3439 -4823 -6578 -9431 7585 12693 -5607 -2140 -19 -9127 8231 8598
598 8598 -13841 1908 9465 -9824 5004 8046 -17762 -1562 14520 -1571 4389 467 -20859
611 -20859 -311 16914 3634 3595 -7120 -18418 6551 11899 -1486 7602 -4540 -18280 7738
624 7738 10150 -5731 5048 -1380 -11668 9347 7758 -10533 -3784 1576 4835 10043 -4553 -11044
638 -11044 -3237 -1562 12830 14117 -12044 -10729 -680 -7269 13398 20393 -13642 -14069 1933 -3468
652 -3468 10269 12215 -12456 -5142 4082 -4342 6975 1531 -12020 9137 5922 -10773 8718
665 8718 -2177 -20401 15395 16828 -12391 2335 -4285 -21413 15776 22371 -10245 -5106 -4227
678 -4227 -11798 10673 12228 -2881 -363 -9372 -6589 12732 980 -3694 6542 -9964 -3320 17346
692 17346 -7502 -13100 10673 964 -507 9785 -10583 -11052 7468 3144 7051 4623 -14354 -3960
706 -3960 2969 -3088 16849 6002 -23928 731 10235 -9520 11173 8426 -21097 2887 12946
719 12946 -11476 2384 7130 -10023 3703 5425 -6050 3726 -4778 -6485 15259 211 -9744
732 -9744 7804 -9614 -8076 23527 -1117 -17233 10963 -2811 -11341 16649 2286 -12186 6223
745 6223 -2499 -5341 10271 -1578 -4096 3417 -6927 4771 8816 -14160 1123 11992 -11950
758 -11950 2261 11585 -15031 149 13437 -10909 177 10446 -10497 -1366 6406 -4411 5714
771 5714 -376 -10507 9250 1076 -9558 12295 -2267 -13895 15681 201 -16562 15604 3144
784 3144 -18006 10957 5444 -12243 8322 1475 -10100 7917 1001 -5500 5674 -4577 -704
797 -704 8784 -10210 -368 13381 -12087 -3365 14504 -10401 -2887 13947 -11441 -4287 14302
810 14302 -7691 -4198 9337 -6157 -507 4979 -7309 5159 4218 -11144 6177 4280 -10694
823 -10694 9138 2385 -15114 11024 7124 -15361 6193 5818 -11343 7174 4825 -9400 4799
836 4799 -570 -6614 9656 -242 -5241 6243 -9037 -3114 17188 -7035 -8824 13075 -8166
849 -8166 -7356 16468 -5896 -8579 13963 -5720 -8817 11627 -3271 -5633 8463 -2894 -918
862 -918 4170 -9882 1096 9956 -4761 2581 1737 -13863 4664 10362 -7822 4181 4873 -13117
876 -13117 700 6546 -3539 6452 1177 -9875 3604 534 -4654 8524 -1237 -4996 9444
889 9444 -7085 -10220 13108 284 -5975 11557 -5680 -12140 9658 -733 -3948 13472 -3066
902 -3066 -11860 3605 -2095 1203 11472 -5246 -5191 4645 -8210 -545 11388 -3996 -80 5697
916 5697 -11968 -2455 10705 -4222 758 8245 -7381 -4255 2397 -4595 5515 8629 -5140 -2966
930 -2966 -2497 -5198 7005 4897 -2996 4375 -3832 -10589 5111 4604 -694 6715 -3591 -9247 3785
945 3785 -343 -1714 9032 45 -4704 902 -7634 -910 12318 -926 -2970 4081 -9225 -4105
959 -4105 10076 -1418 586 8093 -9928 -7832 8468 -265 -98 7445 -5205 -4940 3940 -4102
973 -4102 -485 8483 -395 -2706 -578 -5594 778 5937 -415 1277 917 -5990 -1867 2081 1656 5037
989 5037 -226 -5889 -253 199 -342 4150 -525 -1368 3168 -4445 -4137 5644 433 -714 4727 -4402
1005 -4402 -4799 4475 -1853 -756 8555 -1952 -7248 1269 -1133 963 7378 -2322 -5210 2152 -1873
1020 -1873 -1139 5227 -53 -1685 984 -3747 -643 4737 -1077 -1514 1938 -1388 -331 836 -2675
1035 -2675 1396 3836 -1793 -1877 -138 -1107 1914 1526 -1327 885 -695 -2858 1590 1957 16 683
1051 683 -2779 -1910 4057 592 -2491 810 -797 -135 3046 -2089 -2064 3089 -1386 -1341 3849 -1142 -2448
1068 -2448 1660 -1818 429 5048 -3138 -4264 3367 490 -658 2848 -2700 -2667 3859 -293 -2173
1083 -2173 3006 -357 -3236 1251 1246 -165 901 -1375 -1909 1734 2035 -1028 -2022 451 1615 -566
1099 -566 -457 789 -1114 286 1689 -2209 -248 2845 -2625 -1252 4254 -980 -2338 1744 -2172
1114 -2172 161 5274 -2803 -4168 3738 -80 -1789 3581 -1248 -2933 2918 -935 -2064 4301 -216
1129 -216 -4267 1271 1366 -475 1669 -1230 -2506 2234 1412 -1757 -286 519 -195 -113 111 418 103 -417
1147 -417 -570 -327 1628 1100 -2473 -758 2185 -257 -254 414 -2049 1080 2407 -2935 -330 2877 -2252
1164 -2252 -427 2401 -2322 542 2422 -4003 451 4785 -3477 -1877 3234 -2176 635 3578 -4383
1179 -4383 -1182 4755 -2540 -1635 3938 -1955 -1865 2779 -1620 -613 3682 -1971 -3215 2718 1515 -1546
1195 -1546 26 27 -881 851 1132 -1594 -594 2539 -1057 -2791 2996 1145 -3603 1787 933 -3278
1211 -3278 3561 1172 -6141 3304 3870 -6028 1594 3569 -5314 2428 3521 -6734 2354 5355 -6807
1226 -6807 620 5497 -5109 189 4020 -5052 1450 4941 -5812 -834 5005 -2721 -428 2711
1240 2711 -3316 135 3074 -2596 -295 2827 -1431 -1725 622 831 683 -404 -650 -504 64 2117
1256 2117 -834 -2481 3166 348 -3898 2960 914 -3681 3824 -299 -5466 5888 1253 -7443 5060
1271 5060 2305 -6790 5306 1143 -8002 7038 2723 -9846 5924 4203 -9061 4845 3523
1284 3523 -8749 5507 3905 -9572 4487 5499 -8284 2171 4331 -6062 2944 3471 -6595
1297 -6595 1826 4432 -4410 -33 2870 -1884 -110 935 -938 210 872 4 -1944 -221 3758
1312 3758 -1580 -3479 4222 -604 -3707 5535 -1687 -5466 7653 -1213 -7879 8943 786 -9187
1326 -9187 7380 471 -8425 9566 519 -11183 9068 2345 -10789 8246 2454 -9970 8032
1339 8032 1270 -10651 8984 3113 -10744 6546 3074 -8830 6161 2206 -8379 6289 2972
1352 2972 -8585 3429 3632 -4716 2267 1488 -3619 1869 1093 -2171 706 1013 322 -1658 -1541 3397
1368 3397 -70 -2831 3103 -1507 -2556 6072 -2689 -5016 7807 -2236 -6548 8668 -1799 -6609
1382 -6609 9526 -3574 -8179 12294 -2269 -10653 11790 -757 -10371 11286 -1487 -10905 12646
1395 12646 399 -12297 10112 1316 -10947 9053 1894 -9004 8017 153 -9923 7576
1407 7576 3236 -6867 4269 349 -5589 4272 788 -3614 3922 816 -3625 -221 198 1188 986
1422 986 -591 1353 -2074 -2362 3329 -1887 -334 7764 -4876 -7101 7118 -2040 -3268 10568 -3993
1437 -3993 -7958 8866 -4588 -6732 13857 -1256 -9292 8419 -4653 -7881 13282 -1384 -7880
1450 -7880 11254 -4295 -11199 10243 -95 -5237 11835 -3961 -11587 8432 -509 -5922 11107
1463 11107 904 -8914 2977 -2444 -4167 9323 2903 -5111 249 -2307 -2845 2825 2615 2602 321
1478 321 -4208 -2189 -1852 1370 7237 -382 -3471 2178 -6114 -4038 9101 1123 -691 5601 -9860
1493 -9860 -7427 10907 -674 -1658 10804 -7833 -9903 8545 -3843 -2079 15730 -4674 -11516
1506 -11516 7264 -4573 -5127 14355 -359 -7226 6667 -7038 -8948 11686 3701 -3030 5211
1519 5211 -6484 -8527 6160 1819 594 7310 -3267 -7989 -521 -270 3657 6669 -1117 -3575
1533 -3575 -2894 -3273 2077 3095 2576 3978 -4892 -7065 2015 33 2185 8452 -3646 -6067 2582
1548 2582 -5880 -1406 12782 -122 -5235 2771 -8499 -3815 12534 -317 -3134 6892 -8025
1561 -8025 -7735 8780 -445 -76 9477 -7253 -8281 6718 -2539 -1522 10428 -2323 -5737 2805
1575 2805 -5823 -1878 10467 636 -3516 1087 -5368 -2334 5506 1162 1605 1806 -5595 -3238 1397
1590 1397 1473 4472 439 -3828 413 -1955 -2347 4756 1158 -608 2994 -5292 -4371 6024 -132 -910
1606 -910 5833 -4197 -4924 4474 -2951 -446 9096 -3577 -6072 4210 -2899 -1346 7807 -2878
1620 -2878 -3357 5034 -4600 -3500 6998 -871 -1756 3843 -4463 -2148 5041 -2448 -664 4674 -2864
1635 -2864 -1917 1725 -2713 1843 3895 -3586 -717 1535 -2668 1618 1734 -2282 2054 -233 -4157
1650 -4157 2757 1666 -2285 2046 -1220 -2679 4100 -695 -3237 3707 -554 -2620 3220 -1660 -1807
1665 -1807 4443 -2348 -2786 4479 -1490 -2217 3599 -2157 -1004 4002 -3563 -1553 5068 -1997 -1684 2792
1681 2792 -3064 4 4142 -3127 -519 3481 -3381 -787 3029 -1957 999 1940 -4151 690 2861
1696 2861 -2739 650 1673 -2250 1514 153 -3481 2737 1983 -2645 1421 -191 -2647 2649 -13
1711 -13 -2132 3570 -627 -3791 2086 3 -899 3425 -1896 -2677 3268 -1200 -2051 3440 -577 -1244
1727 -1244 1874 -2841 -687 4114 -1481 -1217 2241 -2208 -291 2057 -2426 1167 2783 -3523 -513
1742 -513 2185 -2005 1424 1454 -3410 1545 1793 -3846 1344 2450 -2507 1273 454 -3275 2600 1545
1758 1545 -3539 1642 1470 -2541 1446 241 -2179 2570 266 -2823 1813 547 -1587 1177 -658
1773 -658 -587 2250 -1461 -1570 2067 -393 -286 1136 -1955 527 1903 -2707 271 2386 -2027 334
1789 334 1063 -2677 1983 2013 -3770 1002 2227 -2866 1207 1413 -2922 2033 1098 -3931 2073 2458 -3039
1806 -3039 848 660 -2403 2520 734 -3135 2075 888 -2758 1373 394 -1245 2127 -895 -2294
1821 -2294 2329 194 -1387 1451 -636 -601 1457 -1810 -310 2758 -1070 -927 749 -1467 1103 1574
1837 1574 -2472 769 1660 -2560 589 1340 -1781 1755 457 -3390 2165 1796 -2945 1222 746 -2177
1853 -2177 2273 74 -3017 2701 843 -3069 1897 610 -1963 2006 -711 -2098 3173 -147 -2649
1868 -2649 1718 -197 -984 2116 -1314 -860 2554 -1471 -1349 1827 -686 408 1133 -2646 810 2086
1884 2086 -2499 590 1784 -2343 1083 720 -3121 2539 1885 -3871 1203 1493 -2629 2196 756 -3407
1900 -3407 2577 916 -3727 2133 1507 -2451 1644 -260 -2300 3074 224 -2867 2002 167 -1590
1915 -1590 1789 -848 -753 2343 -1700 -1291 2280 -770 -3 1071 -2565 970 2154 -2980 722 2121
1931 2121 -2857 1116 1127 -3277 2888 1589 -4883 2019 2347 -3693 2313 1162 -4282 3134 1406 -4819
1947 -4819 3117 2003 -4423 2216 888 -3420 3649 494 -4535 3022 1165 -3380 2510 175 -2429
1962 -2429 2913 -783 -2691 3322 -69 -2252 1789 -959 -499 2367 -1982 -500 2418 -1913 -138
1977 -138 1404 -1988 1790 1066 -4014 1867 2077 -3112 2222 629 -3818 3356 526 -4403 4346 1080
1993 1080 -5287 3245 590 -3783 5028 -388 -5638 4912 591 -4950 4659 93 -4642 4621 -704
2008 -704 -4490 5571 -104 -5018 4155 89 -3192 3827 -1399 -3036 4584 -656 -3031 2904 -994
2023 -994 -1356 2668 -1615 -370 2466 -2615 -428 2107 -1513 1441 522 -3524 2426 1222 -3600 2770
2039 2770 874 -3145 3433 -1047 -4339 5280 361 -4473 4756 -972 -5003 5068 -690 -3402 6865
2054 6865 -2156 -6625 5534 -216 -3057 6468 -2506 -5398 5754 -1818 -3607 6979 -1249 -4587
2068 -4587 4175 -2405 -2238 6061 -2238 -3018 4621 -2132 -2408 3297 -2001 173 3898 -3210 -1429 2048
2084 2048 -2255 1182 2444 -2007 1161 -641 -4099 3028 2124 -1805 2442 -2119 -3647 4576 -747
2099 -747 -2793 5629 -1702 -4230 4415 -2656 -2512 7322 -2457 -3937 6063 -3791 -4404 7073 -1601
2114 -1601 -1892 6479 -5837 -5146 7527 -1371 -1709 6293 -4759 -4298 5362 -2684 -374 7076 -4139
2129 -4139 -4129 3704 -2428 310 4874 -3395 -1004 3032 -3466 -410 2821 -1454 1808 779 -3726
2144 -3726 1163 454 -2048 3412 530 -2283 1884 -3080 -2076 6066 -633 -2556 3259 -3913 -2041
2159 -2041 6072 -2746 -1405 5976 -4811 -3228 5918 -3380 -970 6388 -5059 -1899 6339 -5388
2173 -5388 -2103 7354 -3274 -1279 4866 -6292 -1375 7143 -3558 -863 5056 -5342 -1875 4743
2187 4743 -2755 1144 4121 -5328 -1381 3681 -1911 1175 2043 -3386 940 1181 -2853 2078 1302 -2061
2203 -2061 1640 -956 -1740 3137 -1452 -1824 3701 -1502 -1531 2892 -3259 -207 5080 -3762 -1448 4507
2219 4507 -3928 -496 4903 -4452 39 5171 -5712 -497 6046 -4641 -618 4878 -5060 364
2233 364 5133 -5591 12 5484 -4711 -232 4113 -4605 829 3906 -4838 827 4053 -4346 219
2248 219 3009 -3173 1344 1840 -3845 1463 2178 -2782 1068 876 -1869 1567 -500 -1611 2721 -569
2264 -569 -1773 1803 -1398 -44 3028 -2905 -889 3362 -2688 -310 3451 -3052 108 2799 -4203
2279 -4203 1106 4417 -4452 -406 3315 -3700 1565 3536 -5280 850 3835 -4509 1246 3799 -4585
2294 -4585 729 2863 -4215 2180 3340 -5067 575 3037 -2982 1470 1517 -3644 2020 1875 -3501 1214
2310 1214 1248 -2318 1932 571 -2282 1605 -629 -2024 2930 799 -1599 325 -2138 -32 3732
2325 3732 -894 -1272 946 -2535 430 2971 -1803 758 1497 -4263 761 3526 -2682 632 1809
2340 1809 -3576 1909 2483 -4820 821 3503 -2512 1605 1212 -5065 1214 3110 -2367 2650 1625
2355 1625 -5654 -23 2526 -810 3386 474 -5525 559 2254 -1306 2269 692 -2958 859 55
2370 55 -1739 2215 587 -1411 1496 -520 -1461 593 -1337 865 3921 -1053 -2509 -901 -1827 2686
2386 2686 4194 -1958 -1458 -502 -3270 1970 4299 -1116 -140 -856 -4224 2244 3738 -2105 485 742
2402 742 -2933 1581 1019 -3329 2381 2662 -2622 695 -147 -3703 1970 2821 -681 1694 -1403 -5095
2418 -5095 1296 3437 1008 1482 -2339 -4032 1467 1799 445 1918 -1271 -2375 542 -353 638 2287
2434 2287 -1385 -974 1452 -1176 -615 738 -1090 2056 2437 -3098 -1841 439 -751 2977 2524 -2931
2450 -2931 -1091 -371 -2198 3175 3385 -2369 -1244 -890 -1865 3208 2321 -2826 32 640 -1833 1165
2466 1165 620 -1581 1569 565 -1741 848 -342 -1696 1606 1128 -105 523 -2346 -1852 2436 1521
2482 1521 104 -96 -2459 -617 2023 -190 537 1026 -2198 -648 1174 -536 1201 753 -2575 585
2498 585 1741 -1869 242 903 -1376 1635 865 -2902 479 1606 -1428 1092 1000 -2101 457 548 -1487
2515 -1487 1787 1243 -2398 -93 739 -622 1152 105 -1598 949 550 -1099 437 274 -213 414
2531 414 -649 -216 859 -402 -158 274 -488 658 80 -1295 1135 881 -1765 400 596 -977 1438
2548 1438 15 -2433 1576 1321 -1946 990 583 -1964 1497 722 -2106 1518 662 -2497 1420 1381
2564 1381 -1768 504 -1 -1391 2223 991 -2708 -20 874 -449 1329 224 -1795 130 302 -240
2580 -240 1339 337 -1332 -711 98 1243 959 -1202 -1074 143 713 1271 -601 -1704 708 624 -384
2597 -384 1179 -532 -1932 1055 563 -106 1842 -1471 -2999 2100 1672 -595 886 -1900 -2251 3212
2613 3212 1198 -1893 929 -994 -1903 2718 975 -1733 668 -1178 -1526 3249 1170 -2681 -538
2628 -538 -22 304 2540 -286 -2742 -209 892 792 1204 -625 -1547 -611 491 1860 818 -1465 -1471
2645 -1471 -536 1362 2656 -894 -2805 244 681 781 1924 -1698 -2403 1650 399 -19 2205 -1874
2661 -1874 -2872 2214 1127 -74 1434 -2851 -2457 3714 1416 -1622 412 -1921 -1250 3580 505 -1916
2677 -1916 563 -1442 -1029 3250 734 -1974 -541 -1155 526 3241 -392 -2687 -510 292 1470 1522
2693 1522 -1332 -1512 -78 395 1523 689 -1325 -992 -713 845 2697 -497 -2425 -178 116 1324
2709 1324 2260 -2254 -2285 1861 32 113 2145 -2357 -2018 2369 -189 23 2390 -2855 -2505 3425 719
2726 719 -864 1106 -2700 -1231 4026 -45 -1926 981 -1630 -807 3098 -88 -1462 544 -1663
2741 -1663 -177 3034 -67 -1911 -342 -479 1155 1899 -1133 -1480 110 322 1022 319 -791 -221 -857
2758 -857 130 2073 -327 -1243 265 -1035 808 2694 -1928 -1980 1823 -534 82 2183 -2244 -1311 2490
2775 2490 -1121 -381 2570 -2150 -1617 2477 -794 132 2116 -3136 -1017 3652 -996 -987 1766 -2335
2791 -2335 -492 3138 -1478 -1099 1982 -1682 -935 2470 -326 -950 469 -1299 312 1835 -682 -884
2807 -884 -60 -141 1072 24 -1000 588 -335 -701 1215 -49 -456 647 -1322 -178 2073 -856 -773
2824 -773 989 -1387 407 1980 -2375 -64 2587 -2348 -455 2721 -2115 -354 2564 -2635 -381
2839 -381 3356 -2280 -1188 2774 -1531 -670 2071 -1797 -132 2270 -1997 -450 1853 -1333 95
2854 95 1169 -1777 661 1463 -2220 164 1727 -1166 165 593 -1296 378 659 -651 621 149
2870 149 -691 34 -854 806 2038 -1699 -1094 1321 -1207 502 2314 -2123 -667 2138 -2042 -191
2886 -191 2877 -1659 -825 1663 -1593 590 1842 -2955 136 2678 -1707 300 959 -3328 1072 3275
2902 3275 -2228 117 1514 -3595 52 3538 -757 -22 200 -3188 298 2883 -113 -262 -592 -1389
2918 -1389 1045 325 -640 1368 -456 -1174 1463 -580 -1349 1394 -426 -6 2504 -1345 -2643 316
2934 316 177 2201 2233 -2931 -1940 624 -851 2577 2912 -3137 -1282 576 -2321 2530 3612 -3422
2950 -3422 -1238 1710 -1758 852 1846 -2652 590 2527 -1775 -567 -56 -1842 2207 2351 -1395 -63
2966 -63 -1679 -3111 3105 3626 -858 -601 -2625 -3050 3209 3243 -715 -542 -1843 -1784 1617 1063 483 696
2984 696 -1906 -472 1490 -1341 -151 1435 -1109 1529 1964 -4048 -1986 2492 643 2166 1339 -4545
3000 -4545 -2183 1726 650 3052 1601 -4104 -1902 375 128 3958 1274 -4279 -189 1154 -1403
3015 -1403 2035 910 -2611 1665 1299 -2614 249 444 -1074 2233 1515 -1615 -1164 -1977 -211 4033
3031 4033 1517 -1468 -1469 -3020 342 4376 426 -1295 -25 -2601 -463 2962 249 -274 306 -2217
3047 -2217 161 1872 -1367 -41 1007 -760 1460 130 -3678 659 2442 -572 1583 -86 -4042
3062 -4042 404 2259 -313 2048 308 -4041 -246 1880 415 1770 -763 -2801 1076 846 -618
3077 -618 1353 -558 -1336 1693 -451 -1354 1545 -662 -1054 2181 -83 -1512 299 -992 347 2536
3093 2536 -714 -1549 -42 -794 1243 1588 -1636 -74 438 -1803 1127 1667 -1731 257 533 -1770
3109 -1770 1455 1298 -2334 407 1170 -1170 890 98 -1777 1591 792 -1750 1063 68 -1566 1605
3125 1605 105 -1479 1684 -302 -1999 1978 639 -1662 754 -260 -936 1799 -105 -1431 843
3140 843 -131 -427 901 -613 43 1012 -1248 -227 1094 -892 222 979 -1209 322 584 -1715 734
3157 734 1624 -1035 -140 -211 -1175 1638 889 -1496 613 3 -1489 1443 359 -1280 1425 -318 -1858
3174 -1858 1851 358 -1861 1183 353 -878 1402 -792 -1881 1775 743 -714 763 -1144 -1195 1680
3190 1680 -69 -241 1356 -1531 -1374 1662 117 91 862 -1783 -646 1934 -290 -666 430 -643
3206 -643 383 894 -973 -3 233 -743 1076 680 -1042 96 -538 -812 2262 698 -2078 -51 -62
3223 -62 -228 2078 -269 -1910 733 -10 -654 1800 -286 -1484 919 -429 -265 1981 -1084 -1781 1519
3240 1519 230 -287 1030 -1575 -1049 2158 79 -830 616 -1048 -503 1400 -53 66 243 -1539
3256 -1539 41 1647 -219 -139 -433 -1350 1273 1349 -1267 -157 133 -899 1027 693 -1110 344 -199
3273 -199 -900 1438 559 -1150 160 -481 -192 1808 -512 -1700 918 86 -296 1231 -852 -1059 1169
3290 1169 -299 -344 1398 -877 -1174 951 -46 433 1019 -1647 -757 1568 -179 -7 582 -1282 49
3307 49 1252 -854 56 867 -1204 -160 932 -370 317 -99 -1182 806 841 -810 130 -236 -557 1366
3325 1366 -42 -1267 873 -39 -924 1206 40 -873 801 -674 -822 1703 -109 -1225 661 -244
3341 -244 -364 1254 -812 -802 1351 -545 -599 1109 -464 -516 898 -714 -144 1237 -811 -766 817 -82
3359 -82 157 319 -964 156 774 -661 248 433 -642 341 52 -697 1047 324 -1341 452 407 -443
3377 -443 783 -364 -890 1057 53 -867 853 -95 -673 836 -459 -357 1404 -806 -1091 1311 -141
3394 -141 -510 911 -906 -431 1530 -613 -689 1083 -515 -440 1026 -564 -150 883 -1016 -198 1347
3411 1347 -412 -434 295 -634 516 758 -931 -164 510 -454 275 247 -416 330 -190 -613 882 247 -674
3430 -674 195 -471 -35 1286 -614 -1005 962 -183 -296 951 -685 -449 1043 -730 -275 1488 -785
3447 -785 -875 1080 -417 154 1168 -1365 -598 1580 -407 -455 736 -875 -91 1075 -773 -158 868
3464 868 -926 -203 988 -323 -12 127 -992 576 1043 -789 -352 129 -302 660 241 -737 169 0
3482 0 -360 640 29 -258 187 -801 35 1388 -640 -697 612 -436 221 1028 -1237 -396 1337 -655
3500 -655 -225 1054 -922 -270 891 -788 322 1072 -1513 -357 1340 -469 271 503 -1666 248
3516 248 1531 -933 -174 922 -873 -67 778 -533 159 416 -774 193 555 -397 -127 -217 -22 1125
3534 1125 -165 -997 264 54 102 923 -475 -682 481 -531 -134 1188 -299 -478 10 -703 703
3551 703 1098 -1222 -155 920 -942 229 774 -1414 492 1377 -1388 -96 1057 -1229 92 1256
3567 1256 -663 94 219 -1491 487 1368 -543 -38 -232 -1080 920 659 -991 586 287 -1205 363
3584 363 539 -531 455 184 -732 417 132 -603 9 206 691 320 -1248 -307 735 -313 656 757
3602 757 -1345 -258 658 -922 692 1389 -1382 -669 652 -462 568 741 -1223 260 724 -1140
3618 -1140 294 501 -879 981 402 -1618 579 641 -1404 811 1203 -1247 -96 161 -949 1110
3634 1110 1052 -997 -281 64 -186 650 -51 -296 522 -578 -440 847 -356 -148 674 -701 -119 1004
3652 1004 -746 -560 920 15 -9 74 -1009 266 685 -508 427 168 -1108 590 317 -876 1248
3669 1248 506 -1923 467 984 -1082 535 482 -1224 618 696 -1273 359 690 -632 353 -21 -609
3686 -609 777 -94 -738 1042 -1 -872 575 -118 -351 1092 -342 -1006 732 272 -379 318 -215 15
3704 15 413 -519 165 401 -568 189 295 -772 791 423 -1458 538 1006 -1122 231 610 -911 582
3722 582 506 -1245 381 774 -744 264 142 -631 759 -95 -823 1047 109 -1113 762 192 -638 939
3740 939 -270 -1105 1106 390 -922 393 54 -325 606 -215 -217 487 -451 -158 570 -417 269 282 -1075
3759 -1075 433 1057 -868 -210 642 -635 351 596 -1001 236 651 -731 300 447 -636 417 0
3776 0 -760 1073 254 -1265 642 357 -749 781 -58 -1119 970 400 -1164 467 290 -587 503
3793 503 49 -528 418 -361 -408 852 68 -354 6 -876 176 1252 -575 -396 384 -739 -53 771 -289
3812 -289 212 333 -972 -74 806 -245 284 73 -770 644 61 -1090 730 647 -692 492 -188 -1141
3830 -1141 910 598 -793 789 176 -1303 214 382 -48 966 -251 -1183 384 42 -222 930 -54
3847 -54 -454 389 -673 -485 1211 137 -408 393 -508 -307 507 -290 91 855 -393 -577 -164 -326 799
3866 799 700 -574 126 -143 -1104 504 875 -103 469 -472 -1488 569 1001 -108 460 -200 -968 414
3884 414 52 -280 1110 39 -934 343 -213 -405 846 -248 -453 1051 -445 -1185 517 295 199 865
3902 865 -682 -1061 340 -66 234 1050 -250 -755 -289 -471 648 1176 -646 -670 204 -305 356 517 -567
3921 -567 182 427 -593 2 54 -340 447 240 -175 341 -659 -926 928 845 7 140 -1148 -880 1367
3940 1367 626 -420 324 -744 -750 896 221 -62 449 -867 -522 1082 10 -356 150 -632 232 1202
3958 1202 -735 -855 652 -93 215 724 -848 -665 458 -141 467 794 -818 -723 167 365 766 40
3976 40 -1236 -165 583 173 389 -333 -770 374 351 -96 428 -343 -674 362 410 230 174 -1003 -391 1235
3996 1235 170 -283 -60 -937 65 1393 -401 -569 379 -731 30 1283 -299 -610 189 -708 320
4013 320 1273 -595 -860 111 -7 650 651 -923 -399 559 -217 251 387 -674 -184 305 -113 382 93 -783
4033 -783 -3 626 292 156 -750 -554 806 460 -176 41 -669 -253 825 -21 -137 437 -773 -447 978
4052 978 129 -173 71 -787 177 1012 -508 -370 405 -402 428 515 -1013 -46 740 -580 276 776 -958
4071 -958 -313 533 -361 388 495 -1165 -247 779 -135 28 26 -666 314 448 -457 61 133 -319 264 119
4091 119 -259 124 -299 -295 523 85 -400 -147 -461 426 756 -629 -347 340 -426 262 566 -741 -19 651
4111 651 -788 175 898 -830 -238 698 -481 177 520 -1049 29 1113 -446 -234 149 -583 467
4128 467 613 -692 2 201 -607 367 561 -528 100 -57 -501 743 316 -766 -83 178 95 583 -316
4147 -316 -690 299 211 -45 337 -369 -367 334 -155 162 484 -737 -451 475 79 408 51 -977 118 817
4167 817 -238 45 20 -764 534 574 -694 374 220 -1026 525 803 -647 58 79 -779 803 782 -1095
4186 -1095 -116 403 -273 627 220 -912 135 382 -365 356 222 -666 -19 122 113 516 -337 -621 257 271
4206 271 224 -28 -739 5 580 -223 171 302 -743 90 519 -383 344 244 -1004 172 852 -371 81
4225 81 22 -757 611 602 -814 87 316 -478 369 305 -616 324 130 -670 492 424 -641 139 146 -162 559
4246 559 -41 -742 396 249 -308 313 -89 -261 489 -231 -321 568 -69 -434 209 -48 33 336 -350 -91
4266 -91 399 -133 -46 128 -266 294 81 -578 438 380 -535 164 57 -528 672 137 -827 386 314 -767
4286 -767 496 325 -663 272 65 -563 728 289 -853 128 210 -153 496 -182 -671 514 251 -374 299
4305 299 -114 -405 261 56 5 282 -390 -382 401 256 167 -169 -652 288 655 -178 -83 -9 -499 376 473 -439
4327 -439 68 67 -719 383 662 -389 -115 -226 -360 849 314 -863 -106 191 -79 737 -188 -880 293
4346 293 76 -125 764 -105 -948 74 304 184 639 -526 -973 398 468 139 117 -596 -275 596 92 -144
4366 -144 129 -370 -24 434 1 -58 -257 -523 431 743 -101 -493 -588 -264 993 555 -542 -287 -399 -203
4386 -203 900 285 -571 70 -333 -372 1021 157 -941 149 110 -5 569 -414 -947 549 659 -52 90
4405 90 -657 -593 760 504 103 81 -857 -701 754 699 307 -68 -961 -261 817 378 -194 -98 -199 241 301
4426 301 -245 -131 141 96 446 153 -572 -284 -117 364 1070 77 -1171 -556 87 574 1064 -278 -985 -35
4446 -35 -11 148 790 -146 -551 146 -284 -28 592 -344 -422 716 133 -385 -89 -555 95 1232 109 -913
4466 -913 -330 -389 245 1011 138 -531 -425 -559 216 921 194 -389 -470 -243 448 347 -305 -70 177 135 132 -376
4488 -376 -506 364 498 151 152 -627 -699 299 509 588 299 -933 -909 545 641 339 129 -833 -522 651 107
4509 107 -96 326 -392 -249 462 -216 -230 189 -377 227 766 -438 -741 -28 134 732 542 -829 -817 192
4529 192 288 490 332 -623 -485 101 155 463 230 -577 -403 139 385 225 -410 -532 316 428 72 -165 -600
4550 -600 -62 657 208 -91 -108 -699 -134 807 259 -158 -165 -760 70 1067 -32 -524 -193 -268 333 689 -455
4571 -455 -428 212 -80 155 493 -442 -396 85 29 376 222 -761 -313 444 271 215 -268 -663 192 668 72
4592 72 -116 -283 -486 301 357 4 46 -500 -531 466 559 76 -214 -636 -107 751 157 -315 -71 -232 137 488
4614 488 -218 -147 126 -263 178 464 -249 -340 68 -17 525 346 -834 -400 419 165 296 87 -729 -76 435
4635 435 -110 289 222 -583 -179 267 28 164 -100 -509 195 384 -114 -234 -231 3 433 36 -320 -124 -106
4656 -106 33 486 41 -194 -161 -440 102 700 31 -297 -228 -259 254 447 -344 -117 298 -250 -20 201 -297
4677 -297 55 313 -343 108 288 -463 -116 444 -11 81 -147 -465 157 504 -147 -91 -70 -287 231 96 -204
4698 -204 221 14 -328 132 184 -59 40 -201 -220 380 -2 -322 11 71 73 230 -220 -140 290 -202 -5 271
4720 271 -128 -22 32 -294 117 408 -332 -157 220 -118 72 170 -317 151 252 -415 -27 265 -69 16 54
4741 54 -344 237 200 -329 10 183 -206 61 28 -160 251 117 -342 173 149 -110 108 -99 -59 292 -134 -231
4763 -231 266 119 -94 114 -185 -66 324 -157 -170 237 -203 -99 99 -50 125 47 -422 -29 384 -65 -72
4784 -72 -72 -265 200 281 -373 60 189 -315 97 145 -164 125 14 -257 271 214 -301 -100 42 38 326 -68 -319
4807 -319 137 55 -37 189 -151 -129 177 -128 -45 315 -201 -291 154 -12 105 123 -469 -72 439 -76 -119 -14
4829 -14 -331 103 414 -231 -7 109 -307 99 449 -101 -115 -112 -226 391 318 -314 -244 -21 6 282 -57 -348
4851 -348 86 -11 -50 321 -28 -246 93 -40 36 373 -305 -408 154 178 75 148 -375 -169 448 52 -123 0
4873 0 -211 -91 338 44 -24 81 -388 62 423 30 -164 -237 -251 383 402 -378 -230 23 -23 346 94 -308
4895 -308 44 16 -167 411 144 -494 -94 -53 156 421 -155 -593 113 296 53 219 -319 -244 352 192 -63
4916 -63 148 -192 -261 235 98 115 38 -481 -64 494 108 -147 -131 -305 331 407 -288 -150 -3 -184 239 279
4938 279 -219 -135 -87 -223 410 321 -438 -292 48 118 440 -22 -479 24 188 64 164 -181 -284 140 -8
4959 -8 95 321 -289 -392 240 149 112 114 -541 -187 584 113 -176 9 -336 95 481 -134 -103 88 -323 47
4981 47 382 -99 -200 -37 -142 268 433 -373 -322 68 165 367 7 -503 -75 128 -54 248 -17 -351 -3
5002 -3 32 93 333 -201 -452 173 158 105 156 -354 -320 447 145 -192 62 -227 -38 313 36 -93 36 -295 -66
5025 -66 483 35 -190 -124 -288 284 441 -239 -132 18 -99 244 140 -302 5 115 -225 185 218 -368 -97
5046 -97 91 4 291 -79 -510 90 294 117 56 -165 -349 220 205 -25 148 -119 -262 160 180 95 113 -278
5068 -278 -209 364 47 -148 -62 -177 188 336 -302 -200 174 -128 133 279 -250 -80 101 -254 217 408 -290
5089 -290 -264 119 17 293 110 -369 -4 211 -108 49 76 -91 73 5 -100 138 -7 -270 172 109 41 50
5111 50 -286 -119 367 185 -161 -69 -202 -60 190 -78 -142 267 -157 -169 193 44 -71 123 -155 14 305
5132 305 -148 -233 150 65 46 -3 -287 5 114 -52 -8 64 -213 0 111 -16 200 12 -360 51 227 -15
5154 -15 124 -159 -194 327 121 -273 78 30 -111 179 22 -111 174 -41 -124 247 102 -159 58 -29 36 231
5176 231 -124 -220 139 105 -4 40 -158 -24 65 -243 18 187 -62 -108 81 -119 166 115 -298 -1 265 -89
5198 -89 -52 69 -157 113 93 -249 29 193 -154 -9 72 -71 60 -102 -184 221 133 -112 5 -37 -55 241 -19
5221 -19 -127 153 9 -119 117 -8 59 149 -173 -75 362 -39 -214 167 -60 21 174 -193 -153 137 -175 -118
5243 -118 110 -51 -26 26 -86 45 190 -125 -132 26 40 -11 -33 -176 57 116 -164 -43 88 -134 79 42 -80
5266 -80 245 -22 -228 144 53 -48 118 -134 -179 235 10 -182 88 53 -75 71 -24 23 228 -82 -111 113
5288 113 20 -123 -42 -80 152 174 -255 -194 98 -10 113 124 -178 -62 28 -188 98 299 -109 -125 3 -145 179
5311 179 185 -260 17 181 -121 -16 54 -51 77 112 -188 24 58 -98 149 82 -21 7 -270 -86 251 174 -17
5334 -17 -55 -300 -39 194 -92 12 153 -207 -170 151 -50 76 198 -237 -5 194 -181 -186 249 -31 80 153
5356 153 -372 -126 278 55 70 137 -195 -161 37 0 192 183 -285 -154 92 21 137 -17 -167 91 4 -214 35
5379 35 8 -18 151 -130 -72 105 -79 -76 241 48 -43 -27 -310 120 368 -71 -82 -43 -203 77 172 -208 38 96
5403 96 -269 43 245 -170 64 60 -225 134 283 -372 -20 296 -48 -9 44 -270 82 277 -101 74 78 -230
5425 -230 -76 110 106 109 -56 -212 4 193 -5 -70 -138 32 108 -103 -3 22 -91 42 -44 -218 145 96 -308
5448 -308 149 222 -221 -5 30 -305 227 195 -366 19 272 -293 71 144 -340 121 118 -282 102 274 -269 17
5470 17 134 -198 245 102 -223 77 222 -191 -23 68 -22 64 -41 -135 91 9 -10 -40 -67 63 -44 -145 157
5493 157 115 -132 -103 11 -98 202 28 -236 54 102 -196 76 73 -183 241 84 -297 217 164 -321 188 178
5515 178 -244 110 -39 -222 294 249 -291 37 78 -252 119 217 -206 136 70 -252 73 108 -150 25 -15 -46
5537 -46 131 13 -95 -16 100 63 -23 -129 4 78 -37 71 -28 -161 57 -22 -64 232 34 -347 99 47 -113
5560 -113 225 -100 -301 310 75 -340 271 8 -323 214 60 -253 201 43 -263 225 127 -245 13 1 -94
5581 -94 238 -42 -274 55 112 -108 143 42 -143 11 -32 -49 126 27 -123 -86 1 130 75 -174 -34 51 45 144
5605 144 -65 -121 186 -41 -96 185 -34 -205 107 -1 -39 210 -123 -335 331 51 -153 144 -89 -219 264
5626 264 -70 -248 190 6 -223 229 96 -131 216 -24 -131 183 56 -309 95 47 3 114 -73 -102 149
5647 149 56 -68 70 35 -49 -73 -75 63 -7 -92 9 1 51 158 -163 -82 130 -38 -36 144 -147 8 144 -62 -132
5672 -132 253 -93 -236 196 -20 3 173 -174 -96 282 -93 -261 217 -34 -96 143 -128 -129 168 -12 -157 151
5694 151 -30 -82 11 -97 -50 145 -66 -169 121 4 -50 -15 -69 5 0 -11 29 30 30 -52 -13 -9 84 -80 -87 74 1 -16
5722 -16 -9 -103 3 215 -132 -119 157 -54 -82 91 -138 28 220 -186 -122 137 -73 -87 82 -119 -39 131 -160
5745 -160 -78 194 -61 -73 66 -83 21 126 -119 -85 203 -112 -87 63 -8 -23 91 -164 -26 133 -31 -65
5767 -65 73 -3 105 -4 -54 101 91 -23 -20 -48 69 79 -114 -4 115 -5 -69 53 -86 2 52 -112 19 214
5791 214 -96 -65 32 -19 28 149 -154 -10 191 -123 -79 116 -95 37 81 -145 51 172 -126 -120 158 -12 8
5814 8 91 -143 0 75 -98 52 83 -52 19 39 -114 55 101 -85 35 34 -79 -65 -67 -55 124 -20 -85 63 14
5839 14 -5 76 -50 -13 19 -102 -76 107 20 -64 -22 -74 31 106 -149 -55 62 -52 -9 -61 -70 104 81 -122 43 65
5865 65 -166 10 53 -8 167 2 -299 1 41 -108 -36 73 -148 45 36 -121 69 171 -96 -65 35 -37 72
5888 72 9 -44 78 72 -107 -45 37 56 97 -1 -106 94 1 12 75 -12 -26 -60 -151 53 134 -69 -28 -39 -119 73 64 -93
5916 -93 92 151 -121 -19 36 -19 92 91 -112 66 -29 -154 -12 194 -54 -2 -70 -150 117 118 -57 8 -22 -119 21
5941 21 32 -10 78 22 -162 50 7 -69 99 18 -49 115 -17 -127 68 61 49 54 -102 -65 51 37 14 132 -54 -115
5967 -115 -88 -71 161 114 -85 -44 2 -87 28 22 -9 138 21 -168 82 59 -65 78 28 -155 73 3 -144 125
5991 125 118 -137 -124 -35 -51 113 23 -98 43 -16 -129 -9 76 -2 76 -80 -105 123 29 -116 -20 -44 83 9 -91
6016 -91 64 138 -65 -25 38 -95 141 46 -137 119 217 -157 -15 88 -38 79 -25 -145 18 136 -133 -27
6038 -27 56 -32 33 -6 -113 117 65 -171 -3 7 7 28 -72 -108 111 -79 -114 106 -15 -23 13 -89 -94 187 -13 -110
6064 -110 58 12 8 89 -119 -34 39 -157 -76 64 -40 20 48 -38 102 42 -128 20 126 -37 56 29 -132 95
6088 95 136 -54 92 79 -85 7 65 -52 108 -2 -213 87 139 -77 96 -47 -74 80 -56 -193 55 38 -32
6111 -32 81 -67 -123 82 -105 65 160 20 -39 -52 -117 93 156 -114 -74 -6 -39 63 85 -78 131 27 -167 87
6135 87 113 -117 35 173 13 78 -31 -172 77 214 19 -12 -79 -65 70 34 -19 45 -45 -110 9 49 137 10
6159 10 -133 -66 175 70 -11 48 -55 62 95 -88 -53 35 -52 29 116 -92 -6 -18 -136 41 164 -124 -89 -26 -1
6184 -1 105 -13 -181 -35 52 -78 51 7 -122 -18 -66 29 172 -17 -130 -5 69 63 128 -101 -103 101 84 -75
6208 -75 1 -60 -113 56 27 -13 21 -187 -58 114 75 -46 -45 -148 65 153 19 -66 -69 -103 57 45 -74 6 -26 -98
6234 -98 144 41 -54 32 -91 -56 158 35 -201 24 5 -53 125 -36 -97 43 -9 2 220 46 -155 11 -32
6257 -32 128 77 -65 -148 53 14 29 -59 -60 13 57 -79 59 29 -79 10 26 27 37 31 -133 -2 150 -11 -20 -33 -17
6284 -17 104 -21 -80 93 7 -49 42 -49 -7 47 -95 -115 133 18 -61 10 -53 -23 104 -43 -84 116 -81 -25 23
6309 23 6 -18 22 -96 -6 153 -74 -48 75 -56 10 47 -130 -11 90 -81 -69 30 -9 53 -69 -29 54 77 -16
6334 -16 -45 11 90 17 -54 -47 38 57 -69 75 -17 -32 27 -100 -7 140 -67 -90 -2 -39 -6 111 -89 3 160 -96
6360 -96 -5 150 -46 -83 43 -58 17 141 -83 -83 119 60 43 -2 -64 -9 47 -17 2 -27 -40 -51 -30 23 46 -86 -124
6387 -124 -41 58 31 -50 -44 -73 141 29 -37 9 -58 -15 52 9 16 40 -130 -67 147 53 -107 -30 -84 94 154 -40 -83
6414 -83 39 -45 -11 59 -74 -91 -1 -83 105 221 -68 -127 26 70 64 79 -181 -108 134 -7 41 -34 -145 20 41
6439 41 56 47 1 -147 -99 130 138 18 -103 -94 57 50 58 -99 -93 -7 102 11 34 39 -136 -128 84 66 -12 -15 -242 46 205
6468 205 2 -105 -44 -84 89 142 -68 -148 17 -52 -7 126 -44 -111 -35 -45 86 90 -162 -182 34 102 141 0 -126
6493 -126 -56 42 38 66 -17 -29 27 69 21 101 -85 -186 88 127 126 -8 -177 -120 156 64 19 7 -158 -113 83 66 -40
6520 -40 28 -74 -26 179 71 -99 -106 1 103 134 -83 -121 -22 42 97 134 -75 -61 -51 -48 97 90 -113 -131 -43 89
6546 89 86 35 -189 -97 70 37 6 25 -78 40 2 18 159 -53 -125 66 46 22 51 -93 -107 135 104 -14 13 -99
6572 -99 9 132 -43 -11 95 -97 -91 89 91 -45 -1 -119 23 154 3 -115 -3 11 -7 38 -48 -65 39 -29
6596 -29 30 15 -14 -13 -26 -111 57 78 -103 -36 59 73 78 -38 -146 24 15 -90 66 23 -11 38 -31 9 141 -24 -98
6623 -98 55 38 -1 106 -64 -68 76 -62 -21 175 34 -13 30 -38 17 46 -31 -131 72 14 -43 -19 -75 -19 65 -134
6649 -134 -36 139 -69 -78 45 20 110 1 -141 -76 82 29 8 34 -5 57 28 64 107 -49 -57 47 81 62 79 -112
6675 -112 -79 118 80 0 31 -108 -22 91 49 -34 53 -101 -86 63 38 -15 16 -96 51 211 -56 -93 -19 -103 80
6700 80 98 -47 -23 -20 27 55 123 -24 -67 -9 -7 151 -23 -143 -106 9 49 128 -64 -176 18 10 42 58 -58 -81 -35
6727 -35 -32 124 58 -131 -171 -2 75 124 -72 -149 -62 133 -14 -72 34 -196 26 161 -19 -61 -16 -207 3 223
6751 223 57 -5 -89 -101 80 182 -95 -145 -24 -81 104 59 -52 -35 -48 -13 150 30 -77 -144 1 104 162 20
6775 20 -171 -38 55 159 92 -122 -110 56 7 149 137 -101 -216 28 49 212 55 -155 -66 155 75 -36 -68
6798 -68 -141 93 124 -64 -47 -24 -124 29 119 28 -8 -148 -139 76 188 14 -61 -38 0 119 101 -75 48 50 -47 71
6824 71 -4 -43 6 -72 33 134 17 -158 -27 -4 110 51 -134 -62 34 51 135 30 -165 -38 10 21 161 56
6848 56 -163 -81 86 2 83 -35 -156 3 85 -71 25 36 -106 32 65 -125 90 78 -8 54 65 -24 -23 -84 -61 76
6874 76 66 -40 13 -29 -8 84 -49 29 44 -50 31 52 -5 46 -37 -101 -24 48 -86 -13 -66 -9 24 -42 -34 62 13 -153 25
6903 25 66 -74 43 -37 -78 70 -7 -153 -28 0 -25 50 44 -59 15 -70 -93 133 62 -94 -41 27 20 103 -23 -109 2
6930 2 20 6 46 37 -25 -29 -7 5 28 -6 -102 -50 43 165 -16 -124 4 16 47 57 -49 -60 62 20 67 54 28 -119
6958 -119 12 33 26 64 -110 -130 64 54 -28 91 -65 -79 75 52 -62 65 18 -89 35 49 -25 5 -30 -16 131
6983 131 74 -118 -60 -20 126 55 28 -55 11 -40 52 102 44 -16 -108 -4 132 117 -123 -33 -42 36 118 -18 -51 48 -4
7010 -4 14 126 16 -15 41 0 13 108 -65 -134 49 58 84 51 -89 -91 123 60 34 108 -39 -81 75 27 33 84 -110 -145
7038 -145 82 90 34 -84 -112 30 106 -24 -51 45 -8 58 8 18 -3 -45 -118 4 20 -33 -51 -61 38 136 49 -95 -29
7065 -29 -40 9 66 -22 -65 62 -64 -18 147 17 -109 35 -65 33 156 -94 -149 12 58 38 11 -48 -62 18 3
7090 3 -39 49 -70 -65 48 41 67 33 -149 -5 102 -44 -10 -31 -133 35 61 -64 58 19 -38 14 93 -49 -4 -82
7116 -82 -49 38 78 11 -74 -85 24 65 7 5 -26 -72 27 10 13 31 -8 -87 59 77 -23 -73 4 -21 77 49 -94 12 90
7145 90 -20 22 35 -51 43 58 17 7 44 -90 -80 37 15 -4 3 -52 -3 97 -6 -2 -20 -74 -57 35 -41 81 -27 -95
7173 -95 71 42 76 17 -6 52 112 4 17 36 -4 54 24 -58 -118 55 -49 8 99 27 37 14 -19 49 117 -51 -28 31
7201 31 -15 -31 2 -51 68 58 -43 -7 72 43 -2 4 38 69 19 -41 -3 87 -61 -8 -43 67 48 -25 -85 38 27 -46
7229 -46 -55 -9 43 -13 1 -36 -29 -1 -30 -1 44 -36 -32 -42 0 103 21 -5 -11 -6 -4 20 -82 8 82 -52 46 8 -69 1 45 -61
7261 -61 81 105 -145 -21 90 4 -30 -61 -97 89 184 -35 -53 -38 -23 -13 48 -55 -2 -43 -90 9 113 30 -52 -102
7287 -102 9 75 103 -112 -24 2 50 106 -83 -57 -31 -52 51 89 -80 -22 -16 -24 123 58 -136 -123 58 83 83 23 -159
7314 -159 -42 40 -61 118 51 -174 -22 96 15 122 -16 -208 11 99 27 -77 -67 -74 72 73 -11 -30 -16 -57 12
7339 12 70 -28 -35 -106 -2 53 88 -37 -91 -8 106 146 -64 -111 -76 4 84 72 -115 -42 -10 -16 92 78 -63 -62 58 47
7367 47 96 40 -159 8 111 -6 55 -98 -134 43 75 -69 9 41 -109 91 97 54 -65 -151 -77 143 136 -9 -73
7392 -73 -23 72 43 -19 -57 -59 54 -75 -1 -46 -15 37 -48 119 52 -36 -121 -48 20 70 34 -148 -26 54 -51 53 46 -110
7420 -110 -68 31 -5 76 114 -144 26 147 -29 -20 -14 -63 79 77 -91 -101 53 -17 89 4 -87 60 43 24 71 84 -25
7447 -25 -27 -43 70 83 -45 -82 -25 -2 22 -45 -33 -4 69 -55 -10 4 -94 -11 69 43 21 -24 -211 -18 44 -25 -39 -62
7475 -62 -80 72 51 -110 -57 11 -54 105 -5 -73 -23 27 -64 69 64 -25 45 23 107 45 -89 -114 27 67 -7 -1 -59 36
7503 36 35 29 71 -9 -61 -51 -4 66 43 -45 -183 47 76 8 -40 -139 -88 76 31 -105 -27 -33 -102 80 10 -12 -10 -82 -77 92
7533 92 13 -127 -23 15 -11 76 -90 -85 19 54 66 38 -20 -40 -137 45 101 -8 -31 -102 -35 65 91 -24 -74 51
7559 51 73 56 12 -38 -6 20 49 -53 63 -26 -43 9 74 6 -59 -103 27 109 55 -101 -10 -43 -19 110 -62 -43 -4
7586 -4 -25 -22 60 21 -85 3 11 54 104 -42 -76 0 62 0 -28 -79 -98 3 43 35 -10 2 -37 -66 9 152 -34 -52 37 58
7616 58 28 1 -115 -20 114 23 -26 39 17 8 30 -21 -13 105 -21 -63 86 13 -11 -25 -21 53 155 12 -69 13 35 -25
7644 -25 22 0 -16 65 -46 -7 48 -10 -77 -16 -108 52 -18 -89 -65 42 13 -17 -20 4 38 -31 -72 11 -27 -107 -10 12 82
7673 82 120 -94 -51 60 37 -1 -24 -55 14 55 -111 -44 41 -20 -60 72 -5 1 30 -96 -36 103 -23 -91 -3 -7 9 30
7701 30 -68 -26 34 -35 -78 65 3 -12 -26 -36 -9 -7 -42 -111 -62 20 -29 -44 -34 77 -21 -9 9 4 74 -82 -49 -22 88
7730 88 -93 -19 76 8 21 77 -89 -7 63 -67 -79 14 -42 5 73 -16 40 59 -48 -3 100 -34 -59 20 -22 -51 107
7757 107 -81 -39 33 3 -38 -35 -57 -28 17 -57 10 153 -1 -70 5 58 11 5 -136 -39 54 42 -1 -64 -5 -70 -46 -92 48
7786 48 10 -104 28 -44 18 8 -142 -81 80 -34 15 -8 -91 -1 36 28 -54 139 -54 -47 51 -36 -46 54 -116 23
7812 23 212 -61 -111 33 -10 14 55 -99 10 6 39 -31 59 15 -31 18 -20 88 -26 -46 -6 45 5 -9 -68 -45 52
7839 52 2 -50 -11 -13 14 36 -65 -9 31 -55 -18 106 50 -9 -31 12 38 81 -43 -78 12 -15 -14 85 -112 -3 58 -92
7867 -92 51 131 -19 -47 7 42 35 55 -128 -40 116 79 -8 13 -100 -17 43 -108 47 1 -21 -39 7 -7 20 -43 -104
7894 -104 -7 62 -17 -52 -66 42 53 -32 -69 54 -33 26 10 47 -35 50 -69 50 33 -27 -122 2 28 56 34 -180 -77
7921 -77 90 -37 20 57 -36 75 16 -37 35 14 -127 -24 34 35 7 -21 -51 88 83 -40 -70 -2 43 37 -3 -45 0 -42
7949 -42 -94 52 71 12 -72 -116 -37 97 -40 -81 -16 2 20 53 -58 -52 21 -16 -37 -15 -20 -29 96 -73 82 7 -117 -87
7977 -87 94 9 7 -48 -70 41 73 -43 -50 -2 44 43 68 -29 57 23 -31 74 133 0 18 -48 18 45 40 -106 23 42 5
8006 5 17 -5 61 39 -32 -61 74 7 -17 -6 -23 61 27 -107 3 95 -7 -16 -125 -55 10 -10 -27 13 53 -28 -55 62
8034 62 16 16 -30 -106 17 35 0 -56 48 19 40 -4 -75 28 43 8 24 4 -21 51 -21 0 45 37 -23 -15 57 -6 21 -80
8064 -80 6 16 17 -14 30 34 21 73 -49 10 101 -16 -87 46 -8 39 4 -86 48 114 80 -6 40 10 -16 19 -2 14 42
8093 42 -66 16 59 1 -65 -36 -41 63 0 -60 -59 -22 3 -41 -95 4 34 -18 0 64 24 0 18 -54 42 82 -55 -18 28 -16
8123 -16 -2 -32 -30 35 106 -68 1 45 -54 26 -13 -9 -5 39 -114 -19 114 -16 64 -19 -48 92 65 -56 -66 74 -8 -115
8151 -115 -13 -15 25 -43 -28 -2 46 -57 -50 51 90 58 -60 -22 35 36 -28 21 31 71 16 -93 69 -7 -73 -9 -43 -5
8179 -5 48 31 -14 0 -11 8 -76 25 4 14 46 -52
8191e2
$$ Imaginary data points
##PAGE= N=2
##DATA TABLE= (X++(I..I)), XYDATA
0 0 0 0 0 0 0 0 0 0 0 0 0 0 0 0 0 0 0 0 -2 3 -4 5 -8 9 -12 12 -15 20 -20 26 -30 33 -38 44 -51 59 -64 72 -82 93 -103
41 -103 113 -123 138 -152 167 -182 196 -210 226 -240 247 -248 230 -184 79 154 -699 2128 -7072 49051
61 49051 282423 -95945 -87033 173987 -171527 -104941 237813 -23681 -108612 104283 -66321
72 -66321 -68096 123139 -17419 -56466 48318 -37561 10786 69576 -77573 -38643 65554
83 65554 -13285 17259 50470 -76340 -66070 57649 55013 -5828 -11536 -1023 -57772 -35027
95 -35027 116598 37787 -117952 34410 40089 -115128 81873 103653 -165668 8247 137507
106 137507 -114081 -4749 109212 -129030 -8192 144285 -74879 -23621 56177 -114979
116 -114979 31104 127609 -81318 4354 33674 -146183 67727 147957 -125015 -3056 83237
127 83237 -147114 22674 164348 -105845 -49965 105897 -76132 -36335 113440 -35869
137 -35869 -68719 55537 14643 -26724 7158 -3095 -15493 1964 36442 14597 -54330 -11638
149 -11638 34438 -14337 19768 29270 -56465 -9726 30921 -18814 36990 11031 -75127 35061
161 35061 33787 -62907 57618 20514 -112645 69179 71398 -119356 38162 70605 -122151
172 -122151 40178 106934 -112775 -8959 85037 -83044 7094 93812 -71522 -30041 54877
183 54877 -35196 10601 42181 -50925 -446 29558 -32541 22384 19964 -48185 18767 26363
195 26363 -38118 14319 21529 -34465 5228 26295 -11286 -12500 -784 10494 3305 -9912 16295
208 16295 -9330 -35257 42040 22423 -54573 20585 22584 -54344 32895 42630 -60148 6041
220 6041 30646 -44514 27349 36043 -54533 6197 22668 -32886 35246 13545 -59287 30278
232 30278 23605 -48573 37736 17983 -66377 32867 37241 -54435 20612 28240 -56693 15840 46910
245 46910 -34699 -9769 17195 -19496 9424 24261 -15241 -14218 -387 6500 13046 -4211 -5528
258 -5528 -1023 -12886 11206 20202 -14470 -8475 351 -8159 21258 11811 -25713 -1711 1312 -5606
272 -5606 31865 -1981 -39176 17034 7371 -20435 36938 3970 -51432 18231 20449 -24248 28307
285 28307 7789 -51197 14161 30833 -18963 9416 2771 -31888 15672 21171 -15661 5622
297 5622 -2682 -20646 18692 13069 -14074 4895 -7160 -15100 23770 12008 -20024 -3592 660
310 660 -1741 15300 4296 -15250 -7756 3657 9998 5371 -4274 -4111 -10066 -2733 21901 6079
324 6079 -17035 -3061 -4421 -1085 25032 1198 -25118 1352 3496 -1316 19825 -2631 -22826
337 -22826 5307 2766 -1761 20643 -5960 -25873 8795 8532 -1348 15056 -10648 -24715 15104
350 15104 13893 -6668 5597 -6826 -17102 12195 13098 -4298 380 -8087 -11485 11774 13509
363 13509 -2959 -7834 -9846 -360 14398 6786 -7103 -9068 -4124 6268 9637 1206 -5910 -9033
377 -9033 -2226 10542 7979 -1729 -7751 -11953 2909 18970 3024 -11312 -6983 -5799 7313 18181
391 18181 -3715 -14736 -1943 -1593 6161 16341 -5028 -16685 -1797 2763 9499 13540 -11063
404 -11063 -18947 3723 10551 7499 3594 -13270 -12549 8394 10996 3214 -1295 -11249 -8733 8421
418 8421 12790 2741 -8199 -12364 -1710 12495 11396 -3483 -14412 -6967 8531 10825 3088
431 3088 -6227 -12058 -2133 11226 7888 -369 -7176 -12137 1182 15888 6109 -7264 -10509 -7150
445 -7150 9189 16015 -2228 -12624 -6415 503 10593 9932 -6570 -10791 -3397 2447 11470 7630
459 7630 -10328 -11764 -143 7973 11982 29 -15491 -6780 7591 8677 5169 -5501 -12073 -544
473 -544 8234 5901 1958 -7037 -9766 2163 9188 6347 -1842 -12086 -5823 9891 8574 -189 -6198
488 -6198 -9805 1764 11937 1793 -4379 -3561 -6461 3217 11050 -580 -5579 -3791 -4965 7172
502 7172 11511 -5806 -9137 -750 1144 8410 5148 -10835 -5818 5208 2101 3736 1636 -8316
516 -8316 -3162 4539 3065 3667 -2336 -8626 117 6013 4460 1136 -8914 -6013 8425 4508 -1491
531 -1491 361 -7123 -2553 9803 -41 -3702 3605 -5672 -2938 9919 -891 -5277 2114 -4150
545 -4150 2569 9966 -8085 -7650 6380 -62 3446 6032 -12606 -5348 11128 -888 255 6260
559 6260 -10270 -5945 9253 1050 741 2642 -9154 -1977 8963 240 -2347 -2518 -3373 7666 4461
574 4461 -8139 -2368 -359 -270 10519 1979 -10771 -2455 -1140 1307 12931 1633 -10995 -5209
588 -5209 -2757 7416 13119 -6998 -8614 3352 -4434 4031 10595 -11874 -3943 13166 -6922 -2990
602 -2990 10113 -12602 -4810 18620 -673 -6172 1294 -14398 29 21835 1689 -7585 -5733
615 -5733 -13185 7537 17865 -4392 -2391 -1640 -15159 6715 16246 -7478 -2240 2743 -9942 5716
629 5716 10401 -11295 -5227 7062 3847 4882 -5422 -12442 1448 5895 8698 9078 -14225 -14896
643 -14896 6720 2502 8035 15720 -15440 -19755 8677 5448 4915 9823 -12865 -10177 9255 -517
657 -517 1614 4718 -10687 3832 10375 -11947 839 5609 -15817 10056 20995 -16278 -8524
670 -8524 4659 -13182 11802 24703 -15107 -15124 3027 -4757 9222 14374 -8266 -6792 -3538 -4638
684 -4638 12686 5040 -9423 3622 -3296 -6586 14987 -1918 -16644 10927 7510 -6847 5275
697 5275 -6098 -11858 11183 7767 -546 1487 -12764 -5517 10846 601 7194 5684 -23003 -3685
711 -3685 19238 -5688 848 10650 -18479 -3451 18952 -8413 -5158 10925 -7826 -1521 9021
724 9021 -6702 -625 1759 -6318 11256 4138 -14883 4249 783 -9345 18538 4261 -23039
737 -23039 6669 7770 -12579 11691 7534 -16695 2813 4974 -7038 8131 1972 -8650 3705
750 3705 -1812 -319 9573 -10234 -4934 14925 -7369 -5739 13534 -9888 -6495 16393 -6488
763 -6488 -7290 12242 -6706 -6352 10242 -2641 -437 3201 -9783 5095 7249 -11071 6130 4734
777 4734 -15198 9761 8397 -18135 8553 11022 -18980 4884 12989 -13662 2311 7725 -11091
790 -11091 4304 6136 -8269 3551 522 -4665 8188 -4843 -6003 13445 -6318 -9772 15250
803 15250 -3980 -9933 14062 -5030 -10371 14803 -2378 -10231 10207 -1977 -5695 7294 -4372
816 -4372 -320 7118 -9525 833 9245 -9931 2498 8028 -13809 4612 12585 -14996 -346
829 -346 11911 -10392 1236 9221 -10222 458 5329 -7035 6355 3815 -9399 3988 -1526
842 -1526 -5956 14981 -1703 -15063 11306 321 -11708 14214 928 -14229 11368 1111
854 1111 -12979 10308 2767 -9656 7508 873 -6028 4736 -5070 -1905 11823 -3614 -4611 4065
868 4065 -9445 1444 14184 -6883 -3541 6974 -10403 -2063 11682 -2744 227 2937 -10043
881 -10043 1389 6168 -4976 5076 2420 -8489 5618 -836 -11202 11635 6314 -10913 6343
894 6343 -113 -13809 9083 6768 -7607 8228 -29 -14893 4254 5584 -1466 8415 -3773
907 -3773 -10246 5556 -1763 -2818 11867 -1912 -6954 5419 -6990 -4693 13238 -756 -5364
920 -5364 7017 -5475 -7330 6067 -133 2057 7807 -6612 -6794 1611 -1616 5734 6538 -5948
934 -5948 -806 -724 -8710 5520 9067 -3274 1309 -1845 -9737 4158 5395 -2919 5851 729 -8679
949 -8679 539 -1348 -1086 11739 379 -9088 2533 -3874 -4803 11508 1898 -5504 5154 -6271
963 -6271 -9146 10600 4313 -4533 4692 -3421 -7539 5293 624 -2084 7437 -314 -6635 -36 -1836
978 -1836 872 7091 -630 -2842 574 -4558 -1411 5033 1956 1784 -912 -6541 -255 3448 -71
993 -71 2774 285 -3575 1750 -1695 -4065 5903 2802 -3672 2427 -2200 -5701 5036 1973 -2830
1008 -2830 5848 -1031 -9200 1907 3430 -198 5097 -1795 -7364 2355 1694 -1756 4381 536 -4141
1023 -4141 598 -1296 -1023 4992 -184 -3398 1719 -330 -1514 1579 -1175 298 3641 -2018 -3180
1038 -3180 998 215 1218 1742 -1929 -494 322 -2212 1421 2794 -1030 -592 -1386 -1619 3743 1433
1054 1433 -3654 299 885 -798 2256 -1032 -3010 2853 509 -2507 2993 30 -3682 1723 371
1069 371 -921 3875 -1901 -5200 3640 2599 -2302 1532 -1150 -3207 3709 1356 -3298 1855 903
1084 903 -3481 1090 2426 -948 -150 -700 -1582 1799 2093 -1477 -2043 695 1856 -560 -1105 882 -351
1101 -351 -399 1597 -1309 -1177 2663 -1226 -2292 3795 69 -3694 1618 234 -1048 4119 -1563 -5297
1117 -5297 3561 2209 -3066 2261 253 -3857 2435 1289 -2811 2874 924 -4782 967 3020 -1137
1132 -1137 353 -363 -2398 1948 2019 -2119 -810 1137 -44 -169 112 327 -18 -530 -361 174 1046 767
1150 767 -2113 -1071 2481 251 -1312 617 -1049 129 2592 -2040 -1666 3229 -1065 -1879 2771 -1142
1166 -1142 -1290 2834 -2454 -1210 4890 -2233 -3746 3816 -246 -1528 3407 -2807 -2784 5093 -792 -3486
1182 -3486 3740 -433 -3282 2879 106 -1987 2956 -739 -3732 2711 2456 -2279 -611 816 -502
1197 -502 506 1080 -1179 -990 2061 -74 -2867 2155 2173 -3625 324 2679 -2927 1352 2645 -5411
1213 -5411 977 5653 -5156 -1315 5434 -3987 -708 5178 -5166 -799 6849 -5088 -2583 6928
1227 6928 -3372 -2913 5286 -3143 -1577 5651 -4127 -3149 6058 -1297 -2918 3204 -1782 -1443 3720
1242 3720 -1549 -1775 3003 -860 -2308 1182 1244 109 -649 -838 28 240 1283 -235 -2582 2005 1800
1259 1800 -3887 1387 2922 -3922 1625 2327 -5387 3230 4005 -7522 2083 5673 -6867 1685 4818
1274 4818 -7662 3103 6215 -9590 1810 7957 -8615 490 7192 -7810 1112 7309 -8646
1287 -8646 351 8433 -7357 -1598 7118 -4968 -676 5390 -5502 -825 6214 -3649 -2146 4004
1301 4004 -1366 -1372 1632 -699 -196 915 -308 -1169 -274 2876 -350 -4140 3057 1850 -4572 3295
1317 3295 1453 -6421 5009 2793 -8830 5464 5003 -10333 3734 5737 -9143 5069 5288 -11831
1331 -11831 4717 7639 -11381 3569 7593 -10654 3256 6552 -10781 4356 7836 -11275 2164
1344 2164 7672 -9064 2008 6370 -8368 2497 6272 -8492 566 6644 -4853 -319 3440
1357 3440 -3628 457 2597 -2370 105 1570 -507 -1069 -1110 2560 1057 -3699 1711 941 -3535 4227
1373 4227 433 -6482 5694 1914 -8222 6146 2872 -8875 6394 2011 -10258 8887 3637
1386 3637 -13057 7936 5620 -12746 6871 5196 -12781 8051 6446 -14185 5660 7579 -12046
1399 -12046 4808 7139 -10631 3689 5160 -10259 4469 7211 -8342 927 3855 -5929 2632
1412 2632 3608 -4582 2079 2205 -4463 -127 1974 767 962 -1185 -2 -651 -2523 3157 914 -2383
1428 -2383 5112 -2377 -8622 6696 3058 -5927 7285 -224 -10926 7102 2316 -8767 10577
1441 10577 3172 -13394 5445 2582 -9406 10499 3994 -12146 6906 1803 -12867 8652 6596
1454 6596 -8911 6867 519 -13609 7097 6422 -7925 7049 3433 -11834 1377 3558 -4006
1467 -4006 7178 3866 -8314 -1404 1054 -1818 3626 3177 -244 -1234 -4369 -1580 1852 2106 5400
1482 5400 -653 -6646 973 -1357 -3413 9000 3336 -5988 2235 -5133 -7697 11986 4470 -6988
1496 -6988 6338 -3831 -12273 9390 3973 -5767 11244 -1700 -15933 6609 3970 -6703 11414
1509 11414 2675 -12769 3634 -170 -8583 11324 7169 -8437 839 -2562 -8069 7738 6175
1522 6175 -2892 3246 -2908 -9081 1939 4391 2643 4480 -3094 -6259 -1192 -144 3261 4383 175
1537 175 161 -4416 -6707 3949 4507 273 4959 -3448 -8998 3213 533 -1989 10912 756 -10681
1552 -10681 1368 -1897 -3809 12431 2444 -9015 3839 -3256 -8556 9985 4581 -4944 5614
1565 5614 -4449 -10565 7989 3477 -4246 7714 -814 -9646 2834 -41 -2378 9692 1318 -8102
1579 -8102 166 -1576 -1867 6787 2118 -2253 230 -4526 -2899 4290 2581 1973 -248 -5095 -369
1594 -369 1137 -1504 4204 2326 -3390 790 -2645 -4339 6522 2760 -3921 3449 -2006 -6547 5022
1609 5022 1444 -2786 6887 -1726 -8812 4400 1689 -3107 6472 -786 -6671 4342 -877 -4796
1623 -4796 6856 1409 -5002 2812 -1738 -3618 5546 -83 -3122 4134 -1589 -3853 2868 -554 71
1638 71 4004 -3249 -2688 2947 -1334 168 2744 -2410 121 1383 -3556 1668 3364 -2974 383 744
1654 744 -2954 3045 1317 -4222 2550 1491 -3742 2400 707 -3116 3519 -251 -4174 3972 679
1669 679 -3878 3066 -43 -2863 3593 -1402 -3221 4972 -340 -3838 2850 -895 -1719 4269 -1776
1684 -1776 -2685 3788 -1719 -2397 3847 -789 -1178 2453 -2958 -825 4059 -2020 -1158 2667 -1967 -248
1700 -248 1618 -2901 1407 3207 -3237 -282 1345 -2523 1699 1703 -2805 1977 831 -4232 1663 2323
1716 2323 -1807 2053 -547 -3700 2883 867 -2905 2837 720 -2831 1519 -916 -1652 4023 -428
1731 -428 -3031 2217 -770 -1564 2665 -1136 -690 2918 -2677 -1903 3317 -946 -361 2160 -2888 -75
1747 -75 2998 -3069 -167 3641 -2343 -648 1785 -2735 1127 2872 -3487 197 2885 -2504 118
1762 118 1641 -2141 1328 1475 -3146 943 1906 -2101 604 601 -1215 1766 -386 -2254 2018 565
1778 565 -1375 1106 -908 -421 2306 -1797 -999 2930 -1319 -1193 1950 -1741 375 2794 -3179 -631
1794 -631 3412 -2284 -570 2498 -2466 246 2409 -3349 603 3618 -3005 -811 2104 -1986 1013
1809 1013 1898 -3201 685 2215 -2736 419 1846 -1583 935 241 -2659 1789 1409 -2149 871 276
1825 276 -1345 1301 -627 -966 2643 -566 -2143 1230 -383 126 1946 -1974 -554 2385 -1924 -578
1841 -578 2361 -1510 107 1361 -2980 947 2961 -2992 -285 2169 -2024 829 1391 -3114 1478
1856 1478 2189 -3259 797 1992 -2365 880 818 -2452 2288 1131 -3381 1181 1269 -1678 1511 -129
1872 -129 -1782 2268 -349 -2189 1994 236 -914 1221 -1719 -407 2787 -1815 -858 2488 -1715
1887 -1715 -400 1820 -2463 943 2899 -3644 -349 3025 -2298 442 2080 -3376 875 2510 -3589
1902 -3589 780 3023 -2811 157 1333 -2327 2002 1431 -3437 1108 1626 -2195 1066 492 -1619 1819
1918 1819 -481 -2170 2382 161 -1427 1270 -1424 -236 2758 -2187 -830 2972 -2167 -558 2423
1933 2423 -2671 726 2913 -4418 114 4171 -3346 -6 2925 -3925 1038 3312 -4481 951 3861
1948 3861 -4377 274 3078 -3349 1604 2298 -4716 1587 3176 -3783 904 2072 -2992 1631 1026
1963 1026 -3265 2400 1397 -3258 1248 655 -1463 2060 -704 -1661 2578 -875 -1487 2158 -1164 71
1979 71 1992 -3255 403 3517 -2900 123 2312 -3502 1409 2701 -4517 2120 3091 -5516 1323 3464
1995 3464 -4134 2538 2096 -6196 2979 3596 -5652 2400 2897 -5442 2660 2306 -5267 3591 2494 -6090
2011 -6090 2609 2875 -4400 2364 1122 -4021 3487 1242 -4407 2251 1043 -2559 2336 -211 -1864
2026 -1864 2443 -1324 -1618 2915 -822 -437 1382 -2988 876 2815 -3403 869 2732 -3637 1375
2041 1375 1400 -4561 3586 2853 -5568 2494 2007 -5693 3660 2656 -4991 4223 808 -7790 4391 3668
2057 3668 -4988 4017 261 -7034 4765 2136 -5327 5141 1133 -6743 3287 1129 -3693 4998
2071 4998 -30 -5162 3952 261 -4060 3402 167 -1908 3444 -2068 -3076 3186 -649 -383 2954
2086 2954 -2187 -851 1084 -3095 2160 3683 -2991 167 -91 -3827 3818 1994 -4264 3622 633
2101 633 -5905 3487 1172 -4100 5782 211 -6641 4791 38 -5973 6466 1656 -5300 4573 -2308
2116 -2308 -6649 7791 2204 -5318 4525 -1963 -6264 6047 952 -3265 5625 -2271 -6461 4541
2130 4541 793 -1802 4505 -2208 -3512 3672 -1645 -1799 3948 -755 -613 1444 -3393 151 2560
2145 2560 -1810 1862 1575 -3672 766 -272 -2414 5379 1044 -5104 2184 -811 -3296 5959 -142
2160 -142 -4395 4954 -1968 -5474 6263 -32 -4025 5793 -2407 -5097 6467 -1983 -4688 7555
2174 7555 -817 -5117 4807 -2973 -3634 7810 -1212 -4536 4905 -2845 -3937 6013 -577 -2008 4076
2189 4076 -3862 -3150 5182 -489 -1276 2424 -2907 -755 2713 -2272 611 2447 -2568 288 757 -2199
2205 -2199 2419 381 -2940 2935 185 -3196 2711 -878 -2037 4828 -1888 -3813 4784 -1453 -3025
2220 -3025 5284 -2175 -2981 5449 -3255 -3295 6738 -2416 -3771 5500 -2666 -2611 5922 -3496 -2932 6363
2236 6363 -2759 -3081 5100 -2698 -1891 5002 -3337 -1762 5083 -3110 -2013 4265 -2111 -944 3016
2251 3016 -3135 -127 3482 -2481 -446 2135 -1865 548 974 -2054 1907 694 -2752 1480 267
2266 267 -1291 2676 -1531 -2415 3637 -1048 -2178 3644 -1714 -2117 3550 -2322 -1101 5026 -3119 -2796
2282 -2796 4504 -2019 -1065 4279 -3912 -1550 5324 -3176 -1442 4774 -3482 -1762 4444 -2951 -374
2297 -374 4339 -4178 -1495 4677 -2227 -766 2856 -3086 219 3179 -3158 -251 2798 -2112 488
2312 488 1650 -2582 661 1079 -2091 2137 1508 -2831 -62 -252 -404 3478 -433 -2948 1082 -807
2328 -807 -371 3262 -1318 -1395 2004 -2808 -510 4449 -1893 -1619 2664 -2420 -138 3460 -3762 -909
2344 -909 4850 -2072 -1170 2173 -3911 -14 4832 -2057 -399 2111 -4876 -736 4764 -557 530
2359 530 777 -5187 27 4428 -983 251 1122 -3276 94 1706 -1606 1428 1423 -2138 554 301 -1768
2376 -1768 862 280 145 2942 -1300 -3702 247 484 1942 3586 -2573 -3505 763 -983 1598 4516
2392 4516 -1739 -2687 84 -2396 1758 4671 -2428 -1779 1609 -2273 368 2493 -2671 826 3313
2407 3313 -2972 -1185 1358 -2512 1351 3810 -1664 -765 -498 -3902 1745 4888 -297 -1065 -1931 -3355
2423 -3355 2140 3453 -555 278 -1062 -2742 1105 1220 113 1770 -1070 -2039 1467 -266 -1192 1365
2439 1365 -143 670 1921 -3022 -2489 2094 654 1485 1897 -3538 -2235 1467 -472 2113 3261 -3204
2455 -3204 -2666 893 -533 2353 2604 -3370 -1356 1748 -1201 433 1517 -1559 570 1258 -2035 119
2471 119 886 -1367 1264 1558 -1103 -402 -1298 -1341 2800 1976 -1350 -848 -1583 -460 2623 340 -844
2488 -844 718 -1623 -1019 1971 25 42 880 -2161 -223 2387 -1417 -777 1700 -994 322 1321 -2558
2505 -2558 -249 2547 -1157 -271 1386 -1937 -258 1593 -1088 721 1501 -2383 -704 1753 -413
2520 -413 324 384 -1612 460 1160 -1162 92 800 -492 226 -200 -408 925 -122 -681 471 -327 89
2538 89 460 -1129 533 1271 -1673 -249 1441 -807 433 645 -2181 801 2065 -1987 -153 1463
2554 1463 -1732 534 1563 -1990 440 1583 -2246 371 2209 -1859 -433 1120 -1139 1189 1352
2569 1352 -2728 -513 1992 -303 352 360 -1828 8 1170 -270 703 305 -1610 -477 824 945 485
2586 485 -1329 -1157 816 902 563 -564 -1610 684 1310 -697 269 -56 -1831 901 1548 -771 641
2603 641 -716 -2732 2024 2660 -1609 -400 -760 -1819 2890 1943 -2876 -57 512 -1681 2157 1703
2619 1703 -2623 -167 382 -1299 2461 1469 -3396 -872 1505 398 1515 -336 -2929 115 1979
2634 1979 563 248 -854 -1632 121 1135 1370 248 -1956 -1263 626 1475 1722 -1132 -3007 654
2650 654 1943 229 722 -1354 -2492 1845 1612 -965 1051 -1056 -2911 2329 2195 -1316 250 -1454
2666 -1454 -2256 3668 2165 -3080 -550 -231 -930 3113 1046 -3139 39 222 -859 2683 908 -2998
2682 -2998 -530 417 599 2536 -500 -3319 4 1588 1043 788 -1615 -1720 709 1058 939 183 -1707
2699 -1707 -927 421 978 1924 -713 -2948 223 1486 689 1315 -1913 -2610 2328 1326 -1026 1222
2715 1222 -1324 -2425 2679 1114 -1433 1504 -1590 -2764 3579 1754 -2480 353 -1097 -1354 3797
2730 3797 694 -3294 660 173 -1050 2747 361 -2603 438 -149 -451 2648 -9 -2744 -18 736
2746 736 740 1450 -1340 -1919 728 906 632 112 -1129 -292 91 167 1669 -250 -1910 327 140 232 2122
2765 2122 -1458 -2650 2048 824 -1046 1523 -1272 -2111 2693 103 -1646 2151 -1053 -2372 2739
2780 2739 406 -1429 1669 -1775 -1734 3806 20 -2606 1621 -786 -1380 3141 -476 -2447 1911 -443
2796 -443 -1672 2428 229 -1943 538 -218 -93 1759 -561 -1458 387 270 689 283 -1185 208 377
2813 377 -808 922 389 -1019 449 -420 -592 1988 -329 -1654 1143 -364 -444 1981 -1499 -1241 2777
2830 2777 -1240 -1776 2904 -1034 -1842 2749 -1223 -1725 3336 -1101 -2490 2937 -327 -1965 2200 -652
2846 -652 -1236 2377 -1147 -1544 2250 -620 -939 1689 -1154 -368 1998 -1685 -663 2325 -868 -875 1022
2863 1022 -921 -29 1144 -717 38 424 -869 117 55 292 1618 -1384 -1842 1722 -84 -498 2084
2880 2084 -1426 -1789 2329 -687 -1304 2746 -861 -2069 1979 -547 -678 2041 -1938 -890 3200 -1164
2896 -1164 -1445 1679 -1948 3 3830 -1865 -1848 2082 -2100 -763 4057 -489 -2005 539 -1864 90
2912 90 3534 -391 -1682 -167 -886 859 1091 -1047 644 136 -1560 1016 312 -1607 1324 560 -877
2929 -877 1618 -853 -2849 1166 1632 922 1124 -2951 -2502 2052 693 1148 2215 -3317 -2511 2130 -583
2946 -583 1113 3462 -3269 -2823 2797 -490 -434 2292 -1991 -725 2892 -1534 -1792 1173 -641 1322
2962 1322 2421 -2255 -1447 -88 -1696 2897 3847 -2388 -2489 -951 -1434 3444 3606 -2337 -2132 -694
2978 -694 -865 2044 1790 -579 -20 -1365 -952 1863 -410 -820 1880 -534 -206 1663 -3138 -2119 3936
2995 3936 1449 -236 324 -3947 -2048 3703 1637 824 610 -4292 -2078 2683 1213 2057 814 -4641
3011 -4641 -1008 2912 -692 668 1518 -2658 326 2112 -2469 -496 1851 -687 1204 1379 -2476
3026 -2476 -1418 -60 531 3503 1020 -3286 -1662 -880 969 4363 132 -3253 -360 -872 -319 3353
3042 3353 451 -1846 169 -1254 -252 2376 -819 -1024 1508 -543 47 565 -2795 343 3578 -790
3058 -790 -616 294 -3224 296 3701 -409 -149 296 -3636 -236 3453 401 16 -563 -2689 884 2035
3075 2035 -922 416 187 -1666 1296 500 -1851 1259 424 -1445 1591 443 -2162 336 325 21
3091 21 2080 -637 -2386 464 314 657 1528 -1597 -1026 1260 -1026 294 2049 -1622 -848 1368 -1254
3108 -1254 471 1821 -2182 -453 2018 -981 -156 809 -1662 868 1499 -1878 217 1096 -1598 893
3124 893 1079 -1867 849 706 -2031 1350 1385 -2081 169 727 -1024 1220 483 -1823 589 731 -758
3141 -758 679 -51 -562 962 -710 -738 1372 -342 -531 1153 -842 -408 1078 -1131 95 1906 -1117
3158 -1117 -1014 538 -715 919 1341 -1768 -165 888 -1220 854 1208 -1597 538 575 -1938 1166
3174 1166 1236 -2086 580 1199 -1303 644 131 -1883 1537 1479 -1495 163 -235 -1154 1735 661 -1192
3191 -1192 834 -749 -1550 1794 828 -897 498 -1062 -867 2074 228 -1373 466 -149 -100 961
3207 961 -737 -531 796 -449 341 829 -1299 -321 436 -482 1489 838 -2380 -379 1127 -248 1278
3224 1278 122 -2292 498 1065 -899 1088 215 -1902 728 580 -676 1453 -465 -2167 1481 1201
3240 1201 -1129 542 -613 -1225 2031 642 -1660 378 -166 -641 1503 202 -846 186 -931 -85
3256 -85 1910 -278 -1007 -10 -819 821 1615 -1345 -884 779 -514 500 966 -1265 -179 501 -742
3273 -742 889 880 -1461 -219 478 -264 1268 -157 -2036 796 1030 -723 716 -270 -1326 1241 493
3290 493 -944 893 -257 -1458 1178 595 -324 668 -1145 -975 1802 358 -917 517 -731 -377
3306 -377 1482 -522 -671 986 -655 -577 1198 -237 -396 264 -907 431 1153 -966 -379 431 -404
3323 -404 922 305 -1574 505 665 -1036 814 587 -1209 450 104 -986 1345 386 -1579 504
3339 504 405 -585 1000 -236 -1144 1169 165 -1077 897 55 -1000 810 -107 -624 1118 -374 -1174
3356 -1174 985 396 -364 265 -708 -106 999 -501 -163 625 -574 -53 415 -632 540 626 -1322 144
3374 144 948 -542 295 151 -898 765 572 -1071 574 442 -936 591 174 -764 1063 -211 -1373
3391 -1373 1231 458 -1099 685 -207 -807 1364 -135 -1284 1034 65 -893 971 -146 -664 868
3407 868 -529 -649 1326 -100 -898 500 -186 88 898 -719 -499 842 -208 -138 428 -514 7 222
3425 222 -564 572 457 -953 75 204 -274 937 -268 -1315 801 471 -732 636 -281 -897 1037
3442 1037 -94 -832 1287 -310 -1286 1070 279 -605 937 -817 -983 1662 95 -1158 708 -241
3458 -241 -554 1280 -371 -788 976 -452 -620 1150 -176 -518 393 -592 148 1135 -738 -792 609 -84
3476 -84 276 345 -873 15 409 -347 491 186 -611 163 -261 -221 1222 -309 -1204 727 106 -311 864
3495 864 -823 -794 1350 -158 -863 1002 -466 -719 1150 -287 -419 1073 -1070 -768 1686 -115 -641
3512 -641 645 -1043 -191 1750 -600 -939 968 -499 -569 989 -253 -314 549 -555 -145 697 -456
3529 -456 -336 202 -29 675 -17 -1253 337 625 -169 547 -308 -1014 512 105 -181 1013 -262 -983
3547 -983 230 -179 416 1087 -1090 -776 1189 -485 -401 1085 -920 -188 1491 -1035 -805 1396 -653
3564 -653 -514 1472 -432 -745 525 -904 188 1674 -590 -844 229 -600 604 1080 -1002 -106 703
3581 703 -1084 71 1069 -513 -16 360 -758 172 461 -528 89 481 232 88 -1040 -390 1150 80
3599 80 -40 683 -1126 -645 1216 -316 30 1290 -1204 -1224 1121 57 52 773 -1045 -347 1107 -802
3617 -802 -245 943 -695 192 708 -1459 83 1304 -1155 109 1348 -1237 -669 807 -605 482
3633 482 1162 -1167 -748 598 -112 450 185 -478 268 -186 -578 842 192 -570 584 -311 -501 931
3651 931 -372 -867 1072 223 -504 128 -539 101 1012 -479 -196 388 -940 165 916 -839 450 866
3669 866 -1707 83 1649 -919 -182 972 -1052 161 1056 -1089 -159 1108 -637 -161 386 -601 484
3686 484 374 -876 595 374 -1073 343 461 -573 747 41 -1253 612 648 -674 32 94 -240 388
3704 388 -241 -117 597 -505 -225 597 -580 328 776 -1156 7 1337 -903 -377 1047 -686 -18
3721 -18 897 -1043 -53 1117 -670 -204 478 -660 333 404 -958 580 554 -1277 383 753 -887 388
3739 388 220 -1230 757 800 -1098 90 505 -426 347 62 -513 419 -73 -361 573 -91 -228 509 -735
3758 -735 20 1225 -694 -759 905 -278 -154 714 -752 -236 878 -511 -159 633 -614 7 444 -652
3776 -652 628 567 -1296 213 914 -750 288 390 -1132 631 795 -1210 133 874 -650 192 373
3793 373 -670 263 149 -481 677 252 -751 12 -339 88 1296 -347 -1042 440 -220 -272 950 -156
3811 -156 -392 322 -695 -201 1017 -82 -198 160 -727 287 524 -918 371 947 -845 -47 350 -933
3829 -933 642 1006 -943 170 532 -1231 22 898 -176 393 -100 -1326 383 745 -321 567 59
3846 59 -843 304 -99 -515 1095 328 -998 48 -88 -472 601 51 -201 590 -356 -742 201 157 528
3865 528 695 -827 -383 183 -640 400 1229 -310 -274 -217 -1236 556 1443 -360 -238 -45 -907 317
3883 317 642 -282 592 128 -1228 189 495 -417 674 216 -798 687 -25 -1288 632 862 -225
3900 -225 326 -508 -1221 663 649 -92 616 -325 -1145 60 136 540 1010 -766 -1115 387 153 8 531
3919 531 -518 -199 545 -434 -244 342 -174 249 384 -468 3 -300 -673 904 997 -564 -462 -594 -571 1383
3939 1383 871 -952 -163 -234 -629 969 594 -512 154 -390 -551 1152 358 -841 182 -105 -78 1045
3957 1045 -593 -1059 843 381 -224 445 -645 -761 734 266 19 435 -730 -896 578 629 413 -90
3975 -90 -1127 -218 1034 218 -54 -265 -711 395 659 -282 17 -157 -670 490 567 -149 -85 -675 -349 1220
3995 1220 392 -866 -74 -333 56 1274 -254 -1072 437 -180 -285 1116 -170 -1030 282 -48 19 1088
4013 1088 -477 -1225 436 397 269 422 -925 -549 856 59 -151 318 -531 -302 648 43 27 65 -716
4032 -716 -5 793 72 -332 -603 -390 870 565 -553 -154 -293 -171 928 128 -577 212 -376 -468 999
4051 999 273 -697 13 -353 4 997 -381 -668 597 -14 20 534 -757 -363 1002 -325 -262 745 -723
4070 -723 -507 905 -10 -80 454 -891 -401 1087 56 -406 132 -456 111 596 -450 -112 360 -267 114
4089 114 196 -317 118 82 -228 492 227 -584 -113 -9 271 677 -578 -585 574 -18 -97 563 -614 -354 851
4110 851 -429 -255 980 -575 -609 902 -146 -349 574 -714 -251 1202 -283 -701 289 -237 196 738
4128 738 -670 -390 538 -362 132 691 -528 -245 278 -352 443 489 -877 -254 479 144 341 -136 -809
4147 -809 372 485 -262 129 -220 -450 451 83 -124 396 -513 -582 673 265 -140 -18 -695 77 986 -222
4167 -222 -364 262 -508 231 820 -670 -206 543 -765 125 1104 -654 -437 412 -485 502 889 -1099 -533
4186 -533 889 -153 160 368 -826 -93 733 -300 89 380 -621 -119 503 61 166 -235 -618 341
4204 341 462 -21 -101 -575 -91 692 -131 -243 289 -430 -146 666 -298 -95 383 -716 -68 1020 -301
4223 -301 -454 269 -489 277 802 -757 -253 713 -396 21 541 -551 -64 449 -576 171 539 -748
4241 -748 -169 482 -301 237 179 -773 201 503 -422 78 160 -306 377 89 -463 441 103 -565 267 265 -164
4262 -164 253 -208 -290 503 -62 -276 172 -143 51 229 -537 120 548 -556 -113 422 -341 317 357 -857
4282 -857 192 666 -618 97 536 -630 -26 396 -505 399 424 -874 -27 629 -190 187 39 -700 444
4301 444 582 -489 -12 132 -334 200 228 -162 148 -210 -378 511 301 -166 -237 -499 247 772 -255 -397
4321 -397 98 -262 244 607 -472 -207 243 -481 296 725 -465 -426 57 -131 572 341 -917 -217 605
4340 605 73 313 -93 -892 252 617 -233 325 -8 -994 116 712 23 241 -340 -898 516 802 -213
4359 -213 -172 -369 -265 635 256 -442 -22 -144 -120 537 9 -414 -106 -281 365 706 -258 -719 -196 160 874
4380 874 451 -956 -515 76 81 670 363 -807 -110 96 -246 759 337 -1018 -9 522 -99 235 -225
4399 -225 -841 567 817 -419 -325 -383 -331 870 700 -430 -260 -547 -484 897 717 -316 -406 -579 -160 965
4419 965 368 -535 -198 -78 107 288 -295 -283 303 135 151 64 -621 -259 354 317 642 -153 -1240 -312 724
4440 724 585 614 -504 -1254 146 534 136 567 -155 -868 204 189 -150 511 -152 -651 600 262 -650
4459 -650 -83 -93 83 982 43 -1221 -263 274 316 852 -91 -961 -407 30 415 951 -15 -728 -446 -10
4479 -10 474 440 -453 -284 313 62 22 -281 -403 415 546 -139 -208 -435 -495 499 761 90 -135 -885 -781 875
4501 875 894 -80 -219 -688 -438 795 336 -379 223 -170 -349 473 36 -392 274 62 0 576 -401 -888
4521 -888 259 435 369 266 -867 -826 605 614 214 100 -665 -579 363 405 271 63 -594 -379 397 394 37 -378
4543 -378 -370 407 481 -194 -335 -382 92 710 118 -445 -178 -342 46 848 210 -567 -250 -375 174 996 -87
4564 -87 -790 -23 102 257 598 -441 -642 407 124 -44 298 -370 -457 344 253 107 112 -644 -322 654 398
4585 398 -157 -287 -536 282 701 -15 -343 -198 -166 296 444 -119 -244 -356 -324 547 569 -247 -413 -346 58
4606 58 750 111 -559 -105 -68 98 354 -139 -414 181 10 64 379 -294 -440 275 145 225 176 -781 -420 637
4628 637 269 -14 -77 -622 -90 633 42 -71 130 -469 -251 441 120 -83 -28 -398 103 462 -138 -292 -62
4649 -62 142 406 28 -453 -116 93 115 405 10 -430 -124 -116 139 621 2 -534 -69 -35 171 490 -270 -323
4671 -323 355 -44 -147 287 -134 -86 355 -233 -159 425 -295 -188 494 -10 -196 30 -349 105 607 -154 -274
4692 -274 43 -118 160 327 -229 86 117 -297 14 325 -192 -69 -1 -109 286 59 -358 36 165 18 121
4713 121 -174 -201 283 5 -170 249 11 -145 151 -98 -42 493 -268 -337 291 -42 -26 225 -191 -87 307
4734 307 -314 -123 406 -118 -152 143 -175 68 268 -273 -76 309 -161 -53 128 -177 154 134 -280 91 265
4755 265 -167 -45 82 -105 201 -29 -346 271 207 -220 -10 -69 -131 273 -105 -261 220 -81 -165 247 -3
4776 -3 4 112 -315 -57 550 -54 -232 109 -158 151 359 -255 -133 270 -128 -59 252 -202 -79 160 -222 134
4798 134 242 -376 -179 197 79 93 -48 -436 104 285 -126 56 -21 -186 124 54 -96 222 -79 -284 224
4819 224 164 -66 66 -261 -161 535 -71 -344 111 -96 59 442 -243 -220 222 -161 6 436 -139 -252 -46
4840 -46 -114 271 338 -310 -315 133 109 212 16 -407 11 206 -66 147 37 -282 91 137 -33 228 -111 -459
4862 -459 202 332 -128 -20 -240 -214 501 129 -294 32 -89 -127 331 26 -182 -2 -210 -16 444 -76 -387
4883 -387 -131 16 367 340 -399 -360 206 98 228 147 -362 -44 182 -44 221 193 -559 -146 215 99 275
4904 275 -111 -618 159 505 -27 -12 -181 -209 350 306 -226 36 -142 -236 265 145 -143 -29 -252 -63 546
4925 546 78 -345 -102 -114 281 412 -299 -411 141 -5 117 285 -274 -275 63 -8 228 258 -428 -344 257 185
4947 185 223 -78 -493 67 383 111 -12 -91 -277 270 226 -34 151 -233 -424 324 301 -82 -71 -390 -135 582
4969 582 155 -403 -68 -147 -22 465 -127 -317 153 -122 -41 446 -121 -378 1 -2 247 270 -381 -344 191 240
4991 240 182 29 -387 -58 343 23 121 -13 -337 -7 218 87 189 -143 -512 199 326 -113 -62 -272 -201
5012 -201 434 187 -341 -34 27 -60 387 66 -256 18 -167 -1 450 29 -379 -167 -48 203 391 -282 -333
5033 -333 203 49 150 193 -297 -98 241 -112 47 180 -326 -108 264 -22 68 -69 -416 107 509 -49 -152
5054 -152 -146 -253 221 323 -152 7 -45 -256 153 239 -13 54 -118 -125 313 143 -250 -67 -28 78 253 -231 -270
5077 -270 237 69 -51 197 -198 -261 220 -32 137 310 -321 -323 202 121 113 105 -403 -46 299 -34 -89 108 -37
5100 -37 54 105 -164 28 36 -234 138 192 -113 -36 -159 -107 363 149 -309 -57 24 -86 218 -18 -223 87 -28
5123 -28 -180 172 154 -267 -4 12 -10 280 -94 -271 171 124 -81 -32 -194 46 293 -50 -99 76 -158 8
5145 8 133 -58 44 38 -348 -27 270 -100 -43 -25 -135 190 198 -237 21 159 -138 21 81 -204 83 46 -206
5168 -206 260 171 -211 -16 51 -16 183 -63 -247 126 105 -83 -53 6 -45 195 -54 -22 230 -120 -209 139 -53
5191 -53 8 125 -202 -116 287 -75 -148 147 -19 20 137 -127 -37 174 -80 -89 102 -75 -25 24 -131 199 156 -209
5215 -209 -113 68 17 128 37 -170 116 69 -125 82 9 -63 70 -60 -57 279 -12 -303 133 58 -135 129 -107
5238 -107 -195 173 -2 -129 146 38 -162 82 -83 -74 183 -101 -158 106 93 -33 -14 -139 90 177 -135 -32
5260 -32 69 -67 -10 79 -109 51 47 -304 43 271 -82 -75 -21 -113 175 133 -161 77 102 -122 67 37 -6 104
5284 104 -42 -207 122 60 -125 72 78 15 221 -226 -251 118 88 -16 102 -146 -127 195 -65 -8 293 -179 -182
5307 -182 96 -30 48 215 -271 -136 237 -72 -89 157 50 -18 115 -195 -100 81 -95 26 78 -75 -62 -132
5329 -132 -4 300 199 -229 -149 -111 -50 245 -67 -134 237 -193 -227 251 31 -69 210 -191 -154 303 -118 -156
5351 -156 236 77 -54 66 -270 -132 424 63 -90 52 -240 -177 143 78 107 158 -331 -245 237 127 55 0
5373 0 -176 87 104 -167 0 81 8 69 -30 -141 114 17 -58 224 15 -181 -99 -118 117 336 -148 -293 -6 -72
5397 -72 64 287 -120 -101 178 -202 -63 347 -148 -146 124 -178 16 259 -240 -126 386 -37 -112 58 -188 -9
5419 -9 278 -77 -163 129 -133 2 206 29 23 -7 -180 45 210 22 -80 -40 32 61 -103 -50 119 -47 6 68
5443 68 -98 60 166 -271 -12 217 -222 -151 146 -120 111 200 -360 -101 416 -130 -59 169 -235 -42 280
5464 280 -251 -42 267 -110 -78 230 -35 -48 106 -208 -22 230 -156 -62 166 -48 -38 20 -121 70 101 -62
5486 -62 -66 -14 -2 43 -54 94 170 -135 -105 53 -42 123 91 -219 15 149 -199 4 237 -186 29 140 -240 81
5510 81 258 -299 65 273 -240 -66 94 -243 131 304 -342 -139 268 -184 31 168 -207 -18 118 -298
5530 -298 35 275 -100 -115 78 1 71 25 -174 -16 128 50 -54 -72 57 135 -77 31 -3 -117 39 82 -54
5553 -54 217 45 -364 72 267 -117 79 38 -316 172 153 -297 113 218 -220 -10 194 -272 78 164 -274
5574 -274 125 249 -284 -21 109 -125 105 106 -260 38 223 -82 -18 96 -182 -14 15 -47 131 116 -76 -37
5596 -37 28 60 3 -178 14 88 -24 7 -31 -121 236 100 -164 107 68 -230 121 124 -72 112 -31 -265 223 210
5620 210 -275 66 81 -193 215 31 -309 152 129 -305 137 110 -255 -6 35 -161 161 94 -305 17 163 -29
5642 -29 23 -59 -140 29 124 -89 11 35 -83 10 38 96 64 -81 -21 68 4 114 -79 -114 166 41 -113 107 -28
5667 -28 -110 149 -70 -103 219 7 -288 135 83 -173 161 -47 -224 249 -22 -250 163 75 -146 78 19 -190
5689 -190 118 17 -215 166 123 -177 102 86 -43 100 -60 -175 83 116 -74 -23 6 -5 10 12 -82 13 -29 -14
5713 -14 -27 38 155 -36 -126 11 28 -32 23 -39 -54 175 -103 -112 221 2 -129 96 -45 -113 229 -141 -138 151 -16
5738 -16 -138 106 0 -98 191 -34 -164 231 26 -127 97 92 -130 154 -34 -114 104 -46 -135 139 86 -74
5760 -74 34 -89 -14 100 -61 -84 22 -22 -21 -60 -33 43 61 -60 -13 7 -13 37 -68 -55 112 44 -83 55 39 -6
5786 -6 77 -133 6 207 -3 -111 94 -2 -40 96 -134 -77 147 -146 -67 135 -78 -31 94 -50 -22 240 -95
5809 -95 -152 116 -6 -41 43 -84 27 133 -145 -94 61 -50 -31 19 -58 -8 78 -108 2 119 -11 5 30 32 77
5834 77 7 -139 35 53 -17 47 29 4 81 -104 -33 162 24 -46 12 -90 -33 66 -87 -49 81 -20 -96 -20 -48 23
5860 23 139 -170 -4 169 -121 -49 141 -36 30 6 -251 -23 269 -40 -98 57 -107 16 59 -100 74 161
5882 161 -85 -40 105 -10 -50 97 -58 38 124 -114 -47 133 64 33 -112 -98 38 83 14 53 -39 -115 -12 -13 89
5907 89 178 -57 -172 42 -84 109 143 -99 28 157 -126 -83 107 -14 68 60 -150 -72 50 -98 72 230 -98
5930 -98 -72 21 -54 160 137 -118 -71 69 -109 60 52 -9 92 41 -207 63 115 -24 -16 32 -12 5 -73 -112 161 150
5956 150 -33 -74 -51 -56 166 67 -17 99 -46 -110 -24 59 63 94 -165 -103 108 39 -2 60 -24 72 67 -239 50 184 -105
5983 -105 37 40 -141 50 70 -132 53 159 -129 -139 129 -91 87 120 -96 23 84 -101 26 116 6 25 -33
6006 -33 -100 84 107 -12 53 28 -67 58 -99 -8 134 -42 -66 5 -16 -27 81 -87 -14 91 -79 -56 162 18
6030 18 31 16 -107 -54 140 -112 2 88 -65 27 77 -97 75 102 -163 22 38 -58 36 -20 -29 83 -20 -121 93
6055 93 51 -32 29 -9 -43 91 -20 -118 42 61 -84 74 -8 -17 196 -54 -133 78 16 -60 34 -50 -34 66 -86 -16
6081 -16 212 -69 -33 8 -106 48 166 -48 -62 47 -73 -1 27 17 79 21 -233 39 160 -94 -5 17 -51 23
6105 23 -42 -214 39 105 -20 57 -14 -100 9 -22 -25 65 -10 -137 3 69 69 160 -178 -71 24 -68 -16 146 -138 -12
6131 -12 99 -100 8 135 -105 -1 173 -52 -34 21 -153 90 211 -68 -102 -20 -81 65 130 -29 -6 -87 -131
6154 -131 32 139 -23 -8 -114 -26 166 89 -86 7 -42 11 100 -47 -166 106 19 -35 194 -59 -99 11 -21 59
6178 59 157 -171 -137 73 100 107 32 -152 -61 175 -55 -2 55 -93 -61 14 23 123 43 -141 -53 137 6 -18 -88 -134
6204 -134 135 60 -129 -2 26 -26 53 16 -1 19 -35 -127 169 69 -82 -26 -105 40 124 -66 -48 30 -62 92 106
6229 106 -63 0 -29 -64 155 135 -75 -48 -39 -59 148 61 -206 24 102 -64 55 66 -94 51 106 -81 106 84
6253 84 -135 40 103 5 35 -37 -168 49 123 -32 -28 -59 4 80 -12 -1 58 -69 9 82 11 57 -69 -91 60 147 -18
6280 -18 -42 3 -64 147 127 -102 -13 37 -119 65 88 -93 62 -11 -54 93 36 -116 -67 64 62 170 30 -145 123
6305 123 7 -102 89 0 17 99 -16 20 108 -67 -199 24 127 -54 69 -10 -53 87 -5 -106 37 -8 -53
6328 -53 -47 -27 29 58 -101 17 47 -25 20 15 -64 57 36 -131 50 -35 9 32 -38 11 96 -10 -129 95 67 10 109
6355 109 -82 -62 159 -12 -73 96 -41 -68 84 -8 -5 93 -85 -136 98 57 -43 -26 -69 -6 149 -73 -49 111
6379 111 -39 -45 -13 -10 58 -51 -67 16 115 48 -44 -102 -27 45 113 -61 -43 11 11 7 -67 16 -5 -35 -32 185 46 -41 -57 -24
6409 -24 64 156 -77 -184 41 56 6 59 -52 -51 71 0 46 116 -78 -146 104 84 72 0 -134 -73 157 61 0 -67
6435 -67 -66 -17 102 23 -57 36 -120 16 169 74 -29 -113 -103 125 105 -38 -111 -109 -24 52 16 -56 -16 -51 36 212 67
6462 67 -68 -25 -104 5 214 -19 -192 -42 -6 42 132 -95 -177 52 105 14 140 -70 -242 36 57 121 86 -155
6486 -155 -188 41 172 51 -36 -164 -14 189 38 32 -58 -83 -5 140 46 40 -119 -115 66 136 22 -134 -117 -70 122
6511 122 161 -57 -29 -98 -79 25 47 -52 16 -110 -41 114 43 -159 -56 -16 46 80 -103 -169 19 56 56 79 -41 -91
6537 -91 10 5 38 58 -145 -94 36 133 98 -14 -152 -55 160 14 -3 -64 -43 15 39 4 4 10 -88 53 73 4 14 -109
6565 -109 -75 156 116 -42 -32 -20 -5 74 42 -78 -21 -28 -46 158 131 -134 -33 2 -30 209 13 -109 77 5 2 52
6591 52 -67 -52 77 30 16 0 -44 -77 -7 22 19 11 -87 -35 49 20 45 -104 -79 106 23 -58 34 1 -83 29 34 -49 59
6620 59 13 -143 62 45 -9 98 -33 -95 121 -87 -95 58 63 -99 39 35 -19 36 -112 -111 112 14 22 92 -65 -37 38
6647 38 -12 -52 51 -65 -152 56 4 -19 -35 -77 -58 102 3 -88 10 -24 -2 1 -65 27 1 -74 22 18 -28 -8 -136 -165 110
6676 110 115 24 10 -12 -23 108 34 -69 86 -9 -80 133 51 -74 -13 -85 -18 105 -6 -147 -76 -3 56 77 -89 -66
6702 -66 32 4 29 123 -9 -92 35 7 116 12 -84 -71 93 143 90 -22 -120 53 102 2 -8 -37 -137 65 100
6727 100 35 61 -141 -151 62 163 4 3 -132 -34 226 81 -109 -14 -123 53 197 15 -6 7 -109 48 163
6750 163 15 -136 -119 -4 158 159 -69 -132 24 97 64 54 -117 -72 46 -38 98 19 -194 -114 63 111 61 -102
6774 -102 -189 -27 50 143 52 -122 -152 23 57 10 48 -107 -136 86 109 46 -87 -239 -89 168 48 -64 -51 -191
6798 -191 57 167 -53 -92 -25 -26 45 118 -39 -81 -64 -105 132 169 -65 -144 -34 9 147 56 -146 -87 29 -17 -17 45
6824 45 -95 -78 53 19 131 -15 -137 17 98 84 12 -119 -78 95 13 23 65 -107 -72 113 -82 45 63 -190
6848 -190 -81 72 3 86 61 -130 -34 91 -36 -63 60 5 57 49 -124 -7 -17 -76 75 115 -38 -79 17 -36 44
6873 44 72 -91 -21 10 29 116 -42 -12 22 -8 47 29 32 -95 -50 -86 19 53 -27 -108 45 -45 -30 118 -77 14 78
6900 78 -93 76 61 -54 20 33 -10 98 142 -114 6 75 8 47 83 -112 8 68 -117 98 58 -107 -84 2 37
6925 37 29 26 -164 -94 76 -5 5 -31 -9 22 40 -24 13 5 -81 10 48 118 22 -104 -10 104 55 8 -23 -78 89 70 -58
6954 -58 59 -32 -163 26 65 11 10 -52 -193 193 154 -67 -29 -26 -26 109 105 -49 -22 -8 -88 -15 103 -90 -46 -24 -6
6981 -6 139 20 -94 -69 31 61 43 -55 -60 33 31 31 33 -6 -21 -40 -36 146 137 -110 -69 -14 49 99 -18 -99 46 59 -36 99
7011 99 17 -36 -9 -12 4 117 29 -127 34 159 -35 11 -122 -140 218 46 -81 -14 -22 -61 94 42 -36 -49 -90 -84 33
7038 33 55 -82 -16 -61 -32 124 -25 -116 -20 58 30 63 -31 -66 -17 -7 46 45 -14 -71 -85 13 142 39 -136 -36 9
7065 9 -16 130 9 -70 22 3 -13 137 -42 -124 46 3 -8 141 -34 -144 56 85 -61 9 -54 -73 39 54 -1
7090 -1 26 -31 -108 51 52 -24 -55 -114 12 80 13 -81 -39 -60 31 44 4 18 -38 -42 10 43 26 -8 -77 -18 92 74 -56 -84
7120 -84 -17 29 91 29 -97 63 56 17 6 -4 -39 12 -16 -5 98 -36 -132 17 4 2 86 -83 -18 96 12 -29 46 -51
7148 -51 -56 33 28 50 87 -69 -95 68 63 -16 -66 -87 -33 82 -2 -17 29 -26 44 -48 -38 66 0 -60 11 50 -15 36 -43 49
7178 49 127 61 -37 47 41 -34 -46 2 -37 6 18 -61 66 -14 -96 1 14 6 35 -43 -52 60 -4 -22 8 44 25 68 -25 -15 19
7209 19 42 -77 -10 -19 14 38 -38 -50 82 -54 -54 45 -39 -25 58 -39 21 42 -74 -7 15 -4 -35 -3 -75 -9 55 -34 60
7238 60 56 -44 16 -80 -40 27 -40 -59 -28 63 34 73 -17 -28 65 27 7 84 11 -58 15 -65 -21 81 -62 -36 157 84 -41
7267 -41 -53 -8 52 122 21 -58 6 27 56 32 11 -25 -31 -47 4 191 -67 -49 -83 60 87 33 -124 -99 74 60 47 16
7295 16 -131 -70 15 23 85 5 -86 -10 69 84 12 -71 -88 131 19 51 26 -152 -32 99 74 1 55 -101 8 94 12
7322 12 -5 -64 -140 16 267 -91 -57 -20 -65 5 140 -25 -83 -8 -39 30 53 0 -81 -53 38 37 19 -91 -55 41 89 87
7350 87 -78 -113 -4 72 70 57 -54 -34 44 44 64 50 -133 -40 55 114 12 -7 -145 32 165 -64 -70 -12 -93 23 160
7377 160 -103 -98 97 -2 65 84 22 -84 -26 -67 96 66 -59 -126 5 34 -20 41 -90 -71 17 -46 51 67 -43 -34 92
7404 92 44 73 -94 -72 23 79 62 -58 -99 -20 154 5 -20 4 -89 -9 60 -36 15 12 -111 14 143 -8 -29 -71 -128
7431 -128 47 76 -66 -102 79 20 34 56 -6 -5 2 21 5 69 -53 -77 4 103 94 26 -103 34 67 38 -94 -59 62
7458 62 19 -57 -43 9 -49 47 59 -73 47 -8 -51 0 137 -16 -124 -12 5 106 106 -110 -86 77 4 103 82 -101
7484 -101 20 5 20 61 77 -83 -49 51 50 7 -76 -44 -1 99 22 -61 -44 3 63 55 30 -13 -2 -11 65 6 -11 -108 -64
7513 -64 88 147 -14 -51 -11 -10 78 67 -195 -27 -19 -65 60 70 -62 -37 59 -23 94 106 -61 -56 75 59 -37 -41 -73 -12
7541 -12 72 -27 13 -28 -59 77 36 106 73 7 -68 51 120 46 -65 -125 44 47 8 -47 -106 -5 46 54 -47 44 -38 -89
7569 -89 74 163 22 -97 -86 6 118 85 -144 -42 42 -7 94 5 -80 48 46 -53 66 -55 -56 30 47 28 35 -55 -103
7596 -103 19 108 -44 -40 -62 -77 6 81 -32 31 -18 -34 28 100 54 -76 -53 64 66 -3 17 -50 -50 49 -38 -68 26 95 86
7625 86 123 -36 -56 68 -19 -52 55 66 -51 -4 17 -9 126 -41 -33 35 22 -66 4 0 -32 26 4 -55 37 12 -43 -39 34
7654 34 54 -32 -26 -19 31 -53 -14 -24 22 20 -17 10 39 -10 -67 13 11 15 10 -27 -4 83 9 -82 -6 -12 -52 149 -34 -91 42 -7
7686 -7 -68 14 106 -2 91 -64 -23 89 1 -84 10 -12 -93 54 -68 0 28 -18 -60 130 21 -49 -55 54 79 56 -55
7713 -55 -43 19 105 -54 1 -11 35 52 -19 66 -5 31 -19 -33 -22 48 -38 -72 4 51 15 63 -83 -58 134 6 -117 30
7741 30 64 -32 104 -72 -64 68 -38 -43 106 9 -73 -13 -38 -6 69 -119 -55 49 16 -12 76 -28 -57 46 -84 -17
7767 -17 84 -70 -102 12 12 97 20 -104 -21 99 19 -83 19 -16 -18 -2 -61 41 8 -62 5 -14 -22 17 -77 -72 80 -27
7795 -27 -65 -1 -1 35 45 -57 -54 62 -7 -14 56 -14 -103 10 -13 33 116 -74 -141 20 64 47 30 -43 36 96 1 -13 -51
7824 -51 -6 -49 18 10 34 17 -106 -82 60 40 -25 -114 -61 42 10 36 6 33 -17 107 -9 -26 -15 -7 24 59 36 -58 75
7853 75 -68 51 49 -108 -48 63 -30 -37 142 18 -34 63 -68 -11 111 -11 -94 97 23 -8 31 -103 -66 96 59
7878 59 -82 -22 -55 14 58 -64 -56 -20 -71 -59 47 -23 42 -126 -49 25 13 -60 -87 -36 58 121 -36 -50 20 55 -2 75
7906 75 -60 -92 15 -28 5 62 -29 -72 -2 32 23 35 -79 -48 151 -19 -97 65 15 -26 118 -69 -55 40 -90 17
7932 17 147 18 -54 -102 -8 85 70 0 -48 -8 14 91 -52 -80 -18 32 -51 -41 33 3 -6 -59 32 40 -71 -58 42 70 22
7961 22 38 -86 1 141 19 -9 12 4 20 94 -39 -35 56 -116 -46 105 63 -13 36 -24 8 78 -65 -57 96 1 64 57
7989 57 -60 44 85 -104 -70 56 -23 -80 35 -47 46 36 -89 33 64 -63 34 21 -22 59 -40 -3 25 4 -81 0
8015 0 32 44 10 -146 -48 67 -20 -58 27 -31 -32 17 -46 -24 74 -22 -5 22 -5 8 59 -97 61 89 23 -21 53 -7 33
8044 33 14 -23 -14 14 -16 -71 3 5 101 -71 68 47 15 -127 73 40 61 -21 -12 10 37 13 -39 19 -18 -3 55 -16 -60 49
8074 49 -19 -84 41 59 2 -25 -25 83 94 -28 -22 24 23 -1 -19 -56 -38 -3 -14 58 66 5 -26 -40 -8 49 -15 -56 -5 80 -12
8105 -12 17 -19 -25 23 -47 -67 0 95 -6 32 -16 32 84 -34 -79 39 -26 -40 -68 -26 -15 -24 -30 -30 36 -1 4 10 28 -53 17 27
8137 27 -31 83 7 -27 21 -53 41 37 -62 -16 -24 20 -34 -11 -70 75 -22 -50 -7 69 -16 -42 -38 38 62 -53 12 -8 81 -72
8167 -72 -35 90 33 34 -61 13 11 -9 -24 -25 -2 54 14 -98 13 31 -7 4 26 16 75 56 -14 8
8191H
##END NTUPLES=NMR FID
##END=
