##TITLE=1H_LY-7.2.Dix.1.B
 CD3CN, 8 sc, 
 26.04.2021
##JCAMPDX= 6.0         $$ Bruker NMR JCAMP-DX V2.0
##DATA TYPE= NMR FID
##DATA CLASS= NTUPLES
##ORIGIN= UXNMR, Bruker Analytische Messtechnik GmbH
##OWNER= root
$$ XWIN-NMR		Version 3.5
$$ Mon Apr 26 16:10:24 2021 Russian Standard Time (UT+4h)  she@DPX200
##.OBSERVE FREQUENCY= 200.131506
##.OBSERVE NUCLEUS= ^1H
##.DELAY= (6, 6)
##.ACQUISITION MODE= SIMULTANEOUS
##.ACQUISITION SCHEME= undefined
##.AVERAGES= 8
##.DIGITISER RES= 18
##SPECTROMETER/DATA SYSTEM= spect
##.PULSE SEQUENCE= zg30
##.SOLVENT NAME= CD3CN
##.SHIFT REFERENCE= (INTERNAL, CD3CN, 0, 15.7039)
##AUDIT TRAIL= $$ (NUMBER, WHEN, WHO, WHERE, WHAT)
$$ ##TITLE= Audit trail, XWIN-NMR		Version 3.5
$$ ##JCAMPDX= 5.01
$$ ##ORIGIN= Bruker BioSpin GmbH
$$ ##OWNER= she
$$ F:/spectra/data/she/nmr/H-F/1/audita.txt
$$ ##AUDIT TRAIL=  $$ (NUMBER, WHEN, WHO, WHERE, WHAT)
(   1,<2021-04-26 16:08:52.54 +0400>,<she>,<DPX200>,
      <created by zg, POWCHK disabled, PULCHK disabled
       configuration hash MD5:
       00 E9 B6 7A A2 85 ED C7 34 08 36 98 17 FE 4E 26
       data hash MD5: 16K
       AA 53 83 62 E2 F9 A2 8E DB AC 8B 5A 57 FB 3B 26>)
$$ ##END=
$$ 
$$ hash MD5
$$ A7 87 E2 44 85 B7 81 9B 61 8A 38 F3 74 8A E6 A6
##$RELAX= 
##$RELAX= 
##$RELAX= 
##$RELAX= 
##$RELAX= 
##$RELAX= 
$$ Bruker specific parameters
$$ --------------------------
##$DU= <F:/spectra>
##$EXPNO= 1
##$NAME= <H-F>
##$PROCNO= 1
##$TYPE= <nmr>
##$USER= <she>
##$AMP= (0..31)
100 100 100 100 100 100 100 100 100 100 100 100 100 100 100 100 100 100 
100 100 100 100 100 100 100 100 100 100 100 100 100 100 
##$AQSEQ= 0
##$AQ_mod= 1
##$AUNM= <au_zg>
##$AUTOPOS= <>
##$BF1= 200.13
##$BF2= 200.13
##$BF3= 200.13
##$BF4= 200.13
##$BF5= 200.13
##$BF6= 200.13
##$BF7= 200.13
##$BF8= 200.13
##$BYTORDA= 1
##$CFDGTYP= 0
##$CFRGTYP= 5
##$CHEMSTR= <none>
##$CNST= (0..31)
1 1 145 1 1 1 1 1 1 1 1 1 1 1 1 1 1 1 1 1 1 1 1 1 1 1 1 1 1 1 1 1 
##$CPDPRG= <>
##$CPDPRG1= <>
##$CPDPRG2= <>
##$CPDPRG3= <>
##$CPDPRG4= <mlev>
##$CPDPRG5= <mlev>
##$CPDPRG6= <mlev>
##$CPDPRG7= <mlev>
##$CPDPRG8= <mlev>
##$CPDPRGB= <>
##$CPDPRGT= <>
##$D= (0..31)
0 1.2 0 0 0 0 0 0 0 0.06 0 0.03 0 0 0 0 0.0002 0 0 0 0 0 0 0 0 0 0 0 0 
0 0 0 
##$DATE= 1619438931
##$DBL= (0..7)
120 120 120 120 120 120 120 120 
##$DBP= (0..7)
150 150 150 150 150 150 150 150 
##$DBP07= 0
##$DBPNAM0= <>
##$DBPNAM1= <>
##$DBPNAM2= <>
##$DBPNAM3= <>
##$DBPNAM4= <>
##$DBPNAM5= <>
##$DBPNAM6= <>
##$DBPNAM7= <>
##$DBPOAL= (0..7)
0.5 0.5 0.5 0.5 0.5 0.5 0.5 0.5 
##$DBPOFFS= (0..7)
0 0 0 0 0 0 0 0 
##$DE= 6
##$DECBNUC= <off>
##$DECIM= 32
##$DECNUC= <off>
##$DECSTAT= 4
##$DIGMOD= 1
##$DIGTYP= 9
##$DL= (0..7)
0 120 120 120 120 120 120 120 
##$DP= (0..7)
150 150 150 150 150 150 150 150 
##$DP07= 0
##$DPNAME0= <>
##$DPNAME1= <>
##$DPNAME2= <>
##$DPNAME3= <>
##$DPNAME4= <>
##$DPNAME5= <>
##$DPNAME6= <>
##$DPNAME7= <>
##$DPOAL= (0..7)
0.5 0.5 0.5 0.5 0.5 0.5 0.5 0.5 
##$DPOFFS= (0..7)
0 0 0 0 0 0 0 0 
##$DQDMODE= 0
##$DR= 18
##$DS= 0
##$DSLIST= <SSSSSSSSSSSSSSS>
$$ [...]
##$SUBNAM2= <"">
##$SUBNAM3= <"">
##$SUBNAM4= <"">
##$SUBNAM5= <"">
##$SUBNAM6= <"">
##$SUBNAM7= <"">
##$SUBNAM8= <"">
##$SUBNAM9= <"">
##$SW= 16.9725357007746
##$SWIBOX= (0..15)
0 0 2 0 0 0 0 0 0 0 0 0 0 0 0 0 
##$SW_h= 3396.73913043478
##$TD= 16384
##$TD0= 1
##$TE= 0
##$TE2= 300
##$TE3= 300
##$TEG= 300
##$TL= (0..7)
0 120 120 120 120 120 120 120 
##$TP= (0..7)
150 150 150 150 150 150 150 150 
##$TP07= 0
##$TPNAME0= <>
##$TPNAME1= <>
##$TPNAME2= <>
##$TPNAME3= <>
##$TPNAME4= <>
##$TPNAME5= <>
##$TPNAME6= <>
##$TPNAME7= <>
##$TPOAL= (0..7)
0.5 0.5 0.5 0.5 0.5 0.5 0.5 0.5 
##$TPOFFS= (0..7)
0 0 0 0 0 0 0 0 
##$TUNHIN= 0
##$TUNHOUT= 0
##$TUNXOUT= 0
##$USERA1= <user>
##$USERA2= <user>
##$USERA3= <user>
##$USERA4= <user>
##$USERA5= <user>
##$V9= 5
##$VALIST= <valist>
##$VCLIST= <CCCCCCCCCCCCCCC>
##$VD= 0
##$VDLIST= <DDDDDDDDDDDDDDD>
##$VPLIST= <PPPPPPPPPPPPPPP>
##$VTLIST= <TTTTTTTTTTTTTTT>
##$WBST= 1024
##$WBSW= 4
##$XGAIN= (0..3)
0 0 0 0 
##$XL= 0
##$YL= 0
##$YMAX_a= 815992
##$YMIN_a= -814199
##$ZGOPTNS= <>
##$ZL1= 120
##$ZL2= 120
##$ZL3= 120
##$ZL4= 120
##$ABSF1= 10
##$ABSF2= 0
##$ABSG= 5
##$ABSL= 3
##$ALPHA= 0
##$AQORDER= 0
##$ASSFAC= 0
##$ASSFACI= 0
##$ASSFACX= 0
##$ASSWID= 0
##$AUNMP= <proc_1d>
##$AZFE= 0.1
##$AZFW= 0.1
##$BCFW= 1
##$BC_mod= 2
##$BYTORDP= 1
##$COROFFS= 0
##$CY= 11.3945322036743
##$DATMOD= 1
##$DC= 2
##$DFILT= <>
##$DTYPP= 0
##$F1P= 15.9154993809931
##$F2P= -4.1035820241983
##$FCOR= 0.5
##$FTSIZE= 0
##$FT_mod= 4
##$GAMMA= 1
##$GB= 0.15
##$INTBC= 1
##$INTSCL= 1
##$ISEN= 128
##$LB= 0.24
##$LEV0= 0
##$LPBIN= 0
##$MAXI= 10000
##$MC2= 0
##$MEAN= 0
##$ME_mod= 0
##$MI= 1.114404
##$NCOEF= 0
##$NC_proc= 0
##$NLEV= 6
##$NOISF1= 3.799351
##$NOISF2= 2.8
##$NSP= 1
##$NTH_PI= 0
##$NZP= 0
##$OFFSET= 15.70392
##$PC= 1
##$PHC0= -11132.12
##$PHC1= 27.40096
##$PH_mod= 1
##$PKNL= yes
##$PPARMOD= 0
##$PSCAL= 0
##$PSIGN= 0
##$REVERSE= no
##$SF= 200.130013532006
##$SI= 16384
##$SIGF1= 3
##$SIGF2= 2
##$SINO= 400
##$SIOLD= 16384
##$SREGLST= <1H.CDCl3>
##$SSB= 0
##$STSI= 0
##$STSR= 0
##$SW_p= 3612.71676300578
##$SYMM= 0
##$S_DEV= 0
##$TDeff= 0
##$TDoff= 0
##$TI= <>
##$TILT= no
##$TM1= 0
##$TM2= 0
##$TOPLEV= 0
##$USERP1= <user>
##$USERP2= <user>
##$USERP3= <user>
##$USERP4= <user>
##$USERP5= <user>
##$WDW= 1
##$XDIM= 8192
##$YMAX_p= 0
##$YMIN_p= 0
$$ End of Bruker specific parameters
$$ ---------------------------------
##NTUPLES= NMR FID
##VAR_NAME=  TIME,          FID/REAL,        FID/IMAG
##SYMBOL=    X,             R,               I
##VAR_TYPE=  INDEPENDENT,   DEPENDENT,       DEPENDENT
##VAR_FORM=  AFFN,          ASDF,            ASDF
##VAR_DIM=   8192,          8192,            8192
##UNITS=     SECONDS,       ARBITRARY UNITS, ARBITRARY UNITS
##FACTOR=    0.0002944,     1,               1
##FIRST=     0,             0,               0
##LAST=      2.4114304,     0,               0
##MIN=       0,             -814199,         0
##MAX=       2.4114304,     815992,          0
$$ Real data points
##PAGE= N=1
##DATA TABLE= (X++(R..R)), XYDATA
$$ [...]
375 125109 -142115 -204357 34648 232112 92611 -190357 -203838 76316 248275 70730
385 70730 -201672 -185231 94688 235146 32150 -216288 -147894 127728 208540 -8575 -198642
396 -198642 -95408 132048 156330 -32462 -159387 -71314 96569 132576 6933 -116161
406 -116161 -86884 52163 121870 30738 -106725 -106070 44479 147079 52911 -121271 -139154
417 -139154 38273 175668 66683 -153045 -164044 67333 212596 51936 -188500 -157245
427 -157245 101404 207439 6710 -203223 -116999 137458 196026 -20989 -205769 -100986
437 -100986 140614 176354 -35929 -189859 -72140 141894 150980 -47069 -169081 -56770
447 -56770 123292 128837 -37275 -149162 -58557 115306 138682 -26969 -159915 -74928 113472
458 113472 144874 -25109 -157750 -64989 121465 139344 -36581 -165128 -65810 128368 146008
469 146008 -43665 -176061 -58763 145710 140705 -67446 -178344 -38388 146353 116859
479 116859 -72082 -151167 -20395 131912 100568 -68477 -145415 -26728 128499 110707 -58415
490 -58415 -146395 -29903 129538 109595 -62217 -147682 -27758 131890 111052 -63146 -150305
501 -150305 -24528 140143 108205 -78875 -156500 -12917 148965 101664 -83863 -147104 -6376
512 -6376 139625 90292 -84021 -142356 -3600 143187 92937 -90248 -148460 3305 149367
523 149367 81745 -101830 -140942 14593 143240 72336 -95110 -131859 10121 136083 72909
534 72909 -95099 -135703 15335 149385 73136 -108689 -137231 29106 153023 60027 -113653
545 -113653 -122641 40444 147141 51518 -111616 -115525 43305 141988 43418 -113081 -107143
556 -107143 48862 134865 35708 -108670 -102225 41696 126130 38264 -103624 -106729 37774
567 37774 131496 39494 -114114 -111430 47755 137068 28835 -120285 -100372 56799 130521
578 130521 21423 -117041 -93637 57473 127797 19961 -115799 -88004 63028 124813 13856
589 13856 -111587 -78151 62066 115686 16542 -99801 -79601 51341 118470 28194 -102854
600 -102854 -92996 53180 133131 26923 -120215 -98350 64866 138591 15678 -132564 -97275
611 -97275 74626 141768 2835 -149000 -93099 94750 144451 -20579 -161391 -70154 118140
622 118140 126714 -49356 -149482 -35750 119263 97746 -55937 -119891 -14401 104383 76585
633 76585 -47478 -95257 -10850 84711 68181 -28009 -76741 -24675 58687 72779 -3089 -78543
645 -78543 -52391 52325 96614 5704 -104539 -70895 69677 113642 -11913 -128751 -65350
656 -65350 90469 115791 -28042 -138587 -55536 104759 111393 -47044 -142602 -34389 123304
667 123304 100115 -70043 -136172 -6560 125302 74557 -74476 -109352 8140 108616 61479
678 61479 -59620 -91799 552 92026 63319 -46779 -90273 -6156 92106 69793 -45712
689 -45712 -101069 -17516 96214 80335 -51127 -115927 -16733 110781 79233 -74018 -126247
700 -126247 2096 123117 58483 -93126 -109989 26173 116137 36410 -93740 -91622 32398
711 32398 102126 29065 -78686 -72967 32789 88850 22395 -67409 -59950 26003 75727 31593
723 31593 -46932 -62533 5262 73724 51966 -41558 -85555 -8827 91767 68399 -55673 -102606
735 -102606 -177 106559 60043 -79625 -110533 18483 124404 51005 -100327 -111563 36810
746 36810 130202 29306 -117668 -93185 63302 119832 1631 -112812 -63217 69007 94473
757 94473 -13109 -96112 -45172 61887 83045 -3674 -79819 -46462 46815 74188 4094 -66318
769 -66318 -44807 40107 76923 13731 -68686 -58485 36173 88182 18891 -81729 -67848 47931
781 47931 99314 9522 -93638 -64609 51819 90568 -1279 -91321 -52527 59302 87185
792 87185 -10046 -99420 -53661 66028 89903 -15875 -98019 -39836 70278 77653 -22388
803 -22388 -88066 -32060 63346 69267 -16781 -76887 -30454 62275 73928 -16912 -86631 -36148
815 -36148 65345 78568 -13879 -82742 -32665 64361 71270 -21876 -85012 -29150 70295 73605
827 73605 -25922 -88596 -24853 73431 67186 -32730 -87764 -24906 68485 66811 -25052 -81728
839 -81728 -27574 63910 64583 -32817 -91857 -21671 82760 70291 -43819 -96443 -13520 85522
851 85522 60911 -49378 -88106 -2264 86021 55851 -48662 -80862 4379 84083 43026 -58117
863 -58117 -73464 17376 84283 37228 -53488 -65026 8658 63875 31459 -40274 -56280 3728
875 3728 60691 35924 -40747 -65048 -2682 62117 40166 -41059 -70200 -3654 70529 50001
887 50001 -41757 -81605 -10514 75193 51569 -49505 -79293 10828 89248 38087 -69723 -78721
899 -78721 23076 90074 30164 -66915 -65130 28972 82372 22638 -65391 -59597 27842 72889
911 72889 16978 -57178 -47083 29833 67099 15378 -58031 -58420 16376 71444 32399 -52812
923 -52812 -66702 16442 78418 23501 -72941 -67889 34936 86613 11343 -80871 -56096 48151
935 48151 82125 -2487 -84972 -49418 52569 77694 -4454 -72221 -30561 52833 55077 -21287
947 -21287 -63296 -15460 50161 46884 -10776 -46101 -21439 27462 40964 3143 -40143 -34669
959 -34669 17283 51899 20292 -41139 -49430 12439 61735 20765 -60526 -62592 31653 91283
971 91283 20344 -86673 -69981 49844 93390 -5600 -97079 -42273 75589 80591 -30688
982 -30688 -93255 -21160 76461 59111 -42849 -80944 -4636 76300 50326 -39974 -67134 -3009
994 -3009 55170 31531 -30645 -43588 3320 44308 30293 -19689 -46438 -16178 36733 44077
1006 44077 -9026 -53715 -23519 44642 55047 -12492 -66376 -29539 48202 55935 -18680 -68134
1018 -68134 -16669 64462 54690 -37959 -80536 -10052 71727 47933 -41243 -64547 5550 62679
1030 62679 28906 -42031 -52411 6323 51878 26938 -31773 -45225 4307 50233 29917 -31511
1042 -31511 -54625 -7499 49446 42443 -18973 -53623 -13091 49375 43212 -30414 -66880 -6254
1054 -6254 69769 47431 -44745 -71578 7342 75603 32723 -57663 -65191 17547 72332 25671
1066 25671 -52634 -52429 22159 61845 9981 -58575 -45517 30608 63190 9838 -51773 -39376
1078 -39376 22026 47172 8264 -39002 -33849 16080 46216 16295 -34814 -38519 11520 47714
1090 47714 16273 -41942 -44384 17191 59962 23969 -45306 -54083 11683 59718 20153 -50227
1102 -50227 -46853 27886 63833 7354 -59907 -41094 33990 56872 -553 -53974 -32117 32730
1114 32730 54580 4303 -50497 -36580 25753 50019 3078 -48060 -28838 35326 51449 -4747
1126 -4747 -54776 -31996 31349 51059 2071 -48911 -31770 30168 49984 -655 -52335 -32336
1138 -32336 32618 49843 -5360 -51550 -22798 39252 48697 -8923 -57920 -29837 38965 54312
1150 54312 -3770 -53221 -25533 38975 47767 -13627 -55987 -18418 44286 45444 -14136 -53339
1162 -53339 -17861 44862 46137 -18704 -59144 -18280 47824 46806 -19267 -54522 -8412 46929
1174 46929 30163 -30408 -49093 -1712 47214 31981 -25576 -46238 -5896 37861 27656 -20409
1186 -20409 -40875 -5674 35332 26865 -14373 -33424 -9363 28109 30222 -11302 -42019 -14339
1198 -14339 39922 46758 -9937 -55797 -22447 45904 47338 -20114 -55621 -9034 52921 40981
1210 40981 -31124 -60760 -2688 57820 32995 -40064 -57832 6138 61498 27492 -45724 -51636
1222 -51636 11458 49408 14713 -39059 -37174 17774 47968 10256 -40115 -36645 13041 44399
1234 44399 16744 -31779 -32973 12106 38948 15760 -24689 -33719 3787 39495 21438 -26792
1246 -26792 -36291 8977 47991 21040 -41016 -46488 15653 53181 14663 -39055 -35241 16068
1258 16068 42023 5775 -39590 -29598 17357 37196 7294 -33948 -30907 14960 37993 6058
1270 6058 -34032 -31388 9162 38856 18033 -28201 -34399 8526 40192 16348 -34099 -39693 17050
1283 17050 57080 17002 -45501 -40834 22249 55983 12111 -50545 -39006 32214 57123 592
1295 592 -53738 -30071 37897 49253 -16497 -59074 -13809 46940 37327 -20696 -46754 -11309
1307 -11309 33194 24718 -17579 -30946 -5236 23200 22478 -7765 -29604 -11768 19676 22872 -1249
1320 -1249 -24888 -18855 17552 36424 6457 -33406 -28711 16651 42744 8086 -41657 -26261
1332 -26261 34301 45710 -9019 -50243 -21648 38754 45254 -14002 -50416 -12178 41050 35393
1344 35393 -18142 -47820 -10980 40235 28433 -24369 -38027 629 35115 21750 -23212 -39640
1356 -39640 -3989 32253 23459 -13359 -32890 -9764 29459 27136 -16515 -36178 -6265 31535
1368 31535 29290 -12515 -38408 -6949 38223 30076 -19796 -43194 -7142 43448 34717 -24812
1380 -24812 -43428 4793 42302 17648 -30312 -36651 8897 42111 15018 -29539 -30726 5658
1392 5658 32210 15977 -25550 -34081 5315 34140 14584 -22146 -29082 1774 30644 13696
1404 13696 -25881 -29303 6226 33891 19084 -23246 -36340 3624 37382 15698 -25712 -30249
1416 -30249 7217 37775 16911 -27961 -30897 10565 35823 13047 -27356 -31428 12921 42898
1428 42898 11410 -32841 -28024 11992 33331 9315 -28476 -25318 14551 32127 6067 -28281
1440 -28281 -29095 8889 36839 9523 -34479 -28996 15768 36505 7134 -34169 -29541 16848 36049
1453 36049 2621 -31449 -21113 18959 36550 2155 -37701 -22206 24431 34925 107 -31123
1465 -31123 -18648 22028 32636 -2659 -30531 -15721 18230 29880 2046 -31226 -18782 23427
1477 23427 31266 -4724 -33949 -19133 21983 32572 -4196 -33850 -14590 21670 25576 -6498
1489 -6498 -33072 -14956 25430 27558 -10492 -30917 -9860 21870 23828 -8092 -29252 -9757
1501 -9757 20181 22279 -1241 -23225 -14845 17799 27051 -3391 -27833 -12935 20956 30376 -258
1514 -258 -32229 -17719 23285 31996 -2289 -34401 -20002 27088 38620 -9294 -44901 -13551
1526 -13551 36424 31710 -20489 -45662 -3905 43241 24128 -28763 -37470 4033 35127 15277
1538 15277 -26490 -29310 10652 31399 6544 -22690 -19767 7378 23434 7742 -15756 -15369 2817
1551 2817 16489 13728 -6108 -21021 -6168 19241 18324 -6945 -23306 -7453 23110 23348 -11806
1564 -11806 -31007 -6187 27456 24728 -13838 -36109 -4802 35716 21996 -24780 -34862 4496
1576 4496 35832 14601 -28768 -29097 11918 31561 6061 -25119 -22887 8089 27695 8463 -21703
1589 -21703 -20375 7247 24016 9836 -18572 -22470 5912 26902 11959 -18035 -24581 3181
1601 3181 30928 16178 -24208 -29282 9723 35659 11084 -29437 -27231 16228 35927 1455
1613 1455 -33209 -19060 19905 29929 -1987 -31360 -15548 21067 23878 -6821 -25294 -9147
1625 -9147 17158 18100 -5681 -19246 -7040 10174 13957 2303 -13837 -14347 5714 19827 7565
1638 7565 -16247 -19699 5478 26196 9975 -22288 -22619 10134 30280 8900 -27403 -25687 16362
1651 16362 36564 2354 -35343 -20289 25079 34164 -7360 -37324 -10904 30083 24650 -14407
1663 -14407 -30140 -4701 24776 18491 -13292 -25117 -2992 20020 14987 -9336 -21317 -5184
1675 -5184 17269 15406 -6434 -19548 -8077 14950 19832 -2950 -23479 -10743 18737 22803 -4670
1688 -4670 -25965 -9500 22300 22493 -9508 -27088 -6287 23279 21713 -10760 -28943 -5205 26363
1701 26363 19504 -15458 -28321 -1019 26680 14824 -17887 -23166 3428 22450 10221 -14776
1713 -14776 -20051 1058 20663 12476 -12284 -20679 -1009 20627 14038 -12864 -21483 552 21512
1726 21512 12825 -12758 -21538 88 22321 13611 -14790 -22522 1491 23838 13152 -15506 -21954
1739 -21954 2673 22382 10155 -15118 -19811 2369 22382 12138 -16082 -23007 1965 24872
1751 24872 12880 -18610 -24474 5093 27288 10469 -21032 -22218 7227 26507 7921 -22215
1763 -22215 -20508 11785 28190 4783 -25258 -18792 14660 25985 301 -23715 -12234 15188
1775 15188 19777 -2181 -19830 -10768 11506 17173 -734 -17444 -10697 10084 17141 531 -16878
1788 -16878 -12019 7319 15929 4202 -13319 -13408 5742 18647 5904 -17409 -17799 8888 25068
1801 25068 5806 -22227 -17542 13943 25419 546 -24338 -14198 15760 23016 -1982 -22960
1813 -22960 -10208 16403 18831 -6061 -22736 -8175 16455 17332 -4209 -19019 -8983 11449
1825 11449 16344 -1289 -19214 -12143 12589 20947 -597 -22800 -12384 16866 21913 -5541 -25795
1838 -25795 -9272 20949 22463 -7028 -25515 -7313 21734 19408 -11331 -25321 -784 26266
1850 26266 15572 -16718 -22491 4589 22807 7338 -16307 -15036 5635 15969 4988 -9689
1862 -9689 -10747 -13 8265 4936 -4506 -9531 -3590 7815 10625 -1201 -15050 -11436 9076 18924
1876 18924 558 -21599 -12495 17875 23671 -6359 -28100 -7445 25175 20737 -13855 -26774
1888 -26774 1446 29112 15513 -19509 -25928 4692 27759 10575 -20119 -19068 10228 23409
1900 23409 1885 -21096 -13869 10458 17279 720 -14827 -10495 5913 14048 4146 -12200 -14360
1913 -14360 1130 14497 8112 -9685 -13971 1742 15492 7119 -13244 -17054 3087 20830 10437
1926 10437 -14862 -18854 5597 22874 6402 -19583 -16173 10902 21898 2244 -17774 -10114
1938 -10114 11705 16528 -1402 -16676 -9478 9631 15974 2386 -12884 -10279 4894 12062 2408
1951 2408 -11436 -11247 4073 14907 5768 -13413 -16034 4405 19644 5195 -19581 -17702 10417
1964 10417 23951 3331 -21096 -14572 11904 19827 -1529 -20352 -9070 16531 20284 -4082
1976 -4082 -22545 -8307 17468 17652 -6822 -19373 -3177 16763 12986 -6810 -14786 -2893 10972
1989 10972 9297 -4653 -12514 -4054 11109 12958 -2752 -16385 -9319 9223 14687 -644 -15411
2002 -15411 -8849 10978 15314 -3689 -19385 -8550 15096 16416 -7102 -20730 -3914 19016
2014 19016 14545 -9889 -19851 -2946 16334 12291 -6955 -14262 -243 15309 10040 -9286 -15870
2027 -15870 398 16591 10663 -8383 -14111 -12 13749 8997 -7362 -14171 -2631 12045 10600
2040 10600 -5904 -14846 -2505 13757 9243 -10574 -17914 -1313 16612 11798 -9004 -17143 -2621
2053 -2621 14269 10287 -9314 -16761 310 17984 10332 -11966 -16788 3123 18757 7897 -13968
2066 -13968 -16198 4543 19945 9456 -12287 -15948 3123 17869 6206 -14774 -13690 8789
2078 8789 19471 3141 -17246 -12995 8536 16611 985 -15690 -10374 8248 14606 397 -14171
2091 -14171 -8789 7281 10355 -2268 -11362 -5577 6882 9820 1026 -9223 -9752 814 10919
2104 10919 7600 -7046 -12076 1731 14800 7310 -11074 -13525 4517 17493 5929 -13830 -13051
2117 -13051 7841 20062 4626 -18126 -16229 9047 21114 2494 -18370 -11303 12626 17140
2129 17140 -4658 -20587 -7711 14405 15022 -5198 -17722 -5769 12992 12479 -5744 -15893 -4561
2142 -4561 11015 10590 -3519 -11408 -3483 8964 9706 -3174 -13351 -6619 10713 15721 -443 -15952
2156 -15952 -7760 11859 14122 -4201 -15738 -3573 14290 11601 -6394 -13860 -1300 12955 9236
2169 9236 -7858 -14180 -1321 13449 9800 -5981 -12316 -2800 8178 6015 -4447 -9036 -2495
2182 -2495 7295 8510 -2112 -12568 -7227 8485 12694 -1812 -15374 -7513 12334 15883 -3183
2195 -3183 -17958 -6801 14567 15127 -6570 -18913 -1751 21119 14484 -13621 -21999 1657 22042
2208 22042 9994 -14948 -15853 6957 18267 2923 -15150 -10926 7343 13624 203 -12424 -7243
2221 -7243 7527 11081 119 -10362 -8086 2005 7574 4338 -3641 -7380 -1856 7467 6745 -5883
2235 -5883 -13063 -1479 13659 9860 -8630 -14644 1242 16140 7697 -11637 -14365 3152 16660
2248 16660 7415 -11328 -12211 6001 16168 2202 -15428 -10788 9626 16861 1309 -13826 -8685
2261 -8685 6946 11433 -61 -11121 -7708 5176 10525 1555 -9742 -8065 4278 10259 1011
2274 1011 -11527 -9796 5310 14473 4820 -11833 -12911 4452 15191 3068 -14262 -9802 10694
2287 10694 16805 -1132 -16258 -7231 11811 13265 -3386 -14354 -4998 11164 12640 -2279 -12930
2300 -12930 -5879 8552 9868 -3584 -11897 -2486 10973 9468 -4673 -12912 -5173 8078 9914
2313 9914 -1522 -11364 -5698 8157 10869 -2178 -12803 -5684 8941 10313 -3724 -12056 -2830
2326 -2830 11429 10803 -4589 -14441 -4886 11160 11693 -3548 -12328 -2125 11413 8361 -6459 -11573
2340 -11573 -886 10550 7972 -4393 -10609 -2374 9912 9264 -4771 -13581 -4520 10606 10367 -4439
2354 -4439 -12245 -1987 10958 7654 -7469 -13945 -1066 13781 10296 -7432 -14532 -806 14003
2367 14003 8351 -9293 -13390 1727 13708 6418 -8523 -10000 2462 11543 4578 -9457 -11534
2380 -11534 2195 13842 7251 -9309 -12644 1677 12447 4473 -10440 -10129 4293 12658 3450
2393 3450 -10485 -9612 4472 11905 2431 -10945 -8986 5718 12428 2452 -9213 -7228 4016 7968
2407 7968 904 -7014 -5085 4199 8789 2691 -7300 -8107 1463 8876 4409 -6029 -8540 180 9489
2422 9489 6779 -5894 -11939 -1666 12006 8529 -9423 -14548 3329 18337 6104 -16792 -15646
2435 -15646 8140 19224 1589 -17270 -9907 12137 16113 -3695 -17385 -5686 13601 12713 -6175
2448 -6175 -14782 -849 13801 8311 -7417 -10899 -89 8648 4713 -3474 -5444 -318 4507 3944
2462 3944 -1766 -6308 -4142 3353 7450 1629 -7230 -7284 2603 9908 2974 -10238 -10250 5051 13861
2477 13861 1981 -13378 -8595 10048 13730 -3940 -15913 -4137 13709 11973 -5542 -13357 -1730
2490 -1730 11455 8052 -6084 -10820 -311 10233 6760 -5210 -9211 -450 8024 5542 -3832 -8557
2504 -8557 -3172 7076 8870 -1066 -10858 -6364 7727 11030 -3079 -14001 -3915 12823 10657
2517 10657 -7408 -15178 -1260 14458 8811 -9892 -13952 2294 14779 6181 -10891 -11510 4645
2530 4645 13170 1755 -10719 -6466 6480 9666 566 -7981 -5191 3179 6606 2318 -3706 -5255
2544 -5255 178 6305 4498 -3501 -7224 -1817 6506 6918 -3353 -10608 -2756 10414 8883 -6844
2558 -6844 -14773 -1400 14711 8282 -11102 -13393 4262 14627 2884 -13108 -10097 7124 13379
2571 13379 755 -11572 -6900 6712 10838 535 -10291 -5842 6420 9137 278 -7550 -4679
2584 -4679 4285 8002 1015 -7230 -6111 3314 9403 3515 -8181 -8679 3471 10848 2455 -9568
2598 -9568 -8556 4383 11714 2062 -11174 -8413 5865 11685 329 -13123 -8012 8945 12204
2611 12204 -2639 -12849 -4712 8700 8820 -3312 -10231 -2419 8284 7548 -2282 -8396 -3642 7205
2625 7205 8788 -1833 -9043 -2810 7258 8375 -1155 -8563 -3851 6536 7612 -1384 -8386 -4282
2639 -4282 6469 8981 -2364 -11012 -4054 7509 7631 -2739 -9870 -3804 6983 7137 -2803 -8982
2653 -8982 -4195 5840 8623 -1679 -10862 -4152 8559 9179 -2906 -11221 -4083 9466 10057 -3785
2667 -3785 -11640 -2562 10180 9636 -4652 -12909 -1198 13216 8278 -7546 -11177 1187 12106
2680 12106 6146 -8064 -10091 2461 10304 3833 -7210 -8684 1708 9815 2935 -8570 -7301
2693 -7301 2364 7273 2352 -6158 -6736 1048 6112 3133 -3418 -7061 -1826 7335 6500 -4697 -9082
2708 -9082 179 9417 6397 -5711 -9800 1520 11250 4458 -6968 -8080 2049 10446 4397 -7990
2722 -7990 -7956 3344 9145 2432 -6681 -7048 1890 8403 2904 -6010 -6956 200 7662 5282 -6612
2737 -6612 -9956 1209 10338 4221 -8092 -10536 1814 12093 4198 -10376 -10138 4238 12446 3583
2751 3583 -11724 -10762 7222 14821 -551 -14039 -5957 10478 12107 -3849 -13283 -1632 11260
2764 11260 6633 -5278 -7651 481 7715 4218 -4470 -5600 622 3863 2336 -621 -3132 -2612 772
2779 772 3325 2444 -2481 -7450 -2041 8276 5413 -7012 -9666 1770 11179 3960 -11189 -10555 6784
2794 6784 13855 586 -12806 -7603 8624 13233 -2041 -14606 -4019 12586 10167 -5675 -11899
2807 -11899 -798 11843 6835 -7175 -9073 1350 8299 4738 -3616 -6990 -537 6671 3819 -3725
2821 -3725 -5990 -1427 5386 5634 -2689 -7912 -2877 4804 6496 -726 -9612 -5369 7807 9274 -3418
2836 -3418 -11375 -3047 9424 7808 -6676 -11256 1419 11664 4778 -6794 -8179 1357 9468 4140
2850 4140 -6284 -5753 2940 7067 3305 -4083 -5626 1000 6102 2934 -2864 -5316 -1702 5713 6520
2865 6520 -3271 -9197 -2519 6563 6142 -3511 -9621 -1407 9116 5489 -6682 -9988 -716 9672
2879 9672 6615 -7282 -11038 1862 12014 4361 -8857 -9278 3549 11135 1918 -9042 -4786 5760
2893 5760 7640 432 -6836 -5364 3700 7641 1932 -4965 -5002 1728 6978 2859 -5900 -6272 1841 7211
2909 7211 3133 -5552 -7967 1511 9609 2624 -8931 -8402 3035 10272 2663 -9365 -7185 5232
2923 5232 8334 -732 -8727 -4927 5512 9136 -463 -9042 -4148 6275 7682 -928 -8080 -3636
2937 -3636 6238 6972 -1012 -5526 -2512 3267 5424 -63 -6015 -3613 4221 6508 560 -6645 -5701
2952 -5701 3433 7336 77 -6801 -4603 3107 7324 1328 -7880 -6244 4480 8220 -65 -9024 -5600
2967 -5600 6764 10167 -1179 -10356 -4536 6329 7800 -1167 -8591 -3700 7465 8041 -3036 -9996
2981 -9996 -3343 8277 8532 -4052 -10787 -1300 9819 6726 -4996 -9345 -1010 8443 5192 -5465
2995 -5465 -7297 1910 7705 2962 -6112 -6914 1690 6783 2111 -3681 -3962 -274 3788 3236 -1754 -5034
3011 -5034 -2029 3894 5067 -753 -6281 -2169 5769 5358 -2735 -7676 -3114 6039 7915 -1309 -8836
3026 -8836 -3586 6918 7207 -3677 -10047 -1303 10297 6419 -6991 -9656 1324 9937 4080 -7598
3040 -7598 -8843 2389 9552 3458 -6237 -6426 1988 7223 1770 -6260 -4943 3228 7136 2651 -4837
3055 -4837 -6346 121 6899 4088 -4800 -7297 546 8637 4179 -6959 -8076 2778 8514 1412
3069 1412 -8076 -6251 4628 9398 949 -8511 -6232 4231 7530 204 -6682 -3115 5522 5547 -2274
3084 -2274 -5511 -1358 3447 3545 -188 -3093 -2654 1311 4337 2921 -3055 -6147 -1080 5763 4277 -3167
3100 -3167 -6228 47 7358 4292 -6734 -9196 1728 11050 4766 -9322 -9884 4881 12286 784
3114 784 -12177 -6794 8359 10240 -2895 -10994 -2200 9724 7075 -6067 -10168 -763 8842 5546
3128 5546 -4242 -6217 684 4947 1475 -3117 -2938 313 3083 2841 -13 -3223 -2842 2194 5341 843
3144 843 -6250 -4690 4031 7989 1089 -6729 -5486 3562 6817 -783 -8274 -3790 7129 8616 -2863
3159 -2863 -10816 -3145 8539 6805 -5157 -9033 393 8213 4049 -5006 -6281 997 5674 1968
3173 1968 -4210 -4642 1298 5928 3484 -2997 -5639 -1901 3621 4487 -353 -4725 -2113 4273 5424
3188 5424 -1596 -7408 -2518 6819 6451 -3690 -8460 -219 8706 5490 -5121 -8538 -649 7270 4601
3203 4601 -4206 -6657 1092 7599 2809 -6929 -7600 1810 7808 2433 -5789 -5373 1823 6138 1973
3218 1973 -4692 -5268 759 5899 3010 -4050 -4878 2025 6775 1954 -6106 -6042 2151 7751 3309 -4590
3234 -4590 -5253 1316 6153 2019 -5408 -5190 2642 6840 1258 -5704 -4088 3344 5497 -288 -5983
3249 -5983 -4248 2071 5615 2057 -3871 -4640 240 4630 1282 -4713 -4501 2206 6318 2385 -5149
3264 -5149 -5803 1430 6557 2624 -5783 -6125 2804 8436 2468 -6464 -5251 3770 6783 -353 -6474
3279 -6474 -3069 5333 7454 358 -6738 -5117 3371 7041 657 -6861 -4297 4640 6845 -1261 -7822
3294 -7822 -3259 4999 5418 -2267 -7156 -1980 5973 5968 -2168 -7783 -3163 5015 5147 -2271 -5681 -105
3310 -105 5773 3605 -3689 -5527 52 4917 3293 -1799 -3652 -19 3712 3193 -931 -3448 -1645
3325 -1645 1532 2927 1178 -1800 -2473 1185 4584 1439 -5783 -6145 3167 8835 1464 -8621 -6103
3340 -6103 5648 8435 -2159 -10333 -3637 7951 7322 -4283 -9618 -606 9238 5201 -7387 -9673
3354 -9673 1880 10180 3785 -6835 -5667 3504 6513 -331 -5818 -2491 3920 4767 430 -2992 -2070
3369 -2070 1226 3301 1448 -1916 -3050 -610 3126 3531 -346 -3985 -2616 2622 4096 -1988 -6406
3384 -6406 -1371 6825 5197 -4715 -8560 -306 7619 3454 -5912 -6422 2165 6989 1512 -5662 -4609
3399 -4609 2740 5635 16 -5248 -2587 3760 5004 372 -3389 -2756 668 2883 2558 -606 -3140
3414 -3140 -772 4507 4086 -2746 -6351 -349 7207 4261 -5238 -7053 1610 8415 2928 -7235 -7508
3429 -7508 2371 8059 1098 -7903 -4907 5338 7146 -2614 -9324 -3175 6601 5712 -3139 -6500 -356
3444 -356 5122 2949 -2654 -3558 263 3126 1677 -690 -1363 -15 1437 2248 877 -2147 -3126 123
3460 123 4986 3907 -2899 -5891 544 6750 2316 -6366 -5609 3935 7617 -575 -8143 -3782 5523
3475 5523 6053 -2433 -7798 -2592 5543 5449 -2490 -6423 -1117 5053 3082 -3646 -4915 823 5184 2385
3491 2385 -2452 -3564 -482 2796 2915 -203 -3142 -1789 2749 4407 361 -3954 -2622 2988 4730
3506 4730 -508 -4999 -2366 4582 6047 -1462 -7476 -3160 5347 5588 -2898 -7392 -682 6357 3492
3521 3492 -4854 -6327 563 5639 2383 -4231 -4949 980 5614 2263 -3822 -4669 712 4786 1967
3536 1967 -2989 -2875 1584 4053 1532 -2739 -3542 519 4611 2998 -2497 -4365 257 4625 2423
3551 2423 -3121 -4118 543 3941 1745 -2350 -3283 213 3355 2167 -2750 -4715 -438 4546 3405
3566 3405 -2804 -5084 -198 4447 2503 -3282 -5065 324 5222 3026 -3648 -5357 825 6168 2692
3581 2692 -5021 -5494 2176 6795 2105 -5117 -4613 2621 5762 634 -5623 -3674 4002 6216 -168
3596 -168 -5774 -3047 3764 4687 -1274 -4924 -1457 3345 3248 -521 -3405 -2014 1486 3042 135 -3489
3612 -3489 -2883 2137 4433 328 -4537 -3210 2578 4195 -39 -3823 -2239 2562 3952 -155 -4233
3627 -4233 -2237 2730 3879 -373 -3951 -1582 2753 3590 -272 -3431 -1993 1574 3600 718 -3143
3642 -3143 -2727 1813 4474 744 -4567 -3606 2637 5466 579 -5134 -3755 3423 5968 -1 -6509
3657 -6509 -3944 4747 6539 -1738 -7723 -1955 6784 5006 -4627 -7315 609 6978 2911 -4974 -4868
3672 -4868 1869 5383 865 -4249 -2885 2120 3713 80 -2819 -1290 1618 1596 3 -699 -886 -983
3688 -983 411 2412 1247 -2605 -3028 1672 4509 376 -4921 -3033 3720 5216 -1341 -6150 -2085
3703 -2085 5327 5136 -2901 -6717 -676 6399 3687 -4625 -5837 1652 6098 1428 -5083 -3666 2598
3718 2598 4738 392 -3968 -2691 1797 3463 706 -2747 -2331 893 2816 1076 -1795 -2267 -251
3733 -251 2584 2505 -1126 -3880 -1102 4194 3806 -2680 -5870 16 6229 3053 -4892 -5434 2273 6226
3749 6226 764 -5578 -3745 3285 5099 -387 -5100 -2396 3486 3959 -1079 -4095 -1297 3026 2471
3764 2471 -1076 -2469 -903 1518 1856 377 -1460 -1948 215 2558 1568 -2017 -3351 199 3710 2084
3780 2084 -2660 -3962 581 4597 2178 -4023 -4501 1818 6017 1001 -5566 -3556 3864 5615 -1172
3795 -1172 -5619 -1631 4497 3861 -1835 -4264 -924 3426 2753 -1458 -3574 -999 2749 2398 -886 -2868
3811 -2868 -1022 1837 2365 -230 -2671 -2007 1534 3558 561 -3606 -3048 2269 4676 -320 -4912 -2297
3827 -2297 3972 4418 -1302 -5058 -1333 4434 3870 -2013 -4888 -773 4718 3619 -2511 -4602 158
3842 158 4531 1874 -3091 -3315 1088 3537 1164 -2503 -2823 318 2520 1435 -1647 -2684 -94 2290
3858 2290 1615 -1188 -2451 -870 1521 2086 -513 -2709 -1300 2126 3103 -726 -4156 -1645 3522 3632
3874 3632 -1561 -4189 -424 3746 2986 -2072 -3985 -349 3941 3269 -1911 -4403 -359 4901 3385
3889 3385 -3278 -5215 249 5260 2285 -3917 -4510 1493 4781 757 -4576 -3610 2209 4717 262
3904 262 -4694 -2669 2777 3744 -623 -3641 -1454 2283 2576 -331 -2285 -1010 1210 2003 337 -2201
3920 -2201 -1567 1338 2571 1009 -1693 -1894 418 2464 1553 -1098 -2382 -99 3133 2591 -2055 -4077
3936 -4077 688 4547 1783 -3637 -3944 1452 4901 956 -4445 -3196 1753 3678 -2 -3818 -2552
3951 -2552 2437 3761 -776 -4264 -2007 2459 3285 -226 -3357 -1676 2175 3200 459 -2782 -2576
3966 -2576 1727 4025 517 -3594 -1913 3181 4326 -526 -4875 -1945 3659 3922 -1006 -4093 -1212
3981 -1212 3568 3115 -2349 -4437 -49 4061 1716 -3161 -3320 881 3077 632 -2573 -1700 182 1126
3997 1126 882 -104 -1158 -791 613 1049 94 -1428 -1426 989 2889 948 -2374 -2843 958 4566 1745
4014 1745 -4411 -3532 3542 5926 -302 -5528 -1950 5072 4613 -3207 -6076 579 5935 2707 -4030
4029 -4030 -4948 1105 4743 597 -4368 -2863 2218 3102 -490 -3414 -1684 1588 1503 -677 -1656 -1115
4045 -1115 -122 1800 1689 -469 -2287 -1118 1477 2481 -82 -2477 -508 2933 2815 -1172 -3833 -942
4061 -942 4184 3735 -2457 -4867 783 5368 2316 -3838 -4301 1720 4659 8 -4293 -1661 2955 2902
4077 2902 -896 -3874 -1890 1915 1926 -481 -1765 -859 623 1236 -115 -1556 -1136 -12 1263 1652
4093 1652 -571 -2481 4 3353 2104 -2147 -3631 297 4506 2588 -2583 -3011 1332 3589 863
4108 863 -3186 -3087 2136 4808 317 -4274 -2294 2546 3441 -594 -4474 -2165 2808 2621 -797 -2498
4124 -2498 -1522 1407 2060 -882 -3030 -1398 2190 2911 46 -3049 -2063 2040 2700 -498 -2350 -1106
4140 -1106 1841 3158 172 -3309 -1343 2604 2848 -1143 -3525 -931 3752 3307 -1620 -3229 -282
4155 -282 1966 1419 -689 -1923 -184 2090 1361 -918 -2116 -1019 1376 1899 -961 -2662 -779 1713
4171 1713 2260 108 -2944 -2411 1390 2582 -359 -2719 -924 2723 2941 -1242 -4081 -1014 2986 2554
4187 2554 -544 -2813 -1136 2961 3103 -1298 -3588 -744 3188 2776 -1682 -3607 579 4215 1755
4202 1755 -2871 -3528 -179 3329 2439 -2059 -3174 419 2927 1253 -2886 -3271 1007 3849 738 -3397
4218 -3397 -2033 1733 2768 113 -2989 -2179 1742 2201 70 -1384 -618 1061 1079 -552 -1641 -317
4234 -317 725 889 1482 251 -1665 -1286 1451 2158 158 -2738 -1599 2875 3425 -1110 -3501 -396
4250 -396 3166 2141 -2552 -4475 655 5535 2250 -4113 -4341 1175 4564 674 -4701 -2616 3455
4265 3455 3874 -1548 -3939 -854 2716 2539 -1569 -3220 -237 2505 2191 -347 -1952 -1105 1184 1270
4281 1270 -499 -1058 -194 814 1859 564 -1919 -2160 662 2884 1387 -2239 -2784 1630 3759 67
4297 67 -3576 -1914 1831 2631 -530 -3256 -698 3340 2250 -1905 -3409 -850 2301 1948 -1067 -1854
4313 -1854 342 1077 371 -320 -949 -992 272 1606 757 -1187 -1983 645 3337 773 -3522 -2504 1747
4330 1747 3744 792 -3088 -2073 2396 3462 -1034 -4353 -1422 3891 3800 -1866 -4966 -300 4482
4345 4482 1972 -3267 -3511 1148 3478 563 -3000 -1534 1743 1956 -634 -2180 -985 1070 1828 437
4361 437 -959 -707 -777 75 1589 813 -1387 -1395 1207 2653 282 -3040 -1831 2901 2944 -1700 -3840 -213
4379 -213 3865 2721 -2385 -3781 217 3506 1139 -2613 -2562 1664 3786 256 -3523 -1912 2299 2445
4395 2445 -450 -2210 -778 1371 1431 -100 -774 -751 -250 567 1086 -278 -1366 77 1475 1247 -1089
4412 -1089 -2554 -713 2499 2673 -1175 -3045 -728 3105 2298 -2565 -3842 791 4182 1163 -3506
4427 -3506 -2593 2156 3771 -208 -4106 -2152 2386 3145 -1 -2659 -1303 2177 2251 -1291 -2710 -301
4443 -301 2147 1927 -577 -1962 -631 1402 1462 -177 -1893 -1241 1218 2060 -44 -2035 -652 1357
4459 1357 1235 -838 -1767 -686 1456 1799 73 -1774 -1652 704 1973 348 -2103 -1271 1384 2225
4475 2225 74 -1927 -1097 1197 2006 -156 -2066 -1388 1582 2829 532 -2789 -1995 1491 2719 -204
4491 -204 -2828 -1241 2198 2689 -792 -3322 -1230 2749 2528 -1302 -3465 -549 3280 2150 -2162 -2896
4507 -2896 135 2546 993 -1906 -1732 566 2259 908 -1636 -2510 -291 2337 1489 -1353 -2047 344
4523 344 2151 870 -1395 -1645 518 1830 693 -1006 -1282 363 2236 969 -1655 -2044 114 1933
4539 1933 1092 -818 -1259 11 852 539 -796 -1347 -566 1301 1486 -597 -2008 -959 1644 1757 -1082
4556 -1082 -2632 -731 2218 2375 -697 -2789 -642 2698 2156 -2133 -3511 416 4228 1997 -3275
4571 -3275 -3353 1564 3997 445 -3565 -2082 2495 3415 -341 -3206 -1081 2596 2181 -1657 -2854 -22
4587 -22 2405 1281 -1340 -1451 70 619 -117 -100 -266 -531 -341 691 969 -866 -1893 -285 1877 1090
4605 1090 -1508 -2103 317 2643 1493 -1973 -2655 717 3301 1128 -2398 -1906 2215 3250 -287 -3445
4621 -3445 -1274 2698 2584 -907 -2460 -388 2202 1534 -1091 -1915 -351 1531 843 -857 -1290 -401
4637 -401 800 521 -107 -1465 -1770 203 2067 1074 -1783 -2294 764 2967 64 -3200 -1746 2607
4653 2607 2886 -728 -3277 -555 3055 2236 -1697 -2953 -13 3030 1996 -1722 -2342 839 2729 467
4669 467 -1992 -1356 992 1695 209 -1059 -848 -9 744 434 -325 -1135 -932 695 1239 -175 -1751 -1285
4687 -1285 764 1503 -339 -2557 -1227 1997 2751 -750 -3386 -703 2905 2349 -1889 -2728 781 3217
4703 3217 1029 -2243 -1850 1388 2553 490 -1818 -1241 1036 1832 444 -1355 -950 697 1049 121
4719 121 -785 -813 -105 627 830 -439 -1781 -947 1627 1855 -1057 -2773 -395 2598 1596 -1944 -2867
4736 -2867 490 2888 1209 -2021 -2583 1057 3218 841 -2845 -2298 1964 3221 31 -3039 -1180
4751 -1180 2385 2232 -1036 -2273 -213 2042 1627 -782 -1623 -122 1499 893 -598 -1349 -347 699
4767 699 459 25 -978 -859 -10 902 618 -1081 -1532 129 1777 856 -1578 -1748 623 1951 528
4784 528 -1551 -1401 694 2090 836 -1473 -1846 818 2686 832 -2328 -1988 1622 2914 204 -2866
4800 -2866 -1639 1997 2654 -460 -2878 -1149 2200 2256 -1011 -3037 -636 2527 1954 -1720 -2618 4
4816 4 2376 1050 -1872 -1923 223 1923 613 -1423 -1446 242 1587 548 -1158 -1092 374 1143 422 -514
4834 -514 -679 -179 513 891 227 -1230 -1072 926 1889 96 -1845 -887 1580 1922 -514 -2058 -513
4851 -513 1880 1767 -778 -2364 -743 2143 1592 -1329 -2298 -99 2195 1086 -1466 -1757 262 1568
4867 1568 722 -985 -1428 -175 1348 1509 -716 -2082 -349 2215 1592 -1289 -2402 90 2575 1497
4883 1497 -1606 -2266 540 2728 1164 -2041 -2098 1157 2930 450 -2790 -1435 1799 2470 -319 -2138
4899 -2138 -641 1573 1283 -901 -1599 -291 1146 691 -604 -1018 -338 333 290 -3 -297 -427 -730 333
4917 333 1456 57 -1784 -1268 1688 2164 -1005 -2750 -62 3075 1576 -2385 -2394 1345 3347 562
4933 562 -2589 -1790 1716 2917 -213 -2903 -1050 2152 2214 -1112 -2541 -235 2092 1058 -1467 -1537
4949 -1537 -47 954 510 -399 -838 -361 317 907 -91 -1086 -935 467 1479 575 -1281 -1618 548 2250
4967 2250 967 -2075 -2195 1237 3002 292 -2954 -1215 2443 2192 -1560 -2633 21 2764 1646
4982 1646 -1634 -2076 447 2089 666 -1518 -1447 587 1583 293 -1014 -636 349 555 4 -363 -579
4999 -579 -668 289 1455 494 -1402 -1542 646 1802 -47 -1910 -823 1907 1909 -728 -2165 -748 2006
5016 2006 1901 -1050 -2354 -222 2419 1609 -1214 -1923 47 1685 778 -1445 -1347 443 1728 463
5032 463 -1283 -1627 -127 1463 810 -1019 -1509 99 1617 939 -885 -1591 -114 1390 1234 -1045 -1936
5049 -1936 264 2536 1353 -2035 -2761 569 2854 660 -2129 -1329 1530 2094 -553 -2168 -763 1278
5065 1278 1306 -329 -1433 -471 1021 1359 -9 -1399 -730 300 864 349 -230 -391 45 650 386 -709
5083 -709 -1296 -118 1608 1098 -1031 -1716 262 1700 754 -1197 -1844 19 1999 1047 -1165 -1769 470
5100 470 2486 417 -2386 -1977 1328 2613 247 -2177 -1364 1229 1803 -214 -1995 -1054 1348 2060
5116 2060 -237 -2295 -1082 1970 2092 -1096 -2921 -545 2336 1852 -969 -2100 -63 1728 766 -1375
5132 -1375 -1293 594 1993 519 -1292 -1116 511 1068 83 -665 -209 150 127 457 523 -150 -1148 -503 860
5151 860 751 -772 -1142 480 2039 799 -1955 -2087 736 2480 514 -2452 -1743 1992 2786 -623
5167 -623 -3132 -823 2573 1998 -1660 -2614 429 2878 1421 -1797 -2468 408 2271 951 -1446 -985
5183 -985 1118 1888 43 -1700 -837 799 1236 256 -559 -423 -266 569 1097 -372 -1724 -1004 1280 1560
5201 1560 -492 -1839 -132 1896 889 -1920 -2348 478 2410 1152 -1650 -1602 787 1929 -86 -1716
5217 -1716 -704 1260 1514 -376 -989 61 846 605 42 -590 -544 -126 1117 1298 28 -1437 -676 708
5235 708 984 -513 -1581 -421 1542 1268 -1092 -2391 -489 2469 1351 -2228 -2655 857 3263 656
5251 656 -2662 -1898 1741 2302 -807 -2348 -282 2267 1694 -895 -1951 -308 1487 1176 -416 -673
5267 -673 178 744 436 -13 -359 -343 -143 509 837 -549 -1436 165 1995 770 -1917 -2397 292 2484
5285 2484 613 -2123 -1765 1216 2048 -568 -2847 -1275 1956 2167 -983 -2496 -68 2527 1489 -1530
5301 -1530 -1964 429 1786 260 -803 -320 824 817 93 -575 -621 150 617 752 341 -487 -855 -237 998
5320 998 718 -673 -1523 -11 1861 954 -1948 -1826 1074 2175 -449 -2842 -1300 2339 2559 -1021
5336 -1021 -2642 -713 1830 1416 -1261 -2274 292 2335 943 -1524 -1710 474 1948 713 -1568
5351 -1568 -1287 634 1612 1096 -605 -1190 6 1251 317 -1037 -1002 704 1746 537 -1510 -1399 232
5368 232 1095 476 -712 -1193 -135 1072 797 -985 -1396 -65 993 286 -1279 -996 881 1310 85
5385 85 -1015 -1010 -388 976 957 -180 -668 -194 987 1004 -539 -1494 -43 1649 1064 -733 -1458 152 1982
5404 1982 1535 -1242 -2056 216 2144 1190 -1268 -1665 876 2008 -83 -2084 -1347 1000 1946 262
5420 262 -1704 -1581 855 1793 -137 -1998 -1154 951 1570 -482 -1816 -273 1597 982 -627 -1729
5436 -1729 -690 1531 1774 -98 -1201 -553 812 1155 -336 -1225 298 1395 773 -348 -370 -154 435
5453 435 544 -217 -561 -482 69 982 790 -699 -1215 -168 621 281 -628 -1147 27 1684 612 -1794
5471 -1794 -2113 420 2324 943 -2332 -2145 1566 2780 -171 -2747 -1238 1855 2077 -944 -2667 134
5487 134 2966 1821 -1798 -2709 406 2617 794 -1899 -817 1441 1363 -237 -912 -406 582 669 -288
5504 -288 -453 -325 -258 490 670 -371 -1277 -785 290 858 497 -1072 -1074 659 1258 -337 -1777 -1023 1562
5523 1562 2234 -643 -2526 -223 2212 1425 -1302 -1689 322 2094 955 -1449 -1003 1207 1475 -168
5539 -168 -1439 -1053 923 1496 47 -692 -419 -213 135 544 -105 -778 -412 636 1134 -90 -1843 -823
5557 -823 1733 1021 -1299 -2081 -25 2039 1640 -1156 -2371 24 2014 591 -1646 -1484 1050 2608
5573 2608 226 -2300 -1013 1422 1557 -223 -1349 -419 1117 1336 -169 -801 -323 117 720 103 -795
5590 -795 -272 777 930 218 -750 -1286 -251 1267 747 -690 -1318 -41 1709 744 -1860 -1738 1075
5607 1075 1833 -233 -1734 -781 1454 1921 -485 -1977 -504 1308 1217 -203 -783 -129 1252 474 -844
5624 -844 -696 57 312 380 383 -402 -637 -75 871 714 -745 -1683 7 1884 843 -1250 -1337 699 1775
5643 1775 72 -1962 -1658 1418 2251 -74 -2212 -1459 1729 2220 -823 -2701 -400 2395 1353 -1292
5659 -1292 -1943 355 2151 504 -1846 -1366 713 1542 533 -886 -985 616 942 -305 -623 -388 205
5676 205 719 376 -447 -584 -176 382 751 105 -1106 -459 900 783 -319 -795 -540 473 633 -164 -884
5695 -884 -400 675 1020 147 -1651 -959 1451 1482 -356 -1558 -522 1174 1423 -739 -1838 -379 1499
5712 1499 1235 -712 -1814 -222 2343 1258 -1664 -2117 398 2029 690 -1482 -1468 911 1896 64
5728 64 -1532 -849 943 1714 38 -1611 -728 988 1134 -392 -1207 -280 752 427 -99 -403 -219 106
5746 106 484 455 -658 -1044 103 1052 744 -454 -1087 -210 1232 703 -989 -1154 53 1534 645 -1100
5764 -1100 -1430 464 1556 -204 -1439 -932 705 1191 199 -1068 -511 239 582 455 -521 -1143 312
5781 312 1378 755 -928 -1292 358 1513 667 -1406 -1304 595 1667 528 -1352 -1632 508 2063
5797 2063 217 -2157 -1020 1631 2037 -620 -2326 -687 1832 1397 -1091 -1735 94 1533 660 -1324
5813 -1324 -1413 644 1321 21 -791 -48 533 417 -134 -12 344 -248 -306 543 1099 -382 -1207 51 1719
5832 1719 804 -1248 -1395 533 1874 246 -1985 -1009 1270 1828 -293 -2281 -933 1800 1760 -1152
5848 -1152 -2181 54 1879 518 -1569 -1458 625 1312 -63 -1045 -645 317 610 143 -297 -305 82 331
5866 331 527 186 -404 -429 378 864 425 -1129 -1178 916 1867 53 -1967 -836 1546 1747 -989 -2360
5884 -2360 -106 2184 1132 -1706 -1864 323 2014 438 -1800 -1383 964 1786 -189 -1682 -755 1120
5900 1120 789 -433 -838 -131 506 164 215 -140 -419 -99 728 782 -277 -882 -8 939 707 -561 -1064
5919 -1064 -15 1257 830 -550 -1129 26 1262 900 -893 -1115 343 1318 189 -1256 -1093 534
5935 534 1016 235 -1020 -804 253 872 414 -907 -975 96 1026 399 -617 -922 232 1207 656 -781
5953 -781 -1354 124 1857 1068 -1224 -1574 894 2314 298 -2078 -975 1428 1698 -741 -1716 -281
5969 -281 1447 1160 -784 -1487 -198 1279 817 -727 -1183 -44 1195 211 -968 -704 32 654 47
5986 47 -243 -216 -338 3 500 228 -461 -645 32 860 491 -402 -799 88 909 510 -706 -910 498 1536
6006 1536 650 -1414 -1019 837 1513 122 -1328 -665 960 1292 -171 -1281 -749 868 1305 -379 -1590
6023 -1590 -791 1376 1538 -665 -2123 -538 1426 984 -897 -1624 137 1561 745 -1178 -1623 283
6039 283 1803 632 -1412 -1224 1000 1407 -180 -1143 -227 895 265 -239 -246 429 383 246 149 -47 -278
6058 -278 -365 106 773 303 -578 -764 311 1068 215 -1259 -1211 688 1405 -296 -1693 -546 1485 1102
6076 1102 -1321 -1943 -208 1842 956 -1231 -1424 214 1638 365 -1413 -1119 925 1497 128 -999
6092 -999 -423 1022 970 -223 -635 -263 337 436 705 176 -654 -480 631 768 -494 -1345 -39 1554 628
6111 628 -1263 -1485 365 1377 390 -1545 -1416 751 1493 66 -1618 -947 1207 1069 -684 -1573 -33
6128 -33 1276 674 -529 -719 49 515 141 -248 -194 316 272 203 230 -49 -310 -38 507 684 -216 -1085 -305
6149 -305 1462 1296 -1062 -1910 -209 1825 718 -1580 -1229 1151 1671 -462 -2073 -936 1474 1348
6165 1348 -656 -1779 -141 1244 695 -1122 -1248 197 1002 211 -881 -387 599 509 -42 -56 -162 -328
6183 -328 -127 990 832 -327 -962 181 1175 307 -1067 -934 781 1506 61 -1535 -790 1257 1453
6200 1453 -388 -2238 -621 1707 1421 -1030 -1334 441 1493 123 -1687 -894 939 1210 22 -1037
6216 -1037 -491 654 707 -182 -483 34 462 236 -60 247 282 -358 -377 523 493 -349 -923 476 1506 203
6236 203 -1371 -1019 917 1204 -194 -1469 -559 1160 820 -713 -1382 -331 1430 787 -1057 -1571 263
6253 263 1699 610 -1203 -1452 209 1231 269 -854 -700 493 1190 68 -897 -869 786 1308 195
6270 195 -930 -602 731 979 40 -838 -599 306 927 150 -560 -385 627 1117 -121 -1110 -566 692
6288 692 679 -92 -588 -202 190 -54 2 -300 -320 -74 308 412 -233 -422 -96 691 215 -593 -982 -186 740
6309 740 713 -271 -1209 -276 1067 517 -919 -990 594 1601 413 -1159 -1009 529 1253 231 -1219 -759
6327 -759 742 1259 204 -1220 -721 967 982 -520 -1440 -297 1498 1012 -400 -1336 -437 793 650
6344 650 -364 -880 -78 1162 732 -718 -1030 254 977 102 -768 -626 430 764 364 -416 -380 -203 27
6363 27 237 -104 -89 -35 355 134 -158 -244 -334 37 421 379 -210 -765 72 1050 623 -1170 -1337 388 1611
6384 1611 191 -1403 -607 1354 1249 -710 -2020 -343 1541 1317 -775 -1625 241 1628 515 -1455
6400 -1455 -913 607 1229 -27 -971 -353 777 614 -306 -842 -443 294 469 260 -77 -89 -119 185 -20
6419 -20 32 -309 -180 287 840 117 -1006 -740 737 1071 -523 -1432 -267 1569 1184 -850 -1297 413
6437 413 1242 159 -1325 -909 997 1463 -67 -1378 -627 766 791 -444 -800 133 764 95 -299 -205
6455 -205 210 -152 -177 77 17 -375 -243 686 813 -82 -1068 -529 734 878 -18 -886 -15 1295 827 -1084
6475 -1084 -1505 321 1520 362 -1322 -941 1078 1477 -286 -1423 -368 769 695 -280 -809 165 982
6492 982 598 -733 -1095 -300 554 282 -84 -480 -104 273 208 144 -474 -587 -169 824 605 -597 -782 662
6512 662 1146 -206 -1380 -768 821 1091 -176 -951 -266 1073 622 -680 -978 121 1048 254 -602 -533
6530 -533 289 623 -67 -518 -266 -193 83 207 377 -197 -412 -362 63 78 -593 -551 330 757 372 -735 -888
6551 -888 262 1107 251 -1126 -1041 811 1447 103 -1548 -612 1168 1000 -1023 -1379 338 1674 847
6568 847 -1033 -1192 78 999 345 -844 -503 743 993 128 -1042 -472 602 661 -100 -827 -377 443
6586 443 412 134 -400 -491 -188 420 -72 -441 -209 314 292 -237 -436 -384 -69 301 328 94 -383 -243 646 515
6608 515 42 -520 -171 510 430 -16 -477 85 806 808 -282 -1166 -533 1053 992 -534 -1230 -66 1205 342
6628 342 -1138 -1018 452 1418 98 -1027 -852 596 1235 -58 -1398 -753 817 1001 -151 -1000 -103
6645 -103 906 440 -840 -547 182 690 354 -259 -338 21 129 410 102 -368 -198 174 285 152 -166 -228
6665 -228 173 395 132 -796 -424 565 816 -40 -818 -536 402 224 -437 -536 -82 259 152 -123 -595 -335
6685 -335 112 379 9 -483 -515 390 864 184 -638 -603 355 772 458 -480 -521 546 1061 248 -1090 -801
6705 -801 803 1369 -150 -1416 -257 1050 803 -759 -1206 94 969 280 -984 -766 600 873 -266
6722 -266 -1238 -374 663 431 -384 -423 401 170 -158 -174 91 91 -569 -156 377 451 -455 -385 302 817 63 -876
6744 -876 -699 537 1279 -70 -1117 -446 1131 900 -764 -1224 156 1541 326 -1265 -784 583 964
6761 964 -284 -1099 -332 624 422 -452 -501 -26 206 178 -417 -339 115 70 -90 149 300 -267 -538 201 806
6782 806 274 -736 -755 692 1361 -254 -1435 -126 1048 796 -640 -1276 402 1607 356 -1225 -877
6799 -877 551 1175 -162 -1358 -453 1070 701 -721 -1069 -27 789 218 -443 -486 62 272 240 -138 -373
6818 -373 -210 163 182 -95 -114 59 81 209 237 -109 -417 143 654 442 -445 -626 256 944 313 -614 -445
6839 -445 506 705 115 -553 -386 542 503 -262 -384 -186 157 385 -113 -366 -251 156 274 184 -379 -566 -8
6860 -8 631 294 -597 -814 217 1300 228 -1059 -625 824 832 -263 -1067 -128 967 763 -448 -879 61
6879 61 948 721 -595 -920 169 1176 81 -653 -435 462 696 133 -568 -367 256 368 -206 -317 -427
6898 -427 -64 258 82 -410 -99 -110 -86 89 10 -197 -294 47 431 211 -345 -575 311 768 128 -402 -253
6919 -253 331 612 50 -537 -347 621 549 -120 -590 -525 700 864 -550 -882 -27 963 509 -418 -1077 -180
6939 -180 969 233 -819 -865 197 886 268 -1153 -836 676 975 -299 -971 -182 675 610 -379 -702 139
6958 139 433 36 -174 -18 56 205 98 14 -102 200 125 139 213 35 -147 -12 175 486 -50 -793 -182 732
6980 732 451 -430 -683 -47 738 225 -814 -697 413 788 -64 -743 -485 517 785 -223 -878 -144 717
6999 717 206 -258 -449 -191 390 266 -257 -112 -28 -24 456 257 -373 -664 21 704 207 -701 -500 384 897
7020 897 157 -837 -571 371 920 -58 -940 -471 853 790 -701 -908 -32 835 381 -776 -580 410 682
7039 682 -82 -377 -97 209 335 -68 -430 -39 163 81 -9 127 -77 -278 -303 403 539 -281 -658 -35 916
7060 916 209 -697 -609 625 980 -39 -1106 -279 880 680 -608 -890 -128 944 500 -799 -776 302
7078 302 813 -156 -780 -140 511 402 -289 -452 218 206 -104 -156 232 -120 -364 -160 318 240 -488 -705 236
7099 236 764 53 -784 -559 576 982 -230 -1152 -355 1002 733 -766 -1010 252 1210 416 -1118 -761
7117 -761 745 1072 -154 -951 -366 950 877 -433 -694 258 763 -106 -656 -418 502 439 -224 -268 245 196
7137 196 -518 -187 248 304 -383 -580 230 559 -114 -562 -345 310 387 -220 -946 -345 794 766 -579 -1009
7157 -1009 191 931 446 -701 -644 461 950 -163 -765 -270 307 798 -169 -751 -195 639 830 -174
7175 -174 -689 -260 495 527 -118 -416 48 366 184 -135 -506 -136 461 513 -59 -676 -247 438 319 -430 -606
7196 -606 -31 440 101 -307 -289 217 444 133 -308 -333 -122 360 364 86 -227 -72 2 60 190 116 -69 27 376
7219 376 307 -269 -549 158 699 37 -696 -491 478 632 67 -617 -452 245 633 -59 -542 -448 327 587 -313
7240 -313 -923 -354 609 491 -242 -749 77 522 441 -463 -786 4 799 321 -606 -437 348 749 120 -453
7260 -453 -407 327 587 261 -281 -104 232 313 -19 -515 -243 242 248 -226 -459 14 368 -49 -156 -23 69 -467
7282 -467 -331 253 292 -225 -421 87 282 -65 -623 -263 407 716 -173 -789 -65 524 666 -406 -805 306
7302 306 975 330 -725 -531 502 862 -116 -803 -320 457 740 -83 -624 -248 263 230 -285 -384 130 353
7322 353 89 -235 -251 -2 -167 111 -73 -68 -289 -66 510 544 -188 -738 -190 457 289 -599 -546 409 827 125
7344 125 -813 -394 601 901 -41 -795 -237 679 623 -277 -736 228 637 47 -430 -260 291 221 -210 -253 21
7365 21 -76 -353 -32 365 130 -98 -336 101 77 -229 -461 -148 486 164 -374 -462 239 878 54 -1001 -651
7386 -651 531 836 -121 -613 -95 603 188 -338 -668 144 805 290 -295 -366 111 557 204 -411 -116 156
7406 156 54 8 -54 86 -114 -117 32 177 -499 -504 376 572 41 -728 -313 492 512 -408 -676 34 776 350
7428 350 -688 -549 340 749 45 -678 -413 533 744 -39 -363 108 372 110 -410 -182 428 333 -53 112
7448 112 23 61 -114 -250 28 63 -88 -263 32 464 329 -493 -875 221 615 105 -903 -323 832 656
7468 656 -703 -1043 -32 850 452 -617 -600 312 848 268 -676 -414 595 801 -133 -845 4 893 681
7487 681 -247 -587 -62 430 308 -122 -168 87 274 128 -365 -572 -18 333 24 -227 -322 89 -1 -5 -249 -171
7509 -171 -325 -47 83 178 -139 -79 55 192 -22 -151 -38 -15 409 426 -86 -370 -234 613 412 -221 -550
7530 -550 285 703 152 -317 -353 228 498 61 -573 -331 401 751 39 -519 -400 285 535 -309 -488 55
7550 55 727 440 -427 -752 260 349 -54 -278 -279 53 352 183 -135 -200 -47 156 60 -146 -169 67 544 402
7572 402 1 -322 -132 433 369 -29 -408 -2 343 140 -457 -266 198 191 -88 -366 -11 130 133 147 -242 -402
7594 -402 -298 105 150 60 -36 34 69 -18 -77 -269 -289 125 401 185 -509 -286 370 673 -132 -774 -75 796 659
7617 659 -371 -677 274 597 81 -820 -621 377 719 -104 -705 -272 415 580 -290 -612 156 196 -129 -126 -79
7638 -79 337 10 -224 57 -126 -216 -63 333 427 92 -353 -181 175 227 -133 -643 -46 674 322 -561 -673
7659 -673 311 859 42 -817 -236 849 723 -169 -676 -83 504 15 -393 -323 285 429 8 -515 -368 124
7679 124 77 -107 -171 248 266 -326 -187 346 481 -263 -412 304 519 -32 -491 -241 789 287 -701 -747 -27
7700 -27 928 439 -731 -578 699 700 -248 -823 -98 896 491 -556 -575 277 644 61 -531 -392 187 376
7720 376 18 -297 -134 73 277 -125 -368 -22 170 134 78 98 -91 -77 72 259 33 -221 -419 168 527
7741 527 86 -443 -132 311 246 -400 -394 204 529 229 -332 -210 117 174 -34 -379 -66 270 173 -10 -170 -15
7763 -15 48 38 -150 106 -97 -342 -123 627 415 -352 -503 421 529 -9 -662 -182 527 582 -291 -550 -38
7784 -38 594 558 -565 -792 77 684 135 -738 -538 378 624 -163 -614 -146 688 351 -332 -578 -21 385
7804 385 129 -99 -203 50 342 -85 -341 -65 299 64 -116 -112 196 -136 -233 107 72 37 -372 -94 177 405
7826 405 -121 -273 -15 75 54 -238 -414 -45 410 302 -275 -544 -66 296 273 -481 -516 37 343 75 -415
7847 -415 -390 183 544 -141 -613 -335 566 692 -153 -645 -84 682 191 -276 -295 265 333 17 -247 -46 275
7868 275 354 13 -79 -186 237 249 -117 -161 -126 17 -55 -52 -106 -30 -196 -3 236 174 -293 -162 13 374 59 -509
7892 -509 -346 347 536 -63 -612 -272 352 420 -154 -347 -18 572 477 -323 -247 287 349 -4 -138 -111 141 43
7914 43 2 158 -99 -180 82 213 17 -302 -171 130 236 38 -368 -349 272 451 -88 -663 -176 380 444 -458
7936 -458 -655 307 651 277 -468 -385 299 411 -84 -437 -158 253 290 -248 -236 62 383 152 -219 -178 92
7957 92 179 236 -65 34 -100 -171 45 244 74 -205 -250 126 292 -243 -563 -150 384 329 -371 -596 69 570
7979 570 43 -710 -447 463 478 -175 -607 39 496 331 -380 -381 138 201 -69 -190 10 25 -102 -53 190 216
8001 216 -121 -189 25 340 223 -431 -306 321 462 -180 -631 -162 562 393 -592 -870 161 955 87 -846
8021 -846 -474 419 751 -407 -921 -47 881 363 -620 -685 325 725 28 -549 -326 473 472 -275 -407 115
8041 115 500 171 -160 -46 83 -93 -308 12 249 48 -184 -31 21 229 -97 -254 -26 380 344 -313 -472
8062 -472 40 478 -85 -336 -330 328 244 -235 -404 53 292 268 -141 -277 -42 239 223 -53 -352 -126 385 96
8084 96 -132 -125 114 338 250 -190 -260 -33 404 247 -60 -413 -223 371 317 -306 -366 13 310 53 -383 -422 319
8107 319 406 -48 -505 -229 116 303 -81 -387 57 347 72 -240 -220 215 206 136 -21 81 -34 -259 115 259
8129 259 50 -219 -23 82 199 59 -37 -101 122 284 160 -268 -156 299 406 -101 -477 -209 406 314 -238
8150 -238 -571 13 259 197 -359 -371 98 366 -22 -453 -534 270 519 -32 -486 -135 306 350 -152 -434 -64
8171 -64 529 270 -40 -236 -35 470 267 -232 -375 137 346 92 -123 -1 238 271 -173 -163 236 78
8191G8
$$ Imaginary data points
##PAGE= N=2
##DATA TABLE= (X++(I..I)), XYDATA
0 0 0 0 0 0 0 0 0 8 0 0 -8 8 -8 16 -24 24 -32 40 -46 55 -65 80 -92 110 -130 151 -175 206 -235 270 -311 353
32 353 -401 455 -516 577 -650 732 -813 909 -1015 1126 -1248 1385 -1533 1692 -1870 2062
48 2062 -2271 2501 -2756 3038 -3347 3694 -4080 4514 -5004 5573 -6227 6996 -7918 9041
62 9041 -10444 12259 -14712 18219 -23682 33414 -55950 221914 -242733 -814199 -70746 622459
74 622459 450419 -397116 -606810 50492 621426 252341 -409634 -487712 73683 461700
84 461700 203935 -358089 -407528 77056 400202 181704 -221171 -364625 -59565 300144
94 300144 230628 -148992 -316589 -71710 326641 327620 -157099 -460322 -107313 403908 365592
105 365592 -161883 -458538 -94228 457207 372783 -252919 -493118 -26447 461597 305846
115 305846 -294587 -467197 82044 513530 187039 -379131 -412599 82178 431778 179556
125 179556 -299431 -334388 78094 342624 134691 -257714 -335464 36906 367734 168784
135 168784 -262322 -319469 45857 360650 191761 -279112 -382697 47750 403944 211453
145 211453 -259038 -365835 67475 428372 154395 -359331 -338746 173047 438459 112376
155 112376 -348942 -306451 180391 392251 44273 -330739 -243468 160454 348571 53678
165 53678 -306872 -211547 166970 280329 2170 -283381 -202384 150810 304096 44734
175 44734 -264750 -222748 89573 276797 83534 -254849 -237514 129365 308642 62270
185 62270 -265496 -237343 128323 324158 48348 -303269 -222771 175094 346867 52772
195 52772 -319887 -240011 189269 330264 -10332 -307868 -153768 216435 295379 -36323
205 -36323 -315844 -151284 202491 267498 -16850 -279497 -164229 193663 286623 -28929
215 -28929 -299076 -152631 188927 257178 -39637 -286903 -118474 224917 244456 -73889
225 -73889 -296812 -136339 208342 266126 -55101 -287174 -106945 209186 228797 -66560
235 -66560 -275419 -102065 215415 228175 -70629 -259024 -87445 216756 238647 -80212
245 -80212 -298254 -91567 239242 233109 -78790 -266786 -74912 227908 202126 -115426 -269894
256 -269894 -54487 236003 210395 -110262 -285047 -51888 253578 185666 -143503 -265402
266 -265402 -24844 239752 162649 -136836 -224140 -1006 199460 120404 -123810 -211802 -12384
277 -12384 210719 148896 -107055 -212671 -39467 182495 160030 -84522 -216896 -46996
287 -46996 193526 178998 -78479 -241523 -64702 227041 198966 -128053 -276046 -22792
297 -22792 277179 193576 -166524 -287721 5353 278726 142254 -190815 -243837 51554
307 51554 275517 103225 -220671 -225939 82380 252776 62848 -204102 -181648 85258 218139
318 218139 48547 -169698 -152752 52087 176154 63381 -136415 -147082 53330 186944
328 186944 68478 -145230 -169642 36912 202029 94986 -138761 -178172 29626 205434
338 205434 101225 -157464 -202519 48335 234894 79603 -191562 -183215 93064 235950
348 235950 36794 -213644 -158583 106490 207114 27142 -173859 -129823 88567 176061
358 176061 16692 -163109 -120943 81676 176028 36081 -154006 -137297 65290 182464
368 182464 53696 -157985 -165583 61422 216416 67346 -183164 -170844 92169 226103
378 226103 28396 -220829 -153026 141467 237903 -1614 -234574 -134295 153759 219477
388 219477 -31534 -234554 -94091 178875 187118 -68793 -211868 -47434 170702 131652
398 131652 -85393 -166632 -21933 135770 110537 -45873 -133301 -52255 87960 110400 -11291
409 -11291 -120267 -70557 81826 133663 2828 -142488 -100175 84995 164380 12934 -172602
420 -172602 -119029 116704 195935 -9773 -210714 -110753 149298 188667 -49195 -212949 -63399
431 -63399 178177 163227 -83334 -210638 -42727 181139 146882 -90022 -189833 -18421 174395
442 174395 118803 -97316 -167753 -5927 153642 99091 -82750 -145446 -10620 139490 102974
453 102974 -76822 -159174 -26474 143405 115618 -72386 -158780 -21294 145322 105505 -84434
464 -84434 -160666 -15472 154040 110870 -89907 -168049 -7703 167954 103813 -111751 -167602
475 -167602 14584 170169 82897 -112540 -140041 25909 147514 63127 -105623 -129381 22450
486 22450 145380 73539 -97444 -134870 15202 145167 73426 -100204 -134477 19226 148008
497 148008 74006 -101409 -136442 20335 151913 68953 -115238 -138585 34980 160263 59949
508 59949 -122772 -132172 38340 148527 49597 -118262 -122853 41723 149048 49455 -123503
519 -123503 -127615 48051 155211 40865 -131245 -116384 61489 150088 31502 -124473 -107070
530 -107070 55567 141366 33781 -120184 -107963 59273 150098 30510 -135076 -109751 72358
541 72358 152378 17236 -138694 -94863 80761 141796 6539 -135441 -87931 80924 135118
552 135118 354 -133579 -79431 84187 126270 -7765 -129366 -74405 77702 118992 -3039
563 -3039 -122348 -77703 72512 123233 -892 -130317 -79988 84260 129972 -9693 -134585
574 -134585 -67287 93314 122082 -17043 -128381 -58766 93671 118699 -17158 -125475 -54543
585 -54543 95647 113908 -23399 -122350 -47166 92365 103053 -23308 -113647 -51174 78887
596 78887 102972 -13973 -118241 -64747 80558 116110 -16883 -135451 -67496 94923 121773
607 121773 -28111 -143817 -60180 107242 123594 -38940 -152581 -49913 127456 124192 -59524
618 -59524 -158581 -25101 146778 104082 -85027 -142332 7912 142434 73277 -88052 -111987
629 -111987 22530 119258 50681 -77321 -89353 19896 96203 43671 -58648 -77412 866
640 866 71367 50848 -34647 -81992 -27193 67998 75375 -28682 -108624 -42162 88463 92636
652 92636 -46151 -128886 -28936 113215 92727 -63466 -133472 -14407 127277 87769 -77777
663 -77777 -130324 8882 140924 72676 -98125 -120629 35432 139380 46172 -101040 -93968
674 -93968 44827 116581 30567 -87261 -81015 31257 96748 33020 -73434 -81879 20197
685 20197 94445 37406 -75613 -92355 13048 101854 48768 -79994 -104537 16700 116429
696 116429 47544 -98300 -108261 38919 129536 29314 -112091 -87505 62240 118557 6505
707 6505 -108649 -66266 67280 104088 1488 -92151 -52344 59429 86879 -3137 -80342
718 -80342 -41976 50958 73842 4747 -64223 -49457 28137 72372 23665 -62176 -72774 17525
730 17525 92521 38460 -79579 -91293 27030 106342 28228 -99403 -90092 50161 120728
741 120728 14646 -119347 -86018 70258 125329 -4009 -128610 -63278 94951 112477 -30131
752 -30131 -119941 -33183 95567 84652 -40004 -97587 -15322 85138 69722 -32517 -85369
763 -85369 -22808 67242 64992 -21325 -73411 -25473 56088 63692 -15123 -78100 -38749 54780
775 54780 75871 -10756 -90104 -45874 67219 86044 -21865 -102747 -40359 74721 80566 -27838
787 -27838 -95351 -27329 77960 71953 -37624 -98415 -22764 87040 75951 -42006 -97618
798 -97618 -12438 88326 62573 -47357 -86058 -4358 80757 55444 -39883 -75002 -5667 74164
810 74164 55403 -41383 -83630 -8851 81261 61400 -40980 -84868 -10961 75792 53255 -46418
822 -46418 -82865 -4521 80358 52500 -51865 -86606 -1094 82907 46546 -57356 -82597 3404
834 3404 82281 48706 -49060 -78514 -1899 75894 48019 -50059 -80270 8017 92942 48801
846 48801 -65780 -86510 16488 95963 40271 -69287 -76634 25820 92382 31576 -69709
857 -69709 -71338 27325 86038 20608 -73623 -60259 40014 83101 10432 -73518 -56138 30813
869 30813 67268 12152 -54986 -46955 22185 60336 15070 -55528 -54945 19167 65777 21604 -54925
882 -54925 -57881 20178 74138 27635 -60139 -69628 16798 82998 34060 -62889 -65730 33169 88394
895 88394 14366 -82465 -59874 50313 90226 5850 -80671 -49355 50255 77314 -3115 -78102
907 -78102 -44292 47975 69411 -5513 -68400 -34666 44290 58076 -9961 -68150 -40040 39153
919 39153 68941 8195 -66088 -52799 35291 74528 2501 -78917 -46606 57101 81334 -11744
931 -11744 -86608 -34453 67352 71896 -26425 -87063 -23973 73228 68484 -27459 -77420 -14681
943 -14681 64260 44623 -38009 -61077 3903 60752 34304 -31476 -49959 -7068 38410 33115
955 33115 -13312 -43504 -19916 31215 45971 562 -50394 -37754 27144 56385 2479 -64130
967 -64130 -41994 49557 79579 -7662 -94323 -47840 70513 84862 -27816 -97453 -17793 90211
979 90211 64370 -54721 -90233 4592 88484 42605 -60655 -71677 20988 83201 29892 -60777
991 -60777 -63208 17349 63942 19563 -43569 -39099 17595 46002 13484 -35209 -41903 1522 44253
1004 44253 31855 -24219 -51375 -6826 52023 40321 -31374 -64422 -8867 60121 44931 -34159
1016 -34159 -63743 1517 68424 35520 -55021 -71302 14744 80096 31410 -57924 -58854 23629
1028 23629 65729 12247 -54864 -42899 25371 55920 12485 -42914 -37379 19509 50254 12813
1040 12813 -43779 -44664 13643 56445 27404 -36019 -50893 2388 52735 27971 -42586 -57129
1052 -57129 13481 71530 27455 -60319 -62678 26291 75727 12513 -69984 -51335 39777 72924
1064 72924 5295 -64691 -41388 37899 58971 -6370 -62267 -28065 47908 58158 -10364 -60993
1076 -60993 -27160 37818 45506 -6586 -45008 -22122 29389 42639 -76 -43078 -29315 23982
1088 23982 44744 2290 -46656 -30628 32477 55318 3116 -56310 -41792 29543 59622 5158
1100 5158 -56348 -34051 40933 57097 -11253 -65242 -26127 48582 51297 -17860 -57758 -16374
1112 -16374 45527 45572 -15421 -56258 -22413 39720 45935 -10789 -50321 -16080 43875 41259 -22135
1125 -22135 -56556 -14508 45705 44515 -14614 -52423 -18142 41138 42327 -16657 -54012 -16758
1137 -16758 44263 43231 -19294 -52412 -8710 47364 36843 -26270 -56163 -10321 52227 45834
1149 45834 -21165 -55790 -11675 47746 38070 -27345 -53839 -1796 52998 33486 -30586 -51885
1161 -51885 -2567 50682 32442 -34600 -56048 -83 55952 34235 -34983 -53823 4055 51474
1173 51474 19188 -40718 -41114 15699 51279 18422 -38272 -41646 10120 44751 18648 -29572
1185 -29572 -35239 8363 41319 18369 -25426 -31310 2896 32481 20678 -20739 -37192 25
1197 25 44070 31494 -27354 -54728 -7266 52717 36161 -34196 -53384 5448 55657 24794
1209 24794 -45038 -53982 14110 61159 17729 -51635 -47597 23840 61817 11016 -56700 -42500
1221 -42500 29090 52966 2952 -44754 -26314 30412 45103 -3634 -45876 -23964 29115 44304
1233 44304 3808 -38715 -25355 23981 38493 2579 -33273 -26109 15354 38693 9610 -34990
1245 -34990 -29951 18197 42349 4137 -48346 -36372 29057 51761 -1006 -49009 -27996 26674
1257 26674 38851 -6030 -43237 -18911 30093 35439 -4956 -37082 -19696 26188 36748 -4222
1269 -4222 -37382 -18561 24249 38713 6316 -34332 -27193 19669 39459 4338 -38009 -27766
1281 -27766 27999 51139 -365 -54198 -30536 34882 49978 -5641 -55790 -27079 42743 49417
1293 49417 -17347 -58459 -17356 45858 39896 -28825 -56800 1048 55167 26478 -35929 -45371
1305 -45371 3022 41116 19420 -25556 -28862 6645 28814 15341 -15719 -27328 -1554 27205
1317 27205 19504 -9931 -23866 -7529 23955 30103 -5888 -36818 -17866 26931 37901 -3607
1329 -3607 -43168 -17661 39152 36191 -24136 -51050 -7413 45832 34372 -28039 -50898 -105
1341 -105 46449 23749 -31811 -44508 2778 45504 20859 -33367 -34617 12995 37878 10787
1353 10787 -30656 -32324 10622 39212 15683 -22908 -29067 2078 33078 19755 -23957 -32291
1365 -32291 6410 36327 19289 -22424 -34928 3356 40186 18858 -30620 -37913 7087 45583
1377 45583 22372 -35501 -41216 14388 43401 5890 -38366 -28500 20065 40932 2568 -38708
1389 -38708 -25205 17258 31917 4762 -30691 -26958 15956 36038 4827 -29789 -23169 12107
1401 12107 31239 6612 -29117 -21262 18521 34280 7363 -29547 -28776 14780 39625 7290
1413 7290 -32110 -23258 17921 36082 5555 -34487 -25536 19999 34595 905 -32984 -23372 20848
1426 20848 38487 -1712 -40797 -21729 22548 31362 -1294 -32506 -18626 22235 29416 -5533
1438 -5533 -32501 -18914 19401 34467 397 -37318 -19825 26611 34241 -4407 -36913 -19013
1450 -19013 27037 35270 -6551 -34071 -11425 26938 30508 -8427 -38501 -12113 33691 30854
1462 30854 -11842 -33886 -9657 27908 26956 -13005 -33544 -7222 25238 23690 -8865 -32779
1474 -32779 -11793 27873 24974 -16362 -35278 -8276 28613 26815 -14123 -35630 -6115 28363
1486 28363 20293 -14710 -30358 -4132 31207 22919 -18325 -30119 788 28260 18640 -14796
1498 -14796 -27232 -138 27141 17970 -10636 -23488 -6817 21776 21937 -11353 -28610 -4343
1510 -4343 25910 22402 -11806 -33557 -9640 28913 25223 -14321 -35014 -9218 31570 29822 -19776
1523 -19776 -43994 -2549 41597 22903 -29749 -40346 8371 46265 14391 -37686 -32334 16599
1535 16599 37529 6495 -31448 -23182 19806 32231 -1247 -27739 -13590 15968 23640 1290
1547 1290 -20051 -11762 10275 17497 6259 -11691 -18438 333 21514 12669 -13912 -21826 -403
1560 -403 24057 15347 -19333 -29057 2627 30144 15386 -22171 -32153 4246 36957 13349 -32000
1573 -32000 -29767 15090 36830 5411 -33468 -22812 21368 31946 -2959 -29517 -15053 17585
1585 17585 27287 1016 -25418 -15056 15416 23591 1747 -22140 -16879 13303 26368 3184
1597 3184 -23576 -18750 11227 29251 6750 -29137 -23599 18050 33842 463 -34059 -20149
1609 -20149 23202 32399 -8062 -36355 -11304 27154 25368 -11494 -32450 -7721 26978 20376
1621 20376 -14523 -26009 -1673 22054 14811 -11664 -19722 -825 15939 11554 -3679 -14415
1633 -14415 -8353 11261 18731 997 -18871 -13620 11838 24158 2377 -25341 -16585 17291 27426
1646 27426 -1027 -30282 -17819 22642 32034 -7729 -37720 -11884 31183 27659 -17161 -37473
1658 -37473 -2291 34774 18464 -23129 -28804 4726 28420 12498 -19783 -23150 5100 23857
1670 23857 9651 -15170 -19066 2226 20540 11061 -12321 -18160 -528 18316 14904 -9437 -22712
1683 -22712 -3566 22444 17566 -12076 -25216 -2103 25669 16800 -16745 -25754 1506 26260
1695 26260 14544 -17877 -26664 2720 28623 12698 -22042 -25279 7155 28265 7841 -23494
1707 -23494 -20180 10969 23817 3440 -19499 -15775 8296 21805 6306 -17323 -17350 6051 21951
1720 21951 8298 -17316 -18311 7301 23102 6829 -17952 -17953 6829 22940 6898 -19679 -19128
1733 -19128 8459 24100 5894 -20928 -18783 9210 22877 3794 -19648 -15638 9374 22148
1745 22148 5014 -20306 -18537 9723 25586 5804 -22581 -19180 12704 27167 2935 -25080
1757 -25080 -17071 14887 25400 324 -25275 -14728 17854 25102 -3926 -28072 -12648 20443
1769 20443 23422 -7198 -26143 -6757 19997 16606 -9193 -21103 -4911 16465 14900 -6284
1781 -6284 -18171 -5204 14674 14708 -5007 -17917 -6706 13044 15270 -1354 -15324 -9039 10160
1794 10160 16856 58 -18992 -11953 14264 22615 -1435 -24603 -11868 18754 22194 -7072 -25800
1807 -25800 -7823 20857 19686 -9361 -24211 -4747 19881 14742 -12170 -22336 -1465 20107
1819 20107 13128 -10991 -19680 -3022 15957 13161 -6930 -18318 -5369 17236 17608 -6532 -22500
1832 -22500 -5623 21339 18080 -11333 -23996 -1066 25192 17175 -14300 -25016 -387 24409
1844 24409 13902 -17078 -23154 5689 26577 8023 -22817 -20617 10214 23016 1297 -20701
1856 -20701 -12262 10770 16117 -378 -14038 -9069 4417 9852 2966 -6523 -7431 850 9328 7442
1870 7442 -5016 -13641 -4925 13354 16322 -4050 -20474 -5765 21205 18777 -12697 -26804 -164
1883 -164 27786 14747 -19685 -24346 8276 29083 7107 -25554 -21933 12421 28116 3267 -24783
1896 -24783 -15745 14963 21270 -4957 -23727 -8934 15948 16157 -5146 -17095 -6489 10598 12732
1909 12732 -1160 -14242 -9980 7284 15803 4263 -12272 -11076 6332 15493 2968 -14696 -11897
1922 -11897 9403 20722 4239 -18427 -15145 11042 21849 515 -22027 -11659 15829 20006
1934 20006 -4406 -20576 -7038 14677 13301 -7216 -17585 -4506 13813 13321 -4010 -15996
1946 -15996 -7569 8614 11348 -1403 -12483 -6945 8401 13701 519 -15337 -11481 9362 18551
1959 18551 280 -20149 -11346 16018 22094 -3341 -23357 -9290 17370 18339 -6336 -20024 -3154
1972 -3154 20031 15508 -10809 -22236 -2189 20798 13820 -12149 -19099 1777 18951 8374 -12785
1985 -12785 -15378 1288 13047 5960 -8342 -11750 -31 12244 8383 -8257 -16403 -3774 13449
1998 13449 12657 -5233 -15836 -4216 13698 12386 -7656 -17962 -2102 18517 13622 -10996 -18724
2011 -18724 2371 21200 9906 -14934 -17861 3875 19488 8731 -11530 -13737 3319 15095
2023 15095 5005 -13161 -13498 5132 17223 5424 -13400 -13341 4093 14297 4352 -11586 -12587
2036 -12587 2163 13451 6838 -9761 -13787 1246 14318 5519 -13309 -14279 5049 18371 7092
2049 7092 -13269 -15357 3171 16565 7086 -11963 -13391 5712 18774 5802 -15130 -13434 8400
2062 8400 18828 2803 -16621 -12147 10372 19444 2849 -17118 -13790 7584 17250 1226 -17144
2075 -17144 -10439 11918 16562 -3681 -19900 -9252 12745 15157 -4184 -17171 -6236 12263
2087 12263 13161 -4393 -15299 -5097 10866 10140 -4272 -10663 -1275 10223 8500 -3027 -10246
2100 -10246 -5451 5878 11861 4274 -9170 -9835 4931 14203 2896 -13387 -10837 8534 16230
2113 16230 722 -16289 -9896 11482 16847 -2229 -20501 -11291 13960 19459 -3406 -20850 -7728
2126 -7728 15405 13879 -9638 -19877 -1962 18146 11835 -10301 -17396 -672 15845 9549 -9777
2139 -9777 -14879 849 14654 8752 -6995 -11212 276 11038 6951 -6459 -11408 -883 13515
2152 13515 12243 -5811 -16538 -3921 14327 11403 -8279 -15551 247 15435 7870 -11021 -13716
2165 -13716 2081 13303 4990 -11073 -12540 3209 14615 5631 -10363 -12356 760 10336 4746
2178 4746 -6241 -7919 1214 8838 5893 -5145 -11192 -2572 11144 10843 -5122 -14420 -2301 15151
2192 15151 12461 -8086 -17444 -1791 16956 11853 -10396 -16958 3097 21067 8285 -18212 -19047
2205 -19047 7827 23012 4708 -19019 -13604 10873 17172 -2448 -17773 -7679 11055 12492
2217 12492 -3947 -13869 -4293 10178 9187 -4212 -11920 -4839 6506 8816 1893 -5732 -6060 1126
2231 1126 7942 4450 -6912 -9724 3097 14476 6268 -11263 -12418 5575 16038 3294 -14525
2244 -14525 -11593 8016 16644 2637 -14414 -10446 8439 13942 -2429 -16898 -6855 13233 14573
2257 14573 -4383 -16452 -6094 10222 10364 -3739 -11900 -4310 8572 9590 -2108 -10850 -5291
2270 -5291 7318 9470 -1741 -11431 -5246 9365 13012 -265 -13944 -9218 8500 14572 -346
2283 -346 -14720 -5857 13394 13901 -6056 -17235 -3203 14759 10919 -7838 -14324 -732 13478
2296 13478 9158 -7328 -13777 -2793 10744 7890 -6541 -11300 495 11656 5789 -8696 -12385
2309 -12385 -605 10837 8224 -4730 -11059 -2111 10252 8826 -5363 -12460 -1574 11624 8580
2322 8580 -6075 -10932 981 12655 6977 -8851 -13357 -27 13817 9071 -7501 -12524 613
2335 613 11897 4895 -9659 -10444 2735 11748 4929 -7891 -9786 1105 10655 5659 -8050 -12029
2349 -12029 316 12908 8077 -7584 -11816 1156 11810 4746 -9890 -11043 3701 14839 6196
2362 6196 -11045 -13143 3241 14889 4786 -12127 -11162 5923 14460 2722 -11531 -8698 5626
2375 5626 11167 821 -11111 -8296 6377 13527 2678 -12295 -10773 5247 12829 1343 -11694
2388 -11694 -7297 7652 12027 -442 -12266 -7077 7710 11374 -934 -11860 -5738 8999 11433
2401 11433 -1521 -11482 -5226 6650 8025 -1232 -7642 -2816 6113 7405 -1195 -9018 -5883 4631
2415 4631 8907 1464 -8154 -6924 3256 9416 3098 -8413 -9935 2182 12580 5367 -11016 -11419
2429 -11419 6953 17040 1123 -18336 -11218 13092 18552 -2881 -18589 -5803 15352 13423
2441 13423 -8237 -17399 -980 16288 9634 -10387 -14354 2601 14608 4757 -11310 -10487 3514
2454 3514 10060 2713 -6254 -5512 1348 4790 1904 -3413 -5348 -1220 5385 6293 -1107 -7767 -4738
2469 -4738 5233 8907 69 -10491 -6669 8143 12860 -1331 -13843 -5507 12232 11622 -7262 -15216
2483 -15216 371 15809 8622 -9812 -13151 1925 12927 5164 -9036 -9492 2809 10903 3976
2496 3976 -8291 -8868 2129 8738 3017 -6475 -7827 198 8089 6188 -4514 -10847 -2859 9489
2510 9489 8908 -5744 -12794 -147 14135 7586 -10621 -13455 3353 15777 5377 -12193 -11409
2523 -11409 6509 15174 2291 -13122 -9309 7997 12930 -1292 -12218 -4310 8896 8455 -3179
2536 -3179 -9459 -3512 5641 6365 -374 -5613 -4225 2093 5902 1877 -5366 -6437 730 7248 4415
2551 4415 -5305 -9317 392 10777 5500 -9327 -12496 2901 15347 5169 -13516 -11372 8039
2564 8039 14503 -571 -14186 -6614 10847 12644 -3106 -12675 -3878 9827 9767 -3072 -11071 -3231
2578 -3231 8977 8232 -3109 -8722 -2753 5943 6502 -1850 -8161 -3708 5386 7938 -84 -9589 -6863
2593 -6863 5833 9883 -979 -10720 -5853 7202 10519 -1489 -12211 -5423 8974 10452 -2992
2606 -2992 -12675 -3934 11762 10875 -5808 -13016 -1044 11336 7400 -5843 -9740 730 10035 5474
2620 5474 -5431 -8140 -638 8194 6662 -4586 -9401 -364 8531 5873 -4387 -9050 -1752 7857
2634 7857 5870 -4503 -8736 -1672 7689 6510 -4907 -11004 -1051 9464 5687 -5693 -9172 -861
2648 -861 8662 5869 -5203 -8350 -680 8007 7021 -3630 -9761 -913 10534 7260 -5656 -10238
2662 -10238 -312 11169 7954 -6603 -11151 889 11389 6361 -7706 -11864 1473 13500 4550
2675 4550 -10995 -10364 4169 11825 2234 -10754 -8993 5172 10405 546 -9508 -6846 4118 9665
2689 9665 559 -9776 -5393 5725 7666 117 -7128 -4961 3885 7080 1161 -4870 -5005 1279 7996
2704 7996 4708 -6109 -8014 2877 9983 3536 -7601 -8324 3883 11169 1717 -9332 -6347 4676
2718 4676 9578 1158 -9704 -6715 5849 8683 -826 -8548 -5350 4041 7675 248 -7965 -5568
2732 -5568 3107 7344 2373 -7591 -8143 4176 10776 1451 -9656 -7585 5458 12019 1487 -11244
2746 -11244 -7016 7970 12157 82 -12150 -7098 10255 13527 -3918 -14675 -2510 12681 9544
2759 9544 -7298 -13256 769 12452 4248 -8444 -7656 2443 7711 1881 -6526 -5642 2281 4868
2773 4868 708 -2572 -3265 -1411 2101 3127 584 -3331 -5265 452 8299 3637 -7957 -7632 4704
2788 4704 10742 1164 -11155 -7206 9583 12960 -2779 -13352 -3986 11253 10991 -5243 -14232 -599
2802 -599 14543 7641 -9052 -11232 2235 12287 3961 -9994 -8697 4424 8839 1677 -6383 -6788
2816 -6788 1061 6713 1965 -5822 -5485 1021 5749 3698 -4484 -7355 -330 6684 4827 -2844 -8422
2831 -8422 -2051 9473 7952 -5526 -10370 546 11021 6094 -7752 -9512 4589 12189 1923
2844 1923 -9354 -6740 4131 9491 1697 -8017 -5177 4679 6701 134 -5987 -4893 2415 6018
2858 6018 989 -5005 -4403 591 5644 4038 -5250 -8659 150 8006 4466 -5265 -8129 947 9737
2873 9737 3290 -8446 -7779 3308 10441 3983 -8488 -8772 5179 12112 1281 -10448 -6801 6824
2887 6824 11026 -259 -9994 -3209 8043 6429 -2888 -7580 -3275 5592 6913 -850 -6870 -3816
2901 -3816 2979 5752 317 -7397 -5336 4096 6795 353 -6752 -5979 3451 8851 344 -9898 -5712
2916 -5712 6371 10004 46 -10033 -5082 7626 8231 -2827 -8519 -1815 7686 7725 -3033 -9358
2930 -9358 -1785 7988 6205 -3635 -8046 -1517 7531 5679 -3856 -6667 -1022 4378 3950 -1878 -6012
2945 -6012 -1932 5500 5130 -2255 -7351 -3629 4967 6609 -1744 -7412 -2452 5012 5937 -1073 -8076
2960 -8076 -3967 6376 7624 -2399 -8751 -2581 8339 8365 -4179 -10736 -1690 8906 6767 -3677
2974 -3677 -8313 -1123 8555 5966 -5588 -9350 -134 9412 6250 -6424 -10113 1541 10531 3969
2988 3969 -8082 -8738 1655 9225 3469 -7266 -6542 3866 7628 470 -7351 -5176 4171 7343
3002 7343 402 -5251 -3377 1818 3918 1767 -2915 -4355 78 4776 3608 -2591 -5810 -713 6160
3017 6160 3899 -4646 -6894 19 7412 5901 -3828 -8830 -1221 8144 5522 -5595 -8740 1488
3031 1488 10569 4217 -8982 -8498 4485 10198 1388 -9086 -6578 5029 9819 862 -8153 -5432
3045 -5432 3790 6907 -37 -6981 -3513 4960 6527 -433 -6334 -4999 2517 7016 2060 -5982 -5802
3060 -5802 3178 8437 1779 -8184 -6435 4890 8454 -757 -8664 -4010 6797 8332 -1869 -9508
3074 -9508 -4083 6455 7570 -1786 -7148 -1699 6522 4493 -3933 -5867 538 4981 3011 -1801 -3635
3089 -3635 -1229 2487 3771 543 -4266 -4789 1100 6150 2986 -4734 -5610 1673 6606 1756 -7538
3104 -7538 -7121 4451 10549 1422 -10576 -7474 7222 11249 -2103 -12743 -3747 10736 9017 -5564
3118 -5564 -10970 183 10687 4938 -8233 -8938 2871 10142 3457 -6501 -6156 2169 5693 583
3132 583 -4245 -2462 2065 3426 1341 -1780 -3352 -1600 2820 4202 -1012 -5904 -2782 5572 6606
3147 6606 -1568 -7796 -3557 5207 6238 -2309 -7664 -1254 7893 6334 -5537 -10314 -255 9932
3161 9932 5165 -6988 -8015 2960 9073 1952 -6840 -5586 3072 6324 770 -4938 -2840 3294
3175 3294 6029 1127 -4914 -4971 474 5073 3720 -1961 -4724 -848 4546 3836 -3345 -7003 -542 7259
3191 7259 4563 -5367 -7543 1788 8743 2738 -7555 -7697 2098 8457 2915 -5705 -5772 2696 7191
3206 7191 537 -7757 -5459 4662 8319 693 -7066 -4067 3933 6206 149 -5690 -3759 3170 6020
3221 6020 1628 -4770 -3809 3377 5983 -296 -6879 -3947 4754 7371 792 -6281 -4735 2715 5818
3236 5818 20 -6085 -3770 4080 6060 -864 -7022 -3036 4241 4527 -2016 -6356 -2082 4198 5287
3251 5287 135 -5132 -3927 2181 4661 770 -4416 -2492 4095 6006 10 -5910 -4062 3517 6626
3266 6626 789 -6181 -4417 4819 7776 -61 -7641 -4075 5166 6267 -2221 -7174 -1188 6454 5419
3281 5419 -3046 -8112 -3218 5080 6249 -1445 -7320 -2693 5802 5537 -3204 -8010 -1263 6437 4242
3296 4242 -3879 -6400 459 7021 4252 -4395 -7444 -596 6847 4634 -3385 -5128 1379 6158 1960
3311 1960 -4863 -4497 1999 5662 2125 -3223 -3528 1126 4033 1770 -2714 -3659 -381 2509 2323 -248
3327 -248 -2572 -2146 1362 3106 -537 -5858 -3801 4650 7660 -964 -9272 -4224 7260 7271 -4086
3342 -4086 -9494 -711 9517 5784 -6079 -8465 2120 9879 3130 -8754 -7344 5221 10514 1329
3356 1329 -8358 -4925 5415 6353 -1859 -6146 -1037 5225 4173 -1772 -4337 -1623 2298 2871 21
3371 21 -3024 -2336 753 3206 2183 -2138 -4437 -1549 3143 3020 -2576 -5586 285 6754 3040 -6407
3387 -6407 -7282 2307 8429 2107 -6732 -4949 4402 7368 -51 -6323 -3195 4398 5705 -1135 -5257
3402 -5257 -987 5036 4414 -1348 -4437 -1999 2234 3080 1083 -1911 -2999 -93 3701 2232 -4086
3417 -4086 -5931 1180 6903 2099 -6585 -6002 3518 7726 243 -8383 -5581 4894 7865 -537 -8074
3432 -8074 -3160 6864 6429 -4240 -8629 -107 8502 5107 -4613 -6176 1458 6088 2005 -3696 -3431
3447 -3431 1362 3747 1463 -1741 -1553 324 1620 1295 -502 -2410 -2001 1357 4223 1706 -4482 -5491
3463 -5491 1833 6236 532 -7035 -4226 5207 6636 -2713 -8414 -1930 6802 4972 -4295 -7221 -97
3478 -97 7152 4401 -4018 -6236 1032 5974 2344 -4276 -3609 2774 5685 1090 -3863 -3183 1051 3704
3494 3704 2117 -1333 -3192 -811 3152 3265 -1361 -4710 -1757 3578 3450 -2052 -5186 -1092 4988
3509 4988 4155 -3527 -7296 -1209 6421 4433 -4393 -6443 1004 7009 2249 -5920 -5237 2907 6310
3524 6310 991 -5055 -3709 2911 5687 997 -4767 -3809 2446 5242 854 -3705 -2370 2501 3686
3539 3686 153 -3497 -2627 1802 4207 1407 -3615 -3948 1396 4397 725 -4240 -3501 1735 3941 412
3555 412 -3398 -2819 991 3354 670 -3465 -3559 1355 4895 1969 -3768 -4384 1221 5138 1570 -3919
3571 -3919 -3588 2064 5416 1768 -4440 -4215 2614 6064 975 -5726 -3976 3937 6729 162 -6146
3586 -6146 -3536 3850 5253 -1018 -5606 -2129 4929 4927 -2178 -6445 -1687 5033 3896 -2710 -4957 -168
3602 -168 4167 2496 -1912 -3461 -718 2506 2690 -802 -3479 -1541 3163 3836 -974 -4850 -1765 3655
3618 3655 3901 -1251 -4131 -1115 3449 3294 -1460 -4028 -1136 3748 3247 -1624 -4005 -465 3735 2797
3634 2797 -1761 -3805 -1156 2633 3222 -425 -3557 -1997 2422 3748 -680 -4693 -2301 3712 4631
3649 4631 -934 -5583 -2333 4397 5040 -1895 -6489 -2109 5787 5398 -3400 -7216 -75 7465 3574
3664 3574 -5968 -6274 2706 7381 1329 -5967 -3963 3487 5270 -278 -4964 -2115 3362 3590 -1080
3679 -1080 -3331 -714 2435 1607 -754 -1261 -601 -51 676 1811 332 -2710 -2181 2126 3865 -715
3695 -715 -4894 -1750 4573 4087 -2755 -5954 -417 5978 3500 -4291 -6100 1265 6831 2396 -5524
3710 -5524 -5001 3140 6378 80 -5682 -2531 3970 4640 -882 -4430 -1717 2998 3289 -594 -3298 -1714
3726 -1714 2000 2828 21 -2555 -1995 806 2593 1454 -2133 -3269 111 4125 2415 -3486 -5131
3741 -5131 1488 6328 1515 -5696 -4441 3815 5955 -933 -6193 -2254 4569 4574 -2055 -5453 -1256 4361
3757 4361 3341 -2246 -4214 -141 3765 1803 -2105 -2678 172 1939 1354 -601 -1807 -1047 1272 2459
3773 2459 581 -2496 -2586 1489 3739 917 -3372 -3098 1777 4485 620 -4506 -3474 3172 5503 -480
3789 -480 -6020 -2440 4865 4853 -2693 -5852 -395 5487 2810 -3297 -4397 473 4070 1685 -2651 -3390
3805 -3390 231 3320 1766 -1940 -2984 -87 2509 1703 -1182 -2663 -853 2312 2986 -566 -3691
3820 -3691 -1790 3337 4043 -1285 -4749 -956 4528 3671 -2450 -4894 -70 4965 2765 -3206 -4546
3835 -4546 632 5002 2270 -3929 -4315 1247 4516 720 -3974 -2877 2062 3438 54 -3320 -2235
3850 -2235 1384 2927 561 -2261 -2154 911 2725 835 -1752 -2099 176 2387 1554 -972 -2242 -403
3866 -403 2696 2401 -1531 -3795 -357 4212 2806 -2538 -4022 452 4176 1896 -3016 -3625 784 4186
3882 4186 1844 -3133 -4077 586 4975 1733 -4497 -4627 1862 5410 1022 -4860 -3588 2426 4581
3897 4581 -451 -5034 -2305 3385 4506 -960 -4898 -1474 3965 3415 -1797 -3750 -430 3155 2591
3912 2591 -1185 -2330 -148 1879 1778 -466 -2111 -952 2044 2262 -241 -2296 -1492 899 2165 540
3928 540 -2138 -2046 424 2837 1166 -2818 -3498 1500 4127 467 -4390 -2880 2837 4333 -404 -4800
3944 -4800 -2211 3079 3802 -806 -3711 -1304 3309 3374 -1617 -4133 -541 3534 2882 -1284 -3427 -636
3960 -636 2957 2859 -764 -3219 -1566 2561 3625 -441 -4073 -1230 3631 3112 -1956 -4932 -808 4455
3976 4455 3076 -2667 -4368 -123 3812 2049 -3236 -4243 984 4238 642 -3713 -2658 1775 3178
3991 3178 -313 -2986 -1363 1366 1770 533 -277 -1031 -236 1038 960 34 -1061 -533 1435 2382 129
4008 129 -2754 -1829 1824 3712 217 -4458 -2659 4040 4642 -1922 -5749 -1174 5343 3084 -4502 -5537
4024 -5537 1905 6107 922 -5424 -4099 2245 4995 -97 -4771 -1884 3393 3002 -1434 -3432 -698
4039 -698 2591 1744 -1034 -1754 25 1053 1748 1165 -1190 -2023 -273 2177 2020 -459 -2363 -135 3014
4056 3014 1603 -2123 -3345 181 4246 2573 -3485 -4606 1493 5136 590 -5106 -3702 2689 4481
4071 4481 -925 -4836 -1155 3591 2061 -2077 -3666 -655 3189 2291 -1108 -1890 -144 1391 1326 -212
4087 -212 -1402 -518 1172 1646 1139 -740 -2185 548 3069 993 -2878 -2826 1501 4193 1449 -3671
4103 -3671 -3095 1852 3229 -351 -3650 -2036 2676 3793 -1060 -4742 -1663 3370 2960 -2023 -4204
4118 -4204 -768 3660 2409 -1877 -2875 -491 1756 1798 -1146 -2918 -30 3118 2362 -1052 -3020 -1126
4134 -1126 2811 2715 -1015 -2505 -137 2556 2335 -769 -3209 -782 3076 2112 -1862 -3096 184 3799
4150 3799 2043 -2986 -3681 353 2339 815 -1318 -1627 250 2108 500 -1899 -1957 -123 1826 1497
4166 1497 -1016 -2150 5 2357 1571 -846 -2724 -1293 2521 2856 -841 -2611 -1 2861 2047 -2192
4182 -2192 -3748 375 3768 2103 -1573 -2848 -217 2973 2207 -2331 -3475 291 3625 1849 -2469
4197 -2469 -3313 1130 4021 311 -3907 -2937 1382 3672 1448 -2792 -3017 1076 2881 252 -3113 -2561
4213 -2561 1900 3865 -154 -3716 -1437 2663 2574 -823 -3063 -1144 2727 2701 -735 -1824 -184 1193
4229 1193 1007 -780 -1500 386 1552 957 408 -262 -1680 -818 1574 1670 -823 -2657 -884 2919 2449
4246 2449 -2178 -3654 268 3343 1151 -3201 -3336 1798 5169 749 -5054 -3764 2518 4813 -5
4261 -5 -4516 -1703 4328 3341 -2446 -3944 101 3320 1905 -2217 -2977 853 3329 1471 -1525 -2246
4277 -2246 -472 1807 1455 -639 -1018 296 1145 1036 -314 -2044 -1485 1569 2544 386 -2666 -2159 1875
4294 1875 3290 -953 -3868 -1296 2408 2330 -1252 -3074 43 3391 1381 -2906 -3082 515 3147 1792
4310 1792 -1694 -1800 607 1496 131 -682 -633 -333 954 1267 337 -1323 -1461 1090 2597 -68 -3561
4327 -3561 -1764 2800 3470 -507 -3528 -1592 2693 2833 -1940 -4070 -87 4427 2582 -3060 -4744
4342 -4744 672 4819 1007 -3996 -2974 2140 3683 -128 -3092 -1285 2276 1771 -1511 -1973 -46
4357 -46 1834 1564 -169 -1367 -691 -95 303 1184 326 -1512 -1102 1392 2040 -375 -3019 -1097 3080
4374 3080 2362 -2310 -3573 903 3988 1577 -3414 -3597 1287 3950 516 -3006 -1943 2253 3314
4389 3314 -828 -3943 -1260 2951 2489 -1249 -2374 -47 1965 1085 -763 -1192 -214 334 630 689 -432
4406 -432 -1069 247 1289 436 -1400 -1995 -15 2767 1816 -1801 -3080 327 3211 1591 -2884 -3000
4422 -3000 1840 4119 363 -3736 -1782 2922 3306 -1259 -4091 -1150 3280 2923 -1103 -3055 -625
4437 -625 2444 1505 -1802 -2617 377 2499 1181 -1499 -2083 -185 1693 1184 -802 -1961 -580 1750
4453 1750 1742 -596 -2171 -470 1498 882 -1202 -1616 201 1843 1273 -702 -1908 -787 1087 1891 -48
4470 -48 -1940 -811 1811 1855 -699 -2262 -614 1601 1704 -646 -2003 -373 2123 2196 -673 -2925 -1418
4487 -1418 2236 2516 -904 -2820 -510 2518 1943 -1858 -3269 -105 3147 1879 -2060 -3241 421
4502 421 3498 1377 -2863 -2771 1112 2905 623 -2041 -1463 1392 2140 106 -1966 -1832 972 2698
4518 2698 921 -1818 -1845 850 2219 268 -2092 -1347 885 1958 254 -1497 -1025 633 1693 257
4534 257 -1857 -1541 903 2186 470 -1462 -1315 281 1010 23 -1031 -943 176 1392 1044 -961 -1891
4551 -1891 -118 1962 1186 -1329 -2270 147 2758 1804 -1579 -2727 40 2930 1581 -2427 -2650 1566
4567 1566 4099 879 -3768 -2763 2350 3784 -494 -3894 -1331 2921 2844 -1504 -3481 -402 2830
4582 2830 1594 -2304 -2724 794 2953 666 -2109 -1518 454 798 29 -326 -131 -104 -112 674 571 -820
4600 -820 -1426 482 1961 726 -1522 -1619 1081 2631 655 -2329 -2151 1520 2784 294 -2816 -1460
4616 -1460 2597 2619 -1420 -3438 -573 2987 2078 -1705 -2729 169 2281 976 -1794 -1966 9 1655
4632 1655 592 -1149 -1419 18 1119 547 -657 -1315 -697 1107 1790 368 -2126 -1688 1613 2877
4648 2877 -369 -2867 -736 3115 2598 -1732 -3074 333 3410 1550 -2213 -2766 717 3363 1056
4663 1056 -2346 -2230 1123 2549 -204 -2538 -1420 1620 1582 -582 -1733 -886 339 605 165 -670 -766
4680 -766 -49 1112 1120 -591 -1422 -602 1362 1548 -598 -1998 -315 2361 2069 -1203 -3022 252 3283
4697 3283 1641 -2282 -2398 1587 3174 238 -2749 -1430 1752 2208 -432 -2453 -857 1382 1777 -577
4713 -577 -2019 -697 946 930 -284 -1043 -828 164 582 495 -618 -1587 -127 1711 1514 -1235 -2525 166
4731 166 2853 1273 -2301 -2346 1322 3131 550 -2572 -1765 1795 3107 -112 -3041 -1275 2507 3029
4747 3029 -854 -3390 -717 2845 1567 -1710 -2501 313 2138 739 -1330 -1664 282 1423 253
4762 253 -1170 -1160 -49 864 478 -407 -761 -365 193 895 346 -858 -1045 594 1906 494 -1690 -1276
4780 -1276 1273 1990 67 -1692 -1036 1231 1899 365 -1842 -1430 1270 2303 86 -2383 -1247 2103
4796 2103 2521 -930 -3050 -689 2597 1991 -1296 -2950 -325 2569 1625 -1778 -2980 58 2722 1122
4812 1122 -2160 -2388 893 2615 347 -2293 -1363 1224 2056 264 -1677 -1035 985 1823 320 -1223
4828 -1223 -817 784 1321 199 -581 -422 82 652 769 -22 -1088 -655 1202 1325 -519 -2007 -468
4845 -468 1691 1360 -1237 -2026 107 1973 1148 -1575 -2201 46 2215 978 -1725 -2050 611 2410
4861 2410 521 -2000 -1381 1033 1731 477 -1430 -1289 274 1625 974 -1035 -1683 388 2423 1094
4877 1094 -1687 -1928 882 2612 801 -2144 -1759 1297 2805 324 -2562 -1581 1641 2545 -471 -2915
4893 -2915 -1122 2308 1993 -1340 -2665 -72 2013 837 -1331 -1685 148 1350 403 -883 -922 288
4909 288 718 445 -163 -231 -196 -112 590 1012 -12 -1630 -457 1867 1773 -1330 -2416 513 2919 957
4927 957 -3001 -2078 1889 3100 -426 -3108 -1475 2429 2381 -1125 -3017 -532 2700 1580 -1928 -2372
4943 -2372 588 2206 678 -1736 -1516 639 1292 347 -775 -713 -44 657 644 -249 -996 -427 919 1368
4961 1368 385 -1160 -852 1005 2204 214 -2325 -1380 1980 2684 -583 -2812 -560 2734 1837 -2024
4977 -2024 -2789 694 2901 772 -2135 -1840 1032 2139 156 -1863 -1185 1046 1539 -23 -1390 -419
4993 -419 769 617 -119 -513 -343 -52 594 1202 75 -1552 -966 1039 1708 -433 -1868 -262 1990
5010 1990 1293 -1241 -2062 130 2179 1258 -1534 -2218 438 2508 1074 -1884 -1896 740 2131 419
5026 419 -1709 -1018 1051 1668 26 -1569 -1222 484 1574 604 -1297 -1283 582 1653 553 -1476 -1562
5043 -1562 305 1778 846 -1270 -1554 667 2230 589 -2245 -2134 1363 2826 202 -2525 -1027 1986
5059 1986 1707 -1199 -2284 -74 1987 1137 -766 -1439 -131 1444 883 -663 -1271 -318 888 1016 129
5076 129 -428 -371 126 453 73 -719 -996 345 1380 629 -1201 -1371 532 1647 321 -1529 -1454 718
5094 718 1967 597 -1652 -1764 847 1944 -74 -2505 -1257 1969 2480 -559 -2654 -1046 1724 1676
5110 1676 -615 -1797 -538 1865 1823 -841 -2456 -618 2197 1523 -1534 -2417 176 2752 1292 -1783
5126 -1783 -2079 398 1734 522 -1484 -1054 1074 1893 -86 -1712 -994 945 1211 -65 -889 -24 504
5143 504 96 90 65 -447 -935 -215 943 678 -838 -989 741 1521 -199 -2111 -1402 1476 2528 148
5161 148 -2520 -1189 2301 2343 -1234 -2940 161 3185 1427 -2122 -2279 1238 2955 441 -2470 -2011
5177 -2011 1124 2274 433 -1815 -1317 1380 1411 -746 -1883 -546 1269 1130 -403 -1010 -581 20 546
5194 546 494 -549 -1423 -264 1738 1675 -918 -1831 303 1909 440 -2041 -1634 1211 2619 431 -2029
5211 -2029 -1554 1308 1906 -212 -1720 -408 1738 1129 -700 -1131 163 920 393 -492 -594 -396 321
5228 321 1036 624 -777 -1535 -589 968 753 -674 -1457 -13 1650 685 -1438 -1976 327 2390 880
5245 880 -2339 -1996 1714 3139 -32 -2954 -1091 2312 2107 -1307 -2245 521 2594 1201 -1595 -1945
5261 -1945 374 1753 894 -926 -819 506 753 70 -463 -622 -247 72 457 394 -719 -1201 355 1712
5279 1712 171 -2103 -1805 1068 2485 308 -2228 -1081 1739 1692 -958 -2559 -451 2704 1704 -1438
5295 -1438 -2377 638 2744 858 -1981 -1638 1098 2059 162 -1052 -196 800 517 -470 -743 -382 374
5312 374 557 438 -265 -855 -972 65 623 411 -1020 -1497 389 1742 391 -1977 -1383 1333 1927 -949
5330 -949 -2699 -324 2960 2019 -1766 -2718 165 2403 1299 -1481 -1752 920 2456 324 -1974 -1413
5346 -1413 1013 1937 93 -1755 -898 1221 1536 158 -1207 -1239 215 1053 262 -1040 -693 975 1312
5363 1312 -110 -1761 -1256 771 1443 156 -1008 -809 154 1070 317 -1285 -1049 421 1245 71 -1110
5380 -1110 -604 1181 1361 -561 -1233 -464 415 1154 899 -317 -832 -110 1027 790 -817 -1411 319 1693
5398 1693 579 -1247 -1328 608 1626 488 -1796 -1962 839 2260 595 -1916 -1578 950 1778 -706
5414 -706 -2510 -607 1794 1556 -358 -2184 -1053 1440 1556 -504 -1823 -492 1610 1740 -572 -1703
5430 -1703 -25 1650 674 -949 -1454 227 1915 1529 -775 -1649 -135 1145 1004 -553 -1138 451
5446 451 1399 55 -1121 -602 -5 353 202 -322 -690 -191 321 714 249 -988 -1161 57 906 226 -446
5465 -446 -709 460 1407 297 -1774 -1484 1387 2299 391 -2351 -1474 2225 2484 -771 -2581 -260 2437
5482 2437 1964 -1302 -2490 757 3147 717 -2615 -2193 982 2545 272 -2370 -1124 1559 1041 -906
5498 -906 -1380 -78 765 444 -377 -513 -90 122 333 394 -592 -1067 -210 790 860 310 -803 -802 782 1299
5518 1299 -485 -1501 -179 2002 1955 -942 -2337 345 2638 880 -1904 -1653 880 2088 542 -1693
5534 -1693 -853 1180 1217 -557 -1399 -599 1228 1206 -398 -1160 -276 -28 195 328 -176 -765 -290 743 770
5553 770 -437 -1707 -380 1853 967 -1425 -1663 713 2205 907 -1600 -2001 818 2171 250 -1623
5569 -1623 -897 1495 2248 -378 -2705 -672 2153 1252 -977 -1437 -2 1309 1022 -888 -1072 -52
5585 -52 317 483 9 -782 -266 783 551 -575 -969 -949 238 1400 375 -1230 -1064 611 1637 338
5603 338 -1709 -1326 1535 1996 -663 -1973 -147 1710 1458 -1183 -1975 24 1725 920 -647 -989 97
5620 97 1240 265 -1106 -806 748 529 397 0 -718 -424 265 750 402 -1018 -1248 389 2003 202
5638 202 -1798 -1021 822 1223 -295 -1988 -894 1845 1967 -795 -2203 -711 1946 1967 -1215 -2499
5654 -2499 400 2669 950 -1826 -1671 889 2116 93 -1954 -745 1165 1550 -29 -1207 -1014 718
5670 718 992 -334 -693 -97 533 379 -27 -723 -509 53 495 422 -287 -1188 -251 1176 578 -786 -986
5689 -986 -322 568 801 -364 -726 -4 872 847 -186 -1441 -542 1750 1470 -773 -1574 -119 1580 1021
5707 1021 -1024 -1820 149 1953 781 -1342 -1563 422 2229 766 -2185 -1701 1122 2197 88 -1949
5723 -1949 -1203 1142 1607 -439 -1816 -441 1407 1469 -352 -1466 -372 1451 927 -788 -1209 -67
5739 -67 849 547 -327 -564 -32 162 159 155 -645 -789 313 1156 369 -879 -1050 213 1276 474 -1228 -1131
5759 -1131 599 1346 363 -1269 -1166 904 1507 -378 -1654 -196 1259 1081 -351 -1129 -312 658 638
5776 638 -6 -661 -660 384 1238 158 -1216 -779 638 1415 91 -1421 -983 889 1551 65 -1786 -1216
5794 -1216 930 1934 -312 -2322 -641 1898 1478 -1231 -2287 -168 2133 932 -1555 -1521 677 1803
5810 1803 447 -1470 -989 871 1270 -305 -1125 -84 917 323 -289 -92 184 -139 -275 643 742 -478
5828 -478 -1314 173 1394 176 -1529 -1218 859 1775 -365 -2035 -674 1518 1446 -830 -2031 -407
5844 -407 2074 1237 -1474 -1934 620 2132 334 -1806 -1023 948 1625 -165 -1210 -305 823 774 75
5861 75 -569 -282 230 417 172 3 -352 -203 373 762 -5 -1124 -721 960 1477 -383 -1894 -545 1855
5880 1855 1339 -1357 -2264 294 2083 508 -1925 -1635 847 1773 55 -1887 -926 1348 1736 -548
5896 -548 -1740 -381 1508 886 -628 -1028 208 804 352 -80 -57 -113 52 744 372 -550 -868 168 1048
5915 1048 346 -811 -934 237 1166 281 -937 -1071 210 1245 274 -1295 -1120 628 1232 -194 -1495
5932 -1495 -730 810 971 -380 -968 -523 603 876 22 -809 -646 590 1047 221 -661 -686 379 1267
5950 1267 279 -1147 -895 523 1696 549 -1562 -1308 1184 1991 -260 -2188 -613 1816 1452 -1063
5966 -1063 -1952 31 1709 608 -1521 -1468 329 1398 498 -1108 -1136 247 1124 91 -1080 -389 638
5983 638 844 -92 -557 -210 -35 338 596 285 -531 -340 503 883 247 -600 -564 334 866 373 -779 -494
6003 -494 741 1377 21 -1597 -984 1111 1496 -522 -1649 -493 1159 1095 -756 -1466 -557 1067 1122
6020 1122 -596 -1642 -438 1493 1222 -1201 -1963 -93 1953 816 -1216 -1187 665 1716 219 -1450
6036 -1450 -949 985 1691 409 -1331 -617 1336 1512 -385 -1352 -67 1090 483 -523 -260 444 379
6053 379 -472 -241 -254 -499 -229 234 525 -32 -816 -649 319 705 -250 -1348 -712 1070 1280 -476 -1643
6072 -1643 -153 1793 825 -1435 -1530 611 1986 646 -1308 -1144 940 1609 128 -1514 -745 1272
6088 1272 1386 -424 -1358 -235 1181 631 -461 -803 149 616 438 106 -423 -789 -292 481 475 -750 -1209
6107 -1209 295 1485 105 -1468 -1164 642 1416 41 -1594 -933 1080 1433 -423 -1729 -313 1468
6123 1468 1007 -982 -1227 492 1712 553 -849 -523 306 472 180 -252 -210 265 121 97 -17 -70 -277
6142 -277 13 399 340 -411 -1042 -130 1159 582 -1317 -1870 249 1746 355 -1789 -1137 1354 1291 -754
6160 -754 -1947 -5 1905 1073 -1047 -1416 321 1470 416 -1097 -1058 686 1335 -3 -988 -186 792
6177 792 384 -265 -426 -234 -187 130 584 374 -586 -964 169 1066 222 -1276 -594 965 1220 -344 -1775
6196 -1775 -587 1471 1241 -1151 -2109 -81 2050 984 -1408 -1533 650 1511 -175 -1449 -579 1317
6212 1317 1198 -410 -1270 -265 1147 949 -387 -608 171 587 361 -130 107 177 -251 -451 279 516 -440
6231 -440 -583 479 1254 -96 -1708 -836 1396 1224 -681 -1340 -60 1085 579 -1116 -1397 355 1444
6248 1444 290 -1235 -1110 587 1785 342 -1517 -964 610 1314 140 -976 -313 819 1013 -330
6264 -330 -1202 -438 874 1222 -136 -1102 -377 817 947 -318 -757 -371 658 702 -87 -629 -238 714 717
6283 717 -686 -1442 -337 1003 786 -331 -854 -272 330 -23 -261 -193 216 250 415 168 -359 -314 137 615
6303 615 123 -688 -463 470 1078 600 -563 -972 84 1032 304 -1004 -780 904 1406 -283 -1508 -749
6321 -749 909 1062 -160 -1359 -507 985 977 -273 -1399 -463 948 829 -744 -1249 210 1532 809
6338 809 -887 -1425 -105 1100 573 -586 -831 211 1265 411 -942 -838 332 1085 120 -798 -437
6355 -437 603 763 14 -635 -477 60 241 344 -112 -246 -15 129 -119 -378 -423 -117 108 379 307 -402
6375 -402 -645 81 981 137 -1205 -1098 851 1478 -28 -1362 -315 1393 1115 -1081 -1760 170 1855
6392 1855 1000 -1170 -1409 356 1622 109 -1644 -833 1042 1348 -397 -1255 -147 1027 357 -695
6408 -695 -938 -112 732 519 103 -208 -160 -12 139 89 203 -3 -185 447 626 -97 -917 -458 885 835 -691
6429 -691 -1353 86 1662 713 -1036 -1163 473 1209 -244 -1284 -543 1283 1153 -569 -1469 -351 822
6446 822 745 -534 -724 298 625 -2 -522 -118 113 75 -206 342 190 -144 57 565 482 -429 -920 -192
6466 -192 1073 622 -285 -761 256 1006 406 -1117 -994 777 1585 -28 -1435 -578 1094 1145 -815 -1569
6484 -1569 -210 1204 584 -483 -773 232 903 127 -822 -904 91 890 401 -454 -482 76 298 230 -16
6503 -16 -176 -189 230 692 427 -551 -504 591 919 -324 -1374 -368 1352 898 -475 -1363 -177 987
6521 987 326 -743 -839 360 926 47 -928 -460 415 396 -296 -668 -164 315 150 119 265 -169 -448 -156
6541 -156 256 150 -338 -254 571 754 -19 -695 -570 560 1039 110 -1079 -532 1053 1408 -292 -1531 -126
6560 -126 1382 873 -1093 -1342 735 1640 320 -1442 -1087 481 1235 150 -1006 -515 780 953 -258
6577 -258 -1030 -270 692 514 -457 -868 -49 532 388 -14 -503 -128 277 422 93 -259 -186 567 311 -165
6597 -165 -462 -174 291 530 165 -229 -259 -242 312 514 -316 -658 -4 654 399 -213 -593 -75 521 418 -562
6618 -562 -1078 180 1143 673 -937 -1296 266 1070 -22 -1106 -923 888 1172 -210 -1270 -600 717
6635 717 1084 -292 -1185 -281 1274 1087 -243 -942 6 1020 332 -751 -461 483 644 191 -380 -268
6653 -268 -158 344 436 -24 -413 -370 199 401 -91 -400 -362 81 508 -79 -769 -421 752 558 -374 -1028 -434
6674 -434 650 409 -298 -439 48 300 335 -198 -269 -226 329 475 -18 -226 -352 549 796 -113 -857 -386 405
6695 405 655 163 -505 -435 506 791 -164 -1235 -326 1046 1175 -764 -1510 -91 1266 418 -1147 -1180 227
6714 227 1098 128 -1108 -697 812 911 -615 -1085 -148 852 559 -481 -435 290 332 -144 -361 327 118
6733 118 -332 22 581 447 -420 -545 466 672 -235 -847 -308 924 901 -350 -1211 -228 1105 621 -1189
6752 -1189 -1136 278 1339 63 -1471 -763 878 773 -478 -1137 -1 793 496 -693 -557 328 316 113
6770 113 -393 -152 271 217 -91 194 306 -174 -458 440 663 339 -686 -515 793 1009 -510 -1261 -24
6789 -24 1237 577 -1156 -996 568 1438 -11 -1419 -862 768 1012 -389 -1413 -192 1176 572 -1029
6806 -1029 -985 441 737 75 -717 -355 410 475 -71 -256 -237 117 372 358 -242 -100 76 196 145 143 -212 -282
6828 -282 123 631 248 -600 -491 425 814 104 -970 -183 585 562 -246 -607 -158 419 229 -495 -643 -122
6848 -122 460 230 -154 -738 22 314 244 -12 -447 -406 255 614 113 -631 -455 510 971 81 -1058 -301
6868 -301 1111 938 -554 -922 39 872 641 -819 -1020 208 1039 375 -814 -904 318 1246 20 -1071
6886 -1071 -598 500 732 -291 -708 -164 470 256 -425 -201 -45 124 289 22 -395 -178 54 -18 138
6905 138 30 -155 -71 225 389 80 -371 -385 470 727 -285 -592 -53 504 572 -218 -698 -134 604 401 -306
6926 -306 -648 -126 705 540 -590 -811 61 832 188 -692 -899 149 746 162 -850 -546 569 918 142
6945 142 -1099 -691 949 1042 -463 -895 164 821 336 -728 -640 398 516 -99 -329 -77 -63 177 60
6964 60 -155 -60 -18 77 177 224 -84 -366 -191 78 223 -136 -625 -216 689 368 -691 -606 397 678 188
6985 188 -776 -595 565 962 -118 -750 -268 505 672 -343 -838 27 791 238 -412 -335 95 369 83
7004 83 -208 -144 -91 22 253 317 -389 -560 234 785 80 -432 -493 382 842 -85 -951 -374 631 903 -72
7025 -72 -912 -327 915 532 -802 -1032 363 963 197 -718 -597 579 681 -225 -442 -85 416 314 -87
7044 -87 -329 59 92 -207 19 18 -88 -329 50 395 434 -353 -561 2 844 149 -748 -336 761 868 -475
7065 -475 -1044 -130 1104 529 -534 -822 236 855 354 -668 -464 720 570 -479 -859 -79 631 390
7083 390 -507 -418 218 230 -355 -169 202 -199 -173 48 526 226 -274 -381 379 721 -160 -720 -209 647 826
7104 826 -340 -1225 -108 1072 568 -858 -777 594 1059 94 -1355 -669 1135 850 -522 -1051 13
7121 13 1106 439 -758 -795 311 802 -38 -786 -309 630 385 -327 -458 268 140 -509 -35 298 207 -317
7141 -317 -396 370 405 46 -799 -183 475 436 -429 -637 61 794 393 -630 -838 223 1023 389 -677 -602
7161 -602 603 863 -188 -822 -111 718 496 -313 -808 -222 586 337 -360 -640 53 660 418 -122 -577
7180 -577 -172 495 162 -434 -334 4 591 521 -259 -628 -121 615 103 -441 -418 300 616 24 -487 -94 168
7201 168 348 111 -168 -103 237 564 168 -80 -333 -41 49 32 184 48 -41 -24 301 208 -516 -480 50 396
7223 396 -75 -568 -326 400 611 -324 -642 -275 243 497 -111 -455 -90 495 458 -432 -803 -121 933 699
7243 699 -454 -637 100 681 304 -519 -436 259 680 250 -529 -463 487 611 -165 -850 -294 504 554 -40 -410
7264 -410 -25 289 249 -283 -563 -75 500 155 -285 -386 33 246 -109 -371 -191 -58 -127 97 247 329 -98
7285 -98 -458 23 367 -143 -497 122 879 575 -425 -806 -2 627 403 -399 -665 404 852 113 -716 -469
7305 -469 539 780 -398 -883 -160 663 501 -369 -526 -160 293 57 -440 -443 153 364 -47 -267 -238 8
7325 8 47 50 34 8 -200 60 342 358 -387 -795 51 728 472 -500 -357 706 777 -135 -673 -389 776 602
7347 602 -266 -886 119 980 362 -717 -821 402 590 -178 -676 -126 405 73 -492 -428 -142 52 25 86
7367 86 172 -65 -200 -282 312 161 -66 -397 216 518 247 -308 -360 547 670 -80 -968 -324 691 953 -312
7388 -312 -544 76 657 28 -596 -422 206 714 90 -432 -407 194 418 -162 -501 -113 193 109 -138 -110 97
7409 97 -46 -32 80 48 -381 -52 485 440 -182 -945 -135 498 594 -380 -562 297 912 205 -751 -302 628 773
7431 773 -131 -694 -254 854 582 -277 -618 9 582 105 -472 -307 397 346 -367 -304 -24 -69 -192 -7 166
7452 166 151 -117 -191 12 396 140 -570 -613 140 680 -222 -667 -118 871 414 -798 -795 518 1237 458 -743
7473 -743 -510 441 867 -64 -857 -258 607 584 -262 -729 42 792 414 -439 -759 13 578 0 -405 -128
7493 -128 -110 286 -31 -362 -358 145 469 221 -370 -351 96 103 87 -100 -242 68 166 235 24 7 -142 130 14
7516 14 -1 -92 -45 352 412 124 -128 -410 -59 289 216 -325 -463 216 531 106 -544 -243 498 356 -194 -633
7538 -633 -87 572 529 -186 -795 -243 483 515 -321 -520 206 614 215 -526 -495 396 596 19 -399 -146 182
7559 182 323 125 16 -290 122 270 57 -79 -54 82 162 3 -331 -267 10 329 331 -302 -422 11 355 56
7581 56 -298 -280 165 220 -26 -278 -96 -3 292 -40 -214 -400 -71 360 152 -113 -29 238 113 -89 100 -20
7603 -20 -124 220 350 177 -643 -206 473 365 -286 -608 93 804 298 -577 -644 255 485 -117 -712 -317 596
7624 596 781 -112 -713 -40 601 313 -568 -486 258 490 -174 -256 -97 247 17 -205 2 9 -79 -113 348 210
7646 210 -67 -591 -244 149 316 -142 -287 159 738 205 -503 -555 347 629 -94 -763 -99 976 655 -352
7666 -352 -644 -126 544 22 -463 -319 470 487 -110 -508 -260 233 109 -180 -234 190 42 -303 -206 128 110
7687 110 -214 -446 255 481 -154 -504 -4 785 177 -674 -560 405 958 114 -837 -413 548 823 -480 -844
7707 -844 71 996 267 -701 -634 469 725 -135 -722 -375 327 281 -99 -289 -81 307 46 -142 -265 -120
7727 -120 241 163 -1 -57 3 6 141 73 20 -35 -408 405 418 -310 -434 -96 253 257 -464 -390 295 452 -31 -427
$$ [...]
8191e8
##END NTUPLES=NMR FID
##END=
