##TITLE=1H_LY-7.1.Dix.1.B
 CD3CN,8 sc, 
 5.04.2021
##JCAMPDX= 6.0         $$ Bruker NMR JCAMP-DX V2.0
##DATA TYPE= NMR FID
##DATA CLASS= NTUPLES
##ORIGIN= UXNMR, Bruker Analytische Messtechnik GmbH
##OWNER= root
$$ XWIN-NMR		Version 3.5
$$ Mon Apr  5 11:36:10 2021 Russian Standard Time (UT+4h)  she@DPX200
##.OBSERVE FREQUENCY= 200.131506
##.OBSERVE NUCLEUS= ^1H
##.DELAY= (6, 6)
##.ACQUISITION MODE= SIMULTANEOUS
##.ACQUISITION SCHEME= undefined
##.AVERAGES= 8
##.DIGITISER RES= 18
##SPECTROMETER/DATA SYSTEM= spect
##.PULSE SEQUENCE= zg30
##.SOLVENT NAME= CD3CN
##.SHIFT REFERENCE= (INTERNAL, CD3CN, 0, 15.7039)
##AUDIT TRAIL= $$ (NUMBER, WHEN, WHO, WHERE, WHAT)
$$ ##TITLE= Audit trail, XWIN-NMR		Version 3.5
$$ ##JCAMPDX= 5.01
$$ ##ORIGIN= Bruker BioSpin GmbH
$$ ##OWNER= she
$$ F:/spectra/data/she/nmr/H-F/1/audita.txt
$$ ##AUDIT TRAIL=  $$ (NUMBER, WHEN, WHO, WHERE, WHAT)
(   1,<2021-04-05 11:34:51.21 +0400>,<she>,<DPX200>,
      <created by zg, POWCHK disabled, PULCHK disabled
       configuration hash MD5:
       00 E9 B6 7A A2 85 ED C7 34 08 36 98 17 FE 4E 26
       data hash MD5: 16K
       22 6E AA 00 4C 17 2F 14 FC C1 97 AA 6F 1E FA 3B>)
$$ ##END=
$$ 
$$ hash MD5
$$ 03 50 E2 B2 A6 A4 9F 0D 71 65 3D 38 6B 19 7A 57
##$RELAX= 
##$RELAX= 
##$RELAX= 
##$RELAX= 
##$RELAX= 
##$RELAX= 
$$ Bruker specific parameters
$$ --------------------------
##$DU= <F:/spectra>
##$EXPNO= 1
##$NAME= <H-F>
##$PROCNO= 1
##$TYPE= <nmr>
##$USER= <she>
##$AMP= (0..31)
100 100 100 100 100 100 100 100 100 100 100 100 100 100 100 100 100 100 
100 100 100 100 100 100 100 100 100 100 100 100 100 100 
##$AQSEQ= 0
##$AQ_mod= 1
##$AUNM= <au_zg>
##$AUTOPOS= <>
##$BF1= 200.13
##$BF2= 200.13
##$BF3= 200.13
##$BF4= 200.13
##$BF5= 200.13
##$BF6= 200.13
##$BF7= 200.13
##$BF8= 200.13
##$BYTORDA= 1
##$CFDGTYP= 0
##$CFRGTYP= 5
##$CHEMSTR= <none>
##$CNST= (0..31)
1 1 145 1 1 1 1 1 1 1 1 1 1 1 1 1 1 1 1 1 1 1 1 1 1 1 1 1 1 1 1 1 
##$CPDPRG= <>
##$CPDPRG1= <>
##$CPDPRG2= <>
##$CPDPRG3= <>
##$CPDPRG4= <mlev>
##$CPDPRG5= <mlev>
##$CPDPRG6= <mlev>
##$CPDPRG7= <mlev>
##$CPDPRG8= <mlev>
##$CPDPRGB= <>
##$CPDPRGT= <>
##$D= (0..31)
0 1.2 0 0 0 0 0 0 0 0.06 0 0.03 0 0 0 0 0.0002 0 0 0 0 0 0 0 0 0 0 0 0 
0 0 0 
##$DATE= 1617608090
##$DBL= (0..7)
120 120 120 120 120 120 120 120 
##$DBP= (0..7)
150 150 150 150 150 150 150 150 
##$DBP07= 0
##$DBPNAM0= <>
##$DBPNAM1= <>
##$DBPNAM2= <>
##$DBPNAM3= <>
##$DBPNAM4= <>
##$DBPNAM5= <>
##$DBPNAM6= <>
##$DBPNAM7= <>
##$DBPOAL= (0..7)
0.5 0.5 0.5 0.5 0.5 0.5 0.5 0.5 
##$DBPOFFS= (0..7)
0 0 0 0 0 0 0 0 
##$DE= 6
##$DECBNUC= <off>
##$DECIM= 32
##$DECNUC= <off>
##$DECSTAT= 4
##$DIGMOD= 1
##$DIGTYP= 9
##$DL= (0..7)
0 120 120 120 120 120 120 120 
##$DP= (0..7)
150 150 150 150 150 150 150 150 
##$DP07= 0
##$DPNAME0= <>
##$DPNAME1= <>
##$DPNAME2= <>
##$DPNAME3= <>
##$DPNAME4= <>
##$DPNAME5= <>
##$DPNAME6= <>
##$DPNAME7= <>
##$DPOAL= (0..7)
0.5 0.5 0.5 0.5 0.5 0.5 0.5 0.5 
##$DPOFFS= (0..7)
0 0 0 0 0 0 0 0 
##$DQDMODE= 0
##$DR= 18
##$DS= 0
##$DSLIST= <SSSSSSSSSSSSSSS>
$$ [...]
##$SUBNAM2= <"">
##$SUBNAM3= <"">
##$SUBNAM4= <"">
##$SUBNAM5= <"">
##$SUBNAM6= <"">
##$SUBNAM7= <"">
##$SUBNAM8= <"">
##$SUBNAM9= <"">
##$SW= 16.9725357007746
##$SWIBOX= (0..15)
0 0 2 0 0 0 0 0 0 0 0 0 0 0 0 0 
##$SW_h= 3396.73913043478
##$TD= 16384
##$TD0= 1
##$TE= 0
##$TE2= 300
##$TE3= 300
##$TEG= 300
##$TL= (0..7)
0 120 120 120 120 120 120 120 
##$TP= (0..7)
150 150 150 150 150 150 150 150 
##$TP07= 0
##$TPNAME0= <>
##$TPNAME1= <>
##$TPNAME2= <>
##$TPNAME3= <>
##$TPNAME4= <>
##$TPNAME5= <>
##$TPNAME6= <>
##$TPNAME7= <>
##$TPOAL= (0..7)
0.5 0.5 0.5 0.5 0.5 0.5 0.5 0.5 
##$TPOFFS= (0..7)
0 0 0 0 0 0 0 0 
##$TUNHIN= 0
##$TUNHOUT= 0
##$TUNXOUT= 0
##$USERA1= <user>
##$USERA2= <user>
##$USERA3= <user>
##$USERA4= <user>
##$USERA5= <user>
##$V9= 5
##$VALIST= <valist>
##$VCLIST= <CCCCCCCCCCCCCCC>
##$VD= 0
##$VDLIST= <DDDDDDDDDDDDDDD>
##$VPLIST= <PPPPPPPPPPPPPPP>
##$VTLIST= <TTTTTTTTTTTTTTT>
##$WBST= 1024
##$WBSW= 4
##$XGAIN= (0..3)
0 0 0 0 
##$XL= 0
##$YL= 0
##$YMAX_a= 304359
##$YMIN_a= -304205
##$ZGOPTNS= <>
##$ZL1= 120
##$ZL2= 120
##$ZL3= 120
##$ZL4= 120
##$ABSF1= 10
##$ABSF2= 0
##$ABSG= 5
##$ABSL= 3
##$ALPHA= 0
##$AQORDER= 0
##$ASSFAC= 0
##$ASSFACI= 0
##$ASSFACX= 0
##$ASSWID= 0
##$AUNMP= <proc_1d>
##$AZFE= 0.1
##$AZFW= 0.1
##$BCFW= 1
##$BC_mod= 2
##$BYTORDP= 1
##$COROFFS= 0
##$CY= 11.3945322036743
##$DATMOD= 1
##$DC= 2
##$DFILT= <>
##$DTYPP= 0
##$F1P= 15.9154993809931
##$F2P= -4.1035820241983
##$FCOR= 0.5
##$FTSIZE= 0
##$FT_mod= 4
##$GAMMA= 1
##$GB= 0.15
##$INTBC= 1
##$INTSCL= 1
##$ISEN= 128
##$LB= 0.24
##$LEV0= 0
##$LPBIN= 0
##$MAXI= 10000
##$MC2= 0
##$MEAN= 0
##$ME_mod= 0
##$MI= 1.114404
##$NCOEF= 0
##$NC_proc= 0
##$NLEV= 6
##$NOISF1= 3.799351
##$NOISF2= 2.8
##$NSP= 1
##$NTH_PI= 0
##$NZP= 0
##$OFFSET= 15.70392
##$PC= 1
##$PHC0= -11127.62
##$PHC1= 18.40092
##$PH_mod= 1
##$PKNL= yes
##$PPARMOD= 0
##$PSCAL= 0
##$PSIGN= 0
##$REVERSE= no
##$SF= 200.130013532006
##$SI= 16384
##$SIGF1= 3
##$SIGF2= 2
##$SINO= 400
##$SIOLD= 16384
##$SREGLST= <1H.CDCl3>
##$SSB= 0
##$STSI= 0
##$STSR= 0
##$SW_p= 3612.71676300578
##$SYMM= 0
##$S_DEV= 0
##$TDeff= 0
##$TDoff= 0
##$TI= <>
##$TILT= no
##$TM1= 0
##$TM2= 0
##$TOPLEV= 0
##$USERP1= <user>
##$USERP2= <user>
##$USERP3= <user>
##$USERP4= <user>
##$USERP5= <user>
##$WDW= 1
##$XDIM= 8192
##$YMAX_p= 0
##$YMIN_p= 0
$$ End of Bruker specific parameters
$$ ---------------------------------
##NTUPLES= NMR FID
##VAR_NAME=  TIME,          FID/REAL,        FID/IMAG
##SYMBOL=    X,             R,               I
##VAR_TYPE=  INDEPENDENT,   DEPENDENT,       DEPENDENT
##VAR_FORM=  AFFN,          ASDF,            ASDF
##VAR_DIM=   8192,          8192,            8192
##UNITS=     SECONDS,       ARBITRARY UNITS, ARBITRARY UNITS
##FACTOR=    0.0002944,     1,               1
##FIRST=     0,             0,               0
##LAST=      2.4114304,     0,               0
##MIN=       0,             -304205,         0
##MAX=       2.4114304,     304359,          0
$$ Real data points
##PAGE= N=1
##DATA TABLE= (X++(R..R)), XYDATA
$$ [...]
2242b254K478J624j745j513J039J469m65j124J64N99P71N3j031j079P06J541p09
2259E24j515R80J286m47j332j3M69O06m57k57J16j12J68N17o39j124R01O58o31
2278c02m52O61Q72n73o53J6M62l55J65J73O1k64K45P0l08n3N30j61K0l33J5L67
2300B03K91l30l6n27L85M13l24l80K98P06l46q08J24M99l44J96J66l67j4L19L88
2321E12q05l80N65M38o98j71O09K21J94n20m74k77N42J011p53j034J104J130o96
2340E18j574L45J591J15j674j86J094M79j1j020j36J68R34j34j553l6K145N32
2358A597j979j337J572J696j048k032M86J756K60j090r67P53J150L3j182j262
2374a594J345J846n33k327l58K712M47k198j027J888J464r76j637j45J351P39
$$ y = [-2254, 224, 1848, 103, -1410, -371, 1098, 633, -491, -327, 272, 1043, 1096, 65, -1014, -308, 1233, 524, -991, -11, 1275, 828, -504, -517, -48, 558, 101, -156, -40, -152, 16, 533, -106, -1230, -329, 329, -302, -754, -93, 779, 206, -447, -431, 31, -324, -159, 14, 75, -189, 56, 126, -182, -235, 295, 134, 154, -179, -164, 203, 494, 164, 128, -399, -14, 399, 75, -305, -7, 699, 353, -455, -331, 168, -176, 20, 186, -181, -195, 124, 512, -293, -673, -108, 330, -368, -539, 70, 291, 485, -35, -509, -786, -244, 767, 14, -1020, 84, 1214, 518, -1056, -711, 880, 995, -679, -865, 229, 708, 697, -323, -459, -291, 643, 509, -1044, -1080, 1065, 1597, -382, -1719, -147, 1549, 501, -1531, -1045, 711, 971, -119, -1086, -333, 817, 850, -332, -1594, -249, 1597, 1064, -1263, -1621, 1091, 1538, -660, -1687, 201, 1665, 689, -948, -1093, 258, 997]
2390I97q52j542K80K126P05k031j630J747K047j126j986j50K030Q45j248j321
2406a109M52J378P9j337r53J132K319o84k337n15K199J196j826j700Q31K046K54
2423A425k297p60J669J749j046k543J25K517J066k120j887J562K156o97k320l92
2439a793J778J581j092k228M49K335J234k644j924J549K925o22l142k09K976J326
2455B499k432k153J185K678r5k211j498K181K325j453k953Q3L414J049l448j862
2471b691K559K772j809k452j43K228J046j684j980Q17K756J15k318j573J986K505
2487B134j282k988O47L162J98k514j355K313J423j048j743l62K135J032j524j231
2503a003K85J777P64k275j348K340J212j565j259J21J433O93j461q53Q92R27n85
$$ y = [997, 145, -1397, -1117, 1009, 1714, -317, -1947, -200, 1847, 721, -1265, -1415, 615, 1460, 212, -1109, -657, 721, 800, -537, -1490, -358, 1961, 1277, -1060, -1575, 624, 1820, -6, -1706, -875, 1171, 1425, -872, -1632, 37, 1786, 740, -1803, -1678, 839, 1905, -215, -2102, -540, 1616, 919, -1401, -1793, -15, 1566, 474, -1754, -1305, 1030, 2264, -380, -2304, -755, 2170, 1548, -1594, -1803, 1173, 2499, 67, -2086, -901, 1777, 1682, -529, -2027, 154, 2479, 1026, -1927, -1844, 1570, 2619, -829, -2691, -132, 2640, 831, -1621, -1764, 464, 1510, -174, -2154, -1337, 1419, 1534, -784, -2357, -371, 2134, 852, -2136, -1489, 1673, 1871, -643, -1998, 315, 1738, 690, -1053, -1415, 720, 1752, 228, -1003, -718, 1059, 1823, -452, -1800, 540, 1752, 187, -1072, -951, 482, 1175, -286, -1139, -247, 680, 95]
2520I5o97m51R20Q87p58j297N25J457r9p46m06j4J076l16n72j26P22L98j21n84
2540a07n61J212N67j058l99N62O98j46o11l88K10J102n70r99j18Q02M58j96j034
2559e76R8J120k94j139L65L93Rj9k79l64P98O19j094k73P4Q06O22j427m48J247
2579B38N71r92n43O86O53j80l34Rr2M76l43k8r1j3P61l15j010L43J164o43p62
2600d45P81o8o23M29J22k44K71m89j86O18j25r72J273j81q88P57pp92N85N12p81
2621d53j14O27L11j48n68k26J340L7j380M87P42j65j82J36p13N78Q23q33q40Q02
2641B61M48k18n07r19Q52J271r86j149Q37O23l09j28j082J06J720n35j906P97
2659h24J086J82k40j590O34J873m00j885M73R70J52j85o39o66J882N22j844m35
$$ y = [95, -602, -1053, -133, 754, -4, -1301, -776, 681, 582, -164, -570, -584, 492, 176, -396, -522, 200, 598, 477, -107, -668, 544, 1111, 53, -346, 216, 914, 768, 157, -231, -21, 1081, 511, -488, -606, 196, 654, 458, -576, -478, 642, 348, -791, -426, -33, -24, -43, -322, -686, 112, 731, -363, -636, -562, 244, 866, -561, -1009, 238, 809, -183, -726, -40, 613, 433, 99, 108, 16, 492, 149, 121, 30, 17, 778, 463, -547, -204, 960, 317, -445, 336, 268, -355, 74, 196, -48, 223, -266, -452, 166, 41, -931, 342, 161, -727, 30, 23, -769, -184, 328, -453, -567, 60, 371, 223, -345, -571, 769, 806, -574, -87, 655, 490, 308, 444, -269, 309, 1132, 299, -541, 261, 709, 491, -16, -935, -83, 1188, 202, -947, -110, 513, 204, 76, -1006, -900, 820, 285, -1621, -824, 262, 444, 204, -1386, -752, 1121, 721, -1164, -691, 279, 431, 246, -393, -1059, 823, 1345, -499, -934]
2677i34J076P25Lr40j053J973J104j991j045J290M87K13o49j561P77K376j208
2694F43k440R42J381M48r43j913P93K915j360k174O79J225J16L03j720m17K614
2711A092M71k210r51J232J597J1k199r19L165R60k740q15J598N06O10j258j794
2728a644J538K372j974j225L12R89J277j085k728J586K481j350k141O44J189Q06
2744A047n31k237K58K719l10k293O7P95J456ok537p03L391L28k274k83J001J062
2762I50L70j819j178K258J149j733q50P78M52J219j264j872J354J830j085j250
2778f91K31L40J218l48k201N85J859k50j493l8J43R56Q05k237l97K138k5j242
2796f47J34m53O81J800j965j033J567R22p73l61o29P15J967j433j834J539J045
$$ y = [-934, 142, 867, 870, -70, -1123, 850, 1954, -37, -1082, 208, 695, 908, 259, -1302, -525, 1851, 643, -1797, -855, 526, 974, 31, -1882, -1089, 1826, 466, -1708, -1029, 196, 312, 615, -1105, -1522, 1092, 1563, -647, -1598, -366, 1231, 1242, -957, -1876, 1289, 2249, -491, -1306, 292, 798, 1408, 150, -1644, -106, 2266, 292, -933, -621, 368, 1645, 560, -2168, -582, 1899, 549, -1592, -948, 241, 1047, 516, -1721, -1463, 1256, 946, -1347, -1280, -485, 971, 965, -1572, -2275, 1116, 1444, -830, -1113, -112, 950, 1320, -499, -1677, 581, 1730, -3, -853, -75, 377, 1596, 332, -1540, -186, 1644, 559, -691, -460, -120, 1098, 750, -1451, -866, 993, 743, -750, -788, -645, 311, 1116, -1121, -1518, 620, 595, -647, -513, -966, -285, 1515, -450, -1483, 84, 1006, 233, -128, -757, -42, 1925, 492, -1342, 197, 1242]
2813A242p85q00n6r1J739l45k075L41J927m86n15o01m23J909q5k210L34J763m02
2832C81q53K54o78R18J113j603j130J632K43l26l19p21J021J699j764j578J941
2849B30N80j163M38m92M57J046p08j248Q49Q03m56n3m22m47J570k98j890J217
2867A3Q96q89j95J60m27P17K05j066L55N00m75mM51p85L31O76j184k01J371m91
2887d2l66R11m01n37P27m25q3P77o87m57R79k56q83J076k89k12N81k60p17R72
2907D08N83j263N04j74k58P69l66j082Q38Q49j013J04p4j05P72Oj334L54J504
2926A022q62n25J11M6M46Pq73K42J227p25n06L34l84N34O94r14q22J191N98p75
2946F6j06j22K65Q17q36j032J107K61j48o4m46k87J367m9j898L61J540k33n28
$$ y = [1242, 457, -343, -399, -490, 1249, 904, -1171, -830, 1097, 611, 96, -505, -928, 981, 896, -1314, -980, 783, 381, -472, -218, -896, 22, 1135, -468, -1598, 34, 277, -49, -368, -1089, -68, 1631, -133, -1711, 230, 810, -353, 85, -407, 50, 1096, 388, -860, -11, 792, 336, 283, -139, -586, 984, 686, -1204, 13, 909, 20, -175, -15, -442, 275, 480, -586, -231, 269, -206, -210, 241, -544, -213, 463, -721, -922, 449, -42, -408, 503, 102, -435, 292, -133, -216, 561, -126, -583, 396, 140, -743, 333, 44, -168, 413, 153, -564, 408, 991, -272, 232, 58, -200, 569, 203, -879, -41, 808, -205, -101, -175, -280, 492, 498, -836, -482, 1022, 160, -365, -254, -208, 238, 245, -628, -386, 841, 116, -390, -56, -440, 94, 788, -126, -948, 243, 841, 66, -40, -162, 103, 920, 84, -948, 159, 420, 272, 208, -238, -525, 842, 793, -1105, -744, 796, 563, 35]
2965C5p88P6J438J26j953J80J440k30k08m00m49J050P14j364o78J224O25j44o85
2984Ij260J284J317j464j092J444N13j66p62j009P40K001q67j657P9J604J98q75
3002C7j048K51K293p98j794J59J303K38m12j266K56J502K94j540p69J521N87k04
3020F10j239o17J625Q33j253j127P70R97N8q92j064J145J325o28j612L67J068
3037C66K66k93j269L20J429q7j329k59O59R86j61j621O6J151J301j593j106Q71
3055c03O53P78j455q83J466J085j246j066L98Q35R74j074j312N25J883l04j939
3072i85k11J575Q83p96j710K25K033k20j184n91L98J317lj708k52J803P89j535
3090a72j233P41J832J56k292m26J531J345j322j286P14J126M41j290r75J053J304
$$ y = [35, -753, -677, 761, 887, -1066, -886, 554, 324, 116, -284, -733, 317, 1031, -333, -1011, 213, 838, 694, 9, -1251, 33, 1350, -114, -1206, 238, 751, 585, -177, -1186, -446, 1555, 688, -969, -890, 714, 912, 37, -1011, -760, 1533, 735, -1059, -900, 403, 641, 229, -1037, -781, 721, 1015, -525, -1294, 227, 814, 610, -629, -1246, 379, 1212, -41, -1168, -398, 599, 657, -235, -1299, -154, 1171, 543, -1069, -702, 366, 632, 339, -930, -610, 819, 732, -597, -856, -197, 789, 628, -993, -927, 224, 1525, -68, -1174, -303, 350, 1128, -327, -1210, 256, 1341, 95, -971, -573, 262, 1236, 162, -1150, -625, 1258, 954, -985, -1196, 379, 1262, 466, -1244, -1019, 1014, 794, -390, -981, -583, 734, 731, -977, -1229, 574, 1363, -172, -1405, -664, 1168, 1324, -968, -1394, 137, 1482, 160, -1126, -412, 714, 1155, -135, -1110, -57, 1247]
3107A247m78j238m49J323J132j513j349P96J705l76j389q4Q59P03o93j112K91
3124f25J328j34j149j65O22R38l94j292NJ100M62q91n72O90O05m49n54n3Q92P8
3144D42l81l74J31M64K07q34m5N19K33K0l62r8L59J51k20q33N08M67j03l97J29
3165a7K2j75J29l52K94J1KJ83j19j62k02O73m33q0j28J16J63l4J18L24m72L40
3187B01j52j20n1O4N84k34o42J98M46J13j93m27M72K00k03J3k13M45m25k50J96
3208B2m12J50N84l39k14J24L0J6o08J00M80K9j80j26j10L85K30K4k40l47M38K91
3230C27m75m18P76J3K90q48j15P77N2j32n11L57J9K47l62l91L04O56m4r60k47
3251f85P89O28n48r86K40P79J77n39m03M02O11k82q36oN18O01m52p22M46O25j4
$$ y = [1247, 769, -469, -918, 405, 1537, 24, -1325, -529, 1176, 800, -589, -673, 186, 889, 196, -916, -625, 703, 569, -580, -745, -123, 815, 421, -871, -866, 234, 696, -195, -767, -77, 528, 79, -475, -528, 364, 442, 61, -313, -182, 282, 489, -345, -390, 129, 362, 382, 20, -78, 281, 432, 212, -621, -113, 354, 251, -146, -17, 5, -170, -41, -393, -99, -88, -86, 97, -22, -184, -386, 287, -146, -226, -354, -238, -75, -109, 9, 333, -139, 201, 49, -71, -122, -58, 526, 292, -350, -152, 294, 407, 214, -213, 259, 459, 256, 269, 56, 501, 76, -174, 22, -390, -240, 344, 5, -209, -85, -55, -39, -647, -547, -67, -38, -218, -344, -454, -69, 161, 185, -55, -402, 36, 327, -148, -566, 210, 223, 513, -335, -450, 327, 379, 247, -264, 93, 112, 359, -3, -394, -90, 566, 522, -438, -685, 104, 732, 184, -802, -562, 217, 394, -145, -548, -146, 465, 183, -653, -659, -141, 460, 8, -714, -268, 357, 343]
3272C43o76n05Q14P19j71j189J99R56O44p27j268N80J000k65n91m47R86P31j170
3291c7m25NQ54M61j138n94O34R72J03j332m11J150O01j325n17J43J553l2j197
3310e32o22Q91R88k70j407L8J482L70q78j207N63J545j92j427k29J033J023p49
3328D20r47K2J287K29r03j056P03J366l4j437o14J114R26r09j349P20J359L2j431
3347e02m44N85J249n65j275k08J386J041j299r71L60J293J4j507l74J223J264
3364A270r42j330L27J431J96j092n88N75J372p82q03k04J124M82r82q29L35J232
3382G92J62j257o17J075Q61p44j087J5J080O04p90j199Q00P11j00q69m16R83M88
3401D92n92o60J97R98Q6n37r02O91Q21p8q87MQ26J41j03j129M86Q68j41p53M4
$$ y = [343, -333, -838, -24, 695, 524, -665, -466, 490, 1134, 407, -861, -281, 719, 454, -137, -584, 402, 1133, -37, -462, -457, 397, 858, -280, -874, -240, 732, 835, -497, -908, 242, 843, -482, -999, -856, 697, 665, -532, -1154, -263, 725, 455, -952, -914, 568, 938, 60, -1147, -584, 961, 769, -658, -887, 146, 1169, 420, -527, -505, 782, 1011, 108, -948, -245, 1121, 1087, -350, -964, 150, 1076, 167, -1182, -462, 897, 929, -502, -946, -361, 888, 323, -952, -1160, 226, 1267, -32, -1003, -643, 650, 664, -843, -1217, 6, 1270, 328, -1002, -675, 756, 952, -140, -728, -153, 1219, 437, -366, -570, 554, 1036, 54, -775, -440, 792, 954, -303, -920, 155, 1016, 272, -815, -800, 280, 884, 94, -1105, -305, 406, 306, -563, -979, 4, 492, -100, -760, -563, 435, 521, -16, -918, -227, 594, 516, -371, -367, 459, 600, 497, -632, -146, 722, 581, -172, -128]
3422a28P1M64J69m99o05O15O40m05r52L05Q03J08p43k71K42M32j57o81m2P14L84
3443D64k81p52K31O14K20p83k80L97O73m99l41j48R29k43n31J46K58QJ35k83j92
3464b58M27L41j78p56K84L13M53p06j62M10N5j20m59K47qJ68m19K52R6j72l0j05
3486c27qK39Q9n48L22j7L66m43O0L7L44M5o26M85Q2K0j62K99l14L80k23N7N5J33
3510C45J30o51K53j2L83l97j44M04k5n8k83n04P68J31k20n30K05M61J85r50n4
3531e63R05o0m45n67N96M12J22n98m71L94P46l58n48k4P22N39p73o02M36O78K6
3552E67r30o9N02N46k86o44r6O77L47n37p85K32Q43K87j072k24O49O07p11l47
3572d44p9Q23K04r00j96P04K42O4q71j48P05P32m50j165K43J299j23j206j39N07
$$ y = [-128, -57, 407, 576, 77, -528, 87, 727, 322, -630, -325, 478, 586, -157, -428, -186, 246, 89, -592, -634, 80, 464, 183, -569, -338, 276, 496, -287, -567, -170, 503, 4, -337, -485, 444, 201, -330, -184, 74, 82, 217, -66, -258, 169, 510, 332, -424, -140, 173, 626, -80, -242, 168, 223, 103, -356, -109, -117, 51, -368, -116, -20, -192, -222, -327, -335, -96, -7, -555, -233, -250, 116, -327, -267, -230, 114, 159, -467, 18, 100, 120, -42, 257, -57, 323, 100, 157, 212, 345, 475, -176, 77, 65, 448, 51, -93, 311, 286, 228, -55, -559, 209, 340, 120, -410, -205, 256, 441, -509, -563, 342, 282, -163, -730, -134, 278, 400, -198, -669, -275, 471, 113, -435, -459, 263, 802, 29, -573, -137, 541, 567, -363, -432, 70, 616, 330, -314, -410, 267, 614, 77, -708, -476, 367, 654, -418, -642, 7, 614, -97, -444, -523, 300, 504, -396, -592, 112, 354, 418, -453, -601, 104, 836, 386, -779, -536, 763, 640, -566, -705, -198]
3592a98J087l83r18j66R70M67r32m77L09R51M4r98n88R26P44m79j035q1J199K79
3612G21r75o71Q60R97m50j183J0J029P02j145p93N57J318l51j020n27P62P50j85
3631D06j090N9J160M10j047q73O02J125k44j166P3P69N62m73j086K90J331j94
3649F14p84o91P79R32m91r06j22J088K06o83o91L96Q19L74j214k19O53O10j16
3668E54j055j74P00P04n62q40M04O71J65r38k54R47J65k35p53j6Q90N2n05n75
3688f55M99Q94J4r63o04O99P13r6j222K62J048K95j064n14N26O07K13j047k80
3707f75O02O17l50r60K70J006K44r75o50P81O99k35r18j57R06N83j009k90M91
3726b0N23j20p07j55N88M95n87o05o2R41L34q87n06O48P41k91p21p7Q70J62q05
$$ y = [-198, 889, 506, -412, -578, 392, 859, -73, -550, -241, 710, 754, -244, -832, 94, 838, 359, -676, -757, 442, 721, -254, -925, -65, 932, 482, -701, -691, 338, 1040, -105, -898, -341, 977, 626, -394, -921, -159, 591, 406, -684, -625, 535, 945, -102, -975, -373, 752, 508, -658, -585, 184, 746, 273, -813, -523, 808, 614, -170, -861, -82, 850, 359, -547, -669, 419, 625, -58, -749, -353, 466, 840, -374, -593, 60, 670, 554, -501, -675, 25, 729, 167, -673, -269, 402, 567, -371, -625, 322, 487, 252, -501, -517, 373, 425, -80, -655, -156, 738, 752, -211, -815, -116, 597, 501, -721, -459, 589, 884, -180, -694, -168, 439, 652, -395, -675, -73, 544, 194, -766, -496, 510, 754, -221, -871, -90, 609, 374, -544, -701, 205, 788, -221, -511, -20, 503, 383, -324, -479, 109, 604, 17, -588, -650, 291, 625, -262, -768, -120, 621, 330, -391, -468, 402, 564, -241]
3747b41m9J50N75j58l75m22P37K33m14k38J03M52p9m85M1J40M74l96m28K05L18
3768A43r0k28J17oM35l95m90L39L1r9K4R8K8L1J74r1k45m0L58l70O3M54j52j37
3792d8j10K28J23k41M5J35L30k23n30N05j08p1j46J40k11M39j33k48Q6K10O9j87
3814E4o74L93L49L5l43n7L26K31k56p43L48M61P7k91j20K81K59m58j17j76P44
3835C23K34k34p64K87L88M53o34m31M98M43j10n94j95M75M65l77n19J7O01J59
3855D85p15n15Q27L47j18q53j06J145k38l71n91M04L68M3o18K9N17L46k99o19
3875e32L18L27M44l75q75L10J260k61p74l97P91M17n13q60N52P30q7p95k26P73
3895B27L10m6r61o8P81O3j65q05L93P64J01q34p11R21M87l30p49P4N87P07j005
$$ y = [-241, -290, -140, 435, 277, -98, -520, 217, 450, 36, -202, -99, 353, 274, -211, -170, -30, 444, 48, -380, -175, 143, 53, -175, -58, -64, 371, -24, -514, -175, -144, -243, -219, -121, -93, -62, 112, 21, -224, -264, 94, -276, -213, 241, 89, -48, -158, 70, 193, -48, -3, 132, 462, 239, -291, 214, 106, 35, -111, 29, -182, 257, 124, -124, -38, 172, 241, 54, -620, -227, 122, 157, -186, -243, 83, 314, 58, -685, -337, 124, 201, -90, -210, 71, 330, -128, -245, -421, 323, 557, 323, -441, -154, 234, 687, 53, -378, 120, 563, 453, -141, -336, 139, 604, 227, -292, -275, 326, 485, -230, -745, 82, 429, 311, -542, -648, 497, 259, -112, -703, -299, 69, 112, -506, -477, 40, 386, 87, -532, -214, 113, 557, 182, -693, -383, 877, 616, -158, -555, 236, 653, 140, -720, -168, 562, 475, -320, -546, 227, 537, 491, -470, -538, 243, 306, 141, -664, -271, 493, 594, -240, -951, -30, 457, 127, -622, -548, 39, 746, -259]
3916b59o03M21O15K60n80p20Q80R21p88r08O20O78ln99n22M66P77J19j178PO82
3937B86K66m78n53P0J005J80q95o86P82R04r43o28n7P29P29j080m48M24Q69m52
3957B4n34k4K75J011n19r79K17P84L21m50p37J81J096L7j251o9R72L55m05r20
3977f15K69R00M08j272p5Q53M31k60r41j05Q42L03p78o29O23M05R5o86n52Q94
3997A10N71n92j054L90O71L06n34p34L25R71k23p22L63M19J69m30p76L04R74j32
4017C76q50M8O88L6M5n61k25R06j47l67q4J74J39J43l04l91M49M55o33k17J83
4038a37L1K01J66q26L76M48m76J64l0k75K93L98p53J90K33j50q8R8p%M13l06j94
4061b31N51J67o09L65k83J5L13j27j70N4J98j59J43l96K67L8K11n00K11M12o67
$$ y = [-259, -862, -441, 174, 434, -146, -866, 14, 935, 147, -761, -141, 537, 534, -65, -587, -121, 656, 775, -403, -396, 286, 552, 74, -479, -409, 596, 776, -119, -805, -23, 881, -62, -690, -747, -18, 711, -369, -817, -393, 476, 24, -510, -534, -259, 752, 233, -746, -529, 255, 576, 126, -611, -430, 666, 703, -548, -617, 355, 710, 305, -615, -346, 554, 962, -310, -385, 468, 899, 639, -302, -407, 435, 738, -40, -669, -46, 359, 454, -232, -784, 110, 681, 89, -965, -575, 96, 402, -132, -866, -541, 430, 207, -515, -152, 267, 436, 6, -770, -466, 508, 376, -474, -426, 262, 298, 343, -218, -443, 463, 316, -51, -135, 39, 178, 321, 17, -374, 75, 530, -103, -320, -137, -106, 95, 261, -565, -189, 259, -217, -53, -83, -358, -65, 333, -420, -230, 3, -147, -235, -137, -144, -144, 269, -37, -231, 320, 487, -122, 243, -40, -25, 288, 161, -9, 45, 243, 84, 227, -169, 98, 136, 347, -153, 58, 470, -197]
4082a97P2R6k79J23M95l93j51J16j03K33O1m89K27N41o89M6M14k51k61P00l99
4103h8N7L17j94l42O97m20l81Q60l27m75N72j70k21O08m36j07L46l3m20p6J09
4124a24l0O32n02l27N37L01p27l26M73j00L89Q1q98L88O19n78k40K66p1M90K2
4145B75q05J14R41j00n85r3N6O54P2j051o4J171k70p20J19K00M01K74q57m38R49
4166B43M16p40l48J64N46L59o18r26J165J71o41l57K59K81L45q4q77L79P72m11
4186I8l65j55qJ012P1j270j0J068K5n81L1j80M26N02j148j89J189J20n04l18o9
4207b55L12O63r25n98P08P90n93o22j28M18J031n62r76M97Q52k05p77k78J36J183
4227F71l50j397M40J066J83l58o42j72R85L47j167n09J527j36m04o31j19J017
$$ y = [-197, -125, -29, -308, -185, 310, -83, -234, -118, -221, 12, 73, -416, -189, 352, -337, -291, 123, -128, -389, 311, -88, -31, 286, 92, -250, 447, 27, -354, 506, 179, -296, 276, 106, -115, 493, 57, -50, 296, 263, -157, -233, -124, -154, 478, -24, -351, 186, 487, -240, -566, -93, -193, 196, 277, -621, -233, 386, -192, -432, -166, -237, 253, 275, -530, -416, 525, 425, -160, -253, -197, 457, 529, -522, -586, 585, 315, -405, -286, -86, 315, 589, -268, -706, 243, 659, -81, -429, -265, 281, 640, 22, -904, 261, 432, -209, -566, -307, -26, 319, 235, -642, -263, 509, 98, -267, -422, -430, 582, 653, -617, -627, 441, 466, -115, -84, -264, 162, 664, -484, -673, 516, 636, 132, -186, -255, 57, 720, -205, -803, -95, 695, 102, -520, -648, -230, 801, 239, -737, -240, 612, 407, -370, -648, -512, 671, 321, -1076, -636, 430, 613, 255, -387, -559, 426, 773, -394, -903, 624, 488, 84, -547, -666, 351]
4245C51N57r40q05R84M61l16m56m44Q20N90n88j034Q56O78l96l52n83L70R64m28
4265B89r84L36O06M43r02k77L4Q84J80j013j25O80L14k29k63m59J115J91j135
4284c15m72J098L34n08l94M6N7M45l10l18M64n0J98j70l76N3Q25m02q55P35j21
4305c6R6j40l09M8N04O3o18M17j11J98K35l94m49N80M18n59l12K88L18p0j07o01
4327e41M20M45l49n43M30J92K83q3p21L77N56n59j26K8J23L52j18l14l95Q24p
4348B74o47J53L48n6K14k60m44O95L7m63L36j08j46M59l76m23M26N21n13n21J44
4369c50L68N3O9o10O18M97p43l13L62K3J90n5l89M19j51J88j35m7K0j29K9j38
4391b24M8L71k97N8K7J16k60L57l2j63lj69n3O43j66n50K91q0r5M45k32mL8M35
$$ y = [351, 908, -32, -837, 147, 608, 292, -164, -608, 212, 802, 214, -820, 36, 714, 318, -34, -617, -247, 717, 289, -695, -359, 247, 690, -212, -489, -455, 429, 609, -404, -529, 151, 465, 236, -27, -486, 629, 820, -315, -787, 311, 645, 137, -257, -211, -154, 291, -19, -337, 127, 77, 275, 105, -271, -218, 607, 205, -650, 85, -36, 60, -80, -389, -341, 163, 226, -392, 25, -86, 112, 347, -47, -496, 84, 502, -57, -369, -81, 237, 167, 60, -541, -121, 324, -25, -568, -138, 54, 337, 254, -467, -90, 466, -93, -219, -191, -68, 284, 166, -148, -543, 281, 274, -373, -220, 128, 72, 286, 26, -418, 277, 314, -149, 187, 79, -67, 392, 16, -407, 19, 540, 27, -494, -350, 18, 71, 140, -470, 148, 645, -98, -411, -49, -26, 164, 109, -280, 139, -12, 176, 41, -6, 14, -115, -86, -224, -176, 195, -102, -44, -17, 99, -161, 196, 164, 1, -2, -171, -224, 419, 253, -297, -6, -86, -181, 264, 32, 28, 66, 501]
4415E01o42j96N9M68k19j32k57L63M60n45l78L78L90o6j08m13K64L64j1n26J81
4436f5j53N20k04l94M9P53o18n8M4L38K66j05q21J76O04K22o74j75N90n6J17o65
4458c09j48Q53J7n73l95L56M39O2n40n17Q52L50j86p39J07N44K64m65n27M21N78
4479D44k54l73k23M70M21k95q55M28Q48o8n62k60K33L64j56n76J26O48K07k04
4499C63q30K73N24P9n13m95N75O94m87o67K97K03M47n65p98O62O42k32o11j96
4519f35O51L17l22o38L51Q92k05m35l88K26O99k95n19j45O99K71l71n23K48K88
4539A66p1k94l30O38N37l69o50M9N51n2j12o45M84O50l02n74L0L90M11m54l96
4560c43j6L78M02l35q23N25L56K8o24J1O50L97n57m98J16O27j15l68j20K15M63
$$ y = [501, -141, -337, -278, 190, -29, -161, -418, -55, 405, -140, -518, -140, 250, 184, 76, -337, -73, 291, 280, -246, -65, -218, 302, 98, -296, -247, 506, -112, -170, -126, 212, 478, 373, -448, -272, 332, 554, -120, -295, 295, 239, 356, -309, -457, 396, 413, -160, -555, -199, 240, 302, -238, -755, 97, 447, 261, -478, -371, 173, 437, -28, -555, -134, 444, 190, -183, -406, 64, 485, 190, -665, -237, 611, 543, -19, -279, -46, 318, 162, -414, -288, 360, 567, 363, -467, -194, 330, 409, -104, -599, -24, 670, 183, -484, -187, 16, 463, -102, -900, -238, 404, 172, -439, -635, 16, 333, 11, -627, -276, 616, 411, -24, -412, -186, 513, 218, -301, -446, 253, 524, 153, -370, -122, 166, 95, -199, -529, 109, 646, 277, -373, -324, 227, 175, 63, -582, -98, 552, 250, -324, -294, 96, 507, 53, -343, -359, 19, 421, 86, -737, -212, 144, 172, -452, -441, 209, 606, 49, -449, -333, 294, 179, -189, -309, -94, 369]
4581C69k57l70KM19K95l95m63l6Q83l65J4l74K53P84n97o08O3P39N7m43o11M68
4603a73N10k01o48J6K97P30o66r3K08J31J50m94m28N50L93%n66J42L81J17m70
4624a14k52L29K93N3j35j43M5M07k50m34J33L34K71p43j76M12K99m4m69j15M81
4645A82j20l41N1J80K33l90j44J05L2K13r9k49N05j33J64k36N8O2N3l8k55L1K37
4668A01n1J4N0J38k22K3M43k82r9Q2j37%m5L9K85l66M8j00q2n2K16J42l33n9K31
4693a6J25k00j11o5J56J41k38j2o7K23j52K11j08J98L5M7k39k02L38J86Lk95J03
4716F1L78n2m12k51J73L02J65k98J0J32J99l58k32L15q1N4j82q9J31J34J11m85
4738b75k4M46O7k52m88K26K24J31l86r7M20K93q6n07J64M46J11n98j8J98K46%
$$ y = [369, 112, -258, -256, 163, 458, 63, -400, -436, 447, 82, 96, -278, -25, 759, 162, -446, -383, 356, 413, -30, -641, -173, 337, 136, -512, -496, -199, 531, -135, -228, -20, 111, 261, -233, -661, -111, 282, 282, -284, -142, 239, 356, -114, -366, -37, 256, 309, 174, 31, 76, 483, 233, -201, -68, 266, 537, -206, -382, 30, 329, 285, -184, -299, 182, 62, -279, -228, -48, 185, -205, -349, -244, -212, 1, -98, -347, 158, 25, 189, -47, 11, 73, 126, 88, -167, -136, 101, 50, 64, 114, 252, 30, 53, 496, 214, 115, 197, 60, 60, 15, 54, 339, -27, 21, -79, -161, -213, 3, 145, -188, -247, -16, 109, -91, -202, -267, -111, 30, -208, -220, -287, -64, -216, -5, -113, 85, 120, 167, -72, -274, 64, 250, 253, -42, 61, 439, 387, -25, -276, -103, 199, 364, 66, 76, 208, 407, 49, -183, 132, 51, 105, -77, -166, -35, 99, 210, -275, -299, 147, 214, -38, -526, -300, -76, 55, -331, -428, -8, 285, 199, -308, -144, 302, 413, -185, -203, -5, 241, 241]
4760B41m42N8N20K45n18j92j4N66j99m25J04j47N51r4n52j67O03L4k21o47M28
4781b68Q07l48o20lL50N06l60n16j03R69J5l80n31N34L82k50o51J31M39M85m59
4802A29n76K75N01L7n13k46J34P63l23m41N6N06L40o22k46k57Q70R4p46k97M63
4823i9N69k74o42P7N26K05n30m20L77M31M9n94l42O34N81k58o58J4M70M74o48
4844e8l27R2P71m28k20oN49L10o37m72J00Q02k42l35m36M01Q63j72j007J97M49
4865A94L28m46q69N16Q90m05o10K5N88L16l68m72LM07J9l54k85N48L53j1q06j05
4887e44O88J47l42m60M44K93j8k93j91L38L34j26n23N9L45K48m23k47J81N32j69
4908B73l35p1N06n9n42m3L22J79n7j09l75L37O5Rl6k06Q4J96j71l3j22L94O9l71
$$ y = [241, -201, -143, 377, 622, 104, -88, -102, 464, 265, -160, -56, -203, 348, 254, -298, -465, 138, 172, -49, -696, -268, 539, 191, -429, -432, -82, 424, 64, -452, -555, 414, 429, 49, -482, 52, 434, 184, -467, -336, 103, 588, 129, -447, -172, 329, 366, -147, -393, -259, 504, 181, -260, -204, 302, 642, 20, -226, -483, 387, 481, -265, -562, -99, 470, 196, -446, -369, 157, 362, -168, -588, -211, 220, 269, -325, -667, -33, 548, 290, -368, -354, 116, 590, -58, -385, -293, 478, 50, -170, -176, 373, 683, 46, -426, -326, 476, 234, -101, -537, -136, 727, 555, -452, -255, 194, 522, 76, -793, -277, 613, 208, -402, -377, 211, 527, 159, -313, -310, 97, 116, -238, -523, 25, 378, 367, -439, -544, 144, 291, -51, -511, -67, 226, 208, -85, -276, 62, 396, 270, -253, -194, 151, 399, -24, -271, -90, 442, 273, -62, -133, 373, 314, -228, -271, 51, 230, 173, 64, -311, 26, 91, 100, 64, -142, -58, 138, -33, -66, -188, 206, 275, -96]
4932i6j28M70k05m5l12J42J8J37p9L0J63RL3n1R8k60J2K23k82P3K52MJ56n31J6
4957a53k3J83l95J99j02K27K92j0k02j82L99k62j22p8R7K40k33J69k44J14j4o1
4979a61O2r2J00m3J38k4J20QJ05m67L51l01K17o9KQ5%l1L7N1N8k17nP2L7J43p2
5006A04q8J52k46p8K58J54n00K51q9k1M06l01j26K86q1j48k5J68O4J91m92j2L27
5029A54Q9l5m31J69l3M39m03j39K00M1K07m76k06L75K27j64k83k6N43J88m65m96
5051e25P18J95k10j89k98N93j95l0n29N11l3J91k33m14O09M01l07o18J13L88K97
5072D35q57q2L76P91o18l67j14N20M82p09l15j38R47j8m54n79N06N66l53o59K02
5093d38N04N10l91n17Q3O85P1o45j97L84N09l09l55m23Q76P9o09m41N10N15j89
$$ y = [-96, -224, 246, 41, -4, -316, -174, -156, -19, -98, -68, 95, 104, 137, 86, 184, -76, -64, 159, -123, -50, 202, 206, 362, -169, -153, -176, 7, -388, -189, -291, -64, 228, 218, 16, -166, 233, -29, -151, -229, -132, 108, -125, 44, -200, -86, -100, -161, -99, -191, -91, -134, 4, -20, 100, 108, 213, -254, 97, -204, 13, -56, -54, 31, 31, 0, 37, 88, 146, -71, -76, -4, 33, 176, 104, 16, 168, -78, -156, 102, 256, -244, 7, -82, -103, 303, 2, -124, 162, 81, -67, -92, 76, 140, 331, -161, -173, 154, 243, 208, -223, -54, -87, 352, -51, -190, 10, 51, 258, -218, -424, -49, 178, 14, -269, -295, 248, 436, -29, -525, 193, 388, 178, -11, -309, 284, 89, 59, -470, 41, 8, 199, -34, -448, 161, 562, 255, -363, -250, 138, 435, -422, -504, -128, 663, 45, -322, -436, 84, 566, -143, -458, -596, 351, 333, -121, -700, -194, 372, 19, -640, -438, 66, 576, 185, -332, -249, 436, 507, -138, -335, 49, 558, 249, -106, -529, 347, 426, -183, -624, -114, 401, 212]
5114B12o23j79O82L58l76o33M10P33m59m66k51K17Q40k34o25k44R08M76p06o42
5134f02L20P12J15o97l51P28K74k13p40k6P66P1k42m92K48P13l44l47n6J19L88
5155C44l92n25K33N05J48l22m66L41K18M0n97J69L35J29k55k85J56K07M47p59
5175c29K51J87J94q9l76n1N91k09j70k57J94M18J8n28k11N03K14j05m53J02L14
5196B08j74J54n19P3M71%j41n29M71N18o90l21K32J90M39l03l17N3M44n5l60k81
5218d37O10n5k67j16K89K64ol74j52J53N04n45L02k1j94K70k61m1n4L49j77k12
5240a71l2L10Nj94l3j7K75Q8m03nJ06K74l56R8k70L18K31m03k8O3K22k30O5k14
5264c01J56K80j19k33K98P8n1j46J82K08k70N9m5L7j09K4p5R5j50L74l56L34k03
$$ y = [212, -411, -590, 92, 450, 74, -559, -149, 584, 125, -341, -592, -375, 465, 231, -394, -638, 270, 746, 40, -602, -282, 430, 545, -152, -503, 225, 499, 286, -454, -480, 286, 357, 115, -377, -129, 584, 240, -107, -163, -44, 344, -48, -573, -340, 165, 313, -9, -475, -134, 84, 124, -473, -304, 31, 160, -95, -380, -224, -17, 430, -329, -78, 109, 303, 214, -162, -213, 378, 169, -1, -258, -64, 354, 372, -156, -367, 136, 350, 245, -208, -106, 208, 34, 188, -331, -258, 213, 213, 72, -457, 14, 532, -158, -479, -247, -57, 382, 79, -238, -185, 259, 204, -156, -437, 173, 118, -149, -265, 24, 288, 282, -92, -244, -91, 413, -132, 170, 149, -45, 225, -36, -77, -131, 218, 41, -171, -203, 107, 112, -82, -115, -132, 143, 231, -172, -177, -71, 203, -153, -55, -325, -7, 224, -179, -207, -144, 78, -152, -87, -301, -145, 135, 16, -217, 81, 159, 108, -38, 144, 352, 82, 141, 96, 133, 24, 48, -27, 68, -82, 292, -64, 270, 67]
5287F7j66l8K48J04m33L18l79J77M10j97j65j73J16P8N8m74M73J76k59Nnp3J25
5310gM3j32L4l3M59k19j95P3K30j75k5k41L79J5k32l5o3K92L22n60k25m3M95q0
5334G7j66o7M24m27j38k95K20N42J22m82K1M75r0j37k52J49j25M25j58n68N10
5355F0o5J66l41jJ90K54o2m20N4M88J44l78n65N36M91m20l60K56R4Q1l2p69K86
5378c13N72J25o27j52K08M16M0m88j75O04n3m15j78L64K92N6l91n1R9N11l68o56
5400e80M73M67k8k51o89K88P43o0o43L23L99k53l8o90K84N80J30o14J3O4L99M2
5422C59m84k00K86L72n64j22J63M62K20n76n34R65J34n60k79j38O25J29l17l58
5442d17J81O21o26n9j57N92L83m03o40R1Q45k25l04q8L28J10L06p49l8L06L83
$$ y = [67, -99, -137, 111, 215, -218, 100, -279, -102, 308, 111, -54, -227, -111, -33, 25, -449, 24, 200, -59, -54, -59, -132, -7, 36, -96, -62, -95, 364, 145, -50, 23, 253, 78, 53, -188, 191, 206, -26, -61, -124, 168, 490, -70, -295, -338, 157, 77, -89, -156, 268, -159, -297, -592, -372, 170, 292, -190, -169, 306, 216, 79, -173, -24, -149, 276, 118, -450, 60, -5, 161, -180, -181, 9, 263, 201, -219, -165, 323, 467, 89, -476, 60, 551, 131, -229, 27, 121, 202, 170, -599, -313, 259, 384, -243, -395, -187, 229, 269, -219, -394, 210, 157, -258, -436, -72, 220, 276, -115, -166, -67, 444, 76, -580, -107, 360, 332, 81, -608, -320, 423, 363, -280, 43, 442, 189, 151, -539, -255, 325, 455, -159, -146, -82, 317, 359, -125, -325, -39, 333, -231, -353, -190, 272, 492, -84, -618, 347, 481, -79, -358, -496, 129, 258, -59, -417, -236, 385, -241, -300, -457, 135, 518, 115, -525, -434, 411, 186, -118, -206, 122, 232, 538, -211, -249, 57, 440]
5463D40l88k74k85P82K62l76m74O56k16j52k95J53k3O18o89l63M37N16j40q9n03
5484d03J0P92j51m40p1M51l8k92j49K47M20j41m20n3N88j67m57pJ71L12L98m77
5506A23n40O88j76n1Ll78M79K90m91j86L16J70k31j91j81L31J97o0l28J98L49
5527C31j53l63k8j15M20R4o13R2N18r2m43M67j24Q2q7k38J91L05k49J05K53l29
5549B4M9O9J40k45j4K5l01L77k53j22M28l49J48J40j24j79J61qn6%nj06J40j5
5573g6j80N84j51m87L87l0k87K17J06j73K91M8k11m62M12J39r6L31n81J37K55
5594A73k85J40j09k89M42l6l12N1M12j21j88K19o1l8L37o09J31K96q9k14J30j50
5616a70J07K91j67l50K29K74m78K60l33K6N31j7n31J39K81kmr3l4j7M17n49J57
$$ y = [440, 52, -222, -507, 275, 537, 161, -313, 343, 127, -25, -320, -167, -190, 428, -261, -624, -187, 329, 189, 100, -403, -393, 399, 248, -192, -263, 188, 150, -142, -291, -44, 376, 235, -185, -238, 350, 183, -274, -281, -110, 202, 600, 123, -417, 271, 95, 44, 47, -331, 148, 438, -53, -239, 77, 247, 16, -175, -356, -25, 172, 112, -216, -18, 331, 178, -185, -213, -328, 92, 186, -427, -335, 183, 91, -352, 115, -9, 73, -14, -252, -61, 244, -5, 100, 353, 24, 73, 142, 282, 37, 23, 48, -253, 124, -129, -251, 177, -172, -24, 116, -8, -187, -26, -34, -90, -90, -95, -201, -61, -76, -256, 328, 177, -310, 77, 47, -240, -23, 83, -90, 201, 249, 38, -424, -12, 127, 31, 362, -219, -82, 173, -112, 28, -81, -370, 72, 36, -276, -225, 187, 66, -122, 97, 36, -2, 335, -274, -143, 153, 64, -150, -20, -170, -63, 228, 61, -289, -60, 214, -264, -4, -337, -311, 220, 203, -328, -189, 92, 90, 86, -7, -41, -58, 359, -190, -33]
5639c3J36kn3r2j50k3M44j15l24L46J22l48J47n18M72M03l50m81L85O7M5p8m11
5662d11M24K89K57p41j54K39K44j53J4n15Q60O4p79N0N81K1j67k04R0J4K36l21
5684f2o20N32M10j69J25n74M13L16m18l63K95J35R4k4l51q0P68l3p17m8L78M46
5706D53l21o89K94N09J58k68l47L39J32n5p41K39O67L8o00l0J28J72O9j58n27
5727e38M01M99j02n18L96K8R1o6o78K39N07J56q88J48O06J30k74l27n7O26j73
5748B06j27n82M45M81m03j99j38N06m8k56j74J41M68J15o38k31M10K38l31j5l26
5769d58L62N57m48n80N49K23r9m43O8L91J0J26n83P1M78M1o30J33L30K76k3p63
5791d12J04M34K9O4k30l28P04kn28n0O32l01r8k23m8L54L01k36l36J30J53N4k84
$$ y = [-33, 103, 101, 48, -44, -194, -217, 227, 112, -212, 134, 256, -92, 55, -463, 9, 412, 62, -419, -34, 33, 78, 0, -411, 13, 302, 559, -182, -336, -97, 147, -6, 8, -507, 353, 417, -362, -312, 269, 290, 123, -81, 9, 23, 259, -62, -682, -150, 260, 91, 216, -358, 55, 371, -47, -410, -115, 20, 114, 90, -261, -341, 427, 394, -323, -371, 7, 453, 132, -557, -263, 246, 404, 136, -211, 128, 260, 205, -536, -297, 370, 408, -192, -222, -94, 78, 147, -11, -538, -137, 362, 260, -258, 138, 166, 257, 191, -487, -248, 259, 415, -473, -325, 281, 411, 137, -190, -247, 379, 206, 79, -503, -58, 423, 20, -179, -317, 189, 141, -115, -289, -148, 320, 435, -203, -434, -24, 214, -117, -132, -458, -96, 461, 13, -567, -18, 205, 106, -337, -269, 122, 132, 258, -325, -254, 224, 265, -365, -232, 98, 374, 351, -412, -308, 126, 155, 219, -11, -339, 365, 363, -165, -215, 417, 116, 18, -205, -253, 101, 402, 166, -170, -40, 113, 167, -117]
5814a17j76K32J31j15r3M9J76N2j65M2n9R6K27n49K1N20m7l88J38J04qll38k29
5838d99N88J21j5p3m0Nj05K17m33J37K70j43j70J05P4L4j20l3P8kK7M8m2k9J80
5863A80j63k6L4j16J69N5l27L34j66k3p4j83L51k81J82O9K88k7l22m2J98k08J55
5886E7R0R4q6k77L6n7K1J69j64j26M31j93J60m11J61J91K8m14j95N46P8j76j77
5909b14K41p1M3lk13P4L87j68q3n0j97L47N7l91J54J62J67k10m84L39L34L0n04
5932b53K8K35J62k97Q5j47N62M3m77m32M59K78j79k04L0R3P5j57k76L24J96n6
5954I2k92k02N16L3j86q8q0L29J92ro30L41K32J4k98j23M27k4%o08J15O16l00
5977F7J95m77L45M21n3o34j45J63N02l68m96L53L68J46n50r1K46K44k01l32J48
$$ y = [-117, -293, -61, 70, -45, -138, -89, 87, 139, -26, 16, -43, 53, 280, -269, -248, 272, 225, -163, -25, 79, 71, 68, -270, -499, 89, 210, 195, 122, 82, 87, -18, 199, -234, -97, 173, 30, -140, -35, 39, 73, -47, -80, -2, -4, 23, 71, 29, 0, 180, 17, -9, 25, -91, 78, 133, -194, 140, -26, -49, -123, -306, 45, -236, -54, 15, 303, 276, -46, -88, 110, -98, 57, 147, 241, 155, -122, -86, -143, -122, 47, -117, -243, 188, -5, 155, -256, -95, 96, 124, -290, -485, 61, 139, -37, -214, 27, -44, -1, -4, -217, -143, 244, 76, -7, -57, -254, 93, 150, -241, -87, 75, 242, 32, -452, -113, 221, 251, -253, -225, 10, 172, -125, -40, -187, 375, 418, -59, -491, -32, 246, 67, -137, -107, -14, 61, -96, -372, -48, 148, 92, -200, -402, 114, 147, -39, -127, -207, 122, 314, 305, -325, 16, 248, 262, -36, -159, 268, 244, 244, -364, -249, 367, 67, 262, -215, 130, 551, 498, -136, -281, -118, 384, 16, -480, -127, 241, 387, -163, -254, -8, 236, 35, -297, -149]
5998a49J72J58k94j76l22O05J39j77l1j28L45j34k59K73K14K29n51j60J20N66
6018D40j33l47k93M96J98l85j75q2L83J27Q6o20M32K06p6l32k13L70L59k74m31
6039b64K24J08j06o4k25K65M33j10n21K56J86J4j78j33o8K60J39m64P7J08K48
6060A85j77j5j80L25qo2j65j15O05j10l32O2j59K74k06J97l68P00j89k10o45L05
6082b88N11K3m42RJ20J50J15m41j08M85k71J45k45N5M24j53k02l54Q23k04j27
6103B5l02K24K45n8q7j33J42Q7J05m66j6M63L49l90l88J12K26M6l32k2L16M0k44
6126e8j44J86Q9p8M0j72L04j38O0j67k31L67K74n07p8M56j36K3k94K18o6J41k22
6149a33n3J86K5O4%j08J15J39k44j42R9M8n6Q3O6N3m7j27M4j25MJ71Q0Jl3j08
$$ y = [-149, 23, 181, -113, -289, -611, -6, 133, -44, -75, -203, 142, 8, -251, 22, 236, 465, -86, -246, -126, 440, 307, -40, -333, 163, 361, -24, -199, -281, 102, 229, 315, -305, 127, 333, 257, -75, -288, 82, 441, 167, -264, -40, 68, -38, -102, -327, -62, 371, 261, -260, -4, 182, 196, 18, -115, -183, 77, 216, -248, -171, -63, 185, 8, -7, -187, 138, 130, 68, -97, -212, 393, 283, -49, 13, -146, 128, -78, 119, -249, 451, 262, 52, -593, -288, 223, 246, -196, -187, -67, 83, 198, -243, -351, 134, -137, 8, -237, -182, 242, 89, -113, -467, 356, 152, 25, -277, -53, 192, 134, 47, -86, 56, 143, 248, -218, -234, 229, 578, 188, -200, -88, 138, 184, -148, -170, 146, 186, -58, -202, -16, 73, -5, 35, -137, 167, 29, 89, -78, -309, 58, 332, -175, -253, 203, 67, 90, -204, 14, -52, 89, -133, -186, 0, 25, 89, 89, -19, 96, 235, -9, -151, -52, -4, -60, 23, 89, 142, 95, -32, 12, -113, -109, 62, 142, 143, 110, 2]
6175BL4j30qj48P9J37p8J19j4o4p8K69k40J58j13M7J68j46n0k15K53J85j44j02
6199g9M44j54m04j22K49Q0r9K26k22j79K02K44k08j21K69L45l32m73L53R9m6l45
6221b73R5K08K05p6l97M6K38N8j07k4q7oL93j65l76L48K5M4o1j23L50k52j98l0
6245a65oJ13K06K25n54J65L09%m42J3J55M0j23j99K04K09J5l12J26J79Pp3n17
6268d25K29M90q3k69j39lM22J7l17j92M48p1ol39k8L19L83j07p84M05N0J86l46
6291a60n2J67N3j65N4R5K31J56l55k95J19N03l3n19J9K71k7L3j58K5L16j8l38
6314g8J03r1K08k49k1O7k28N93k90j61K02OJ18k15m1M37k55q1l2J71j51L82m80
6337h6n15O85J75j96p1on4L47j86j3j4P7L51o55J99l35O34j57l64%M9L17k94R3
$$ y = [2, 36, -94, -102, -250, -171, -34, -112, 7, -7, -71, -149, 120, -120, 38, -75, -28, 140, -6, -56, -271, -18, 167, 23, -79, 365, 211, -193, -315, -66, 14, -85, 141, -81, -260, -58, 186, -22, -143, 126, 471, 139, -334, 19, 118, 72, -273, -178, 30, 235, 159, -238, -192, 46, 104, -3, -27, -114, -120, 273, 108, -268, 80, 105, 149, 88, -35, 315, 63, -135, -165, -171, -58, 148, 373, -181, -16, 293, 293, -149, -136, 19, 59, -64, -263, -59, 150, 165, -147, -21, 158, 165, 92, -425, -196, 294, 211, -58, -197, -200, 222, 239, -78, -270, 178, 107, 101, -238, -266, 53, 436, 329, -455, -50, 0, 186, -160, -212, -45, 8, -157, -103, -8, 223, 379, 24, -271, -152, 351, 318, -201, -182, 89, 62, 95, -63, -38, 278, 260, -78, 25, -66, 142, -107, -128, -61, -289, 304, 14, -147, 55, 61, 179, -36, -77, 360, 105, 24, -8, 163, 12, 394, -86, -601, 84, 259, 63, -8, -14, -68, 279, 93, 80, 66, 143, 494, -161, 38, -297, 337, 180, -184, -184, -135, 182, -112, -19]
6361a9pJ08K13m75J05n8K33m6k10j06L28J00k75j67N08N1l98J98n78K76N00k30
6383E1k32j13L02J57k1m06K26n1Q1j95KJ6K36p6l50J17L30j40J3P2P7N2j6k91
6407a59J71J99M3j59j87Q1N4q8k06L1L52j96J48k07m6K85m3m24L59KJ36J32O4
6430C42k13j17L8P8j93p1K79m24L56J39Lk95J04M6j96J36L0q8P4l8Q3r6j79J82
6454b0j14Q7K6m5J26j9j91L35m45M21j20k4L6j0j06K91m97P2L39j79K09j36m4
6477hk70J85j9J54j67K82k95J06n4L4q6N8J64J8j04j64K98r6K6J6P5q6j18M9k24
6502b26J83OL33k40j47K11j22n6N6k61M32qj57j51j85N39m4p4j33M0j75J52j25
6525a52K16r2K07l2j36j78K06J23k8k19J72J43j99L3j63L22j14m8j45Q3K9K5j77
$$ y = [-19, -26, 82, 295, -180, -75, -133, 100, 54, -156, -262, 66, 166, -109, -276, 232, 283, -115, 83, -495, -219, 281, 51, -181, -294, 8, 165, 144, -262, -36, -87, -6, -201, -199, -183, 53, -23, -373, -256, 74, -66, -53, 19, 96, 148, 132, -159, 12, 211, 254, 95, -92, -11, 43, -45, -251, -220, 132, -64, 84, -123, -169, 116, 73, -351, 8, 10, 146, 278, 342, 129, 12, 50, 128, -65, -136, 143, -281, 75, 214, 217, -78, 26, 72, -124, 12, 42, -46, 28, -10, 73, -23, -202, -20, -134, -47, -21, -66, 60, 41, -150, 185, -260, 161, 41, 17, 53, 43, -63, 228, -269, -197, 142, -37, 172, 36, -8, -278, -93, -112, 42, -125, 157, -138, -32, -86, -52, -138, -80, 84, 102, -2, -166, 132, 36, 62, 78, 153, 67, -51, -2, -226, -43, -37, 296, 56, -91, 120, -2, -58, -2, -263, 169, 161, 4, -147, -332, 207, 163, 89, -44, -4, -179, -27, -152, 64, -28, 179, 147, 11, -167, 39, 162, 134, -85, 87, 230, 31, 64, -99, 223, 109, 61, -84, -1, 28, 53, -124]
6548a24L7p7K72r4l1Q5l9j28j03k6J08R9J18k21l0K92j13N7k91K00O7k38N3m1
6572a68O1J91j69k41K42L02q8r6P8k91M07r3j60J79p6j06R6j69M6L7J62q8l18
6595b62N81k81O5k42R5r0K76j80L2J1N9Q0j88j95J83Q9J89l49J02K0L74l19m20
6618c70M62R6j3j83ql9J85n6k19j05L95L5k43j98M10J81j72l27r5M70k7l73r1
6641b85J63k2K80j43Kj69K86k18j8L23l7j80m2pk82M53N0k74M9J0K86k00j48j79
6665c02M05n7J82n31L07J13j26j32J58J94r3P0m42K40J00J62m12j5K2K56r2O7
6687G4j92J46N7m7q0r9J24R2j4j49O3Q3R3k91o5M54k73k73L67j42J20K1j04k12
6711b47J84L7L51m45r3L77j74J73k96J49k1j62J41L2N6l03N56k68nq8K57j46k1
$$ y = [-124, -87, -164, 108, 14, -17, 68, 29, -99, -202, -228, -120, -21, 97, -124, -154, 138, 25, 82, -209, -9, 58, -180, -127, -168, -107, 84, -85, -326, -84, 218, 130, 34, 112, -179, 228, 135, -25, 154, 78, -28, 68, -101, -55, -18, 144, 56, -262, 319, 38, 103, -139, -44, -134, 142, -38, -6, 5, 64, 144, -44, -239, -56, 33, 222, -127, -25, -5, 369, 50, -370, 92, 188, 175, -8, -16, -55, 130, 74, -145, -250, 145, 180, -63, -261, 149, 330, 158, -169, -264, 206, 179, -194, -285, -122, -144, 136, -7, -5, -174, 112, -106, -124, 199, 162, -18, -60, -67, -349, 104, 154, -120, -71, -61, 225, 25, -123, -302, 103, 46, 228, -303, 4, 117, -9, -141, 17, 211, 118, 188, -254, -14, 86, 248, -164, -179, -157, 99, 7, 74, -118, 28, 85, 38, -42, -141, -17, 75, 61, -88, -25, 58, 151, -140, -205, 249, -24, -297, 70, -72, 48, 69, -35, -247, -63, -26, 325, -120, -213, 164, -10, 163, -133, 16, -5, -167, -26, 6, 62, -241, 315, 47, 42, -46, 211, 65, 44]
6734D4M8q1J69j99P4Pl6J64l30K8J97n3m1M40m19l61O71k59k3O8O6k5j57L0Q4
6759A06k60kK99k27L74k50q2J51k91M23l41L9k36K37J60l19K68M0J27j21j74K10
6781A31j43k13K37k97K14j47J21K46j45K8m9k2k2K11j88q1J74J12k86J22j81K85
6803A07p9M8k12L16J29l17j09K74P9k08k35J71R7n0k4r0K9k4L37k40J52p6J18
6826A93j88k17K15m4J81M1l33N0K9J92k30J90M9k10N2j7j58L07J52k90L6j19J97
6849G8r4p0j78L15p7Q1k2j27J16J55l40j42N02P0k29k34K26j53N9l9j2QL35j98
6873C0o2n7K04P5jl82J20K07L8k79k23L94k1n5l8K1j12K01j06J65k81L20p1J24
6897B11k43k6J51l0j53J38J39J32k98m57M90J2j44J85j17O2p3M46j67l62oJ76
$$ y = [44, 92, 11, 180, -19, 55, 62, 26, 190, -140, -112, 85, 32, -9, 431, 12, -349, 322, 63, 40, 108, 174, 149, -8, 22, 106, -154, -156, 143, -84, 290, 40, -42, 109, -182, 241, -100, -61, -297, -60, 100, -219, 49, 89, 216, 95, -79, 131, -12, -225, 12, -285, -71, -218, -97, 149, 4, 32, -17, -39, -61, 150, -38, -119, 55, 167, -119, 3, -178, 107, 28, 76, -136, 180, 309, -8, -117, 157, 236, 28, -207, -36, 61, 11, -13, -103, -74, -98, 239, -1, 151, 75, 193, 5, -212, 3, -41, 140, 181, -152, -102, -73, 119, -111, 79, 128, -82, -30, -47, -205, 102, 254, -36, 0, -119, 78, -16, -86, -264, 51, -26, 55, 33, -94, 22, 177, -163, -305, 197, 267, 38, -196, 30, -123, -64, -103, -115, -107, 228, 30, -32, -89, 115, 190, 189, -193, -73, 134, 172, -107, -330, 64, 43, -12, -50, -29, -141, 60, -46, 119, -162, 158, 87, 211, -32, -58, 93, 63, -90, 48, 187, 319, 21, -436, 54, 66, -78, 107, -10, 52, -21, 425, 258, -104, -110, 66]
6919F6P9k88j10L96l20l2J20K57J50l18J5k61J59N5J93l8K01m58K77l43J23K16
6941A39M9r6j07k20K05J70j13m9knJ86l96L83l13J76N6N6l03K78n8o0K01j26n6
6965eo4N2m9J12J24j53r7J36R1m5j24J9m2J62R8k66nL8j6r2R6J7K2J70l87J28
6991h0O1K9J8J4K01l9k00M0P0j62j01K61j74O3j38L18k68R0j80N78k50k11J6o5
7015a09J23j52J09nl3M5p5J05k5n0j3J71j02q0K69k12J4j04J97r9J52N6k00P4
7039E6j09j26K30J89m6m34P6qj35J13j18L81r3P5k84L76Kk52n7J30o1M3J10k41
7063a83K56J7k75O8J78j9o1M5Jk54K03J8K69k49L2n8O8k45Q4o5M0J66P0l37Q4
7088a47J40K0j5N1k38K50mJ0k71K66k11J58l7M9P8k25L12P0l39R4M4k17K22j18
$$ y = [66, 145, -143, -253, 143, -177, -209, -89, 168, 318, 0, 15, -246, -87, -32, 161, 123, 324, -134, 143, -200, -77, 139, 188, 92, -15, -235, -30, 140, 27, -22, -24, -29, 157, -239, 144, -169, 7, 63, 119, -184, 94, 36, -24, 177, 51, -5, -69, -17, -66, 46, 170, 17, -80, 56, 147, 102, -22, -3, -45, 117, 215, -51, -56, -18, -34, -126, -30, -13, 9, 179, -208, -80, -19, 10, 28, 42, 243, 204, 4, 44, 114, -48, -149, 112, -62, 1, -137, 181, -87, 3, -177, 401, 151, -60, -44, -109, 14, -138, -29, -34, -67, -22, -97, 8, -17, -67, -80, 91, -11, -91, 178, -34, -20, -124, 73, -26, 126, 182, -18, 56, -53, -179, 51, 240, 194, -240, -164, -172, -307, -194, -312, 69, -24, 51, -233, 143, 145, -107, -164, -34, -95, -52, 58, -183, 73, 90, -185, -117, 61, 42, -19, 26, 27, -227, -24, -6, 263, 14, 46, -12, 56, -189, -105, -170, -130, 36, 106, -231, -147, -7, 13, -2, 49, -189, 61, 57, 67, -204, 62, -149, 9, -28, 21, 99, -126, 186, 256, -83, 11, 55, -162, 60, -58]
7112e8O4j25M54m48J62j58j84L85j32J7r3J45j53RJ88L5L5k99K63k83L98l34M
7135a08J41k31K76mJ10j75L5r2j04j12J44K65k03j38k7K05k06L04N4l1r7j09O6
7158c7P1N1p5j5O5j71p1L91m60K85J67k76N6J77k52j15K22K1R9k64j41M29r4j13
7182e0N0R9J28l63J84j68K04k21K46lj83J79Q9k22q4k1k2J4Q1r2J33m9P5n0j40
7207a86J57o0J93n7R6Jj63n0J43R7K4l93k7j5M19j93q0n4J16J55Kj40J0K0j39
7232a24M00l2j57l0N4l32K40j2k33J47J9J55k8j21K07j19m2O5R2M0j46L0j39K
7256f4K47l21J90j21L1K31m29L06p5O4l6r5R1p6P8j33o1K03M6p9J69j02M8k32
7280a20K08lj28P3o7k1j12K03J10j97Q9l03M40m1qR5k27J21l7m9N2j4k88J17Q9
$$ y = [-58, 6, -119, 335, -113, 49, -109, -293, 92, -40, -23, -116, 29, -124, -115, 73, 108, 143, -156, 107, -176, 222, -112, -108, 33, -198, 78, 74, 184, 9, 44, -48, -152, -264, -120, 145, -58, -196, -223, -18, -224, 80, 134, 103, 6, -103, -37, 34, 85, 10, -5, 60, -111, -182, 209, -251, 34, 201, -75, -19, 158, -94, -209, 13, 34, 133, -131, -272, 157, 63, -50, 0, 99, 227, -136, 48, -120, 84, -137, 109, 106, -77, 102, 191, -31, -115, -136, -158, -144, -63, -155, -22, -71, 4, -46, -186, -29, -89, 104, 47, 143, 144, -19, -69, 74, 171, 195, -198, -225, -240, 179, -14, -94, -148, -32, 123, 125, -15, -5, 15, -124, 276, 244, 87, 57, 111, -221, 19, 7, -226, -79, -60, 95, 67, -54, 153, 34, -8, 57, 149, 189, 43, 73, -66, -64, 183, -138, 52, -69, -38, 193, -236, 70, -5, 59, 23, -72, 19, -57, 21, -112, -173, 30, 76, -3, 166, 64, 112, -120, 88, 85, -43, 30, -37, -58, -170, 33, 143, -54, 35, -268, 172, 131, 123, 218, -9, 112, 75, 26, 78, 64, -224, -107, -18]
7305a8N6lJ4K1l10J29K3M19j02m78K85O2p1j67oK90j27j5L87k34k54P6K25l75
7329a73K20J0k6j29K31m37L07K5j60q9L38Oj10M9kk8k0k0k6j43K55M6j64J79j04
7354C5M4j55J23k7k63Q3R6K23R8k56K3k37L15L4j89j54L46k68K90k39P9l7J65
7377A29j98K44q4k6o4j30Q8M5NJ29j74j21L35J49n21K11r0m9J68j15J10J29j65
7400Ej08J18J71j3o6J9j30J1K12l14p2L8r7L08M2k45N8J88j73j00M6N56j69l34
7424d9k2k4Q0j06L9Q9Q3j18Ml43N58L0o3q0k29M12l78J9J95j70L58k09R2l67K99
7449A00j27K9j37K87k34K48l45O7K59k15j09O3lJ12M0k71K53o0K08k32jq1K27
7472G8P0m37L81j70J46p9r3JK89l16L40k51l8K1J23J38n41L67PO4m41K33K55j44
$$ y = [-18, 38, 35, 49, 70, -240, -111, -88, 331, 229, -249, 36, 98, 27, -140, -146, 144, 17, 2, 389, 155, -99, -23, 202, -173, 47, 57, 31, -98, 133, -304, 3, 28, -132, -221, 117, 123, 13, 62, 60, 32, 12, -8, -34, -177, 78, 124, -40, 139, 35, 79, -76, 47, 20, -243, -160, -64, 159, 257, 1, 24, -213, 102, 136, -53, -207, 139, -129, 161, -78, 1, -36, 129, -69, 175, 91, 65, 1, -129, -41, 4, 9, 138, -36, -157, 178, 327, -194, 17, -73, -122, 46, -69, 41, 170, 5, -103, 15, 186, 173, 107, 126, -4, 7, 219, -95, -167, -129, -226, 82, 124, -121, -63, 125, -48, -148, -102, 454, 285, -49, -71, -95, -15, -121, -82, 7, 90, -28, -24, -367, 191, 221, 158, 78, -151, 261, -117, -98, 97, -73, 285, 76, 168, -199, 100, -27, 2, -135, 152, -82, 166, -179, -112, 147, -68, -177, -114, -117, -5, 35, -236, 17, -43, 165, -67, -68, -149, 78, 148, -289, 92, -78, 68, -11, -104, -103, 186, -130, 210, -41, -79, -58, 65, 203, -338, 29, 36, 100, -341, -108, 147, 3]
7496Ck5K84k38j38K1j9J7J01m8J26m9Rm1J20k04l5J15Lk9L3j30M6M89m74n4K42
7522A25j86O6K09l15l7o8K98k43p9L49j90Q9l13L39K28m43J49J01k15J81j13J77
7544A09p9R0J08j78N2k32K88p5k19m3K92p5j24N7l6P6J60k83rNK43N9l68J96j13
7569i9J09j13j30J00K90Qk64J60j19J55m4N6M6k56J34K03j59J0j76j08K37r1j52
7592b03K21K58l80M7k9K22j44r3J91k84K00K5N1J22j49m6J19P2l8J28k06q6P0
7615F8J07k1J32l78p9K11q3N6J05M1j40J39k06qK32j85j88L58k09j29J24mq2J10
7639b9NK68j81j7j43r1J96N4q8l2j31J36K48j09q7M1j10Q6o2J74lj70L5o9J67
7664H8J15p8p5oj5j40Q4k12L44p3m1N6j00l1N7q5P5Q4P2l04Q6j31j4L83m1j03
$$ y = [3, -22, 262, 24, -114, -93, -112, -95, 6, -42, 84, 35, 44, 3, 123, -81, -116, -1, 2, -27, 6, -124, -78, 411, -63, -117, 125, -61, 5, 214, -101, -138, -206, 92, -151, -230, 119, -71, 18, -295, 44, 272, -171, -22, 79, -136, 45, -68, 109, 30, 120, 228, 50, 102, -130, 158, 83, -136, -179, 113, 38, -86, -29, -65, 11, 171, -112, -121, -116, 127, 186, -182, 14, -99, 10, -103, -233, -133, 157, 165, -99, 61, -58, 97, 53, 109, 155, -101, 33, 236, 77, 87, -89, -197, 40, -51, -203, 18, 276, -104, -57, -86, 136, -8, -101, 90, -194, 6, 31, 82, 204, 55, 9, 128, 200, 162, 290, 84, -2, 68, 175, 154, 286, -92, -171, 40, -43, 13, 118, 159, 19, 158, -48, -56, 176, -9, -197, 161, -48, -177, -53, -57, -139, -29, -24, 244, 63, 46, -97, -188, 8, 62, -26, -58, -189, -53, 195, 86, -1, 40, -70, 16, -46, 128, 125, -45, -10, -79, 88, 203, 125, 50, 44, 29, -111, -27, -239, 105, 32, -9, 47, -53, -84, -27, -112, -37, 47, 119, -185, -99, -230, -244, 139, 98, -5]
7690eP9p1K17k56J39j4j56J34j43j4J78j2l9j50N0kj16J78j11L11j71n9K0J48
7714A35k54K28p5k79L26m0J01k42L98l47Q5r1JJ32L8k47J55r9P5J37k75J15K02
7737A79k08K2O4l79K52J68N5j90N4k8o8L20k91q6K31O4j37m9J51M4j41j67k5J09
7761e6N3n5k49n4L69K46k63j19J25m1J85j36p9q8Q4J21j29k7J63k3%j44L6N3l
7786c1j13J5K72K38m66J28k01K47N1k56Q4j60L55j91J17p8J31J07m32J43RJ78
7808A47j7M9l1j31J83m1r3M8q0j17J57o6r6L47r8k23J11J06J50k97m4j28K64j46
7832d6J72J65l95O7j49J49J17PJ35l17O1Q0j69q2L34m6j31K80k00k10N3L07j65
7855A7j47J35J67o0j32J0L9NL4m5o1k80N09q9j83N5M8k1K93k72j61J96J90l8m09
$$ y = [-5, 74, 3, 220, -36, 103, 89, -67, 67, -76, -90, 88, 76, 37, -113, -63, -65, -181, -3, -114, 197, 26, -33, -13, 135, -119, 109, 34, -245, 81, 41, 142, -100, 298, -49, 36, -55, -54, 78, 116, -131, 24, -75, 0, 137, -138, -23, 179, -29, -7, 57, -322, -70, 98, 153, -37, 17, -11, -79, 241, -50, -136, 95, 159, 22, -27, 124, 168, 27, -140, -165, -56, -3, -58, -307, -361, 8, 254, -9, -128, -3, -44, 141, 5, -74, -162, -78, 43, -86, -113, 50, 27, 27, -117, -81, -28, -31, -144, -129, 143, 381, -85, 43, -158, 89, 140, -116, -32, -192, 163, -28, 89, 11, 142, 249, -183, -40, -31, 147, 130, 179, 148, 17, 200, 159, 66, 114, 34, -83, 74, 8, -88, 259, 161, -62, 49, 155, 305, 8, -36, -164, 100, -46, 126, 291, -104, -37, -186, -37, 80, 87, 222, -95, -34, 46, -123, -205, 129, 83, -48, 232, 32, -178, -125, 182, 17, -130, 5, 172, 112, -20, -10, 29, 34, 68, 23, -38, -318, 191, 102, -81, -26, 22, 1, 294, 22, -139, 57, 247, 209, -200]
7880b00L18j07J18n5j62J24J17k54M5o5O3J05J4k33J47j89L29k88J57Q3Nj02K4
7903fj90K69j5l23R4K82Oj36Q8k77J63o1K56k46K13j45O8J62l06L55k51L5Q2j59
7927d2J3K03l39K77n2q7P6j90J08l2k4lJ79l20K60j91J61j77L93j40PJ49l37K63
7951A55m8m25M00n0M1Nj16P0J8J13l46J23j59K79rJ43j46P1Q1l35P6P0J25j19
7975A7J63j60j95l6O6K05Jk3j51J66j23Jk5N7O8j4j86QK46l65L48n6q2J46O9j79
8001c4m1J52mj79J67k7j00R1K28l16M1J97j24j40J3L32k95j1P2q7j72L97j90o2
8025i2O4J21j3j50jp9L71j36j28J14j52K52K5k42p9q7L64j27J4j56O9J58J7j44
8049a7m0P0j0j44kL02n5m1l2k30K94r1l71K26Q8Q3r8q9q6J58J43k58j24J12K88
$$ y = [-200, 118, 11, 129, 74, -88, 36, 153, -101, -56, -121, -58, 47, 61, -172, -25, -214, 115, -173, -16, 67, 72, -30, -6, -196, 73, 58, -265, -171, 111, 117, -19, 69, -208, -45, -106, 150, -96, 117, -28, 40, 202, -104, 251, 0, 35, 117, -42, -29, 174, -165, 112, 60, -27, 49, -141, -33, -65, -89, -92, 87, -233, 27, -164, -3, -180, 213, 73, 80, 229, -108, 155, 107, -318, 82, 32, 73, 78, -38, 32, 50, 163, -183, -60, -219, 60, 51, 194, 48, 119, 200, -135, -59, 11, 136, 17, 180, 20, -175, -211, -145, 60, 61, 38, -113, 53, -70, -69, -94, -37, 31, 17, -169, -161, 85, -280, 68, 12, -70, 76, 145, -34, -75, 77, 73, -106, 61, 34, -66, 25, 253, -63, -22, 175, 51, -89, -76, 256, -39, -50, 22, -65, -237, 160, -30, -92, -28, 93, 80, -70, -71, -150, 221, 85, -43, 71, -81, 171, 196, -46, -125, -212, 152, 25, 39, -117, -48, 110, 127, -17, -57, 13, 3, -141, -143, 159, 104, 63, 31, -199, 95, 4, -367, -141, -53, 30, -68, -157, -243, -85, 58, -200, -324, -212, 76]
8074G6K34o11K12P2K17j02k04l3J63Q6n9j04O4K3K04j75k22J95M1j91n3j68O03
8097B68q0L4m97M5L73N1l00j1J95O8l23P4O6K61l03j32N5k49O38l6n44K76J37
8120F6q3J75m26K84L27k75j99K50l03M60l20N0L9LL0P7j96RL42m0l68r2Q8L07
8144B05k55L1r9K90j01M3m60K98Q2o9r4J22O4n2M8o3L7M8K5k71P9rJ87j77O8p1
8170i4k8J87O4j50K19j91K05m30P6R0J99j67k74L03J9j7k43L66j89J60o
$$ y = [76, 310, -301, -89, -17, 200, 98, -106, -139, 24, 110, 51, -53, 11, 34, 238, 63, -159, 36, 77, -114, -167, -335, 268, 188, 222, -275, -230, 143, 194, -106, -117, 78, 146, -177, -103, -37, 224, -79, -211, -156, -405, 233, 197, -347, -71, 66, -17, 158, -268, 16, 343, 68, -131, 119, -184, 276, -44, 6, 45, 48, 78, 155, -41, -32, 310, 270, -98, -190, -102, 205, -50, -19, -118, 172, 71, 114, -346, -48, 34, -35, -129, -7, 57, 5, 53, -10, 27, 75, 100, -171, -92, -101, 86, -91, -23, -94, -122, 65, 129, -21, 198, 7, 212, -218, -142, -52, 147, -20, -294, 9, 28, 11, -232, 134, -55, 105, 99]
8191I9
$$ Imaginary data points
##PAGE= N=2
##DATA TABLE= (X++(I..I)), XYDATA
0@%%%%%%%%%%%Qj6J6j6K2l0L3m1M9n7P2q8J04j21J45j69J94k26K59k97L41l89
33b07M40m97N61o33P13p98Q90r92J103j225J361j507J665j840K032k239K465k718
51a426K996l300L637m014M438m917N459o080O807p668Q702r974J1589j3709J6631
66I171k0944K8039m2358J22155k90699n1280M87518j04335l02966P1715K24475
77A30491j02312j20147J12244N3197j91237L9601K48465j16479l25335K19026
87e2486L44188k95885l00022L37880J93984k96366j11217K26118O4363j61354
97e0797j3801J56556p1461j55970J79476J33483k79283p4220L48236Q834l64023
108a82970O2236L21555j09910k40895J13787J58139j00984j15105J18088Q8172
$$ y = [0, 0, 0, 0, 0, 0, 0, 0, 0, 0, 0, 0, 8, -8, 8, -8, 14, -16, 17, -24, 25, -32, 40, -48, 56, -65, 80, -89, 105, -121, 138, -159, 182, -207, 233, -264, 297, -336, 377, -421, 469, -523, 580, -645, 716, -791, 874, -966, 1066, -1173, 1292, -1426, 1570, -1730, 1907, -2107, 2331, -2586, 2873, -3207, 3600, -4068, 4634, -5340, 6249, -7460, 9171, -11773, 16266, -26092, 96063, -194636, -245916, 241602, 137267, -165699, -93984, 130491, 28179, -91968, 20276, 73473, -117764, -78163, 170302, 53823, -271512, -52486, 291702, -4183, -304205, 33675, 227659, -68707, -179924, 46194, 110557, -50797, -64598, 91958, 20497, -135473, 44003, 177486, -101797, -176017, 172219, 181053, -182970, -120734, 200821, 90911, -149984, -36197, 121942, 20958, -94147, 23941, 112113]
118A12113j79338l3212K32696o9728k51164J62612K22632k15316j66576K25377
128D0096R6455k11633l8390J77959j541j53174L2891J57888p9831j64636J61013
139A7097J40578k36936p6854K66480N940k34528N2191J86367p9673j39974R3660
150e652J02017j09104o9803J43448M2599j90185M53K29144o9483k34562J37118
161b4010J87538j73895j19647J65976O5275j42623l4548J26389l308j33075M8542
172c7386J42816j02863j38132J59754J08535k09890n6717K26032k599j96816M6668
183f0598J49440n9316j11575O9599R4291r5664p5995J38174M1777j70331J5868
194f4330J87136p4897j77133J20663J38989j44685q6907J44859M7417j32751k7241
$$ y = [112113, -67225, -100437, 132259, 62531, -188633, -26021, 196611, -18705, -185281, 40096, 136551, -75082, -113472, 64487, 62946, -90228, -57337, 100551, 20720, -143916, 17097, 157675, -79261, -156115, 110365, 116305, -118223, -66032, 120335, 40662, -99312, -5652, 96365, -12739, -82542, 60906, 103505, -86680, -86227, 142917, 73434, -161128, -24010, 163528, -10367, -130014, 35962, 101237, -41386, -75934, 50455, 47147, -85928, -37386, 105430, 2567, -135565, 24189, 132724, -77166, -133883, 92149, 89550, -107266, -60598, 88842, 29526, -82049, -12450, 81841, -13823, -89818, 48356, 90133, -80198, -64330, 122806, 47909, -129224, -8561, 130428, -14257, -101164, 43695, 91112, -41639, -68880]
205f8880J27438N475j39587L1061J45691q6756j28006J35079Q3883j59977l3102
216h7681J56019j6366j39048M9555J17394o5004r8227P7075Q7831j01876p7166
227i7494J35910M9099j58057L659J54386n5730j22156R0860Q3580j05789m9983
238g1715J12289K6110j15510m553J25671j6212j37152M2558J35911p9316j10895
249i2814J13481O5054j25551j6168J13124k4134r7971M8055Q8506o7904q6212
260h2534Q8753Q0740j11582o5998J29168L3332j35472Q372J22246m8238q7555
271f8768P7679M8984r3699k2963J04479J0807j15623L528J29904k3238j34569
282h3479M9480J21458p3357q8541Q8372M4436r1458L777Q6661m1415q2148O5320
$$ y = [-68880, 58558, 64033, -75554, -44493, 101198, 14442, -113564, 21515, 105398, -54579, -87681, 68338, 51972, -87076, -37521, 79873, 14869, -83358, -6283, 81548, -20328, -97494, 38416, 87515, -70542, -66883, 87503, 31773, -90383, 477, 84057, -21732, -71715, 40574, 66684, -48826, -53379, 72292, 56080, -81072, -38514, 97397, 18081, -92814, 20667, 85721, -39830, -55998, 57126, 32992, -64979, -16924, 71582, 3678, -82534, 6219, 86959, -24623, -90621, 38547, 71879, -63593, -55221, 67025, 18787, -68768, 8911, 57895, -35804, -58767, 45712, 56519, -59104, -55576, 74328, 51090, -83479, -33999, 87459, 14102, -74439, 13933, 58369, -33089, -29312, 57349, 15934, -66214, -894]
294h94Q0496q5126q4485J06595Q4484j25057p0873J28743M0355j17039n336R1062
306D2925k8003n8098N5202K7270p8140m749R8412r599j19786K0222J37498l2081
318E1073j38898M8960J20060o2885q6091O5934M5988n9987l234N5083l3280n5881
330e3158O3891O1400q9103o7386J10823O6812j24581n5486J26063L4851j11015
341c6889j2009Q1967j1962m9385L4884K3205n7326l806P7825j4495r7676K9922
353c5745J11396m3828j10923N4808R4904o0910o6660N9512L3930n5243k330N2808
365C1719k5622n1674N2171N2677p6133n3046R3819M7388j00126l2107R7054J0884
377D7004q3283Q855O1121k7664l7836M6967J8633o6480k853Q4150j1286r5690
$$ y = [-894, 79602, -5524, -90009, 16586, 101070, -23987, -94860, 33883, 74238, -42801, -48137, 42925, 14922, -43176, 12026, 39296, -38844, -43593, 54819, 45220, -74566, -54344, 83154, 51073, -87825, -38865, 81195, 18310, -67781, -1847, 44141, -15846, -19080, 36003, 2723, -53158, 10733, 72133, -16970, -84356, 26467, 93279, -31302, -86788, 39275, 74126, -36889, -48898, 33069, 21107, -28278, 6606, 29811, -27515, -31321, 46504, 32009, -65667, -35745, 75651, 31823, -79100, -24292, 70612, 9702, -56958, 2554, 36484, -18759, -21089, 31719, 6097, -45577, 6594, 59271, -16862, -69908, 23911, 71299, -28827, -60934, 36120, 47004, -36279, -27424, 33697, 6033, -31803, 15164, 33797, -32683, -35536, 48614, 37328, -58362]
389e8362K2508R7454l3541q7800M3134O8969m8029m2499M8169J1411m8002J7913
401h675N1418m2090n5887O3719N7208q1204n4508Q9917M6010q8750l1246P8535
413B4447J3175o1633Q439M0744l1530k1840N2103N684p1008Q908Q8643k1379r9754
426f5001K9745R8702l5324q6670L8707O8322m0686m3523M1415J4687m1128J3822
438f932M1716l9697m2487O2177M4094p7547m1874Q5299L2544q4232k0884P6304
450B8481Q406o1933O642M4617k5426k6278M2674Q878n7112O749O7743k0557p4417
463e1533L1387P3801m1400o5936M6300N1898m7790l3624M8208J3657m8769O468
475a7333M6036k6089l9745M3531L3671n4909k5801O2190J5340o3284k119O0114
$$ y = [-58362, -35854, 61600, 28059, -59741, -16607, 52362, 4333, -38166, 10003, 21414, -26588, -8675, 42743, 653, -55234, 8485, 65693, -15511, -70019, 19898, 65908, -22842, -54088, 24447, 37622, -24011, -15572, 25172, -6358, -28198, 23905, 29589, -41419, -32511, 56132, 34753, -65001, -35256, 63446, 28122, -58548, -19841, 48481, 7795, -35728, 5687, 20374, -20754, -6932, 34784, -4913, -47400, 14777, 58871, -18676, -60550, 24749, 57293, -26939, -47823, 28481, 36887, -25046, -18404, 26213, 787, -25491, 17183, 26061, -31051, -24302, 43441, 22884, -51533, -20146, 53655, 12255, -53681, -7381, 44517, -3273, -36897, 11311, 24968, -23801, -17333, 28703, 2614, -37131, 6400, 40071, -14838, -40639, 21551, 36891, -26393, -28512, 31602]
487C1602j1246n1392K3933M1685l4993l0130M5591J5551n3202p08N5928j2127
499B0492n4177K3260M8472l5324m0518M4572K7672n1118j3000N2909j930n3160
511c1850J4815N0025k8157m2978L8529L2071m5700j8255M9294N460n0557Q215
523a9088M9847k1777m5039L5500L8142m3301k8841M8398J8575n0483m734N0102
535B7301j0025m4046K4418L5340l6377k6470M6916J6289n5820n713N9011n222
547B5602n7236J3528N0037k1797m1108K8060K7708l5447j1761M0325n783m3574
559c1446J9927M5756l1855m7286M1993M5465m7581l8002M8514K8743m3956j5929
571b5657L7878J417k9040J6399K0262l2410r493M5833K501n4947K436O1011o098
$$ y = [31602, 20356, -31036, -7103, 34582, -411, -30541, 15050, 30601, -22601, -23309, 32619, 20492, -33685, -10425, 38047, 2723, -37795, 6777, 34449, -16669, -29669, 23240, 21310, -31850, -17035, 32990, 4833, -38145, 384, 32455, -13245, -31500, 17794, 23254, -27303, -19088, 30759, 8982, -36057, -557, 37585, -5716, -34557, 13841, 32416, -18067, -22801, 27301, 17276, -26770, -2352, 32988, -3389, -29859, 17057, 33346, -22474, -28187, 30824, 25602, -31634, -18106, 31931, 10134, -30974, -2914, 24794, -10653, -22414, 17911, 12128, -31446, -11519, 34237, 2382, -44904, -2911, 42554, -5027, -43029, 5485, 34228, -9728, -25657, 12221, 13638, -15402, 997, 21259, -11151, -20644, 25189, 27690, -27257, -24821, 36190, 30092]
584C0092o1870J0093N4806j3940m2498J5288K7213k0193j0262K4922r307l0232
596b5888K5338L3325l8575l6513M5722L7030m9585l4911M8669K7965m2819j6312
608b6554L2899L667k1420J1120J1813k4832k876L8878l659m7656R219N2544j0707
621B2436n2004J3313M6933j6091l5238J9719J9099k2072k658K4708j3005k8436
633b3296K5695L1637l6230l3577M0742L1170m1680k7358L8358J7808l3523n863
645a6117K5181r562j6192K3753Q098l6366l007M6460P04n2549R19N5053k621m9466
659b5712N278L9747p473k4166J2831P363j7571J0531K4165k4367l0240L4459L6250
672D1095l9570m0815M1176M0762l9141l5169L2038K3350k3345r799J2900p100
$$ y = [30092, -31778, -21685, 33121, 19181, -23317, -8029, 19184, -1009, -11271, 13651, 4344, -25888, -550, 32775, -5800, -42313, 3409, 40439, -9146, -44057, 4612, 32577, -10242, -26554, 6345, 10012, -11408, -288, 11525, -13307, -16183, 22695, 19036, -28620, -19401, 33143, 22436, -29568, -16255, 30678, 14587, -20651, -932, 18167, -3905, -6563, 18145, 5140, -23296, 2399, 34036, -2194, -35771, 4971, 36141, -5539, -32897, 5461, 23269, -10254, -16117, 9064, -498, -16690, 7063, 15161, -21205, -24212, 22248, 22952, -29597, -28678, 26375, 23754, -25712, -20434, 19313, 11840, -12326, 505, 7868, -9703, 828, 24993, 626, -29614, 4845, 41095, 1525, -39290, 1886, 42648, 3507, -31662, 376, 23726, 381, -9418, 3482, -3618]
684c618m610K2471k324l7581M848M8976n252n7412L236N9528j758n5305K048M4396
698A7643k605k7923L421J0907n618P233J1085k1464j6942L3488K4009l9811k8806
711c5383M3307L0791m1096k7862L6144K0651k6471j1009J5207j074n028J2380
723A0557k413k3788O259L3563j0053m2073J1276M4734j2803m2561J2737L4636
735B0071j3559k3906J3029J0935j3034R00J3587j0987j4898K0356J7500k7453
747g459j7824L2382J5801l2911r495L1344K981k5184M388J9019j0964j2483J8072
760G667P145k3551k467K8720j830l1612O162L0489j2252k6535J6601J9188k0014
773b289j1069K0984J605k3058M804K3792j1116k4194J6510K2474k1588j8952K4667
$$ y = [-3618, -8228, 14243, 11919, -25662, -20814, 28162, 22910, -34502, -31266, 28262, 26504, -28801, -26753, 17643, 15038, -12885, -9464, 1443, -4175, 3058, 14143, -7321, -24263, 9225, 33234, -6577, -35383, 7924, 38715, -2381, -30243, 5901, 26552, 81, -10928, 4279, 3205, -1823, 10557, 8144, -15644, -9385, 24178, 14125, -27948, -16672, 28062, 15259, -27302, -14565, 20071, 6512, -17394, -4365, 6570, -6464, -5564, 8023, -2964, -17862, 2494, 19994, -7459, -25283, 7099, 22900, -10011, -19506, 11838, 14819, -10365, -5977, 13042, 2078, -10405, 7667, 14812, -8739, -11206, 17514, 15684, -15928, -9766, 20723, 8471, -18064, -1463, 17725, -2289, -13358, 7626, 9231, -13827, -9023, 14769, 3653, -20541, -4031, 18443, -3145, -22097, 2570]
786B570J3369k5746n520K4769k465k0558J0235J7516j6391j4015K1198J1165k4116
799g989o296K7999J552k8315M295K5866j0255k0517J5875J4205j9275q456K1660
812A0349K311k3338K269K2911p652k2177J2385J8971j7017j4647K0416O687k3073
825a1605O0K3153n562k2244J0432K0133j3980j8188J6002J4995j6827r557J7273
838D085L697j5843M803J4213j2634j1001J9275P471k2296l895K5364K120k5721
851a0362r64K3857k027j9248O150J2986r964o133J3075j635j6969Q061J9087j4263
865A651k0800J6926K0966j7712j9539J6046J5959j6067j0259J4471K619j0288
877f027N941O783j4057m615K0791K916k4167j175K6656O33k5721J096K2427k269
$$ y = [2570, 15939, -9807, -15327, 9442, 6977, -13581, -3346, 14170, -2221, -16236, 4962, 16127, -7989, -14285, 13714, 15266, -13049, -8754, 17112, 6857, -13660, 2215, 16420, -2855, -11311, 10349, 12660, -10678, -8409, 14502, 6850, -15327, -2942, 16029, -988, -15635, 4781, 11468, -11605, -11545, 11608, 6046, -16198, -5766, 14367, 387, -17801, -1799, 13196, -3631, -13188, 4085, 7782, -8061, -3258, 10955, -1679, -12680, 6595, 14066, -8230, -12125, 13239, 15359, -10362, -11326, 12531, 10504, -8744, -2594, 10392, 428, -5705, 7370, 5735, -11234, -3173, 15914, 1651, -19149, -2223, 18743, 1031, -18508, -2462, 13497, -2570, -12829, 1642, 4261, -6027, -86, 6697, -7360, -11975, 8816, 11732, -12435, -13610, 13046, 13679, -12042, -10946, 11481, 9212]
891I212j7537N591R971q988j206J4046n869j8303J0851K0335j4767k1962J6908
904a718K2420j6993k0166J4325J4187j1817p739R997k133q182J1639O659k0065
917i586n422K5303M908k8665o791K9725Q257k6395o504J9844L903j2039p00L987
931a75l689M815J1443j1939j8074J6873K3378j8208k6893J7163K7519j4076k4526
944a6389J0845J8384o131j0317P20p48K137J1132j488k0802K08K7479N16l1388
958a5842l636L1184P180k8260r107K2449Q459j3329n721K654J664N703M270j2265
972d597r757J8563J5360k1838j9845K0770K1494j7056j8974J2837J5438q467q813
985d885L411L62O48Q269l218j5446L065K2614k344k5902J42K5126L93k2662L9
$$ y = [9212, -8325, -2734, 7237, -1751, -2957, 11089, 5220, -13083, -2232, 18103, 3336, -18626, -1718, 20702, 3709, -16457, -2132, 12055, 238, -7501, 2496, 363, -7819, 3820, 10479, -9586, -15008, 10295, 15203, -13462, -20253, 9472, 17729, -8666, -15170, 4674, 8577, -3462, -4162, -175, -3864, 951, 12394, 455, -17619, -746, 22632, 4424, -22469, -5306, 22213, 8137, -16389, -5544, 12840, 6709, -3608, -2888, -3636, -1499, 9633, 8145, -12657, -12449, 15030, 15546, -15842, -19478, 11706, 18886, -9374, -18481, 3968, 12427, -902, -6623, -3969, -2305, 3398, 7668, -4597, -14354, 4209, 19569, -2269, -22114, -1344, 20150, 3094, -15880, -3043, 12395, 3928, -4885, -1474, -1112, -464, 7805, 4587, -10859, -7794, 14820, 12476, -13426, -13284, 11842, 12235, -10427, -10388]
1000a0388J7948N37j1792J129K966n070M517R004r952j1887J3552J4592j5445
1013b89j6046J5636J4978j4512j2079J1841P693p633q80M890o155m588J2732L433
1027I021j7780j668K1381K534k3074l518K1534K572j7940o98J2183j260n668M712
1041B331j53q617M951J2435j0234j5517J3237J7645j2463j7991J1160J5876j0644
1054B016j2623R142P901o249j330L805n298k238J0461J694j4951k425J8474K471
1068A0850j8918j422J7921M65j6482J04J1816j526n747M582N89o927L214Q116
1082F635o660r525R164J1009j0643j0772J1431R979j1742p263J0909L045r567
1095d000Q43Q203l240n290N409K540p663k084R977J006j0735J942J0253n421r587
$$ y = [-10388, 7560, 8097, -3695, -2566, 400, -4670, -153, 8851, -1101, -12988, 564, 15156, -289, -16335, -699, 14279, -233, -12312, -471, 7222, -411, -1291, 3599, -2556, -7144, 5588, 9021, -8759, -10427, 10954, 13488, -9586, -13104, 8430, 11002, -6938, -7636, 4547, 3287, -2381, 2331, 2178, -6439, -1488, 10947, 713, -14804, -1567, 16078, 3615, -14376, -3216, 12660, 2016, -10607, -1465, 6436, 187, -1143, 2662, -2636, -4874, 5587, 7281, -7670, -10095, 8379, 10850, -8068, -9490, 8431, 8896, -7586, -7482, 4334, 2808, -2939, 1643, 2232, -4695, -1481, 6635, -25, -9550, -386, 10623, -20, -10792, 639, 10618, -1124, -8387, 2522, 5567, -4000, -3157, 5046, 1806, -3484, 1925, 4465, -3198, -5282, 4695, 5701, -5034, -3092, 7161, 1740, -7847]
1110g847Q335P004j0010m613J0498J702r756N31R309k679q591K944Q076o011n197
1125f305J0190K261j2791J243J2778m643j1681O653J1016o538r459O499P684o191
1139G16n146O527J494p702L678P994q054o838J1948M388j4367l878J4222L507
1153H489j1458l367R404J957q658M33O331m713k854R703j845j3166N653J4766
1167A0675p398j5020N930J3896l366j2157K095J0814j577p825K493J647l720O715
1181C202M936j2781m893J6776M689j6691n973J4381Q481j1566j0580Q895J0737
1194I613o183o713J570l99K780P132q612j1085J2395J3132j2679j5217Q782J5587
1208A0103l053j6327o74J5104J611j0257j283K393J081O651j880j4104L307J8711
$$ y = [-7847, 488, 7492, -2518, -7131, 3367, 5069, -4687, -4156, 5153, 2474, -6117, -3173, 4903, -1108, -6305, 3885, 6146, -6645, -5402, 7376, 2733, -8948, -2295, 8721, 2183, -7276, -777, 6907, 716, -4430, 2097, 3591, -4111, -433, 7561, -493, -7331, 4617, 9005, -5362, -9240, 4982, 8489, -2969, -6336, 3068, 5025, -3633, -3200, 3131, -1582, -4436, 5267, 3422, -9744, -4091, 10675, 3277, -11743, -5813, 8083, 4717, -7440, -5345, 5469, 3892, -3933, -1440, 207, -3513, 3202, 8138, -4643, -9536, 7240, 11929, -4762, -10735, 3646, 12127, 561, -10019, -1124, 9613, 3430, -3283, -1713, -2112, 668, 7800, -812, -11897, 498, 13630, 951, -14266, -5484, 10103, 7050, -9277, -9951, 5153, 6764, -3493, -4776, -2383, -1302, 5349, 3469, -10635, -7328, 11383]
1222A1383j690j8110k388J5591P028j3491r573J2082J0749r424o874L559J022
1235a36M001M008j0764o926J4423P741j3532r146R326J1147o051j4133L937J3804
1249G699l921q295M050q28l511Q208L65j2514K566J3675k034j2224j782J0764
1263B218O056j0238p465J0496M685q269K265L626p348L075R475q448q897R641
1277H72R102n649r761J048J0804P58j2031P93R269l673k101M527o726l831J3360
1292F761O93j5119j418J2827M508r792q789P712J2332q830j1418P491O322l404
1306a24K436l216p939R056R907j1529r180R242J0093l291j2527j069J6093K772
1320A0724j5782j532J0136j95j040N81p457K379J2784o073j2930L943J0642J904
$$ y = [11383, 9693, -8417, -10805, 4786, 11814, -1677, -11250, 832, 11581, 2157, -4717, -1158, -136, 3865, 7873, -2891, -9817, 4606, 12347, -1185, -10331, -1005, 10142, 4091, -10042, -6105, 7699, 3778, -4517, -467, -1295, -4806, 3402, 3767, -8747, -6181, 7494, 5460, -6764, -8546, 2218, 8274, -1964, -9429, 1067, 5752, -2517, -252, 3374, -3974, -899, 8576, 128, -8769, 872, 9974, 4325, -5436, -4388, 6416, 7174, -4857, -4064, 5205, 1532, -569, 3958, -2768, -6599, 6761, 7454, -7665, -9083, 3744, 8252, -1540, -10329, -2617, 9715, 885, -10533, -3042, 3280, -124, 2312, -904, -8843, 213, 10120, -1409, -10589, -1347, 8746, 5455, -7072, -8141, 7952, 10724, -5058, -6590, 3546, 3351, 2311, 2892, -4565, -2186, 10598, 4525, -8405, -4462, 6180, 8084]
1334H084r488q537J0116J0972j2039q417R612K913m703J855l367l931J0183L492
1348F745j2072l134Q690M600l524q734K456J3015l615j3132O446P865o348K43
1362d99L504n937K228P282m903n063L650L526k49m366m218R454L930j2298L08
1377c651J0224o556n197Q904j780o581N503K347n162r54J713K315J43o338J521
1392c549Q674n914o711J0338J277j0692M126O561n984j140M358M4l19k053q79
1407a863M850j843m567P162R01r315M985P737r710k739R515j606n734J881J242
1422H96J103K64m778K128L426o200J408O493p701k468J0654k953j0104N585N995
1437C748m554j928j51J744L619l194l008M823j337k735O260l170o740R245N639
$$ y = [8084, -1404, -9941, 175, 11147, -892, -9309, 303, 3216, -1487, 368, -2999, -6930, 3253, 6745, -5327, -8461, 229, 4829, 1305, -7429, -4973, 8042, 4427, -8705, -2259, 5606, -742, -499, 3005, -2932, -704, 6578, 1675, -3388, 262, 3788, 3539, -827, -5045, 4409, 8339, -3959, -3651, 6573, 17, -5180, 3724, 1944, -4637, 866, 3213, -1949, -2903, -1190, 1125, 1268, -5070, -3549, 5125, -789, -7500, 2838, 4115, -6577, -2451, 4110, -1874, -3014, 1344, 1388, 1069, -984, -1863, 2987, 1144, -3423, 3739, 4640, -4675, 310, 8047, -1663, -4402, 5113, 3507, -2227, -346, 896, 1999, 2263, -2515, -387, 3039, -3161, -1753, 4740, -2961, -5429, 5225, 2272, -7832, -2247, 3748, -806, -2734, -2885, -1141, 2478, -716, -3724, 1099, -238, -2973, 3287, 117, -6623, 2622, 8261]
1452H261j1333j696P926J03k159j901j177N572J365o460K76L194k428L300J030
1467C873j0312L577J2004p350r414O777M897k794l158l144L969N600m708l673
1481c856K782r94J807M400p846m852J2897K923j2497p89Q012J991k706m944l09
1496c981Q082J84o474J384J343j208O101k612j0392O759J1111q373q337N516N177
1511D280m77m675m088N381M662n794j127K120l025L799N134j0394m375J2032K901
1526F354r938k475N034M750j342p672l24Q898l27m853J281j953P07Q461l788j1070
1542h257O133J0087m851p440P83N841M630n825p759N976N814l417j887j498j695
1557c365P501L394j2678k755J2189K741q540m827L500Q043k53j0385q88Q970P34
$$ y = [8261, -3072, -4768, 3158, 3261, 1102, -799, -1976, 3596, 4961, -1499, -1223, 1971, -457, 2843, 3873, -6439, -2862, 9142, 1792, -7622, -845, 4052, 1258, -1900, -5044, -1075, 4525, -183, -3856, -1074, -2068, -261, 4139, -3707, -8559, 4338, 7261, -5236, -6025, 1987, 3978, 1272, -3672, -3981, 4101, 4285, -2189, -805, 538, -670, 5431, 2819, -7573, -814, 10297, 1924, -6413, -897, 4280, 3803, -872, -4960, 421, 5083, -711, -1838, 282, -2743, 1056, 6190, -4204, -8579, 3453, 6354, -3584, -6059, -1025, 3725, 2383, -5289, -5613, 3285, 2958, -1895, -614, -2567, -1860, 6601, 2813, -8257, -2124, 7963, 3112, -4328, -3545, 2296, 6926, 1101, -6658, -682, 5132, 1715, -172, -1670, -3365, 4136, 7530, -5148, -7903, 4286, 7027, -1513, -6340, -2840, 5203, 4950, -5435, -6323, 2647, 3381]
1572C381l957j845k584M962Q009p786j0235Q552R136m994p719J87P226M890p640
1587d17o972P387N174l174k667k903J220Q684p47j1532Q18J0870N2p770l058M453
1603e82O251k787q038K196O229j742j475j430l012M954N487p197o051P198N598
1618E599m547n573P11O504J580o851j763O192Nk320J227k451r81O311l2p700R99
1635c090O065L51m093k047K826M117l360l649L103J339k401K445j31m490J667
1650a348N860l587m792K478M056n73m143j133M491J580m637l87L209j469j39K575
1666B041k996k075M514J414m432r28K829K053j465l743J551M071k211k153J976
1681D46n4j148K049j13l593J755L681k273k803J132K632j97k553m50L088K7k981
$$ y = [3381, -576, -2421, -5005, -43, 7966, 180, -10055, -1503, 7633, 2639, -5080, -4893, 2333, 7223, -417, -7389, -2, 5172, 1998, -669, -3572, -2352, 6332, 5585, -5947, -5129, 5741, 5793, -1977, -5035, -582, 5669, 2882, -5156, -2960, 3269, 1527, 52, -1378, -4390, 564, 6051, -1146, -7197, 1, 5599, 1052, -4521, -3810, 2694, 4274, -2577, -4340, 1852, 1857, -463, 764, -1687, -2668, 3643, 3611, -4089, -3090, 2975, 3326, -767, -2814, 12, 4129, 769, -2880, 223, 1562, -839, 1606, 1475, -3015, -1348, 4512, 925, -3867, -1389, 2667, 2094, -2049, -3182, 1309, 2889, -1748, -2135, 1074, -395, -534, 2041, -955, -3030, 1484, 2898, -1534, -2462, 367, 2420, 955, -2788, -1237, 2834, 623, -1530, 446, 392, -756, 1293, 1180, -2413, -658, 3023, 750, -2053, -921, 1711, 1514, -1039, -1489, 1599, 1626, -1355]
1698a355J464J098k244O32K010k509p39K480K88k124K20J488P3j117p88J867N47
1715A291k965P18L242j955k472K655J091k138k49R45k91j45P93n31r12J18K107
1732A302J98l397k77M618l31n007J094M322j099k777K65J278N46l65m74m09p54
1749a267J668K173k711l324L969L686m238m048L970L443k450k628N21K096M40
1764A300j267j296j91J296K410j373m346J058N637n49n886n5N244N30l874j019
1780b381K022J788n37j378j160M56K432J687l728l100M277M109l925m337K429
1795a346M812q52m327q61L289K125j317l290r61L292K925k327m988J245O464j87
1811C696o635j289N025K982l551l959J439M042J272k963l871J805N114K26o280
$$ y = [-1355, 109, 1207, -1037, -405, 1605, -904, -1643, 837, 1125, -999, -779, 709, 782, -335, -1123, 744, 1291, -1674, -956, 2286, 331, -2141, 514, 1605, -533, -782, 163, -128, -273, 520, -11, -923, -805, 1302, 1500, -1897, -2174, 2444, 2113, -2894, -1800, 2522, 1423, -1354, -1089, 189, 735, 370, -104, -513, -1267, 401, 2574, -137, -3461, 508, 4194, -44, -4092, -122, 3321, 871, -1757, -1236, 860, 1300, 33, -1263, -1454, -158, 2252, 879, -3467, -2409, 3228, 2679, -3207, -3262, 1982, 2512, -1362, -2381, -359, 1429, 892, -486, -1646, -1190, 1242, 2929, -799, -3899, 378, 4487, 562, -3775, -1346, 3466, 2614, -1713, -2574, 715, 2840, 1523, -1767, -2728, 564, 3489, 1162, -3826, -2581, 3883, 3696, -2939, -4228, 797, 3779, 228, -3731, -2292, 1750, 3022, 59, -3812, -2007, 3107, 3333, -2947]
1826b947k139O077M654n299n439L494N486q15n217j568M395L379j868m772m17
1841b996M809L482m847n759L720O867j406p376l35O561J906n308l349K597L950
1856B516L76m038k897K585N146j300o547l98O660K373n839l798M315M717k608
1871A263m406Q77L231J010j422j893k30K857K255l272l932K833N083j822m955
1886b523K35M903M18l800j196K065J659n50j436j003O55K505Q6l541j467L297
1902C07K080k704k597J821K896j274j888m4O51J070N39j200j816J150L265r46
1918A310l526l5L925R92l223j691K586K298j172k219m41J566J808p29k446l27
1934a324L048J298l395k432K613L146j865l078M04K572Q70j882k046O88K061R16
$$ y = [-2947, -5086, 991, 5645, 346, -5093, -1599, 3887, 3072, -2145, -3713, 682, 4061, 2193, -2579, -2996, 1813, 5295, 448, -5311, -1591, 5276, 3870, -3506, -3841, 2720, 4626, -682, -4031, -1434, 2516, 2892, -1146, -4043, -1458, 3688, 2388, -4159, -4557, 2103, 4476, -1363, -5161, -846, 3871, 1263, -3143, -2266, 965, 1975, 553, -1340, -1570, 1287, 3542, 270, -3662, -829, 4254, 2432, -2523, -2288, 2615, 3033, -767, -1963, 102, 1761, 1211, -225, -1228, -573, 1932, 2018, -1523, -2990, 307, 2387, -317, -2914, -1093, 1803, 529, -1359, -1403, -752, 318, 857, -343, -2159, -1009, 2256, 1310, -2216, -2251, 1674, 2666, -557, -2248, 338, 2636, 1464, -755, -1196, 370, 2178, 1449, -997, -1324, 1724, 3022, -373, -2805, -192, 2954, 1089, -1989, -1585, 987, 1857, -25, -2071, -1383, 678, 1594]
1950A594k850j969K614L208j902l936J143L710j16l318p98K985J197j318j443
1965a199k8J791R55n90k356M57L096L18l084j046L211J068k834j361K236J666
1981B300j536j103K75J04K46Q4n63n89N97J287j666j443J823J313j495j299J245
1998d20J141j433p85J543N38j427p77J825j20j173R04P79o67j88Q55j23j173P90
2016H9J632j034j554P66K301r53k326J180J391p14j440L59P52L30k85p84l56L98
2034b48J234n87j865P0K403K56k981l35K273P32j692q22N49J265L92q14j158N58
2052g70J299O37j731j124K186K036j672k688J147K598j58j805p19O99J904k89
2068A550k349n37K271J617j912k923Q18L480R6l519n89K608R71j609j698k75K520
$$ y = [1594, -1256, -3225, -611, 2597, 695, -3241, -2098, 1612, 1496, -1822, -2620, 365, 1562, 244, -1199, -1227, 564, 1519, 929, -1427, -970, 2126, 2444, -640, -1686, 1525, 2593, -241, -1602, 634, 2300, 764, -339, -64, 40, 286, 370, -193, -782, -185, 1102, -564, -2007, -184, 1129, -366, -1665, -420, 721, -712, -1497, 46, 584, -843, -1620, 205, 85, -1088, -184, 595, -72, -260, 595, 472, -701, 89, 1721, 687, -867, -101, 2200, 1247, -1079, 101, 1492, 778, -662, -303, 449, 779, 494, -290, -646, -248, 986, 399, -1466, -1396, 1007, 1263, -1718, -2053, 220, 952, -740, -1562, -1013, 252, 644, -170, -1328, -770, 529, 1166, -565, -1689, 497, 2533, 861, -1827, -680, 1918, 1760, -45, -764, -65, 1839, 1550, -799, -1336, 935, 2552, 640, -2283, -1465, 2015, 2111, -1408, -1997, 611, 1582, -27, -1725, -2000, 520]
2085E20J170j936k704J104L249O25l743j762L610K976l295l040K390L320q70k574
2101i60j438K078K408m36k474p81K472K348k301l685J592M456p13m413n67L753
2117A339J575k410k412L68K914O74k518j962J283L148M08m513j706M085K688l196
2133b35l114K216L066q83k821o79K328K051j457j832l81K113K452j727l573Q84
2149a592L891L38l931p38L153K023k065k758M72K287J263k257j750R37K725J96
2165B194l081j721L059K202k188k623N44L003M26k389j866J373K378k90k415j250
2181b644K525K623j626l606M45L606Q63l005j749K244K849j349k329n60K795J706
2197B788k445k640R66L621P57l882j795L346K150k538k648J236K699M15k532j704
$$ y = [520, 1690, -246, -2950, -1846, 1403, 2028, -1715, -3477, 133, 3109, -186, -3226, -836, 2484, 1614, -960, -2398, -320, 2088, 1652, -822, -1603, 869, 3217, 916, -2769, -1177, 3279, 2566, -1847, -2414, 1339, 2914, 504, -1908, -1540, 1374, 2048, -470, -2432, -1149, 1999, 2407, -2106, -3812, 273, 2961, -235, -3349, -1133, 1933, 1050, -1771, -2450, -122, 1929, 472, -1360, -1741, 372, 2824, 1097, -2476, -1592, 2299, 2637, -1294, -2032, 1121, 3144, 1079, -1679, -1207, 1080, 2343, 86, -1664, -727, 1998, 2194, -887, -2608, 451, 2653, 465, -2158, -1614, 1389, 1815, -574, -2440, -1067, 1311, 1021, -1394, -2644, -119, 2504, 878, -2728, -2283, 1323, 2186, -819, -2568, -324, 2525, 1176, -1153, -1713, 1082, 2788, 343, -2297, -1331, 2290, 3047, -835, -2630, 716, 2866, 328, -2320, -1084, 1615, 2030, -502, -2206]
2213b206J393K496l37k666j207K455K701k513l111J858L264r57l224j35K389J377
2229A577j491j537N73J469O06j439j278P37K370K51k631p69K500J219k178j410
2245a431J342J508p21j209J11J026K21l25j168n61J113J310j030j402Q79J165
2261H28o31j614Q85Q12J86r18K4J59nJ20N81n79p95O36J012p66n05O07O95n10
2281B22o85K95K70P5j22J19p8r5J56L56p38L2L87J90l16n1L13k73L75j46l80j80
2303b74J80K31j94k52K15N74m71p53L85M50K3k73K78j97k89P17r8p10p1O70L34
2324D75n73j22J98N88j77o44j11J92J05O05o36l23M14J018p43j268J66J909k63
2343H10j391l93J171P73q85n75j63O37J95L3j028J20J500Q02k201j468K051J643
$$ y = [-2206, -813, 1683, 1346, -1320, -2527, -72, 2629, 116, -2995, -1137, 2127, 1170, -2054, -2189, 200, 1577, 86, -1451, -878, 591, 1197, -242, -1520, -783, 1587, 1838, -793, -1562, 938, 2157, -21, -1431, -89, 1419, 698, -511, -400, 626, 847, 522, -646, -1207, -94, 1216, 186, -1216, -337, 828, 197, -1417, -532, 280, 466, -452, -428, -269, -274, -154, 427, -152, -947, -311, 701, -65, -570, 37, 732, 222, -463, -168, 102, 177, 55, 174, 96, 1, 157, 513, -225, -193, 194, 384, 68, 17, 330, 57, 432, 286, -94, -274, -94, 137, -57, -309, -94, 480, 9, -744, -359, 91, 114, -159, 119, -78, -367, 350, 252, -458, -529, 141, 475, -98, -220, -22, 566, 389, -255, -366, -174, -69, 536, -100, -423, -9, 1009, 266, -1002, -836, 1073, 810, -581, -974, 197, 970, 85, -490, -653, -16, 179, 212, -816, -696, 804, 1606, -595, -2063, -12, 1631]
2361A631j306j781P61J589K78j555n73J049Q14R9j458o94J113J640q37k316L24
2378a222K189M48j987j218K012J276j011j954M48J788M38j211j285O69J954K60
2394A594k183j040J943J707j608k481J012K262L47j851j013R51J474m06j319p77
2410a388J388J816j047k231j05K434Q20k184j292J418K036o37j987l68J418J807
2426A898j525k252O69K305Q00k620j339J782J898o12k615L96J995J190j530k416
2442a976J071K411M12k408j910K133K742j487k823K64L289N24l009j637J865K495
2458A956l94k992l69K143J805j668k710O56L280L74l157j906L108K530k510k553
2474b407R72K566L67j772j392J200K280k68k867o54K135K319j565k954Q90L190
$$ y = [1631, 325, -1456, -695, 894, 1172, -383, -956, 93, 907, 1006, -452, -1146, -33, 1607, 770, -1546, -1222, 967, 1415, -572, -1790, 222, 1498, 487, -1467, -1019, 769, 1207, -4, -1289, -620, 1334, 1594, -589, -1629, 314, 2021, 413, -2068, -1056, 1206, 1553, -298, -1311, -360, 1114, 708, -611, -1388, 0, 1816, 769, -1462, -1567, 867, 1687, -497, -1789, -371, 1665, 1028, -959, -1327, 91, 1898, 373, -1879, -1210, 1095, 1895, -725, -2064, -282, 1616, 1004, -1611, -1215, 780, 1970, 440, -1976, -905, 1506, 1918, -490, -2400, -267, 2475, 988, -1835, -1571, 1718, 2242, -767, -2404, -539, 1956, 1562, -1430, -1799, 344, 2149, 481, -2229, -1573, 1707, 2081, -1076, -2982, 126, 2656, 146, -2407, -1435, 1131, 1498, -274, -1666, -466, 1814, 1546, -1321, -1975, 160, 2479, 914, -2040, -1150, 2040]
2490B040k87k838p66K452J484j446k012O26J913M25j818j114N84J532K44k043
2506a024q08K448J113j739j775J019J518J12j345r15J393P66q27q54J59P61P54
2523G56l50j675Q38J529l13j312J06K12R63k22r08J93P78O1k03l53m55Q12O63
2542A120r55j146J207N11k59n21l60M22O26n06j050J16R04K45o46o69J45J280
2560D64k23j293K88R15r2N0n70k79R69N39p70n90N48O92L81j166m76Q83R26j256
2580f0n34R33L91j85k41m33o6P82k72p20L97J22lK25q89m0J189n99j018P00M49
2601A28n84J09K57m23J13J50p3K3J55m27Q14K5o48L08M77r49M52O04p28K5P46
2622E54o8k29l21j86R12K18j702L58J747q95o09K09j5j08R51r24j261J499M69
$$ y = [2040, 1753, -1085, -1851, 601, 2085, 639, -1373, -747, 1166, 1591, -227, -1341, -757, 775, 1019, -1024, -1832, 616, 1729, -10, -1785, -766, 752, 864, -481, -1396, -3, 763, -64, -918, -759, 2, 756, 406, -1269, -431, 1098, 785, -527, -421, -209, 754, 532, -376, -183, 595, 656, 453, 100, -355, 457, 1120, 165, -981, 226, 737, 478, -43, -403, 19, 645, 139, -911, -795, 109, 354, -292, -961, -816, 464, 241, -1052, -764, 151, 59, 109, -461, -740, 229, 768, -2, -592, -44, 648, 1029, -137, -613, 270, 1196, -60, -594, 339, 730, 545, 304, -129, -195, 587, 315, -405, -8, 114, 111, 336, -553, -593, 596, -3, -1021, -321, 128, -456, -347, -90, -513, -400, -250, -323, -300, -145, -572, 242, 267, -381, -73, 404, -545, -93, 511, -217, -192, 554, 486, 257, -64, -250, 662, 880, -822, -464, 1283, 388, -221, -12, -27, -135, 816, -108, -1369, 130, 599]
2641E99o96m64m04N94J487j492p73Q26Q16o35m27l00L95J047q1j864P73J648l62
2660F87r39m35K36J543q7k087L58J899k84o57o17n1J450N48k030p71J794K89o71
2679A75o16m95J309J256k009j563K086N77k93q66j016Q17K071j040k383J025J916
2696I51j43j306p01N01K281p09k621R67J843m28j69r55n63K528K66k263q16J769
2714D32R66m39j703p28K690R42k881j157K598L69n19p73j208J347K302k060k243
2731b065J387J299L94j438j581J360K833j597k651J047J763j52p29j074r1K653
2747A358q8k617K65J475N79m2k090k72L191K91l049m49K021O93k50j659o57K056
2765G56J012j976j012J091N68N97j121j583J151K442j742j677R08N55O98m46j693
$$ y = [599, -97, -561, -965, -371, 1116, -376, -1149, -323, 493, -142, -569, -869, -474, 573, 492, -1372, -599, 1049, 687, -252, -687, -451, 1092, 1005, -1082, -724, 1175, 891, 234, -383, -434, 1016, 1564, -466, -1237, 557, 846, 175, -441, -936, 373, 1629, -380, -1943, 143, 720, 427, -439, -1455, -638, 1433, 393, -1990, -965, 951, 808, -498, -1199, -698, 1583, 874, -1747, -780, 1063, 635, 466, -489, -1052, 1476, 1742, -521, -1337, 432, 1398, 959, -744, -1472, 1218, 2160, -721, -1878, 720, 1089, 570, -203, -1411, -64, 2238, 178, -2065, -678, 621, 1015, -423, -2004, -644, 2189, 592, -2059, -1012, 751, 599, -130, -1204, -1295, 1358, 1270, -1347, -1082, 393, 972, 930, -1160, -1432, 1759, 2050, -999, -1448, 573, 1266, 1016, -643, -1300, 756, 1768, -208, -1220, -129, 439, 1036, -85, -1668, -517, 1925, 183, -1494, -586, -31, 667, 221, -1472]
2782a472K04K460m32j872J98Q65R01r2j591m54K499k63j739L60N30K76P99j465
2800b88j296J969J146j306p53K61M82J309j028j834J057K031j538q67L18K21Q52
2817G36K19k162K30K056n69j262r3J86J401P6k219J71J969l16j145J01M18K34
2835C1Q95j152j065J581Q22j231j28j20L58J585j474j635K202P15j391m73M71
2852iK28N84n85j294J083R78q38m12O5m36J229o7j663N38J663j266m61N92k49
2871c20L03L64j081K18J095o87j47M33l86k26R48q30n12J477j88j115R63j99j70
2890f0J90l1l57P70l93o72J011j84p42N62K03n92M42J83r42P02M13j021M13J80
2910G5n01N08J95q41Q4R95p80l14M82k03M70K45j024LJ642p66r10N12J11j3O17
$$ y = [-1472, -1268, 1192, 760, -1112, -914, -49, 852, 760, -831, -1285, 1214, 951, -788, -428, 102, 378, 1177, -288, -1584, 385, 1531, 225, -528, -267, 215, 1524, 496, -1338, -281, 1750, 212, -655, -337, -116, 736, 955, -1207, -977, 1079, 510, -752, -845, -659, 742, 818, -1401, -1230, 739, 423, -722, -621, -203, 31, 926, -226, -1291, 290, 1112, -119, -247, -367, -9, 1576, 102, -1533, 669, 1384, -7, -480, -9, 219, 803, 218, -1076, 7, 985, 147, -265, -200, -636, 593, 526, -1137, -599, 1064, -202, -663, -71, -320, -17, 347, -734, -516, 579, -108, -255, 178, -208, -434, 514, -316, -828, 649, 461, -654, 309, 110, -60, 130, 99, -258, 512, 119, -553, 458, 274, -468, 94, 297, -295, 147, 330, -612, 90, 503, -518, -105, 75, -426, 82, 277, -564, -480, 515, -265, -579, -97, -300, 170, 415, -609, -606, 1036, 270, -640, -128, -17, -30, 587]
2931E87j131J11J442m97q45M38l1q5P76p29r27J260K84q76k9J28K15M04n49j065
2951a119J103J019r19m46J91k93J048m2j688L70J704n45p78l28N46R12m9j780
2969a094L48J670m22n80j13n24J108P98j541p81J170J310p89j121k14R21J350
2986A496j329j745J455J360r74o32m88P20J376q34j556J89J708p6p92j029O14
3003e37J510mk151K79J782K45j445l61j15J400N22k012n67J508P98m42q67n17
3021i74J283R36j347j004J055R65n77p80l29P75J245j038j628P91J270J22r06
3038a41r05M08J531n3j445m66J506M05m67j016l08J502O31j426j033J093J271
3055A087l46j075p65J405Q48j435j084R12J005L89r38j315Q94J721o47j678k04
$$ y = [587, -544, -433, 1009, 512, -333, 105, 74, -11, 765, 36, -891, 369, 653, -223, -252, -124, 91, 495, -54, -1119, -16, 1003, 84, -362, -171, -464, 584, 542, -1146, -776, 928, 383, -395, -723, -177, 735, 686, -1094, -746, 924, 502, -78, -191, -715, 393, 1191, -350, -1131, 39, 1349, 560, -561, -775, 146, 1496, 167, -1578, -123, 1237, 263, -369, -857, -137, 1239, 405, -1151, -962, 746, 670, -122, -1151, -537, 973, 969, -1182, -903, 879, 1124, -321, -682, -797, 603, 1125, -887, -1454, 54, 852, 410, -457, -974, 309, 1245, -102, -1106, -51, 914, 337, -443, -772, 3, 1248, 210, -1418, -627, 643, 765, -141, -1046, -638, 893, 840, -605, -1071, 435, 840, 373, -643, -951, 551, 1182, -244, -1277, -184, 1087, 741, -334, -1099, 306, 1154, -281, -1365, -453, 552, 941, 3, -1312, -418, 1303, 656, -1022, -1226]
3072a226J511Q93j187j553R49J821j54j634o36J138J158n22j328k84J913M26j663
3089c78j010J093J785o30j704l21J930O44j404j208J341N94K84j186p52J035J238
3106A351q88j349J50J303P52j382j399J189J347n39j829L71J390M74j062q50M62
3123e09J237j19j279r5Q27J066p16j143N4J462O3j125n22N65J056n83o81o2J234
3142G30J8r11m12N23N25j25m60n11P26L04l20m97J61L14J57m47l01M03J00K63
3162B40n49P1K52j46k61K58J4J85p2o3J11rP0J11k16p3q1K86J55j58N8MM8m06
3186a71K96k20J84j01O46m27n26N2N42j61n20J15J83L47m61j13K28J21k57l5p2
3207c50L3K04NK22m57n7K86J04l46O1M99Q6o4k82Q2q1L17j29l40O4M27K94l88
$$ y = [-1226, 285, 1178, -9, -1562, -613, 1208, 1054, -580, -1216, -78, 1080, 558, -770, -1054, 859, 1285, -378, -1388, -295, 1490, 860, -844, -1165, 765, 1409, 5, -1203, 138, 732, 1016, -170, -922, 113, 1351, 463, -886, -736, 567, 1319, -63, -1462, -273, 1074, 535, -1294, -923, 467, 941, -121, -971, -509, 728, 609, -670, -765, 62, 1128, 412, -731, -677, 785, 848, -277, -799, -234, 822, 239, -442, -504, 730, 748, -163, -575, -52, 473, 348, -112, -623, 103, 407, 87, -410, -249, 65, 222, -225, -526, -123, -23, 240, -309, -238, 14, -132, -393, -135, -121, 64, -8, -71, 40, 31, 101, 212, -4, -77, -158, 128, 283, 125, 183, 187, 235, -171, 125, -95, 89, -12, 634, 207, -319, -267, 275, 114, -406, -291, -108, 239, -222, -335, -107, 14, -243, -278, -350, -317, -113, -108, 114, -343, -400, -114, -10, -356, -295, 204, 290, 226, -56, 26, -55, 262, 133, -207, -143, 284, 578, 190]
3230A90m70M23M41l03o48n7Q50J72r00p8K94O5M67o93j45K47M28Q1q91j32Q14
3251A55K91j70j370L43J190P1q84k33O74M60l80j110L49J004N00r67o32M52J258
3270A001m57p06m03P27J024p07q68K32J160L0j193q96P34J302k91j123m79J109
3288A96K24p27r60O78J231J6j050p77R47R00m71j353K41J256K76r32p80P49J150
3307H14j5j080p75J336N29j59j156j75J612L08j184j307J050J604p82j384l3J167
3325C70Q70j166q91M81R48N2j081n03O48J328m76j381l14J183P95q85j282Q21
3343d83J563l24j512o58J547O28m00j243m1J670M30j307o80O69J094J41k122K6
3361a002J569J170j508j151O29J317p6j246n77J134R81n84j353q0J143N03r15
$$ y = [190, -280, 143, 584, 281, -367, -424, 426, 598, -302, -380, -86, -21, 446, -247, -392, -145, 283, 364, -527, -659, 155, 446, 276, -1094, -751, 439, 510, -374, -607, 67, 527, 147, -963, -614, 390, 890, -77, -709, -257, 1001, 544, -162, -565, 162, 1186, 479, -389, -157, 1003, 1033, -160, -1056, -322, 980, 689, -434, -913, 196, 420, -307, -1267, -589, 642, 658, -392, -1169, -222, 678, 207, -1146, -905, 351, 627, -305, -1085, -336, 814, 799, -281, -1056, 280, 809, 650, -506, -681, 931, 1239, 55, -1252, -202, 1402, 620, -764, -797, 370, 1240, 74, -817, -336, 612, 664, -417, -920, -272, 1056, 580, -801, -1115, 68, 863, -22, -1304, -483, 1080, 756, -756, -1414, 133, 761, 361, -882, -923, 747, 1177, -130, -810, -141, 953, 1094, -1028, -1002, 567, 1737, 229, -922, -293, 1024, 948, -298, -875, 259, 1240, 656, -697, -777, 366, 869, -46]
3378d6q92J85J680m61j109n17J251P52j074r30N56J328o5q49r08R23R39m25q68
3397e30j73R54M21p06l97J75Q36K06j009o08Q43Q69m15q94K11O75K93r93l31M43
3417a30O06K36r35k22M69L69P1q26j78N90L32o71n02L76Q36n9o46l93M24M02J33
3438B82p20J46M77K65j79q90L49Q26k1n50k82N26N64n62n93L37L96j37m25K24
3458C3L33q4m6n11k13K89K59j56k44o8M45J26n64Q1N01k27j54l23N22P6Qk93j8
3481b28q1J48M5j72M07j7K33k47k19K25K30m17K63K78k51k43K65k64L40j51n9
3502H5J19l2j05O3j52l2M56l31n9k31J41L14l22j41M22l9j48o46K44M44K27m21
3524a44m92N34N24j45p82J39O77P2o24k83M05Q54l35o40l45N52K94J36p65J87
$$ y = [-46, -938, -753, 927, 466, -643, -1160, 91, 843, -231, -1161, -605, 723, 658, -191, -1099, -176, 763, 338, -530, -703, 251, 672, -34, -431, -256, 580, 786, -223, -831, 12, 881, 466, -428, -217, 458, 751, -242, -573, -130, 476, 712, -223, -445, 24, 393, 464, -362, -540, 50, 382, -289, -791, -415, 421, 362, -284, -677, -253, 149, 282, -438, -292, 185, 450, 271, -619, -270, 556, 535, -15, -297, 229, 793, 231, -362, -25, 371, 234, -191, 33, 366, 282, 236, -275, -488, -199, 60, -96, -340, -408, 37, 163, -401, -320, 181, -46, -200, -523, -1, 75, 83, -210, -228, -309, -161, -116, -288, 119, 102, 335, 88, -131, 94, 324, -93, 170, 448, 197, -46, 219, -45, 295, 144, 85, 204, 172, 67, 130, -22, -54, 402, 71, 12, -219, -78, 236, -86, -227, 195, 156, 8, -638, -394, 50, 277, -144, -636, -102, 422, 277, -505, -366, 311, 383, -241, -524, -119, 735, 400, -240, -585, -33, 261, 397, -368, -181]
3544a81M83N25j006n87P44L98j66m38j40M93J67k00o26J81O79k22l73l11M53O75
3564E48j45j101j35P70O21n07q37P47O30k1p34k82M08N91k36p06k12R62O89j125
3584g5q00O31J060k42j119j87Q30Q59p03j112K22J072j44n56m96N58R14k06j016
3603e10k40R01Q01p56j097L59J190J97j084q15J364N85l88j351J71J059L80o93
3621G3j106P76R75k7j113n36J465N46p32j226M11Q64L37j030n98L99J359k24j332
3640g19m9J048N97j140l97L76J046n8j148m35J033N58n36r23p0J021N87j228l12
3659g49M50R59l69r61j38Q30Q01n01r81Q7P96L60o72n47M61Q48k22q73k45Q93
3679B27P01r62l70o6R57J0o56l61L75O95k87p52P1K48J041m60j119K64R07L18
$$ y = [-181, 302, 827, -179, -766, -22, 376, 210, -228, -368, 125, 292, 92, -534, -353, 326, 104, -269, -580, -127, 548, 403, -698, -833, -63, 558, 51, -786, -39, 591, 570, -164, -446, -38, 553, 317, -389, -601, 361, 1050, -75, -875, -244, 816, 574, -545, -732, 98, 957, 254, -858, -636, 436, 292, -264, -760, -202, 712, 506, -510, -750, 151, 952, 196, -901, -542, 648, 845, -239, -1054, 310, 895, 507, -844, -673, 386, 766, 73, -1033, -257, 718, 691, -422, -958, 507, 1053, 321, -905, -494, 370, 707, -323, -921, -522, 837, 613, -719, -768, 280, 877, -263, -660, -284, 762, 704, -444, -879, 154, 712, 176, -747, -817, 204, 791, -437, -749, -299, 660, 291, -670, -808, 22, 823, 322, -659, -572, 224, 584, -88, -635, -174, 674, 452, -421, -666, 227, 928, -34, -404, -470, 487, 497, -159, -520, -145, 550, 263, -489, -418, -170, 871, 411, -708, -444, 463, 781]
3699G81r21o28O40Q93k58r75j18Q62K93l60q86M31P65j73p01k43O82N55l68j121
3719h50K17J227J1p58l04J78Q89m31o33k9O99n8O3r47L37P85L49r04p76J024O25
3740G14n75n71J73Q65Q6q73n16O97P14l57q03M16L80J10n27p5K2L71j26o29N66
3761F2j14N24l08m91J6P41m53m30J67L09J70L6o64M55K16l10L0K04o4k35K40l0
3783G1L6K02N0m15k88N00j44j56K97J60J36l39l36K18J70k99Rj20L14pk17r2J34
3806a16J93l83q6L5K61K64j78j83j46Q10L4o29l24N32K38l25p3J53L80k81l40
3827a64k99P23m6J47l31k11M60K14k37n77L36M65J60p67mK63L02j25m07j28L26
3848A00K17j75q82M03M62L07p84q8K04N68j93m38j98Q26K12p00l31L48M18k04
$$ y = [781, -140, -768, -128, 765, 507, -468, -586, 276, 569, 209, -677, -246, 519, 346, -355, -598, 84, 639, 271, -850, -633, 594, 605, -153, -457, -279, 610, 179, -454, -483, 216, 158, 221, -726, -389, 396, 745, -159, -935, 89, 714, 139, -432, -259, 606, 692, -181, -697, 0, 714, 357, -446, -30, 350, 460, -67, -142, -120, 251, 125, -504, 62, -52, 472, 164, -327, -311, 430, -23, -453, -286, 23, 193, 229, -435, 20, 236, -74, -44, 160, 96, -139, 101, 71, 107, 309, 359, -56, -344, 156, 12, -144, 153, 313, 449, 110, -226, -8, 162, -137, -128, -248, 66, 59, -158, -250, -116, 77, -306, -392, -357, -96, 168, -10, -193, -339, 471, 505, -124, -448, 84, 322, -3, -76, 77, 457, 176, -164, -463, 260, 214, 361, 30, -181, 279, 493, 256, -321, 15, 480, 640, -127, -131, 132, 434, 309, -98, -226, 100, 317, 142, -740, -337, 125, 432, -352, -440, -236, 332, 139, -299, -497, 329, 541, -159, -490, -142, 276, 72]
3868G2m30j97R00L3k74n72K14R44L6o62n70N45P14m97o18r5P78O74q70r57P63
3889f9O37J14j020l49N75N82m02m40k55Q67L33p09n36M14Q80l5j187l66J288J24
3909D46p00l94J95Q01O20j164m43N10R28j84q46n11Q47O06m97q54M87P81k07r12
3929d91j51P15P16k06j079j83J008L82r70j85p2R14O0r02l30N44O96j39q24j72
3949f69Q90N08j309q2O00N87l41n54k78O18J030p39j068N64P49j85n35o2nJ119
3969H38J7j493K20J137j3o79m32J30R95k1r31n34Q21N31m19n79j79J264N2j056
3989c31m77P68N36n67m67j78Q25P81r33p00L74Q68j03m25p58O07J014n56p53J60
4009c15P58n9j71p15P8J075j24j040K28P02O4l92k79j52P26m9k78n72O04m6L3
$$ y = [72, -358, -555, 345, 378, 104, -468, -254, 690, 726, 64, -506, 39, 753, 256, -362, -457, 321, 995, 125, -832, -69, 568, 682, -338, -687, -112, 470, 68, -372, -627, 240, 573, -136, -672, -258, 622, 587, -600, -966, 322, 446, -254, -648, -453, 348, 968, -196, -639, -129, 799, 615, -231, -742, 105, 711, 214, -640, -153, 628, 421, -491, -642, 73, 789, 583, -496, -679, 329, 711, -259, -444, -516, 398, 458, -444, -774, -230, 466, 327, -497, -669, 221, 729, -580, -662, -62, 525, 184, -370, -648, -30, 1000, 261, -807, -243, 506, 321, -214, -276, -281, 838, 855, -638, -418, 719, 706, 27, -405, -275, 720, 699, -232, -766, 55, 586, 167, -412, -591, 673, 725, -331, -808, -40, 496, -71, -538, -716, 109, 890, -43, -743, -369, 499, 396, -29, -787, -180, 834, 278, -475, -315, 443, 384, 213, -502, -424, 651, 527, -513, -285, 417, 481, 89, -190, -342, 384, 335, 57, -515, 89, 43, 76]
4030G6m7m90L65L69n06m15O07L3P1l13l83L10N41j51m23K80O1J03K76m64l57J094
4052F37Rq06J73J55K8L07k87j69K56J9k95p2K38k93M19r9p09L49N42m47M6k04
4074b03m5J32M7k73P7L57l96r9J94Jj62M48m88n7Q31m79J98r1l61Q9M55k36m11
4097d72O87r0n14N42l4k06J44l1k72N96k10l77L96K21q74M55L56o68M94j21l95
4118c73L28L14m75J59J74k79L26k79l36L87L15l97m36O93O8k48K17p64L82Q02
4138E78m26l60M08k61M82j39q67k8J225k66p36K40K49N0J73p29L2R22p5r33N9
4159d02Q21j66J49o14k95O36N82j091m4K60N20J13n56o06O70P77q90n04O80J14
4179A54N02p06p70O53O89n68n75K58M06L84K7q05j96J352k35j080oM38L92J70
$$ y = [76, 29, -461, -96, 273, -233, -648, -41, -8, 63, -250, -633, -323, 218, 67, -356, -76, -15, 88, 364, -100, -457, 637, 646, -160, 13, 168, 196, 503, 216, 47, 303, 322, 27, -45, 193, -100, 319, 220, -489, -140, 402, -45, 1, -203, -248, -116, -69, -342, -265, 92, -304, -403, -209, -208, -370, 78, -410, -467, 364, -115, 83, -8, -369, -280, 175, -61, -472, 215, 125, -389, 153, 119, -87, 57, 26, -246, 350, 140, -237, 159, 380, -494, -39, 317, -351, 143, 22, -373, -45, 269, -206, -47, 127, -152, 174, -105, -441, -54, 261, -136, -572, 121, 189, -59, 158, -606, -224, 578, 152, -208, 200, -61, 421, 282, -585, -613, 612, 346, -390, -150, 99, 149, 322, -407, -375, 547, 472, -461, -402, 419, 253, 402, -212, -507, 129, 711, -380, -424, -164, 356, 469, -87, -693, -23, 754, -136, -640, 40, 154, 656, -50, -820, -167, 522, -46, -621, -363, 43, 427, 454, -351, -547, 805, 570, -510, -516, -78, 314, 484]
4199D84r66l06J104L83r78j10J12L98M28o15r47J103N74q15l46K28J20O35m94
4218hr81P70Q98o44n33k6M23Q81l22r07MR80Q6q65k46J35R46K36j206k47J152
4239E26J45p69m84M01N98K88r11p37J284M93o64o33k3O63P23r43q87Q48P58p69
4259i3j84j35j30J032n04p39N80Q10m38n69O6k7R98j22j014N1J014J35o56k75
4279b00q4P68K76j283QJ019J2p49l33N49J29L25o38l66Q13J90n12Q1m95K71Q51
4300F32m68o97M29L19j1j44k00o1N11r4o50R4M58J88j85r5m88L44M59o79j75M45
4322f8J43L38n56m90O72M74m06n30K70L92j57q5k47L50M89m53o07N09J48M4j25
4343A05o00o1Q65P5q32L01K72K5K00p28p8N98J77m23j35K61j53M51k03n57M17
$$ y = [484, -482, -788, 316, 699, -279, -389, -277, 121, 549, -66, -1013, 90, 664, -151, -497, -269, -149, 486, -8, -989, -219, 679, 35, -498, -524, -101, 780, 458, -449, -445, 535, 621, -244, -490, -355, 591, 827, -379, -626, 526, 671, -98, -582, -181, 417, 705, -206, -943, 341, 834, 170, -463, -486, 177, 900, -43, -930, -82, 676, -93, -277, -412, -542, 490, -14, -753, -173, 637, 199, -370, -304, -331, 667, 545, -469, -418, 596, 731, 75, -200, -284, 484, 760, -523, -515, 504, 516, -233, -566, -17, 112, 437, -201, -567, 246, 436, -76, 5, -490, -219, 632, 164, -533, -104, 215, 204, 60, -140, -201, 310, 216, -434, -340, 118, 306, 121, 26, -462, -118, 341, -338, -513, -68, 75, 413, -143, -633, 39, 513, 107, -423, -153, 239, 82, -3, -250, 100, 589, 136, -471, 38, 186, 230, 105, -495, -556, 309, 384, -448, -147, 125, 150, 350, -378, -456, 142, 319, -104, -239, 22, -131, 320, 117, -440, -23]
4364b3N89q60m0J39M39o3k08j43K96n2m16q5O46m03K64l87j16M46K6j53n0J46
4386hj77J31K73l04P5K76k22j88L88Kl10Q8J96r0q8j58n5L47r9k05q0L58q3j40
4410g3O3k16K00L07n36j56L74K26j58j06l87M43L39o50l46O94L68l24Om90M75
4431E3K83l57l60L18L57n2j75k30L6Q26o54n45R6P34j44r3k80l25P71J13p20J73
4453a75K47K46j29o13QP21J95p77j86M22L25n6m58l17O53M14o92l87L04N18K85
4474E48p46k90N19P21l91o04j86P74K03o44m38M48O68l26o38k24Q26L07m36n76
4494d85P9Q06j10l23n11L52L46J93o37k48N04N38l46q24L74N84Q6q40j49Q87K39
4515E15m65m77m5N64M17m96o03N73Q54m83o10k55M58P34l21r36J66O69M01n80
$$ y = [-23, 566, -294, -334, -195, 244, 181, -27, -170, 126, 74, -342, -427, 219, -184, 80, -307, -423, 23, 49, -104, -154, -8, -185, -54, 219, -85, -10, 266, 44, -144, 244, 246, -64, 24, 220, 130, 42, -116, -171, 176, 77, -128, -208, 150, 67, -73, -10, -226, -26, 281, -255, -411, -37, 189, 31, -75, -462, -19, 320, -330, -676, 18, 386, 62, 68, -422, 53, 336, -21, -381, -63, 294, 242, 67, -163, -127, 699, 45, -500, -404, 330, 186, 93, -187, -512, 259, 372, -348, -175, 72, 318, 189, -424, -416, 305, 500, -277, -463, -41, 284, 228, -230, -547, 106, 520, -172, -559, -255, 263, 548, -198, -488, 31, 752, 361, -243, -429, 345, 548, -96, -534, -86, 582, 256, -382, -606, 220, 527, 91, -485, -406, 400, 290, -33, -544, -192, 154, 347, -290, -538, -34, 504, 158, -666, -292, 292, 378, -462, -611, 276, 515, 50, -427, -472, 92, 509, 13, -590, -17, 837, 354, -256, -511, -53, 681, 360, -576, -410, 259, 660, 80]
4535H0o12N02M64r2p06l00J156k0l09o48J29O77J1p64k27N53M70j35q99M0O72
4556D2N42p93l74M53N47j27m01l81O63M21k11p99j1O79K96l66o09M28L35Q3m24
4577gl24N00M22n10m72J47O61K01o02n40L01N38J41p63k82O52J94l94l73K51N18
4598B59j7l67l72K85O80m9n98j30N03K61m56o89P80K94P1o74j22L75K34k58j74
4619a64J9N60l9m99k04K49M26k70n11L06J75L0Qn61K84L68J12o00l29P50K56l89
4641b3l00K49K35r6Q9k54K99n5o3k53j37K48J89L8o3j17K75J7Q4m12K41j01J28
4664B18j68j03K19J99k91J9j39J86n0k92K09k39K17P6k04j99J38O5n1K25j57q6
4686b08O8K03k22j11Q1J56J19k47J24J19j09M0j31j15L05p0OJ91j06J49l0J75
$$ y = [80, -532, -30, 434, 342, -364, -664, 492, 472, 163, -485, -356, 321, 332, -432, -659, -106, 364, 229, -670, -630, 42, 584, -209, -583, -130, 417, 290, -111, -492, 171, 592, 381, -418, -429, 250, 546, 180, -429, -1, 334, 417, -7, -331, 169, 591, 81, -391, -244, 417, 618, 16, -524, -223, 315, 456, -307, -589, 63, 257, -137, -510, -259, 259, 242, -125, -497, -212, 468, 419, -179, -309, 194, 455, -1, -690, 90, 384, 455, -219, -341, 34, 268, 10, -164, -145, 415, 376, -123, -327, -78, 348, 78, -433, -127, 48, 78, 86, -475, -191, 177, 289, -311, -640, 110, 366, -23, -323, -74, 161, 65, 154, -100, 199, 144, 81, -172, -309, -61, 128, 166, 103, -14, 261, 278, 362, -50, 191, 90, 218, 50, -53, 166, 365, 74, 93, -46, 140, 90, -202, 7, -232, -15, 61, -143, -342, -204, -139, -190, 35, -122, -208, -140, 63, -159, -270, -189, -33, 86, -161, -37, 82, -27, 13, -118, -233, 72, 2, 8, 199, 93, 242, 212, 387]
4708C87l77j63K00L0j85m1P7K25k70Lq5K31M2q0l9q8k6J77j92l26K48J25L52m02
4732a77j68M02k9R6m31J95Q6K50j58k99L01L03k28k21j53O30R5k68n19L6N74J23
4754D40m98j06K02L72l43l62j2L95L20m68k25K23L17k67j33l71N98M32k48p35
4774d69P0M73J35k38p50P29M17k33o45K43N91P7m04m43Q9P88K30q21j06L47M06
4795D86l01o33O8N54M92o88n46N18M52J58p90k71N30N06m00o53J69Q06k00o65
4815d08k67L96Q48m29n91l87J006N21q88m39M55N36j92l44m48N28O65k70m73m7
4835b28M17K72k24q53M18O59Ro82l25N54M95l79n87K92L39K28p26m1K40M32P0
4856C80n83k02N55K69k82q52K58P95K10r42m46N98Q90j66q78j4N28N01m96q20
$$ y = [387, 10, -153, 47, 77, -108, -149, -72, 153, -117, -114, -199, 32, 74, -6, -45, -133, -159, 18, -174, -500, -252, -127, 225, -177, -345, 57, 28, 124, -307, -112, -26, 224, 66, -233, 68, 371, 143, -78, -231, 399, 494, 226, -293, -257, 317, 440, -58, -164, 38, 410, 67, -295, -307, 88, 408, -60, -285, -62, 255, -12, -145, -516, 82, 514, 266, -469, -399, 74, 209, -29, -779, -50, 367, 134, -511, -268, 323, 400, -4, -447, -358, 430, 660, -161, -267, 80, 486, 185, -448, -380, 174, 666, -22, -568, -50, 402, 560, -230, -501, 29, 535, 135, -518, -349, 457, 257, -408, -675, -279, 569, 140, -451, -838, 168, 689, -199, -638, -183, 353, 161, -183, -631, -103, 562, 292, -181, -228, 189, 461, 237, -616, -198, 461, 470, -212, -537, 17, 512, 133, -454, -162, 177, 405, -321, -362, -122, 310, 380, -203, -405, 150, 419, 137, -715, -457, 338, 548, -394, -840, -242, 648, 482, -396, -410, 118, 619, 123, -697]
$$ [...]
8191h2
##END NTUPLES=NMR FID
##END=
