##TITLE=1H_LY-7Dix 51.B
 CD3CN, 8 sc, 
 13.05.2021
##JCAMPDX= 6.0         $$ Bruker NMR JCAMP-DX V2.0
##DATA TYPE= NMR FID
##DATA CLASS= NTUPLES
##ORIGIN= UXNMR, Bruker Analytische Messtechnik GmbH
##OWNER= root
$$ XWIN-NMR		Version 3.5
$$ Thu May 13 09:36:57 2021 Russian Standard Time (UT+4h)  she@DPX200
##.OBSERVE FREQUENCY= 200.131506
##.OBSERVE NUCLEUS= ^1H
##.DELAY= (6, 6)
##.ACQUISITION MODE= SIMULTANEOUS
##.ACQUISITION SCHEME= undefined
##.AVERAGES= 8
##.DIGITISER RES= 18
##SPECTROMETER/DATA SYSTEM= spect
##.PULSE SEQUENCE= zg30
##.SOLVENT NAME= CD3CN
##.SHIFT REFERENCE= (INTERNAL, CD3CN, 0, 15.7039)
##AUDIT TRAIL= $$ (NUMBER, WHEN, WHO, WHERE, WHAT)
$$ ##TITLE= Audit trail, XWIN-NMR		Version 3.5
$$ ##JCAMPDX= 5.01
$$ ##ORIGIN= Bruker BioSpin GmbH
$$ ##OWNER= she
$$ F:/spectra/data/she/nmr/H-F/1/audita.txt
$$ ##AUDIT TRAIL=  $$ (NUMBER, WHEN, WHO, WHERE, WHAT)
(   1,<2021-05-13 09:35:43.14 +0400>,<she>,<DPX200>,
      <created by zg, POWCHK disabled, PULCHK disabled
       configuration hash MD5:
       00 E9 B6 7A A2 85 ED C7 34 08 36 98 17 FE 4E 26
       data hash MD5: 16K
       A6 87 1A AD 3D 9D 8A 1C DC E1 4C 0F 05 84 E6 C5>)
$$ ##END=
$$ 
$$ hash MD5
$$ F1 FD 20 6B AB EA A8 A2 35 41 AE D0 DD 1A 63 0D
##$RELAX= 
##$RELAX= 
##$RELAX= 
##$RELAX= 
##$RELAX= 
##$RELAX= 
$$ Bruker specific parameters
$$ --------------------------
##$DU= <F:/spectra>
##$EXPNO= 1
##$NAME= <H-F>
##$PROCNO= 1
##$TYPE= <nmr>
##$USER= <she>
##$AMP= (0..31)
100 100 100 100 100 100 100 100 100 100 100 100 100 100 100 100 100 100 
100 100 100 100 100 100 100 100 100 100 100 100 100 100 
##$AQSEQ= 0
##$AQ_mod= 1
##$AUNM= <au_zg>
##$AUTOPOS= <>
##$BF1= 200.13
##$BF2= 200.13
##$BF3= 200.13
##$BF4= 200.13
##$BF5= 200.13
##$BF6= 200.13
##$BF7= 200.13
##$BF8= 200.13
##$BYTORDA= 1
##$CFDGTYP= 0
##$CFRGTYP= 5
##$CHEMSTR= <none>
##$CNST= (0..31)
1 1 145 1 1 1 1 1 1 1 1 1 1 1 1 1 1 1 1 1 1 1 1 1 1 1 1 1 1 1 1 1 
##$CPDPRG= <>
##$CPDPRG1= <>
##$CPDPRG2= <>
##$CPDPRG3= <>
##$CPDPRG4= <mlev>
##$CPDPRG5= <mlev>
##$CPDPRG6= <mlev>
##$CPDPRG7= <mlev>
##$CPDPRG8= <mlev>
##$CPDPRGB= <>
##$CPDPRGT= <>
##$D= (0..31)
0 1.2 0 0 0 0 0 0 0 0.06 0 0.03 0 0 0 0 0.0002 0 0 0 0 0 0 0 0 0 0 0 0 
0 0 0 
##$DATE= 1620884142
##$DBL= (0..7)
120 120 120 120 120 120 120 120 
##$DBP= (0..7)
150 150 150 150 150 150 150 150 
##$DBP07= 0
##$DBPNAM0= <>
##$DBPNAM1= <>
##$DBPNAM2= <>
##$DBPNAM3= <>
##$DBPNAM4= <>
##$DBPNAM5= <>
##$DBPNAM6= <>
##$DBPNAM7= <>
##$DBPOAL= (0..7)
0.5 0.5 0.5 0.5 0.5 0.5 0.5 0.5 
##$DBPOFFS= (0..7)
0 0 0 0 0 0 0 0 
##$DE= 6
##$DECBNUC= <off>
##$DECIM= 32
##$DECNUC= <off>
##$DECSTAT= 4
##$DIGMOD= 1
##$DIGTYP= 9
##$DL= (0..7)
0 120 120 120 120 120 120 120 
##$DP= (0..7)
150 150 150 150 150 150 150 150 
##$DP07= 0
##$DPNAME0= <>
##$DPNAME1= <>
##$DPNAME2= <>
##$DPNAME3= <>
##$DPNAME4= <>
##$DPNAME5= <>
##$DPNAME6= <>
##$DPNAME7= <>
##$DPOAL= (0..7)
0.5 0.5 0.5 0.5 0.5 0.5 0.5 0.5 
##$DPOFFS= (0..7)
0 0 0 0 0 0 0 0 
##$DQDMODE= 0
##$DR= 18
##$DS= 0
##$DSLIST= <SSSSSSSSSSSSSSS>
$$ [...]
##$SUBNAM2= <"">
##$SUBNAM3= <"">
##$SUBNAM4= <"">
##$SUBNAM5= <"">
##$SUBNAM6= <"">
##$SUBNAM7= <"">
##$SUBNAM8= <"">
##$SUBNAM9= <"">
##$SW= 16.9725357007746
##$SWIBOX= (0..15)
0 0 2 0 0 0 0 0 0 0 0 0 0 0 0 0 
##$SW_h= 3396.73913043478
##$TD= 16384
##$TD0= 1
##$TE= 0
##$TE2= 300
##$TE3= 300
##$TEG= 300
##$TL= (0..7)
0 120 120 120 120 120 120 120 
##$TP= (0..7)
150 150 150 150 150 150 150 150 
##$TP07= 0
##$TPNAME0= <>
##$TPNAME1= <>
##$TPNAME2= <>
##$TPNAME3= <>
##$TPNAME4= <>
##$TPNAME5= <>
##$TPNAME6= <>
##$TPNAME7= <>
##$TPOAL= (0..7)
0.5 0.5 0.5 0.5 0.5 0.5 0.5 0.5 
##$TPOFFS= (0..7)
0 0 0 0 0 0 0 0 
##$TUNHIN= 0
##$TUNHOUT= 0
##$TUNXOUT= 0
##$USERA1= <user>
##$USERA2= <user>
##$USERA3= <user>
##$USERA4= <user>
##$USERA5= <user>
##$V9= 5
##$VALIST= <valist>
##$VCLIST= <CCCCCCCCCCCCCCC>
##$VD= 0
##$VDLIST= <DDDDDDDDDDDDDDD>
##$VPLIST= <PPPPPPPPPPPPPPP>
##$VTLIST= <TTTTTTTTTTTTTTT>
##$WBST= 1024
##$WBSW= 4
##$XGAIN= (0..3)
0 0 0 0 
##$XL= 0
##$YL= 0
##$YMAX_a= 799996
##$YMIN_a= -734208
##$ZGOPTNS= <>
##$ZL1= 120
##$ZL2= 120
##$ZL3= 120
##$ZL4= 120
##$ABSF1= 10
##$ABSF2= 0
##$ABSG= 5
##$ABSL= 3
##$ALPHA= 0
##$AQORDER= 0
##$ASSFAC= 0
##$ASSFACI= 0
##$ASSFACX= 0
##$ASSWID= 0
##$AUNMP= <proc_1d>
##$AZFE= 0.1
##$AZFW= 0.1
##$BCFW= 1
##$BC_mod= 2
##$BYTORDP= 1
##$COROFFS= 0
##$CY= 11.3945322036743
##$DATMOD= 1
##$DC= 2
##$DFILT= <>
##$DTYPP= 0
##$F1P= 15.9154993809931
##$F2P= -4.1035820241983
##$FCOR= 0.5
##$FTSIZE= 0
##$FT_mod= 4
##$GAMMA= 1
##$GB= 0.15
##$INTBC= 1
##$INTSCL= 1
##$ISEN= 128
##$LB= 0.24
##$LEV0= 0
##$LPBIN= 0
##$MAXI= 10000
##$MC2= 0
##$MEAN= 0
##$ME_mod= 0
##$MI= 1.114404
##$NCOEF= 0
##$NC_proc= 0
##$NLEV= 6
##$NOISF1= 3.799351
##$NOISF2= 2.8
##$NSP= 1
##$NTH_PI= 0
##$NZP= 0
##$OFFSET= 15.70392
##$PC= 1
##$PHC0= -11120.13
##$PHC1= 9.801003
##$PH_mod= 1
##$PKNL= yes
##$PPARMOD= 0
##$PSCAL= 0
##$PSIGN= 0
##$REVERSE= no
##$SF= 200.130013532006
##$SI= 16384
##$SIGF1= 3
##$SIGF2= 2
##$SINO= 400
##$SIOLD= 16384
##$SREGLST= <1H.CDCl3>
##$SSB= 0
##$STSI= 0
##$STSR= 0
##$SW_p= 3612.71676300578
##$SYMM= 0
##$S_DEV= 0
##$TDeff= 0
##$TDoff= 0
##$TI= <>
##$TILT= no
##$TM1= 0
##$TM2= 0
##$TOPLEV= 0
##$USERP1= <user>
##$USERP2= <user>
##$USERP3= <user>
##$USERP4= <user>
##$USERP5= <user>
##$WDW= 1
##$XDIM= 8192
##$YMAX_p= 0
##$YMIN_p= 0
$$ End of Bruker specific parameters
$$ ---------------------------------
##NTUPLES= NMR FID
##VAR_NAME=  TIME,          FID/REAL,        FID/IMAG
##SYMBOL=    X,             R,               I
##VAR_TYPE=  INDEPENDENT,   DEPENDENT,       DEPENDENT
##VAR_FORM=  AFFN,          ASDF,            ASDF
##VAR_DIM=   8192,          8192,            8192
##UNITS=     SECONDS,       ARBITRARY UNITS, ARBITRARY UNITS
##FACTOR=    0.0002944,     1,               1
##FIRST=     0,             0,               0
##LAST=      2.4114304,     0,               0
##MIN=       0,             -734208,         0
##MAX=       2.4114304,     799996,          0
$$ Real data points
##PAGE= N=1
##DATA TABLE= (X++(R..R)), XYDATA
0@%%%%%%qQ%Qj6J6j7K5l3M1n6O8p7R2j16J38j62J94k27K63l07L57m11M70n37O15
$$ 0 0 0 0 0 0 0 -8 0 0 8 -8 8 -9 16 -17 24 -32 36 -41 51 -65 73 -89 105 -122 141 -166 191 -220 250 -287 328
32C28o99P91q93J006j129J264j415J581j760J956k172K406k659K936l243L577
$$ 328 -371 420 -473 533 -596 668 -747 834 -926 1030 -1142 1264 -1395 1541 -1702 1875
48A875l940M343m785N269n810O411p081P840q704R690j0836J2191j3813J5797
$$ 1875 -2065 2278 -2507 2762 -3048 3363 -3718 4122 -4582 5108 -5728 6463 -7350 8447
62H447j8294K1544k5966L2367m2505O1033j05644M07573M61441r32785m87634
$$ 8447 -9847 11697 -14269 18098 -24407 36626 -69018 338555 799996 -132789 -620423
73f20423M49031P59333q2632p54500l10840O45633N12864l39571o07705J4272
$$ -620423 -171392 587941 505309 -249191 -560031 85602 598466 258895 -348810 -334538
83c34538M85877K70161l41752m25722J30197M13996k6k58923j04883R1882J19688
$$ -334538 151339 421500 79748 -345974 -215777 198219 198193 -60730 -165613 -73731 45957
94D5957l6529j33561O4599R0965j03468m3567J45335N9806j31312j56392M9831
$$ 45957 9428 -124133 -59534 31431 -72037 -115604 29731 89537 -41775 -198167 -148336
105a48336K64464J10460k96500k46208K50553L55599o2691l56015j82630K95686
$$ -148336 116128 226588 -69912 -316120 -65567 290032 227341 -128674 -311304 -15618
115a5618L95732j65043m61277k173M03640K23560k35568m05160O53M30159K07821
$$ -15618 380114 215071 -246206 -248379 155261 378821 143253 -261907 -261254 168905 376726
126C76726l02127l33058P3888L33380J53782k59895l41884R9727L69018O3227
$$ 376726 74599 -258459 -184571 148809 302591 42696 -299188 -199461 169557 232784
136B32784k68476k27444Q1563L23600R3649l05831k25839J46031K65745O4991
$$ 232784 -35692 -263136 -181573 142027 235676 -70155 -295994 -149963 115782 180773
146A80773k14185k11069J25447K76422o561k38150r7092J30510J79821K3843j78801
$$ 180773 -33412 -244481 -119034 157388 150827 -87323 -184415 -53905 125916 149759 -29042
157b9042j09170J26738J23990j4284p0771r1964L023J29798N2932o9563o8748
$$ -29042 -138212 -11474 112516 98232 27461 -64503 -61480 68318 121250 51687 -17061
168a7061l0486N1048J04911j9834j49218n2472J14195J28542r427j82228j35505
$$ -17061 -47547 3501 108412 88578 -60640 -113112 1083 129625 120198 -62030 -197535
179a97535J57162K18239p4845k32289p3065J69887K15030o6176k84494n3778K46335
$$ -197535 -40373 177866 103021 -129268 -202333 -32446 182584 116408 -168086 -221864 24471
190B4471J60481j32396k36433j6854K58085J70031j83134k41445N5282K21259
$$ 24471 184952 52556 -183877 -200731 57354 227385 44251 -197194 -141912 79347
200G9347Q4927j26779j75691L1493K06146O5074j34635j25060P681J42064J12535
$$ 79347 164274 37495 -138196 -106703 99443 164517 29882 -95178 -87497 54567 167102
211A67102j02871j73647J4950J59672Q9658q1095j65792l6822J59466J15469r9707
$$ 167102 64231 -109416 -94466 65206 154864 73769 -92023 -128845 30621 146090 46383
222D6383j46229m542J28039J11906q4732j93145R82J80356Q5506r5881j50403
$$ 46383 -99846 -104388 23651 135557 50825 -142320 -141338 39018 124524 28643 -121760
233a21760j2138J64019J02448j13513j44152K0655J29913P5283o9349j26702J1064
$$ -121760 -133898 30121 132569 19056 -125096 -104441 25472 100755 31406 -95296 -84232
244h4232J38018M6611q7893q2866Q07Q8740P9530m3029r4280j5596N7089P0249
$$ -84232 53786 100397 12504 -70362 -69555 19185 98715 55686 -38594 -54190 2899 73148
256G3148N723r9686p0470P8980J07894j1915j05213p1707O0869J31242K711j49408
$$ 73148 78871 -20815 -91285 -12305 95589 83674 -21539 -93246 -32377 98865 101576 -47832
268d7832q3661R0118J42038J8999j55246j26669J04321J79852j8997j79447q8017
$$ -47832 -131493 -41375 100663 119662 -35584 -162253 -57932 121920 102923 -76524 -164541
279a64541J27439J81201l0554k17569p9076J78068J69197p3754k12687n5721K00461
$$ -164541 -37102 144099 113545 -104024 -183100 -5032 164165 90411 -122276 -177997 22464
290B2464J72838j21046k22663J4759K06182R5569j44874j71534O3143K02561K7510
$$ 22464 195302 74256 -148407 -133648 72534 168103 23229 -148305 -85162 117399 144909
301A44909j65090j00048Q6312J27567n740j21093m8069Q9292O4232n0841n6539
$$ 144909 -20181 -120229 -33917 93650 87910 -33183 -81252 8040 72272 21431 -35108
312c5108J6175L3894m040l2433Q992M1372k1889o2370K7104Q7284m601j08736
$$ -35108 -18933 14961 10921 -21512 -12520 28852 6963 -55407 -28303 58981 54380 -54356
324e4356n6585R6095J32975m2704j78977l7353J79401J24304j25970j97739K9349
$$ -54356 -110941 -14846 118129 75425 -103552 -140905 38496 162800 36830 -160909 -131560
335a31560K38487Q9206k15473j91378J36002K52253q195k55465j24306J90987
$$ -131560 106927 196133 -19340 -210718 -74716 177537 169342 -86123 -210429 -19442
345a9442K20405q1199k43723l6474K04091J35419j22847j98100J5053K02668Q0826
$$ -19442 200963 119764 -123959 -160433 43658 179077 56230 -141870 -126817 75851 156677
356A56677j44489j41990N6542J51475K6388j24048q3806P2059R8058j5277q0908
$$ 156677 12188 -129802 -73260 78215 104603 -19445 -103251 -31192 66866 51589 -29319
367b9319k5523M9192M3995k0486m4775J083K9006K163o756J1640P233k4284l0038
$$ -29319 -54842 -5650 38345 17859 -26916 -25833 3173 5336 -1420 10220 17453 -6831 -36869
380c6869J6956N8060R070p2463m2269O3418P9124k6589j00252l0107R3662Q7809
$$ -36869 -19913 38147 47217 -25246 -67515 -4097 75027 48438 -51814 -81921 11741 99550
392I9550n5984j27953r771J31183Q9302q8614j53936Q149J70245P9891j33940
$$ 99550 43566 -84387 -94158 37025 126327 37713 -116223 -108074 62171 142062 8122
403H122j49355O0167J85794L5824j74713j27315J11053J84247j5463j88183q1633
$$ 8122 -141233 -81066 104728 140552 -34161 -161476 -50423 133824 118361 -69822 -151455
414a51455J42745J57260o1089j85867k8839J62929R9709j04304j39871L2109J45725
$$ -151455 -8710 148550 87461 -98406 -127245 35684 135393 31089 -108782 -76673 69052
425F9052L4253j17191q0773O2627R2342j2472p7076j8992N2308K9448l2759k8146
$$ 69052 103305 -13886 -94659 -32032 60310 47838 -29238 -48230 4078 33526 767 -27379
437b7379K2302K1173k5296k2594L0474L8334k7312n9114J4176Q0827J5414q9397
$$ -27379 -5077 16096 -9200 -31794 -1320 37014 9702 -49412 -35236 45591 61005 -28392
449b8392n8937P4195J05506k6521j26625l5170J16472R5392p4615j35676R708
$$ -28392 -87329 -13134 92372 65851 -60774 -95944 20528 115920 41305 -94371 -84663
460h4663J44618O5683j14571j25727N4206J50058J8171j36847q6299Q5986J22895
$$ -84663 59955 125638 11067 -114660 -60454 89604 107775 -29072 -115371 -29385 93510
471I3510j9390j19256m3466Q1000P9970l0960q9476k3451O5827O1120k2204p0774
$$ 93510 74120 -45136 -88602 -7602 72368 41408 -48068 -71519 -5692 55428 33224 -37550
483c7550k2827M8872N0928j1231n3266k3359L3897M3639L240l8471l2410J6204
$$ -37550 -60377 -11505 39423 28192 -25074 -48433 -14536 29103 32343 -6128 -38538 -22334
495b2334M7111J7152l8272m3613J5364N8864K2422m5263n3568J3761O4223K4587
$$ -22334 24777 41929 3657 -39956 -24592 34272 56694 11431 -42137 -28376 35847 60434
507F0434n0319n5468J8017O7087J9055n7593n3546K4988O5180R644n8475m1248
$$ 60434 10115 -45353 -27336 39751 58806 1213 -52333 -27345 37835 47479 -10996 -52244
519e2244K7981N2284P738m5713l8987J5363M7788J7180l7144m0658J3321M8498
$$ -52244 -24263 28021 35759 -9954 -48941 -33578 14210 31390 -5754 -46412 -33091 15407
531A5407J7381l5498l9838J0727M6493K1083k6490l9025j355M2508L4732j9038
$$ 15407 32788 -2710 -42548 -31821 14672 35755 9265 -29760 -31115 11393 46125 27087
543B7087n2808j4534N2076M9475k3977o7461j6523O3266N7142l5870q4593j2167
$$ 27087 -25721 -40255 11821 61296 37319 -30142 -46665 16601 73743 37873 -46720 -58887
555e8887Q3360O2379n6653r9110M759J04394M8752q6282r6263L9199J13684J5356
$$ -58887 24473 86852 30199 -68911 -64152 40242 88994 2712 -93551 -54352 59332 74688
567G4688j04940o7067O7540R6689j8613j00719l2600Q0308O9389m2979q1640N107
$$ 74688 -30252 -97319 -29779 66910 48297 -52422 -85022 -4714 64675 21696 -59944 -54837
579e4837P5610K8725n3732m3902L4136M9205j1923m0735L452L6867K108l4280
$$ -54837 20773 49498 -4234 -48136 -14000 35205 23282 -17453 -14001 22866 24974 -9306
591i306l264L8946J3184m2333l1082M1119N3904k7237p6653n415Q5808M5126p9373
$$ -9306 -12570 26376 39560 -2773 -33855 7264 61168 33931 -42722 -48137 37671 82797 3424
604C424q9527M4574J15684L621j23433o4333R7823J09495m9140j34553j5353J25541
$$ 3424 -86103 -41529 74155 77776 -45657 -109990 -12167 97328 48188 -86365 -101718 23823
616B3823P3891q6784j13757K6471J25080L8081j01807q4727N6949J08664K106
$$ 23823 97714 10930 -102827 -76356 48724 86805 -15002 -99729 -42780 65884 67990
627F7990r9691m9631P2457Q1580k6004q3686j5401O7848M7259l5669n7019L959
$$ 67990 -31701 -81332 -8875 72705 46701 -36985 -52386 15462 62721 27052 -29967 -26008
639b6008N1333K0829l3993l0929J3288K7645k19k2843p208J4532L756j3395k355
$$ -26008 25325 46154 12161 -18768 -5480 22165 21946 -897 -8105 6427 10183 -3212 -5567
652e567J1337P1j7389r487J6395J9203j0786l0332o164L0830K5538j9768m3516
$$ -5567 5770 5841 -11548 -21035 -4640 14563 3777 -26555 -32719 -1889 23649 3881 -39635
665c9635m302N1195L6483l9780o1592J4114P7247K8078o9996o6214M4796R6235
$$ -39635 -43937 7258 43741 3961 -57631 -43517 33730 61808 -8188 -74402 -29606 66629
677F6629L820r7314n1713P4510R3737k7923j11455k6412J04111P7049o8923j10246
$$ 66629 70449 -26865 -78578 -4068 89669 61746 -49709 -76121 27990 105039 36116 -74130
689g4130J5205J15981L9210r8904q5321N6999J04137r184j01764l9059P5297O7250
$$ -74130 -58925 57056 96266 -2638 -87959 -30960 73177 63993 -37771 -76830 -1533 65717
701F5717m3948q2591O266P7116K3542o1067m3977L8819N2959j9959n4374O399
$$ 65717 21769 -60822 -54556 22560 46102 -14965 -58942 -20123 32836 12877 -41497 -35098
713c5098N4602O600m9903j6408M8310L4607l9652n0580K8477O7592m148p1420
$$ -35098 19504 26104 -23799 -40207 8103 42710 3058 -47522 -19045 48547 44399 -27021
725b7021k2976O7761N6659m6689q3684J2164R5714K9926q4560o8779N3321R2138
$$ -27021 -49997 17764 74423 27734 -55950 -43786 51928 81854 -2706 -71485 -18164 73974
737G3974j1630r9191l5540Q0024O7612m6878q5882M50P9530L8521n7560o7288
$$ 73974 62344 -36847 -72387 7637 75249 28371 -57511 -57061 22469 60990 3430 -63858
749f3858J9316P0025J5789n4569m1260K8379N1869j630m7069j8628L1602L0257
$$ -63858 -44542 25483 41272 -13297 -54557 -26178 25691 24061 -23008 -41636 -10034 20223
761B0223q679k5040n719J6692J4648k329q495l618O6O542J0839J578j0391r391
$$ 20223 11544 -13496 -19215 -2523 12125 9796 1301 -2317 -2251 4291 15130 16708 6317 -3074
775c074M599J6457N361j8962j8059J2887K6135O32k8168j9812J5453K7541k308
$$ -3074 1525 17982 23343 4381 -13678 -791 25344 25976 -2192 -22004 -6551 20990 18682
788A8682k9173j4996J6320K3019j49k5479j9068J5402K8118r72k9984j7279K2295
$$ 18682 -10491 -25487 -9167 13852 13703 -11776 -30844 -15442 12676 11704 -18280 -35559 -13264
801a3264L2707l719l4889j4773K5276K7651m426k6136j1608K0508K6420l759k7228
$$ -13264 19443 15724 -19165 -33938 -8662 18989 14563 -11573 -23181 -2673 23747 19988 -7240
814g240j2055J8822K6816j134k8401j4650J9969K6898j409k7874k0140J5330L1044
$$ -7240 -19295 -473 26343 25209 -3192 -17842 2127 29025 27616 -258 -20398 -5068 25976
827B5976J736l2297k1178K1005L3553m773m1546j9935L1203L5881j2432m2367
$$ 25976 27712 -4585 -25763 -4758 28795 24022 -17524 -37459 -6256 29625 17193 -25174
839b5174j2724L3144L1240j6626m0921n137L7003K3408k2513l2813P005L7966
$$ -25174 -37898 -4754 26486 9860 -31061 -36198 805 24213 1700 -31113 -24108 13858
851A3858J0374l0328k2447J7524K8561j01k0842o580J4646J0302p696r082N720
$$ 13858 24232 -6096 -28543 -11019 17542 17441 -3401 -9981 4665 14967 7271 -1811 3909
864C909P310m330o526N402J0763o059j8412O49K3306N948k8478k1277K3282L5907
$$ 3909 11219 6889 363 5765 16528 10469 -7943 -7294 16012 21960 -6518 -27795 -4513 31394
878C1394r551m5665j3978L9433L1554k7221m4631N521M8657K0715l9886m4227
$$ 31394 21843 -23822 -37800 1633 33187 5966 -38665 -33144 15513 36228 -3658 -47885
890d7885J8039N5643J1012n0318l7438L2179N6825j926n5425k5741M1969M5568
$$ -47885 -29846 25797 36809 -13509 -50947 -18768 38057 36131 -19294 -45035 -3066 42502
902D2502j8645n2913n863N0536L3295l1581m9276N758M9039J7907l7707l3670
$$ 42502 23857 -29056 -34919 15617 48912 17331 -31945 -26187 22852 40759 3052 -30618
914c0618K0384M1383l105l8993j3402K7943K2188j8699k8487N430K8196N632k3882
$$ -30618 -10234 31149 28044 -10949 -24351 3592 25780 7081 -21406 -15976 12220 17852 -6030
927f030j4146J7243J6785j5744k4233R915L3771K657l7351j7912L5015L2942k6085
$$ -6030 -20176 -2933 13852 -1892 -26125 -16210 17561 20218 -17133 -35045 -30 32912 6827
940F827m6617J0653N8087J3185n5147l7593M3650O1256j7984p4268j6311O9462
$$ 6827 -39790 -29137 28950 42135 -13012 -50605 -6955 54301 36317 -37951 -54262 15200
952A5200N1757m5901p2646J4028P9814K0168p3950n4905N0353P8607j5212q3249
$$ 15200 66957 21056 -51590 -37562 42252 62420 -11530 -66435 -16082 62525 47313 -35936
964c5936k2822O9530N1155m5135o9065J1874O9410J8562n7213m0841L8285N3556
$$ -35936 -58758 10772 61927 16792 -52273 -40399 29011 47573 -9640 -50481 -12196 41360
976D1360j6169n7670q838M9824K6689l5032l3171K2774L7519j1401m1160j010
$$ 41360 25191 -32479 -41317 8507 35196 164 -33007 -10233 27286 15885 -25275 -26285
988b6285M0555J4352l3911k4396K5809L5348j3690m1275j791M1016J8314l6275
$$ -26285 14270 28622 -5289 -29685 -3876 31472 17782 -23493 -25284 15732 34046 -2229
1000b229l4152K6176M8746n192n2507k0950M1503L8834k3552m7254K755M6428
$$ -2229 -36381 -10205 38541 33349 -19158 -40108 1395 40229 16677 -30577 -27822 18606
1012A8606J9691l6412l7456J4695M2167Q409l6498k8146K1033L9954P70l7722
$$ 18606 38297 1885 -35571 -20876 21291 29700 -6798 -34944 -13911 26043 26813 -10909
1024a0909k1168K3847L1289p566l2374q048K7756K3380j3855k9903m792K4609
$$ -10909 -32077 -8230 23059 15493 -16881 -24929 2827 26207 12352 -17551 -22343 2266
1036B266J7957j1986k2027M74K1030R447j4567j6151O480J5939J98j3254n505
$$ 2266 20223 8237 -13790 -13316 7714 17161 2594 -13557 -7077 8862 9060 -4194 -9699
1049i699R889J0496m634j0082q32N303L77n263J648J0203K275j3391q944J1827
$$ -9699 190 10686 6052 -4030 -4862 441 818 -4445 -2797 7406 9681 -3710 -12654 -827
1063h27J5299q973k1842K486K6557R339k5450k1257J9389L0079q060l4732r873
$$ -827 14472 5499 -16343 -13857 12700 22039 -3411 -24668 -5279 24800 16740 -17992 -27865
1076b7865L0770K6505j6567l3613K95L1697J2972k4805k6447J2521L3720M319
$$ -27865 2905 29410 12843 -20770 -20475 11222 24194 -611 -27058 -14537 19183 23502
1088B3502k9602j8714J7753K4055l898k2411q398J5064J5206m621j3455k910Q395
$$ 23502 -6100 -24814 -7061 16994 13096 -9315 -17713 -2649 12557 7936 -5519 -8429 -34
1101c4P291l321r734k526Q029Q134Q87o147q579j578R415Q268m543j2331j965
$$ -34 7257 3936 -5798 -8324 -295 7839 8726 2579 -6000 -7578 1837 10105 5562 -6769 -8734
1116h734J3139J0817j0655j6851M116J7040L443j4909j1317R395J6566j04j6407
$$ -8734 4405 15222 4567 -12284 -8168 8872 12315 -2594 -13911 -4516 12050 11946 -4461
1129d461p748Q290R018k100q339j806Q569L848o814m602L131J389j123J742L170
$$ -4461 -12209 -3919 5099 2999 -5340 -7146 1423 5271 -1543 -6145 -3014 -1625 -2748 -1006 2164
1144B164q12o260j805J0586Q038j0657j3967M780J6125O466j2094j2749O351J7747
$$ 2164 1352 -4908 -6713 3873 11911 1254 -12713 -7933 8192 14658 2564 -10185 -3834 13913
1158A3913N60j9765j0468J3953K1966j522k6667j3250K2415K2705j1877k8106
$$ 13913 14473 -5292 -15760 -1807 20159 18637 -8030 -21280 1135 23840 11963 -16143
1170a6143n397K5292J9983j7369k8827M399K9868Q998k5257k4484J1813L3976
$$ -16143 -21540 3752 23735 6366 -22461 -18062 11806 20804 -4453 -28937 -17124 16852
1182A6852M450l1330j6174K1126K3178q566k6057m222K6184J6824j8824k1977
$$ 16852 21302 -10028 -26202 -5076 18102 9536 -16521 -20743 5441 22265 3441 -18536
1194a8536Q899K3543L924k0476j4795J6526K1378j0718k2075O551K3589K86k4971
$$ -18536 -9637 13906 17830 -2646 -17441 -915 20463 9745 -12330 -5779 17810 18096 -6875
1207f875j3645K3785K4605j8791l1119J0246L2666O81l3798j8063K8337L3877
$$ -6875 -20520 3265 27870 9079 -22040 -11794 20872 21553 -12245 -30308 -1971 31906
1219C1906j9044m5390K105M6702J7821l8448l8166K0231N1479m27n4287j7918
$$ 31906 12862 -32528 -30423 16279 34100 -4348 -42514 -22283 29196 28769 -25518 -43436
1231d3436M6710L7605k6856n1402J336N4928K3736m4215l7930K7638M6137l643
$$ -43436 3274 40879 14023 -37379 -36043 18885 42621 -1594 -39524 -11886 34251 30608
1243C0608m6388j8423M0201L6343k7345m3702J0671M2231Q944l4918k4964K2752
$$ 30608 -15780 -34203 5998 42341 14996 -28706 -18035 24196 33140 -1778 -26742 -3990
1255c990L1427j3859l3294N043K9463N753k5242k0074J5529K7658r038l0545J309
$$ -3990 27437 13578 -19716 -14673 14790 20543 -4699 -24773 -9244 18414 9376 -21169 -19860
1268a9860K7535Q429k2151k0199J4095L0264n322l4379m999L2240J7882j7966
$$ -19860 7675 16104 -6047 -26246 -12151 18113 12791 -21588 -26587 5653 23535 5569
1280E569k6575L026L1805J0766k9064j9528K0314K8407j063k9677j7608K4225
$$ 5569 -21006 -17980 13825 24591 -4473 -24001 -3687 24720 23657 -6020 -23628 597
1292E97L0049j3398l2826o44K6825J6485j6931k8740M553L0736M881k6693j6271
$$ 597 30646 17248 -15578 -16222 10603 27088 10157 -18583 -14030 16706 21587 -5106 -21377
1305b1377J2411K3412L515k6012j6509J9428J8465j0548j8139r42J6858J1960
$$ -21377 -8966 14446 17961 -8051 -24560 -5132 13333 2785 -15354 -16296 562 12522
1317A2522j4100j8231R500J8240k301j3436m404R476J3624n401j6020N600J7468
$$ 12522 -1578 -19809 -10309 7931 5630 -7806 -12210 -2734 10890 5489 -10531 -4931 12537
1330A2537l123j5619k759J4174J4367r663k1783P424K4301l576k4124n295J8778
$$ 12537 9414 -6205 -8964 5210 19577 9914 -11869 -4445 19856 16280 -7844 -13139 5639
1343E639J6454j0370k7535K57K9153P143k4836j6592R911K2499L739k6709j3580
$$ 5639 22093 11723 -15812 -15555 13598 20741 -4095 -20687 -10776 11723 15462 -11247 -24827
1356b4827K3355J8843j4843k2449o07K1683J5409j5617k1464R781J9949r08j3656
$$ -24827 -1472 17371 2528 -19921 -20528 1155 16564 947 -20517 -10736 9213 8305 -5351
1369e351p388P750J5968j541j6073K30J3689J841n594m428m38P048J907o624K703
$$ -5351 -12739 -4989 10979 9438 -6635 -6405 7284 9125 3531 -897 -1335 5713 7620 996 3699
1384C699N379o126m371M748J068l069q82k456N177M529q827p829O289N402j709
$$ 3699 9078 2952 -1419 3329 4397 1328 446 -2010 3167 7696 -1131 -8960 -2671 2731 1022
1399A022l857o847K444J1819k356j0340O41L945J857Q55n536q74P752L196n650
$$ 1022 -2835 -9682 -7238 4581 2225 -8115 -7474 -3529 -1672 -817 -6353 -7227 525 3721 -1929
1414a929o37M86r18O238J794n836L21K317P85L639M23o876n21N610R91l61l452
$$ -1929 -2566 -2080 -2998 3240 5034 -802 -481 1836 2621 6260 6683 -193 -714 4896 5887 5526 2074
1431B074n960O922R436q108j2226K168R900O029o268j5871K376J8305o05j5233
$$ 2074 -3886 3036 12472 4364 -7862 -5694 4206 10235 3967 -11904 -9528 8777 8172 -7061
1445g061p443O752J4193K234j8789q869J8339J2976j0397j4099j771J4791J2089
$$ -7061 -14504 -7752 6441 8675 -10114 -18983 -644 12332 1935 -12164 -13935 856 12945
1458A2945j1947j5747R665J6403k487j2367o278P531J6305k569j8649J29J6600
$$ 12945 998 -14749 -5084 11319 8832 -3535 -9813 -2282 14023 11454 -7195 -7066 9534
1471I534L093j0752q828M952J4839k319j8836O68J8539K073j5743q616Q487J3918
$$ 9534 12627 1875 -6953 -2001 12838 10519 -8317 -7649 10890 12963 -2780 -11396 -2909 11009
1485A1009l319k0326r45K1803N084j7977j3552P955K0722K530k5581j0814K4247
$$ 11009 7690 -12636 -13581 8222 13306 -4671 -18223 -10268 10454 12984 -12597 -23411 836
1498H36J7066j4617k1534J846K4270J1998k2683k1236J7244K6661l682k3589j0916
$$ 836 17902 3285 -18249 -16403 7867 19865 -2818 -24054 -6810 19851 16169 -7420 -18336
1511a8336J8282K3052j0199k8419K897K6488P359j8696j7439P939K3744M63k4975
$$ -18336 -54 22998 12799 -15620 -12723 13765 21124 2428 -15011 -7072 16672 17135 -7840
1524g840p118J8684J0687q993j4610j802J5387P508j5998j0515J0805J1350k997
$$ -7840 -14958 3726 14413 5420 -9190 -10992 4395 11903 -4095 -14610 -3805 7545 4548
1537D548j1250n941J1133J1201j1362j2290Q448J2591j693j0250o711R912J4267
$$ 4548 -6702 -12643 -1510 9691 -1671 -13961 -5513 7078 5385 -4865 -11576 -1664 12603
1550A2603p440j6596K437J6190N699j0156j4621N292K1446J280k3392q477J8415
$$ 12603 5163 -11433 -8996 7194 12893 2737 -11884 -6592 14854 16134 -7258 -15735 2680
1563B680J6754p817k2672n181K5114J4075k1555k0861J0397K3406L921k3329j8257
$$ 2680 19434 11617 -11055 -16236 8878 22953 1398 -19463 -9066 14340 18261 -5068 -23325
1576b3325J8473K6013r984k8680l047K4382J5882j6332k5981P696K9206J711k5826
$$ -23325 -4852 21161 11177 -17503 -20550 3832 19714 3382 -22599 -14903 14303 16014 -9812
1589i812j0996J7921K0154p264k5223j729K6330R365k1508j4797J3867K0816m229
$$ -9812 -20808 -2887 17267 10003 -15220 -16949 9381 18746 -2762 -17559 -3692 17124 12895
1602A2895k4477m072K6400J0467k2559j6540J4773K1135m955k4509n210K4655
$$ 12895 -11582 -15654 10746 21213 -1346 -17886 -3113 18022 13067 -11442 -16652 8003
1614H003J3628k1760j9820J1899K3299N26k4296j3423K1656K1557j4950k5310
$$ 8003 21631 -129 -19949 -8050 15249 15775 -8521 -21944 -288 21269 6319 -18991
1626a8991L471K4246Q892j9678j9475J3312K4994m324k3884n007J7716J3767r099
$$ -18991 -15520 8726 17618 -2060 -21535 -8223 16771 12447 -11437 -16444 1272 15039 5940
1639E940j9400K574J9771L861j5967q102R359J2003k369j3319k405J2896M557
$$ 5940 -13460 -10886 8885 12746 -3221 -11323 -1964 10039 7670 -5649 -8054 4842 9399
1652I399r570m976M986N094j808n463m17N552R90n552p97L807O06j454l068l42
$$ 9399 -171 -5147 -161 4933 3125 -2338 -2755 2797 3787 -1765 -2562 1245 1851 397 -2671 -3013
1668c013N402J331n931k561N457K300j482l111k118L953L003k646l683K103J392
$$ -3013 2389 3720 -2211 -4772 685 2985 1503 -1608 -3726 227 3230 584 -3099 -996 396
1683C96J682l44l164j808L964L254k774k534k406M168L332k026n036J884K498
$$ 396 2078 1734 -1430 -3238 726 3980 1206 -1328 -3734 434 3766 1740 -3296 -1412 1086
1698A086J889m66l843k719M467M605k543n791o05N811L240k861p228J516O597
$$ 1086 2975 2509 -1334 -4053 414 5019 2476 -3315 -3920 1891 5131 2270 -4958 -3442 3155
1713C155J843m362n035J072O402L141o164n110L258M762J924o013m142L568O494
$$ 3155 4998 636 -4399 -3327 3075 6216 52 -5058 -1800 2962 4886 -1127 -5269 -1701 4793
1728D793j129o238k773M337N113J20p276k848O611M999l453p581K41P967K572
$$ 4793 3664 -2574 -5347 -1010 4103 4223 -3053 -5901 710 5709 2256 -5325 -5084 2883 5455
1743E455p084n789O260O894l835p091J368P007J983p171l633N966O007l962p246
$$ 5455 -1629 -7418 -1158 5736 1901 -5190 -3822 3185 5168 -2003 -5636 330 6337 2375 -4871
1758d871Q91Q479L252q389p266O666J0286l814j1673j190J2274P252j0492j2606
$$ -4871 -3980 4499 7751 -638 -7904 -1238 9048 5234 -6439 -7629 4645 11897 1405 -11201
1772a1201N407J5122J169j4974q502J0966J4166n150j7585k505J7570R517j3754
$$ -11201 -5794 9328 10497 -4477 -12979 -2013 12153 7003 -10582 -13087 4483 14000 246
1785B46j5230O364J8883J819j8168q980J3608J3971o943j5913j08J5267P263j0945
$$ 246 -14984 -8620 10263 12082 -6086 -15066 -1458 12513 5570 -10343 -10451 4816 12079 1134
1799A134j2038N732J3733R24j2444o548R407J0739m742j2149K29J1874M087j0058
$$ 1134 -10904 -5172 8561 9485 -2959 -9507 -100 10639 5897 -6252 -6023 5851 9938 -120
1813a20q493O289J1171j661j1824l289R645P004p239j0924K420J3064K899j3406
$$ -120 -8613 -2324 8847 7186 -4638 -7927 1718 8722 1483 -9441 -7021 6043 8942 -4464
1827d464q529J0265J3424m844j6540k370J6239R293j2249j4480O548J7873J820
$$ -4464 -12993 -2728 10696 5852 -10688 -13058 3181 12474 225 -14255 -7707 10166 11986
1840A1986j7560j0195J3205J7714m874k0239l854J9332J2342j3721j9039N531
$$ 11986 -5574 -15769 -2564 15150 10276 -9963 -13817 5515 17857 4136 -14903 -9372
1852i372K2381L701k0145j2422J4665J9055o485k2232l197J9366J1418j4632j7628
$$ -9372 13009 16710 -3435 -15857 -1192 17863 11378 -10854 -14051 5315 16733 2101 -15527
1865a5527P520K0868k7k1133q786J7013J5209j1520j8715L844J9966K874j8678
$$ -15527 -8007 12861 12834 -8299 -17085 -72 15137 3617 -15098 -11254 8712 11586 -7092
1878g092r445J5037J4402r197j7459K515J9294N734j6138j2671J1099J7225l901
$$ -7092 -16537 -1500 12902 3705 -13754 -11239 8055 13789 -2349 -15020 -3921 13304 9403
1891I403j8360l438J8557J1296j3408j7265O091J9650K312j8258j0057J3671J5754
$$ 9403 -8957 -12395 6162 17458 4050 -13215 -7124 12526 14838 -3420 -13477 194 15948
1904A5948o823j8255j803J6577Q236j3096j4295O511J6649Q01j5218p967J0362
$$ 15948 9125 -9130 -10933 5644 13880 784 -13511 -7000 9649 10450 -4768 -12735 -2373
1917b373J0754n855j2253P49J1338M416q341p429M076Q354N29p038l795N465O304
$$ -2373 8381 2526 -9727 -8978 2360 6776 -1565 -8994 -4918 3436 3965 -3073 -6868 -1403 4901
1932D901j673n889m22N926K461m895m415L618O287k39n726k202M870L477l354
$$ 4901 3228 -2661 -3083 2843 5304 409 -4006 -388 5899 5660 -66 -2268 2602 6079 2725
1947B725m953O96N785J741n926m267L703O149j966q326k292P305N037n173p163
$$ 2725 -2228 -1532 4253 5994 68 -4199 -496 5653 3687 -4639 -6931 374 5411 238 -6925
1962f925J658Q265P23q129m794N247P615n27p971k800O244N821l173p082L87P514
$$ -6925 -5267 2998 3721 -4408 -9202 -3955 3660 3133 -4838 -7638 -1394 4427 1254 -5828 -5441 2073
1978B073L846n234n296L731O862m48o102k579M122M414j055l421n21K568Q98k261
$$ 2073 5919 685 -4611 -880 5982 5534 -568 -3147 975 5389 4334 913 392 2960 3858 1597
1994A597k233R96K011p13j255m7J30j139j060J132R11k215k207J413L331n76l660
$$ 1597 -636 360 2371 1658 403 356 486 -653 -1713 -581 330 -1885 -4092 -2679 652 76 -3584
2011c584p79L199J069k982j691K641L722m39l030n48K257J235r67r25J233K126
$$ -3584 -4363 -1164 -95 -3077 -4768 -2127 1595 1156 -1874 -2422 -165 1070 103 -822 411 2537
2027B537p1k421L91L013J102l437k485K500L831j009l982l58M547R85n771l888
$$ 2537 2466 45 436 3449 4551 1114 -1371 1129 4960 3951 -31 -389 4158 5143 -628 -4516
2043d516L344O219o58p407l401O256N693m729q635N84R208L388q598p223O139
$$ -4516 -1172 5047 4389 -3018 -6419 -163 5530 801 -7834 -7250 1958 5346 -3252 -10475 -4336
2058d336J0023j605j0831l375Q740Q046m404q734Q05R577L688p439p919M534J0789
$$ -4336 5687 4082 -6749 -10124 -1384 6662 2258 -6476 -5671 3906 7594 155 -7764 -3230 7559
2073G559J767j0113n885P939Q761l830j0072n91R526M350p894q120N314R744j241
$$ 7559 9326 -787 -6672 1267 10028 6198 -3874 -4465 5061 9411 1517 -6603 -1289 8455 7214
2088G214j1237m853Q666Q609n979j1064J846J1979J538j2314p322R788J2230n909
$$ 7214 -4023 -8876 -210 8399 2420 -8644 -6798 5181 6719 -5595 -12917 -3129 9101 3192
2102C192j4321k6J5393N861j2046j1384P777J5394j310j6480n173J6043J2831
$$ 3192 -11129 -11155 4238 10099 -1947 -13331 -5554 9840 8530 -7950 -13123 2920 15751
2115A5751r909j7936K166J9644N920j6795j2665J2673J7942n420k0368l763J8523
$$ 15751 5842 -12094 -9928 9716 15636 -1159 -13824 -1151 16791 11371 -8997 -12760 5763
2128E763J2086j3925j8088N996J9912K312j8672j0289J3306J5514q722j8806J172
$$ 5763 17849 3924 -14164 -8168 11744 14056 -4616 -14905 -1599 13915 5193 -13613 -12441
2141a2441J9859N640j6709j2540J0668J5712m592j6888p73J6045O744j2217j1442
$$ -12441 7418 13058 -3651 -16191 -5523 10189 5597 -11291 -12064 3981 10725 -1492 -12934
2154a2934P333J4882q67j4787m926J3274J0578q040j3195K923J4230L320j3926
$$ -12934 -5601 9281 8414 -6373 -11299 1975 12553 4513 -8682 -5759 8471 11791 -2135
2167b135q354J0347J2952l850j4123l182J1892P814q511j1489L279J2388J932
$$ -2135 -10489 -142 12810 8960 -5163 -8345 3547 11361 2850 -8639 -5360 7028 8960
2180H960j1522p717P853J0637l044j2364k926R859P064n178q634P90Q001K866
$$ 8960 -2562 -10279 -2426 8211 5167 -7197 -10123 -264 6800 1622 -7012 -6222 1779 4645
2194D645o638o075L728Q246J718p319n381N070Q100j728q400j434P714N112n142
$$ 4645 -1993 -8068 -4340 3906 5624 -1695 -7076 -2006 6094 4366 -4034 -5468 2246 7358 2216
2209B216p438K999Q592N42q212m841O141Q025k669q823p55Q508L365q631p295
$$ 2216 -5222 -2223 6369 6911 -1301 -6142 -1 8024 5355 -3468 -4223 4285 7650 -981 -8276
2224h276N500J0108j391j1594l201J0169O782p744r690L359J0808J473j0624n640
$$ -8276 -2776 7332 5941 -5653 -8854 1315 8097 353 -9337 -5978 4830 6303 -4321 -9961
2238i961Q637J0233n400j2228j079J2273O899q906r522N349J1961j045j2188m069
$$ -9961 -1324 8909 3509 -8719 -9798 2475 9374 468 -9054 -3705 8256 7211 -4977 -9046
2252i046J0646Q675o520j0549K270J0784K111r115n876O098P327k658q374J14
$$ -9046 1600 10275 3755 -6794 -4524 6260 8371 -744 -6620 -522 6805 4147 -4227 -4113
2266d113Q089K725p079n546M061N529j727n682O60N484M10n029k646M039L388
$$ -4113 3976 6701 -378 -5924 -1863 3666 1939 -3743 -3083 2401 2811 -2218 -4864 -825 2563
2281B563k506l439M47L931J496l181k169K056K813j494l344J65M659K019l475
$$ 2563 57 -3382 -2935 996 2492 -689 -2858 -802 2011 517 -2827 -2662 1997 4016 541
2296E41k830J458L152q63k674R7L313M02k260j305K092Q65j688j757R85K226m54
$$ 541 -2289 -831 2321 1458 -1216 -1119 2194 2596 336 -969 1123 1988 300 -1457 -472 1754 1300
2313A300k365P93K889o54l935k067L522L496k464m252J884M995Q9o325k710N164
$$ 1300 -1065 -272 2617 1963 -1972 -4039 -517 2979 515 -3737 -1853 3142 3231 -3094 -5804 -640
2329f40N215k941o276M48O187L247m718n371J894O030Q79n819k828N061O220k783
$$ -640 4575 1634 -4642 -4194 1993 5240 522 -4849 -2955 3075 3954 -1865 -4693 368 6588 3805
2345C805q168j071P134M464n012o109K806P073l8p347l226N511N627l658o732
$$ 3805 -4363 -5434 1700 6164 1152 -4957 -2151 4922 4884 -2463 -5689 -178 5449 1791 -4941
2360d941L22P627K997o459n760M076P231j994p837p18Q496M511o919p381L184
$$ -4941 -4619 3008 6005 -454 -6214 -2138 5093 3099 -4738 -5456 3040 7551 632 -6749 -3565
2375c565Q588N32q793l637P386P227m250r826K34J0377L913r035q749N934J1527
$$ -3565 5023 5555 -3238 -6875 511 7738 3488 -6338 -6104 4273 8186 -849 -9598 -3664 7863
2390G863k39j2256m576R821Q317o838j1043J831J3123M032j1109r336P005J1996
$$ 7863 7624 -4632 -9208 613 8930 2092 -8951 -7120 6003 10035 -1074 -10410 -3405 8591
2404H591j832j2736l817J1790Q513q117j1322L766J2422J244j2003o059Q968R563
$$ 8591 6759 -5977 -9794 1996 10509 2392 -8930 -5164 7258 8502 -3501 -9560 -592 8971
2418H971l854j0997k90R909M202q194q247N175J0525n86j0393m315Q637P683n722
$$ 8971 5117 -5880 -6170 3739 7941 -253 -8500 -3325 7200 6614 -3779 -8094 543 8226 2504
2433B504j0141J427J0792K500r130o621O923R607k983j1499k422J0570P211o919
$$ 2504 -7637 -6210 4582 7082 -2048 -8669 -1746 7861 4878 -6621 -9043 1527 8738 1819
2447A819r927K756J1342J878j0762o485Q314J0056l362j1357j577J0427O596p297
$$ 1819 -8108 -5352 5990 7868 -2894 -9379 -1065 8991 5629 -5728 -7305 3122 9718 2421
2461B421r681K403J0506K521q965o624O200R522j917j1844l090R944P946p482
$$ 2421 -7260 -4857 5649 8170 -795 -7419 -1219 8303 6386 -5458 -8548 1396 9342 1860
2475A860r871K479J0777J935j1007n431P548Q835l762j0542p41J0587N481q388
$$ 1860 -8011 -5532 5245 7180 -3827 -9258 -1710 7125 3363 -7179 -7920 2667 8148 -240
2489b40q617M737J0263J18j0404l634R843P367p279j0082K498J1487K093r989
$$ -240 -8857 -4120 6143 6261 -4143 -7777 2066 9433 2154 -7928 -5430 6057 8150 -1839
2503a839n708P991R364m929j0790L06J0395M085p640r296M836J0755k33j1568
$$ -1839 -7547 444 9808 4879 -5911 -5605 4790 8875 1235 -8061 -3225 7530 7297 -4271
2517d271m345R635O609n594r821J588J0967J869r160o224N915Q079k108p972j936
$$ -4271 -8616 1019 7628 2034 -7787 -6199 4768 6637 -2523 -8747 -2832 5247 3139 -4833 -6769
2532f769P916M589o136n773K903P271m4o268l040N296N920l529n378J689M315
$$ -6769 1147 5736 -400 -6173 -3270 4001 3957 -2311 -5351 -55 5865 2336 -3042 -1353 2962
2547B962N67k923k173K436L287j212l518n95L006N40j747j852J67L510j108l050
$$ 2962 3529 606 -1567 869 4156 2944 -574 -1169 1837 2377 630 -1222 -1055 2455 1347 -1703
2563a703N50K153L20j296k489j39K334N78j288o84J03N17N06R5k045Q27K061K58
$$ -1703 -1153 1000 1320 24 -2465 -2604 -270 308 -980 -1664 -1561 -1044 -538 -443 -2488 -1661 400 658
2581F58j998P48o08J520J214k187K95K97J552P32k41k175P07K950l74l310m4J832
$$ 658 -1340 -592 -1200 320 1534 -653 -358 -61 1491 2223 1982 -193 514 3464 3090 -220 -264 1568
2599A568J378l86k850m03J884J167j682j456j13K80J481l86k592M97J695O77k017
$$ 1568 2946 2560 -290 -693 1191 2358 676 -780 -893 -613 868 482 -2110 -1613 82 759 -1258
2616a258k344O16L312P36k781j270R93J346K251k411k027M144J588l289j793J125
$$ -1258 -3602 -2986 326 1062 -1719 -2989 -1996 -650 1601 -810 -2837 1307 2895 -394 -2187 -1062
2632a062K367J832k833j878K790K657j610l209Q70K486J627k718l315J938M520
$$ -1062 1305 3137 304 -1574 1216 3873 2263 -946 -76 2410 4037 1319 -1996 -58 4462
2647D462m76n323p30K177L344j240o740L72O357J844o013m089L526O036j506p000
$$ 4462 3986 -1337 -2067 110 3454 2214 -4526 -4154 2203 4047 -1966 -6055 -2529 3507 2001 -4999
2663d999j804P375N045p423n436L314P179J960p229n352O665P579l456p840k55
$$ -4999 -6803 572 5617 -1806 -7242 -3928 3251 5211 -2018 -7370 -705 6874 3418 -4422 -4677
2678d677P562N378p366o974M301R305j724q223j522N645N234l745p634P12Q567
$$ -4677 2885 8263 897 -6077 -1776 7529 5805 -2418 -3940 1705 6939 3194 -4440 -3728 4839
2693D839R52o890m065L577O440n57q878k514Q198M139n900n745J859P284J406
$$ 4839 5791 -1099 -5164 -1587 4853 4296 -4582 -7096 1102 5241 -659 -6404 -4545 2739 4145
2708D145p370m977O608O533l660o815l17O842N092n481q047M585Q917q94p259
$$ 4145 -3225 -8202 -1594 4939 1279 -5536 -5853 989 6081 600 -7447 -2862 6055 5161 -2098
2723b098l602O117P468l081r434L23Q835L385n921p043J801R177K298r818o160
$$ -2098 -5700 417 7885 4804 -4630 -4307 4528 7913 1992 -5051 -3250 5927 8225 -1593 -7753
2738g753P860P586l547r446k333J0006O315r271r245O050R648j010r412m968Q322
$$ -7753 107 7693 4146 -5300 -7633 2373 8688 -583 -9828 -3778 5870 4860 -4552 -9520 -1198
2753a198Q751n438j1263K337J1291J959q668o895N905J1859l129j2437j80J1082
$$ -1198 7553 2115 -9148 -6811 4480 6439 -2229 -9124 -3219 8640 5511 -6926 -7106 3976
2767C976M906p428q944M158J1734j34j1986l764J0177P111n971j0132Q51J1676
$$ 3976 8882 1454 -7490 -3332 8402 8268 -3718 -7482 2695 9806 3835 -6297 -5446 6230
2781F230L445j1963o979R140R016m269j0856k082J1141O361j0277q895O318R701
$$ 6230 9675 -2288 -9267 -127 8889 4620 -6236 -8318 2823 9184 -1093 -9988 -3670 6031
2795F031j479r329m189Q599P646o000r669L095R582J218p206n312M785Q641k638
$$ 6031 4552 -4777 -8966 -367 7279 1279 -8390 -5295 4287 5505 -1701 -7013 -2228 6413 3775
2810C775r035J080P658J893l991m812J839O630l52o516j044M993K105j926l578
$$ 3775 -5260 -4180 3478 5371 1380 -3432 -1593 5037 4685 -1831 -2875 2118 4223 2297 -1281
2825a281q21M307K042n058k822L541K473j078l009j422L246K441l659k463K208
$$ -1281 -2102 2205 4247 -811 -3633 -92 2381 1303 -1706 -3128 118 2559 -1100 -3563 -1355
2840a355J602m6j181j759J015L155q61k828K65J570R29P85k256j056K751J244
$$ -1355 247 201 -980 -2739 -1724 1431 570 -2258 -1993 -423 506 1291 -965 -2021 730 1974
2856A974j740o98j52J014K424j363l005J367K708j14k078j556R15L112l17m094
$$ 1974 234 -464 -616 398 2822 1459 -1546 -179 2529 2415 337 -1219 -304 2808 2491 -1603
2872a603J68L099J01j921j143j39K252O71k555j112J761N86k01q47j115Q17K074
$$ -1603 -1435 1664 1765 -156 -1299 -1438 814 1485 -1070 -2182 -421 165 -36 -883 -1998 -1181 893
2889H93j447j728J679Q24k15r7j005J22J783n18j105J624j89m93O66n25n28J447
$$ 893 -554 -2282 -603 221 6 -91 -1096 -974 809 291 -814 810 621 128 794 269 -259 1188
2907A188j56r14O69J71p47P40K64q12j66Q7k69O12l85j437J292J663k123j775
$$ 1188 1032 118 787 958 211 951 1215 403 237 324 55 667 282 -1155 137 1800 -323 -2098
2925b098J099J638M83j926j651J858K838k357k968J043K931J018j981l240J560
$$ -2098 -999 639 1122 -804 -2455 -597 2241 -116 -3084 -2041 890 1908 -73 -3313 -1753
2940a753M774n42m913m46L240K603j722m295M85N969Q71n381k398K997L989n45
$$ -1753 3021 2479 -2434 -2880 360 2963 1241 -3054 -2569 3400 4271 -1110 -3508 -511 3478 2933
2956B933m687j638M605L282l851l927J336M180J585m736m077M103N688k583n691
$$ 2933 -1754 -3392 1213 4495 644 -3283 -1947 2233 3818 -918 -4995 -892 4796 2213 -3478
2971c478j95M719K875l865m734K526O244p95o007j767M256M323k345o162M76P243
$$ -3478 -3673 1046 3921 56 -4678 -2152 4092 3297 -2710 -4477 -221 4102 1757 -4405 -3929 3314
2987C314J306n728l761L610N717r50p141j541O837M295m685n700J105O263K662
$$ 3314 4620 -1108 -4869 -1259 4458 3508 -3633 -5174 1663 5958 1273 -4427 -3322 2941 5603
3002E603o882n133O139O569k880p710j320P459M873n693p982L505Q797l31p883
$$ 5603 -1279 -6412 -273 6296 3416 -4294 -5614 1845 6718 1025 -6957 -3452 5345 5014 -2869
3017b869k946N981O481l999q863J131R135K347p131n541M052P786j186q936j584
$$ -2869 -5815 166 6647 2648 -6215 -5084 4051 6398 -733 -6274 -2222 5564 4378 -4558 -6142
3032f142Q352M629o134o939K623Q205R93q077m241O805O189m126o940K60P486
$$ -6142 2210 6839 705 -6234 -3611 4594 5587 -2490 -6731 74 6263 2137 -4803 -4543 2943
3047B943L006o914o004M887P813j423p768j981O947M629n519o611L061P690J99
$$ 2943 5949 -965 -6969 -2082 5731 4308 -3460 -5441 1506 6135 616 -5995 -2934 4756 4955
3062D955p168l135M912O219k780p114j57O313K777m475m753K021O389J97o356
$$ 4955 -2213 -5348 -436 5783 3003 -4111 -4268 2045 4822 347 -4406 -2385 4004 4201 -2155
3077b155l007N192M070k107n188l77N006K293l807m276K437M285O47m318k689
$$ -2155 -5162 30 4100 1993 -3195 -3572 1434 3727 -80 -4356 -1919 2366 3013 -1305 -3994
3092c994L297M344j526n109m85M347K441k920l797J869M570J2m618k058L794L645
$$ -3994 -697 3647 2121 -2988 -3473 874 3315 395 -3402 -1533 3037 3049 -1569 -3627 167 3812
3108C812j576m564k07M127K678m046l546K320M081o0m659k258M846L647l246m986
$$ 3812 2236 -2328 -2535 1592 4270 224 -3322 -1002 3079 3019 -1640 -3898 948 4595 1349 -3637
3124c637M58M985J669m279l623L084M766j015n824j442M989L958l527n172J899
$$ -3637 -3179 1806 3475 -804 -4427 -1343 3423 2408 -3416 -4858 131 4089 562 -4610 -2711
3139b711N773M39n660k297M357L937k529m713Q73N176J249l999k757K469L208
$$ -2711 3062 3501 -2159 -4456 -99 3838 1309 -3404 -2531 2645 3894 -105 -2862 -393 2815
3154B815o06l386o39L753J729l142k955J526L411l48l107j253K876J692k318k094
$$ 2815 2209 -1177 -1816 1937 3666 524 -2431 -905 2506 2158 -949 -2202 674 2366 48 -2046
3170b046J200J924o11k271o51K394J678j594k035N98J838l05j748l74J931J260
$$ -2046 -846 1078 467 -1804 -2455 -61 1617 23 -2012 -1414 424 119 -1629 -2003 -72 1188
3186A188j416j224J262J343p36j636P72J792l01j061q7J521M91j507j055R19J238
$$ 1188 -228 -1452 -190 1153 417 -1219 -447 1345 1044 -17 -104 1417 1908 401 -654 265 1503
3203A503k92j599P39J540p6k190j373J611K054q22k826k37K841J139k979k050
$$ 1503 1211 -388 351 1891 1815 -375 -1748 -137 1917 1095 -1731 -1968 873 2012 -967 -3017
3219c017J681K801j058k965m39L281J857k214k973N61L342O94k506j914K714L126
$$ -3017 -1336 1465 407 -2558 -2997 284 2141 -73 -3046 -2485 857 1551 -955 -2869 -155 2971
3235B971j302l802l4L780J708l080k610J894L669J29l725j243K933K049j999l486
$$ 2971 1669 -2133 -2167 1613 3321 241 -2369 -475 3194 3323 -402 -1645 1288 3337 1338 -2148
3251b148L05M114J522l493l387K142L500j124l866o83L995K125l042l832R04M415
$$ -2148 -1843 2271 3793 300 -3087 -945 2555 1431 -2435 -3118 877 3002 -40 -3872 -2968 1447
3267A447P92l868l058L066M397j075m408j055M409L239l938m749K203O232R96
$$ 1447 2239 -1629 -4687 -1621 2776 1701 -2707 -3762 647 3886 -52 -4801 -2598 3634 4630
3282D630n678l072M303M785k603n543R2O156K639n016m533K969N811o62o463k222
$$ 4630 -1048 -4120 183 4968 2365 -3178 -3086 3070 5709 693 -3840 -871 4940 4278 -2185 -4407
3298d407N155M565l590n729J184N876J084o252l912M237N927j852o468r46N845
$$ -4407 748 5313 1723 -4006 -2822 3054 4138 -2114 -6026 -1789 4138 2286 -4182 -5128 717
3313G17L047m526n078K562O441k8o178k276N240N510l786o207J029O532J940n216
$$ 717 3764 -762 -5840 -3278 3163 3135 -3043 -5319 -79 5431 1645 -4562 -3533 2999 4939 -277
3329b77l622L910N474k256n961q62N569L714l973n118J461N311J208n391l282
$$ -277 -3899 11 5485 3229 -2732 -3594 1975 5689 1716 -3402 -1941 3370 4578 -813 -4095
3344d095L782M387k036n484m17N120L075m132m839J472M830J109m900k546L613
$$ -4095 -313 4074 2038 -3446 -3863 1257 4332 200 -4639 -3167 1663 2772 -2128 -4674 -1061
3359a061M295j619n435p30N093L243l612m447J948N272N31m668k089L452L873
$$ -1061 3234 1615 -3820 -4550 543 3786 174 -4273 -2325 2947 3478 -1190 -3279 173 4046
3374D046j945m640R7M859K471l583m362J847M933k0m749k058L817L969k582n264
$$ 4046 2101 -2539 -2442 2417 4888 1305 -3057 -1210 3723 3703 -1046 -3104 713 4682 2100 -3164
3390c164P2N268J711m792l809K626N212m54n741j711M778L676l599n539J770O373
$$ -3164 -3092 2176 3887 -905 -4714 -2088 3124 2670 -3071 -4782 -4 3672 73 -5466 -3696 2677
3406B677J218n850l463M203N104k278n272K82N799K245m856l503K899M889o95
$$ 2677 3895 -1955 -5418 -1215 3889 1611 -3661 -3379 2420 4665 -191 -3694 -795 4094 3399
3421C399m868j659M228L475k288m433Q47M418K29m223k628L594L783j987m381
$$ 3399 -1469 -3128 1100 4575 2287 -2146 -1299 3119 3348 -875 -3503 91 3874 1887 -2494
3436b494j30L904J292l181k672J665L898q84l982n45L321J968k727l075J414L082
$$ -2494 -2624 1280 2572 -609 -3281 -1616 2282 1398 -2584 -3129 192 2160 -567 -3642 -2228 854
3452H54J91k549p35K448J919k233j722P01K476N16j909n51J515N26n72q41j71
$$ 854 1045 -1504 -2239 209 2128 -105 -1827 -1126 1350 1866 -43 -594 921 1447 875 34 -137
3469a37J039L15o07o97P66N37l08n76m44M93k32l91N1P00m04r34j80P08p0l46
$$ -137 902 1217 610 -87 679 1216 908 332 -112 381 149 -242 -191 509 105 -829 -1009 -301 -371 -717
3489g17m46N42N62n10p95R7J045N08j022n92K06J713L06j565l75J487J077j327
$$ -717 -1163 -621 -59 -569 -1364 -1267 -222 286 -736 -1328 -1122 591 897 -668 -1043 444 1521 194
3507A94j388Q90K268J25j960r92J322J505r90j414j35J898P91j782j653R94K079
$$ 194 -1194 -304 1964 2089 129 -863 459 1964 974 -440 -575 1323 2114 332 -1321 -327 1752
3524A752j61k395j138J835J766j285k085K56K236L04j898j827J354K629l00k666
$$ 1752 1591 -804 -1942 -107 1659 374 -1711 -1455 781 1085 -813 -2640 -1286 1343 1043 -1623
3540a623j051K600J971j451l068L46L871O65l065k175K806L616j446l753p44L987
$$ -1623 -2674 -74 1897 446 -2622 -2276 1595 2260 -805 -2980 -174 3442 1996 -1757 -2501 1486
3556A486K318k887l023J049M105p6l971j927L245L326j535m342l69M381J863l581
$$ 1486 3804 917 -2106 -1057 3048 2972 -999 -2926 319 3645 2110 -2232 -2601 1780 3643 62
3572F2l948K003M457j57m558j417L516L595k644m662L58M895J631m092l047K758
$$ 62 -3886 -1883 2574 2417 -2141 -3558 -42 3553 909 -3753 -3395 1500 3131 -961 -4008 -1250
3588a250M776j198n238q28M691L144l590m419K221M787N69m662k431L256M055
$$ -1250 3526 2328 -2910 -3738 953 4097 507 -3912 -1691 3096 3665 -997 -3428 -172 3883
3603C883k090m339m19M930K173l552m113J475N331K19n150k077L981L901k670
$$ 3883 1793 -2546 -2965 1965 4138 586 -3527 -2052 3279 3498 -1652 -3729 252 4153 1483
3618A483n057J69M964K432m145m574K536N513o6n292k712M597M118k737n194N55
$$ 1483 -3574 -3405 1559 3991 -154 -4728 -2192 3321 3255 -2037 -4749 -152 3966 1229 -3965 -3410
3634c410O013K099n291m108L061N460p10n579j643N095L753l379n427J605N431
$$ -3410 2603 4702 -589 -4697 -1636 3824 3114 -2465 -4108 987 4740 1361 -4066 -2461 2970
3649B970J491n419l716L862N480j583o284q92N933L078m842n024K571O352q2o336
$$ 2970 4461 -958 -4674 -812 4668 3085 -3199 -4091 1842 4920 78 -4946 -2375 3977 3895 -2441
3665b441k563N207M757l399o149Q81O332J924n648m278M297O088j911o794o93
$$ -2441 -5004 203 4960 1561 -4588 -3707 2625 4549 -1099 -5377 -1080 5008 3097 -3697 -4390
3680d390O156L332m785n022K810N483K0n936j934M361M352k602n237J82N249J575
$$ -4390 1766 5098 313 -4709 -1899 3584 3604 -2332 -4266 95 4447 1845 -3392 -3210 2039 3614
3696C614m056l653K866M695j296m777o69M315K539l091l814J820L972R2l671j646
$$ 3614 -442 -4095 -1229 3466 2170 -2607 -3276 1039 3578 487 -3327 -1507 2465 2557 -1114 -2760
3712b760K837K819j742l250Q9L663R22k685k371K207K150l14k828l59K034J246
$$ -2760 77 2896 1154 -2096 -2007 1656 2578 -107 -2478 -271 1879 1565 -1263 -1622 412 1658
3728A658j297j545L32J519K90r46j217K51J530J96j220j061R03J425j6j534o31
$$ 1658 361 -1184 -852 667 957 11 -1206 -955 575 771 -449 -1510 -607 818 802 -732 -1363
3745a363J360J222p19j445L7J087J093q07j484O3J676P17j660p19R97J592l85
$$ -1363 -3 1219 500 -945 -908 179 1272 465 -1019 -956 720 1437 -223 -942 55 1647 1262
3762A262k061m4J376J361j423j386L77J358M31j429r85R78J291l34j788l44J491
$$ 1262 -799 -843 533 1894 471 -915 -538 820 1251 -178 -1163 -185 1106 772 -1016 -1360 131
3779A31O89q57j561N08J636j55j790K16J144Q23q59p79K30J038q2r15K95N47L96
$$ 131 820 -37 -1598 -1090 546 391 -1399 -1183 -39 784 -75 -854 -624 414 332 -583 -288 259 655
3798F55l48k71l8M90L8l20K08L36l26j23L77L02n17q96L79R15j6j483k91J519
$$ 655 307 36 -2 488 526 206 414 750 424 301 678 980 463 -433 -54 861 845 -638 -929 590
3818E90N69j419j443J263J624q53j846l31J947J241j795j500L23K413O87k597
$$ 590 1159 -260 -1703 -440 1184 331 -1515 -1846 101 1342 -453 -1953 -1630 783 1470 -1127
3834a127j587K272K565q36l382j19L441J537k727k460J783L450o5l929j229L392
$$ -1127 -2714 -442 2123 1287 -2095 -2214 1227 2764 37 -2423 -640 2810 2745 -1184 -2413 979
3850I79K953k700l599R78M175Q27m438k567L264L962j959m813L35M090J708l574
$$ 979 3932 1232 -2367 -1389 2786 3613 -825 -3392 -128 3834 1875 -2938 -2603 1487 3195 -379
3866c79l559K291M157p68m284j244L488L117k451m016L97M624J511m036l073L202
$$ -379 -3938 -1647 2510 1742 -2542 -3786 -298 2819 368 -3648 -3251 1373 2884 -1152 -4225 -1023
3882a023M202q50n258o93N192K873l701m087J695M939R81n099k799L927M512k192
$$ -1023 3179 2329 -2929 -3622 1570 4443 742 -3345 -1650 3289 4270 -829 -3628 299 4811 2619
3898B619n164m39N436K330l987n114K414N960o36n459k403M587L856k614n477
$$ 2619 -2545 -2984 2452 4782 795 -4319 -1905 4055 3419 -2040 -4443 144 4000 1386 -4091
3913d091P1N710J868m412m079K581N626q88n424k037N734L605l765n060J483O255
$$ -4091 -4020 1690 3558 -854 -4933 -2352 3274 2386 -3038 -5075 659 4264 499 -4561 -3078 3177
3929C177J246n960l520M753N481k392n911j70N757L254m833n547L219O590o02
$$ 3177 4423 -1537 -5057 -304 5177 2785 -3126 -3296 2461 5715 882 -4665 -1446 5144 4542
3944D542o749k104N626M286l951o096J491O534L59n590k906L556N045j584o215
$$ 4542 -2207 -4311 1315 5601 1650 -4446 -2955 3579 3938 -1652 -4558 -1002 4043 2459 -3756
3959c756q43N393K770l957m589J858N613N05n462k643M707M419k730m898M12N219
$$ -3756 -4599 794 3564 -393 -4982 -3124 2489 2994 -2468 -5111 -404 4015 1285 -3613 -3201 2018
3975B018J749m142l376K945M491j024m353j027L942L364k660m486P67M672O39
$$ 2018 3767 -375 -3751 -806 3685 2661 -1692 -2719 1223 4587 1927 -2559 -1792 2880 3519
3990C519l633k137K247K982p27m247j68L154J557k325k522K90K749J199k818k564
$$ 3519 -114 -2251 -4 2978 2251 -1996 -2164 990 2547 222 -2300 -2010 739 1938 -880 -3444
4006c444K064K776p79k708j033K703K597j941l182J086L084M57j995j909J736
$$ -3444 -1380 1396 617 -2091 -3124 -421 2176 235 -2947 -1861 1223 1680 -315 -2224 -488
4021d88K632l97l019m02K501J932j516k555K25L233J094l114j494J671K012o44
$$ -488 2144 1747 -1272 -1674 827 2759 1243 -1312 -1087 2146 3240 126 -1368 303 2315 1671
4037A671k456p91K590J599k041k500R16J843O57k288j497J411K391j448k331L92
$$ 1671 -785 -1576 1014 2613 572 -1928 -1012 831 1488 -800 -2297 -886 1505 57 -2274 -1882
4053a882J988N58j829j684J652K470o17k246L70J275O03p15j068N69K129J53k060
$$ -1882 106 664 -1165 -2849 -1197 1273 656 -1590 -1220 55 658 -57 -1125 -556 1573 1726 -334
4070c34q3J197N67l80j005K8J608k22j451L46J097k83o23N0p08K51K06n17M49
$$ -334 -417 780 1347 967 -38 -10 1598 1376 -75 271 1368 1085 462 512 -196 55 261 -256 193
4089A93J96r54l49O35j30l23J81p08M62J136j388n44J049M03J6p87q71J490J751
$$ 193 389 -565 -914 -279 -409 -732 -551 -1259 -797 339 -1049 -1593 -544 -141 -125 -912 -1783 -293 1458
4108A458j109k119J227J777l15j069j142J457K273p89k771L18K308Q53j555j938
$$ 1458 349 -1770 -543 1234 919 -150 -1292 165 2438 1649 -1122 -804 1504 2357 802 -1136
4124a136P78K876k51l493k07K827O24j980k211L89L201O39l035j432K233J094
$$ -1136 -358 2518 2267 -1226 -1433 1394 2018 38 -2173 -1784 1417 2056 -979 -2411 -178 916
4140I16j008k058q63K997K245k825k726J450L065M46k635k384K506M408k013l794
$$ 916 -92 -2150 -3013 -16 2229 -596 -3322 -1872 1193 1639 -996 -3380 -874 3534 1521 -2273
4156b273L57L804J094k804l178J926M609K38m687j179K899K894j933m275kN416
$$ -2273 -1916 1888 2982 178 -3000 -1074 3535 3773 -914 -2093 806 3700 1767 -2508 -2510 2906
4172B906M56m140k947L282L343m53m637j453M364K172l382l249J313M563Q63m296
$$ 2906 3362 -778 -3725 -443 2900 2447 -2190 -3643 721 2893 -489 -3738 -2425 2138 3001 -1295
4188a295l294L204N781k714n008J41M879J813l397m893L148N465p80n516p06M097
$$ -1295 -4589 -1385 4396 1682 -3326 -3185 1694 3507 110 -4783 -1635 3830 3050 -2466 -3172 925
4204I25L059k011n423O61O214J051n298k407L238M923j173o787r08N849L341m875
$$ 925 3984 1973 -3450 -2789 3425 4476 -822 -3229 9 4932 3759 -3028 -3936 1913 5254 379
4220C79m328K289M651O12n552k456M081M302k449n508N66M568K338l080n085K307
$$ 379 -3949 -1660 2991 3603 -1949 -4405 -324 3978 1529 -3979 -3413 1155 3493 413 -4672 -2365
4236b365N513r03n094q46L771M002k025n778O26N214J383l920k500J920M312j08
$$ -2365 3148 2245 -2849 -3695 76 4078 2053 -3725 -3099 2115 3498 -422 -2922 -1002 3310 3202
4252C202m874j768M677K905l492l755J069M292J762m238l315K878L587j180l746
$$ 3202 -1672 -3440 1237 4142 650 -3105 -2036 2256 4018 -220 -3535 -657 2930 1750 -1996
4267a996r57L237L416k254n083Q80M695P86l397l034K161M911n48n692r75N219
$$ -1996 -2953 284 3700 1446 -3637 -2757 1938 2724 -673 -3707 -1546 3365 2817 -2875 -3850 1369
4283A369K128l600l839J267N258J189n089k524L984L464k187m207l92N162K650
$$ 1369 3497 -103 -3942 -2675 2583 3772 -1317 -3841 143 3607 1420 -2787 -3179 1983 4633
4298D633m586l978K813N058j325m565j587L967L582k555n259J914M696O9m111
$$ 4633 47 -3931 -1118 3940 2615 -1950 -3537 430 4012 1457 -3802 -1888 2808 2877 -1234
4313a234k715L017M491j353n095L0M872Q47l290l303J901M851o14m635p03M172
$$ -1234 -3949 -932 3559 2206 -2889 -2859 2013 2860 -430 -3733 -1832 3019 2405 -2230 -2933 1239
4329A239J781k627k789O85L655L98l626j144L167K091k223k755R1L205J340k880
$$ 1239 3020 393 -2396 -1711 1944 2342 -1284 -2428 739 2830 607 -2148 -2057 1148 2488 -392
4345c92j816K743J271j471j773Q6K343M92j928j348J709J290n22j014j74M29J145
$$ -392 -2208 535 1806 335 -1438 -1352 991 1483 -445 -1793 -84 1206 684 -330 -504 -75 1070
4362A070j099j009J312J036j122p46L33M25J51p22l29J179L97j244o19J537J89
$$ 1070 -29 -1038 274 1310 188 -558 -225 200 351 -371 -700 479 876 -368 -987 550 739
4379G39o59j006L77J096L57j586l32J660L48j251j401N94J952M58j926j198J985
$$ 739 80 -926 -549 547 904 -682 -1014 646 994 -257 -1658 -1064 888 1346 -580 -1778 207
4396B07J278j544j665Q34K040L34k169j286K236J699j208j572k86J695Q72j325
$$ 207 1485 -59 -1724 -890 1150 1484 -685 -1971 265 1964 756 -816 -1102 593 1465 140
4412A40j513R32K268m03k196j191K059J921p61k491k27K805N06k286j466Q89K335
$$ 140 -1373 -441 1827 1424 -772 -1963 96 2017 1256 -1235 -1462 1343 1849 -437 -1903 -1014 1321
4429A321P6k740q24K381J627j358k433k27K796J254k656j474J715K666o74l192
$$ 1321 1397 -1343 -2167 214 1841 483 -1950 -2177 619 1873 -783 -2257 -542 2124 1450 -1742
4445a742p57K202K919j538k773O17K409R97k116k129J167L162k31l140j491L123
$$ -1742 -2499 -297 2622 1084 -1689 -1072 1337 2334 218 -1911 -744 2418 2187 -953 -2444 679
4461F79K728j838m079J34M447Q51l609k274K701L079j248l695j120L525K769k658
$$ 679 3407 1569 -2510 -2376 2071 2922 -687 -2961 -260 2819 1571 -2124 -3244 281 3050 392
4477C92l847J141M340J56l692k457L517L714k072m481J69M806J789l245l922K228
$$ 392 -3455 -2314 2026 2182 -1510 -3967 -450 3264 1192 -3289 -3120 1686 3475 230 -3692 -1464
4493a464M189nm697j246L920L427j952n075M25N021J752m506l351K888M446p85
$$ -1464 2725 2720 -1977 -3223 697 4124 2172 -2903 -2478 2543 4295 -211 -3562 -674 3772 2987
4509B987m986j221M391K714l326m344J610M727J080m733l058L069M387j708m844
$$ 2987 -1999 -3220 1171 3885 559 -3785 -2175 2552 3632 -1101 -4159 -1090 3297 1589 -3255
4524c255l21M436K440l501m123J972M912J05m556k111L585L841j822m120r6M522
$$ -3255 -3576 860 3300 -201 -4324 -2352 2560 2665 -1891 -4002 -417 3424 1602 -2518 -2614 1908
4540A908K056l730l925K118N515o1n098k167M210L598k554m880Q80M959J256m550
$$ 1908 3964 234 -3691 -1573 3942 3881 -1217 -3384 826 4424 1870 -3010 -2130 2829 4085 -465
4556d65l430L278M390j222n257j129M286L006k989m529J474N119J72m959k368
$$ -465 -3895 -617 3773 2551 -2706 -3835 451 3457 468 -4061 -2587 2532 2704 -2255 -4623
4571d623L542M352j919m749k44M917J951l767l361K026N084n86m534j836M327
$$ -4623 -1081 3271 1352 -3397 -3641 1276 3227 -540 -3901 -1875 3209 2623 -1911 -3747 580
4586E80L539k703m442R59M611J292l872k625L116L488j760m352r1L967J642k878
$$ 580 4119 1416 -3026 -2067 2544 3836 -36 -2661 455 3943 2183 -2169 -2260 1707 3349 471
4602D71k908J331L315j45l383j425K677K127j887l128P21L285Q11k854j835J670
$$ 471 -2437 -1106 2209 2064 -1319 -2744 -67 2060 173 -2955 -2234 1051 1862 -992 -2827 -1157
4618a157K201n24k441q4K138J447j669j670N88K209O72j916j271J810J596l22
$$ -1157 1044 520 -1921 -2005 133 1580 -89 -1759 -1171 1038 1710 -206 -1477 333 1929 1607
4634A607j805m81J810Q29j203j291N68J490M3j115q02M29O39k86o88l67O34P18
$$ 1607 -198 -679 1131 1960 757 -534 34 1524 1567 452 -350 79 718 432 -256 -623 11 729
4652G29o00j074j90O51N55o07q55K25P50J43k52l04k84Q51P1n06m00J082M97j51
$$ 729 129 -945 -1135 -484 71 -536 -1391 -1166 -416 -273 -525 -829 -1113 -262 -191 -697 -1097 -15 482 331
4672C31r76K61J039J62m50l29Q42L9l75O2L8L6J50j85K51p29J82L84K15m56n28
$$ 331 -645 -384 655 817 367 38 880 919 544 606 644 680 830 645 896 167 349 733 948 492 -36
4693c6j37K36R2m42k52J51K52K97q98o90N16R01n71o46k44J108Q56r12j052L40
$$ -36 -173 63 155 -287 -539 -388 -136 161 -737 -1427 -911 -10 -581 -1227 -1471 -363 493 -419 -1471 -1131
4713a131J525R2j195o04J146J816l31k118k08K092J122j541j915J251K749n09
$$ -1131 394 486 -709 -1313 -167 1649 1318 -800 -1008 1084 2206 665 -1250 1 2750 2241
4729B241l064n85K238J997j998k583N58L027P97k984j758J581K611j095l421m29
$$ 2241 -823 -1408 830 2827 829 -1754 -1196 1831 2628 -356 -2114 -533 2078 983 -2438 -2867
4745b867L512J670k666l018J432L761j52l910j374L611K573k044l714R86L740
$$ -2867 645 2315 -351 -3369 -1937 1824 1672 -2238 -3612 -1 2572 528 -3186 -2200 1540
4760A540R85l153k307K482L358p04l660r29L856K287k681l613R49M609N51m288
$$ 1540 2525 -628 -2935 -453 2905 2201 -1459 -2388 1468 3755 1074 -2539 -1590 3019 3570 -718
4776g18j894K879L155j720m017J59L876J521l168l219J562L993m24m005j483L342
$$ -718 -2612 267 3422 1702 -2315 -2156 1720 3241 73 -3146 -1584 2409 1985 -2020 -3503 -161
4792a61K845j809m174O41L969J195l754k523K637L772p59l673j667L855K965k138
$$ -161 2684 875 -3299 -2658 1311 2506 -1248 -3771 -1134 2638 1879 -1794 -3461 394 3359 1221
4808A221l920N22M639J204m024l084K956M404j375m713p70M422K933l622l858
$$ 1221 -2699 -2177 2462 3666 -358 -3442 -486 3918 2543 -2170 -2940 1482 4415 793 -3065
4823c065J569M686J09m678k550L755L717j859m663m15M561K465m107l749K407
$$ -3065 -1496 3190 3299 -1379 -3929 -174 3543 1684 -2979 -3394 1167 3632 -475 -4224 -1817
4838a817M715o20m829j674M545L406l335m164Q70M826J193m268k964L499M280
$$ -1817 2898 2278 -2551 -4225 320 3726 391 -3773 -2903 1923 3116 -1152 -4116 -617 3663
4853C663j327m789n91M619K496l548l888K043M590K9m821j580L645L112k409l853
$$ 3663 2336 -2453 -3044 1575 4071 523 -3365 -1322 3268 3297 -1524 -3104 541 3653 1244 -2609
4869b609P87L644J185l418k583K326K861n55l549q34L119K241k714k739R27L352
$$ -2609 -1822 1822 3007 -411 -2994 -668 2193 1638 -1911 -2745 374 2615 -99 -2838 -1911 1441
4885A441K15k905j329K098K231r41k470m35K508J713j746k328Q06K398M60j982
$$ 1441 1656 -1249 -2578 -480 1751 810 -1660 -2095 413 2126 380 -1948 -1142 1256 1716 -266
4901b66j473J471K206o00k182o17K454R57j357j693M26J820L87j863j132J015
$$ -266 -1739 -268 1938 1338 -844 -1461 993 1950 593 -1100 -674 1146 1533 -330 -1462 -447
4917d47J811l68k032l73J505J388j076k050J57K030Q30j774j272Q13J995j41k083
$$ -447 1364 996 -1036 -1409 96 1484 408 -1642 -1485 545 1375 -399 -1671 -858 1137 996 -1087
4934a087n52K127J010r84k185N53K283M64k165j343J894J564o90k111K55K268
$$ -1087 -1639 488 1498 514 -1671 -1118 1165 1629 -536 -1879 15 1579 889 -1222 -967 1301
4950A301M46k031r42J250J492o08j402l25J411Q37j390j090O57J238k2j293o63
$$ 1301 1747 -284 -1226 24 1516 908 -494 -819 592 1429 39 -1051 -394 844 822 -471 -1134
4967a134J057Q77o58j103N34Q45M3r78m06Q97N26m53n56J35P29j39l98l28Q51
$$ -1134 -77 800 142 -961 -427 418 461 -517 -923 -26 500 47 -509 -374 355 216 -182 -510 341
4986C41N19j060l69R38J35n92o96P82J041o47j202N35R83L42j620n89J213R78
$$ 341 860 -200 -569 369 504 -88 -784 -2 1039 392 -810 -275 708 1050 -570 -1159 54 1032
5004A032p60j337L79J336P64j714r06R67J642p13j880l63K115J085j643j729J247
$$ 1032 272 -1065 -686 650 1414 -300 -1206 -239 1403 690 -1190 -1553 562 1647 4 -1725 -478
5021d78K173m81k214q98K241J741j531k317L37K751L92k244j748K099K185p86
$$ -478 1695 1214 -1000 -1898 343 2084 553 -1764 -1427 1324 1716 -528 -2276 -177 2008 1222
5037A222l210p9L060J425k660k618K079K901m51l226q27L089K125k131l218O70
$$ 1222 -1988 -2067 993 2418 -242 -2860 -781 2120 1669 -1557 -2384 705 2830 699 -2519 -1849
5053a849L558R16k937k142J913L333j247l317p65L492J864k531l123J477L842
$$ -1849 1709 2625 -312 -2454 -541 2792 1545 -1772 -2537 955 2819 288 -2835 -1358 2484
5068B484K3l637j650K771K604j282l459j51L526J771l161l041J861L589j52l692
$$ 2484 2507 -1130 -2780 -9 2595 1313 -2146 -2297 1229 3000 -161 -3202 -1341 2248 2096 -1596
5084a596j695L489K996k519l887R76M134P43l854k195K733L470j034l637n91L126
$$ -1596 -3291 198 3194 675 -3212 -2236 1898 2641 -1213 -3408 -675 2795 1761 -1876 -2467 659
5100F59K634k820l297J527L778O32m264j688K701L475j536l907n9L849J717l035
$$ 659 3293 473 -2824 -1297 2481 3113 -1151 -2839 -138 3337 1801 -2106 -2165 1684 3401 366
5116C66l295K046L589m68m036j643L755L031k322l988P01L957P74l791k026K476
$$ 366 -2929 -883 2706 2238 -1798 -3441 314 3345 1023 -2965 -2264 1693 2467 -1324 -3350 -874
5132h74L369j011l789l84L023K182k388k889J131L342P55k887k202K302K784p74
$$ -874 2495 1484 -2305 -2689 334 2516 128 -2761 -1630 1712 2467 -420 -2622 -320 2464 1690
5148A690l362l32L066J947k245k861J291L122ql128j492K463K236j204k973R6
$$ 1690 -1672 -2004 1062 3009 764 -2097 -806 2316 2308 -820 -2312 151 2387 1183 -1790 -1694
5164a694K919J498k533k962J348L245J00l441j295L037J930j870k945L55L081
$$ -1694 1225 2723 190 -2772 -1424 1821 1921 -1520 -2815 222 2152 282 -2663 -2308 773
5179G73J098k314k245J304L239m61l026q23K482K391j360l148O16L537O53k819
$$ 773 1871 -443 -2688 -1384 1855 1394 -1632 -2455 27 2418 1058 -2090 -1474 2063 2716 -103
5195a03k213K029K774n97l127n3K494J351j916k490R82L111n6k652j620K191K265
$$ -103 -2316 -287 2487 1890 -1237 -1290 1204 2555 639 -1851 -869 2242 2186 -466 -2086 105 2370
5212B370j552k840N74K519M07k513j672K312J653n25k538k82J934J299j207j775
$$ 2370 818 -2022 -1448 1071 1478 -1035 -2707 -395 1258 733 -1805 -2087 -153 1146 -61 -1836
5228a836R24J734Q1j809o09J610J317p95j678O80J351N37j352q71J243P92m00
$$ -1836 -912 822 903 -906 -1515 95 1412 617 -1061 -381 970 1507 155 -716 527 1319 919
5245I19j363K37J112L04p83o74P3J077k65j033L86L99K17r97j30K94L76q30m6
$$ 919 -444 -207 905 1209 426 -248 -175 902 637 -396 -10 389 606 -391 -521 -227 149 -681 -727
5264g27K82M90q26m03J051L16q58m26N53O56J22o66k12Q63L64o20m20M08P42Q32
$$ -727 -445 45 -781 -1184 -133 183 -675 -1101 -548 108 230 -436 -648 215 579 -41 -461 -53 689 1521
5284A521j255o35O66J127j26j499M1Q70P88j282j024P74J441n37j312o41Q35J172
$$ 1521 266 -369 297 1424 1298 -201 -160 710 1498 216 -808 -34 1407 870 -442 -1083 -248 924
5302I24m00j699O6J624K85j769q18J009J460j49j880m09J594J175j331j007K20
$$ 924 524 -1175 -1109 515 800 -969 -1787 -778 682 533 -1347 -1756 -162 1013 -318 -1325 -1105
5319a105J622P9r32j254J479J477l65j443n22J304J384q28j590L69J677N27j598
$$ -1105 517 596 -336 -1590 -111 1366 1001 -442 -964 340 1724 896 -694 -325 1352 1879 281
5336B81r63P69J522r3k306m97J914J120q81k114j39J781Q47j898j873J745K347
$$ 281 -682 87 1609 1516 -790 -1287 627 1747 866 -1248 -1387 394 1241 -657 -2530 -785 1562
5353A562n41k832o58K165J823j667k678J421K620J51k299j506J770K921j035l396
$$ 1562 1021 -1811 -2469 -304 1519 -148 -2826 -1405 1215 1366 -933 -2439 -669 2252 1217 -2179
5369b179L6K843K062j959k719R23L529J49l785j005L109K470j745l483j58L570
$$ -2179 -2143 700 2762 803 -1916 -993 2536 2685 -1100 -2105 1004 3474 1729 -1754 -1912 1658
5385A658J561l465k744K571K852m82l803j139L639K359k998l494J213L881M37
$$ 1658 3219 -246 -2990 -419 2433 1951 -1852 -2991 648 3007 9 -3485 -2272 1609 2046
5400B046l447k090K908L004j799l605M76L402J779k624l136J527M059k0l803j477
$$ 2046 -1401 -3491 -583 2421 622 -2983 -2507 895 2674 50 -3086 -1559 2500 2480 -1323 -2800
5416b800L264K540j705l506M66M079J179l593k553K244L288n81l300j335L341
$$ -2800 464 3004 1299 -2207 -1741 2338 3517 -76 -2629 -385 2903 2322 -978 -2313 1028
5431A028K195k590l260Q92L623O45l275k495K430L517j602l657J85K659J756k188
$$ 1028 3223 633 -2627 -1735 1888 2533 -742 -3237 -807 2710 1108 -2549 -2364 295 2051 -137
5447a37k934J487L673m08l288j337K299K889p42l680k01L916J323k940k290J486
$$ -137 -3071 -1584 2089 1681 -1607 -2944 -645 2244 1502 -2178 -2379 1537 2860 -80 -2370 -884
5463h84L312K03l512j737L442K269j773l119L41L131J348l230k466K521L271j397
$$ -884 2428 2631 -881 -2618 824 3093 1320 -1799 -1458 1673 3021 -209 -2675 -154 3117 1720
5479A720l716m87L015K133k631l003J551L530p11l212q16K338K277j482l214N85
$$ 1720 -1996 -2483 532 2665 34 -2969 -1418 2112 1401 -1811 -2627 -289 1988 506 -2708 -2123
5495b123L047R22k241j849J767K131m55k692o75L330J302k002j830N84K001M56
$$ -2123 924 1846 -395 -2244 -477 1654 1199 -1493 -2168 1162 2464 462 -1368 -784 1217 1673
5511A673k174j074K077J946j635j543r2J606J109j933j429J077J929o86j434q0
$$ 1673 -501 -1575 502 2448 813 -730 -822 784 1893 -40 -1469 -392 1537 851 -583 -663
5527f63J060P13j322j070Q60J433r76p80K37PM20J07o54l61R58Q5k00q4rM57K84
$$ -663 397 1110 -212 -1282 -422 1011 35 -745 -508 -501 -81 26 -628 -989 -31 54 -146 -230 -239 218 502
5548E02p71k80N38J41oK32j86j69L47j82j63K77j31j87P59Q8r69J65J69K6o0j20
$$ 502 -269 -549 -11 130 124 356 170 1 348 166 3 280 149 -38 721 809 -160 5 174 200 140 20
5570B0o20P19O29r05m31L91L15j54m43m74J291L69j187m05Q09L07O4k83q54P45
$$ 20 -600 119 748 -157 -588 -197 118 -36 -479 -953 338 707 -480 -885 -76 231 295 12 -842 -97
5590i7P41n30o86M62K28O02m97r12j66J521K78r77k25K85N21L32r74o09J183O82
$$ -97 644 114 -572 -110 118 720 223 -689 -855 666 944 -33 -258 27 548 880 -94 -703 480 1162
5610A162p96r48j76O91J181r35j290M67J586m35j080m26R91J306p00k366N99J951
$$ 1162 366 -582 -758 -67 1114 179 -1111 -644 942 507 -573 -999 -8 1298 598 -1768 -1169 782
5628G82M19j455q76M02J622P3k141m94K036J151r79j573k81K213J008k177j800
$$ 782 1201 -254 -1130 -728 894 967 -1174 -1668 368 1519 540 -1033 -1314 899 1907 -270 -2070
5645b070J801J996p16k087o16K413J534k107k568J262K753ok303j310J794K604
$$ -2070 -269 1727 1011 -1076 -1692 721 2255 148 -2420 -1158 1595 1589 -714 -2024 -230 2374
5661B374j147l106O0L197P57k429j996J390K877n36k833j080K653J782j251k187
$$ 2374 1227 -1879 -1819 1378 2135 -294 -2290 -900 1977 1441 -1392 -2472 181 1963 712 -1475
5677a475l19L188J146l145k300K038K999m61l115j166L326J885k267k976J312
$$ -1475 -1794 1394 2540 -605 -2905 -867 2132 1671 -1444 -2610 716 2601 334 -2642 -1330
5692a330K854L37k620k016K168L196j213l474N4K950J396j942k806J194L775k47
$$ -1330 1524 1861 -759 -2775 -607 2589 1376 -2098 -2044 906 2302 360 -2446 -1252 2523 2276
5708B276l616j224K712K470j526k830k88L405J311l099k121J737K925j96l134
$$ 2276 -1340 -2564 148 2618 1092 -1738 -2026 1379 2690 -409 -2530 -793 2132 1936 -1198
5723a198j620L510K657k436l470Q17L379Q85l179k483K678L475j475m173Q6L138
$$ -1198 -2818 692 3349 913 -2557 -1740 1639 2524 -655 -3138 -460 3015 1540 -2633 -2547 591
5739E91J635j991l222J342L895l02l506r72K761K473j802l248M41L666R12l104
$$ 591 2226 235 -2987 -1645 2250 1948 -1558 -2530 231 2704 902 -2346 -1905 1761 2673 -431
5755d31k052K163K637p64k962o22K943J822k155k449P93K733N57k712k087K265
$$ -431 -2483 -320 2317 1553 -1409 -2031 912 2734 579 -1870 -1077 1656 2213 -499 -2586 -321
5771c21K905j627k472o5K346R34j865k390J369K788m06k674k29J786J133p50k341
$$ -321 2584 957 -1515 -1580 766 1700 -165 -2555 -1186 1602 1196 -1478 -1707 79 1212 462 -1879
5788a879K06K475N89j731j061P45K082l84j772o88J940P81j001j040K19J308O33
$$ -1879 -1673 802 1391 -340 -1401 -656 1426 1042 -730 -1418 522 1303 302 -738 -519 789 1422
5805A422r95j666J014J600p7j395q64J008J285m97j703J29J571L37j334j186Q02
$$ 1422 427 -1239 -225 1375 1298 -97 -961 47 1332 835 -868 -739 832 1169 -165 -1351 -549
5822e49J385o0j656n52J112R58n66j157j01J402O40j133j312J033J375m75j126
$$ -549 836 776 -880 -1432 -320 638 72 -1085 -1186 216 856 -277 -1589 -556 819 344 -782
5839g82r8J107O90o16j088M74J197L20j075p05P33J073k69j391J48R79L80j105
$$ -782 -880 227 917 301 -787 -313 884 1204 129 -576 157 1230 961 -430 -282 697 1077 -28
5857b8m85M34J204n35j022K01O08m4o17j10M0L76j81n77J71N22k97k42k5L98M30
$$ -28 -513 -79 1125 590 -432 -231 377 333 -284 -394 -354 22 -159 -736 -565 -43 -340 -582 -607 -209 221
5878B21o39k04L49O55o07m47L19J007k24q20j84J339M95r32r29R76J023m71j231
$$ 221 -418 -622 -273 382 -225 -672 -353 654 430 -390 -574 765 1260 328 -601 375 1398 927 -304
5897c04K22Q10O78q56j495Q04J125K50k046k80J405J112j009k141M82K064J90
$$ -304 -82 728 1406 550 -945 -141 984 1234 -812 -1092 313 1425 416 -1725 -1243 821 1011
5914A011j784j389J694J788r35k220L0K151J040k077j464J270K405j74k518p89
$$ 1011 -773 -2162 -468 1320 385 -1835 -1805 346 1386 -691 -2155 -885 1520 1346 -1172 -1961
5930a961K505J643j812k149P54K863M28k445j255J917J965j284k276M3K382J109
$$ -1961 544 2187 375 -1774 -1020 1843 2271 -174 -1429 488 2453 1169 -1107 -1064 1318 2427
5946B427k420j907J114K799m53k595r76K179K066j777k627K27K750P74k412j724
$$ 2427 7 -1900 -786 2013 1560 -1035 -2011 168 2234 457 -2170 -1943 807 1581 -831 -2555
5962b555J660K556o00k919p63K837J698j762k590Q52K812N07k532j529K095K514
$$ -2555 -895 1661 1061 -1858 -2621 216 1914 152 -2438 -1586 1226 1733 -799 -2328 -233 2281
5978B281q97k829j3K711J234j852k243P30L120q0k481j430J915K281q30l044k80
$$ 2281 1384 -1445 -1458 1253 2487 635 -1608 -878 2242 2162 -319 -1749 166 2447 1617 -1427 -1707
5995a707K853J188k258k196J175K841k73k931j451K296K418j615k855K23L214
$$ -1707 1146 2334 76 -2120 -945 1896 1623 -1308 -2759 -463 1955 340 -2515 -2292 922
6010I22P88k776k009J960L050n88l185n70L037J796j800l115J199L170N42k727
$$ 922 1710 -1066 -3075 -1115 1935 1347 -1838 -2408 629 2425 625 -2490 -1291 1879 2421 -306
6026c06j663K420K070o69l017l07K855J406k320k367J085K957P2l277j161K380
$$ -306 -1969 451 2521 1852 -1165 -1472 1383 2789 469 -1898 -813 2144 2216 -1061 -2222 158
6042A58K450k117k592M25K765O65k206k462J941K370l89k742p91K503K079k105
$$ 158 2608 491 -2101 -1676 1089 1754 -452 -2914 -973 1397 1008 -1734 -2525 -22 2057 -48
6058d8k271N91K488R59k288j829J983K194l30k505m95K149J567j429j947M29K148
$$ -48 -2319 -1728 760 1719 -569 -2398 -415 1779 1449 -1056 -1551 598 2165 736 -1211 -782 1366
6075A366O93j866j543J053K309n40k502l79K518J055j793j896O71K235q1k292
$$ 1366 2059 193 -1350 -297 2012 1472 -1030 -1409 1109 2164 371 -1525 -854 1381 1300 -992
6091i92p01J516J635j033k153m0K103R32j848j705J245K132j67k250m96J660J455
$$ -992 -1693 -177 1458 425 -1728 -1768 335 1267 -581 -2286 -1041 1091 924 -1326 -1822 -162 1293
6108A293j085j677M93K113M22j828r41J073J855m11k033J9J475J114j415j489
$$ 1293 208 -1469 -976 1137 1559 -269 -1210 -137 1718 1307 -726 -707 768 1882 467 -1022
6124a022Q26J725l10j869l93J160J332r55j709M87J326o2j142n17P38R85o80j102
$$ -1022 -196 1529 1219 -650 -1043 117 1449 494 -1215 -728 598 536 -606 -1123 -385 600 -80 -1182
6142a182J86J000J61o21m75L29Q18o8p00r0Q82J76o07k94O87J74k00K1P8j89K28
$$ -1182 -996 4 165 -456 -931 -602 216 148 -552 -642 240 416 -191 -485 202 376 176 197 275 86 314
6163C14%L9J8J05j4k01j66M41p7p48K28M92M9o48k65O91L16o59o46K27Q68l8o63
$$ 314 314 353 371 476 462 261 95 536 459 -289 -61 431 480 -168 -433 258 574 -85 -731 -504 364 326 -337
6186c37p14P03Q96o71q04N8J185L56j117p44P63J228j49j450l05J773L36j171
$$ -337 -1051 -348 548 -123 -927 -869 316 672 -445 -1189 -426 802 653 -797 -1102 671 1007 -164
6204a64j256J295J328J33j430o88J128P32k58j658J50J683L73j276j464Q79J663
$$ -164 -1420 -125 1203 1336 -94 -782 346 1078 820 -838 -688 995 1368 92 -1372 -493 1170
6221A170J14k156o16J834R68q60j843M04J929O91k278j275J496J986q15k104J87
$$ 1170 1284 -872 -1488 346 1314 454 -1389 -985 944 1635 -643 -1918 -422 1564 749 -1355 -1168
6238a168J622J072j479j710R62K251j00k110j313K033J980j260k273J52K098R15
$$ -1168 454 1526 47 -1663 -701 1550 1450 -660 -1973 60 2040 780 -1493 -1341 757 1672
6254A672j627j671Q53K578k28k583r61K150K252j318k904P2L105N33k315j664
$$ 1672 45 -1626 -773 1805 1577 -1006 -1967 183 2435 1117 -1787 -1715 1390 1923 -392 -2056
6270b056J589K582r87k619n26K485J650j772k750J018L068R4k432j776K266K651
$$ -2056 -467 2115 1128 -1491 -2017 468 2118 346 -2404 -1386 1682 1776 -656 -2432 -166 2485
6286B485j366l208K44K836J263k450j759J180K604O8l068r52K511K069j569k773
$$ 2485 1119 -2089 -1845 991 2254 -196 -1955 -775 1829 1897 -1171 -2123 388 2457 888 -1885
6302a885K98K968Q67k247k346J465K826l58l083n07K665J698j933k839R51K969
$$ -1885 -1587 1381 2248 1 -2345 -880 1946 1588 -1495 -2002 663 2361 428 -2411 -1460 1509
6318A509K48k376j685J925K488r58k530o52K822J421j896k274J014K601J81k544
$$ 1509 1757 -619 -2304 -379 2109 1151 -1379 -2031 791 2212 316 -1958 -944 1657 1838 -706
6334g06j382J907J814o13k746Q7K529J277k311k129J199K370N10k560j248J927
$$ -706 -2088 -181 1633 1020 -1726 -1639 890 2167 -144 -2273 -1074 1296 1806 -754 -2002 -75
6350g5K194j183k719J13K702Q38k354j867J732K756o67k860n08K310J419j428
$$ -75 2119 936 -1783 -1670 1032 1870 -484 -2351 -619 2137 1470 -1390 -1898 412 1831 403
6366D03k246O96K659L89k386j263J455K064o13k680k0K311J126k140j671J011
$$ 403 -1843 -1147 1512 1901 -485 -1748 -293 1771 1158 -1522 -1542 769 1895 -245 -1916 -905
6382i05K230J93k501r58K039J939j043k651J46K127Q26j949j676J789J983p47
$$ -905 1325 1518 -983 -1941 98 2037 994 -1657 -1511 616 1442 -507 -2183 -394 1589 842
6398H42k129r3J770O64j105j339P54J394L37j623k04P88J274p23j532K03J555
$$ 842 -1287 -1380 390 1054 -51 -1390 -636 758 1095 -528 -732 56 1330 607 -925 -722 833
6415H33O57j397o77L25J242m70j016j27Q25O41q09o74L20L27M33n69l43J09N62
$$ 833 1490 93 -584 -259 983 513 -503 -630 195 836 27 -647 -327 0 433 -136 -479 -370 192
6434A92n5o71M03L24k5m52l91K55M02l9J16j61k27J76L26J2l0m32K38L71M6k09
$$ 192 137 -534 -131 193 168 -284 -675 -420 -18 -57 59 -102 -329 -153 173 185 155 -277 -39 332 378 169
6456A69P8K73j90M7p40K63N40O47o21n38O1O37l02n40j88M95N58n83q35M10M89
$$ 169 247 520 330 377 -363 -100 440 1087 466 -72 -11 626 324 -216 -404 91 649 66 -769 -359 130
6477A30M7q36j22L12L36r1j49k55O44J93j96o58J6O38N32m80n19L98P10K7p94
$$ 130 177 -659 -781 -469 -133 -224 -373 -628 16 209 13 -645 -629 9 541 61 -458 -60 650 677 -117
6498a17k20N58M86j00n42j54N69N81m62q58p5Q09M66q11n69L34P72j13j206m12
$$ -117 -337 221 707 607 65 -89 480 1061 599 -259 -334 475 941 130 -439 -105 667 554 -652 -1064
6518a064R40O48m1j665k0J139O15p17j326M69J506L92j856n76J615J250p68k210
$$ -1064 -124 524 483 -1182 -1202 -63 552 -165 -1491 -1022 484 876 -980 -1556 59 1309 541 -1669
6536a669N85J800P26j684j247J276J993m47k284k44J658J818j427k096L91K575
$$ -1669 -1084 716 1442 -242 -1489 -213 1780 1333 -951 -1195 463 2281 854 -1242 -851 1724
6552A724J75k241j519J881K232j287k475K7K633J090k476k021J004K815j51k935
$$ 1724 1899 -342 -1861 20 2252 965 -1510 -1483 1150 2240 -236 -2257 -1253 1562 1411 -1524
6568a524p30K319J808j663k642M83L077Q48k724j855K095K621o76l208r2K844
$$ -1524 -2254 65 1873 210 -2432 -1949 1128 1976 -748 -2603 -508 2113 1437 -1771 -1863 981
6584I81J181k095k304J363L373k81k764j312K256K172j333l013O05L147O57k681
$$ 981 2162 67 -2237 -874 2499 2218 -546 -1858 398 2570 1237 -1776 -1171 1976 2633 -48
6600d8j996J606K591l70l140r10K836J618j672k602O00K765K35k526j683J918
$$ -48 -2044 -438 2153 1783 -1357 -2267 569 2187 515 -2087 -1487 1278 1513 -1013 -2696 -778
6616g78K653o45l094l47K573J352k035k168J239K893M1k737j101K329K160j082
$$ -778 1875 1230 -1864 -2211 362 1714 -321 -2489 -1250 1643 1684 -1053 -2154 175 2335 1253
6632A253k747K95K636J078k257j813J351K332k23l008n99K240K017j624k301L53
$$ 1253 -1494 -1199 1437 2515 258 -1555 -204 2128 1905 -1103 -1702 538 2555 931 -1370 -1017
6648a017K308M43k151j609J368K087l49k695m61K270J383j707k233O82K724L4
$$ -1017 1291 1734 -417 -2026 -658 1429 1080 -1615 -2076 194 1577 -130 -2363 -1681 1043 1077
6664A077k323p76J936J418o88k315L33K166N94j700r84P73K049j05k022l63J642
$$ 1077 -1246 -2022 -86 1332 644 -1671 -1338 828 1422 -278 -1262 -489 1560 1455 -567 -930 712
6681G12J033j025j543N39J684K49j527j183J004J556o81j443p2J110Q18j098j428
$$ 712 1745 720 -823 -284 1400 1649 122 -1061 -57 1499 818 -625 -697 413 1231 133 -1295
6698a295N77J143K83j246o19N97R43k21j252J2Q63P55j184k30L05P11M24p09p83
$$ -1295 -718 425 708 -538 -1157 -560 383 162 -1090 -1078 -215 540 -644 -874 -569 142 566 -143 -926
6717i26O07J157m79n47J13m1Q41k92p22L46P89r3n89k24K43Q35m59n44k12M88
$$ -926 -319 838 359 -188 -75 -116 725 433 -289 57 846 753 164 -60 183 1018 559 15 -197 291
6737B91J96l58p45L51N78L12q77n90O80J69k82l12k0L72M77o36l13L60K63j93
$$ 291 487 129 -616 -265 313 625 -252 -842 -162 7 -275 -587 -607 -235 242 -394 -707 -347 -84 -277
6757b77K0q4j43M97J55j13J55k01J1J92Q7j96L15O3j52O5k1l35O1M86n54o3P4
$$ -277 -257 -341 -484 13 168 55 210 9 20 212 299 103 418 481 329 394 373 38 99 585 31 -32 42
6780D2O1M24k39p26J80R04m11q37j23O95O90m99j062j82J268M41j199n80N34J103
$$ 42 103 527 288 -438 -258 646 235 -602 -725 -30 660 161 -901 -1083 185 626 -573 -1153 -619 484
6800D84P9j673j3J341O93j313o84O61J276K89j479n21J296Q52n18j618K89J448
$$ 484 563 -1110 -1123 218 911 -402 -1086 -425 851 1140 -339 -860 436 1288 770 -848 -559 889
6818H89O08j347j598J474J437n50j721j83J479R26j054k103P71K206k51j863n23
$$ 889 1497 150 -1448 26 1463 913 -808 -991 488 1414 360 -1743 -972 1234 983 -880 -1403
6835a403J036J510k80k298l12K369P40k047j236J254J981k17k153q43K180J332
$$ -1403 -367 1143 863 -1435 -1747 622 1362 -685 -1921 -667 1314 1097 -1056 -1899 281 1613
6851A613j110j893N67J842N96j929j329J761J712q92j632l72J408J591j494j926
$$ 1613 503 -1390 -823 1019 1615 -314 -1643 118 1830 938 -694 -1066 342 1933 439 -1487
6867a487Q29K236N3j785j381J384J688n99k034n75K071J121j534j448K06K322
$$ -1487 -658 1578 1631 -154 -1535 -151 1537 938 -1096 -1671 400 1521 -13 -1461 -1255 1067
6883A067N14k458j203K004J441q72k062r8K367J469k326j726J345K215n14j921
$$ 1067 1581 -877 -2080 -76 1365 493 -1569 -1667 700 2169 -157 -1883 -538 1677 1163 -758
6899g58j012J897J878j417k447Q74K286N53j787j952J359K666o36k825l41K545
$$ -758 -1770 127 2005 588 -1859 -985 1301 1854 67 -1885 -526 2140 1504 -1321 -1662 883
6915H83J495j942k244N31K706J71k471j192K084J936j094k630k15K804J100k110
$$ 883 2378 436 -1808 -1277 1429 1600 -871 -2063 21 1957 863 -1767 -1982 822 1922 -188
6931a88k016J714J841J63k557r06K201J714j753j878N08K386L14j857j421J684
$$ -188 -2204 -490 1351 1514 -1043 -1949 252 1966 213 -1665 -1157 1229 1543 -314 -1735 -51
6947e1J862n92k505L4J821R72j352j563M83K240J65k244p32J486J463n37k066
$$ -51 1811 1219 -1286 -1252 569 1541 189 -1374 -891 1349 1514 -730 -1462 24 1487 950 -1116
6964a116j14J747J045j737j272O93J938K3j684j185J627J553j154j430J36J517
$$ -1116 -1230 517 1562 -175 -1447 -754 1184 1207 -477 -1662 -35 1518 364 -1066 -930 587
6980E87L91j084j372J101J527n29j262l57J084J089n97j571j26J741N32j475o79
$$ 587 978 -106 -1478 -377 1150 621 -641 -998 86 1175 578 -993 -1119 622 1154 -321 -1000
6997a000N67J508j89j665n36J683P66j081q97J71J154N76j164j254J260J160q19
$$ -1000 -433 1075 886 -779 -1315 368 1134 53 -844 -673 481 1057 -107 -1361 -101 1059 240
7014B40q68j28J319N37j054j499J321J164l62j257J21O05O23n32j039L03R94m5
$$ 240 -628 -756 563 1100 46 -1453 -132 1032 670 -587 -466 139 762 230 -809 -506 488 443
7032D43p80j18N18N32k08j144R2J258j45q65L6K99L83j54o97J27O91Q9q54K82
$$ 443 -337 -455 63 595 387 -757 -665 593 448 -417 -381 -82 301 147 -550 -423 268 357 -497 -215
7052b15K36J44k61j92N9M69M7o17K99K97K7m01l11N64M75l42r59L77J239n19r52
$$ -215 21 165 -96 -288 -229 240 287 -330 -31 266 293 -108 -419 145 620 278 -681 -304 935 416 -536
7073e36oO55N50o02q90O72R02n36r61n8O89J036o92j350J87J534Pj336k94P60
$$ -536 -542 113 663 61 -829 -157 745 209 -752 -810 -121 915 223 -1127 -940 594 601 -735 -1029 -269
7093b69P83j03j612L84J402M29j254p40O28J365N1j733m40J599J042j145j476
$$ -269 514 411 -1201 -817 585 1014 -240 -980 -352 1013 1064 -669 -1109 490 1532 387 -1089
7110a089O13J450L75j795q63J501J226q37j573J03J609M78j355j295J030J519
$$ -1089 -476 974 1349 -446 -1309 192 1418 581 -992 -889 720 1198 -157 -1452 -422 1097
7126A097k67j651n91J773N92n83j781J80J762N36j773q32J203J222o1j551o81
$$ 1097 830 -821 -1412 361 953 370 -1411 -1231 531 1067 -706 -1538 -335 887 826 -725 -1406
7143a406J720J097j188j450P03J395N28j675r01J243J544n12j768k07J386J218
$$ -1406 314 1411 223 -1227 -524 871 1399 -276 -1177 66 1610 1098 -670 -877 509 1727
7159A727j202j955Q64J729L67k080q72J497J171n02j590n00J630R53j400j376
$$ 1727 525 -1430 -566 1163 1530 -550 -1422 75 1246 744 -846 -1346 284 1237 -163 -1539
7175a539N77J947J14k094o68J616J484j130j836J28J815J117j347j886J304K083
$$ -1539 -962 985 1099 -995 -1663 -47 1437 307 -1529 -1401 414 1531 184 -1702 -398 1685
7191A685m49j908n79J737J411j071k155M55K204L46j937j040J277K002q53k126
$$ 1685 1236 -672 -1251 486 1897 826 -1329 -874 1330 1676 -261 -1301 -24 1978 1125 -1001
7207a001j45J928J002j467j876Q68J881J06j788j094J238J719r55k074l7K254
$$ -1001 -1146 782 1784 317 -1559 -691 1190 1296 -492 -1586 -348 1371 416 -1658 -1695 559
7223E59J087j963j737J259J849j34k195k48J540J547j078j986L91K080Q44k004
$$ 559 1646 -317 -2054 -795 1054 920 -1275 -1523 17 1564 486 -1500 -1109 971 1815 -189
7239a89j029R29K196n00k091o96K298Q07j172j697P19J829J15j880j058J285J516
$$ -189 -1218 -289 1907 1407 -684 -1380 918 1725 553 -1144 -425 1404 1519 -361 -1419 -134 1382
7256A382n61j935l16K013Q74j745j571R00K050l69j956n30J654J355r89j854N75
$$ 1382 821 -1114 -1430 583 1457 -288 -1859 -959 1091 722 -1234 -1764 -110 1245 256 -1598 -1023
7273a023J570P71j871j288J441J795n94j778j59J675R05j077j392N95J698M9j504
$$ -1023 547 1318 -553 -1841 -400 1395 801 -977 -1136 539 1444 367 -1025 -430 1268 1317 -187
7290a87n78J246J007q35j242n0J183P44j267j060Q68Q39k07j147l17R43Q64j134
$$ -187 -765 481 1488 653 -589 -639 544 1288 21 -1039 -171 668 461 -686 -1003 -60 804 -330
7308c30p97M27J016K4q37m59N93O29m61o55K61P48J59p35k5J81O15n5m44M1L24
$$ -330 -1127 -700 316 340 -497 -956 -363 266 -195 -850 -589 159 318 -417 -442 -261 354 299 -145 -104 220
7329B20M66n46l72K70L38o9m3o1j52L52k07J40j14k00n5K53k40N8J58l38K24k21
$$ 220 686 140 -232 38 376 307 264 203 51 403 196 336 222 22 -33 220 -20 38 196 -142 82 -139
7351a39j90j91L46K83l53q3L9LM18k41k52KJ79K49k41l61P03R6J41n27j93L83
$$ -139 -329 -520 -174 109 -244 -327 -288 -285 133 -108 -360 -358 -179 70 -171 -532 171 267 408 -119 -312 71
7373G1O45k49j98k65N70K61q18k65M13O37k45p04m4N50M44o86n23K05N32k22k76
$$ 71 716 467 269 4 574 835 17 -248 165 802 557 -147 -191 359 803 117 -406 -201 331 109 -167
7394a67m67L78P26l80p95l70P46P93l42j043NJ089L37q70r51P97J216j39j467
$$ -167 -634 -256 470 90 -705 -1075 -329 464 122 -921 -916 173 510 -360 -1311 -514 702 563 -904
7413i04m3J267P97q21j003P2J227N53j087q63J032J299m86j706n3J371R72j282
$$ -904 -947 320 1117 296 -707 -635 592 1145 58 -805 227 1526 1040 -666 -719 652 1624 342
7431C42j286L86J687k04j246j119J435J418j078j528O4J821O81j979r79Q45J783
$$ 342 -944 -558 1129 925 -321 -1440 -5 1413 335 -1193 -1129 692 1373 -606 -1585 -740 1043
7448A043m80j893l60J889J261j181k162P50K277L82j852j470J807J839r56k120
$$ 1043 563 -1330 -1690 199 1460 279 -1883 -1133 1144 1526 -326 -1796 11 1850 894 -1226
7464a226J91J933J005j942j718J400J947n1k016r41J946J225j375j516L34J876
$$ -1226 -1035 898 1903 -39 -1757 -357 1590 1539 -477 -1418 528 1753 378 -1138 -804 1072
7480A072K57j521j599J246J672j72k348l44J757J330j413j595Q70K052Pk289j036
$$ 1072 1329 -192 -1791 -545 1127 955 -1393 -1737 20 1350 -63 -1658 -788 1264 1271 -1018 -2054
7497b054J755J908p52k136J33J863Q55j620j506J037J885k91j816n39J638J671
$$ -2054 -299 1609 857 -1279 -1146 717 1572 -48 -1554 -517 1368 1077 -739 -1278 360 2031
7513B031j284j794N0J994L74j406j331J254J597l15j943o38J513J239r07j730
$$ 2031 747 -1047 -997 997 1371 -35 -1366 -112 1485 1170 -773 -1411 102 1341 434 -1296
7529a296j45K319K01j663r87J027J756o45j852l44K082R88j270j933P55J835K28
$$ -1296 -1441 878 1079 -584 -1571 -544 1212 567 -1285 -1629 453 1441 171 -1762 -1007 828 1056
7546A056j817m19J316J450r98j735J0J604J020j714j077J079J475l38j571m06
$$ 1056 -761 -1180 136 1586 588 -1147 -1137 467 1487 -227 -1304 -225 1250 912 -659 -1065
7562a065J500J128j164j642N95J563M05j540j097P55J569j12j877j79J401Q03
$$ -1065 435 1563 399 -1243 -648 915 1320 -220 -1317 -562 1007 895 -982 -1161 240 1043
7578A043r78j427L46J713J17j269p82J314N38o6j448L03J073L96j049m02L49J219
$$ 1043 65 -1362 -1016 697 814 -455 -1237 77 615 549 -899 -596 477 873 -176 -578 -229 990
7596I90k26j142r1N11N21n60m87J87P15L37o34p86L78O79K5n26o74P24O91k08
$$ 990 764 -378 -469 42 563 3 -484 -297 418 755 121 -665 -287 392 417 -109 -783 -59 632 424
7616D24o84l1L45L83q41pJ53O88j89n01Q5R9M7Q8l32j3L83K82l27l93L5P21j54
$$ 424 -260 -291 54 437 -404 -411 -258 430 241 -260 -175 -76 -29 59 -273 -286 97 379 52 -341 -306 415 261
7639B61j14l93M3M08J9m44j27M66J70k94j57n3M27J84m40j14Q3R1R7k88j6O54
$$ 261 147 -246 -203 205 224 -220 -347 119 289 -5 -162 -215 212 396 -44 -158 -75 16 113 -175 -191 463
7661D63k86k5l30M44j27n5j99R2p3r5L89l6m3j05q7L53j76k47j40K85M12q7p03
$$ 463 177 152 -178 266 139 84 -115 -23 -96 -191 198 162 119 14 -73 280 104 -143 -283 2 414 327 -376
7684c76j32Q40J15l41n51K2Q40K27r52l10N35O36l37r27J13J000J14m08j053M75
$$ -376 -508 332 447 106 -445 -423 417 644 -308 -618 -83 553 216 -711 -598 402 516 108 -945 -470
7704d70J059pr94j54O23J043n27j488K03J312Q30j682r22R88J288k94j502j91
$$ -470 589 582 -412 -566 57 1100 573 -915 -712 600 1430 -252 -1174 -186 1102 808 -694 -885
7722h85J509O54j287j063K85J850p8j609m69J368R03q11j690K28J944N75j847
$$ -885 624 1278 -9 -1072 -787 1063 985 -624 -1093 275 1178 367 -1323 -1095 849 1424 -423
7739d23j042J206J590o15j759l31J745Q01j033j762J013J699K64j884j174J761
$$ -423 -1465 -259 1331 716 -1043 -1374 371 1172 139 -1623 -610 1089 1353 -531 -1705 56
7755E6J594q05j902J5J845Q67j781j510J344J716l29j985l03J832R61j221j861
$$ 56 1650 845 -1057 -1042 803 1670 -111 -1621 -277 1439 1110 -875 -1178 654 1615 394 -1467
7772a467M07J877M12j701j198J333J701o50k146k15K256Q94j369j893Q33J783
$$ -1467 -1060 817 1229 -472 -1670 -337 1364 714 -1432 -1647 609 1503 134 -1759 -926 857
7788H57J06j678j110J601J487n98k000j77K396N61j410j633J036K251n79j676
$$ 857 963 -715 -1825 -224 1263 665 -1335 -1512 884 1445 35 -1598 -562 1689 1110 -566
7804e66n94J888R60j064k041N89K066R7j403j507J461J514m94k128k76J927J007
$$ -566 -1160 728 1688 624 -1417 -828 1238 1335 -68 -1575 -114 1400 906 -1222 -1498 429 1436
7821A436j302j825Q19J627K49j810r22J251J684n75k035K46J701O66j416j245
$$ 1436 134 -1691 -872 755 1004 -806 -1728 -477 1207 632 -1403 -1157 544 1210 -206 -1451
7837a451P20J643P5j898m40J361J535q34j635K02J360O25j257j018R62J393j44
$$ -1451 -731 912 987 -911 -1351 10 1545 711 -924 -722 638 1263 6 -1012 -50 1343 1199
7854A199j498p56J548R60r60j343K5J696j7j167j069J091J277m77j522j67J192
$$ 1199 -299 -1055 493 1453 493 -850 -825 871 854 -313 -1382 -291 986 509 -1013 -1180 12
7871A2M94n42r69N07R74J34j119o93O72J211j74j103k98R91P94q89j068P90J343
$$ 12 506 -36 -1005 -498 476 610 -509 -1202 -530 681 507 -596 -894 97 891 2 -1066 -276 1067
7890A067j71j000m42Q90Q20o17j075L22P13K35m57p51L98J012k1j147m57P37P25
$$ 1067 896 -104 -546 344 1164 547 -528 -206 507 742 285 -466 -68 944 923 -224 -681 56 781
7909G81n41r52J71O76J07p48n23P76O35n20m73k16R02L16n51p62L82M94K91m09
$$ 781 240 -712 -541 135 242 -506 -1029 -253 382 -138 -611 -827 75 391 -160 -922 -540 -46 245 -164
7929a64j29M10N11o27m87O39J67k9k11O9J48J44l31Q4K86j82J7j63lK32j85j53
$$ -164 -293 117 628 1 -486 153 320 291 80 149 297 441 110 194 480 298 315 152 149 381 196 43
7951D3p9J62o1l17k3J31J92j64n18J26L06L45r14J39M88K77n87l88L28M91K14
$$ 43 -36 126 65 -252 -275 -144 48 -116 -634 -508 -202 143 -771 -632 -144 133 -454 -842 -514 -23 191
7972A91o49n6N54M15l4p04j36P24O47p33p44P29Q05j12j284k00J164N54q25j144
$$ 191 -458 -514 40 455 421 -283 -419 305 952 219 -525 204 1009 897 -387 -587 577 1131 306 -838
7992h38P85Q85j18q09o63Q30R81q35j099j51J245L49q07q64N45J300l95j211n42
$$ -838 -53 832 714 -95 -758 72 1053 218 -881 -1032 213 562 -245 -1109 -564 736 341 -870 -1412
8011a412J540N66q54q57L97J026M93j424n51J009J012j93j216n18J359J024q36
$$ -1412 128 694 -160 -1017 -620 406 899 -525 -1076 -67 945 752 -464 -982 377 1401 565
8028E65j436O24J075L91j196p53J059R93n57j323q0J228N85j039j152M15J280
$$ 565 -871 -247 828 1219 23 -730 329 1322 765 -558 -638 590 1175 136 -1016 -601 679
8045F79Q2j472l32J054Q53m95j599O3J606N20j087j573Q56J363J89j456p16J374
$$ 679 761 -711 -1043 11 864 369 -1230 -1167 439 959 -128 -1701 -845 518 707 -749 -1465 -91
8063i1J297n80j616j61J748J203j682j377Q40K104m76j864o29J482J496r71j736
$$ -91 1206 626 -990 -1151 597 1800 118 -1259 -419 1685 1209 -655 -1284 198 1694 723 -1013
8080a013J92K103M95j835j351J198J646o38j724n17K044J042j516j759N63K142
$$ -1013 -821 1282 1777 -58 -1409 -211 1435 797 -927 -1444 600 1642 126 -1633 -1070 1072
8096A072N5k002q92J456J671p76k026j50J825J240j562j834J088K252k0j901j010
$$ 1072 1127 -875 -1767 -311 1360 584 -1442 -1592 233 1473 -89 -1923 -835 1417 1397 -504 -1514
8113a514J613J630j089k162P76K086M50j985j345J548J736o49k077j21J953P24
$$ -1514 99 1729 640 -1522 -746 1340 1790 -195 -1540 8 1744 1095 -982 -1103 850 1574
8129A574j447j575O94K041q7j830j069J921J217q13k007J21J656J044k073r60
$$ 1574 127 -1448 -754 1287 1200 -630 -1699 222 1439 626 -1381 -1260 396 1440 -633 -1593
8145a593Q97J409m9j420n73J233J445j109j546M76J818L56j456j119J017J578
$$ -1593 -696 713 664 -756 -1329 -96 1349 240 -1306 -830 988 1344 -112 -1231 -214 1364
8161A364l72j709k43J691O12j178j071M90J547n5j223o48Q08Q65l02j229MJ184
$$ 1364 992 -717 -960 731 1343 165 -906 -416 1131 1076 -147 -795 13 878 576 -653 -649 535
8179E35L84j250q03R20P80r7j175o57J230J217o89j325
$$ 535 919 -331 -1134 -214 566 469 -706 -1363 -133 1084 395 -930
8191i30
$$ Imaginary data points
##PAGE= N=2
##DATA TABLE= (X++(I..I)), XYDATA
0@%%%%%%%Qq%qJ6j6K4m0M8n6P2q8J04j21J45j74K05k44K86l29L83m46N12n86O71
$$ 0 0 0 0 0 0 0 0 8 0 0 -8 8 -8 16 -24 24 -32 40 -48 56 -65 80 -94 111 -133 153 -176 207 -239 273 -313 358
32C58p65Q69r83J109j250J401j567J752j954K173k413K677k963L275l618L994
$$ 358 -407 462 -521 588 -662 739 -828 924 -1030 1143 -1270 1407 -1556 1719 -1899 2095
48B095m403M852n346N888o487P155p899Q731r674J0749j1987J3433j5149J7220
$$ 2095 -2308 2544 -2802 3086 -3401 3754 -4145 4586 -5088 5661 -6326 7107 -8042 9178
62I178j9776K3036k7353L3372m2425N7731r0186K80986m53359n05412P47771N96638
$$ 9178 -10598 12438 -14915 18457 -23968 33763 -56423 224563 -228796 -734208 13563 610201
74F10201k36285q13190j07939O99992M42213n25034n76698J57979N68928J27688
$$ 610201 373916 -439274 -547213 152779 594992 69958 -506740 -348761 220167 347855
84C47855m13826l73652K42710M35314n0579l51547n4130J64844J23598m8669j21689
$$ 347855 -65971 -439623 -196913 238401 187822 -163725 -217855 -53011 70587 21918 -99771
95i9771M8878J26330q0579n6683J29314M4565j45317r6513J03408K20100K9250
$$ -99771 -50893 75437 -5142 -61825 67489 112054 -33263 -129776 -26368 193732 222982
106B22982k86706j81485K88757L08264j72557l70586n9340L31697L01092k38861
$$ 222982 -63724 -245209 43548 351812 179255 -191331 -250671 81026 382118 143257
116A43257m49567Q3808M43087J04850l36014l31699J18123M37222J09282l85099
$$ 143257 -306310 -222502 220585 325435 -10579 -342278 -224155 213067 322349 -62750
126f2750k87205J90936L43242L9894l08482k61024J86498L77580j6574l30902
$$ -62750 -349955 -159019 184223 224117 -84365 -345389 -158891 218689 202115 -128787
136a28787j47318J80568K88875J2094l30039j65118K43987K62765l4578k45742
$$ -128787 -276105 -95537 193338 205432 -124607 -289725 -45738 217027 182449 -63293
146f3293j46190J75785K57114o5394k65764m5426J94697J46975n1745j88837p8365
$$ -63293 -209483 -33698 223416 158022 -107742 -153168 41529 188504 136759 -52078 -130443
157a30443J58056J23865p6557j04357m5669L4992J20546K5829j12989o9630J5473
$$ -130443 27613 151478 74921 -29436 -75105 -40113 80433 106262 -6727 -76357 -60884
168f0884O0055O9237m0574j35395j3665J40915R0008p1626j63307o4461J79455
$$ -60884 -829 68408 27834 -107561 -121226 19689 109697 38071 -125236 -189697 -10242
179a0242J87950j22208k32681P647K10290J50826j19168k60680Q974K80450J12589
$$ -10242 177708 55500 -177181 -169534 40756 191582 72414 -188266 -179292 101158 213747
190B13747j93587k01064O2421K59047R9213k30801k17317J24102K44243J8035
$$ 213747 20160 -180904 -118483 140564 239777 8976 -208341 -84239 160004 178039
200A78039j78726j38311P7418J99909J7497j83371j02020P2928J38664N5742j31213
$$ 178039 -687 -138998 -61580 138329 155826 -27545 -129565 -56637 82027 137769 6556
211F556j54253O1424J73807L5966j28691j36386K1150J71753Q2088j36062j37952
$$ 6556 -147697 -86273 87534 123500 -5191 -141577 -120427 51326 133414 -2648 -140600
222a40600N0908J40699N9819j09981j60197M7942J99255M5047j43083j21880M3476
$$ -140600 -89692 51007 110826 845 -159352 -111410 87845 132892 -10191 -132071 -88595
233h8595J65601O3830j43358j29354P1515J45834L1058j00895j06487M0194J39353
$$ -88595 77006 140836 -2522 -131876 -60361 85473 116531 15636 -90851 -50657 88696
244H8696K0121j20198o7563M6692R0843M3782p1581r7013J3199P9442M3302k7851
$$ 88696 108817 -11381 -78944 -32252 58591 102373 30792 -66221 -53022 26420 69722 41871
256D1871r2237l9980R2950R1954n0576j13547k9649Q5296J05065l1302j49745
$$ 41871 -50366 -90346 2604 94558 43982 -69565 -99214 -13918 91147 59845 -89900
267h9900m3402J29552J17639l8530j54519p6326J35917J61722o4907j84650l1753
$$ -89900 -133302 -3750 113889 75359 -79160 -155486 -19569 142153 77246 -107404 -139157
278a39157J59798J41712q1743k07690k3174K07887J29392j33006j96877J1104
$$ -139157 20641 162353 80610 -127080 -150254 57633 187025 54019 -142858 -131754
288a31754K12874J22101j67529k06738O9314K21773M0466j79577j38872J04496
$$ -131754 81120 203221 35692 -171046 -101732 120041 160507 -19070 -157942 -53446
298e3446J94147j8406j90846o8773J26550J19231m4831j30029k3942J05315N9726
$$ -53446 140701 122295 -68551 -137324 -10774 108457 63626 -66403 -90345 14970 74696
309G4696o9696o3969L1454M4337q213l1251N774L5101j3981n0853K7831P4701
$$ 74696 5000 -58969 -27515 16822 8609 -22642 -16868 18233 4252 -46601 -18770 55931
321E5931k0873j00142k1346J09932R4851p2590j60343O454J86751Q0141j58680
$$ 55931 35058 -65084 -86430 23502 118353 45763 -114580 -108126 78625 158766 86
332H6j63103Q1973K24790K9514k33881j43753J81908K26914p6028k61985o1018
$$ 86 -163017 -81044 143746 173260 -60621 -204374 -22466 204448 128420 -133565 -194583
343a94583K30760J79125j39502k42426K1122K29024R0352j68752j73841O9556
$$ -194583 36177 215302 75800 -166626 -145504 83520 173872 5120 -168721 -99165
353i9165K08362L6572j79521j15439R9910J52680j2692j41582o0676R9383R8428
$$ -99165 109197 145769 -33752 -149191 -49281 103399 90707 -50875 -111551 -12168 86260
364H6260m2358r2270o815O5519L7285l4533m6263R104L9693L328j6601L248M559
$$ 86260 43902 -48368 -55183 10336 47621 13088 -33175 -24071 15622 18950 2349 5597 10156
377A0156k0663j7817K2740M5219m929o7637k5280P2136O1054m8879r3281o02J00971
$$ 10156 -10507 -28324 -5584 39635 34706 -32931 -58211 13925 74979 26100 -67181 -67783 33188
390C3188O0328p8795j10308K6439J35032M9034j16001j26030N1328J69169L7220
$$ 33188 93516 14721 -95587 -69148 65884 114918 -1083 -127113 -75785 93384 130604
401A30604j57745j17590J00942J72448j4215j87366q4459J48403J62104o5017
$$ 130604 -27141 -144731 -43789 128659 114444 -72922 -157381 -8978 153126 88109
411H8109j92879l4109J71051J23128j05198j78544J4868J80373O7815j36109j24173
$$ 88109 -104770 -138879 32172 155300 50102 -128442 -113574 66799 134614 -1495 -125668
422a25668O8672J47114J981j35674o1635R1540R1357l5441q6811o202O4708K5851
$$ -125668 -56996 90118 92099 -43575 -105210 -13670 77687 42246 -44565 -50767 13941 39792
434C9792m1560k9909K6259K4643k2088j9617K8962K9619l0003m8234K2203P1101
$$ 39792 -1768 -31677 -5418 19225 -2863 -22480 6482 36101 6098 -42136 -19933 51168
446E1168j233q6995l5192Q5838Q4182n3629j20581l850J25277O6430r8884j19094
$$ 51168 49935 -37060 -72252 13586 97768 44139 -76442 -80292 44985 111415 12531 -106563
458a06563M4438J44160K7437j35532r9874Q6157J42296j9196j48502n4833J14822
$$ -106563 -62125 82035 109472 -26060 -125934 -39777 102519 83323 -65179 -120012 -5190
469e190J09174n3793j26288j4600J03491O5211n6175q8361M104Q1800M5547m4806
$$ -5190 103984 50191 -76097 -90697 12794 78005 21830 -66531 -62427 19373 64920 20114
481B0114o9524o03O3835M0419k9537n4630o430M6717L5974j5911m3544j9295K8906
$$ 20114 -49410 -50013 13822 54241 24704 -29926 -36356 10361 46335 30424 -13120 -32415 -3509
494c509M2612Lm5164l1923K8376N2905K025n5979m0376L0668O1464N108o1434
$$ -3509 39103 39106 -6058 -37981 -9605 43300 45325 -10654 -51030 -20362 41102 46210 -15224
507a5224m2258L4420O3585k30o5810l8431M3247O1982p644o5250k6872M5227M9587
$$ -15224 -57482 -23062 40523 40293 -25517 -63948 -20701 41281 33637 -31613 -58485 -13258 36329
520C6329r950n1085k4606L3119M7228J694m3463l0268K7544M7517L200m2990k9862
$$ 36329 26379 -24706 -49312 -16193 31035 32729 -10734 -41002 -13458 34059 37259 -5731 -35593
533c5593K5223M6923N917l8414l1968J3886M3584J8880l3630m6507K723N4547
$$ -35593 -10370 36553 42470 4056 -27912 -14026 29558 48438 14808 -31699 -28976 25571
545B5571L2150m1597o1966L768O7485L6622n3640p4510J2236Q6839L7105p4378
$$ 25571 57721 16124 -45842 -42074 25411 62033 8393 -66117 -53881 32958 70063 -4315
557d315q4235L2313J05368K2061r8814p5106O5485J09514j1830j12256m2074R0303
$$ -4315 -88550 -56237 49131 71192 -27622 -102728 -37243 72271 60441 -51815 -93889 -3586
569c586Q6180m2917j01188o678R3958N4412o1492p7350K4381Q1700J3881o5161
$$ -3586 82594 39677 -61511 -68189 25769 80181 18689 -58661 -34280 47420 61301 -3860
581c860l8058M3902M7911k2692m5448O207L7932j100l5928l293L5379O065m2128
$$ -3860 -41918 1984 49895 27203 -18245 -12038 25894 24794 -11134 -14427 20952 27017 -15111
594a5111k1865M1975M1190l7012o6803J1591Q2493K3797q5994o8815O4965J04954
$$ -15111 -36976 4999 46189 9177 -57626 -46035 36458 60255 -25739 -94554 -29589 75365
606G5365k2105j22715l4113J14971Q9673p5811j25047J8576J35087M7529j08821
$$ 75365 53260 -69455 -103568 11403 101076 25265 -99782 -81206 53881 101410 -7411
617g411r5830N8991J24264P590j16242o3067Q2432J01488k6890j07475k7408Q8546
$$ -7411 -103241 -44250 80014 87604 -28638 -91705 -9273 92215 65325 -42150 -69558 18988
629A8988O8454n0425q5780L891P7689L2933n3727n5525J7994N5007R004m4962
$$ 18988 87442 37017 -48763 -44872 32817 65750 12023 -43502 -25508 29499 38503 -6459
641f459k8809K2481K9328o644k6655n517J7833N598j4038k894J2029R77j4034
$$ -6459 -35268 -12787 16541 9897 -16758 -22275 -4442 1156 -12882 -15776 -3747 -2770 -16804
654a6804l750J8358J4611j4195k4408M344L3259J6934k5906l4120R987N0054K0926
$$ -16804 -20554 -2196 12415 -1780 -26188 -21844 11415 28349 2443 -31677 -21690 28364 49290
$$ [...]
8191d15
##END NTUPLES=NMR FID
##END=
