##TITLE=1H_LY-6.2.Dix.1.B
 CD3CN,8 sc, 
 1.04.2021
##JCAMPDX= 6.0         $$ Bruker NMR JCAMP-DX V2.0
##DATA TYPE= NMR FID
##DATA CLASS= NTUPLES
##ORIGIN= UXNMR, Bruker Analytische Messtechnik GmbH
##OWNER= root
$$ XWIN-NMR		Version 3.5
$$ Thu Apr  1 13:31:03 2021 Russian Standard Time (UT+4h)  she@DPX200
##.OBSERVE FREQUENCY= 200.131506
##.OBSERVE NUCLEUS= ^1H
##.DELAY= (6, 6)
##.ACQUISITION MODE= SIMULTANEOUS
##.ACQUISITION SCHEME= undefined
##.AVERAGES= 8
##.DIGITISER RES= 18
##SPECTROMETER/DATA SYSTEM= spect
##.PULSE SEQUENCE= zg30
##.SOLVENT NAME= CDCl3
##.SHIFT REFERENCE= (INTERNAL, CDCl3, 0, 15.7039)
##AUDIT TRAIL= $$ (NUMBER, WHEN, WHO, WHERE, WHAT)
$$ ##TITLE= Audit trail, XWIN-NMR		Version 3.5
$$ ##JCAMPDX= 5.01
$$ ##ORIGIN= Bruker BioSpin GmbH
$$ ##OWNER= she
$$ F:/spectra/data/she/nmr/H-F/1/audita.txt
$$ ##AUDIT TRAIL=  $$ (NUMBER, WHEN, WHO, WHERE, WHAT)
(   1,<2021-04-01 13:29:25.65 +0400>,<she>,<DPX200>,
      <created by zg, POWCHK disabled, PULCHK disabled
       configuration hash MD5:
       00 E9 B6 7A A2 85 ED C7 34 08 36 98 17 FE 4E 26
       data hash MD5: 16K
       B2 9F 20 06 2D 5F 57 BB 1C 79 26 2B C0 48 51 73>)
$$ ##END=
$$ 
$$ hash MD5
$$ 97 E8 37 D0 D1 8E 3B C0 D0 68 6D 61 34 E6 D6 89
##$RELAX= 
##$RELAX= 
##$RELAX= 
##$RELAX= 
##$RELAX= 
##$RELAX= 
$$ Bruker specific parameters
$$ --------------------------
##$DU= <F:/spectra>
##$EXPNO= 1
##$NAME= <H-F>
##$PROCNO= 1
##$TYPE= <nmr>
##$USER= <she>
##$AMP= (0..31)
100 100 100 100 100 100 100 100 100 100 100 100 100 100 100 100 100 100 
100 100 100 100 100 100 100 100 100 100 100 100 100 100 
##$AQSEQ= 0
##$AQ_mod= 1
##$AUNM= <au_zg>
##$AUTOPOS= <>
##$BF1= 200.13
##$BF2= 200.13
##$BF3= 200.13
##$BF4= 200.13
##$BF5= 200.13
##$BF6= 200.13
##$BF7= 200.13
##$BF8= 200.13
##$BYTORDA= 1
##$CFDGTYP= 0
##$CFRGTYP= 5
##$CHEMSTR= <none>
##$CNST= (0..31)
1 1 145 1 1 1 1 1 1 1 1 1 1 1 1 1 1 1 1 1 1 1 1 1 1 1 1 1 1 1 1 1 
##$CPDPRG= <>
##$CPDPRG1= <>
##$CPDPRG2= <>
##$CPDPRG3= <>
##$CPDPRG4= <mlev>
##$CPDPRG5= <mlev>
##$CPDPRG6= <mlev>
##$CPDPRG7= <mlev>
##$CPDPRG8= <mlev>
##$CPDPRGB= <>
##$CPDPRGT= <>
##$D= (0..31)
0 1.2 0 0 0 0 0 0 0 0.06 0 0.03 0 0 0 0 0.0002 0 0 0 0 0 0 0 0 0 0 0 0 
0 0 0 
##$DATE= 1617269365
##$DBL= (0..7)
120 120 120 120 120 120 120 120 
##$DBP= (0..7)
150 150 150 150 150 150 150 150 
##$DBP07= 0
##$DBPNAM0= <>
##$DBPNAM1= <>
##$DBPNAM2= <>
##$DBPNAM3= <>
##$DBPNAM4= <>
##$DBPNAM5= <>
##$DBPNAM6= <>
##$DBPNAM7= <>
##$DBPOAL= (0..7)
0.5 0.5 0.5 0.5 0.5 0.5 0.5 0.5 
##$DBPOFFS= (0..7)
0 0 0 0 0 0 0 0 
##$DE= 6
##$DECBNUC= <off>
##$DECIM= 32
##$DECNUC= <off>
##$DECSTAT= 4
##$DIGMOD= 1
##$DIGTYP= 9
##$DL= (0..7)
0 120 120 120 120 120 120 120 
##$DP= (0..7)
150 150 150 150 150 150 150 150 
##$DP07= 0
##$DPNAME0= <>
##$DPNAME1= <>
##$DPNAME2= <>
##$DPNAME3= <>
##$DPNAME4= <>
##$DPNAME5= <>
##$DPNAME6= <>
##$DPNAME7= <>
##$DPOAL= (0..7)
0.5 0.5 0.5 0.5 0.5 0.5 0.5 0.5 
##$DPOFFS= (0..7)
0 0 0 0 0 0 0 0 
##$DQDMODE= 0
##$DR= 18
##$DS= 0
##$DSLIST= <SSSSSSSSSSSSSSS>
$$ [...]
##$SUBNAM2= <"">
##$SUBNAM3= <"">
##$SUBNAM4= <"">
##$SUBNAM5= <"">
##$SUBNAM6= <"">
##$SUBNAM7= <"">
##$SUBNAM8= <"">
##$SUBNAM9= <"">
##$SW= 16.9725357007746
##$SWIBOX= (0..15)
0 0 2 0 0 0 0 0 0 0 0 0 0 0 0 0 
##$SW_h= 3396.73913043478
##$TD= 16384
##$TD0= 1
##$TE= 0
##$TE2= 300
##$TE3= 300
##$TEG= 300
##$TL= (0..7)
0 120 120 120 120 120 120 120 
##$TP= (0..7)
150 150 150 150 150 150 150 150 
##$TP07= 0
##$TPNAME0= <>
##$TPNAME1= <>
##$TPNAME2= <>
##$TPNAME3= <>
##$TPNAME4= <>
##$TPNAME5= <>
##$TPNAME6= <>
##$TPNAME7= <>
##$TPOAL= (0..7)
0.5 0.5 0.5 0.5 0.5 0.5 0.5 0.5 
##$TPOFFS= (0..7)
0 0 0 0 0 0 0 0 
##$TUNHIN= 0
##$TUNHOUT= 0
##$TUNXOUT= 0
##$USERA1= <user>
##$USERA2= <user>
##$USERA3= <user>
##$USERA4= <user>
##$USERA5= <user>
##$V9= 5
##$VALIST= <valist>
##$VCLIST= <CCCCCCCCCCCCCCC>
##$VD= 0
##$VDLIST= <DDDDDDDDDDDDDDD>
##$VPLIST= <PPPPPPPPPPPPPPP>
##$VTLIST= <TTTTTTTTTTTTTTT>
##$WBST= 1024
##$WBSW= 4
##$XGAIN= (0..3)
0 0 0 0 
##$XL= 0
##$YL= 0
##$YMAX_a= 809376
##$YMIN_a= -756112
##$ZGOPTNS= <>
##$ZL1= 120
##$ZL2= 120
##$ZL3= 120
##$ZL4= 120
##$ABSF1= 10
##$ABSF2= 0
##$ABSG= 5
##$ABSL= 3
##$ALPHA= 0
##$AQORDER= 0
##$ASSFAC= 0
##$ASSFACI= 0
##$ASSFACX= 0
##$ASSWID= 0
##$AUNMP= <proc_1d>
##$AZFE= 0.1
##$AZFW= 0.1
##$BCFW= 1
##$BC_mod= 2
##$BYTORDP= 1
##$COROFFS= 0
##$CY= 11.3945322036743
##$DATMOD= 1
##$DC= 2
##$DFILT= <>
##$DTYPP= 0
##$F1P= 15.9154993809931
##$F2P= -4.1035820241983
##$FCOR= 0.5
##$FTSIZE= 0
##$FT_mod= 4
##$GAMMA= 1
##$GB= 0.15
##$INTBC= 1
##$INTSCL= 1
##$ISEN= 128
##$LB= 0.24
##$LEV0= 0
##$LPBIN= 0
##$MAXI= 10000
##$MC2= 0
##$MEAN= 0
##$ME_mod= 0
##$MI= 1.114404
##$NCOEF= 0
##$NC_proc= 0
##$NLEV= 6
##$NOISF1= 3.799351
##$NOISF2= 2.8
##$NSP= 1
##$NTH_PI= 0
##$NZP= 0
##$OFFSET= 15.70392
##$PC= 1
##$PHC0= -11128.4
##$PHC1= 18.60093
##$PH_mod= 1
##$PKNL= yes
##$PPARMOD= 0
##$PSCAL= 0
##$PSIGN= 0
##$REVERSE= no
##$SF= 200.130013532006
##$SI= 16384
##$SIGF1= 3
##$SIGF2= 2
##$SINO= 400
##$SIOLD= 16384
##$SREGLST= <1H.CDCl3>
##$SSB= 0
##$STSI= 0
##$STSR= 0
##$SW_p= 3612.71676300578
##$SYMM= 0
##$S_DEV= 0
##$TDeff= 0
##$TDoff= 0
##$TI= <>
##$TILT= no
##$TM1= 0
##$TM2= 0
##$TOPLEV= 0
##$USERP1= <user>
##$USERP2= <user>
##$USERP3= <user>
##$USERP4= <user>
##$USERP5= <user>
##$WDW= 1
##$XDIM= 8192
##$YMAX_p= 0
##$YMIN_p= 0
$$ End of Bruker specific parameters
$$ ---------------------------------
##NTUPLES= NMR FID
##VAR_NAME=  TIME,          FID/REAL,        FID/IMAG
##SYMBOL=    X,             R,               I
##VAR_TYPE=  INDEPENDENT,   DEPENDENT,       DEPENDENT
##VAR_FORM=  AFFN,          ASDF,            ASDF
##VAR_DIM=   8192,          8192,            8192
##UNITS=     SECONDS,       ARBITRARY UNITS, ARBITRARY UNITS
##FACTOR=    0.0002944,     1,               1
##FIRST=     0,             0,               0
##LAST=      2.4114304,     0,               0
##MIN=       0,             -756112,         0
##MAX=       2.4114304,     809376,          0
$$ Real data points
##PAGE= N=1
##DATA TABLE= (X++(R..R)), XYDATA
0@%%%%%%qQ%Qj6J6j8K6m0M8n6P3r0J06j30J61j88K19k57L01l51M07m70N37o13
31c27O99p96R02j020J149j287J442j613J799k003K227k470K732l023L343l688
47a934M066m484M940n437N991o607P290q052Q911r895J1023j2329J3871j5720
61h366J7984k0832K4542k9597L6916m8505O9661j20372M59216M28729j165085
72c55709l07876Q45882N89137o78242p05970M19178Q24264k55022p74636M4417
82c54577O69050N7363m92770j80361L13474K02934j88001k09027J52196J08894
92G9175j60062m421J58374j18281j78124J45694K63974q5273l69600k0252M82188
103A93392J33375n47004k45984N73371L77732m91049m83539L60597O09148j73539
$$ plain form
0 0 0 0 0 0 0 0 -8 0 0 8 -8 8 -10 16 -24 24 -32 41 -49 57 -73 88 -100 119 -138 163 -188 219 -251 286 -327
31 -327 372 -424 478 -542 607 -680 762 -851 948 -1055 1172 -1298 1434 -1589 1754 -1934
47 -1934 2132 -2352 2588 -2849 3142 -3465 3825 -4227 4684 -5211 5812 -6517 7354 -8366
61 -8366 9618 -11214 13328 -16269 20647 -27858 41803 -78569 380647 809376 -355709
72 -355709 -663585 182297 771434 93192 -612778 -193600 630664 375642 -398994 -354577
82 -354577 314473 371836 -120934 -301295 12179 215113 27112 -181915 -29719 79175
92 79175 -80887 -85308 73066 -45215 -223339 -77645 186329 101056 -268544 -288796 193392
103 193392 326767 -220237 -466221 107150 484882 -6167 -489706 -129109 480039 306500
113C06500p00008K3791P31923R7179o54635j82913N32147K89297m00767l88436
123c45922K74656M20551j86799l96109J24997L29418j00677k70692N6957K03255
133A09635l5586k05616J3048K37648l7905k91739P1074L20673p8271l45679J1512
144b31206L68467J00324l82747j98643M04315K96517l91777l69637L44156M29194
154C68963k29298m44788J06930M71434K0446m76558r7243M55482J38619l82649
164f8662j67058K87831K04787j98532k30993J39001K22506j30281k13406J28459
174b6348J88812j29924j69040J08062J50805r3203j87642O9302K42883o6783k98210
185b11286N9633L21780k8409l22048l9418L13024J19175l06310j88449L08251
$$ plain form
113 306500 -393508 -369717 362206 459385 -195250 -378163 153984 443281 42514 -345922
123 -345922 -71266 349285 162486 -233623 -108626 220792 120115 -150577 -93620 109635
133 109635 74049 -131567 -118519 119129 81224 -210515 -139441 181232 102961 -242718 -231206
144 -231206 137261 237585 -145162 -343805 60510 357027 -34750 -404387 -60231 368963
154 368963 139665 -305123 -198193 273241 293687 -182871 -280114 175368 313987 -68662
164 -68662 -235720 52111 256898 58366 -172627 -33626 188880 58599 -154807 -26348
174 -26348 162464 32540 -136500 -28438 122367 29164 -158478 -89176 153707 86924 -211286
185 -211286 -151653 170127 141718 -180330 -219748 93276 212451 -93859 -282308 25943
195B5943K57024k80775k89463K36629L01173j66303k96954R9836L19003k8746
205A77367l31439p722L29246K6818k98464m7290K59037Q1292k27668j23913K10258
216D7522J62094k08411k02342J88379K11633j65155k16265J21687K24364p0162
226I3344k59730Q403K80898K5918k84282m7780K61386P2365k25615j03412J95128
237A6623J36298j73733j59098J67294J74331j55341j61966J52932J54528j37958
247A3910j60723J16305J93413q8041k24934P8053K56281o2185k74268K4735K74982
258A47528L4742k68366j06235K52930J74627k31199k31393J89910K56074j39722
268G8896k70570O5389K70380J1620k64205p3688K37836R6022k05795j01049J64611
$$ plain form
195 25943 282967 2192 -287271 -50642 250531 84228 -212726 -112890 206113 177367
205 177367 -154072 -161794 167452 194270 -104194 -151484 107553 188845 -38823 -162736 47522
216 47522 209616 1205 -201137 -12758 198875 33720 -182545 -60858 163506 93344
226 93344 -166386 -157983 122915 148833 -135449 -183229 78157 150522 -75093 -178505 16623
237 16623 152921 -20812 -179910 -12616 161715 6374 -155592 -2660 151868 13910
247 13910 -146813 -30508 162905 74864 -150070 -72017 184264 122079 -152189 -127454 147528
258 147528 182270 -86096 -192331 60599 235226 4027 -227366 -37456 218618 78896
268 78896 -191674 -126285 144095 155715 -108490 -182178 55658 151680 -54115 -155164 9447
279I447R9129j21162r0395R3311P8907q7274o4214J07585N4548j38038m6185J75082
291G0741O2146j88334r8318J87633J57043j73371k20692J53088K83158j05391
301A27703l20884L0800L27868N5463l13778j46120K78627K25143k28340k82245
311b45763J56718L01886p9199k96497o969K65620P4682k24532j13276J77767J19691
322A30128j33050j07953Q7381Q0876n1159m3749M4782J4224o5410K924J05272
333F4266l817j47388p317J84582M2067j99073r3471J95144J58952j70060k24717
344b00832J23822K74026n6001k90890k0563K79603R5568k49501j68131J99001
354a3898K21900j36145k43692O8664K32577r682k03859l9077J61987O6110j21462
$$ plain form
279 9447 108576 -12586 -102981 -9670 69237 -18037 -82251 25334 79882 -58156 -104341 70741
291 70741 132887 -55447 -153765 33868 190911 17540 -203152 -50064 233094 127703
301 127703 -193181 -162381 165487 220950 -92828 -238948 39679 264822 36482 -245763
311 -245763 -89045 212841 133642 -162855 -169824 95796 170478 -54054 -167330 10437 130128
322 130128 -2922 -110875 -23494 57382 6223 -37526 7256 21480 -43930 -41006 64266
333 64266 60449 -86939 -94256 90326 132393 -66680 -160151 34993 193945 23885 -200832
344 -200832 -77010 197016 141015 -149875 -170438 109165 204733 -44768 -212899 -13898
354 -13898 208002 71857 -171835 -103171 129406 119724 -84135 -123212 38775 104885 -16577
365a6577o8881Q6677N0056o1335j7911N0580j9965o1265M7203R3817m9420j34488
377a01509L4486J77140m486k13329m2718K30968J08064k18487j76256J78390K37797
388B10060j16219k81226L9785K95790L9966k82324j15116K43484J79729j84647
398B9282k25988J11902K40539m2204k23537j2970J88367N3404j42551p4450R2278
409e928P2166m9045m7868K3767J1008j5982L0895K8925o4959n8572Q0378R8477
421A03262p7026j43047N4853J84446j4664k13422m4302K15398J06259j94742j62950
432a85935J54938K08426j00811k39287L5348K47673K9875k34517q7000K01824
442C0534J33348j55450j60013J10360J67774o7571j60388L4243J44374n941j19541
$$ plain form
365 -16577 -85458 1219 51275 -10060 -27971 22609 2644 -58621 -11418 82399 32979 -101509
377 -101509 -67023 110117 105631 -107698 -150416 80552 188616 -29871 -206127 -27737 210060
388 210060 93841 -187385 -147600 148190 188156 -94168 -209284 34200 213929 29282
398 29282 -196706 -84804 155735 113531 -110006 -122976 65391 118795 -23756 -98206 -5928
409 -5928 66238 17193 -30675 -6908 4100 -11882 19013 47938 -17021 -75593 4785 103262
421 103262 26236 -116811 -61958 122488 107824 -105598 -149900 65498 171757 -22985 -185935
432 -185935 -30997 177429 76618 -162669 -127321 120352 150227 -84290 -171290 30534
442 30534 163882 8432 -151581 -41221 126553 58982 -101406 -67163 77211 71270 -48271
453d8271n016R6134L816q0009M082P4767j2750p5953K1085Q4605k5690r8292J8057
466d3435J12062m136j26390k0563J30280M8943j24889q0941J08410J04654q9071
477A4924j25878O0890J39690k8559j44973l433J40307K8597j28802m7206J16183
488B1740O4013j00756p2910R1521P9986p9120q2341P1388Q7131o3096q9731O0902
500a1273R7776n2605j04034M0362J11164k6988j17166J1838J19489M746j19195
511d5886k6887J10628M2929j03425n9300Q7489O9077p3977q0616N7945Q6629m7849
523A6757r2219L4873R4943k4966r8208J8211J05452q777j11938k519J20013K1418
535G3040j22873l8745J27865O2566j21816q3811J12255J09134r2698j26567P0260
$$ plain form
453 -48271 -53287 42847 46663 -33346 -29264 45503 32753 -43200 -22115 62490 36800 -61492 -43435
466 -43435 68627 64491 -61899 -82462 47818 96761 -28128 -109069 -659 103995 14924
477 14924 -110954 -50064 89626 61067 -83906 -87339 52968 81565 -47237 -94443 21740
488 21740 85753 -15003 -87913 3608 83594 4474 -77867 -6479 80652 17556 -72175 -11273
500 -11273 86503 33898 -70136 -29774 81390 54402 -62764 -50926 68563 73309 -45886
511 -45886 -72773 37855 80784 -22641 -81941 5548 74625 648 -79968 -22023 64606 16757
523 16757 -75462 -40589 54354 29388 -68820 -50609 54843 46066 -65872 -68391 51622 73040
535 73040 -49833 -88578 39287 101853 -19963 -103774 8481 117615 24917 -101650 -31390
546c1390J37565l9139j38930Q029J32414J9333j19908m2834R6895N7135p3756
557E414o4395M8504N8980l3764n1301J9993L6594j8646k8727K2884K1519l6964
569a9909k3854M9738L4789o1112n6169O7891Q4044o3096j09605M8007J36452j7554
581F9622j52155j5535J60318N7798j48901r2051J28547J25143r4888j43563N7572
592d8093J50133j5334j41447k2464J21004M9213r4632o4789O1375O5474l5460
603B4980o0375J3537M2119p843k5824P918P819k3162l255M1459O733o3205k3887
616f2986P8547N0431q3918q4628P8299J20397n6332j45925K3716J63482K1240
627A02323j61541o2392J49870J03127j18079j28878Q0451J44447l4138j40223
$$ plain form
546 -31390 106175 67036 -71894 -63865 68549 87882 -32026 -74860 22035 79170 5414
557 5414 -58981 -10477 48503 14739 -36562 -16569 20025 1379 -27348 -4464 17055 -19909
569 -19909 -43763 5975 40764 -20348 -76517 -8626 75418 12322 -97283 -49276 87176 69622
581 69622 -82533 -98068 62250 120048 -28853 -120904 7643 132786 37898 -105665 -48093
592 -48093 102040 86706 -54741 -77205 43799 93012 -1620 -66409 -5034 60440 24980
603 24980 -35395 -21858 20261 12418 -13406 -5488 2331 -20831 -24086 17373 24106 -39099 -62986
616 -62986 15561 65992 -17926 -102554 -24255 96142 39810 -106115 -82399 81083 102323
627 102323 -59218 -121610 28260 131387 13308 -115570 -35119 109328 75190 -65033
637f5033o743J22705M1614r3305o2305N9904O4819k7370n6242j700L3574J4473
649B4391j0294j4935j8739m407L3512K9050m0906o4078K9943R3295o558j18441
661f8167l2283J27040P7742j19312j22252R5671J60473n5360j79104Q978J84933
672G8359M4908j68008q8863J41630J26449r6464j41210N0005J42849l399j24529
683c8273l2985R8272N7863o4281o7682K9806N8876l014m1660j6284J3386J7320
695A1344Q424q704k8966j7236L4263M2790l3047p3802J4619R4984J3287j06886
707d8930n0678J03560Q6845q6030j17124O0309J39274k3167j42077j3319J35887
718D4550N1768j12595p7531Q7595R5092n2333r4379K4185Q7232K935p0430k0561
$$ plain form
637 -65033 -71776 50929 92543 -762 -63067 -3163 61656 34286 -21956 -23656 9918 24391
649 24391 14097 -838 -19577 -23984 9528 38578 -2328 -66406 -36463 56832 50274 -68167
661 -68167 -100450 26590 104332 -14980 -137232 -41561 118912 63552 -115552 -106574 78359
672 78359 123267 -44741 -133604 8026 134475 38011 -103199 -53194 89655 86256 -38273
683 -38273 -71258 27014 84877 20596 -47086 -17280 41596 38582 -3078 -19362 -5976 11344
695 11344 19768 11064 -17902 -35138 -875 41915 8868 -64934 -50315 44669 57956 -48930
707 -48930 -99608 3952 90797 4767 -112357 -52048 87226 64059 -78018 -91337 44550
718 44550 96318 -16277 -93808 -6213 88879 36546 -57833 -33648 53584 56519 -13911 -34472
730c4472N1341K7907l1514k4407J6631J0566j2399J261J1622j6027k3753K0046
742c198L6769k1479n9669R810P6270L823r2058k8639R3900N5103q6597q0184P0825
755b5324J00402m7820j13082K4024J18681N723j07932k8068R5328N0087p2869
766h50n9549N4744O6208l3430o0059J9320N3830o936m3523j25L4539K04l0449
779f076K162K9052p858l3979Q069L5059j1462m4550N148N1202J094o1512j4632
792d8283O4659K4278o6190l7049O0571M6667n1569n5322M3415O3590l1865o6686
804e3784K1954O8373r446o1869L937O1589O493n6248j3290N5281K2234n0010k7952
817c2738M8464L5604m2063m2449L3468M9961k5731n9642J4296O2472l942o4049
$$ plain form
730 -34472 16869 44776 13262 -11145 5486 16052 3653 4914 16536 509 -23244 -3198
742 -3198 33571 12092 -47577 -37767 38503 42326 -49732 -78371 15529 70632 -15965 -96149 -25324
755 -25324 75078 27258 -85824 -61800 56881 62604 -45328 -73396 21932 72019 -850
766 -850 -60399 -5655 60553 27123 -32936 -13616 40214 33278 -10245 -10370 24169 24373 -6076
779 -6076 -3914 25138 17280 -16699 -8630 26429 14967 -29583 -24435 26767 27861 -33651 -48283
792 -48283 16376 40654 -25536 -62585 -2014 44653 -6916 -62238 -18823 44767 12902 -53784
804 -53784 -31830 36543 27097 -34772 -30835 30754 37247 -19001 -32291 22990 45224 -4786 -32738
817 -32738 15726 51330 9267 -33182 286 50247 24516 -35126 -20830 41642 37700 -26349
829b6349r125N9118J6486n7850k9223M8729L5539m1856l8900L2458L5582k8394
841c785l2698K4455K8444k2569k5813K5226K8273k6178k9037L0751L6111l1088
853B092m3818L0854N7648j8053o4450M570P1555J3343p3090l1756O9526N1846
865G0267n6100o8872L6750P9755j6134q5805p629P9080K5195o9036m0573N1660
877a442M7929l5081n0724J3806M0478k078k6331k364J0517n71L967Q538j5055
890h411k2927J9096M1695j0565n7346l247P0620K6717p0653n1384O1898P5920
902G1413m2432r1219J8880J04349J3334j04355m7705R0808P6291o6762r4511L7050
914c4859J03807p066j03751k3331Q9380M4686o9637o0800M2781O3170j7401n5500
$$ plain form
829 -26349 -35474 23644 40130 -17720 -46943 1786 37325 -4531 -43431 -10973 24609 -3785
841 -3785 -36483 -12028 16416 -6153 -31966 -6740 21533 -4645 -33682 -2931 33180 2092
853 2092 -41726 -10872 46776 28723 -35727 -31157 40398 53741 -19349 -51105 18421 70267
865 70267 14167 -54705 -17955 61800 45666 -40139 -47768 31312 56507 -12529 -53102 -1442
877 -1442 46487 11406 -39318 -25512 14966 12888 -13443 -15807 -5290 -5861 -1894 6644 -8411
890 -8411 -31338 -12242 29453 18888 -38458 -41705 28915 55632 -15021 -66405 -4507 71413
902 71413 28981 -62238 -43358 60991 74325 -30030 -77735 13073 89364 22602 -71909 -34859
914 -34859 68948 61882 -41869 -65200 24180 68866 -771 -61571 -18790 44380 26979 -28521
926b8521m850L7237J4956j9642j7829N0J2882J8572K782k8897k2882K7047M2414
939C3319j4142n5153j916O3824K5000n9489m7402M8122O8423k8267q0859K610
951d5930Q4851K7308p5415n0942N7931O5346l9076p4590J6807P5180O490o7294
963a9334k4010M9440L0402l2164l1374J6121K2432n462r409J288n370m365J5852
976D047J3854k4485l0327K5369M9015j3713o1196m470O6991K5012o5840m6945
988f2688N8124O9217l6375q3761J0032Q9609J8562q4035m4376O9051O4751m7514
1000B0597p5440K4938P7255j680p1652k1683N5188L5603l3753l7352J2655L0055
1012A4731K953j9952j4449K150J7635J7389j2095l3373j133M3412J9728m4846
$$ plain form
926 -28521 -33371 3866 18822 -820 -18649 -18599 -5717 12855 15637 -13260 -36142 -9095 33319
939 33319 19177 -35976 -37892 25932 50932 -8557 -55959 -7837 60586 32319 -48540 -45930
951 -45930 38921 66229 -9186 -60128 -2197 63149 24073 -50517 -33710 41470 47960 -19334
963 -19334 -43344 6096 36498 4334 -27040 -10919 11513 6051 -3358 -2070 -7440 -11805 4047
976 4047 17901 -6584 -36911 -11542 37473 23760 -37436 -41906 25085 50097 -15743 -62688
988 -62688 -4564 64653 28278 -55483 -45451 44158 62720 -21315 -65691 3360 68111 20597
1000 20597 -54843 -29905 47350 45670 -25982 -47665 7523 43126 9373 -27979 -15324 14731
1012 14731 17684 -2268 -16717 -14567 3068 20457 8362 -25011 -26144 17268 36996 -7850
1024g850m0720L6487N7921k0014o6942k00P2438K3923o8821m8410N4348O7032
1036E9192l2005p5504R154P7637J2723p2741l4527O1090N0065m4370n8097K6076
1048b1307N8530q274n1903n511M1031J0793l0615j2428K1685J1435j1541o429
1060d534M990k925n796J0484J1108j3160j7059J3641K3875j0648l0247L939L3760
1073A7428M780l4193j5193L2244K6627k5735l5161J6389L7572q443l8690L44L9441
1086A7410R202l7691j6981L2087J9710k7593k0872K4852K1525k1756k2313J9996
1098b424K3421j7968k5441J6216K6804j5147k5788J4166K8894r792l0846K732
1110a5173L0255L794k7751p019K6478J0709k3890j4469J8519J6565j3737j8497
$$ plain form
1024 -7850 -48570 -12083 45838 25824 -41118 -41318 31120 55043 -13778 -62188 -7840 59192
1036 59192 27187 -48317 -39163 38474 51197 -21544 -56071 5019 55084 10714 -47383 -21307
1048 -21307 37223 28949 -22954 -28465 12566 23359 -7256 -19684 2001 13436 1895 -4534
1060 -4534 456 -2469 -8265 2219 13327 167 -16892 -3251 20624 9976 -20271 -16332 17428
1073 17428 22208 -11985 -27178 5066 31693 5958 -29203 -12814 24758 16315 -22375 -22031 17410
1086 17410 26612 -11079 -28060 4027 23737 -3856 -24728 124 21649 -107 -22420 -2424
1098 -2424 20997 3029 -22412 -6196 20608 5461 -20327 -6161 22733 12941 -17905 -15173
1110 -15173 15082 18876 -8875 -15894 10584 21293 -2597 -17066 1453 18018 4281 -14216
1122a4216R450J9144q657j8733Q611J7776j0957k0538R400K3029p223k6654N892
1135a3676L2152l773l9220k307M2768J0550m0765j8580L7846K9008l2288l6902
1147c5187K5446M2571j4626m3249M281M0386R504l1736j9251K2259K3295j4625
1159I068k2947P000K0321Q56j3955q188M796Q173q9l311m100o341L493J5596j020
1174I352k4408o668K7301J6056k6858k9823K2512M4388j2871n3611M28N5371J3373
1187C4542n0487k6423M2478M2279k8303n0817J3546N2668K207m4072j5595L2737
1199D760K7060j7666l1936N278L0940M163k3455j3165R885J6795M540j4249j6471
1212a3521M132J6853P981j5248k4619Q170L8060K003m7525j7442M5584L4858l6410
$$ plain form
1122 -14216 -4766 14378 5721 -13012 -4401 13375 2418 -18120 -8720 14309 7086 -19568 -13676
1135 -13676 18476 14703 -24517 -26824 15944 26494 -14271 -32851 4995 34003 1715 -35187
1147 -35187 -9741 32830 18204 -25045 -20764 19622 29126 -2610 -21861 398 23693 9068
1159 9068 -13879 -6879 13442 14298 343 -7845 -3049 5124 5035 1724 -2376 -8717 -5224 10372 9352
1174 9352 -15056 -21724 5577 21633 -5225 -35048 -12536 31852 18981 -34630 -34202 21169 34542
1187 34542 -15945 -42368 110 42389 14086 -36731 -23185 29483 31690 -12382 -27977 4760
1199 4760 31820 14154 -17782 -12504 18436 22599 -856 -14021 -4136 12659 17199 2950 -13521
1212 -13521 -9389 7464 15445 197 -24422 -16252 21808 23811 -23714 -41156 4428 39286 2876
1225B876n3246K1603O6788k511p0934j3996O6343L2226n2286m8130L4010O1757
1237D4500j0361o2621p962N5445K3207l8832l4321J9399M2401O69m1885j6033
1249b6394L2198K4723j5833k8520n862K4092K1937j6060l1138J718L0686J4123
1261B5670k6280l6282J4351N1623J052n7292j8737N1223L6065l8770n3069K2434
1273b8012O5330l833o7510j1254O0684K8797m3497m1889K4240N0754m897m9510
1285b0597o580M3610J7542k8857k5895J1414K9855L096k7071r836J9016R716p710
1298G703q379o300L017J3797R47j5865j0340R212K0515J12l2751j3061L5954K0596
1312B5157l1692k6751K2424L3718r680l9809m517M3101J5259l6835j9172K6125
$$ plain form
1225 2876 -50370 -28767 38021 35510 -35424 -49420 16923 49149 -3137 -51267 -17257 44500
1237 44500 34139 -28482 -36444 19001 42208 3376 -30945 -11546 30855 31524 -10361 -26394
1249 -26394 5804 30527 14694 -13826 -19688 4404 26341 10281 -20857 -19139 11547 25670
1261 25670 -610 -36892 -22541 29082 30134 -27158 -45895 5328 41393 2623 -50446 -28012
1273 -28012 37318 33485 -34025 -45279 15405 44202 705 -41184 -16944 33810 28913 -20597
1285 -20597 -27177 16433 33975 5118 -20777 -9363 20492 23588 -3483 -13319 5697 15413 7703
1298 7703 -676 -6976 -3959 9838 10785 -5080 -15420 -6208 14307 14419 -18332 -31393 4561 25157
1312 25157 -6535 -33286 -10862 22856 13176 -26633 -31150 11951 27210 -9625 -28797 -2672
1324b672K3610j0135k4409j393K5474R062k1401r285J4013R868j832p011p370
1337c481K888R131l0l886m909m900J1631J2559j8417k1988J7086K5185r561l0474
1351a9166n104L3711J8126l6953k7994L3306L1781k6051l4377J3007L7077K929
1363B0292l6778j4130L4063J8662k6581j7153J6992J8744l524j8043m381J9318
1375G481Q339j5828n582J0607K435j988k03j470M24O02k286K867J21j0410L674
1390a217J5661p850j8618N288J4918j746j4497o919J5897J2054j9719j4515J9624
1403a639J2778j6697j1342R890J2075l148j4023K280J8561k200j9744M113J8101
1416I005j081j2037k568J1253J0979j2060j6647J4835J9726j3970j8941R145J8230
$$ plain form
1324 -2672 20938 10803 -13606 -14999 10475 19537 -1864 -11149 2864 12732 10900 3889 -3481
1337 -3481 -593 8538 8508 4622 -287 -5187 6444 19003 586 -21402 -4316 20869 11308 -19166
1351 -19166 -24270 9441 27567 -9386 -37380 -4074 27707 1656 -32721 -19714 17363 20292
1363 20292 -16486 -30616 3447 22109 -4472 -21625 -4633 14111 10587 -7456 -11837 7481
1375 7481 15820 -8 -5590 5017 7452 5464 5261 3791 4215 4817 2531 5398 5519 -4891 -1217
1390 -1217 14444 6594 -12024 -6736 8182 6436 -8061 -14980 917 12971 -6748 -21263 -1639
1403 -1639 11139 -5558 -16900 -7010 5065 1917 -12106 -9826 8735 6535 -13209 -9096 9005
1416 9005 7924 -4113 -6681 4572 15551 3491 -13156 1679 21405 7435 -11506 -2361 15869
1429A5869k91j9125q793K0655J2636k3312j4264J9533J1860j2871j0493K876Q567
1442B847M29j0738n54Q776l779m190Q133k362j1073N299J1655k168j1345n021
1456a4091J3483J5793j3845k1900J4876K4851q648k3797j195K4210J7076k3092
1468C721k6886K1406L1448j4859l1370M243K8569Q216k5210j9805K0875K3562
1480B3910j6538k2403O174J4736K817o885j2291N64J2718L448q481r843k612J5689
1494A003J3817j8201k2015J6100K6436o559k7045p479K8077K3300k4821l2997
1506c0384J9542L8501o396l7055r863L3741K7923k7664l8444K0000M2591q705
1518B3787m0384o228L2743K0356k4617k9703J4476L0480n675k4729n801J2876
$$ plain form
1429 15869 15578 -3547 -12340 8315 20951 -2361 -16625 2908 14768 1897 -8596 -5720 2847
1442 2847 3276 -7462 -8016 760 -3019 -7209 924 -1438 -12511 -7212 4443 2275 -9070 -14091
1456 -14091 -608 15185 1340 -20560 -5684 19167 10519 -13278 -14473 9737 26813 3721
1468 3721 -23165 -1759 29689 14830 -16540 -12297 16272 24488 -722 -20527 348 23910
1480 23910 7372 -15031 -8857 5879 8696 1811 -10480 -9916 2802 6250 -2231 -12074 -14686 1003
1494 1003 14820 -3381 -25396 -9296 17140 10581 -16464 -23943 4134 27434 2613 -30384
1506 -30384 -10842 27659 21263 -15792 -25655 8086 36009 8345 -30099 -10099 32492 23787
1518 23787 -16597 -22825 9918 30274 5657 -24046 -9570 20910 15235 -9494 -15295 -2419
1530b419J4386k633k0233o683J7511J2826q572j8078n572K0649J8205j9211k5891
1543b5715J3175K9232o59k7903j4081K4879K9029j8046l6171R279L8281M840l3469
1556g329j9441K6705L2505j8281l8635R002L7953J799l1151j3230K0616K0871
1568B1384j0926k4344K242J9845L903j0668j0468k200J2910J1570j2212j7891
1580a6855M744J9902O900j9019j9542J5629K8739q817l2059m42L0337J3913k4282
1593h52k6691J6547L6892o927l8635l254L5255J5592k7312k5978J7849L3216q455
1606A7247l4213l54K9279Q127j9793j4774R059J7715q37j6978n419J0165R183
1619H407q88j1203r517J0055J6201o865j8816o87J7404J0109j4259j8655R543
$$ plain form
1530 -2419 11967 9334 -10899 -17582 -71 12755 4183 -13895 -19467 1182 19387 176 -25715
1543 -25715 -12540 16692 16033 -11870 -25951 -1072 27957 9911 -26260 -16981 21300 26140 -7329
1556 -7329 -26770 -65 32440 14159 -24476 -15474 22479 24278 -6873 -20103 513 21384
1568 21384 10458 -13886 -11644 8201 12104 1436 -9032 -11232 1678 13248 1036 -16855
1580 -16855 -12111 7791 14691 -4328 -23870 -8241 20498 11681 -20378 -20820 9517 23430 -852
1593 -852 -27543 -10996 25896 18969 -19666 -22920 12335 27927 615 -25363 -7514 25702 17247
1606 17247 -16966 -17320 11959 20086 293 -14481 -5422 12293 11456 -5522 -10941 -776 8407
1619 8407 7519 -3684 -13201 -3146 13055 6190 -12626 -13313 4091 14200 -59 -18714 -9171
1632i171K3738l006k4279m550K0872J3933j4374k1618Q156K6477j550k6126m520
1645a6018K3102J0814j6672j6038J0699J9244o620j8443L369J4233l89r269k137
1658d125M723L135k552k402J683j086k378M591L014p660m003P663N692n416q082
1673g203J655J0488K366j2376m912J1892P398r022r552M916J2027j281j3433r91
1687h028J3837K403j2090l311R947L673p035m696O488N019p054m742Q415L660
1701F486q831l238Q218L745p713m975O406P266n589r352N032R156k959q943N82
1716d709P037K375n715m164M675N117l990m491K950L119k098k347K533J915k743
1731e36k930M389M584p113o178Q622Q670q020j1802O150J4592l401j7249l07J8054
$$ plain form
1632 -9171 14567 11561 -12718 -17268 3604 17537 3163 -18455 -10299 16178 14628 -11498 -16018
1645 -16018 7084 17898 1226 -14812 -4113 15131 8511 -9932 -6563 7670 7281 -1988 -4125
1658 -4125 598 3733 1181 -1221 462 -624 -3002 1589 4603 -3057 -7060 603 6295 879 -7203
1673 -7203 -5548 4940 7306 -5070 -9982 1910 9308 286 -9266 -4350 7677 6396 -7037 -8028
1687 -8028 5809 8212 -3878 -7189 2758 6431 -604 -5300 1188 6207 -847 -5589 2826 6486
1701 6486 -2345 -5583 2635 6380 -1333 -6308 98 7364 1775 -7577 -2545 6611 3652 -5291 -4709
1716 -4709 2328 4703 -1012 -5176 -501 4616 626 -3865 -915 2204 106 -2241 292 2207 -536
1731 -536 -3466 923 5507 -1606 -7784 838 9508 1488 -10314 -4164 10428 7027 -10222 -10529 7525
1746G525N146j6956r525J3825J2644q728j4889K873J5954K487j4337o579J0560
1759@R982m824j1804n43J1222M990q446p382M497P617K67o559m711L056P388J733
1775F483p911o645M792J1531o60j5144n381J6178J0874j4357j6417J0179K0694
1788A4216l986k2450l579K1179J0927j7540j5023J1148J8135l525j8337l645J6080
1801C600R837j0598j3244M717J3311L055j1534q096P085J0292q58r983n242O775
1815h83J0382j317j2849p020J1636J3912q105j9344J027K2514O864k3322j5576
1828b2081J9641K2306j2678k7418L898K8769N795k5816j4378J9101K0843j0292
1840G690k3762J134K4029R228j8801j6808J1442K0813j816k0467o351J7240J4062
$$ plain form
1746 7525 12671 -4285 -13810 15 12659 3931 -10958 -8085 7869 10356 -3981 -10560 0
1759 0 9982 5158 -6646 -7189 4033 9023 577 -6805 -2308 5309 5576 -983 -5694 -2638 4750 6483
1775 6483 -1428 -8073 -3281 8250 7590 -7554 -12935 3243 14117 -240 -16657 -6478 14216
1788 14216 10230 -12220 -15799 5380 16307 -1233 -16256 -5108 13027 9502 -8835 -12480 3600
1801 3600 13437 2839 -10405 -5688 7623 10678 -856 -8952 -1867 8425 7567 -2416 -7658 -883
1815 -883 9499 8182 -4667 -11687 -51 13861 5756 -13588 -12561 9953 16817 -6505 -22081
1828 -22081 -2440 19866 7188 -20230 -16332 12437 18232 -7584 -21962 -2861 17982 7690
1840 7690 -16072 -14938 9091 18319 -482 -17290 -5848 14965 13149 -7318 -13669 3571 17633
1853A7633j0382j8653J988J8487P314j5364j5318Q127J9770P94k0558j1686J7391
1866d57J9091j2097k5413K739K8274O868k6736j6720K0867K3227j2726k7214L546
1879a6751K7717N972k3456j3919J7398J9995q547k1895m11K0844R407j5396j3774
1892a2816R470J6463k787j5823l695J2634R086o760j0644L42Q917N110o524r190
1906f217N76J0434M982j0008j1204O656J4962k725j7303m372J6370R238j3263
1919a874j2716Q568J4750l518j5307k026J3644P404r181r364M703J0719M73r005
1933b730l242O388O412l103n864K62N641K544k288m482j486L895M766j642o965
1948a894k208P955N202q850r484O321J1836l263j4277j135J3853M562j2662q551
$$ plain form
1853 17633 7251 -11402 -9414 9073 16387 1023 -14295 -6168 13602 14396 -6162 -17848 -457
1866 -457 18634 6537 -18876 -16137 12137 19005 -7731 -24451 -3584 19643 6917 -20297 -16751
1879 -16751 10966 16938 -6518 -20437 -3039 16956 8409 -13486 -13897 6947 16354 958 -12816
1892 -12816 -3346 13117 10330 -5493 -9188 3446 12532 5772 -4872 -4530 4387 9497 2973 -6217
1906 -6217 -5641 4793 9775 -233 -11437 -4781 10181 7456 -9847 -14219 2151 11389 -1874
1919 -1874 -14590 -6022 8728 5210 -10097 -12123 1521 8925 -256 -9620 -4917 5802 6275 -2730
1933 -2730 -5972 416 6828 3725 -2139 -1877 3764 6308 4020 -462 -1948 1947 6713 5071 -1894
1948 -1894 -4102 3853 9055 205 -9279 -2958 8878 5615 -8662 -9797 4056 8618 -4044 -12595
1962a2595R688R649n913j0870K589J0710J408q754m373O527O303l303n455J400
1976b989N889R81m290j971L792K691j634k230J135J271o28M18R11j365k026J371
1992A326K698j825m157J913M139j873n538N9N017j13m809q02L859Q31l817j571
2008d663L602Q15l731n08L510J211k976j593L924L100l084m674K559O845k5o666
2024b354r36P226L827p173n991N949R266m133j0014J305J0270J115r302m066O996
2039A985M932n361n643J920N384l15m098k396j46L006K526k532m709L98N852K316
2055C119o184n863N363Q729k463r988r58J0682O093q482r789N541J3323j055j3736
2070e668l062J4036Q589j0578j3692O891J5146j682j4857l060J2655P227q943
$$ plain form
1962 -12595 -2907 6742 829 -10041 -7452 3258 4666 -4088 -8461 -1934 4369 1066 -4389 -2989
1976 -2989 2900 3881 -409 -2380 1412 4103 2469 239 1374 2645 2017 2435 3346 1981 -45 1326
1992 1326 4024 2199 -1958 -45 4094 2221 -3317 -3258 1759 1646 -3163 -3965 -106 725 -3092 -4663
2008 -4663 -1061 -246 -3977 -4485 -975 236 -2740 -4333 -409 2691 -393 -5067 -2508 4337 4312 -2354
2024 -2354 -3290 3936 7763 590 -5401 548 9814 5681 -4333 -3028 7242 8357 -945 -5011 1985
2039 1985 6917 1556 -4087 -2167 3217 2902 -1196 -3592 -3738 -732 1794 -738 -5447 -5049 803 3119
2055 3119 -3065 -8928 -3565 5164 2701 -7287 -8245 2437 8530 48 -9741 -4200 9123 8068 -5668
2070 -5668 -8730 5306 13895 3317 -10375 -3484 11662 9980 -4877 -7937 4718 11945 3002
2083C002j0614L772J0725J083r767o350N406R025m36j0322n558P994R322n152
2097B130j2519R06J3093N190j1586j0583P933J4137k333j4922l228J3901J0476
2110A2595j0167j4478N199J7893J112j7317p244J5213J3317r841j6380L918J6970
2123A0790J496j5522o651J1354J0681n751j2451j125J0187N492p082q801J294
2136f089R288L647q444q486N324J0865j275j1948m468J0229R929n662j2629L19
2150i400J3284N370j1510j0216Q493J5201k185j6710l303J6265R124j2650j3286
2163a1523P844J4939q94j4473m178J1969Q127p901j0860R42J0679N244p658j0190
2177g933K831J1088K189j1623q130Q983J2389m263j5890j546J5340P615j2227
$$ plain form
2083 3002 -7612 -3840 6885 7968 -1799 -8149 -2743 6282 5846 -4476 -10034 -2040 7282 2130
2097 2130 -10389 -9483 3610 8800 -2786 -13369 -5436 8701 6368 -8554 -11782 2119 12595
2110 12595 2428 -12050 -6851 11042 12154 -5163 -12407 2806 16123 6282 -10098 -6180 10790
2123 10790 12286 -3236 -9887 1467 12148 6397 -6054 -7179 3008 8500 1418 -7383 -6089
2136 -6089 3199 6846 -1598 -10084 -4760 6105 4830 -7118 -11586 -1357 8572 2910 -9719 -9400
2150 -9400 3884 9254 -2256 -12472 -3979 11222 9037 -7673 -10976 5289 14413 1763 -11523
2163 -11523 -3679 11260 10366 -4107 -8285 3684 11811 3910 -6950 -6008 4671 9915 2257 -7933
2177 -7933 -5102 5986 8175 -3448 -11578 -2595 9794 5531 -10359 -11905 3435 11050 -1177
2190a177j3254O727J6912m55j7056n621J5976J1897j1760j6812N526K0267J944
2203A3114j8664p637J5911J2649j0776j5833N070J6289J451j4446o836J0421J0372
2216A1085n131j1829j211R689O258p316r804L592J0884R77j1038o497Q075R697
2230G431l946j0889j01J0147M096q193p771M967J0188o79j0916l422J0203Q005
2244I120p232j0240L947J1100m42j0669j811R974M702p738o286M691O552k438
2258C230n627N08M428N00k860o62R45K88k33n36l45r18O36J340K21j481j856P83
2276a639K411p12k164l82L086J575l202k742K618L628j863l459R52M312q41k843
2292a265J004K594r82l021R73K922q96k553K017K593k244l782J228M299k05m648
$$ plain form
2190 -1177 -14431 -7704 9208 8753 -8303 -13924 2052 13949 2189 -14623 -9097 11170 13114
2203 13114 -5550 -13187 2724 15373 4597 -11236 -6166 10123 11574 -2872 -9708 713 11085
2216 11085 5954 -5875 -7086 2603 8861 1545 -8259 -4667 6217 7194 -3844 -10341 -2266 7431
2230 7431 3485 -7404 -7505 2642 6738 -1455 -9226 -4259 5929 5250 -5666 -9088 1115 9120
2244 9120 1888 -8352 -4405 6695 6253 -4416 -6227 3747 8449 711 -5575 -884 5668 3230
2258 3230 -2397 -1889 2539 3039 179 -483 462 750 517 -19 -364 -1282 -646 694 915 -566 -2422 -1639
2276 -1639 772 60 -2104 -2486 600 2175 -1027 -3769 -1151 2477 614 -2845 -1893 2419 1578 -1265
2292 -1265 -261 2333 1351 -1670 -697 2225 1329 -1224 793 3386 1142 -2640 -1412 2887 2682 -1966
2308a966j31M190J313l909k547K524K884j345l699j07L484K247k758k852J133
2323a539K960n56k806o6K407R66r87j284l84J72J714J256j521k813Q86M937k14
2340C128n912j532O416L795o393o280N576Q037k373q810r06Q235L348p147n566
2355f384M639P796j376q458k321P576M988n405p450K799Q209K62p205l342N712
2370D0N084l288n829o46N721L842k711o209m32O525L700n682p292L789J0128m23
2386F317j1111l969J0774P506q366j0617M550J2031J10j1679l950R742P839o689
2400B488j0597J941J1471K876r510o783O435Q920k413j0010j329Q685N019n378
2414A815p615J847Q175K277o601p083L649R280Q60r639n683Q760R459o070j3164
$$ plain form
2308 -1966 -2097 2093 3406 -503 -3050 -526 2358 1013 -2686 -2793 691 2938 180 -2672 -1539
2323 -1539 1421 865 -1941 -2007 400 1366 379 -905 -1289 -1117 597 1853 332 -2481 -1595 3342 3128
2340 3128 -2784 -4316 2100 5895 -498 -6778 -1202 6835 4462 -4348 -5254 2981 6329 -818 -6384
2355 -6384 -1745 6051 4675 -3783 -6104 1472 6460 1055 -6395 -3596 4613 4875 -2330 -5672 40
2370 40 5124 1836 -3993 -4639 1082 4924 2213 -3996 -4428 2097 5797 115 -7177 -3388 6740 6317
2386 6317 -4794 -8763 2011 9517 1151 -9466 -4916 7115 7225 -4454 -8404 1338 9177 2488
2400 2488 -8109 -6168 5303 8179 -1331 -8114 -1679 7241 4828 -5182 -6511 2174 7193 1815
2414 1815 -5800 -3953 4222 6499 -102 -7185 -3536 5744 6604 -3035 -8718 42 9501 3431 -9733
2429i733J750J4351L716j3256q578J0470J1690n536j3815L96J3179M926j0465
2442i05r517O927J2130j684j2637l722J0860Q194o999j0950L204J1778J817j0997
2456b501n603P073Q809k446r630k487Q707O278n684r220R04J0674L365r859q158
2471i778P946J1268l828j3361j222J2541N583j0429r076O792J1481k485j1376
2484e944k901J0026O841o675r432K979J0456J419r092m700O415P194l257p606
2498d277LP384L203m819n130J140N405K441m302n606K797O562P74p609m784O681
2514a37P668m781r989J738J0150J553r198m970O625P459m088q602O53Q498K722
2529E301o499n459L410P467m67o985k018O254L969l325n423Q52O064J823m666
$$ plain form
2429 -9733 -7983 6368 10084 -3172 -11750 -1280 10410 4874 -8941 -8545 4634 9560 -905
2442 -905 -10422 -3495 8635 6951 -5686 -9408 1452 9646 2647 -8303 -5099 6679 8496 -2501
2456 -2501 -8104 -1031 7778 5332 -4298 -6785 1922 8200 2516 -6704 -5800 4874 8239 -1620 -9778
2471 -9778 -1832 9436 5608 -7753 -8975 3566 9149 -1280 -10356 -3564 7917 5432 -5944
2484 -5944 -8845 1181 8022 1347 -8085 -5106 5350 6769 -2323 -7023 -608 6586 3329 -4277
2498 -4277 -4274 3110 6313 1494 -3636 -2496 2909 5350 1048 -4558 -1761 4801 5575 -2034 -6818 -137
2514 -137 7531 2750 -7239 -5501 4649 6202 -2996 -7966 -1341 6118 2030 -6572 -5919 2579 5301
2529 5301 -1198 -6657 -3247 4220 3753 -3232 -5250 1004 4973 1648 -3775 -2923 3141 4964 298
2544B98l455K507M577L49m065l455L141N999k321p089k95P104K927o331n868M294
2560a683P563l206q061R30O874J494o151l590L881N242k026o093P40M980J276
2575B170l385k680K568L803j086m351Q24L930N95l031k04J893J266j289j040J321
2591A304Q44j385j53J583q88o86O42K88j054l28R4Q0N2q64M92L33k017m90K264
2610A11K75k623k44K302N97j569j890O17L725l14m242j81L987J945k209l873J444
2627b142O180k18o841m68O610K686n108m432L308O118j273o769k19O343P47m185
2643C37k342J330L381P53m219k841K762L066m70l185l276L185N291l096o596J379
2659d541N933J766m822m654K900P363p93p777j391P047M639m243p357J714R959
$$ plain form
2544 298 -3157 -650 3927 4276 211 -3244 -103 5896 3575 -3514 -3809 3295 6222 -109 -5977 -1683
2560 -1683 5880 2674 -5387 -4457 2417 3911 -2240 -5830 -1949 3293 1267 -4826 -4086 894 2170
2575 2170 -1215 -3895 -1327 2476 1390 -2961 -2137 1793 2388 -643 -847 1046 2312 1023 -17 1304
2591 1304 2148 763 610 2193 1305 619 1261 1549 495 167 261 341 393 -471 21 354 -1663 -2153 111
2610 111 386 -2237 -2481 -179 418 -1151 -3041 -2424 1301 987 -3255 -3436 551 2496 287 -3586 -2142
2627 -2142 4038 3820 -3021 -3489 3121 5807 699 -3733 -425 5693 4420 -2349 -2568 3775 4522 337
2643 337 -2005 -675 2706 3459 -760 -3601 -839 2227 1757 -1428 -4704 -1519 3772 676 -5920 -4541
2659 -4541 1392 3158 -1664 -6318 -3418 3945 3152 -4625 -6016 1031 5670 1427 -5930 -4216 5743
2674E743J473r969l664Q251O476m720q159R95R162K348q423m865N745N690j622
2689D461o505l359N964O514n266q251J874P541K649o983p020M827R575k580j0190
2704f749r90Q716M690n492q368K008J1043J560j0704m318Q134Q335l511j1168
2718f814k39J2837M232j1762o166P956R012l187j0018j564R788M916p667o961
2732e637M017O513O80o108n689N089P780l402q309m02O448M560m857p766J692
2747e391Q848O98q078l344N142O740j480q406k349R551N111p463o784M138Q472
2762E405J131r608m192R151O526o053p068K197O937K271n818n704L845P328j807
2777D541o389k172M080O090k252r298q5Q881K152o973n168L324P457R7r045l246
$$ plain form
2674 5743 7216 -2753 -6417 1834 8310 3590 -4569 -3574 5588 7936 -487 -5352 393 6083 4461
2689 4461 -2044 -5403 561 7075 1809 -6442 -4568 2973 5622 -1361 -8381 -3554 6021 3441 -6749
2704 -6749 -7739 977 5667 175 -8193 -6185 4858 6418 -4286 -8604 -470 7865 4354 -6814
2718 -6814 -7053 5784 10016 -1746 -7912 44 9056 5869 -4149 -5713 4075 8991 1324 -5637
2732 -5637 -1620 4893 5573 -535 -6224 -1135 6645 3243 -5066 -5468 980 5540 683 -7083 -5391
2747 -5391 3457 4155 -3923 -7267 -2125 4615 3135 -5271 -7620 1931 7042 -421 -7205 -3067 5405
2762 5405 6536 -3072 -7264 1887 8413 2360 -4708 -2511 4426 6697 879 -4825 -980 6348 4541
2777 4541 -1848 -4020 60 6150 3898 -5400 -5485 3396 5548 -1425 -6593 -3269 4188 4285 -4760 -8006
2793h006Q342N530n505p217J103Q410L541q810o476Q077Q236m527q781N95Q896
2808C408M698q163o994O325Q067l120p028p96N835M495m099o947J952P491k47
2823D877n296l732K858O299j226q035k98O812J769m824l778J334N222J079n984
2838b923k721M916L458k219m087r74N374L555n434n040N463M876k926l855K6M125
2854A614K607m203k860L855K529k211j635M07P30J222j69k330L15J441j71r2j205
2871a56j318K030P97j744p72R10j9N45m97k113O58K190n07k185M43J385R25n36
2889C6k485J217K661j179j937J815Q96j566P43M38n0k88o06P50J504j297j599
2906i47K000J274j924j017J024M34R18q47k325J315J490q29j348l81P45J680p56
$$ plain form
2793 -8006 336 5866 361 -6856 -5753 2657 6198 -2612 -9088 -1011 7225 2698 -6083 -5488 3408
2808 3408 8106 -57 -7051 -726 7341 4221 -2807 -3603 2232 6727 2628 -4319 -2367 5124 4877
2823 4877 -419 -4151 -1293 5006 3780 -4255 -4553 2259 4028 -796 -4574 -3240 1982 3061 -2923
2838 -2923 -5644 -728 2730 511 -3576 -4550 824 4379 -1055 -6095 -632 4244 1318 -2537 -2511 1614
2854 1614 4221 18 -2842 1013 3542 1331 -304 103 833 2055 1886 -444 -129 1312 1141 1049 -156
2871 -156 -1474 556 1353 -391 -1163 -253 -272 273 -224 -2337 -1679 511 4 -2181 -1738 -353 572 36
2889 36 -2449 -1232 1429 250 -1687 128 1024 -542 201 639 589 301 -305 445 1949 652 -947
2906 -947 1053 2327 403 -614 410 844 1762 915 -1410 -95 1395 566 -782 -1163 -418 1262 506
2923E06l045P20L161n00k276p66R97J345O38k232q06K224J435q58j746j202K384
2940b1L840k714m362J787M946o42m117j982L796M641l691n761K310N822N0m816
2956i14l111L456N133j891o549L10O409J579n104m175K846O036q35o676j072O081
2972A523J945l236l911P70M602K296m861l642L369M629Q3n270l676N342O059m123
2988A899p483K096P839Q28o633m712N181P233k967q006L46O934L177m891o207
3003e366K581P620k10q128k541O954M957l802p171L43P841K175o181m616M084
3018a460N473n9o278l456N732O205l515q083O82Q178L299p008p138N168R505k865
3034D380r872r80R210M887o773q157L457R494L6r202l471P113O955m192q899N84
$$ plain form
2923 506 -2539 -1819 1342 842 -1434 -2200 -1203 142 780 -1452 -2258 -34 1401 543 -1203 -2405 -21
2940 -21 3819 1105 -3257 -1470 3476 2834 -1283 -3265 531 5172 1481 -4280 -1970 3852 3902 -914
2956 -914 -4025 -569 4564 2673 -3876 -3566 2843 4422 -682 -4857 -2011 4025 3190 -3486 -4558 1523
2972 1523 3468 232 -3679 -2909 1693 3989 -872 -4514 -1145 3484 3567 -1703 -5379 -37 6022 1899
2988 1899 -5584 -3488 4351 5179 -1454 -6166 -985 6248 3281 -4725 -4379 2555 5732 841 -5366
3003 -5366 -2785 4835 4625 -3503 -6044 910 5867 2065 -5106 -4763 3078 5253 -928 -5544 -1460
3018 -1460 4013 3954 -2324 -5780 -48 6157 2642 -5441 -4759 3419 6718 -290 -7428 -2260 7245 4380
3034 4380 -5492 -6472 2738 7625 852 -7305 -3848 5646 5682 -3520 -6991 122 7077 2885 -6014 -5430
3050e430R738K726q671o086O676P481k496q045q50P294L689n644o037L294O580
3065D219O56n896m563M709O743k700p211p22O616M037n620o400L699P762q94q164
3081c729k111O425M653l850o050J220O671R83n879l315M147N214j573n945p57
3096c896N866K250m240l222J802M036j50l088j395J914K700m03l139j459J960
3111d64L683p29m368p65M457J935l821l944K636M648q72n024j392M641K842k787
3127F76l554O7L971J451l476k808K903L579r86m383r89M056K553k691l031J344
3143a318L466K07k915j606J904K776k34l343j142L228K702j983m068M91M189N58
3159B912m328j502L809K670k536l850P20L591M34l066j536K428K134j448k445
$$ plain form
3050 -5430 4308 7034 -1637 -7723 -1047 6434 3938 -4107 -4957 2337 6026 382 -5655 -2361 4219
3065 4219 4875 -1021 -5584 -875 5868 3168 -4043 -4765 1851 5888 268 -6132 -2433 5329 4435 -3729
3081 -3729 -5840 585 5238 1388 -4662 -3442 3229 4212 -1667 -4982 -835 4379 2806 -3139 -3896
3096 -3896 1970 4220 -20 -3242 -1440 2596 2446 -642 -2037 -123 2577 2174 -965 -2424 -464
3111 -464 3219 2490 -1878 -2643 1814 3749 -72 -4016 -1380 3268 2396 -2628 -4020 621 3463 676
3127 676 -2878 -2811 1160 2611 -865 -3673 -770 2809 1823 -2560 -3549 507 3060 369 -2662 -1318
3143 -1318 2148 2355 -560 -2166 -262 2514 2280 -1063 -2205 1023 3725 1742 -2326 -1835 2354 2912
3159 2912 -1416 -2918 891 3561 1025 -2825 -2105 1486 1920 -1146 -2682 -254 1880 432 -2013
3174b013J35K472O21k668j268J985K217j089k024P25J727m74j662Q58J216r1o13
3191E4L4Q57k08p10K67R89l82p45K35Q15j42q04K96j38k39K27K08o74k19M98R95
3212A214j436j397O74J372p0j583p10J818Q29j190j873L71K848N44k667j906K764
3229c98L047j366m005N73M008R40m056j964L999L290k339l915J110L571N92k695
3245C92k160J682K614K56l116j556K294K824j560m114l68M175J663l260l777K289
3261a722L602l18m403j552M378L124k205m905Q8N255K329m481m331L743N452r98
3277C056o508p42O426K931m980m794L228O057m85n336k070M424L805k629m995
3292b612K63N144J960m188m748K691N582n36o075k318N206L985l341n730R23O029
$$ plain form
3174 -2013 -1878 594 1215 -1453 -2721 -736 1481 392 -1632 -907 820 346 -1316 -458 758 667 54
3191 54 88 945 737 27 294 1283 901 156 391 1206 1064 260 556 418 179 406 614 -60 -279 219 1214
3212 1214 -222 -1619 -945 427 357 -1226 -1936 -118 711 -479 -2352 -1981 867 1411 -1256 -3162 -398
3229 -398 2649 1283 -2722 -2149 1859 2799 -1257 -3221 778 4068 1729 -2186 -1076 2495 3087 392
3245 392 -1768 -86 2528 2784 -332 -1888 406 3230 1670 -2444 -2812 1363 3026 -234 -4011 -1722
3261 -1722 1880 1562 -2841 -4393 -15 3109 904 -4001 -3913 1342 3671 -810 -5141 -1398 4054 3056
3277 3056 -3452 -4194 2232 5163 183 -4611 -1383 4674 4189 -1147 -3217 1207 5012 2383 -2612
3292 -2612 -2349 2795 4755 567 -4181 -1490 4092 3556 -2519 -4837 369 4354 1013 -4717 -3794 2235
3308B235J588n831m015L446O204p65o672j650O218M142m517o438K789P709K8o868
3324b397k848O038N131l688o055J533N375J781m658l459K965M723j85n544k489
3339c777M342M446k619n752j43N748K086m991m296K895N464o45n908k301N456
3354EM175l335o260R25O474J925n763m109M384O619k475o842m8O321K975m506
3370D65m683K947N448l65m992k122M058M194k011n623k36N926K474m649m867K382
3386a654O016r05n520k174N313L642m177n436J252N841J227m984l758L274N501
3401C458j377o105m54N540K855m646m449L124N667n56n378j395M749K841l077
3416G97l540J698M013N25l585k016K337L117q26l596o71L475J505k722k339J140
$$ plain form
3308 2235 3823 -2008 -6023 -2577 3627 2862 -3810 -5460 758 4900 383 -6055 -3266 4443 4471 -2397
3324 -2397 -5245 793 5924 2236 -3819 -2286 3089 4870 212 -3247 -282 4441 4256 -1288 -3777
3339 -3777 565 5011 2392 -3360 -3503 2245 4331 -660 -4956 -2061 3403 2758 -3150 -5451 5
3354 5 4180 845 -5415 -4490 1984 3909 -1854 -5963 -1579 5040 2565 -4277 -4325 1996 4971 465
3370 465 -4218 -1271 4177 3812 -1180 -3302 756 4950 2939 -2684 -2920 3006 5480 831 -4036 -1654
3386 -1654 4362 3457 -2063 -4237 1076 4718 541 -4895 -3643 2198 3425 -1559 -5317 -2043 3458
3401 3458 2081 -4024 -4478 1062 3917 -729 -5178 -2054 3613 3057 -2321 -3716 1033 3874 797
3416 797 -2743 -1045 2968 3493 -92 -2108 229 3346 2520 -1076 -1747 1728 3233 511 -1828 -688
3432f88K902n39k774j048K176J697j171k422k18K132R40j709k067J232K289k28
3448E04k550j56J847J572j468j714J463J170k67j006K15J110p3k68p7Q5k54O51
3466G84O20l06q20j03R19j57n99k87N83L67k73o75n49O04P52m65j368l02J023
3485b52R24j225j071Q15R11p36r60L96Q99K61k62o67K97L00L42K99n59m76Q39
3504G5R21o19p04L63J119j59j059l06J142P44m52p04n32O32O14m28j256%J313
3523G04O67j115j690Q91J685o46j433n74J226J110j026j045k7R21J302j163j873
3540b086K75K632P81k468j625K001K601q43l112K44L090J196k651k124J767L028
3556B706n33l361r31L185K013k165l124R06L741M65l991k045L149K953j593l707
$$ plain form
3432 -688 2214 1675 -1099 -2147 29 1726 555 -1867 -2085 47 987 -722 -2789 -1557 732 504
3448 504 -2046 -2202 -355 1217 -251 -1965 -502 668 401 -605 -390 720 647 379 302 387 133 784
3466 784 1404 1098 278 175 1094 937 338 51 634 1001 728 53 -496 108 860 395 -973 -1275 -252
3485 -252 672 -553 -1624 -809 102 -634 -1594 -1198 -299 -38 -300 -967 -670 -370 -28 271 -288 -764 75
3504 75 996 377 -327 36 1155 996 -63 -369 773 1517 1065 361 -171 461 1075 647 -609 -609 704
3523 704 1371 256 -1434 -543 1142 496 -937 -1511 -285 825 -201 -1246 -1273 -352 950 -213 -2086
3540 -2086 -1811 821 1602 -866 -2491 -490 2111 1268 -1844 -1600 1490 2686 35 -2089 -322 2706
3556 2706 2173 -1188 -2119 1066 3079 914 -2210 -1304 2437 2902 -1089 -3134 15 2968 1375 -2332
3572b332QL364J376k742k682J428L226O80l797j766K610L437j443m284n87M872
3588A368J689l577l209K710M314r93m496j031M200K870k798l510N49M449J036
3603C571m278k517K529M040j161m422r67M816K418l691l996J868M524K69m624
3618a621k111L588L664k473l913k63M283K311l539l972J986N203L4n381k210M691
3634B77L860k984m897J286N140J194m767k961L210M305q73n311j053N043L069
3649D538l901m515J919N402j53m899k587M461L874k842m797R78M849P53l924k829
3665c673K447M150o41m075j646L566L369k400m776J114N003P91m424k421L002
3680f14M055j586m389L0L930J552k936k885J819L339M6l716j330K928K987k142
$$ plain form
3572 -2332 -2324 1040 2416 -326 -3008 -1580 1646 2326 -1471 -3237 -627 2810 1367 -2917 -3504 1368
3588 1368 3057 -520 -3729 -1019 3295 2302 -2194 -3225 975 3845 1047 -2463 -1914 2535 3571
3603 3571 -707 -3224 -695 3345 2184 -2238 -3205 1611 4029 338 -3658 -1790 2734 3003 -1621
3618 -1621 -3732 -144 3520 1047 -2866 -3129 1154 3465 -74 -4046 -2060 3143 3177 -2204 -4414 277
3634 277 4137 1153 -3744 -2458 2682 3876 -891 -3852 -642 3663 2790 -2521 -3574 1469 4538
3649 4538 637 -3878 -1959 3443 3290 -1609 -4196 265 4139 1297 -3500 -2522 2327 3080 -844 -3673
3665 -3673 -1226 2924 2283 -1792 -3438 128 3497 1097 -3679 -2565 2438 3229 -1195 -3616 -614
3680 -614 3441 1855 -2534 -2504 1426 2978 42 -2843 -1024 2315 2361 -1355 -2685 243 3230 1088
3696A088l254J9L971M11k630k131J872K648p52k430q40K332J524r48k690KK592
3713G84J470k291k087J182L129m63k841j259L021J513j509k516R99K147M67j888
3729a42j791J529K039k34k684p08K297J652j697k246R51K442j40k197q56J889
3745A04J381j075j580K25J588N18j078j066P59R65M58j655p43J469J087r44j165
3762g52L44J530j1j494m81J092Q75r57n58J20N73K24n97p21L61P00j55o61K07
3781c61M75j27m03l19R03J11p88m2O88K78p96l29Q46Q35j130q24J106J033p85
3800C71o82K9R86M33r83o83K84J046K96j197q51R09J190m20j680Q2J330N13j225
3819b52j144R39J396k41j461p37J488J184j190j274j45J969P20k045j130J445
$$ plain form
3696 1088 -2166 -2147 1824 2235 -395 -2526 -654 1994 1242 -1188 -2028 304 1828 880 -1810 -1808 784
3713 784 2254 -37 -2124 -942 2187 1724 -1117 -2376 645 2158 649 -1867 -868 1279 1746 -142
3729 -142 -1933 -404 1635 1401 -1283 -1991 306 1958 261 -1985 -1034 1408 1268 -929 -1785 104
3745 104 1485 410 -1170 -945 643 1161 83 -983 -224 741 1199 -456 -1199 270 1357 413 -752
3762 -752 -408 1122 1111 -383 -864 228 1103 146 -412 -292 281 505 -92 -813 -452 248 93 -568 -361
3781 -361 114 -13 -416 -735 168 279 -509 -551 137 415 -381 -710 136 971 -159 -983 123 1156 371
3800 371 -311 -282 704 1137 154 -529 -245 801 1097 -100 -951 -42 1148 728 -952 -870 460 973 -252
3819 -252 -1396 -457 939 698 -763 -1500 -12 1172 -18 -1292 -1437 532 1252 -793 -1923 -478
3835d78K196p98k474K87K235J199k284j530J308K180m41j701p99J649J253q80
3851I22k006M7K198R62j581k395J397K068k0k604p45K083J332j364k246K96K334
3868F78P98k090j946J077K926j31k733j040K298K374j610l278R02L781L18l027
3884g03j948K619K729j255l152j04L308J144k009k685J281L108J65l545j085K781
3900F49K484k041k995K60L134J144k982k418K154K814q21l050j214K740K763k446
3916A75l367N52L983R84l413k356K566L517j464l534L76L245J274k814k227J986
3932e17K925j68k918j167K402K171j207k713k20K949J448k679k598J979K587k24
3948B050k839j430K519J918j615k699O3L030J102k602k375J450L501n02l613q85
$$ plain form
3835 -478 1718 920 -1554 -1267 968 2167 -117 -1647 -339 1841 1400 -301 -1100 549 1802 922
3851 922 -1084 -1037 1161 2123 542 -1853 -456 1612 1592 -1012 -1757 326 1658 294 -1952 -1656 678
3868 678 1476 -614 -2560 -1483 1443 1312 -1421 -2461 -163 2211 601 -2677 -1775 2006 2324 -703
3884 -703 -2651 -32 2697 1442 -1710 -1814 1494 2638 629 -2056 -775 2333 2498 -1047 -2132 649
3900 649 3133 1092 -1903 -1643 1491 2635 -347 -2765 -611 2203 1382 -1668 -2882 -142 2621 175
3916 175 -3192 -2640 1343 2327 -1086 -3442 -876 2641 1177 -2357 -1981 1264 2538 -276 -2503 -517
3932 -517 2408 2240 -678 -1845 557 2728 1521 -1192 -1412 1537 2985 306 -2292 -313 2274 2050
3948 2050 -789 -2219 300 2218 603 -2096 -2033 997 2099 -503 -2878 -1428 2073 1571 -2042 -2927
3964b927L229J802j579l371R69L679L49l340j229K070K719q96k713p89L061J905
3980B939k275k530J199K931L59l278j794L157K358j721l356O55K661R17k861j564
3996b203J565K505o21k980o30K156K474j900l178N97L689K62l390j234K755J986
4012A853j562k262L39K870Q10k871q54J492J484qj806m97J947J168j748j359P46
4029b58J739M3j393j007J393J115j385j094M51R02M91j094r81M58J140p1j101
4046f52l90N78P35k73j033J29J627o09j364N40P37r9p6k25j96Q84n9l66J90L76
4066D54m22K50K78m90K22L67j08L4l13j42K07p2o9J09Q5m77M23K16q65o7Q83m81
4088B2o02J77K10J96L3l07o88P32j30PJ35l63q7Q86L9j032J45P91J46M5j127L74
$$ plain form
3964 -2927 302 2104 525 -2846 -1877 1802 2151 -1189 -2418 -348 2371 1475 -1238 -2027 1034 2939
3980 2939 664 -1866 -667 2264 2623 -655 -2449 708 3066 1345 -2011 -1356 1305 2222 -639 -2203
3996 -2203 -638 1867 1246 -1734 -2364 -208 2266 366 -2812 -2215 1474 1736 -1654 -2888 -133 1853
4012 1853 291 -1971 -1632 1238 2048 -823 -1677 -185 1299 1291 -515 -1012 935 2103 355 -1004 -258
4029 -258 1481 1524 131 -876 517 1632 247 -847 -396 506 997 -97 -1078 -620 520 449 -652
4046 -652 -1042 -464 271 -2 -1035 -906 721 112 -1252 -712 25 -74 -150 -375 -571 313 254 -112 78 454
4066 454 32 282 560 70 292 659 551 585 272 130 337 265 196 305 390 -87 336 552 -313 -380 503 22
4088 22 -580 -403 -193 3 36 -271 -959 -227 -357 -350 -215 -578 -665 221 260 -772 -627 164 310 355 -772 -398
4110c98J308p1r14k84P56K53K5q97r7J115Q28j155j211P02Q25K13j278n27J075
4129B68Q67r96j298P39O77K84n86j295K90J681j70j029o80M62J637m02j880l56
4147a787K618N64k035j047J191J630j4k003m97K225J190j852j150P51J632N37
4163A953k186j545J833K071j193k101K19J743R63k281j377J349J977k84k254m07
4179a520J590J225o07k103l6K161O27j715j667J275K119j66k690m79K203J556
4195A773j670j650N78K307N49k217j625K062K082j060k110m22K058J785j786k619
4211a965J438K682m91k623m73J439K250j596k364R5K632N68j697j739R01K472
4227A529r6l050o28K775J747j997k401M34K885J045k928j680K343J766j101k214
$$ plain form
4110 -398 910 839 -75 -359 397 650 675 -222 -319 796 1624 469 -742 -40 785 998 -280 -807 268
4129 268 1135 139 -1159 -420 257 541 -45 -1340 -1050 631 461 -568 -1248 -786 851 449 -1431 -1787
4147 -1787 831 1395 -640 -1687 -496 1134 1120 -883 -1380 845 2035 183 -967 -216 1416 1953
4163 1953 -233 -1778 55 2126 933 -1168 -949 794 1757 -524 -1901 -552 1425 1141 -1113 -1520
4179 -1520 70 1295 688 -1415 -1451 710 1337 -378 -2045 -770 1349 1183 -1507 -1986 217 1773
4195 1773 103 -1547 -969 1338 1887 -330 -1955 107 2189 1129 -981 -1403 655 2440 654 -1965
4211 -1965 -527 2155 1664 -959 -1432 7 2257 661 -1703 -1608 1024 1592 -105 -1844 -943 1529
4227 1529 1433 -1617 -2245 530 2277 280 -2121 -1687 1198 2243 -685 -2365 -22 1744 643 -1571
4243a571k0K448J428j890k642J566K557k32k272j079J945K200j686k740Q58K655
4259A525L1k083j167J108K259m86k435j37J590J187j078j632j03K464O73k585
4275h69j136J724J851q33k212J68K021R85j985j067Q65J634j02j255j000J116
4291i5J501o15j728J49J689M40j214j455R82J907m89j931k34J187J032o38j181
4308f93k08J303J058j558j300R09J252K25j522j059J717J302j332j167J98J215
4324C40O23j210j020Q66J640o30j272j92R55Q33n34j302K82J669K41j702p28J080
4342f1J144p60j203P2J624M3j049n51P45N77p7j017k97J011P70r27q90O98P25
4361E77j83o90n66J013P68r67o40O00M97j08m64o73Q41P33o00l77J74L17p6l68
$$ plain form
4243 -1571 -1591 857 2285 395 -2247 -681 1876 1644 -628 -1707 238 2438 752 -1988 -1130 1525
4259 1525 1556 -527 -1694 -586 1673 1187 -1248 -1385 205 1392 314 -1318 -1421 1043 1716 -869
4275 -869 -2005 -281 1570 737 -1475 -1307 714 1699 -286 -1353 -488 1146 1044 -211 -1211 -95
4291 -95 1406 791 -937 -788 901 1341 127 -1328 -346 1561 1072 -859 -1093 94 1126 488 -693
4308 -693 -901 402 1460 -98 -1398 -489 763 988 -534 -1593 124 1426 94 -1073 -875 340
4324 340 963 -247 -1267 -401 1239 609 -663 -855 100 933 399 -903 -621 1048 1289 -413 -1141 -61
4342 -61 1083 323 -880 -808 816 859 -190 -741 4 581 504 -513 -810 201 971 44 -846 -148 577
4361 577 394 -296 -862 151 919 -48 -688 -88 409 301 -163 -836 5 738 138 -239 -65 252 176 -192
4381a92k23N38N59o58m36O43J50j65o60M54M21j90r08K17J082o2r45J26K18K98
4401B67j99n22K13P14L25r79l36L40P88O6j049m02J338P04j180r87Q15Q38R1j295
4421d50l46R75Q31j082q21L35J007J97j096o04Q83J099j80j981L1J456R25j344
4439a65j135P53J459oj569k25J169J290j056j443K33J449P53j454j071P43J396
4456A121k27j880m25J937J186j701j230O47J730j14j628p24R70J404n55j530l98
4473a417J609Q61j103j732Q67J826K15j974r44K007J408j394j708L97J910P07
4489A535j933j164J474J544m86j752m18J572J293r62j859L83J934M28j976j159
4505a546J512J547o91j888n6J676O96j134j884O41K293q3j960q80J623J551r56
$$ plain form
4381 -192 -415 123 682 24 -412 231 381 216 -444 10 431 241 -667 -450 632 570 -375 -249 -31 267
4401 267 68 -454 -241 473 798 -181 -517 -177 611 677 -372 -774 564 1268 88 -899 -84 754 845 -450
4421 -450 -796 179 1010 -72 -893 -558 449 646 -450 -1054 -171 928 748 -1233 -1202 254 1179 -165
4439 -165 -1300 -547 912 906 -663 -888 281 1571 515 -928 -695 754 1507 53 -1018 -275 1121
4456 1121 894 -986 -1411 526 1712 11 -1219 -572 1158 1044 -584 -1308 -338 1066 511 -1019 -1417
4473 -1417 192 1053 -50 -1782 -915 911 1126 -848 -1792 215 1623 229 -1479 -1082 828 1535
4489 1535 -398 -1562 -88 1456 970 -782 -1200 372 1665 703 -1156 -773 1161 1589 -387 -1546
4505 -1546 -34 1513 822 -1066 -1122 554 1250 116 -1768 -1127 1166 1083 -877 -1757 -134 1417 461
4522D61k110K69J966Q34k051r57J227J888p60j838l74J959J065j243j782O31J895
4539A080L76j575j310J443J759p02k221l5J941R56j370j845O78J769M2j407q20
4556a241J107J539p83j757j61J326J481j539j856J042J980j04k208p02J870J397
4572A391j174j675M68J983M67j585j209R13J759j30k108j39J514J171q29k059
4588a242P73J848j56j643n62J415R97r05j275q0J352P78j326o79r8J701N3j807
4606h56o41J302J288j278j301L07J761L47j533r29J344J167o07j133l7J191N10
4623I02q80m72J90J295k28r83k80P08O54j88j061K44Q29k01l87n35K57M44K85
4642E93m16m22J69M43m5q93n8N01L81m01m92K74M77k95l01k05K02O99l07k39j8
$$ plain form
4522 461 -1649 -1380 586 1420 -631 -1588 -361 1527 767 -1071 -1445 514 1579 336 -1446 -815 1080
4539 1080 1456 -119 -1429 14 1773 1071 -1150 -1185 756 1712 342 -1503 -825 944 986 -421 -1241
4556 -1241 -134 1405 622 -1135 -1296 30 1511 -28 -1884 -842 1138 1034 -1174 -1876 -6 1391
4572 1391 217 -1458 -990 993 1460 -125 -1334 -421 1338 1208 -900 -1039 475 1646 817 -1242
4588 -1242 -469 1379 1223 -420 -982 433 1430 525 -750 -830 522 1300 -26 -705 -803 898 951 -856
4606 -856 -1497 -195 1093 -185 -1486 -1179 582 929 -604 -1533 -189 978 371 -762 -799 392 902
4623 902 22 -450 -260 1035 807 -176 -456 252 906 718 -343 -99 730 529 142 -393 -136 308 593
4642 593 177 -245 -76 367 322 -571 -629 -128 253 -148 -640 -366 111 -184 -485 -690 -488 211 -96 -335 -353
4663c53N2L50J44l80o9L19L12M4n43L11M36l72q1q3J75K70m0j83j38K23J9K56
4685F69m13n35M02Jn9n74J45L72k60j22P4Q6j53J30l02L22o9k5J42k47n4r3P10
4708A47M6m69j18L27N22r2j36m90M83M05l79p01M02Q27K17r07o37P93Q48n58j108
4729e78L46Q54J59r04q20O68Q12j7j081n16R45Q75p28j095j01J845K39j441j077
4748a615R09J778o89j598O3J259J223j242j521Q20J806m0j614o41J285J442q36
4765G89j794J92J790P50j361j759J328J619o59j959L3J664P63j264j303L17J719
4782H65L32j758j235J168J777n73k208o4J976J223j825j389P72K063l00j727o68
4799a571J717J499j066j952K75K081M46j417j497J174J906j83k346m18J969J420
$$ plain form
4663 -353 -301 49 193 -187 -256 63 375 419 -124 187 623 251 170 87 262 532 492 309 171 394 413 669
4685 669 256 -279 123 124 65 -509 -364 8 -252 -374 -300 -214 -367 -237 -539 -217 -286 -311 -169 -416 -470 -563 147
4708 147 193 -276 -394 -67 455 363 227 -263 220 625 246 -455 -53 774 991 84 -553 240 1088 530 -578
4729 -578 -232 622 781 -123 -943 -275 537 520 -561 -1077 -132 743 15 -1080 -1181 664 903 -538 -1615
4748 -1615 -706 1072 383 -1215 -1152 107 1330 88 -1433 -613 1193 1153 -461 -1102 183 1625 789
4765 789 -1005 -813 977 1727 366 -1393 -65 1554 895 -1064 -1031 633 1396 132 -1171 -854 865
4782 865 1197 -561 -1796 -628 1149 576 -1632 -1696 280 1503 -322 -1711 -939 1124 824 -903 -1571
4799 -1571 146 1645 579 -1373 -1098 983 1429 12 -1485 -311 1595 1412 -934 -1352 617 2037
4815B037j552j868P22K255o2k082j130J626J576p97j834k79J850J043j809j531
4831a835O69K389K69k475q28J869J712j088k161Q2K164Q05j948j232J344J609
4847A345j98k115p45K295J541j675j986Q27K315k17k344n85J799J146q62j884
4863a343N41J506N04j082j740J011J578l40j252o96J224J321q58j589J52J634
4879E71L94j492r50J189J315o41j244m00J318O51n22j093R2J369K86r31j080J183
4897A5J089k62j445j01J378N01r74j025P59R41k15r88o66J031Q34m71j017p1P77
4916I0P35p10j217M89J125J94j065n53P67Q10n60p45oP31M83m20j066Q18Q30k52
4936D78o56q10J078O64p34k20j53J271J15j470J29L79Q52r96k69j5L73L00l33
$$ plain form
4815 2037 485 -1383 -661 1594 1532 -550 -1680 -54 1522 725 -1109 -1388 462 1505 -304 -1835
4831 -1835 -1166 1223 1492 -983 -1811 58 1770 682 -1479 -1397 767 1572 -376 -1608 -264 1345
4847 1345 1147 -968 -1713 582 2123 448 -1538 -711 1604 1387 -957 -1542 257 1403 541 -1343
4863 -1343 -802 704 1208 126 -1614 -603 975 635 -617 -1313 -89 1232 374 -1215 -1063 571
4879 571 965 -527 -1477 -288 1027 386 -858 -1258 60 711 189 -904 -812 557 843 -88 -1168 15
4897 15 1104 842 -603 -704 674 1175 201 -824 -65 876 661 -327 -993 38 872 401 -616 -687 90
4916 90 825 115 -1102 -613 512 706 -359 -912 -145 665 105 -640 -646 85 568 148 -918 -100 730 478
4936 478 -178 -988 90 754 20 -200 -353 918 1033 -437 -308 71 923 -73 -342 -357 16 316 -17
4955a7j13n14O50K93J46j065O71J070n82j273N33K70K61o81M4M29j82l41K37K28
4975F4j77j4K14k43J76nN1l22L75l9K3k74K06L80j38m60L09J40j02n17J03P53
4997E03o8p66k32L64P94k24n64j89J50O02k82m09J59N10K54p10n09J21Q48J41
5017D93j109R3P82N11q60o31M85R77q8j133M5M04R85l43j464J55J086L47o79r91
5037i35O86J247l02j168m51J232M31n75j181N53J065J74p27r63O13J503n71j291
5055f60m08J291J025j107j086L21J678k9j399q00R91J517o22j649j11J201J261
5072A414j147j672P78J581L99j859j102J640J413j108k047M43J916O77j740j169
5088a583J073J890l88j737p03J755J210j209j411L37J732O12j817j378J533J942
$$ plain form
4955 -17 -130 -644 6 299 445 -620 51 1121 539 -734 -201 69 330 -351 -307 122 -60 -401 -164 64
4975 64 -113 -127 87 -156 20 15 66 -256 119 80 103 -171 35 415 277 -183 126 266 164 -353 -250 503
4997 503 435 -331 -563 -199 595 371 -193 -382 -232 370 88 -321 -162 348 602 -108 -617 -496 352 493
5017 493 -616 -523 259 770 -90 -721 -236 741 653 -480 -435 -31 954 611 -853 -698 388 735 56 -935
5037 -935 -249 998 696 -472 -923 309 740 165 -1016 -463 602 776 49 -914 -301 1202 631 -660
5055 -660 -1068 223 1248 141 -945 -624 1054 1025 -374 -1174 -183 1334 712 -937 -1048 153 1414
5072 1414 267 -1405 -627 954 1353 -506 -1608 32 1445 337 -1710 -1267 649 1326 -414 -1583
5088 -1583 -510 1380 992 -745 -1448 307 1517 308 -1103 -766 966 1578 -239 -1617 -84 1858
5104A858q91k102l20K108J122j640j825R67J844o1j681j034J637J290n40k286
5120a554J28K073P25j816j295J327J799k80k383k02J685J195j088j550L92J500
5136F56M75j618r78J054J815qj956p88J834J598j778j419N00J853M01k178p21
5153a258J434J279o04j829j57J868P79j412j659J078J655o9k158o54J505J612
5169A410j039j697J56J767O62j825q92Q20J753j14k090k85J527J513j383j672
5185a389O51J812L36j519j154J274J527p30j621NJ741L69j215r84O96J216J66
5202A181j825o93J280J033o50j696K19J596L62j510o64J120J187j110q17K39Q70
5219A22L63r66l19L33J068l55o08m78P86P63m98o37J40Q31J09j040J25M88P23
$$ plain form
5104 1858 967 -1135 -1455 653 1775 135 -1690 -723 1121 1060 -621 -1655 -18 1272 732 -1554
5120 -1554 -1426 647 1372 -444 -1739 -412 1387 1107 -1276 -1478 207 1402 314 -1236 -844 656
5136 656 1131 -487 -1465 -411 1404 1396 -560 -1348 486 2084 306 -1113 -613 1240 1641 -537 -1258
5153 -1258 176 1455 851 -978 -1135 733 1512 100 -1559 -481 1174 1105 -1053 -1707 -202 1410
5169 1410 371 -1326 -1170 597 1259 -566 -1458 -638 1115 1001 -1089 -1374 153 1666 283 -1389
5185 -1389 -738 1074 1410 -109 -1263 11 1538 808 -813 -808 933 1302 87 -897 -201 1015 1181
5202 1181 -644 -1337 -57 976 326 -1370 -1151 445 807 -703 -1367 -247 940 -170 -987 -748 122
5219 122 485 -481 -800 -467 601 246 -362 -840 -54 709 211 -426 -286 545 654 -386 -261 227 950
5238I50l46q10K31M51k71m5q2j19K88J22m03k14J77L30l33j24m8r6J44Lk7JM3
5261a78k71P2L28m49m5N62J58m39j00K62M51l91J30j71K87J54M3k14k58L15K07
5282D53l47NP4N46m4m80m79N12K55k65n13L20J64K89o91j93J58K02K29m60k62
5303e27L65P2O0m74LK44L55n32j63K83L76L31k74p14K98N82J88m49n11L59R52
5324H24j02r36j28J036M03q15p94L73J265k15j103k47O60M68n71r86l5J433M12
5343I42q85j143N66J341m90j167n37J239J011r72j149N49J138K53j253o01P82
5360c76J255k00j299l70J389P47n43j680J84K322j51j792p64J647J300p00j985
5377a016K53J787M67j616j218J081J500j95j619r09J466J476j282j785P33J844
$$ plain form
5238 950 604 -206 25 476 205 160 78 -41 247 369 -34 -248 -71 259 -74 -198 -246 -342 -198 -195 -222 -221 -178
5261 -178 -449 -377 -49 -498 -543 19 177 -262 -362 -100 351 -40 90 -81 206 360 403 189 -69 246 453
5282 453 106 111 185 731 687 207 -272 240 495 230 -283 37 201 490 -201 -394 -236 -34 195 -265 -527
5303 -527 -162 -90 -30 -504 -501 -257 98 -434 -597 -314 62 393 119 -595 -297 285 473 24 -487 -128 824
5324 824 722 -214 -342 694 1097 282 -512 -139 1126 911 -192 -439 221 689 118 -868 -903 530 942
5343 942 57 -1086 -520 821 331 -836 -1373 -134 877 -95 -1244 -695 443 696 -557 -1158 -376
5360 -376 879 679 -620 -990 399 1146 603 -1077 -893 1429 1278 -514 -1278 369 1669 969 -1016
5377 -1016 -763 1024 1491 -125 -1343 -262 1238 1043 -576 -1485 -19 1457 175 -1610 -877 967
5393I67R0j548j309J140J978j114j668J20J418R33j022j503M04K548j42k108q25
5410a641J775J358k53k233k19K253R62k000j194J132J798o01j618o29J545J164
5426A599r58k055O97J347P67j636j585J260K105q40k082K2J835R73j549j809Q02
5443a107K206j92j610n91J153J246n78k016L86J757R98j672j538J295J732m88
5459I81j626o07J799R58j110j175N64J388M8j160j116J091J217n11j458k29J159
5476B13R92j028j552N77J701m58r88r49J191J052m75j043m98J645K86j057l69
5493g60P6J344K86j362p42J034J307q32j009P5J061P50j178r03J190P93l96q79
5511a45l55P21Q25o98q51j39J329J39p99q67L21J338m06j112o6J007M8n85j11
$$ plain form
5393 967 1057 -491 -1800 -660 1318 204 -1464 -1344 74 1007 -15 -1518 -1114 1434 1292 -816 -1641
5410 -1641 134 1492 1239 -994 -1213 1040 2002 2 -1192 -60 1738 1137 -481 -1110 435 1599
5426 1599 641 -1414 -717 630 1397 -239 -1824 -564 1541 701 -1381 -1359 476 1449 -100 -1909 -1107
5443 -1107 1099 907 -703 -1294 -141 1105 527 -1489 -1103 654 1652 -20 -1558 -263 1469 981
5459 981 -645 -1252 547 1505 395 -780 -216 1172 1220 60 -1056 35 1252 741 -717 -946 213
5476 213 1205 177 -1375 -798 903 445 -543 -1492 -301 751 276 -767 -1265 380 666 -391 -760
5493 -760 -684 660 946 -416 -1158 -124 1183 351 -658 -583 478 1228 50 -853 337 1130 734 -145
5511 -145 -500 221 1046 348 -503 -642 687 826 27 -840 -519 819 413 -699 -765 242 290 -295 -406
5530d06k94Q91K25r11k49Q32J90k06o22l29J079O63j034n38Q17N56o55m04K27
5549a68L62N54p27j54K74K66k49L09m06j23L48n3n01K19O02m64k34j35L78L4k63
5570a31j80K80L30n63j79N60j43J01l59l12M89M07q20L19M17p3l7k73k69O47M10
5591F21o20n65R01L38n78o02J43R16L09j016m85R26M03m84q01pR15L57n72q52
5611g53M85Q04O3r25m96J039Q11p20j038l7J455k61q41m85N46J330p36r42j86
5630h87R20N46l36r34K72J090L69j284q23J013J177r83q85j20J160Q23j059j109
5648a050J013Q91k93j080k46O81J076l52j588L3J166Q03j225q59N32J305l0j589
5666h12k20J327N35o18q50k89J199O69q71j041N82J267k01j160p76J544R22q91
$$ plain form
5530 -406 -700 191 416 -495 -744 88 278 72 -550 -879 200 863 -171 -709 108 664 9 -395 -168
5549 -168 194 748 21 -133 141 407 158 467 61 -62 286 233 -268 -49 553 89 -145 -280 98 132 -131
5570 -131 -311 -31 299 -264 -443 117 -26 75 -284 -596 -107 300 -520 -201 216 143 106 -167 -436 211 621
5591 621 1 -564 337 675 97 -505 -362 554 863 -153 -638 288 691 207 -594 -601 314 671 99 -753
5611 -753 -268 536 599 -326 -822 217 1028 308 -730 -767 688 427 -414 -899 -353 977 241 -701 -887
5630 -887 33 579 243 -691 -419 671 1040 -244 -1067 -54 1123 140 -745 -865 295 1118 59 -1050
5648 -1050 -37 854 561 -519 -765 -84 992 640 -948 -915 251 1054 -171 -1030 -498 807 777 -812
5666 -812 -1032 295 830 212 -638 -927 272 941 70 -971 -389 878 677 -483 -1259 285 1207 316
5684C16j659R06J366P6j273q06Q30J325m98j470J23J038Q28r19j523M09J917R3
5702A079j463j110J529J233r21j334o8J818O65j822q89Q91J414J11j493j078J337
5719a01J718j056j712L32J619N42j497j375J222J537m28k000K86J372M47p18j460
5736a272O43J235L03j413n36Q54J352n63j500l42J800O97j314j031P66J464p8
5753A065j376q54J272J107m88j607P7J347O83r88j495R26J319j03j534p18J633
5770B66Q82p28j627L87J832k60j143o66N01J540m68j548N2J217Q16j131j003N56
5788e25J141N23j609n34J171R17o61j478M38R66Q07r55j183P31J254l06j121j39
5806e63P96P89n99j141J3J390k7j088k10M63Q14l14j210P19M84K3n14m54J24Q13
$$ plain form
5684 316 -1343 -437 929 1005 -268 -1074 -244 1081 583 -887 -764 274 1102 183 -1340 -931 986 1079
5702 1079 -384 -1494 35 1268 347 -987 -1055 763 1428 -394 -1283 -392 1022 1133 -360 -1438 -101
5719 -101 1617 561 -1151 -819 800 1342 -155 -1530 -308 1229 801 -1199 -913 459 906 188 -1272
5736 -1272 -629 606 909 -504 -1040 -186 1166 603 -897 -1239 561 1258 -56 -1087 -321 1143 1065
5753 1065 -311 -1165 107 1214 726 -881 -804 543 1226 238 -1257 -331 988 885 -649 -1367 266
5770 266 1148 420 -1207 -820 1012 752 -391 -1057 -556 984 516 -1032 -980 237 1053 -78 -1081 -525
5788 -525 616 1139 -470 -1004 167 1084 423 -1055 -617 349 1156 201 -982 -251 1003 697 -424 -563
5806 -563 233 1022 423 -718 -705 685 658 -430 -640 -177 637 323 -887 -168 316 339 -175 -629 -505 308
5826C08J31o28o27Q26M86n07n91J51Q09K01n61l48M88L45j6n59L35J08N3p3m19
5847h8N5K90J26j25m03Q7M02j70l19K27J81l42J17j43k42O1J16K76j54j82k30
5868d60N32j02k85J49n9L30k36j59J38J83L4p5J2l30N21J9K77m38K9J89J88l45
5890A12q0J20J92rl06K7M0J47k40N5n0nL52l75n08K54L06L53p45m24O84L43j23
5913A20q21m4J017J18o36l71K04P01k1n13m66N82J073o26p05n5J170J82r79l61
5933d31O87P20k40r81k37P35J022j123r03K66J302Q0j283q09R97J166n76j197
5951h05j04J489K97j404o72P05J213k59j225l20J024R16o29j369L00J581M1j029
5969b50j064J079J352m15j454k89J386J073r36j452P88J262j42r62r58Q72J324
$$ plain form
5826 308 439 -189 -816 10 496 -11 -602 -451 358 559 -2 -350 138 483 467 -92 243 351 404 331 -88
5847 -88 -33 257 383 258 -145 -58 344 174 -145 82 263 -79 38 -105 -347 -286 -170 106 -48 -230 -460
5868 -460 72 -30 -315 -166 -225 105 -131 -290 -152 31 65 -10 2 -328 193 212 489 51 80 269 457 112
5890 112 32 152 344 335 29 56 96 243 3 58 8 3 355 -20 -528 -274 32 385 -360 -784 -100 243 120
5913 120 -701 -745 272 390 -246 -617 -413 288 267 -246 -712 -130 943 317 -388 -443 727 909 -70 -431
5933 -431 256 976 736 -245 -482 253 1275 152 -751 -485 817 897 -386 -1195 -198 968 392 -805
5951 -805 -909 580 877 -527 -1199 -494 719 460 -765 -1085 -61 855 226 -1143 -843 738 779 -250
5969 -250 -1314 -235 1117 702 -752 -1041 345 1418 482 -970 -182 1080 938 -24 -982 -110 1214
5986A214l95j152l24J102Q09j261j465J157J143J42j616o09J248Q51o88j242n3
6003a139J472L99j060n30p4J594j19j170n97J354J123o90j437K52J303M40j407
6020b86o97Q70J272k53j424JJ015O36p63j244N18J342L88j422j022R74J179m99
6038E85j312j68J498K95r60j018N58J361k34j349p34J317R00m75j375L99J139
6055D27N45j347r49R37J321m67r53l25J515M30q56j082M38J102K62r13q48O93
6073g0R88j24j221J43Q31L36o79r90M01J228j94j232k14Q66O22o41n57k99R84
6092A78J39m17q78N72Q10lr99l62J052N16o67o46L42N24O38r08l18K82Q48m01
6112C02m16k64P35L72m93p04P8R07J16o14m76M85L86p8p61P2N45P8j49q01K71
$$ plain form
5986 1214 819 -333 -657 445 1254 -7 -1472 -315 828 970 -646 -1255 -7 844 156 -1086 -1139
6003 -1139 333 732 -328 -858 -932 662 543 -627 -1224 130 1253 563 -874 -622 681 1121 -286
6020 -286 -983 -113 1159 906 -518 -517 498 1134 371 -873 -355 987 1375 -47 -1069 -95 1084 585
6038 585 -727 -895 603 898 -62 -1080 -522 839 605 -744 -1478 -161 739 264 -1111 -712 427
6055 427 972 -375 -1324 -387 934 467 -486 -811 704 1134 278 -804 -366 736 998 85 -763 -70
6073 -70 918 794 -427 -284 547 883 204 -786 -385 843 649 -583 -797 69 691 50 -507 -806 178
6092 178 317 -100 -978 -406 404 401 -598 -960 92 608 -59 -705 -363 161 799 -109 -427 -145 703 302
6112 302 -114 -378 357 729 236 -468 -390 517 633 19 -457 28 414 336 -425 -353 192 270 121 -680 -409
6133d09O19P2m40m10M64L33j42o14k07O94M04o29k23N69L35k66m90K15K55m5j72
6154h7j41N06j25K62l75o1J50RM6m30K83L26k48j56Q4M51l02k29j26K15K53l74
6176f9n4J35k36K11l41Q4J75K2j33o0L21P3j24k76n1N42j39j80l52L47M70k54
6198A11m04L42K80K77n52k47O5P82r9j159M32K78L67l68m34J57O64j66q30k55
6218g59O28Q32o60r47L90Q94L16j113l4Q0P72j91p69j19M28P85l89p44K55Q10
6238D65Qr10j96P10O04j35r26k74J123K80q28n53O34R38k17q31o90Q21J078p87
6258C14q71k6J085M24j203p49Q28Q65l17r02k72R49M57m34r20K96J039K08j081
6277c10o46P88J084j09j601l7J119O21r93r03O45Q74K27j242m29P79J017l69j079
$$ plain form
6133 -409 210 282 -158 -568 -104 229 87 -527 -734 -40 364 -265 -488 81 416 150 -340 -125 130 85 -87
6154 -87 -228 278 153 415 40 -21 129 138 184 -246 37 363 115 -41 43 494 192 -37 -163 52 305 -69
6176 -69 -123 12 -224 -13 -354 -270 -95 -73 -206 -266 55 128 4 -272 -323 219 80 -100 -452 -105 365 111
6198 111 -293 49 329 606 54 -193 -128 654 555 -604 -172 106 473 105 -329 -172 492 326 -504 -759
6218 -759 -131 701 41 -906 -516 378 694 -419 -453 -373 399 208 -561 -680 -252 533 144 -600 -345 465
6238 465 473 -437 -633 77 681 546 -380 -654 469 749 -79 -632 2 940 723 -108 -798 23 1101 314
6258 314 -557 -583 502 926 -277 -1026 -198 667 350 -552 -824 125 582 148 -772 -476 563 771 -310
6277 -310 -956 -168 916 807 -794 -831 288 909 -84 -987 -342 532 759 -483 -912 -133 884 515 -564
6296e64l5R61O31j108q92O70J132o5j319l32J262Q18j169r16L49J038N02j398
6314d35m16O21J063k32r62n78J257N45n43j145M91R89O6j179l64N48J186n73q53
6333e14l69J238L64o08r62M67J084N6j016p41J159Q57o22j279K07J069N77j068
6351a01p51M89Q74j39r22m40J180O61m17j124m5J153L80r20o95M65J347k25j447
6370f77j78J187O10j095p56P63P17r1p81l87Q18M54m28p82j29J100K84q10p04
6389h85P01Q80l12n94o33Q22N15r8p51qP32K16p85m94Q02N87l93p75J30N68K97
6410E22k66p81K24P19nq91R7M08M02l28m63K27L52j1q4j69l0J92K28p02Q0Q6J00
6433i3J44j07k93O15k39l7P5j77K01j95J50k43M35j8k68J14j32J09K54k87j2q0
$$ plain form
6296 -564 -599 362 993 -115 -1007 -337 795 730 -589 -921 341 1159 -10 -926 -577 461 963 -435
6314 -435 -851 -230 833 601 -361 -939 318 863 320 -825 -334 655 721 -458 -822 -274 912 339 -514
6333 -514 -883 355 719 111 -851 -384 700 756 -260 -1001 158 1015 393 -886 -679 390 967 -101
6351 -101 -852 -363 511 372 -550 -990 190 851 434 -690 -735 418 798 -122 -817 -352 995 770 -677
6370 -677 -855 332 942 -153 -909 -146 571 480 -301 -688 130 584 156 -626 -755 345 629 -181 -885
6389 -885 -184 696 384 -210 -843 -21 494 396 -355 -363 369 585 -200 -694 108 695 302 -473 -343 225 522
6410 522 256 -525 -301 418 413 -478 -381 27 429 101 -362 -135 217 206 122 -47 -77 115 343 -359 -279 -193 -93
6433 -93 51 -56 -349 266 27 -10 65 -112 89 -106 44 -199 236 218 -50 64 -68 41 295 8 -4 -84
6455h4K03l4j24J46q1O8Q4J37k04k28J67J35l38j69p9M78K83o71L17k6m7O4k72
6478b75J71K5k1P2j11J78j25P7J4m56L77M06l32k52j04L33J64J25k35j88K53j27
6500c1K45k55q6J85M4Q4j59l42P39J9o32K8J25J20L6l67j87O04P5k65l96k32R19
6523B71L32q72l79M58N45J36r89nO71J97o12l45O24P16m27n17l76Q83L05l80o58
6544d22j1J059J96r64o66O36J103o00q15m0P89M36o88o16J64R46j36r24l00R69
6564A16L62n31o61J8J159O3r21n57N45J075o2j289j3J076M49q20p75L54J264j33
6584G19j164J49N61M07o1j180J11P51P35q75q53L32J050o0j043j42N46O03l28
6603B58j082J43J006L61r37p98O36R37j03r64k54Q30O06o08r19J66J406l45r28
$$ plain form
6455 -84 119 85 -39 107 26 94 178 315 111 -117 50 185 -153 -322 -401 77 360 -311 6 -20 -67 -3 -275
6478 -275 -104 -79 -100 -28 -139 39 -86 -9 5 -451 -74 332 0 -252 -356 -23 141 266 31 -157 96 -31
6500 -31 214 -41 -127 58 102 186 27 -315 424 443 -189 -161 -36 84 120 -247 -434 170 245 -20 -416 -648 271
6523 271 603 -269 -648 -190 355 491 -498 -503 168 365 -247 -592 32 748 321 -196 -572 311 616 236 -422
6544 -422 -433 626 822 -142 -808 -172 931 331 -484 -524 265 701 13 -603 -439 507 371 -553 -853 116
6564 116 478 -53 -714 -696 463 526 -395 -952 -407 668 606 -683 -696 380 829 9 -766 -412 852 719
6584 719 -445 -296 265 672 611 -569 -458 293 1028 153 -700 -368 682 622 -421 -563 -17 586 258
6603 258 -824 -681 325 686 -251 -1049 -413 524 421 -543 -797 33 639 31 -888 -722 684 339 -589
6622e89O6N34N97j48p30n58R88M62j71j054L36J037J47j142k13O94Q52p60p91
6641d43J13Q47R1p77o17N24Q12k03r31q7M28N60q6p81J66O68K55r87k17K58Q73
6662D66l76q58L26O79R4m07m54J34J038R6r17l38L57O68P4p61j92P41M68p99o60
6683f21M68O60q9p18k04L19Q19m74n05R6L75K78n80l72L58M77j01n17m84J023
6703B08R0m92k41L58L25p9k29k21L03Q9J59l39k39L03J69J75o13K07N28k54J9
6724B26l26J48K04J25m03kK40m8%m21Q8L33J40m33M2k4K38j18m41K02K16K62o17
6747c69N9J15L23l14L1L95m44K2K5j81L22N0O2j75J46k02K00J8J22k98K71k78
6769a00J51J64Jk05j41L22K7k86j00L46L2l17j45j7L32J54j54l84K70p2L4k20
$$ plain form
6622 -589 -523 11 608 460 -270 -828 160 622 451 -603 -267 770 917 -225 -438 256 1108 348 -443
6641 -443 -330 517 608 -169 -786 -262 550 347 -584 -671 -243 317 231 -550 -384 284 539 -448 -665 -407 466
6662 466 90 -768 -442 237 331 -76 -530 -396 642 738 -179 -517 -160 508 582 -179 -371 370 838 39 -621
6683 -621 -153 507 418 -300 -504 -185 634 160 -345 -249 126 404 -176 -548 -190 287 186 -331 -815 208
6703 208 298 -194 -435 -77 248 169 -60 -281 22 111 270 -69 -308 -5 164 339 -274 -67 461 207 226
6724 226 -100 48 252 377 -26 -28 212 164 164 -257 -169 164 304 -129 -87 -111 127 9 -432 -230 -14 248 -369
6747 -369 -310 -195 128 -186 -155 240 -204 -182 -157 -338 -16 34 96 -79 67 -135 65 83 205 -93 178 -100
6769 -100 51 215 216 11 -130 192 219 -67 -167 179 211 -106 -251 -268 64 218 64 -320 -50 -122 -88 -308
6791c08m1M03Q7k27k63k07O88L10o38k80L90K67J73m64k48N35J91k22n22J11N20
6812B55l5j60l04J53M18K2n86k13N83L70m60m22L42N34l61l95r5L53M52k95n48
6833c92K37M25P1k57n24l8R20J41r41k57Q21O8l48j12k54N79J87m04m64L05L62
6854A25J40O5q19M44N97o4r30P0P74O9o53l78N41N27p7p61j63Q28PO1j013L12
6876b98O90J90o45p55P00O40Qr21n09R09O88o93o48N05O02j3n90n17M74P27or48
6898d10k68J063K99n01o77J86R66K1j059k44R25M65p18m34J09N84K06n19m97N80
6918G7L46k42m84j96M75M99n03o59M99N09J40q28j05O55N25p43m10l8O36J45k58
6939D0k97J01M85J52r88K12M10M37l81l58k47R64m3p26k83N43M82k39l54l68P08
$$ plain form
6791 -308 -349 54 141 -86 -349 -556 132 442 -196 -476 -86 181 354 -110 -358 177 368 146 -376 -265 255
6812 255 220 60 -244 -91 327 349 -237 -450 133 503 43 -379 -37 497 136 -259 -354 -1 451 156 -392
6833 -392 -155 270 341 84 -440 -478 442 583 -358 -615 206 274 -74 -186 -440 139 326 -78 -542 -237 125
6854 125 265 330 -489 -45 552 488 -442 -372 402 471 -182 -560 -19 508 431 -330 -493 335 342 403 -610 -298
6876 -298 392 582 -63 -818 -118 522 530 -391 -900 9 697 4 -644 -139 463 450 -140 -657 -183 544 538 -410
6898 -410 -678 385 684 183 -494 -308 658 679 -380 -624 301 766 48 -386 -277 307 513 -6 -503 77
6918 77 423 181 -303 -499 -24 475 -28 -687 -188 321 461 -367 -472 183 708 -35 -445 -483 153 298 40
6939 40 -257 -156 329 481 -507 -295 115 552 171 -187 -434 530 487 -239 -522 21 503 264 -90 -458 250
6960B50M64n68n32mO11L40p66j38K06N54kq71K98P60k68k08m70K73N55j76o22
6981c14K30O3N33m09k91k07N38L60o58j50K2N91k05k61o1O17j05l48j45p1M01
7002A30J14j45l60M63rj32l37L50K2J02k3o09K30L82J87l79k72K56L25k97j2j41
7024a55J62L26k96k52J75J07q8l2k8j70M29m21L57L8r7j79l24M15K1K7PK60r6
7047A86k79J42J59k36L7o4j02L49k62l1J50L4K1n4n8j42K90l2j21q9K81n8L6m77
7071c20L23J8J01k63M6m4LP1K78r4l9k52P7k43Q8M65r7o3r0l28M78k5r8j34J64
7096B2R3q2J30m25L81Q9j28m44R8L09K46m47oJ86K18m3m42J01K72J62k53k41R4
7119a10K59mm16p0J82K01J12k56k02J90N02l00m82M27J75J21m63k20K51L98m05
$$ plain form
6960 250 714 146 -386 -390 221 561 -205 -343 -137 417 415 -456 -158 602 334 126 -344 -71 484 308 -314
6981 -314 -84 -21 512 103 -188 -395 143 503 -155 -305 -283 308 103 -158 -219 398 293 -55 -200 -271 130
7002 130 244 99 -261 202 193 61 -276 74 96 198 175 -434 -204 178 365 -14 -286 -30 295 -2 -14 -155
7024 -155 7 333 37 -215 -40 67 -21 -53 -81 -251 178 -243 114 152 55 -124 -448 -33 -12 15 22 282 186
7047 186 -93 49 208 -28 9 -55 -157 192 -70 -101 49 83 104 50 -8 -150 140 108 -13 -102 179 121 157 -320
7071 -320 3 21 122 -141 -95 -139 -136 -65 213 119 80 -172 -95 -338 -250 215 118 55 -35 -363 115 90 -8 -142 22
7096 22 115 33 163 -262 119 208 80 -364 -266 43 289 -158 -164 22 240 197 -245 -144 128 290 37 -204 -110
7119 -110 149 145 -271 -341 -159 42 154 -102 -304 -114 388 88 -394 33 208 329 -134 -354 -103 295 -110
7140a10j85j2M20J72j76o44L64P13l04l32k82M98L70j59o23J93N04qo39j45K98
7161h7N29k11n45p4N37J04J42o30K7M60J15o72j89L94L45k02l95K35m0N79o14
7182a92j73L44K55k1m28MJ07O91k78m95k04N35M02o61N1k0N01N4p71L03L38j23
7204B19j91m11K87N94j82l88l38L30L97k52l71J7N86J44o09l15L32M41%o35r1
7225d36N48Q2k46j62k17O70J20O2q46J27L97M12p39m41P13L90l66l47J21M66o1
7246B47q1m75L57M48k09m81n1L24L5n2m87J67L07J03m98k0K65K98n3o33K98L05
7268A14O8l70O4M9J66J69l14k65N52J98m25j31m2M96rm06l18M60L13M4l71j31
7290h9L90J6l82Rj11M87L8k61j21j07K46J74o81M6L87O2l8k16J34j51L70j06k66
$$ plain form
7140 -110 -295 -307 113 285 109 -535 -171 542 238 -94 -376 122 492 333 -290 -97 407 399 -240 -385 -87
7161 -87 442 231 -314 -388 149 253 395 -235 -208 252 367 -305 -494 -100 245 43 -352 -117 -157 422 -192
7182 -192 -365 -21 234 213 -215 -211 -104 587 309 -186 -390 145 547 -114 -63 -83 418 472 -299 4 342 219
7204 219 28 -383 -96 498 316 -72 -410 -80 317 65 -306 -289 297 441 -168 -483 -151 290 290 -345 -436
7225 -436 112 194 -52 -214 -431 239 359 421 -425 -298 99 511 -228 -669 44 434 68 -279 -158 308 247
7246 247 166 -309 48 496 287 -194 -245 79 114 62 -425 -258 49 152 -346 -366 -101 197 144 -489 -191 114
7268 114 182 -188 -124 -75 91 260 -54 -319 233 431 6 -125 -167 329 320 -86 -404 56 369 413 42 -89
7290 -89 301 317 -65 -56 -167 320 358 97 -24 -131 115 289 -392 -346 41 103 65 -151 -17 -168 202 96 -170
7313a70L4M68l55k02K4L18j31j37KJ29K91k23Mj08K60j69k84L5M17O8N8l92L2
7336c1K06K45j60l48q0L7N25k80j66J63k49K81ql98L1p9K20L0J74j91k0NJ29Q4
7360A20k23J59J21j86Q4k7R1K74j24l72L1o2J47K51k16n6L32j82j71J71N0m2J18
7383B88m74K38N8J84o1m37L98q5r3l6o7P5L00k25k71j41K02J43k66l68P01L36
7405C99k58l52m7L42j03K5m01L32L58J8l95k26L40K74L3n24j5L81P4k96j58M72
7427B73J46L3n22MK85k20J14l63J28K51M3m51q0K42R9K10n43K10J08K86k76k71
7449b94J76L88j08l14j43J77K73j7k34k96N76M6j42l44k4O52n6n97m0L67M75k47
7471B74o52L45K20o5l50K8p0K93M14o46j66J79N54k71m10N9L35J20m17R1j04M91
$$ plain form
7313 -170 -136 332 -23 -225 -201 117 -14 -151 -149 -20 271 48 52 -56 204 35 -249 -214 203 271 329 -63 -31
7336 -31 175 420 260 -88 -168 -131 394 114 -52 111 -138 143 135 -263 -232 -311 -91 -61 113 -78 -98 -93 36 120
7360 120 -103 56 177 -9 75 48 139 413 289 -83 -52 -114 33 284 68 12 344 162 -9 162 212 170 288
7383 288 -186 52 110 294 233 -204 194 109 16 -20 -87 -12 288 63 -208 -349 -147 -4 -270 -638 63 399
7405 399 141 -211 -258 84 -19 6 -395 -63 295 313 -82 -308 32 306 339 -185 -200 181 255 -41 -199 273
7427 273 419 452 -70 -66 219 -1 113 -250 -122 129 172 -279 -359 -117 -18 192 -351 -141 -33 253 -23 -294
7449 -294 -118 270 162 -152 -295 -118 155 138 -96 -392 184 230 88 -256 -280 372 316 -281 -321 46 521 274
7471 274 -378 -33 187 122 -228 -200 -270 23 437 -209 -375 -196 358 87 -323 -264 71 191 -226 -135 -239 252
7493B52n4n00m0L65M61l93l47j90O43O2k46n15N30M87j96o12K13L54J10n24k57
7514c97L80N38k47m52k20P37j30L9p19K02N01J8j83n26J83N24j2n45NJ78L99l11
7536c8o45L27M46J50n83n5N68J51j97l41n0O10j99j73m10J72P52Mn46j23M07J81
7558D08k86o27M67J61K16j98o52M75L70j37l95o9L03K05J6o98N00J38k30k16J05
7579a44L66l27l7L0PM40r9j41m82K31M87j96k39k82M96M10n85l62K10P63k56l19
7601b9j67O4P9J11l14J88K23o0j18j70K03J00J33l75j29K78L5Q3m38J82M8j4K61
7624A74j06j86J49L7J28k44q9K04K39l78j09J73Q4k34K25j94K16j65K33j92j42
7645a77j35J89J80j54K69k94Q0m4o2j09N9N14l47P9K2j71M54m85o4J50L62k16
$$ plain form
7493 252 198 -302 -342 23 484 91 -256 -446 197 259 13 -502 28 515 319 -293 -80 274 384 -140 -397
7514 -397 -17 521 274 -178 -398 339 209 248 -471 -269 232 250 67 -459 -276 248 236 -309 -304 -126 273 -38
7536 -38 -683 -356 90 240 -343 -398 170 321 124 -217 -267 343 144 -29 -439 -267 485 489 -57 -180 227 408
7558 408 122 -505 -38 123 339 141 -511 -36 334 197 -198 -267 36 241 257 -441 59 197 -33 -249 -144
7579 -144 222 -105 -142 -112 -105 335 236 95 -387 -156 331 135 -104 -386 110 520 -65 -427 -217 546 290 -29
7601 -29 -196 -132 -53 58 -256 -68 155 95 -23 -193 10 110 243 -132 -261 17 52 135 -303 -121 -73 -87 174
7624 174 68 -118 31 68 196 -48 -137 67 306 -72 -181 -8 76 -158 67 -127 89 -76 157 -35 -177
7645 -177 -312 -123 57 -97 172 -122 -42 -86 -148 -257 -198 316 -31 48 70 -101 353 -132 -196 -46 316 100
7667A00r4k39M38k35j50k0J22K76N9j16k48R0J4M6n4k86L33l8J48k08q0N1Q8k49
7691b52k2K61K6P7m6l49P2K49J63Ml12J9J31K5l25J65K96q1l26J38K68J35k35
7714H1K5J18n1J2l96RK59Q3l7k59j46L21K57k48m29P4O47P3o17L3j91N68j83o55
7738f52N19K86K24o79J41L52M03l40m36j33M39M18l98l52RM62K33p44m9J58N88
7759D49l66m78J62L29N6j76q9j86L58r9p2o5J84M07l11o71L22K68K65l51o40M30
7781b74P20m46j55j70M68K18j82n73j54O81J58m07k70L75L84K5m87k29L44M51
7801D77m36m05L03K86l5k12l46M62L69k08n70Q5L00K80m07p7j08L19K24m85q3
7822b67K41J02n4m48J88N38K57n74m52K25L22J92m70k12L11N45k76m67J69K06
$$ plain form
7667 100 6 -233 205 -30 -180 -200 -78 198 257 141 -107 -17 -3 43 -11 -297 36 -2 146 -62 -142 -91 -3 -252
7691 -252 -274 -13 13 90 44 -305 -233 16 179 183 -129 -110 21 46 -279 -114 182 101 -225 -87 181 316 81
7714 81 106 224 173 185 -211 -202 57 140 103 -156 -302 19 276 28 -401 -327 320 393 -224 -191 -382 186 3 -652
7738 -652 -133 153 377 -302 -161 191 594 254 -182 -315 124 542 144 -208 -199 263 496 -248 -297 -139 449
7759 449 83 -395 -233 96 152 -24 -113 -299 59 -40 -112 -177 7 414 103 -568 -246 22 287 -64 -704 -274
7781 -274 446 0 -155 -325 143 361 179 -394 -548 133 291 -116 -386 -11 373 398 -89 -318 26 477
7801 477 41 -364 -61 225 190 -22 -368 94 463 255 -315 -230 70 350 -57 -134 -242 77 301 -184 -267
7822 -267 -26 76 22 -426 -238 300 557 -17 -469 -244 78 270 -200 -412 -101 444 168 -299 -130 76
7842G6J68m32k29K66L00k71N2m1J66J91k80k28J83L37k26J33o19M53L63j46o36
7863d20J50P0L46j08j56j19M63Q4l75j84K73J06Nm12qJ90K90j79l39K42K38L3
7885A90m26j1N02j69j1N3j02K32j11ql30L79lj75J53k57l4L84m53J63k6J25n1
7908A4l6k33L25J8J23k32j72O5J20p8r2l0J40L19k85k57L54J77k54j80J44K27
7930A77j75P7n7J17l05K27j42J87q0r2K90rj09r3n2K74pl86K7K8J66N3j24p0Q5
7955Gj71p2P5M6J01n4k19J64M7j41L06l44J98L4J35N0m58J87m6K72P6k85lL78
7979B83k75j79r7M06n5kj20N8j2J73k82j58p1N26j74k7l62M90K01k29l49P2L98
8002B15l40o7j80L09Q5j55l38M09j15J51l5o5J65K94l43k22P4J36N54n81p1QL87
$$ plain form
7842 76 244 -188 -417 -151 149 -122 -70 -111 55 246 -34 -262 -79 258 32 165 -454 -1 362 216 -420
7863 -420 -270 -200 146 38 -118 -237 226 310 -65 -249 24 130 135 -277 -285 -95 195 16 -323 -81 157 190
7885 190 -236 -247 255 86 75 128 26 258 147 139 -191 188 185 10 163 -94 -128 256 -197 -34 -60 65 14
7908 14 -22 -255 70 88 211 -21 -193 -128 -8 -86 -178 -208 -68 251 -34 -291 63 240 -14 -194 -50 177
7930 177 2 79 22 139 -166 61 -81 106 26 -66 224 215 106 13 -39 235 228 -158 -131 -103 63 116 -8 -78 7
7955 7 -164 -236 -161 -115 -14 -68 -287 -123 -76 -217 89 -255 -57 -23 112 162 -296 -109 -155 117 193 -92 -95 283
7979 283 8 -171 -268 138 83 81 -39 19 7 180 -102 -260 -331 195 21 -6 -368 122 323 94 -255 -183 215
8002 215 -125 -192 -372 -63 22 -133 -471 -62 -177 -26 -61 -126 39 333 -10 -232 -158 -22 532 -49 -120 -112 275
8025B75r5j85j21K91J76j70o6n35M99J83l1l77K05K19j1m94p6K86K91m11l75N2
8047d70P28rl44m00N28J06j63j25k37N18N7r3m63L03M66r4m63p2L33L31j50n05
8069b18L07K8J43k91j64lQ54k19p95K28K32L59l85k52M9M86l8n54j37K50M56l89
8091e3k75j32N38J74k73l18N88n0lk44m79M97M01L1m36l41N38J46l74k12j0O39
8113C52k03r6l10K50K64J3m98q4P16n9l70k24P5K87J59o12Q5M52J57n91k85L08
8135b14J93r8l4m6J78L44n28l5J83K6J27j66l26J93M79k78k50j86M49K70m0m42
8157b01J21K81pj15l87J37N06r3m08j83M38P3j77k10j41P68q4m50j83L28J44j12
8179D5l35Q8J94J38m3m74K68j27L26j03k55R9
$$ plain form
8025 275 180 -5 -126 165 341 171 105 -430 69 252 221 -156 49 268 257 -237 -313 -27 264 -147 -522 -470
8047 -470 258 249 -95 -495 33 139 -24 -149 -386 132 189 96 -367 -64 402 308 -155 -227 106 437 287 -218
8069 -218 89 117 260 -31 -195 -198 656 437 -358 -130 102 461 76 -176 -127 359 321 -233 -370 -120 336 -53
8091 -53 -328 -460 78 252 -21 -339 249 199 196 -48 -527 -30 371 402 -34 -375 163 309 -65 -277 -287 352
8113 352 149 53 -257 -7 257 270 -228 -312 404 345 -25 -249 -174 113 272 -340 -255 197 354 -237 -522 -214
8135 -214 -21 -119 -153 -199 -21 323 -205 -240 -57 -31 96 -70 -396 -203 276 -2 -252 -438 11 281 241 -201
8157 -201 -80 201 194 79 -308 -171 335 242 -166 -349 89 162 -15 -225 -366 402 318 -132 -315 13 157 45
8179 45 -290 -202 -8 130 87 -387 -119 -246 80 -23 -278 -179
8191a79
$$ Imaginary data points
##PAGE= N=2
##DATA TABLE= (X++(I..I)), XYDATA
0@%%%%%%%QrJqJ6j7K5m0M9n7P2q9J09j32J58j88K23k63L09l59M15m80N54o36P27
32C88q28R38j062J200j352J518j701J900k115K353k618K906l213L552l927M332
48B271m775N262n797O385p033P758q564R463j0482J1646j2985J4545j6395J8625
62I924k1376K4872k9488L5898m5465O1453r4609K82503n84976l94848J066121
73C10009M00213p32246o88289N65193P52318l22086q33949J54514P13057J9446
83C38180n98544j16520L91833K07256k45661k06562J56666J73687j57160n1075
93a07900J60386n3876j59125J53811K16987j17640l13200M0294M30582Q1643n17815
104a85853j83971N71307L15484n42311m30738M31022N45585k70879o62406R0972
$$ plain form
0 0 0 0 0 0 0 0 0 8 -1 0 -8 8 -9 16 -24 25 -32 40 -49 60 -72 86 -102 121 -142 167 -192 223 -257 297 -339 388
32 388 -440 498 -564 636 -716 802 -899 1001 -1114 1239 -1379 1527 -1686 1866 -2061 2271
48 2271 -2504 2758 -3039 3346 -3687 4071 -4493 4970 -5512 6134 -6851 7694 -8701 9924
62 9924 -11452 13420 -16068 19830 -25635 35818 -58791 223712 -361264 -756112 310009
73 310009 710222 -22024 -710313 -145120 607198 285112 -548837 -394323 318734 338180
83 338180 -260364 -376884 14949 222205 -23456 -230018 -73352 100335 -56825 -107900
93 -107900 52486 -1390 -160515 -6704 210283 92643 -220557 -180263 250319 331962 -185853
104 -185853 -369824 201483 516967 -25344 -456082 -25060 520525 249646 -412760 -321788
114c21788P25538L8728p06773j44456N91909K28916m70482l48043L31770M11021
124C36340k28686m17237J48548L62432j14124l02134P8172K33358m4588j95306
134a43225K2798K20646j9139k63682N7999L11191p8828l29540N6850L61754M6482
145B43306l72493j48435L97087K50800m00968l33581L76855M04767k91419m39135
155c13216J68339M56436m1604m79318o7147M69350J19281m26747j55042L33349
165F3681J82199k44304k24550J60382K26943j32738k19904J28159K00710j31865
175H713j80154J19899J56354j00000j62121Q2152K16012o4118k71135O7232L16250
186A89084m6410l21877N48L20543Q2199l06182j52617L09892K26073k97002k76964
$$ plain form
114 -321788 403750 442478 -264295 -408751 183158 412074 -58408 -406451 -74681 336340
124 336340 107654 -309583 -161035 201397 87273 -214861 -136689 96669 52081 -143225
134 -143225 -120427 100219 81080 -182602 -124603 186588 107760 -221780 -164930 196824 243306
145 243306 -129187 -277622 119465 370265 -30703 -364284 12571 417338 125919 -313216
155 -313216 -144877 311559 269955 -209363 -276510 192840 312121 -114626 -269668 63681
165 63681 245880 1576 -222974 -62592 164351 31613 -188291 -60132 140578 8713
175 8713 -171441 -51542 104812 4812 -157309 -75157 140855 76737 -194398 -127166 189084
186 189084 142674 -179203 -178655 141888 224087 -82095 -234712 75180 301253 4251 -272713
197b72713K61972K98303k02860k97900J32378L05309o3871l28644M634L31570
207A68178J6766l18076l7559K76866O0866k43741j04449K15104J41428k10726
217c5343j84894J99162K09926j78873k14623J45708K17838r6807k40676L9477
227a39105K73937J3220k84139l5898K76953O0218k42432q5408K11282J22223j81378
238a0527j47371J71491J69834j60033j69951J54360J57553j46991j54894J28112
248h417J74339j01576k11416Q0136K40421p3306k69079M5226K74542J486k74035
259a21679p1463K60003J40747k44712k06764K11600K46122j67011k64232J04855
269a12534K71772k5529k68394m5231K53374R0257k21748r8433J87602J01731j41081
$$ plain form
197 -272713 -10741 287562 84702 -213198 -80820 224489 160618 -168026 -163392 168178
207 168178 184944 -133132 -170691 106175 167041 -76700 -181149 33955 175383 -35343
217 -35343 -220237 -21075 188851 9978 -204645 -58937 158901 62094 -178582 -139105
227 -139105 134832 148052 -136087 -171985 104968 165186 -77246 -162654 48628 170851 -10527
238 -10527 -157898 13593 183427 23394 -146557 7803 165356 18365 -136529 -8417
248 -8417 165922 64346 -147070 -66934 173487 100181 -168898 -123672 150870 152356 -121679
259 -121679 -193142 66861 207608 -37104 -243868 -32268 213854 46843 -217389 -112534
269 -112534 159238 133709 -134685 -179916 73458 163715 -58033 -156466 31136 132867 -8214
280h214r4027J05628Q5996q6199p0700R5245N9663j21623m8240J57885N0863j84462
292e8185p7879J89098J25040j82003j89141J64874K52598j34203l06314O9720
302a46395L27041J0417l23876j02326K98126J86926k56040k57755J93469K95884
312B25471j19320l02641L6052K83829M3617k45076r7697K02081J20091j54927
322h520j15002J10779R6684o5428o1864M4549K8176n1456l016Q4395m769j26526
334g1998O90J68290K1909j94953o5750J99164J24292j85614j93562J49281K51950
345B03699r2412k86977J7157K87589N7783k67311j33757K26408J98044j68508
355D1715k37115J02372K41223l7828k20009j6529J83892N6082j41063o9688J03524
$$ plain form
280 -8214 -102241 3387 89383 3184 -67516 27729 87392 -34231 -82471 75414 126277 -58185
292 -58185 -136064 53034 178074 -3929 -193070 -28196 224402 90199 -216115 -146395
302 -146395 180646 191063 -132813 -235139 62987 249913 -6127 -263882 -70413 225471
312 225471 106151 -196490 -160438 123391 167008 -78068 -175765 26316 146407 -8520
322 -8520 -123522 -12743 83941 18513 -43351 1198 29374 -22082 -25098 59297 54528 -71998
334 -71998 -71308 96982 118891 -76062 -141812 57352 181644 -3970 -197532 -48251 203699
345 203699 111287 -175690 -158533 129056 186839 -80472 -214229 12179 210223 41715
355 41715 -195400 -93028 148195 110367 -109642 -126171 57721 113803 -27260 -96948 6576
366F576O1936p2288l5461N3856j097n2340L6130P5908n0993j13970M4025J55820
378A08102k2054j96946j6564K25731P3646k28492j42303K01300K08682j50144
388F0958k62351P9241K92181L65k92360p8191K65888J48824k16630k06159J48802
399e9432K37941p5824k34939J3114K07295L4915j66909o6621J16836P6477o9054
410A3799o1767L4096L0294j7440R650K0149n0005m2092P5078P7355q0818j20107
422a11808O7580J64549l7365k01766j3665K18177P5574k07548j35668J77427J86820
433A82307j29597k26010O8845K46805j718k43272n8901K20866J12412j79130j48805
444a56198J32572J66258q7951j65537N0649J53520j8584j32698k532J06948N754
$$ plain form
366 6576 68512 -3776 -39237 14619 13522 -38818 -2688 73220 22227 -91743 -47718 108102
378 108102 86048 -110898 -127462 98269 171915 -56577 -198880 2420 211102 60958
388 60958 -201393 -122152 170029 170394 -121966 -200157 65731 214555 -2075 -208234 -59432
399 -59432 178509 102685 -132254 -119140 88155 123070 -43839 -110460 6376 82853 13799
410 13799 -47968 -13872 16422 -1018 8632 28781 -21224 -63316 11762 89117 8299 -111808
422 -111808 -44228 120321 82956 -118810 -132475 85702 161276 -46272 -181940 -4513 182307
433 182307 52710 -173300 -104455 142350 140632 -102640 -161541 59325 171737 -7393 -156198
444 -156198 -23626 142632 54681 -110856 -60207 93313 74729 -57969 -60501 46447 52201
455E2201q7433p94P5866q699p4871J6226P8441k5293r1824K2771J04759j2534
467D8816j20083p381J29880L4218j29185o5097J17989R3740r8645j15059P6267
478c4540J34649m4501j42732J2343J44492J7462j33944l7269J22751N6802j08044
489a2531o9038R6118P6858q5262q1362P4742Q4457o6968q8957O1315R2848n8031
501B4189j02028M6056J06798l3999j15039J8980J17669m661j20500j6677J15420
512C6208L4918j07667n1415R5510O4810q0140p5517O6363Q4228n2065q8792M2511
524c1048R4391k8711r5119K2117J02732j3088j07982M635J16922J2289j21164
535d4026k9520J25876N0492j25577p3384J17544R6420j04178j19040Q1250J31813
$$ plain form
455 52201 -35232 -36026 39840 31141 -43730 -27504 50937 25644 -66180 -43409 61350 48816
467 48816 -71267 -78648 51232 85450 -43735 -108832 9157 102897 4252 -110807 -34540
478 -34540 100109 55608 -87124 -74781 69711 87173 -46771 -84040 38711 95513 -12531
489 -12531 -81569 14549 91407 6145 -75217 -475 83982 17014 -71943 -10628 82220 24189
501 24189 -77839 -31783 75015 41016 -74023 -55043 62626 57965 -62535 -79212 36208
512 36208 71126 -36541 -87956 7554 72364 -7776 -83293 -16930 67298 15233 -73559 -31048
524 -31048 63343 34632 -60487 -38370 64362 51274 -56708 -52073 64849 77138 -44026
535 -44026 -73546 52330 102822 -22755 -96139 21405 117825 13647 -105393 -24143 107670
546A07670n5903j40711K2356J35871M908j27878l2792J08402M9891q6053o2251
557g6490O0068O2399m0628n5520K6201M4579j7497l1821K0167K5126k8113k0302
569c1831M4010K9681n4921m3409O6489P0387o5989r6153N8154J23825l3448j45043
581g8248K015J57813L5993j56490p5836J39531J09288j13707j36641P5552J47722
592A06992l7085j48492n730J31628L6460j09673n9172P7296O5354m8232o4845
603e5499K2999N1510q868l4011O801J6463j4125l619L2497M265n1596j2971P3136
616B6982L7228q1319o6216Q3775J04216o8292j33190M2224J57227j540j63702
627f2607m1780J57691Q3294j35759j18159R9280J38507n8352j45460J1831J31989
$$ plain form
546 107670 51767 -88944 -66588 69283 74191 -53687 -86479 21923 71814 -14239 -76490
557 -76490 -16422 45977 5349 -50171 -23970 20609 3112 -28709 -8542 16584 -11529 -31831
569 -31831 12179 41860 -13061 -56470 10019 80406 14417 -81736 -23582 100243 66795 -78248
581 -78248 -76233 81580 117573 -38917 -114753 24778 134066 20359 -116282 -40730 106992
592 106992 69907 -78585 -84315 47313 83773 -25900 -85072 -7776 57578 9346 -55499
603 -55499 -32500 19010 10142 -23869 -17068 -605 -14730 -18349 14148 18413 -33183 -46154 26982
616 26982 64210 -17109 -83325 450 104666 36374 -96816 -54592 102635 101095 -62607
627 -62607 -104387 53304 136598 839 -117320 -18040 120467 62115 -83345 -71514 60475
638F0475K4151j10167n4853P5313O4480m4237o3146J0913M4953R350k2629j7078
650b2475n089P349K7789J6428l8657m5489L8195Q0087j9218j06457j0088J26429
662D8804N5353j24440r9372J10497J44182p6349j71191L3908J84751J8393j78052
673e3516o8047J56672J09260j20828j36689P2931J43229k6822j35825j7501J11573
684C4437M5568q2509o6057M5541O3655j6479n1945r026K6881J8090k304j5375
696i523j9747k961L3081K9715l4142n8037K6566Q6670j285j01952k9645J08586
708B7326P0243r4823j02283P6442J30530m2046j41755O262J41260L3052j25299
719b1091o5873J00546Q7797p0899r7161L6832R1109j0936q0998j3934N9641K4352
$$ plain form
638 60475 84626 -25541 -80394 -5081 59399 15162 -47984 -37071 7882 17232 -5397 -22475
650 -22475 -27564 -20215 7574 24002 -14655 -60144 -21949 58138 38920 -67537 -77625 48804
662 48804 104157 -20283 -119655 -9158 135024 58675 -112516 -78608 106143 124536 -53516
673 -53516 -121563 35109 144369 23541 -113148 -40217 103012 76190 -59635 -77136 34437
684 34437 80005 -2504 -68561 -23020 40635 24156 -27789 -36815 -9934 8156 5852 -9523
696 -9523 -29270 -32231 850 30565 -3577 -61614 -35048 51622 50337 -51615 -81260 27326
708 27326 97569 2746 -99537 -23095 107435 65389 -76366 -70104 71156 104208 -21091
719 -21091 -86964 13582 101379 30480 -66681 -29849 61260 50324 -30674 -44608 15033 39385
731C9385m2149k8818K2072J7101j4325n451J0242r936j6498J8376K9881k1677
743a797m7790J7195O8801k824q4173j4404R5153M3066r0239o6844Q0245R2414
755H8803n8905j06614L7368J17799q082j14044j6935J02374L9930q4267n5794
766e8367O3286O3552m4668o4823K5562N5979j3581n0165J205L7862k36l3188j82
779a7764K8307n979l2228P164L3920j0563l9876R360M8140k555n6161o935O4220
792A9050K0024o4911k9452O4950M3463n4955n0124M8962O0508l6849o4794K7651
804a6477O8671j4681o4787O639O1700Q28n9284j0438N4806J7638n3584k5933M8799
817A3897L0176m6529l9933L6655M5339l1176n5489J9546O0888r768o4064l180
$$ plain form
731 39385 -2764 -31582 -9510 7591 -6734 -12185 -1943 -11879 -28377 -10001 19880 -1797
743 -1797 -49587 -32392 36409 33585 -50588 -64992 30161 73227 -17012 -83856 -3611 88803
755 88803 29898 -76716 -39348 78451 70369 -43675 -60610 41764 81694 -2573 -58367
766 -58367 4919 68471 23803 -41020 -15458 40521 26940 -23225 -22020 15842 15606 -17582 -17764
779 -17764 10543 4564 -27664 -20500 13420 2857 -37019 -27659 20481 17926 -38235 -45170 19050
792 19050 39074 -25837 -55289 9661 53124 -1831 -51955 -2993 57515 20666 -44128 -16477
804 -16477 52194 37513 -27274 -20635 41065 41893 -17391 -27829 26977 44615 -8969 -34902 13897
817 13897 44073 -2456 -42389 -5734 39605 8429 -47060 -27514 33374 23606 -40458 -43638
829d3638O1711J2496n8676k2763N4187L3546m4729l7284L7769L8255k9572l3151
841c1849K7265L1255k2148k6105K5109K7219k5408k7758K9192L2181l1033l9089
853c1169L1690N0974k5115o2272J1204O7730L451p3384k3277P1415M1474o4543
865a822o1913M6032P4291k7665q4969M113Q2984J6203p4636l3655O0534M4909
877D4406m3618n0043K4399M7181n886l3196m94J9209K121k178M447r575j4163
890a7390J8811L2888j5293m9587N054O5353J4346p2505l8980O7947O3974n3430
902B1188q4575L1447R7836m340j06539l1791R8954O2598q0406q6845N1709R9725
914F8961k2623j06228q634R7630L4654q0244n3947N6698O3791k9486o0735N461
$$ plain form
829 -43638 18073 30569 -28107 -50870 3317 36863 -7866 -45150 -7381 30874 1302 -31849
841 -31849 -4584 26671 4523 -21582 3527 30746 5338 -22420 6772 38953 7920 -31169
853 -31169 521 51495 26380 -35892 -24688 43042 46493 -26891 -50168 21247 62721 -1822
865 -1822 -63735 -17703 56588 28923 -56046 -51933 31051 47254 -27382 -61037 -503 44406
877 44406 788 -49255 -24856 22325 16439 -16757 -17251 1958 4079 1901 6348 -3227 -17390
890 -17390 1421 34309 19016 -30571 -25517 39836 54182 -18323 -57303 10644 74618 21188
902 21188 -63387 -31940 65896 61556 -44983 -76774 22180 84778 4372 -82473 -30764 68961
914 68961 46338 -59890 -68524 29106 63760 -16484 -70431 -13733 50058 20572 -40163 -34702
926c4702M7382J1242k7647j7147J0861J6937J0387n757k5175j1847K9999L3631
938C8164k1204m9053P024O0410J3640o3412l6367N4657N8171l9190p5728J5801
950c7087Q4075J1969q1841m0942O6705N8819m9252p0629K7520P5673m861p3084
$$ plain form
926 -34702 12680 23922 -3725 -20872 -10011 6926 17313 11556 -13619 -25466 4533 38164
938 38164 16960 -32093 -25069 35341 48981 -14431 -50798 3859 62030 22840 -52888 -37087
950 -37087 46988 58957 -22884 -63826 2879 61698 12446 -58183 -30663 45010 40149 -32935
$$ [...]
8191B23
##END NTUPLES=NMR FID
##END=
