##TITLE=1H_LY-6.1.Dix.1.B
 CD3CN,8 sc, 
 31.03.2021
##JCAMPDX= 6.0         $$ Bruker NMR JCAMP-DX V2.0
##DATA TYPE= NMR FID
##DATA CLASS= NTUPLES
##ORIGIN= UXNMR, Bruker Analytische Messtechnik GmbH
##OWNER= root
$$ XWIN-NMR		Version 3.5
$$ Wed Mar 31 11:13:39 2021 Russian Standard Time (UT+4h)  she@DPX200
##.OBSERVE FREQUENCY= 200.131506
##.OBSERVE NUCLEUS= ^1H
##.DELAY= (6, 6)
##.ACQUISITION MODE= SIMULTANEOUS
##.ACQUISITION SCHEME= undefined
##.AVERAGES= 8
##.DIGITISER RES= 18
##SPECTROMETER/DATA SYSTEM= spect
##.PULSE SEQUENCE= zg30
##.SOLVENT NAME= CD3CN
##.SHIFT REFERENCE= (INTERNAL, CD3CN, 0, 15.7039)
##AUDIT TRAIL= $$ (NUMBER, WHEN, WHO, WHERE, WHAT)
$$ ##TITLE= Audit trail, XWIN-NMR		Version 3.5
$$ ##JCAMPDX= 5.01
$$ ##ORIGIN= Bruker BioSpin GmbH
$$ ##OWNER= she
$$ F:/spectra/data/she/nmr/H-F/1/audita.txt
$$ ##AUDIT TRAIL=  $$ (NUMBER, WHEN, WHO, WHERE, WHAT)
(   1,<2021-03-31 11:12:13.00 +0400>,<she>,<DPX200>,
      <created by zg, POWCHK disabled, PULCHK disabled
       configuration hash MD5:
       00 E9 B6 7A A2 85 ED C7 34 08 36 98 17 FE 4E 26
       data hash MD5: 16K
       62 6B 61 68 D8 EA A2 31 E1 B5 08 DE C6 14 6F 93>)
$$ ##END=
$$ 
$$ hash MD5
$$ CE FD C9 F3 89 73 5B 7E F4 29 58 41 29 3C E8 C2
##$RELAX= 
##$RELAX= 
##$RELAX= 
##$RELAX= 
##$RELAX= 
##$RELAX= 
$$ Bruker specific parameters
$$ --------------------------
##$DU= <F:/spectra>
##$EXPNO= 1
##$NAME= <H-F>
##$PROCNO= 1
##$TYPE= <nmr>
##$USER= <she>
##$AMP= (0..31)
100 100 100 100 100 100 100 100 100 100 100 100 100 100 100 100 100 100 
100 100 100 100 100 100 100 100 100 100 100 100 100 100 
##$AQSEQ= 0
##$AQ_mod= 1
##$AUNM= <au_zg>
##$AUTOPOS= <>
##$BF1= 200.13
##$BF2= 200.13
##$BF3= 200.13
##$BF4= 200.13
##$BF5= 200.13
##$BF6= 200.13
##$BF7= 200.13
##$BF8= 200.13
##$BYTORDA= 1
##$CFDGTYP= 0
##$CFRGTYP= 5
##$CHEMSTR= <none>
##$CNST= (0..31)
1 1 145 1 1 1 1 1 1 1 1 1 1 1 1 1 1 1 1 1 1 1 1 1 1 1 1 1 1 1 1 1 
##$CPDPRG= <>
##$CPDPRG1= <>
##$CPDPRG2= <>
##$CPDPRG3= <>
##$CPDPRG4= <mlev>
##$CPDPRG5= <mlev>
##$CPDPRG6= <mlev>
##$CPDPRG7= <mlev>
##$CPDPRG8= <mlev>
##$CPDPRGB= <>
##$CPDPRGT= <>
##$D= (0..31)
0 1.2 0 0 0 0 0 0 0 0.06 0 0.03 0 0 0 0 0.0002 0 0 0 0 0 0 0 0 0 0 0 0 
0 0 0 
##$DATE= 1617174732
##$DBL= (0..7)
120 120 120 120 120 120 120 120 
##$DBP= (0..7)
150 150 150 150 150 150 150 150 
##$DBP07= 0
##$DBPNAM0= <>
##$DBPNAM1= <>
##$DBPNAM2= <>
##$DBPNAM3= <>
##$DBPNAM4= <>
##$DBPNAM5= <>
##$DBPNAM6= <>
##$DBPNAM7= <>
##$DBPOAL= (0..7)
0.5 0.5 0.5 0.5 0.5 0.5 0.5 0.5 
##$DBPOFFS= (0..7)
0 0 0 0 0 0 0 0 
##$DE= 6
##$DECBNUC= <off>
##$DECIM= 32
##$DECNUC= <off>
##$DECSTAT= 4
##$DIGMOD= 1
##$DIGTYP= 9
##$DL= (0..7)
0 120 120 120 120 120 120 120 
##$DP= (0..7)
150 150 150 150 150 150 150 150 
##$DP07= 0
##$DPNAME0= <>
##$DPNAME1= <>
##$DPNAME2= <>
##$DPNAME3= <>
##$DPNAME4= <>
##$DPNAME5= <>
##$DPNAME6= <>
##$DPNAME7= <>
##$DPOAL= (0..7)
0.5 0.5 0.5 0.5 0.5 0.5 0.5 0.5 
##$DPOFFS= (0..7)
0 0 0 0 0 0 0 0 
##$DQDMODE= 0
##$DR= 18
##$DS= 0
##$DSLIST= <SSSSSSSSSSSSSSS>
$$ [...]
##$SUBNAM2= <"">
##$SUBNAM3= <"">
##$SUBNAM4= <"">
##$SUBNAM5= <"">
##$SUBNAM6= <"">
##$SUBNAM7= <"">
##$SUBNAM8= <"">
##$SUBNAM9= <"">
##$SW= 16.9725357007746
##$SWIBOX= (0..15)
0 0 2 0 0 0 0 0 0 0 0 0 0 0 0 0 
##$SW_h= 3396.73913043478
##$TD= 16384
##$TD0= 1
##$TE= 0
##$TE2= 300
##$TE3= 300
##$TEG= 300
##$TL= (0..7)
0 120 120 120 120 120 120 120 
##$TP= (0..7)
150 150 150 150 150 150 150 150 
##$TP07= 0
##$TPNAME0= <>
##$TPNAME1= <>
##$TPNAME2= <>
##$TPNAME3= <>
##$TPNAME4= <>
##$TPNAME5= <>
##$TPNAME6= <>
##$TPNAME7= <>
##$TPOAL= (0..7)
0.5 0.5 0.5 0.5 0.5 0.5 0.5 0.5 
##$TPOFFS= (0..7)
0 0 0 0 0 0 0 0 
##$TUNHIN= 0
##$TUNHOUT= 0
##$TUNXOUT= 0
##$USERA1= <user>
##$USERA2= <user>
##$USERA3= <user>
##$USERA4= <user>
##$USERA5= <user>
##$V9= 5
##$VALIST= <valist>
##$VCLIST= <CCCCCCCCCCCCCCC>
##$VD= 0
##$VDLIST= <DDDDDDDDDDDDDDD>
##$VPLIST= <PPPPPPPPPPPPPPP>
##$VTLIST= <TTTTTTTTTTTTTTT>
##$WBST= 1024
##$WBSW= 4
##$XGAIN= (0..3)
0 0 0 0 
##$XL= 0
##$YL= 0
##$YMAX_a= 941894
##$YMIN_a= -876651
##$ZGOPTNS= <>
##$ZL1= 120
##$ZL2= 120
##$ZL3= 120
##$ZL4= 120
##$ABSF1= 10
##$ABSF2= 0
##$ABSG= 5
##$ABSL= 3
##$ALPHA= 0
##$AQORDER= 0
##$ASSFAC= 0
##$ASSFACI= 0
##$ASSFACX= 0
##$ASSWID= 0
##$AUNMP= <proc_1d>
##$AZFE= 0.1
##$AZFW= 0.1
##$BCFW= 1
##$BC_mod= 2
##$BYTORDP= 1
##$COROFFS= 0
##$CY= 11.3945322036743
##$DATMOD= 1
##$DC= 2
##$DFILT= <>
##$DTYPP= 0
##$F1P= 15.9154993809931
##$F2P= -4.1035820241983
##$FCOR= 0.5
##$FTSIZE= 0
##$FT_mod= 4
##$GAMMA= 1
##$GB= 0.15
##$INTBC= 1
##$INTSCL= 1
##$ISEN= 128
##$LB= 0.24
##$LEV0= 0
##$LPBIN= 0
##$MAXI= 10000
##$MC2= 0
##$MEAN= 0
##$ME_mod= 0
##$MI= 1.114404
##$NCOEF= 0
##$NC_proc= 0
##$NLEV= 6
##$NOISF1= 3.799351
##$NOISF2= 2.8
##$NSP= 1
##$NTH_PI= 0
##$NZP= 0
##$OFFSET= 15.70392
##$PC= 1
##$PHC0= -11124.07
##$PHC1= 13.40093
##$PH_mod= 1
##$PKNL= yes
##$PPARMOD= 0
##$PSCAL= 0
##$PSIGN= 0
##$REVERSE= no
##$SF= 200.130013532006
##$SI= 16384
##$SIGF1= 3
##$SIGF2= 2
##$SINO= 400
##$SIOLD= 16384
##$SREGLST= <1H.CDCl3>
##$SSB= 0
##$STSI= 0
##$STSR= 0
##$SW_p= 3612.71676300578
##$SYMM= 0
##$S_DEV= 0
##$TDeff= 0
##$TDoff= 0
##$TI= <>
##$TILT= no
##$TM1= 0
##$TM2= 0
##$TOPLEV= 0
##$USERP1= <user>
##$USERP2= <user>
##$USERP3= <user>
##$USERP4= <user>
##$USERP5= <user>
##$WDW= 1
##$XDIM= 8192
##$YMAX_p= 0
##$YMIN_p= 0
$$ End of Bruker specific parameters
$$ ---------------------------------
##NTUPLES= NMR FID
##VAR_NAME=  TIME,          FID/REAL,        FID/IMAG
##SYMBOL=    X,             R,               I
##VAR_TYPE=  INDEPENDENT,   DEPENDENT,       DEPENDENT
##VAR_FORM=  AFFN,          ASDF,            ASDF
##VAR_DIM=   8192,          8192,            8192
##UNITS=     SECONDS,       ARBITRARY UNITS, ARBITRARY UNITS
##FACTOR=    0.0002944,     1,               1
##FIRST=     0,             0,               0
##LAST=      2.4114304,     0,               0
##MIN=       0,             -876651,         0
##MAX=       2.4114304,     941894,          0
$$ Real data points
##PAGE= N=1
##DATA TABLE= (X++(R..R)), XYDATA
$$ [...]
1860a64K339r99l080j63K878J482k443k813J860L064j79l586q33L015J888j918
1876C48k648J101K581M64k516j522J799K500q01k612k51K295J850k115k520J235
1892h12K976n31k403r94K218J614j599j765j11K337O24j611j415P46K078p7k338
1909a063r56J793J797j275k243K50K280M88j771q42J110J795q60j581j4J673N35
1926A116q19j324M20J378M79j339p06J125J384m90k047j36J891N88j419j027Q30
1943i6J190R0j566n50Q70Q59k26j342k19J179P14j010j283P69J310m53j411M09
1961g66O69O51o18o77K30N61L22p93k06J71J024J41q68r5O69M21p36m64M73O39
1981G48n31k24N2M01K07n24K9kK32k18%k82j64M6L44j93j83p8M55l42k20L39N
$$ plain form
1860 -164 2175 1176 -1904 -2067 811 2293 -150 -2963 -1103 1961 1782 -1804 -2637 378 2266 348
1876 348 -2300 -1199 1382 1846 -670 -2192 -393 2107 1306 -1306 -1557 738 2588 473 -2047 -812
1892 -812 2164 1633 -770 -1764 454 2068 469 -1296 -1407 930 1554 -57 -1472 -726 1352 1275 -1063
1909 -1063 -2019 -226 1571 296 -1947 -1697 583 1071 -700 -1542 -432 1363 503 -1078 -1092 581 1116
1926 1116 297 -1027 -607 771 1250 -89 -795 330 1714 1224 -823 -959 932 1520 101 -926 -96
1943 -96 1094 1184 -382 -932 -62 797 571 -771 -990 189 903 -107 -1390 -621 689 236 -1175 -766
1961 -766 -97 554 -64 -741 -511 50 372 -421 -627 -456 568 709 -159 -254 415 836 100 -364 109 748
1981 748 217 -7 45 446 653 129 158 156 388 170 170 -112 -276 -230 114 -79 -262 -340 115 -227 -447 -108 -103
2004a03j50l51M63j78k0J11L17j55k95j44M82N19j93l20L73j13J10K4k18j66N61
2025E54J84q09k37Q05M96m84p60o6J518o69r62o3O19N80o62n52NM41L10n31m59
2046g42J70J047j1j126o96J049J077m56j421M32J350J68j529l91J185R98p51q19
2064d66J65P33P80q30r03K14J441J92j418o93R85J222n99j728n3J771M52j141
2082A24j119M56J440k14j392o76J436J100r65j486K03K022R0j370j440J551J397
2099A157o21j554j03J457Q29j043j486Q67J523K14j122j079R89J449l20k134o3
2116a040J794J072j746j460R36J781j2j959k35J153Q35p52j487Q2J554N52j413
2133c45j274R95J409K60j874o09J733J232j278j772N39J796pj428q87J214J538
$$ plain form
2004 -103 -253 -604 -141 -319 -339 -228 89 -66 -361 -505 -23 496 303 -17 356 243 353 377 159 -7 554
2025 554 738 -71 -308 497 993 509 -251 -317 1201 532 -430 -493 126 706 44 -508 -503 -62 248 -283 -742
2046 -742 -572 475 464 -662 -1358 -309 768 312 -1109 -677 673 841 -688 -1079 106 1104 353 -466
2064 -466 -301 432 1212 382 -521 -307 1134 1326 -92 -785 200 1422 823 -905 -958 813 1265 124
2082 124 -995 -539 901 687 -705 -1381 55 1155 190 -1296 -1093 929 1019 -351 -1791 -240 1157
2099 1157 536 -1018 -1121 336 1165 122 -1364 -497 1026 1240 118 -961 28 1477 1157 -977 -1040
2116 -1040 754 1826 80 -1380 -444 1337 1325 -634 -869 284 1119 367 -1120 -1038 516 1068 -345
2133 -345 -1619 -624 785 1045 -829 -1438 295 1527 249 -1523 -984 812 805 -623 -1510 -296 1242
2150A242j94j877J37J461Q56j216j659Q36J669J81k122p43J932J286j465j206
2166h82R1J609M65j553j039Q25J743m64j732o62J608J338j233j571N99J915k7
2183A030j885j025J966J176p29j677M33J280K73j246q32Q01J418k2j726j62J299
2200C72J154r42j589M25J753j70j354o38J029R78l55j512j9J481K58r00r22P60
2218a91J022j63j169n54Q51J007p12j201M80J256K31r81o41N53N54n7n44j88Q30
2237C83Q8m59o23J1R99N00j132l17O38O26n66o98K22P34L9n12m40O92J07K00n03
2258a1q0j05M47j90k70l33O39M64n62l94oQ36j27m30m02O57J6n9l39K80l07K90
2280A4l8Q0j93J79L97l12k42J40J17r0r0OL52j17J03k52K77l59J4O6m4j12J93
$$ plain form
2150 1242 1048 -829 -692 769 1625 409 -1250 -414 1255 1436 -686 -1429 503 1789 324 -882
2166 -882 -791 818 1283 -270 -1309 -484 1259 795 -937 -1599 9 1347 114 -1457 -858 1057 1030
2183 1030 -855 -1880 86 1262 533 -1144 -711 569 842 -404 -1236 -435 983 961 -765 -927 372
2200 372 1526 584 -1005 -580 1173 1003 -351 -989 40 1018 663 -849 -868 613 871 -29 -951 -191
2218 -191 831 668 -501 -1055 -204 803 91 -1110 -630 626 857 -124 -765 -212 342 285 -259 -447 383
2237 383 471 12 -611 -600 399 899 -233 -550 88 714 148 -550 -328 406 445 -67 -507 185 292 492 -11
2258 -11 -91 -196 251 61 -209 -542 97 561 -1 -395 -401 435 308 -122 -524 133 149 90 -249 31 -276 14
2280 14 -24 56 -137 42 439 127 -115 25 142 52 -38 -32 320 203 306 54 331 -28 -14 52 8 -104 89
2303H9J80j86k23Q8m9n8n3L41k54N4J01m6L7j41R2J79q1m21Q1L74J83l22j24L58
2327A99M8j22l22J76j4M07l26m02J53N31j24m68k04L36O24m43n55M33M93o6n60
2348b06k20L27M53j09o59N8O61J46l85n57K32P96j4r81k31L20J106l08q58J64
2368b65O07K64p20o38N44Q30j74q35l40N53Q46l38q86l04J307K49j017o05O54
2387b68J323p84j053K74P96M95j098l47L37P88J24j016k44O53P76l93r61n0J186
2406E38J96p77q92Q07O86Qj060j81Q87P20q20q35M94P82j34o33m54M46J066m17
2426D27j416K14J002P98j148p68L46J457l10q82k30O22O73l35j081J05R97K49
2444G20m23j067N05J114j27j004m26J037O48p62r87N33Q96L05j192n92O32R21
$$ plain form
2303 89 269 83 -140 -52 -101 -159 -212 129 -125 -71 30 -16 21 -120 -28 151 70 -351 -270 104 287 -35 -159 199
2327 199 247 125 -197 -21 -35 372 46 -356 -203 328 204 -264 -468 -132 492 49 -506 -73 420 354 -206
2348 -206 -426 -99 354 245 -414 -356 305 451 66 -491 -259 537 523 -458 -689 -369 737 429 -429 -265
2368 -265 342 606 -114 -752 -208 622 448 -387 -727 -174 672 334 -552 -856 451 700 -317 -922 -268
2387 -268 1055 271 -782 -508 288 783 -315 -662 -325 463 587 -429 -673 -20 756 363 -598 -648 538
2406 538 734 -43 -935 -128 558 566 -494 -675 212 932 112 -723 -229 553 419 -214 -668 -222 844 427
2426 427 -989 -775 227 1025 -123 -891 -545 912 602 -280 -510 112 785 450 -631 -526 471 720
2444 720 297 -770 -265 849 722 -282 -708 329 977 215 -772 -239 657 962 -230 -822 -190 731
2462G31l54o99n44J084M41o75r19L98R54L4q56l15R74N63n68r39QJ018O0o62n98
2483h64N05R34K9j045n6P75M90l76r58R6R25K17r20n13P55N75j70o17l38R43K94
2504F81o41o89L47P24J34r00l99P48P89l64j131mJ025M51j113p3L03M79j50p38
2524e21J8P23J33l02o69J62J028l28m75k77L07P04j25o71J39P70k51m61l07M92
2544H9K41j94l69n2M24J37L7l78k87M00K11j40k49qL83j88l85k62P52J9l65p4
2566b58K74J23k00r9K0j10K38j00J8Q0J16J95k69j27J69J29k66N6J11k34K89o4
2588I1M8n2k11L11k00m2rJ06R8j16rj66J06j80J24L00l77r6J88K62Rl42LJ86n5
2613b3k8j64K51L43m22O9pj89L21j39k03K81P3N0j98nK63J33j51m12J43K56k7
$$ plain form
2462 731 377 -322 -866 218 659 -16 -935 -537 417 451 -405 -720 254 817 249 -690 -682 336 396 -266 -864
2483 -864 -359 575 604 -441 -497 278 768 392 -566 -470 455 672 -248 -761 -6 569 399 -218 -556 387 681
2504 681 40 -649 -302 422 556 -344 -743 5 794 430 -701 -705 320 771 -342 -415 -112 367 217 -521
2524 -521 -503 220 353 51 -618 -456 572 244 -231 -508 -201 503 378 -293 -154 616 365 -96 -403 89
2544 89 330 136 -233 -285 139 276 313 -65 -352 48 259 119 -130 -138 245 57 -328 -590 162 181 -184 -258
2566 -258 16 139 -61 -160 -140 -250 -12 -112 -94 -14 102 297 28 -99 70 199 -67 -11 100 -134 155 91
2588 91 139 87 -124 187 -13 -55 -64 42 140 24 15 -151 -45 -225 -101 199 -178 -274 -86 176 185 -157 -154 32 -23
2613 -23 -51 -215 36 379 -43 26 19 -170 151 12 -191 90 163 213 15 10 273 406 255 -157 -14 242 215
2636B15j95l63M28J59k29m42M15N9m2J61k88l96N35K60m47m09N31L79j40n42l6
2657c87N17L86n78l28K89M32j80j38m50L33M70l01l33P0N54jl66m29M66N25j12
2678D39j039N8O77K29m08j00k07M90M66q83l9K57M51n49l74q0P81K43p22l92M66
2699b36O88l54m98j94O35M62k01p64M11M18j25j14q19P19R31n10p41M7N52K64
2719E71m48m78L7J112l18q48l6L56N19j38p85l46J088N60q75l82N9Q11L1r15j08
2740e33Q84L36j111p0k6P63K00o44l73Q33R8q5o79J43L28M75l16p92L56P32P9
2761E98n01m50O27R6n0r43K03Q18m1l40k93P9M44Q1n04k45N81M44m31o26K8N43
2783A18L33p36p19R22M27m74j69n3K41M20k52m39J62P05l52j43l66J25Q75k2q48
$$ plain form
2636 215 20 -343 85 244 15 -427 -12 47 5 166 -122 -518 17 277 -170 -579 -48 331 191 -351 -387
2657 -387 130 516 -62 -390 -101 331 151 13 -437 -104 366 65 -268 -198 356 355 -11 -440 26 551 439
2678 439 -600 -542 135 364 -44 -144 -351 139 605 -278 -317 -60 391 -158 -532 -612 169 412 -310 -702 -236
2699 -236 452 98 -400 -594 41 503 302 -462 -51 367 242 128 -691 28 959 449 -292 -245 307 571
2719 571 123 -355 -318 794 476 -372 -408 -52 467 329 -456 -802 286 846 -29 -411 -352 459 490 -425 -533
2740 -533 351 687 -424 -494 -520 243 443 -201 -574 259 357 272 -407 -264 64 539 223 -569 -213 519 598
2761 598 97 -353 274 370 320 -623 -420 398 357 17 -276 -197 247 328 -176 -421 160 604 173 -453 -425 118
2783 118 451 -285 -1004 -82 345 -129 -298 -351 -110 310 58 -381 -219 486 134 -9 -375 -250 625 603 -245
2804b45q1L81K80k58n60N12N94l21n24p5N55n7k98j78j24N41O7l92k68M32M08
2825C89k27l27j50L60N39p01l17L52L72L5n35j26N9P66l30k53j10N92n1k53l33
2846b49J38N18l97l19J29L85J28k82j94m5L24J39m63j14K20K23j69J94p06N49
2866IL20l22k48L66k7o8j16j24M1J50p3l3L60j25l85J57lJ57k5J73j69p2J83q6
2890D0j65J73j07L84k69j60K66k04L4m8J88J96k73j67Q7K34j60j31P6n0N3j31
2912a34r9K10%L11j91j88j17J99K28k95K62j37J56n39M2O41j65k04L1m02L07J28
2934D4J3k7k16M70l25pk86L05M37l20k84L07L02l28o9j87M13j71K28k33m88K79
2956a43K33O6l76p2K36J88j37n27L62O06n16k8l0J7K30j75j52M8K39K33k61k44
$$ plain form
2804 -245 -326 55 335 77 -483 29 623 302 -222 -297 258 201 -97 -275 -399 142 209 -183 -451 -19 389
2825 389 162 -165 -315 45 584 -117 -434 -82 290 325 -210 -336 -277 489 159 -94 -204 388 337 84 -249
2846 -249 -111 407 10 -309 -180 205 333 51 -143 -188 136 275 -188 -302 -82 141 -28 166 -540 9
2866 9 329 7 -241 125 98 30 -86 -210 -169 -19 -92 -125 235 110 -275 -118 -121 36 11 184 15 -57 126 40
2890 40 -125 48 -59 325 56 -104 162 -42 -8 -56 132 328 55 -112 -25 209 49 -82 -6 -56 -3 -134
2912 -134 -233 -23 -23 288 97 -91 -208 -9 219 -76 186 49 205 -334 -292 349 184 -20 11 -391 -84 44
2934 44 57 30 -186 284 -41 -48 -334 -29 408 88 -196 111 413 85 16 -171 242 71 299 66 -422 -143
2956 -143 90 156 -220 -292 -56 132 -5 -532 -170 436 -80 -108 -138 -121 109 -66 -218 -170 69 302 41 -203
2978b03L00L09n1p57L70J68K11l17j51j56P09j67m41j95M31L50k78j81j32J92
2998A1L81m91l21L25M9K79k35m25M59M90n56m38K72K77L07l84m74P09L87n63k38
3019a79j64P06k69j84l68J22N97K91o78l58L87Q7J23l95K87K63K06l23m09J21
3039a37J75J21k81o8m7N36k08n04J99N89o6n94Nm3M74o2j82l7K55P8k47j31n7
3062b32L88L10n29m15L99N55r1o28j59O57O7m05k38M61J21J3p23K32M75K5j53
3083A30j61j93K27K50j02l34j8M19j73l96q8J79N43j58m67N10M6j73j18j10J84
3104cRJ2k2m51M05L85l26k79K01L0M31o69n2K65K34r9k20j40K69K40k53j89O6
3127a56K69k44oj79N34q2m1l95J22L89K6m49r0J59L18o6j44l2P3j08P0R2Q0q5
$$ plain form
2978 -203 97 406 355 -402 -32 136 347 30 -121 -277 432 265 -176 -371 60 410 132 -49 -181 11
2998 11 392 -99 -420 -95 -46 233 -2 -427 32 522 -34 -472 -200 77 384 0 -474 235 622 59 -179
3019 -179 -343 363 94 -90 -458 -336 261 552 -126 -484 -97 -10 113 -282 5 268 474 151 -258 -137
3039 -137 38 159 -122 -190 -237 299 91 -413 -214 375 309 -285 -280 -323 151 89 -93 -130 125 203 -44 -175 -232
3062 -232 156 466 -63 -478 -79 476 385 -243 -402 255 322 -83 -321 140 261 274 -449 -217 258 283 130
3083 130 -31 -224 3 253 151 -183 -201 218 45 -351 -439 -260 283 125 -342 168 214 41 -77 -187 -3
3104 -3 6 18 -4 -455 -50 335 9 -270 -69 -39 392 -277 -329 -64 170 71 -149 -289 -20 220 -33 -222 -156
3127 -156 113 -131 -137 -316 218 136 95 -300 -178 211 237 -212 -302 -143 175 109 -35 -67 6 -102 -32 60 140 55
3151E5R8k34j23J81K81p4l41QK39k27p8R2O5J89l04N0j05J63J02J36k36j01L43
3174A79M0k4l97M40k54n1k2K6O4J32k8k5k84L55j45LL1j41L34l58L46j00j2k9
3198H0j59R2j20J27m2k35L82N2j42j12qj2p1j42L24J36o6k03j38L92k7j81l3O3
3222d3K17k18k11p6M04R4R6k74J17j31K73l15O8K82M7n17P5L57j24m0k60J03k0
3245i6K60l19Nq6K80K76k76n43P7M82Mm20J92M3K77mm36M01j63k3pk9K18j57K56
3270B12m22Q4n1O85m87J00j70J83J3m62J68M4K93m8k87J91l1L50l03j92p5J07
3292i8L53m08J40p6L68k49l15J04L69l45M2l9K25o3M3k78j29M00p1j07l4J62M14
3315D08o0n13n1K40M13m84j89J12L11k8j28j65J67r1kj54k02L83K14j17k05Q2
$$ plain form
3151 55 153 -81 -204 -23 258 184 -157 -149 90 -137 -215 -123 -58 131 -173 -123 -228 -65 37 173 -63 -164 179
3174 179 219 195 -202 238 -16 -67 -89 -63 1 133 105 80 -204 151 6 9 40 -101 233 -125 221 121 109 80
3198 80 -79 13 -107 20 -22 -257 125 177 35 -77 -85 -97 -168 -310 14 150 84 -119 -257 135 108 -73 -106 -43
3222 -43 174 -44 -255 -331 73 167 263 -11 106 -25 248 -67 1 283 330 -187 -112 245 121 81 -179 -76 -96
3245 -96 164 -155 -150 -236 44 320 44 -499 -422 60 64 -356 -164 -121 156 152 -284 117 -46 -69 -76 -105 113 -44 212
3270 212 -210 -126 -177 508 21 121 -49 134 147 -315 -147 -103 190 142 -145 46 15 365 62 -130 -205 -98
3292 -98 255 -153 -13 -89 279 30 -285 -181 188 -157 -115 -154 71 8 51 -227 -356 44 -27 -134 -168 -6 408
3315 408 348 -165 -216 24 437 -47 -236 -124 187 159 31 -134 33 -58 -60 -214 -416 -33 181 64 -141 -59
3337e9J76K41o84J66J33M72m48l94J28J97L27m42l9K79j06M2k17O7J98Rq3j91
3359b28q2J37N74l24k92K66O7L6l66O0M01j36N6k74j77M15L5O9m05J37M37k57
3381A49j76k17K76J14o8j61k2K94L6j37l51N3M08n6l65L35kJ19n1k0l47L14jj74
3405e0j24K89K50q0k65K1p4j3Q7J88k17k36M44l22J42J21J5j33k20j01K64k66
3427b80l9J11J66Lo5R6M0J9k7O1k52j15M36k17K4n0J79k9Q2k56J15J32K35m38
3451f9J8R3pN5j85J30N2j02J47Q2k65J3J54r1k27J59J43l1J22j46j05OlJ52j13
3476a8K31k77o6n3j6K18Q5K44k55j18J79p2k74J38J36J52k00r3K01j40oJ18r5
3499A9J46m66L0L00j53K01j18J76Q9Kl35K18nl8P5j31J10P0k38n3J7L93j82q9
$$ plain form
3337 -59 117 358 -326 -160 -27 445 -3 -397 -269 -72 255 -187 -226 53 -53 -11 -228 -161 37 46 -37 -228
3359 -228 -310 -173 401 77 -215 51 118 154 -212 -152 249 113 169 -105 -282 133 168 237 -168 -31 406 149
3381 149 -27 -244 32 146 78 -83 -105 189 225 88 -263 -210 198 142 -223 112 110 229 178 158 -189 125 124 -50
3405 -50 -174 115 365 285 20 41 -33 -46 41 229 12 -224 220 -102 40 161 176 43 -177 -278 -14 -280
3427 -280 -319 -208 -42 -39 -104 -8 32 51 24 85 -167 -282 154 -63 -39 -89 90 61 143 -113 2 134 369 -69
3451 -69 -51 42 35 90 -95 35 87 -15 132 214 -51 -38 116 25 -202 -43 100 69 191 45 -60 -54 -57 95 -18
3476 -18 213 -64 -130 -183 -199 19 104 348 93 -25 154 82 -192 -54 82 234 34 -59 142 2 -4 114 19
3499 19 165 -301 -271 29 -124 77 -41 135 224 226 -109 109 104 66 141 10 120 190 -48 -101 -84 309 127 38
3523C8ql5J4L6k4k7k4K66k93J2J36J12l7k57J00l13N58k77K05r0J21q0j84JJn3
3549a02K02J4l44L21P2n2j68R5N6J00k70j03K85k7Pm28L9L09j16o5J44P8J28k40
3573f5j46K30r2J48N9N0j95k9K26m46J71R1K50j7m81L16R1r4k01k00L02J20j1
3596G7k94L75j20L15k55q3o9K27m9j04j4j20N24m30j64Q6K79J3m9l35J37K35m12
3619b30J20K3J13J35J6p2j35O2K02j49j76j7K81M7m63J33J34K14m33J53k69M87
3641A76n17L28q4m8K83p9l47k43L47K86p3K2j02J61r9j34q5K23j80K46l31j19
3663c69N40j19j25j70L70L6j08j3k41M85j08j04k93K63K89k15l27J88J32q8rj78
3685a64M3L24l05J02r8K21N4r9J5j67K51k14l12J80j3M41k35J6M5j42K3p8J72
$$ plain form
3523 38 30 -5 9 45 21 -6 -30 236 -57 -45 91 203 166 -91 9 -304 254 -23 182 92 213 133 -51 -50 -49 -102
3549 -102 100 114 -230 91 163 111 -57 38 94 194 -76 -179 106 79 86 -342 -303 6 -110 -175 -31 47 175 -65
3573 -65 -211 19 -73 75 134 184 -11 -40 186 -260 -89 2 252 235 -246 70 161 67 -134 -334 -32 88 77
3596 77 -217 158 38 353 98 15 -54 173 124 20 6 -114 410 -20 -184 -98 181 194 145 -190 -53 182 -230
3619 -230 -110 -87 26 161 177 105 -30 32 234 85 -91 -108 173 220 -243 -110 24 238 -195 -42 -311 176
3641 176 -341 -13 -97 -145 138 59 -288 -531 -184 102 29 51 -51 110 11 -123 -208 15 -165 81 -250 -369
3663 -369 171 52 -73 -243 127 163 55 42 -199 286 178 74 -219 44 333 118 -209 -21 111 23 14 -164
3685 -164 -121 203 -102 0 -98 123 177 78 93 -74 177 -37 -349 -169 -182 259 24 40 85 -57 -34 -112 60
3708F0L5k28J3J99k69K88j81K31n2j39MJ7n0p7J49L0J40k72J48o7J69j99j58J96
3732a3j6L36l30m7n7J09PN4j13j29J42lP6l51L1N48j62k48K13km8K1M8j63J79
3757H2K7j38k6J59J91k24n3r3O1K36k05n3N1o9K1J1J27l12J37N0J7l1J19j33q0
3782a28M08j82M9j80R2p2j33L1m9k3J73K0K62q2l85K99j04J0n0O7j9pRJ30k70
3807a34J29j34J56J71l10K01l65M11j28p0p1K34%o2K13k07J02l39K40l67N09p7
3829A02l77L8K01J23J00k49K49p0J6j20Q7k97j01N17j72j67K7O0k15K15j97M0
3851a90P3L11P6l48O4J35k72j42J29K00j97J19qK7O0m3K10K6j38j13L1o2j5M9
3875a8J64k75J20J52j3j32K12k84J84j20l4J09k70L96j57J0k91J39K50k54J16
$$ plain form
3708 60 95 -133 -120 79 -190 98 -83 148 96 -43 -39 -22 -72 -149 0 30 170 -102 46 -21 148 -51 -209 -13
3732 -13 -29 307 -23 -70 -127 -18 -11 43 -70 -199 -57 -60 16 -335 -304 244 82 -166 47 45 -3 18 66 -97 82
3757 82 109 -29 -55 104 295 71 18 -75 -14 222 17 -36 15 -54 -33 -22 105 -207 -70 -20 -3 -34 85 -48 -128
3782 -128 280 98 147 -33 59 -13 -146 -115 -164 -187 -14 6 268 186 -199 100 -4 6 -44 23 4 -3 6 136 -134
3807 -134 -5 -139 17 188 -122 79 -286 125 -3 -73 -144 90 90 28 241 34 136 -203 37 -330 179 102
3829 102 -275 -237 -36 87 187 -62 187 117 133 13 100 -197 -298 219 47 -120 -93 -33 -248 -33 -230 -190
3851 -190 -117 194 270 -78 -14 121 -151 -293 -164 36 -161 -42 -50 -23 37 -6 204 230 92 -21 10 -52 -67 -18
3875 -18 146 -129 -9 143 130 -2 210 -74 110 -10 -44 65 -205 191 34 44 -247 -108 142 -112 4
3896Dl2J28j00M8k11l9K71j91nq8M88r3m21J82j0J73j36j56n6L31MJ42j81k25
3920a73K61k14j13K26J13O8j45k0R6j3p9J80k88k2L57k53K9L4j27L52m86j9L47
3943A11n9Ql8j00K31l14J61n7J23m8K02j59l7k0j01L51j04k89J8J96j66j35L68
3966A42K8j44q4q8J70J1P1n14L13J60k9J89m35P1J46r2K09j05n3K02k15k24L64
3989I3k39K01j42RK60m11K03J7N5j00J88l67r4K56N6K1K8qJ07J44j42k74R9K11
4013A71k04Q2M6p9j1L18j30k32j04J40p6o6o0L11M7l6k13L22Mk63j11K04j82L62
4037B40j76J28k37rJ35k68K78l45M23l15M5R4J32o2j80Q6L0N3j28O0J68K6r8k30
4061a50K36%k84M00m0k40M04k43j19J27K2Q4j39k15p6K53R1K0q5n0m2k68L56K9
$$ plain form
3896 4 -28 100 0 48 -163 -202 69 -122 -127 -215 273 180 -241 -59 -69 104 -32 -188 -244 87 91 233 52 -173
3920 -173 88 -126 -239 -13 100 168 23 3 99 86 7 187 -101 -123 234 -19 10 44 -83 269 -217 -236 111
3943 111 52 60 22 -78 153 -161 0 -57 66 18 220 61 24 4 -97 254 150 -139 -121 75 -91 -226 142
3966 142 170 26 -58 -146 24 35 106 -408 -95 65 36 225 -210 -139 7 -85 124 19 -34 168 -47 -271 93
3989 93 -146 55 -87 -78 182 -229 -26 -9 46 -54 134 -233 -327 -71 -15 6 34 26 133 277 135 -139 -40 171
4013 171 -33 49 95 16 5 323 193 -39 -143 -3 -79 -145 -205 106 153 117 -96 226 230 -33 -144 60 -122 240
4037 240 64 192 -45 -54 81 -187 91 -254 169 -146 -101 -7 125 63 -117 -31 -1 52 -76 -16 152 178 80 -150
4061 -150 86 86 -198 202 162 -78 326 83 -36 91 113 197 58 -157 -233 20 111 131 46 -4 -46 -314 42 71
4085G1k38N3P7J07j05j17M41J8k92K03k86O9l4j64K20K99k62k1k24J44J49j18
4107a0J19n2k5N3j12o3j32K24j63K89j63K18p4q2m5jl7R9k5R5k80P1j08K07Lq
4133bR6m0K5j70P1R7n6o0J04P0j94R4K09l43m1l7K92j75k5Q0nN3J55k53k8J72
4159H9m4j01o9M68k71j00k23L74r5j24K57r1LJ27o6l9k82J39O3j37Q1j15K39m
4183G9R1j78jL1N8O9j47J94k33j33K39R3J63l41Q8mj32J43R0k11k48L05j81K50
4207H4j6K63l66K00q6k82O3J61k0p4k1K60QM9l76K85K53m56P8P6o9K47j31j47
4231a7j00L69l28k9J96p2J91rQ8j49o7R3l86J50L0kK54k30o7J38M2l6j6k7R6q2
4257C0j11K91k67R5p2o9J04K6j75K15p1rj6J40l2k97O7K54k44O2J97j34j02L23
$$ plain form
4085 71 -167 -114 -37 70 -35 -152 289 307 15 218 -68 1 -33 -197 23 322 60 39 -185 -41 108 -10
4107 -10 109 57 32 85 -27 -90 -222 2 -161 128 -35 183 109 27 -18 -19 -56 43 18 113 -167 -96 -204 3 6 -2
4133 -2 94 54 79 -91 -20 77 21 -39 65 135 -59 35 244 -99 -140 -177 115 -60 -85 -5 -10 43 198 -55 -83 89
4159 89 45 -56 -125 343 72 -28 -251 123 28 -96 161 70 73 200 134 95 -187 -48 15 -122 -41 -156 83 79
4183 79 170 -8 -9 22 80 149 2 196 -37 -170 69 162 325 -16 72 68 -64 79 169 -42 -290 15 -166 84
4207 84 68 331 -35 165 79 -203 -140 21 1 -73 -94 166 174 223 -153 132 385 -71 7 83 14 261 130 -17
4231 -17 -117 252 -76 -105 91 19 210 201 289 140 73 166 -220 -70 -40 -42 212 -18 -85 53 95 59 43 16 112 30
4257 30 -81 210 -57 38 -34 -103 1 27 -148 67 -4 -13 -29 111 79 -218 -151 103 -141 -79 118 -16 -118 205
4281B05l62J67m6J66j69m4K56L5j88l3J86k76J33j5q5P8K14k98K13p8k37K18l75
4304c35K87P1M8j21j91R0J94k59K78q4rj01N3J85l1r2m3J24O7j79n8j2J91p3j8
4329a8K91k85K22j4l36P9J24q8k25L46m4m9L9jJ14j62J37j75J55K0j27j65O3j54
4353b53K45J16L3l7l36L83k28r7O0Q0m6O8K48j44K12m48L24j94q5J63l56N31j76
4376F3m5n9o8J7L42k48J46k82J60K55l92K38r3J8j56r6M23j81j32L45j13R9j26
4399A15k21j75L55k10R9q6J75j51L04j19Q9L9L1k26pl53J96J63MQ2P8l19O8Q8
4423A9J02R7j44j45k58K93K05j79l0K0Q6j53n2R9j33L76j79Q3Q1o3j33j49J58
4446AJ64n3j50P4k90L43k1O5r6p0J04k1l0J40Q4j30j72N1R5K4j57M0l3K97p8L9
$$ plain form
4281 205 -157 10 -36 130 -39 -83 173 208 20 -13 173 -103 30 15 -70 8 222 -76 137 59 -178 40 -335
4304 -335 -48 23 71 -50 -241 -151 43 -216 62 -22 -31 -132 -79 106 75 -17 -60 64 131 -48 -106 -118 73 0 -18
4329 -18 273 -12 210 196 -140 -61 63 -25 -250 96 52 3 42 41 155 -7 130 -45 110 130 3 -162 -99 -253
4353 -253 -8 108 141 104 -232 151 -77 -174 -114 -34 -80 -12 236 92 304 -144 180 -14 -99 64 -292 239 63
4376 63 18 -41 -109 -92 250 2 148 -134 26 281 -111 127 34 52 -104 -200 223 42 -90 255 142 241 115
4399 115 -106 -281 74 -136 -37 -123 52 -99 205 86 175 214 245 19 12 -341 -145 18 22 104 182 -137 -69 19
4423 19 121 218 74 -71 -329 -36 169 -10 -40 -20 66 -87 -139 -40 -173 203 24 107 188 125 -8 -157 1
4446 1 165 112 -38 36 -254 89 68 133 37 -33 71 50 20 160 244 114 -58 -7 88 112 -45 -5 -38 259 181 220
4472B20k90l1L28j32k44O1J46J90k3q8p3p2j0j00K62k71J66r2n9J64p3J32j43
4495c2K58j93k59M31p7j58O8o2j07K5K73k73P2o6qK50K78m89oJ23m2k89L74j16
4519b5p0l3k2J39o2M0n9QN3J02j82J37k04J34J34j16J59j33j10j98J39L05p5Q0
4543A41j24k0j36L28l77M15N6l05R1m01L37nJ44l5l79J07L12j13K1j16j18J70
4565gJ04k3K34k98J64l69R7K91k60J5l9J20J40k08r1J39n3R8j23k09M82l66K79
4588A17j83J82j69RK19k39J23j41J24p5L58m52L06l2k65J99N8l17K5N8L4K52j04
4611H7l4K6J26k76J54K5K9O2nM1k95k5K64q4m7n7L31l32j18K7N4P0j17j75L22
4636E3p2J11j88O1JL1J39l46L21j98J32QQ8k56J96o8J7Jm3J33l38J71m0L81l51
$$ plain form
4472 220 -70 -101 227 95 -149 -88 58 248 225 137 64 -8 -18 -118 144 -127 39 -53 -112 52 -21 111 -32
4495 -32 226 33 -226 205 128 -30 38 -24 -131 -106 167 -106 -34 -100 -108 142 420 -69 -75 48 6 -283 91 -25
4519 -25 -95 -128 -150 -11 -73 -33 -92 -84 -31 71 -111 26 -178 -44 90 -26 133 0 -110 -308 -169 136 61 141
4543 141 17 -3 -139 189 -188 227 283 -22 69 -332 5 0 144 109 -270 -163 149 36 57 -59 -177 -7
4565 -7 97 74 308 10 174 -195 -98 193 -67 -52 -91 29 169 -39 -130 9 -44 54 -69 -278 204 -162 117
4588 117 -66 116 -53 -44 175 -64 59 -82 42 -33 325 -127 179 147 -118 81 139 -178 -153 -95 -61 191 87
4611 87 53 79 205 -71 83 108 137 199 194 235 -60 -85 179 95 48 -9 322 -10 -128 -101 -47 23 -94 -269 53
4636 53 -19 92 -96 -35 -34 -3 136 -210 111 -87 45 53 141 -115 81 13 30 31 -12 121 -217 -46 -86 295 -56
4661e6J91j20Rq8P4L09l64M9j22J00Q7J62l73K45j03r6J03k08J34R0j22J04j79
4684a74J66l0nj13L68n45N14j07J11k99M8K09k76K55j10P4j55j33L02J20J9m49
4706b10K3K14j68M7J04O2j24N6j57J59J01O2j03k27R6K28q8j19K58j77j8k1j48
4729a50K6P4j16L11k86M43l89Q6j77J02J26O0LOj62R4K1K0N6l43J26J03J1k30
4753a85j27L06J72j27o0P6Q6j49K48J33l23m6m6j1j46K52RJ08p3l15N0K94l15
4776a89J49j09J05O4j79j0P3K81r9K35m72M08k41j06rj48L19j44r9Q8L9L64m99
4799a79L19l93R8R5l8M5J66m2k00J26N5l0R3j56j04J83n0J24k95L12O2j84J40
4822A47Kj6J57k67J41k00j0L25j36n8j37l8K60j60NN6j35N9p8K04k53J19J06J22
$$ plain form
4661 -56 135 15 24 -64 10 319 -45 4 -118 -18 69 231 -142 103 0 -96 7 -201 -67 23 -99 5 -174
4684 -174 -8 -38 -43 -156 212 -333 181 74 185 -114 -66 143 -133 122 12 86 -69 -202 100 220 239 -210
4706 -210 -187 27 -141 -94 10 72 -52 4 -153 6 107 169 66 -161 -65 163 75 -44 214 37 19 -2 -150
4729 -150 -124 -50 -166 145 -141 302 -87 -1 -178 -76 50 110 113 119 -43 51 72 92 148 -195 -69 34 45 -185
4753 -185 -312 -6 166 39 -21 55 141 -8 240 373 50 4 -42 -53 -199 53 62 170 97 -218 -168 126 -189
4776 -189 -40 -149 -44 20 -159 -169 -96 185 86 321 -151 257 16 -90 -99 -247 72 -72 -171 -83 -44 320 -179
4799 -179 140 -253 -155 -60 -98 -53 113 71 -129 -3 52 22 115 -41 -145 38 -12 112 -183 129 191 7 147
4822 147 149 133 290 23 164 -36 -46 279 143 85 -52 -90 170 10 15 71 -64 -5 -83 121 -132 -13 93 215
4846B15n63M03P4k59J51j06q0K13K30l10J33r9j75J79P2k59J42K81k82l4J72k85
4868a87k4J2L75j67q8j15K5P4K08l03K4J40kJ05j28m1O0p5R0L8L6R8M9l80L10
4893A34j2rJ4k35m1L35k00J54k7N2j42j3o1J85j69K7P1k42K79k92P3L03k86J59
4917E7J36l29K85l67L05j55K76j52J0o5kk75K50J31k0K90m24k5K71l55M5K22j95
4940h6K00l69K90j7j22K73k52L31k37K04j42o8R7q9r9K32k56J45Q5o7j99Q8N5
4963cj36J93O6j72J81K5l20J57R1j89m4K19M5mq3j1J26j78J55rO6n3lO8k45k3
4989h1q6K17j01J96l82M4L19k22J63j23K1O0K8J2j45L28k59j39pJ92p3K5j48L02
5013A41o7J53j2j93Q9j07j7J35j89Kj0N5M4P2j17R7j28n1n6J23K11k99L38n2m62
$$ plain form
4846 215 -348 55 129 -130 21 -85 -165 48 278 -32 101 2 -173 6 78 -181 -39 242 -40 -74 98 -187
4868 -187 -211 -199 176 9 -79 -194 -169 -95 113 -190 -166 -26 -28 77 -51 -92 -32 -107 -17 21 57 155 204 -176 134
4893 134 122 113 127 -108 -149 186 -14 140 113 165 23 10 -51 134 -35 -8 63 -179 100 -192 -119 184 -102 57
4917 57 193 -136 149 -218 87 -68 208 56 66 1 -1 -276 -26 105 85 375 -49 -74 197 -158 -113 109 -86
4940 -86 114 -255 35 18 -104 169 -83 248 11 215 73 5 102 13 -86 146 -110 35 120 53 -146 -58 -3
4963 -3 -139 54 120 -52 129 154 -166 -9 82 -107 -151 68 113 109 26 15 141 -37 118 109 175 122 119 187 -58 -81
4989 -81 -167 50 -51 145 -237 -193 126 -96 67 -56 -35 25 53 65 -80 248 -11 -150 -157 35 -38 -13 -161 141
5013 141 74 227 215 22 111 4 -13 122 -67 -65 -75 -20 24 96 -21 76 -52 -103 -159 -36 175 -124 214 162 -300
5038c00J58J84l29J84K3K46J39l54k2p3J68r4J47m0k00l1pL68p9j24OM0J42m45
5062b93J93o8K45l5j48J17P9k69J39mr5J33Q1L3J9k2O8m20L87l4J11m25R0J28
5086A0lq2L8N5K8l1j42L00k17J08nj6J71R5n25M23k62O0M2m9k34J88N1j70K99
5111A32l01J89M5o1n4J6j96K54J59k64L6M9j23K50j4p7K8j5J3j75N5J57J41k08
5135C6J47k67K83j79j76K99k11J59n0k46J83q9J00j6p3K7k7L09k64P5K10l30M6
5158e4p4J18j44J66j11oJ69j8o2l7J95j80j6J93o6O5M7j31l1J67o5j17k3j60M59
5183B84k71O1o2P1k22K66p3j61Q9O0R8K0k12M2k38J50O9r7K93j60J67l70R6j11
5207b11J35p2K65j77Q3N6q2n9L01L4r2j76mJ55k63J24k91J79L95j43k7o4J6k14
$$ plain form
5038 -300 -142 42 -287 -103 -80 166 305 -49 -71 -144 24 -70 77 37 -163 -194 -201 167 88 -36 -30 10 152 -293
5062 -293 -100 -168 77 42 -106 11 90 -179 -40 -44 -139 -6 75 108 127 105 173 -247 140 106 217 -208 -118 10
5086 10 7 -75 -37 18 46 15 -127 173 -44 64 59 43 214 309 -216 207 -55 5 47 -2 -236 -48 3 -167 132
5111 132 -169 20 65 4 -50 -34 -230 24 183 -81 -45 4 -119 131 117 40 68 53 66 -109 -54 103 244 36
5135 36 183 -84 199 20 -156 143 -68 91 41 -205 -22 -111 -11 -27 -100 -73 -100 209 -55 20 230 -100 -54
5158 -54 -128 -10 -154 12 -99 -105 64 46 -16 -53 142 -38 -54 139 73 138 185 54 23 190 125 8 -15 -175 284
5183 284 13 74 12 83 -139 127 54 -107 -18 42 140 160 -52 -10 -248 -98 -29 -126 167 7 174 -196 -100 -211
5207 -211 -76 -148 117 -60 23 79 -3 -62 239 273 181 5 1 156 -107 17 -274 -95 300 157 130 66 82 -132
5231a32J79P8j91K53m3k31J96J26k62j40J61pQ0j16M6K83m52K31j3j37n5J9J26
5254aM8j06J79P1l08J38k27K41P6p7Q3O1n02K35kL67l57L6L0J19q9l17K88L37
5278C23l17q5J01j58k0K96k09Q5l00J88J30j51oJ71j34J91n0M9P9j10M4j93r0
5301a66J69J13j53O0L3K07m14J75o1j24J38k3lmK66k80J57O2r5j02m7K35j63j50
5325a70PK39j17P2k40K25jK7L3k02M9k16QK63R1j1L21n32J15J29P3l64J38o7P3
5350e7K42l19K15M3J7J3k24R3K0r3K0q2L0l9P2m6Pj8n6p6J19M3Q3j57K19j91J42
5377B0k1p4K76k54k93K35J30P2m12M29k22J00k24L44P1k31m7J10K31j63k53O6
5399a10J10r0j4mJ73o7j07M30k42j24J15k72J37P0j57K04m0M4j95J3J50j9J9k
$$ plain form
5231 -132 47 125 -66 187 144 -87 109 235 -27 -167 -6 -13 67 -49 -3 280 -172 59 46 -91 -146 -127 -1
5254 -1 47 -59 120 191 -117 21 -206 35 111 34 117 178 -324 -89 -91 276 -81 -45 -15 104 15 -302 -14 323
5278 323 6 -79 22 -136 -156 140 -69 16 -284 -96 34 -117 -123 48 -86 105 55 104 183 73 117 -76 -166
5301 -166 3 116 -37 23 56 263 -151 24 -37 -161 -23 -46 -49 -53 213 -67 90 152 57 -45 -92 143 -20 -170
5325 -170 -163 76 -41 31 -209 16 15 42 75 -127 -78 -294 -286 -23 68 57 378 -154 -39 90 163 -201 -63 -130 -57
5350 -57 185 -134 81 124 141 154 -70 23 43 -50 -30 -112 -82 -121 -49 -95 -88 -106 -162 -238 -119 -76 7 -150 69 -122 20
5377 20 -1 -75 201 -53 -346 -111 19 91 -321 108 -114 -14 -238 106 177 -54 -101 9 240 77 -176 -110
5399 -110 0 -90 -104 -108 65 -2 -109 321 79 -45 70 -202 -65 5 -152 52 12 56 -139 -126 24 5 24 22
5423B2k03J22J09j76rO1j29p5L19no8J8l0M9j35M59k73m1J36J0j49K07j34L5o6
5448E4q0K7J06J02k14J33j25J87k4lm5k06n8m6L02k93M37k99p1J3j3K00J30j87
5472B7l9J91k28J03q8Q7j4j11J85n3K42k09j42L5j31J50q9J62o9J80J3o8j00j23
5496h9K15N2l08M41l71K7%Q5Qj42j2J96k26K26k33K81L3k59J8Q1L34m10l7l5M0
5521h5Q5O2k83L39r8k79K34J69j16M3j60L39j71Oo5k73J96J47l16k0K31j30K9
5544a16O1J37K53l27nj02K57o2j06n5nK4L8Q5j0j30k03K37L5p3L80j28o9l42K04
5569b2k0Q8j17j83L73n0q6j6PJ21l1Ll00J16L35r1p2n5j32K11j48l8J57J13k93
5594a30J22j53J98k00L23k03K24k28j59L17j26m2k35K46Q5o0k14O7L34N8q3m01
$$ plain form
5423 22 -181 -59 50 -126 -135 -74 -203 -278 41 36 -32 -14 -44 5 -130 329 56 15 151 161 12 219 85 120 54
5448 54 -26 1 107 209 -5 128 3 190 166 163 118 -88 -146 -192 110 -183 254 -45 -116 -103 -116 84 214 27
5472 27 -12 179 -49 54 -34 53 39 -72 113 60 302 93 -49 -14 -145 5 -84 78 9 189 202 134 34 -89
5496 -89 126 178 -130 311 -60 -33 -33 52 60 -82 -94 102 -124 102 -131 150 183 -76 -58 23 357 -53 -90 -125 -85
5521 -85 0 62 -221 118 20 -259 -25 144 28 71 -89 250 79 85 20 -253 -57 90 -226 -246 -15 -145 -116
5544 -116 -55 82 335 8 3 -99 158 96 -10 -65 -70 -46 -8 77 67 -63 -266 -29 6 -67 313 185 116 -226 -22
5569 -22 -42 46 -71 -254 119 69 -17 -33 -26 95 64 67 -233 -117 218 127 55 0 -132 79 -69 -107 50 163 -130
5594 -130 -8 -161 37 -163 160 -43 181 -47 -206 111 -15 -57 -292 -46 39 -21 -235 -168 166 224 141 -260
5616b60K41j83L32l17N4J81R8k01K56l00J27j19K2K38j76j91K76j91p1L15j28
5637Cpk49K28J19m8j9J87k17J75k22l1l4KJ26M5M4N7Q6k64K2J45j77J53m6m6j51
5663a19K29k32J37J74j97M2m3K5Q4k70J32j22l9K50J2K9k36K6L92k77L5O1j01
5686hj90L81L4m84J84q3N8K82p7l2j02r9K96j97j40J13L6O3K15j18k4J3n9J70
5710B32j07l8j44J1l3n8K31l39K05l9n6J95j33q3J81K8l20L81k13M14j17j06j46
5733e4J33j09J71K70n59k2L07l51L59J87j98k99J94J14l86J75K6j02K65P4l47
5754a52J77j80j42L75j49j25J77K0j4L3Lj35M3K38J2l32O0Q3r5J48q2j20K7M0
5778i0K72l24r4K44J69k40O3R4l5l18L56j85J48l1j84L72j90jk18J12J26Jp0j1
$$ plain form
5616 -260 -19 -202 130 -187 -133 48 146 -55 201 -99 28 -91 -69 169 -7 -198 78 -113 -184 131 3
5637 3 -4 -253 -25 94 46 27 214 -3 172 -50 -81 -115 -113 13 58 102 159 245 -19 3 148 -29 124 78 32 -119
5663 -119 110 -122 15 189 -8 34 -9 16 100 -170 -38 -160 -199 51 63 92 -144 -118 274 -3 32 93 -8
5686 -8 -198 183 217 -267 -83 -166 -108 174 97 65 -37 -136 160 -37 -177 -64 -28 35 250 132 108 121 62 232
5710 232 125 87 -57 -46 -79 -137 94 -245 -40 -79 -135 60 -73 -156 25 53 -267 114 -99 315 198 92 -54
5733 -54 79 -30 141 411 -148 -170 137 -214 145 332 134 -165 29 143 -243 -68 -42 -144 121 195 -152
5754 -152 25 -155 -297 78 -71 -196 -19 1 -13 20 23 -112 -69 169 181 -151 -91 -8 -103 45 -37 -157 -130 -90
5778 -90 182 -142 -236 8 177 -63 0 94 59 -259 97 -88 60 29 -155 217 27 26 -192 -80 46 47 -23 -34
5802c4r9J29L8l70L32qq9J73L0k89J19K97l70L86l36k1K58j4k41L45j76j61k23
5825c24K65K98N7o07N05l75J90j5L2j3j20k09L62Jk7j11O1L74l24J08P5j34m0
5848B9p0M2j31K68l01L87m07J22J67j26Q4R7l24J03m8K5L12j22m38M49j94j77
5870b53K16J64J73j86k48K00K53l06J94k56K21k32l9p6K71l8K7K11l10L7p3NL3
5893a2L8J06J00j62q6j32K30j53q2J86J47j43j58J90q0L42l81L53l11L2j92K16
5915D8k78L86r7j07n5p8J50j33M6k5J31mj87N47k10j94L1O0j51J40J13k00N3P3
5939E9m21L91Q8j9k96J43k5q4M47l42K98j75k57k11K77Q2L6J86J29k22l4j80L54
5962B24j13j01K29l75O1J28k45L35L0m9R8k47J01j46OO8m6m8J18n1Q9k20J03R1
$$ plain form
5802 -34 -133 -4 34 -336 -4 -12 -101 72 102 -187 -68 229 -141 245 -91 -112 146 132 -109 236 60 -101 -324
5825 -324 -59 239 296 -311 194 -181 9 -6 26 13 -107 -316 46 47 20 -91 -30 344 20 128 203 69 29
5848 29 -41 1 -130 138 -163 224 -183 -61 106 -20 64 161 -163 -60 -108 -83 229 107 -331 118 -76 -253
5870 -253 -37 127 300 114 -134 66 319 13 207 -49 172 -60 -99 -175 96 58 85 296 -14 23 -50 -45 -12
5893 -12 26 132 232 70 -16 -148 82 -71 -153 33 180 37 -121 69 -11 331 -50 303 -8 24 -168 48
5915 48 -230 156 59 -48 -103 -181 -31 -164 -118 -143 -12 -16 -203 344 134 -60 -29 31 -120 20 133 -67 -14 59
5939 59 -362 29 117 98 -198 -55 -80 -164 283 -59 239 64 -193 -404 -127 -45 -9 177 306 84 50 -130 224
5962 224 111 10 239 -136 -75 53 -192 143 173 124 222 -25 76 -70 -64 4 -42 -90 28 -23 66 -154 -51 40
5986D0m5O2p6j50K69m1n4k5r7L55k51p8K31j85j15L35l32L29l49K39j23j02J64
6009Aj53K53r7K5j36K38n67L43L63j86o4J21k93J82j64J12Nj8q0J19P6qm58M17
6033C1O0m8N9l20L58k03J38M0j52J58n7j11r4p6L76r8k7%k05J51NL1J74r7j00
6058gR2l03N36j56j21r4J01l8P3q1J45j99J03J2m6k84M58k21J6%R5j4j29J21l28
6083b69J50L08p5k70P8l4j04K40j01K53k22n8J06n0nQ4p3J11J03k45K5j2N6p5
6107g9J55l34K11N3k41K73M1k01O1J37k52K43J42l38J10Q6k36J18j4J22j06PK27
6130A85j5k2j72M6J34n7Q2l6m21L24J92k96K97l03K97j96k28J51L0l6J83k01J29
6153F7l29K40J25k10K48j17J45k71J74J67l53J54P3j05LM8L4k11j3R1K12q0k5
$$ plain form
5986 40 -5 57 -19 -169 100 59 5 -20 -117 238 -13 -91 140 -45 -160 175 -157 172 -177 62 -61 -163 1
6009 1 -152 101 4 29 -107 131 -436 -93 270 84 20 141 -152 30 -134 -22 -17 -35 -115 4 80 72 -386 31
6033 31 91 43 102 -218 140 -63 75 115 -37 121 64 -47 -141 -217 159 61 34 34 -171 -20 -15 16 190 93 -7
6058 -7 85 -218 318 162 41 -53 48 10 83 2 147 -52 51 63 17 -267 191 -30 -14 -14 81 67 -62 59 -269
6083 -269 -119 189 114 -156 -78 -112 -216 24 -77 176 -46 -104 2 -48 -53 31 -42 69 172 -73 -48 -60 -4 -79
6107 -79 76 -258 -47 6 -235 38 79 -122 -61 76 -176 67 209 -129 -19 67 -169 -51 -65 57 -49 -42 185
6130 185 170 148 -24 22 156 99 181 145 -276 48 240 -56 241 -62 235 39 -189 -38 -8 -44 139 -62 67
6153 67 -262 -22 103 -107 141 24 169 -102 72 239 -114 40 113 8 11 59 93 -118 -131 -40 172 92 67
6176F7M6K8j66j2N1K5J69j57j05M0O3Q1k79K83j15p6J8J39m1j05J23l4l13K17
6200e3q5J14Kl2J5J01m8Q2k18J90k73J96R3l79K63r7R9O9Q1j28qj7k7J15p8q3
6226a06L6l0O5j0k7K1NK8j43J66k2j13j68K85K29j30o7p0J89l88L95l46K82qO8
6251A41Mj14N9k78K90r6L0J10j15J09o1k16L9K5K24Jm1k63J80k41k8K48j60J56
6275CJ00J6n9k18L07j63Kj65J89j25J5K44k33j03J32L8J44k25J35r7J78k06k1
6298a12J81m35M79J84l64P8j16M4m9P6J18l6J04r3q1J71k59K9J94k7K0j69pjO7
6323dm7K41l44K93j82J8J05QJ32r2j22j85R9j19M17k85J00j67L88j50k85J32j62
6346b11rJ87m7n3j17L25J03j37J59j34j42J32k29J79j24K10p9J9J26j27J13R3
$$ plain form
6176 67 113 141 -25 -37 14 39 208 51 -54 -14 49 130 -149 134 19 -57 -39 100 59 -46 77 43 -270 -53
6200 -53 -138 -24 -22 -54 -39 62 14 96 -122 68 -205 -9 84 -295 -32 -129 -30 39 120 -8 -16 -33 -60 55 -23 -106
6226 -106 -70 -100 -35 -45 -72 -51 -46 -18 -161 5 -17 -130 -298 -13 216 86 19 -51 138 -250 145 -201 81 73 141
6251 141 145 31 90 -188 102 6 36 146 31 140 79 -137 -98 -73 151 152 111 -152 28 -213 -241 7 -153 3
6275 3 103 119 60 -158 149 -14 -12 -177 12 -113 -98 146 -87 -190 -58 -20 124 -101 34 -63 115 -91 -112
6298 -112 69 -366 113 297 -67 11 -105 -61 -110 -34 84 48 152 59 -22 149 -110 -81 113 86 106 -63 -70 -71 -4
6323 -4 -51 190 -154 139 -43 -25 80 88 220 128 6 -179 -80 -199 218 -67 33 -134 254 104 -181 -49 -211
6346 -211 -220 -33 -80 -133 -250 75 178 41 200 66 -76 56 -173 6 -118 92 13 32 158 31 144 237
6368B37l5l09L99l08M8o9J15m4q2M0M9n6J16j20j87Q7O2K67m19L84k88j4K38j73
6392f2P2k11N9J30j84J97j01r9J30k2L9j29L7N8KQ1P4j39n1J57j04j41N06m75
6416a76K80N0j00J61j51j69m9J88j03%k5J9lQ2P2J12j41j08n6M34m46m4J35j64
6440b02J29P2j22L55k03J0p9P7j49QJ38l1j07K44j98J8r3K89j19Pm4j61OJ25q6
6465a16oK02N5j37p6Q6Q4o7j30J08P9L46l32J37m80J89m1M1j5pL4K20l06L55j29
6490I4Kj82L04l25K9J45n5j65K63J00l19m3L08j42j35K18l6j04K6j8J92j18Qp5
6514b8O8N5j11OO8p7J04J38l74J85p0N9p5OJ04J88j54J43k22K66m65J25R3p6m1
6539h5M1J09j15%R6J28k52O8O8J40P7k61J6j91J52M9k9J04j4n8j26J18j87J18
$$ plain form
6368 237 202 -107 292 -16 32 -37 78 34 -48 -8 41 -15 101 -19 -206 -119 -57 210 -209 175 -113 -127 111 -62
6392 -62 10 -201 -142 -12 -196 1 -100 -199 -69 -91 -52 -181 -144 -86 -84 -3 71 -68 -119 38 -66 -207 299 -176
6416 -176 104 154 54 215 64 -105 -154 34 -69 -69 -94 -75 -78 4 76 188 47 -61 -117 317 -129 -173 -38 -202
6440 -202 -73 -1 -123 232 29 39 -40 37 -112 -104 34 3 -104 140 -58 -40 -133 156 37 44 0 -161 -155 -30 -116
6465 -116 -122 80 135 -2 -78 8 92 25 -105 3 82 428 96 233 -247 -58 -99 -58 -73 -80 -46 174 -132 223 94
6490 94 96 -86 218 -107 -78 67 12 -153 110 210 -109 -152 156 14 -121 97 61 -43 -17 -35 157 39 47 -28
6514 -28 40 95 -16 -10 58 -19 85 223 -151 34 -36 23 -52 -46 58 246 92 235 13 279 -186 -61 32 -44 -85
6539 -85 -44 65 -50 -50 46 174 -78 -10 58 198 275 14 30 -161 -9 40 11 115 101 43 -83 35 -152 -34
6563c4k8J83l01K06l38J18J36J39j81R9j8K10j22O3O1q2j56r8K5K62j20O1O9k65
6587a11o1K46K93j83k18o7J70k99j1J77J34o9q9J8l4O8J97j75K5o3J08K0o3l4
6611b1kj5j63J43K43l22J13J86n2j89j25K08J36l43M65k91J19Q1k30J3K2p2r1
6634a87J17J02J37j04Q9J02m30K96j11K30l23O1L1j4k8J23P8j49J32k14Q1m7R
6657a9n1K45l85R6K0orP3r8Q7m5J93Q1k32K24k24K08j19P1J00k07J48k38K33k63
6682a17L06l35L51m26r2L66J65k57k9J01Q1Pq7q7k3L50j77j28o7K51j69l2Q3J3
6706D8j64J0k22J10L31m48L50K8j47L34k50J13j41J25M0p0J96l76K81q3K0l7k40
6729a92QON7j34J42J06P3q0j42n6L35j07j48J33M8K43m60J47J21J0k64J1K25j02
$$ plain form
6563 -34 -62 121 -180 26 -312 -194 -58 81 -100 -1 -19 191 69 132 193 111 -45 -143 -118 144 24 85 154 -111
6587 -111 -172 74 367 184 -34 -101 69 -230 -241 -64 70 1 -88 -70 -104 -36 161 -14 11 -52 56 76 13 -21
6611 -21 -23 -38 -201 -58 185 -137 -24 162 110 -79 -204 4 140 -203 262 -29 90 171 -59 -46 -24 -96 -187
6634 -187 -70 32 169 65 154 256 -174 122 11 241 -82 -21 10 -4 -32 91 169 20 152 -62 19 -28 -19
6657 -19 -70 175 -210 -114 -94 -100 -109 -36 -134 -47 -92 101 182 -50 174 -50 158 39 110 210 3 151 -87 146 -117
6682 -117 189 -146 205 -221 -313 53 218 -39 -68 33 114 121 34 -53 -76 274 97 -31 -98 153 -16 -48 35 48
6706 48 -116 -106 -328 -218 113 -335 15 43 -104 230 -20 93 -48 77 117 47 243 -133 148 65 85 48 -192
6729 -192 -184 -178 -121 -255 -113 -7 66 -14 -156 -212 123 16 -132 1 49 292 -168 -21 100 110 -154 -143 82 -20
6753b0j57J8L64j22k18J46o3k13L58j02J35k29K94k73k7K18j28J12p4np8J61J1
6776A08J06j46l08J20MN3K29j38n8m2J49q3J54k54J57k09M3K99k30k0j03J24j19
6799a64K05j37J13P9M5j97n4N7K57q9Rk73J80J10k76J59K8k23R6k7J13j09J68
6822G0k25L09q4j35M4R6L4lj63K7J64k96J20R8l3j14J37P1L8J12k66J8q5R3O6
6847I3k7q1Q4j81K78k04j13j5L54k93L55j75R5j39r4K23l11K11k3J06o6p5r1M7
6871d2j07R9j81J53M2j48K78R8j42k77J84L9J4k33K95Qn2K16l95M5K44k11L9r1
6895a25pL61j87k53o6L74l13K14j25J23J41lj14J52k41K89k76J67J45k12J25p5
6917I4J68l91K49j00j37J22k30M19j61n1J51j08J81m06M98l65k60K73J4l0R7j35
$$ plain form
6753 -20 -177 -159 205 83 -135 11 -52 -265 93 -9 126 -103 191 -82 -109 109 -19 93 19 14 -64 97 108
6776 108 214 68 -240 -120 -116 -63 166 28 -30 -72 77 -6 148 -106 51 -158 -115 184 -46 -66 -169 -45 -164
6799 -164 41 -96 17 96 141 -56 -110 -53 204 115 124 -149 31 141 -135 24 52 -171 -75 -102 11 -98 70
6822 70 -155 154 70 -65 -21 75 109 106 -57 -30 134 -162 -42 56 23 -91 46 117 155 267 1 19 -66 27 93
6847 93 66 -15 69 -112 166 -38 -151 -166 188 -105 250 75 170 31 -63 160 -151 60 37 143 77 2 -89 -42
6871 -42 -149 -50 -231 -78 -36 -184 94 192 50 -227 -43 -4 10 -223 72 80 28 244 -151 -106 138 -73 -34 -125
6895 -125 -132 229 42 -211 -277 97 -216 -2 -127 -4 137 134 20 172 -69 220 -56 111 256 44 169 94
6917 94 262 -129 120 20 -117 5 -225 194 33 -18 133 25 206 -200 298 -67 -327 -54 -40 -70 27 -108
6939a08j18K33J08o4j96K53l0o5k58J7L12j09j48K30j77L16j46l98J02L50m1n4
6961IJ13k99K53J40k13r0j71K68K1l02M55j46j43P5R8j63O1o8N5J31n5r9r9J85
6985A6k63M55j10k61J20qr7j0K75m18N66l83P1K60l45J72j30K07j38J6l8Ko9J87
7009G7l4Q1Q9j73j82LJ84l62L63j07M1J22k56K15Oj11l5J43j92J10j28j9Q4L16
7033B35k38%p1J22K71l24j23J28k89L64J26o6k71m6L44k12j13o6N08m58L8K53
7055A12k17K43q5J81k92J14n8l7M3k4J05j35n9K61Ok99L74j67j62l8J81K79l33
7078gL42k75R7j1k08r0mK29q7J42j19j08J79o0J96j94P7l9k11K35K7k96K27k49
7102b07J27L66n28K9O5K42k40J09r4j6J83J19l9k25J15j87K16n9R8j38K2J39O8
$$ plain form
6939 -108 -226 7 115 51 -145 108 78 13 -245 -228 84 -25 -173 57 -120 196 50 -348 -246 104 63 9
6961 9 122 -177 76 216 3 -87 -258 10 31 -271 184 38 -105 -30 68 -95 -34 -102 -47 84 29 -70 -169 16
6985 16 -247 208 98 -163 -43 -51 -148 -158 117 -301 265 -118 -47 213 -132 40 -90 117 -21 -5 -43 -41 -110 77
7009 77 43 124 213 40 -142 -139 45 -317 46 -61 -20 102 -154 61 67 -44 -79 64 -128 -18 -146 -165 -81 235
7033 235 -3 -3 -74 48 319 -5 -128 0 -289 75 201 135 -136 -182 162 -50 -163 -229 279 -179 -141 112
7055 112 -105 138 53 234 -58 56 -2 -39 4 -20 85 -50 -109 152 158 -141 233 66 -96 -134 47 326 -7
7078 -7 335 60 157 146 -62 -152 -156 73 -14 128 9 -99 80 20 216 22 99 60 -151 84 111 -185 42 -207
7102 -207 -80 286 -242 -213 -148 94 -146 -37 -131 -147 36 155 116 -109 6 -181 35 -24 74 -64 -42 97 165
7125A65r1l6k37J96j91J20J06N7K8l5M1k04k0J30n2k9R4N1m9j68N5j70L67k79
7149a51J01J07Nk44K01q2K77l86L91j88Q7q3J22J9j95J42M6Q4k20kq4J34l45K91
7173B7q6J40k05o5K91j73M4K41k27J20j70J56J06k51K35l23L01m9j43m0j1q9k
7196a73J60j20m1K14R4j78Kj31J67j06L1J02J6J36k35K42n0k28J06O4J20j94Q9
7219H7qN0J02l84O2M7j65L77j80O1K4j71J52m12M95k42J54L2k8p9j21K45k57M4
7243a15K50k39O1pkK4K4J43l02J6K46j14J07j87q6J99o9k7M5K4knJ80k61K27j52
7269b2L2j31q2L02j32J71K6K1k14M3j75K13Q2j90K88k4k45j76J78J49m2j21J09
7292F0R5l10J34l0j7n6K00l14p5K02J98j29L5J41k80J39L76l33J54J0k15R6j45
$$ plain form
7125 165 74 38 -199 -3 -194 -74 32 89 117 82 123 -81 -101 29 -23 -52 42 93 44 -124 -69 -239 128 -151
7149 -151 -50 57 62 -182 19 -63 214 -172 219 31 118 35 157 176 -19 123 169 253 33 31 -53 81 -264 27
7173 27 -59 81 -124 -189 102 -71 -27 214 -13 107 -63 93 199 -52 183 -140 161 112 -31 -71 -82 -171 -173
7196 -173 -13 -133 -174 40 134 -44 -42 -173 -6 -112 -81 21 37 173 -62 180 130 -98 8 72 192 -2 87
7219 87 79 129 231 -153 -91 -44 -209 168 -12 49 73 -98 54 -358 137 -105 49 81 53 -26 -147 98 -159 -115
7243 -115 135 -104 -43 -50 -52 -28 -4 139 -163 -147 99 -15 92 -95 -181 18 -51 -78 -33 -9 -11 -16 164 -97 130 -22
7269 -22 10 -121 -203 99 -33 138 164 185 -29 14 -161 52 134 -56 232 208 -37 -213 -35 114 72 -49 60
7292 60 155 -155 -21 -51 -68 -124 76 -238 -313 -111 87 -42 -7 134 -146 -7 369 36 190 200 -15 81 -64
7315f4L00j25o5j94P4J25J50l27J8J12J10k33J01J6j23J23j32N5J30j65K03n26
7337d37N10J77j3l01R4K7j56j9K2j59M98n56L94m4j02j20L47Pj95j84K09J2o0
7360d9L47m47q3J18mm9J17m3j07R0K53p2j63L3K83l82p5J51j16J54j03L50j50
7383E3J23m52N07m60R3J82k70J12P0m3K53j77k41J66J52R9k54J31R0k41P8j35
7405a64k0O3J47p2qJ80k61M0K91j92J69q8k20N8%o2J10p7J01L35k77k55o8L92
7429A22j50J52l17J40J84j69J24n3k31K10o6JQ4j5M3k13J80j8j70J72M0m3M5q8
7453c6J04N9n2j04o5k8l55M85j07N5P7r9L00k23J20n1j49M2j97N10m25M02k75
7476a2K82J5k02k03K75j19lk19J37J73j28j05J4P2M6k69J92J74j66K15j54j39
$$ plain form
7315 -64 236 111 46 -148 -74 51 201 -126 -108 4 114 -119 -18 -2 -125 -2 -134 -79 51 -114 89 -437
7337 -437 73 250 237 -64 30 57 -99 -118 -96 -255 243 -313 81 37 -65 -185 162 169 -26 -210 -1 11 -49
7360 -49 298 -149 -232 -114 -118 -167 -50 -93 -200 -110 143 71 -92 -59 224 -158 -233 -82 -198 -44 -147 203 53
7383 53 176 -276 231 -229 -136 46 -224 -112 -42 -85 168 -9 -250 -84 68 167 -87 44 134 -107 -29 -164
7405 -164 -184 -121 26 -46 -54 126 -135 -95 196 4 173 85 -135 -77 -77 -139 -29 -106 -5 330 53 -202 -270 122
7429 122 -28 124 -193 -53 131 -38 86 33 -198 12 -54 -53 31 16 59 -154 26 8 -162 10 50 7 52 -36
7453 -36 68 127 75 -29 -94 -122 -477 8 -99 -44 33 -66 234 11 131 80 -69 -27 -224 286 -139 263 -12
7476 -12 270 285 83 -120 155 36 33 -186 -49 124 -4 -109 -95 -23 23 -246 -54 120 -46 169 15 -124
7498a24L73k22k42R2L2J40J5j07K17k10j54K25j63Q8j21M83j07k82k9K57k07j00
7520a46L54k54K15j01J75k40Q7j19k9J98l2j49l55L01K29l6Mj1n4j69L0J89j55
7543f8J23K38j91l04K10r3M5n6K73p2j46L6J14k86j0K06m5j50J79L58j36k65J
7566c9J68k84K98j72rJ36j31j24K49k07k15K68J71n0j5j33K48j73m8K30l31K89
7588A26O8k81J61k9j16J85j15j17N8l2LJ50k5j73k6K2J31j79K52j6J1k51J87M7
7612D1J14m0j01j4l9q7O1J28j89J69R8m18K40j73L50n0r9J0LPoQ2m9j43L1k1K82
7639A87l06M0J98j27J44k02Rj22j9J16L23j64n3L2l7K21k70P7K8j12j72M02k27
7662c4qQ0P3k3k3r5R8J13k34J06q2j18N65m17k17J25J43K2j58J22J6j17K9L24
$$ plain form
7498 -124 249 27 -215 -123 -91 49 64 -43 174 -36 -190 35 -128 -40 -161 322 215 -67 -96 161 -46 -146
7520 -146 208 -46 169 68 243 3 90 -29 -58 140 108 -41 -396 -95 134 98 102 91 37 -132 -102 87 -68
7543 -68 55 293 102 -202 8 -85 -40 -96 177 105 -41 -5 109 -177 -187 19 -26 -176 3 361 225 -40 -39
7566 -39 129 -155 143 -29 -38 98 -33 -157 92 -115 -330 -62 109 59 44 -89 159 -14 -62 168 -163 126
7588 126 194 -87 74 45 -71 114 -1 -118 -60 -92 -89 61 36 -137 -163 -141 -10 -189 63 47 58 -193 -6 41
7612 41 155 115 14 0 -39 -126 -65 63 -126 43 141 -277 -37 -210 140 90 -9 1 4 11 5 87 38 -105 -74 -95 187
7639 187 -119 -79 119 -8 136 -66 -57 -179 -198 -82 241 77 24 56 19 240 -30 47 75 -37 -209 193 -34
7662 -34 -42 38 111 88 65 -30 68 181 -53 53 -29 -147 418 1 -216 -91 52 74 -84 38 54 -63 -34 290
7686B90l38lJ06J75k42L4j15J40j52K90j86j32J47k48K95K23k76K1O8K00l03j7
7708b3j85J98Rnj55J23P7j61k6L72o1k11L2l5L4J91j21r0K2K5N1k2q5L3J33m5
7734G5j44L24k29k3K1j57m3N4J20r5O2q4r0L32j58K93j91K1M9QQ1k72kn2K12k01
7760h9J69Ll94M01R0l21P4R9m9Q7O4k68K96l8l14K25j28M1j4K00j36K9J9J01n2
7785I5j38P4o7o3J68j49K41J44k25l65J62l7J08Q5k65L05R3k61K44j81o5P6p1
7808i2J36J4kO8m00L26p0K35j06P7j97Q5L7Kj12N5j14j21o3K95J36J3l6l93J35
7833i2L84m10J05k90M64l22J76J76j81k28K92j20j29K66r7Q9q1j25J6n3O6J40
7855D6j69L89l75J41l9J45j20l2J99m00J78r8J07l8jM4M6J12j73M2pJ05k31R3
$$ plain form
7686 290 -48 -51 55 230 -12 22 -93 47 -105 185 -1 -133 14 -234 61 284 8 29 97 297 -6 -23
7708 -23 -208 -10 -1 -6 -161 -38 39 -122 -148 224 163 -48 -16 -51 -17 174 53 -37 -15 10 61 39 -46 -13 120 75
7734 75 -69 255 26 3 24 -133 -176 -122 -2 -97 -35 -119 -209 123 -35 258 67 88 137 145 226 -46 -48 -100 112 -89
7760 -89 80 83 -311 90 180 -141 -67 32 -17 70 134 -134 162 124 -190 35 -93 -52 -66 134 -2 27 46 147 95
7785 95 -43 31 -36 -99 69 -80 161 305 80 -285 -123 -160 -52 33 -232 73 166 -95 149 -32 -97 -21 -92
7808 -92 44 58 56 124 -276 50 -20 215 109 186 -11 74 111 113 1 56 -58 -179 -242 53 189 202 166 -227 -92
7833 -92 292 -118 -13 -303 161 -161 15 191 10 -218 74 -46 -175 91 -6 83 2 -123 -107 -160 -94 46
7855 46 -123 266 -109 32 -7 138 18 -14 185 -215 -37 -135 -28 -66 -67 -23 23 135 -38 4 -3 102 -129 -36
7879c6K37l95Q5j74M23j76O3k1K78k61j07L13m59L84l74J98Q6n4j52PJ68kJ28
7902A59q0r1l9m6O6l8J55j23J46k11n9K90j76J01j92j13J82m5J40Q9M5L6O2j06
7926A52l75J11k8J43j44K04L1j89M49l99K88r5k72Q7K2l62M35l10M35j86j45J56
7948HJ41k10j01K19Ol5p2k5Q9j03nL44m74J18L8j2l1P1l4O8j65J93j33P6k50M15
7974A36j62J9j54J61j29R9q8K49m4j55L24m69J20K61j00rj28M2J62p9K37m18K41
7997A16k70K47Om7m7P9k87K38Q1l45L00p9j31K92p0O2j67J71j78J6p3j79K35L79
8021C49m47O1m7o2K65k17M8k05J92J23l7R5j65j05Kj12K26q7K28j76RK09j98j04
8045a55K58l6m13L11L16r3J71k88j08J80q2j52K23J02l06J30j5J33j85J3N4L0
$$ plain form
7879 -36 201 -194 -109 -283 140 -36 27 6 284 23 -84 229 -230 154 -220 -22 64 10 -142 -135 33 31 159
7902 159 79 -12 -51 -97 -31 -69 86 -37 109 -102 -161 129 -47 54 -138 -251 -69 -114 26 115 160 196 258 152
7926 152 -223 -112 -140 3 -141 63 94 -95 354 -45 243 148 -124 -37 -15 -377 58 -252 183 -3 -148 8
7948 8 149 -61 -162 57 63 28 -44 -69 20 -83 -88 256 -218 -100 -62 -74 -105 -34 -68 0 -165 28 -105 -29 -279 136
7974 136 -26 -7 -161 0 -129 -30 -118 131 87 -68 256 -213 -93 168 68 59 -69 -27 135 56 293 -125 116
7997 116 -154 93 99 52 5 84 -203 35 116 -229 71 -8 -139 153 83 145 -22 149 -29 -13 -86 -265 -30 349
8021 349 -98 -37 -84 -146 119 -98 -50 -255 -63 60 23 118 -47 -152 -150 -262 -36 -123 105 -71 -62 147 -51 -155
8045 -155 103 67 -346 -35 281 188 359 71 -37 143 61 -91 132 234 -72 58 43 176 -9 4 58 88
8067H8k2p9j25J48j92J98p0o9R1K07nj1k59K23o8k03k06M57Mk29J97k86J34J84
8091A07j47J95j05o4M0P3J84m40M3L40j14j69o1J54kk54K79l46K0K5K61N6l5j77
8115a37M0Q7o3K33j00J57k42L3J05m5p3l6J00jJ35j38m9j03J27k8P2j0J53l04
8139h7J74K9k99L18j97m8L7R5J57n0J0k63J51P0k75K33K2k92L29j32J22k65J62
8162Aj87K70k84P6J54j18J56J48l22RR6j79L09k01K02n2j70J65mj25J39j28j21
8185a66K39l15J35J89j67O4
$$ plain form
8067 88 66 -13 -138 10 -182 16 -54 -123 -32 175 170 159 -100 123 55 -148 -354 103 107 -122 75 -211 -77 107
8091 107 -40 155 50 -14 26 99 283 -157 -114 226 112 -57 -118 36 34 -220 59 -287 -267 -242 19 75 40 -137
8115 -137 -97 -10 -73 160 60 217 -25 8 113 68 -5 -41 59 58 193 55 6 -97 30 2 74 64 217 -87
8139 -87 87 116 -183 135 -62 -110 -73 22 179 129 139 -124 27 97 -178 55 77 -215 114 -18 104 -161 1
8162 1 -186 84 -200 -124 30 -88 68 216 -106 -97 -1 -180 129 -72 130 78 -92 73 69 -56 83 -45 -166
8185 -166 73 -242 -107 82 -85 -21
8191b1
$$ Imaginary data points
##PAGE= N=2
##DATA TABLE= (X++(I..I)), XYDATA
0@%%%%%%%Qj6J4j4K4l2L2m0N6p2Q9j13J40j68K02k39K82l34L93m56N29o15P07
30C77q04R20j055J195j348J523j716J924k153K407k688K991l320L683m078M507
46B365m975N491o057O675p352Q096q922R840j0857J1999j3295J4768j6461J8438
60I753k0781K3604k7084L1505l7336M5416n7443P7461j18623L47122p60316l89929
72h76651J414449K31345j051744m35861R02163L67605o61140l49232N28003J13515
82A82452l82294R0468L36493l86997k92391N90416L44901p28645m23308P54761
92H5856O02830p57986p48428P47640Q76384o75329q54494N57506P88972m04711
102B18240o58460K81479N40252j94510l89742J89195K54630k65834j15750L93000
$$ plain form
0 0 0 0 0 0 0 0 0 8 -8 6 -8 16 -16 16 -24 32 -40 49 -64 76 -92 110 -129 153 -181 212 -244 285 -330 377
30 377 -427 493 -562 633 -715 808 -908 1016 -1137 1270 -1418 1573 -1747 1936 -2142 2365
46 2365 -2610 2881 -3176 3499 -3853 4243 -4679 5161 -5696 6303 -6992 7776 -8685 9753
60 9753 -11028 12576 -14508 16997 -20339 25077 -32366 45095 -73528 273594 -486722 -876651
72 -876651 537798 769143 -282601 -718462 183701 551306 -109834 -459066 68937 182452
82 182452 -199842 -109374 227119 -159878 -452269 138147 483048 -245597 -668905 85856
92 85856 688686 -69300 -817728 -70088 806296 130967 -723527 -166021 622951 218240
102 218240 -440220 -158741 381511 187001 -202741 -13546 241084 -24750 -140500 252500
112B52500k4634n32945J16515O13409j34533o70067N3607O99002L2379p52211
122c46978j23868P44724J62087o90536j72404N76877J29485m60216p8138L41814
132H2847J9597k66889N0914K63884j40498k95675K69387L43203l68029l63610
142d04869M21186M03109l86997m29209L42404M72056k81633m89472K37889M81917
152C66381k00774m17016J93430L11913j95370j99205J87957J05456k05446o8932
162a21606K50239M7608l42351m0587M20793J6573m85018k5521M91131M0736m72013
173b20016p1553M31169R9589l98463j23199L72158J12635l42808n0191L09560
183A18881k0044k53471Q4132K20666j14748k09891J47412K39228j70276k63023
$$ plain form
112 252500 227866 -305079 -188564 424845 290312 -379755 -326148 372854 405233 -346978
122 -346978 -470846 273878 435965 -254571 -426975 149902 279387 -180829 -258967 82847
132 82847 102444 -164445 -113531 150353 9855 -285820 -16433 326770 -41259 -404869
142 -404869 16317 419426 32429 -396780 -54376 417680 136047 -353425 -115536 366381
152 366381 165607 -251409 -57979 253934 58564 -140641 47316 152772 -52674 -121606
162 -121606 128633 176241 -166110 -206697 214096 230669 -254349 -279870 211261 251997 -220016
173 -220016 -291569 139600 239189 -159274 -282473 89685 202320 -140488 -190679 118881
183 118881 98837 -154634 -70502 150164 35416 -174475 -27063 212165 41889 -221134
193b21134K11241K90366k38516k95875K52192K81753k43140k50572K20236K28597
203B35148j99127k27403J89876K12589k14789j87400K38011J39705k57373j04926
213a75689K51540P6904k50431p4813K40626P2595k43380o8365K56027M9078k66987
224a32895j5461K58605k1944k32759N1314K21749n3493k22128N8533K43979o3571
235I1929k57400Q1391K67021q7065k52437R1979K31463p9409k01098O0208J72505
246A19087n0530j51838O4818J31419j01911j07332J37997P1263j75567n5235J95196
257G7367N6151k13996q3143K21873J11870k30833j42232K25519J51974k07781
267c3231j43911J72744J25864j24520j01455Q3868P3308o4412k9134P6376j7523
$$ plain form
193 -221134 -9893 280473 41957 -253918 -1726 280027 36887 -213685 6551 235148
203 235148 36021 -191382 -1506 211083 -3706 -191106 46905 186610 -70763 -175689
213 -175689 75851 152755 -97676 -172489 68137 140732 -102648 -171013 85014 134092 -132895
224 -132895 -148356 110249 88305 -144454 -93140 128609 75116 -147012 -88479 155500 91929
235 91929 -165471 -84080 182941 95876 -156561 -64582 166881 87472 -113626 -53418 119087
246 119087 68557 -83281 -18463 112956 11045 -96287 41710 112973 -62594 -117829 77367
257 77367 133518 -80478 -163621 58252 170122 -60711 -202943 22576 174550 -33231
267 -33231 -177142 -4398 121466 -3054 -104509 -20641 52667 -11745 -40879 35497 17974
278A7974r5094P2393J25809j12471j55582J34971J91150j26935k21552R9231K50982
289A80876n8555k67770K1840K59174K698k24489j9927J68400K8123j09244k6376
300d5250N1917k929j7137M9154l772j09783N400J67825K632k16568k7213K40111
312I4387O1789k38954j03290K17831J43435j83245j63020J45351J56054j02466
322B7872j21683O4563P6838k9642j9955J6387l4429k7098Q3133O3061j16451j10909
334a28313J36509J60427j37201j99331J15873K19253p7792k23664K8002K08611
344A02374J4933j76257m3944J26318M5678p2399k8605J6998m963K8295M9878n3760
356D546j01167N0917J51072k4929j91089j4260K15514N8700k14477r7945J90473
$$ plain form
278 17974 -77120 -4727 121082 8611 -146971 -12000 179150 52215 -169337 -70106 180876
289 180876 122321 -145449 -123609 135565 138263 -86226 -106153 62247 90370 -18874 -45250
300 -45250 6667 3738 -13399 35755 31983 -77800 -72400 95425 98057 -118511 -145724 94387
312 94387 156176 -82778 -186068 31763 175198 -8047 -171067 -25716 130338 27872
322 27872 -93811 -29248 47590 17948 -2007 14380 -20049 -47147 35986 99047 -17404 -128313
334 -128313 8196 168623 31422 -167909 -52036 167217 89425 -134239 -106237 102374
344 102374 117307 -58950 -102894 23424 69102 -3297 -31902 -14904 -19867 8428 58306 4546
356 4546 -96621 -45704 105368 80439 -110650 -124910 90604 149304 -65173 -163118 27355
367B7355J29480j46410j47034R2943J46799l7507j22392n214P7670K9393k0387
378B4696l6790m0804K6803R5281L395j32364n0394J47236J02941j39286j53040
389a52326J12373J88425p2774k02802K7427J94254J8180j66416n7438J22846P9460
400I1209p0185p7043J9497N3015K2052j4602n1457l2585O3971Q1104n5971j22915
412i3910L0769J50920O587j64056m7563J59485Q2234j40174j04518J08071J12706
423A00551o9458j08190L1753Q6303k912n1753j1081J3261J0658K3610K675n5205
435b9788k4869P7768N3517q4809q0118P9304J03832o1425j17828M1195J19141
446G5920k0055j07618L706Q8250O795o4794q912L7131o76j3923J6325j384l8323
$$ plain form
367 27355 156835 10425 -136609 -43666 103133 65626 -56766 -61980 15690 45083 24696
378 24696 -12094 -52898 -26095 69186 72581 -59783 -110177 37059 140000 714 -152326
389 -152326 -39953 148472 75698 -127104 -99677 94577 112757 -53659 -111097 11749 91209
400 91209 21024 -56019 -36522 16493 38545 23943 -27514 -60099 3872 84976 29005 -93910
412 -93910 -63141 87779 94366 -69690 -117253 42232 124466 -15708 -120226 -12155 100551
423 100551 31093 -77097 -45344 40959 38047 -13706 -24787 -11526 -868 22742 25417 -29788
435 -29788 -54657 23111 76628 -8181 -88299 -8995 94837 33412 -84416 -43221 75920
446 75920 55865 -51753 -48047 40203 46998 -17796 -26708 10423 9747 -4176 12149 10765 -27558
459b7558O899N8225p335p8965M76R0851R764r5887k3627R2625L4549q2365m0539
472f2887O8430L9182n1831l1408L9912K1013k9379m054K4725j2043k3936K7231
484D955L2126l6097m0647M3203M9919m4095n5514M0263N9400l4102o1023K7858
496a3754N6858k2448m9765J7232L9891j8281l3008J8905K5822k4718k1400K8306
508C640J6077l3812j6273L5952J6257l7673j6410L7085J5193l4632j2465L2755
520E694J0896l1464n560L3787J613l3448L735L9400m959m3329N975M9795k463
533B9672n0121r05M9674O988m7132j1045M0170J2580l1270j2273J9541O069j3027
546a079K447N914j6862n705K8817N981m1729j4547M9410K4414n4549l7469N2009
$$ plain form
459 -27558 -20659 37566 30231 -48734 -48258 42593 52357 -43530 -67157 25468 60017 -22348 -62887
472 -62887 5543 44725 -7106 -38514 1398 22411 -6968 -11022 13703 1660 -22276 4955
484 4955 37081 984 -39663 3540 53459 9364 -46150 -5887 53513 19411 -41612 -13754
496 -13754 43104 20656 -29109 -11877 28014 9733 -23275 -4370 21452 -3266 -24666 3640
508 3640 19717 -14095 -30368 5584 21841 -15832 -32242 4843 20036 -14596 -27061 5694
520 5694 16590 -14874 -20434 13353 14966 -18482 -14747 24653 19694 -23635 -17660 32135 29672
533 29672 -20449 -21354 28320 35308 -11824 -22869 17301 29881 -1389 -13662 5879 11948 -1079
546 -1079 1368 7282 -9580 -15285 13532 19513 -22216 -36763 12647 37061 -17488 -54957 -2948
559b948M6943m3281n3870L1782N6496j7863m9952O058L9454N058k1615o844M672
572e910M834J5233P603k9205k0704L8261L9261l7190n5838L0215O9494j6706p5997
585c6649P2P2296J5993o3701k9450M5498L3692k6395l2514J698K1089J4956n296
598A1289k7441j9156K8956M1754k4948o1947J0712P4259Q959p7612l0397P2874
610G302N0093n6221o1240L6274O6287j0696n7683r272M2804K7837j7088l4904
622a6507p122L3306L2751j8845n1085j670O1543K5357o2178m8790N0412O6607
634F3779l3364p8483Q026P6108J4757o8046l6509M7747M6773k5895n0299j194
646c6600M1243K3179k5550l9127K709M4654K2481l8345m4036K5194O1106k995
$$ plain form
559 -2948 43995 714 -53156 -21374 35122 17259 -32693 -26635 12819 17877 -3738 -10582 -5910
572 -5910 -1076 14157 21760 -7445 -28149 10112 49373 12183 -43655 -13440 56054 39348 -36649
585 -36649 -36577 35719 51712 -11989 -41439 4059 37751 11356 -21158 -19460 1629 16585 11289
598 11289 -16152 -35308 -6352 35402 10454 -51493 -40781 33478 42437 -35175 -65572 7302
610 7302 57395 1174 -60066 -23792 42495 31799 -25884 -35156 7648 35485 18397 -16507
622 -16507 -23629 9677 42428 23583 -27502 -29172 32371 57728 -4450 -53240 -2828 63779
634 63779 30415 -48068 -40042 36066 50823 -17223 -53732 -5985 40788 14893 -35406 -36600
646 -36600 4643 27822 2272 -36855 -34146 10508 32989 -5356 -49392 -24198 36908 33913
658C3913o7368j8303O6909M1159n2060n5196L3049O4724q239o1024j1467M9891
670A5988K7930k9340l5115N637L4370J6383k5109l5259O028M4361J4349m6733
682f510l7299L6875N3328k4512o6705M259O6779J3704n9762l2359M3318M2508
694C3624k4131m5071L960L7897J4990k1590k7667L035L5515J9869l1155l7900
706c8624K1921N4053k526n8845j4925N9055L4021m9187m5941L4561N2221j5441
718C0343m9685m311L9961J8605k6157k8344O132K7547J1261k2782k9828R955L9885
731B2582L120m6066k0317M1303L2912l2331m3390J8629M7695n002m5614p247L7670
744C944J7983k3716k2170J0074K3802N638j7042j4676Q814K1983M895k2069j4951
$$ plain form
658 33913 -33455 -51758 15151 56310 4250 -50946 -17897 46827 38588 -22436 -33903 15988
670 15988 43918 14578 -20537 -14900 19470 35853 10744 -24515 -18487 25874 40223 -6510
682 -6510 -43809 -6934 46394 21882 -44823 -40564 26215 39919 -19843 -52202 -8884 33624
694 33624 9493 -35578 -31618 6279 21269 -321 -27988 -24953 10562 30431 -724 -38624
706 -38624 -16703 37350 34824 -24021 -38946 20109 54130 4943 -40998 -6437 45784 30343
718 30343 -19342 -23653 16308 34913 8756 -19588 -13456 14091 25352 2570 -27258 -17303 22582
731 22582 25702 -20364 -40681 622 33534 1203 -42187 -23558 24137 19135 -26479 -33726 3944
744 3944 21927 -1789 -23959 -13885 9917 15555 -1487 -16163 -7349 14634 19529 -2540 -17491
757a7491K0597K6038j4242l1000N630L1819M355k9365j2564K2995J7125j7176
769F721j9550P858J5949k297j2934m255N254N562q81o139n263J615P711K640j0495
784h504p067J1231J1086r007j2956N962J4661j214j3061r7J3747K472j0118p71
798c636R007J081o373J603O006k493m651M125N797m983p701N203P930o633p950
813c668N431O099o212n364L974K726o070k587O977P40j0650o34J2928K20j5384
828a1474j989J5571L926j4603n386J3063Q333r506q480O801P511j736k523m88
842i80j344L791P876l076j1761R34J6379L706j8730q317J8797J4370j6797j8896
856a4048J1014J9149n050j8858j985J4157P440r788j1649O33J0647P159q851j5173
$$ plain form
757 -17491 3106 29144 14902 -16098 -10468 21351 25706 -3659 -16223 6772 23897 6721
769 6721 -12829 -4971 10978 8681 -4253 -8508 -3254 2308 1427 -4712 -9975 -8360 -649 1991 -8504
784 -8504 -15571 -4340 6746 -2261 -15217 -9255 5406 4192 -8869 -8966 4781 7253 -2865 -3636
798 -3636 5371 6452 79 1682 7688 5195 544 4669 10466 5483 -2218 2985 10915 4282 -3668
813 -3668 1763 7862 1650 -3714 260 2986 -3084 -5671 1306 2046 -8604 -9238 3690 3910 -11474
828 -11474 -13463 2108 6034 -8569 -13955 -892 7441 -2065 -10545 -3744 3767 2031 -492 -980
842 -980 -2324 1467 9343 6267 -5494 -4560 11819 15525 -3205 -11522 7275 21645 4848 -14048
856 -14048 -3034 16115 11065 -7793 -9778 4379 11819 2031 -9618 -8985 1662 8821 -30 -15203
870a5203K860K0087M040k1728j1718J9047J9082j4381k2936O744K6700K696k3830
883h540r522J7851J5944q455j7762l44J8222R837j2533j6576M359K0692N619k0270
897a478j4810J5429K1823p430k6032k380K5222J0697k1803j9627J3524K4549l776
910A3908k6058o688J9916J5088j3245k0860L703K1687O702j8476j5885J1498K2227
923A3517j026k4161j0150K2079K1134j4576k7226N985K9935N902k8863j5887K3365
936B8K4960j2824k7584J349K5812R239j9912j7287J0021K1547J586k1765j3718
949a8548J6756K2323q192k9189l917L0168J4276k6246k3408J8144K8993q634l1211
962a8685k433K7751J2815k0054j9418J0270K1539J726j9012j2384J3247K0792
$$ plain form
870 -15203 -12343 7744 11784 -9944 -21662 -2615 16467 2086 -20850 -14106 12594 15290 -8540
883 -8540 -18062 -211 15733 7278 -10484 -10828 7394 17231 4698 -11878 -7519 13173 18792 -1478
897 -1478 -16288 -859 20964 13534 -12498 -14878 10344 21041 -762 -20389 -6865 17684 13908
910 13908 -12150 -18838 1078 16166 2921 -17939 -14236 7451 14153 -4323 -20208 -8710 13517
923 13517 12491 -11670 -21820 259 21393 6817 -20409 -14424 15511 21413 -7450 -23337 28
936 28 24988 12164 -15420 -14071 11741 20980 1068 -16219 -6198 15349 16935 -4830 -18548
949 -18548 -1792 20531 12339 -16850 -20767 9401 23677 -2569 -25977 -7833 21160 12526 -18685
962 -18685 -21118 6633 19448 -606 -20024 -9754 11785 13511 -5501 -17885 -4638 16154
974A6154l817k4329o331K4613J7070j9933k4560J1549K8254j350k7342p815K3124
987E287J5277j6019j9700N700J9940M341j6290j2655Q814J7681n29j9263r148
1000a6564J7191J5714j1425k1239M062K3027M625k0954j2282J4915J6771o828
1012G013j8452m77J6965P887j1797j3944M789J7120L559j6175j0832J2622J5939
1025A4217n787j8711j125J7839P928j4340j3663Q842J7084j891j6975n713J3868
1038A573J0743q587j4242K633J4917L791j3210r228Q730J2768l014j3518l466
1051a0110J2114Q858q325j1942K642J3759K390j3354p065J0955J1869p202j3582
1064h993K013J2868J979j0795n006P564P441m284p614M83N684K921k889n730j88
$$ plain form
974 16154 12337 -11992 -18323 6290 23360 3427 -21133 -9584 18670 17320 -10022 -17837 5287
987 5287 20564 4545 -15155 -9455 10485 14826 -1464 -14119 -5305 12376 11847 -7416 -16564
1000 -16564 627 16341 4916 -16323 -12261 10766 15391 -5563 -17845 -2930 13841 7013
1012 7013 -11439 -11916 5049 12936 1139 -12805 -8016 9104 12663 -3512 -14344 -1722 14217
1025 14217 8430 -10281 -11406 6433 14361 21 -13642 -4800 12284 10393 -6582 -12295 1573
1038 1573 12316 3729 -10513 -7880 7037 10828 -2382 -11610 -2880 9888 6874 -6644 -10110
1051 -10110 2004 10862 2537 -9405 -6763 6996 9386 -3968 -11033 -78 11791 4589 -8993
1064 -8993 -6980 5888 7867 -2928 -7934 -370 7071 2787 -4827 -4344 1340 4261 1372 -4358 -4546
1079d546O357L743n929n978M537P573k974q208R15Q298J818p589k192O107J741
1094C673m412j112K807Q40j810O5J276j028j415J676J800l019j564L081J281k770
1110f31j78K015j137k206R09K591r54l412J134M737j975n359J110N916n30m781
1126b751j206M401K596k451l533J235L758K05k270k208K91M899K173n467m001
1141d329M866N015k550o395M43O908K574o829n262N225N674k034o784j908N702
1156C16N835m343q226J406Q310J708p568n742N464R418k725j1129m33R791M508
1171F590o580p686K777J0790J469j0936m762Q717Q180m283j0711n72J2389N409
1185A0791j0911q079P018R885k120j0528l832R860Q986p462j1775K125J1993L345
$$ plain form
1079 -4546 1811 5554 -375 -6353 -1816 5757 2783 -5425 -4510 3788 5606 -1983 -4175 1932 3673
1094 3673 -739 -1851 956 1796 -14 51 1327 299 -1116 560 2360 -659 -2223 858 2139 -631
1110 -631 -809 1206 69 -2137 -1228 1363 409 -3003 -1869 2868 893 -4466 -3356 2560 2030 -2751
1126 -2751 -3957 444 3040 589 -2944 -1709 2049 2254 -16 -2224 -1933 2966 5139 -328 -4329
1141 -4329 537 5552 3002 -3393 -2950 3958 6532 -297 -5559 -334 5340 3306 -3478 -5386 316
1156 316 6151 1808 -6418 -5012 3298 5006 -2562 -8304 -2840 6578 3853 -7276 -7709 2082 6590
1171 6590 10 -7676 -4899 5891 7360 -3576 -8338 379 8559 4276 -6435 -7007 5382 10791
1185 10791 -120 -8199 -1181 8704 6584 -3944 -7776 2084 11070 3608 -8167 -6042 5951 9296
1199I296j1041r599Q323J3791n050j5821K66J4126M986j0798j0154O038J3104
1212G467j143j2590l274R241P584l658j0944k246J3263P860j1597j0941P081J3989
1226A0092j008j4461n174J4293R612j1344j1086O023J1332M51j0109p267P580
1239a066J0728l482j1901j830R739P548p066j3245K788J5568J101j5087n600J0948
1253h57R613n355j3228J33J3839L827j0975o632O174R484Q81j0971o379J0583
1267A37J0469o988j1243J744J1611M508j0166r595Q292J2331m635j1571q77R212
1281C229O675o241j1534L022J2333N00j1207m780P126R359l664j2774r98J3116
1295D162L436j0251o413N211Q333M20j0219m238R310P251o469p812J512Q406M926
$$ plain form
1199 9296 -1745 -11344 -3021 10770 5720 -10101 -9835 4291 9277 -1521 -11675 -5637 7467
1212 7467 6324 -6266 -9540 -299 7285 3627 -7317 -9563 3700 11560 -37 -10978 -3897 10092
1226 10092 9084 -5377 -10551 3742 13354 2010 -9076 -3053 8279 8730 -1379 -8646 -1066
1239 -1066 9662 6180 -5721 -7551 2188 9736 2670 -10575 -7787 7781 8882 -6205 -11805 -857
1253 -857 8756 3401 -9827 -9694 4145 7972 -3003 -9635 -3461 6023 6904 -4067 -10446 137
1267 137 10606 3618 -7625 -5881 5730 10238 72 -9523 -1231 11100 6465 -5106 -5983 3229
1281 3229 9904 3663 -7871 -4849 7484 7984 -3223 -8003 -877 8482 4818 -7956 -8954 4162
1295 4162 7598 -2653 -9066 -3855 4478 4898 -5321 -9559 -249 7002 533 -7279 -5767 2639 7565
1310G565q181q197P171R186l572p893n65P168N525n125q785L414Q857p19o165
1325c16l213L036P056q62r926j023R156K166o670m676K527O510M36q009k610P050
1341F32K415l995k992n32L959M382m589n879L540N931m14n012k684M521N949l651
1357A581o973L684O531j744m003q56K005L881m71m797J43L339N74r36k040k255
1373b337M902K523n945k861M770J919k568k552n21L368J579m521j356L597R9j600
1389a504J47j128L54L008j074k326J328J165o28K99r25L44K621p27k460K307R43
1406A744j573P46Q16j135L97M39j072J480K18k418J277J388k039Q2J63r30J220
1423H03R51l217q75L291j11k115o43K32K063Q04m345k48M475j84k790j84K16J750
$$ plain form
1310 7565 -616 -8813 -1642 7544 3972 -3921 -4486 2682 8207 3082 -5703 -2289 6568 5849 -316
1325 -316 -3529 -493 6563 5701 -4225 -5248 3908 6074 -596 -5272 -2745 3765 4201 -3808 -6418 632
1341 632 3047 -948 -3940 -4472 -513 3869 -720 -6599 -3059 2872 2458 -2554 -5238 -717 5232 1581
1357 1581 -5392 -1708 4823 3079 -924 -1780 225 4106 3635 -1162 -1019 2320 2894 1958 -82 -2337
1373 -2337 2565 5088 -857 -3718 1052 2971 403 -2149 -2670 698 2277 -2244 -3600 -3 96 -1504
1389 -1504 -1357 -2485 -2131 877 -197 -2523 -1195 -30 -658 -359 -1284 -940 1681 954 -1506 801 1744
1406 1744 171 917 1733 598 995 1434 362 1842 2060 -358 919 2307 268 350 513 -417 803
1423 803 1754 -1463 -2338 953 842 -1273 -1916 -1684 379 1183 -3162 -3410 1065 881 -1909 -2093 -1877 -127
1441a27J999k622k364L010K543j905j582p22K430L550k896m630L691M168k319
1456B224k845m73J859L275j780m718J236M078l15k504k268N34M707M11o593j233
1472d405N931J527m128k995Q20M908J530o245j934M717K579j964k931j317L527
1487c80M812l969n393K989N629q1n065k965M306O609l675p641K857O439l48m020
1503A04l243K275N953r77o854p95N197K821k831n630k38P451K111p871l549N854
1519b22M723l189o144m06O892L239o647m372M667N178j179n019k805M950N991
1534E657l826p126K152O788J195n331m571L992P183k161p592M61N921K194l722
1549A214n066J387P029N39p496k325N183M313k527n946q15P108K713p214l362
$$ plain form
1441 -127 1872 -750 -3114 -104 2439 534 -1048 -1770 660 4210 1314 -3316 375 4543 2224
1456 2224 -621 -1094 765 4040 2260 -2458 -1222 2856 2541 37 -2231 -1697 3010 3421 -3172 -4405
1472 -4405 1526 3053 -1075 -4070 -3250 1658 3188 -3057 -4991 -274 2305 341 -2590 -3907 -380
1487 -380 4432 463 -4930 -1941 3688 3607 -1458 -4423 -117 6492 2817 -4824 -1967 4472 4124 104
1503 104 -3139 -864 5089 4112 -2742 -3537 1660 4481 1650 -3980 -4218 3233 5344 -2527 -6076 -222
1519 -222 4501 1312 -4832 -5238 1654 4893 -1754 -6126 -1459 3719 2540 -2479 -5284 -334 5657
1534 5657 1831 -5295 -3143 3645 4840 -491 -5062 -1070 6113 3952 -3640 -3179 2742 4936 1214
1549 1214 -3852 -2465 4564 5103 -2393 -4718 465 4778 2251 -3695 -4510 2598 5311 -1903 -5265
1564e265M501M178j364m840j856M892L860l935m788K205M365J477l760m785L508
1579a607O413k088o134M21M895K405l293m586J902N348j44m935j438L288K928
1594C375q86m476j116M986K252m430l376K488L989K51n197j779M784K931l759
1609C7l335J307L189J131k581l499K463M074j071m016o73L434K892k340m472J510
1625a950M833j85m054j086K746K404j007l436q4L426J015k284k053N88K574J234
1641B681l268k560L348K854k419k907P17K812P67k970j556K169K275j360k049
1656a466J67J281J401q77k230L45K467K15j786r97J071J887l30k527J99K029N93
1673A442j694k63J14J314L59j465p46J121O62o20l84m04R47R14j498p76J098O94
$$ plain form
1564 -5265 -764 3414 2050 -2790 -4646 246 4106 171 -4617 -2412 1953 3430 -330 -5115 -1607
1579 -1607 4806 2718 -3416 -2995 1900 4305 1012 -3574 -1672 3676 3532 -1403 -2841 447 3375
1594 3375 2489 -1987 -3103 1883 4135 -295 -3671 -1183 2806 3057 -2140 -3919 865 3796 37
1609 37 -3298 -1991 1198 2329 -252 -3751 -1288 2786 1715 -2301 -2974 460 3352 1012 -3460 -1950
1625 -1950 2883 2698 -1356 -2442 304 2708 1701 -1735 -1819 1607 2622 338 -1715 -1127 1447 2681
1641 2681 -587 -3147 201 3055 636 -2271 -1554 1258 2025 -945 -2501 -332 1943 583 -1466
1656 -1466 -1299 -18 1383 506 -1724 -1379 1088 1303 -483 -1480 -409 1478 1148 -1379 -1180 849 1442
1673 1442 -252 -515 -401 913 1272 -193 -939 182 844 224 -160 -564 383 1297 -201 -977 121 815
1691H15p70l90L55p5M25m23k94K88J85l18M28m38m33Q46K25o81k40O06O8m53L83
1712A09J56l31j30j49O89O9r09K17P58J17j341J59P89M21n17q27M77Q41k5j001
1732d28l79O17P25J9j103n75J297J422j630j419J121J485r7k102l98K003R63j309
1750B12j111O1J685M23j223j336Q75K022l66k563l83J846J770j680k147Q09K591
1767A485Pk630r43K344J268j319j807K25J844J046j532j617P25K542K02k714j180
1784b054K361K033j610k645O70K997K05k518j467J970K112r09k225n68K234J513
1800B099j658k469N96K686P03k740j699K114K414q23l185j86L068Q70k137j884
1816b231J025K716N72k964j742K458K700j312l346L81L294J183l283k302K198
$$ plain form
1691 815 45 -345 10 -65 360 -63 -357 -69 116 -202 226 -212 -645 201 426 -255 -495 111 179 -274 109
1712 109 265 -66 -196 -345 344 413 -496 -279 479 596 -745 -586 203 624 107 -720 -243 598 573 -428
1732 -428 -807 -190 535 554 -549 -1124 173 1595 -35 -1454 -333 1152 1055 -1047 -1445 558 1521 212
1750 212 -899 -838 847 1270 47 -1289 -414 1608 1242 -1321 -1704 142 1912 232 -1915 -1106 1485
1767 1485 1492 -1138 -2081 263 1531 212 -1595 -1370 474 1520 -12 -1629 -904 1638 1840 -874 -2054
1784 -2054 307 2340 730 -1915 -1245 1752 1957 -561 -2028 -58 2054 1145 -1080 -1648 586 2099
1800 2099 441 -2028 -1432 1254 1957 -783 -2482 -368 2046 1223 -1962 -2148 920 1790 -347 -2231
1816 -2231 -1206 1510 2082 -882 -2624 -166 2534 1222 -2124 -1743 1551 2734 -549 -2851 -653
1831f53L140r01l143j41K704J505j990k672R71L083N45l016j883K190K940j121
1847A558l917j37L808J375l034k439J793L258p58l284p93L045J718j859k626M06
1863a886L065J107k862j779K056K699r73l265K4L120J362k621k221J442K860k74
1879A854k588q56J941J854j423k264L93K351J139k448k096J314K760k22l157n93
1895b041K496J199j814j852R13K082L2j774r26J256J408j95k204J41J541J438
1911A700j490k131J029K206J30k291p02J816J323j141j399N29J308Q27j480j146
1927i12P59J352j5j564n79J336J013q66j454lJ943l7j433q09Q35R75k89j124k20
1946a092J015O97o10j181K60J174M32j104p07J035P16l45q57j54J311r1k77m53
$$ plain form
1831 -653 2487 1586 -1557 -1698 1006 2511 521 -2151 -1180 1903 2448 -568 -2451 -261 2679 1558
1847 1558 -2359 -2496 1312 2687 -347 -2786 -993 2265 1507 -1777 -2570 475 2193 334 -2292 -1886
1863 -1886 1179 2286 -576 -2355 -299 2400 1427 -1838 -1814 1306 2668 47 -2174 -732 2128 1854
1879 1854 -734 -1590 351 2205 782 -1482 -1089 1262 2401 -47 -2143 -829 1931 1709 -1448 -2041
1895 -2041 455 1654 -160 -2012 -1099 983 1015 -759 -1685 -429 979 784 -1420 -1279 262 1700
1911 1700 210 -1921 -892 1314 1444 -847 -1549 267 1590 449 -950 -421 887 1714 234 -912
1927 -912 -153 1199 1184 -380 -959 377 1390 524 -930 -933 1010 973 -460 -1269 -434 541 252 -872 -1092
1946 -1092 -77 620 10 -1171 -911 263 695 -409 -1116 -81 635 290 -567 -721 590 499 222 -231
1964b31M17M59O6p58k42L18R08l49o55k93J122K53j085l50N34L16j31q63M33K49
1984A18l9l50j63p4J91R5J80k56k3QM69l04m98O29J31l86j88K04K47J19j15K31
2006B26K0j78m4N86k72k50nL52N9m28m6J27K97k39k56J66l0L20k26m97P8J51M81
2029C92n53q04Q28N49j60q49m09R05L77o27k74N6Q46M00r44n24O25P28r1r19m04
2050h52Q43J100q14j087R52R74j82j256m08J085Q27p40p64j25J189K89p78j115
2068h62N99J175m7j384n46J118J074j018j426K97J432L70j319r25R45J383m31
2085D35j568j09J252Q82p61j409M18J904J72j728r02J639J365j285j000L07J430
2102A042M11j485j168J061J455n36j262o09J266J392q75j940j02K381L32j920
$$ plain form
1964 -231 186 645 711 -47 -289 29 937 588 -67 -360 762 1015 -70 -420 114 430 299 -564 -131 118
1984 118 79 -271 -434 -508 -317 -222 -42 -298 -321 -313 156 -148 -646 -17 114 -272 -460 -256 -9 110 -5 226
2006 226 246 68 24 610 338 88 83 435 494 66 20 147 444 205 -51 115 85 405 179 -318 -240 -89 392
2029 392 -161 -965 -137 412 252 -597 -1006 -101 276 -351 -625 -569 277 677 -267 -791 -166 562 471 -448 -852
2050 -852 -9 1091 277 -810 142 1116 934 -322 -730 355 1182 442 -322 -447 742 1031 253 -862
2068 -862 -263 912 865 -519 -1065 53 1127 109 -1317 -1020 412 782 -537 -1462 -517 866 435
2085 435 -1133 -1242 10 892 131 -1278 -860 1044 1216 -512 -1414 225 1590 305 -695 -388 1042
2102 1042 1453 -32 -1200 -139 1316 780 -482 -1091 175 1567 692 -1248 -1350 1031 1363 -557
2118e57j081J172J659o70j818J53J550N07j239r26N90J498%j278j071J073J435
2135I97j94j749k72J737J378k006j467J195J821j58j787l62J211J336j078j523
2151i21J00J581N81j319j431J130J845p36j826k65J623J014j449j429P37J865
2167A100j10j971n22J487J164p23j598j78J729J028j216j951J123J662r5k028
2183a099j05J396J544j387j874J258J316J79j586o19R54J348m04j755j54J631
2199F43R47j333j215O58J510m50j446l85J405Q71j214j129K25J656q4j004p88
2216a133R26Q73j54j120l65J356J26k68j180O20J031Q1j196m22J241M42p63o30
2234e35L81N05M27p24l36K87O89K6q78l92N96R29n80q91jO65J31n38j54M41M1
$$ plain form
2118 -557 -1638 -466 1193 523 -1295 -1142 408 915 -324 -1250 -660 838 838 -440 -1511 -438 997
2135 997 803 -946 -1218 519 1897 -109 -1576 -381 1440 1282 -505 -867 344 1680 602 -921
2151 -921 -821 760 1341 22 -1409 -279 1566 830 -996 -1261 362 1376 -73 -1502 -765 1100
2167 1100 990 -981 -1503 -16 1148 425 -1173 -1351 378 1406 190 -1761 -638 1024 929 -1099
2183 -1099 -1204 192 1736 349 -1525 -267 1049 1228 -358 -977 -23 1325 921 -834 -988 643
2199 643 1590 257 -958 -300 1210 760 -686 -1071 334 1205 -9 -1138 -913 743 659 -345 -1133
2216 -1133 -207 666 512 -608 -973 383 509 241 -939 -319 712 793 -403 -825 416 858 95 -535
2234 -535 -154 351 778 54 -282 5 694 720 -158 -550 46 975 395 -496 -497 168 299 -239 -393 48 89
2255H9Q8l71j25L20O3j43k06o7N27K09o03j99L80L53Q4p11p1N79j47j69L45j68
2277E7J79l83M08p1k03K06K00k85l02J09K93j14k80J67K72j51k56m5O5o3K27j03
2299g3J76k75K63j0p3j45k16L15L22l02R5O5J74j15r2qj62J44p3j54p8j02Q11
2322D87Qq30J34J75N20l48l20K46q7J35m18NL97J61j00r8l54L41M46l91q53N54
2344a90P20k46p40l90J127N8m21m21J83L19L97l89m57L54O12k57k64m28N30O83
2364G80n35p46LR88J39q61m90Q24L41k98o44R3P03L13l82p51J44Q02K58r08l72
2385e99N92J037r15r16L03J101J51j061m53M57R96k29o35m64Q20O07p48r92K98
2404f50J203K26j006o51Q35Q96j90j205N7R00O8o36o41M77P93J24j024k27P54
$$ plain form
2255 89 177 -194 -319 1 64 -79 -285 -352 175 384 -219 -418 -38 315 399 -312 -383 196 49 -120 225 57
2277 57 236 -147 261 190 -13 193 393 108 -194 -85 208 94 -186 -19 253 102 -154 -199 -134 -197 30 -73
2299 -73 103 -172 91 81 8 -137 -353 -38 284 -18 77 142 316 201 109 101 -61 83 10 -144 -222 -324 487
2322 487 495 -335 -201 -26 494 146 -174 72 -15 120 -298 -293 104 265 165 67 -287 54 500 109 -744 -190
2344 -190 530 284 -456 -846 281 339 -82 -503 -320 -1 396 7 -450 -96 516 259 -5 -433 97 780
2364 780 245 -501 -498 490 629 -232 -722 102 443 145 -499 -406 297 610 228 -523 -379 423 681 -227 -599
2385 -599 -7 1030 115 -801 -498 603 754 -307 -760 -303 693 464 -171 -635 185 792 44 -948 -650
2404 -650 553 779 -227 -878 -43 853 663 -542 -485 415 483 -153 -794 -317 476 600 -424 -651 103
2423A03Q32o41r57P6J058K23p81q96R98Q12k36j234R2N09R67o48j171J83J216
2442E05M32j071n08O05P96k85j247K32R67M68q21j094O47R49M4j127k12O92O55
2461F27m11r10J16Q59K90l24j189P81P79J31q77q41J135P18q10q87N74R45lr64
2481b61k16N42M99j37q31l70R16P41o71j140M59J087Pj001m81R26O14l76q97J63
2501d27P72K03o65q14O48Q36j55p83l00Q86L98m56r94N02Q58J62j095j52N70N35
2521E29l33n95R7N20L99m90n55K79N63j48n99l12N85O22j30j010L60O42Q1m75
2541C0n32K69M90j27p63J78O15j08l61Q6J15K98q6m40j21L89K57k31j56K8K12
2562D2R8r3j6n9K84k64j85L49KJ88k68n3k7K76o5j4r5j25K86j18j37o2K9k02o
$$ plain form
2423 103 935 294 -663 -587 471 694 -87 -983 15 827 591 -643 -551 -42 925 277 -894 -711 505
2442 505 937 -134 -642 -37 759 474 -773 -541 426 894 73 -1021 -374 575 619 -508 -720 -28 627
2461 627 216 -694 -578 281 571 247 -942 -161 618 749 -128 -969 166 884 74 -813 -239 706 703 -261
2481 -261 -477 65 564 427 -404 -774 142 883 212 -928 -469 618 625 -376 -857 69 683 307 -590 -427
2501 -427 345 548 -117 -931 -283 553 398 -385 -685 201 599 143 -851 -349 509 671 -424 -576 -6 529
2521 529 196 -399 -302 218 617 127 -428 -149 414 266 -333 -645 -60 562 432 -578 -218 424 505 30
2541 30 -502 -233 257 130 -633 -455 160 52 -309 -223 -108 190 104 -336 -457 -68 189 -42 -198 -170 42
2562 42 140 47 31 -28 256 -8 -193 156 158 346 78 25 -2 274 209 195 100 -25 261 143 6 -56 -27 -229 -235
2587b35L09n5l96M53q5j23q3NR0QP3n6J2q0NN9j16J4K81P3j35n5j52J83J71m96
2613c31J28N25j29j03k7J49j9J06k78j86J35N40l20l3k91l6L61k52n21L90P02
2634E10n25j13r2J29L13j52k47rJ98L4j2m3l85P74J00o54L3L41K52l74k15K6O22
2657E11J10o97j75M58K95l91n3m94M91N09m77o96L81L28K78m89m14M49O26m55
2677I5n78l1P21K01o91j09j18Q08K4q26k25R44m0L8o37j87R36N03r53n54Q91L30
2699E42l37n27l03Q94K41k74p16N61K69P7o65l07L46J028l37j119L93N00L67p15
2719h2o49N16P48m47p03J33O58Nk16m17KP01L00q38m97O51M18J47q14j16R35K53
2741F88n50o41L85Q72k96o64l56Q12M34n55o21L43K75K13J6p55J17Q63j02p14
$$ plain form
2587 -235 74 19 -377 76 -9 -132 -215 -210 -120 -112 -39 -95 -83 -163 -158 -99 -215 -201 80 153 18 -37 -189 -6 165 -331
2613 -331 -203 322 193 90 63 212 193 299 21 -165 -30 510 190 157 -134 -170 191 -61 -582 -192 510
2634 510 -15 -128 -220 -91 222 70 -177 -186 12 46 34 -9 -394 380 480 -174 -141 200 452 78 -137 -111 511
2657 511 621 -76 -251 207 502 111 58 -436 55 564 87 -609 -228 100 378 -111 -525 -76 550 95
2677 95 -483 -514 207 408 -283 -392 -510 298 322 -504 -729 215 175 213 -424 -611 325 828 -125 -679 212 542
2699 542 205 -322 -625 269 510 236 -480 81 350 427 -238 -545 -199 829 492 -627 -234 266 633 -82
2719 -82 -731 -215 533 86 -617 -484 174 179 -37 -454 -452 249 549 -289 -786 -135 283 430 -384 -500 435 688
2741 688 138 -503 -118 754 458 -206 -562 250 684 129 -492 -149 126 339 355 -400 -283 580 478 -236
2761b36o5N05L29m53o35P1Q71p3m64j64j0M27K63o99m41Q60O04o06n99K38P92
2782E15n8m52o53M81Q28o80pj40L89j77J19o57N15N53l13m59J02K86J46r2q56
2803f10J09J197m46o19j0K49O57m47l98j37O67J40l59l92J13L16M16k99p19P45
2823A73Q0k55k53J76R9M51n65k30M87J63j55k74r5Q0M43j4o63J84N08k62l5j21
2845g8j71O53o7n77J11N67j96l18Jj56J09K44k65p2J17L11o0k36n2j5N55n78j95
2868c68L38o0q5O5j1J19K32m34J40J54J30k20N7J51l53K90J36l17N5r3J47q6o5
2891g8J52k30K20N1j84N4r8n9J07J19j50Mk14K48K54m15K3J24P8j28j04J59j82
2914b49M01k63m21M83K74o4k59K09n8nl45J91J84K17l80Q7J51n3j1O1l10K51J86
$$ plain form
2761 -236 -301 204 533 80 -555 -484 387 314 -150 -314 -324 103 366 -333 -774 86 690 84 -515 -277 515
2782 515 457 5 -648 -167 661 -19 -26 -166 223 46 165 -492 23 576 263 -196 -94 192 338 246 -610
2803 -610 -501 696 250 -369 -379 -130 527 80 -318 -455 212 352 -7 -399 -286 30 446 147 -572 173
2823 173 253 -2 -255 -79 20 471 -94 -324 163 326 171 -103 -198 -118 325 311 -352 -168 340 78 43 -78
2845 -78 -249 404 337 -240 -129 438 242 -76 -75 -231 -122 122 -143 -215 -98 213 153 -83 -135 -150 405 -173 -368
2868 -368 -30 -90 -175 -110 -121 -2 230 -204 -64 90 220 0 57 208 -145 145 281 -36 19 -74 73 -13 -78
2891 -78 74 -156 64 115 -69 -15 -113 -172 -65 54 -96 -92 -306 -58 196 -219 -196 -72 6 -122 -226 -67 -249
2914 -249 152 -111 -532 -49 225 161 -98 111 53 48 -297 -106 78 295 -85 2 153 100 89 150 -160 91 277
2937B77j48k10J28P3j7M1k67J70P9j72o0P5k1L34k38o4Pp3J81J74m85N5K09M06
2961D54o29r8K55J12Ql76J79M18nk02l49L46K15j82k08q9m8N67q7n18nL83K31
2984C72o12m8J83M82j91n13n2M72J08lm30j70M70N6k83l97M00K12J91m94j02J58
3006a91N88n02k82K85K69q9k24m15N64M70k75m50J73J26L1j94k99N24K58j56m09
3027a98j61M19L09m36m25J39N60M8j75m48O33J55k84n22J68L08J79j54m12K9N73
3048C05j51k37l21L13N42l87m89K50J19N49m48m07K58K09J67n28J83J89M29o33
3068h8k57J27N06K46o58j99J16O79m40j49m8M66Jk07k54J58M4K45l45k56L20K64
3090B71M1n13k8M45J75m39m07L61J51l7j94j74L99q9K24m26n0K89J03q5k95J29
$$ plain form
2937 277 129 -81 47 120 103 144 -123 47 126 -46 -106 -31 -52 282 44 -20 -13 -86 95 269 -216 -161 48 454
2961 454 -175 -273 -18 94 102 -274 -95 323 318 116 -233 113 328 146 -62 -151 -199 368 281 -237 -242 141 372
2984 372 -240 -288 -105 377 186 -327 -379 93 201 198 -232 -402 68 124 -159 -556 -156 56 247 -247 -349 -191
3006 -191 397 -105 -387 -102 167 78 -146 -561 3 473 198 -252 -79 47 78 -116 -415 109 367 211 -198
3027 -198 -359 60 369 -67 -492 -353 207 255 80 -368 265 420 136 -386 -218 90 269 115 -297 -268 305
3048 305 154 -83 -404 -91 451 64 -425 -175 -56 493 45 -362 -104 105 272 -256 -73 116 545 -88
3068 -88 -345 -218 288 534 -124 -323 -207 472 32 -117 -165 301 302 95 -159 -1 43 288 -57 -313 7 271
3090 271 312 -201 -229 216 391 -48 -455 -94 57 20 -174 -348 51 -38 186 -240 -290 -1 102 17 -278 -149
3112a49M77k15j60r6L88k34k74K84l02O04n6m28J04K22j99K03m09j12O09m1o4
3133A52l84P1K90J85l56r0K08K80l80j42o2J43L05k59j52Q1J41k2l43J37L88j91
3155@n7k33K01J56K15n65J13r3L23l4j71K74j4K6l8j84J87K21q7l48l1J67J9o9
3179b2M8k4J90R7l22K38r0k28L29m36M4P8K61k28R5l47L68q3K08j19K37l26m00
3202d32O29l04J24k34K30q2L22k49m3J46j54m6q4L11Q3k5O9n69M51o1O4o0j05
3225a9J54r1j39P6j10K45p4k28O5J40k67L60k55J46Ll6J9k32J93L88l75j06k54
3248c97O07k10r2J45j05K64j94k10K0N01j88j04j99J29J81K17k46l67J98J08R3
3269A51k87j43N5M50k35j84L9M18k24n7j44K26J50k95n4j48K46j8m9j08J07M50
$$ plain form
3112 -149 328 113 -47 -143 245 11 -263 21 -281 323 267 -161 -57 165 -34 169 -240 -352 257 216 152
3133 152 -232 -161 129 314 -42 -132 76 356 -24 -166 -228 -85 220 -39 -191 -110 31 9 -334 -197 191 0
3155 0 -57 -290 -89 67 282 -283 -170 -263 60 26 -145 129 115 141 103 -81 106 327 240 -108 -139 28 47 -22
3179 -22 26 2 192 289 -33 205 115 -113 216 -220 -176 -98 163 -65 30 -317 51 -32 176 57 294 -32 -432
3202 -432 197 -107 17 -217 13 -69 253 4 -39 107 -47 -93 -177 134 217 192 261 -308 143 82 146 86 -19
3225 -19 135 44 -95 -19 -129 116 42 -186 -121 19 -248 112 -143 3 6 -30 -11 -243 -50 338 -37 -143 -397
3248 -397 210 0 -92 53 -52 212 18 -192 -172 329 141 37 -162 -33 148 365 119 -248 -50 58 151
3269 151 -136 -279 -224 226 -9 -193 -154 264 40 -17 -161 65 215 -80 -134 -282 -36 -54 -103 -211 -104 346
3291C46l70j47j01L52J37k66p9P8L00l84K07l62L15K34k25mm4O8K56J67n86n0
3313a58P3L42j38l68K12M7K7k28K30J49p4l49o4K33K53j75M8k30R1M02l59j28
3335a64J08J30K0r8l80N12O3j83k84j2M69Q4j47l76M15J74j04m25j96L46K79j91
3357D0k44J68j4M46p12KK43J94ok62k24N52L4l83j71Q6M70l30p7L10j64M47k90
3380A15l93J00M65j09k42p4K31J6j43K0l30M98j43K37l20J17m6J55m08j09L38
3401b5J10J8l44J52K32Rj45j08l6J94j9l77K30J23PP1j85k7Q3J56j01l6l3J48
3425I7k04K3J49o0M4J78m33L75l06J93k00J57j65K83J15j76p8P3L70m05k63M06
3447A73k55K61k3k76m8P1J61K9O7k14J23K0j88J05N5O6j86q0Q5j06L11j17N6j75
$$ plain form
3291 346 -24 -171 -272 80 217 -49 -128 -50 250 -134 73 -289 26 260 35 31 -13 55 311 478 -108 -158
3313 -158 -85 257 119 -249 -37 10 37 -191 39 188 114 -235 -299 -66 187 12 60 -170 -79 323 -36 -164
3335 -164 -56 74 94 -4 -384 128 191 8 -276 -288 181 265 118 -258 157 331 227 -198 -394 -48 231 40
3357 40 -204 -36 -50 396 -316 -314 -71 123 117 -145 -369 183 217 -166 -337 -251 219 -111 -188 122 -42 405 115
3380 115 -278 -178 287 178 -64 -138 93 109 -34 -14 -344 154 11 248 -72 45 -1 154 -254 -363 -25
3401 -25 85 103 -241 -89 143 152 7 -101 -137 57 38 -339 -109 14 21 92 -93 -120 -37 119 18 -18 -51 97
3425 97 -107 -84 65 5 49 227 -206 169 -137 56 -144 13 -152 131 246 70 -8 65 435 30 -233 173
3447 173 -82 179 156 -120 -168 -97 64 93 160 -54 69 89 -99 6 61 127 -59 -139 -54 -160 151 34 90 -85
3471h5j20N3K14P3o2n4o8L1j41K46r1J02p5j7P3J95k91O8q1j16K78k49K98j70
3495A1L5k3o2r0K56J1j29j12P7j0K10m92J13J25J63n6J20j79J44j51K98l07p8
3518a26P5J74j05p9J35j3J38j77j88J6K67j53M2J77j34K56j19k02K10l10J93n7
3540B0j02K25k24R9k03L34J3j65j23J16R8k60R0L9q7R5Q8l0j18j56L23L17n61
3563a72J5Q5Q6l8j77N8K07J40j56J89k10m8J10k67k8OK87K16l63j40J69K38j46
3586F1l39p7L77J56l54n5J68J4J67l15K49K55j92K0m98L68j42J34j83l5K07K95
3608B81j01l41K80l7J04k88j61L02N4k88J48o6P8rP2j27j10L40J68n90K8J60J79
3631G6K14l69j05L29J72l49M0l08L75k12J67j57O8J76k2k07j61K56J60j88j71
$$ plain form
3471 -85 -205 -152 62 135 73 19 -49 -18 -159 87 -4 98 23 6 79 274 -17 51 -30 -146 132 -117 181 11
3495 11 46 23 -39 -129 127 138 9 -103 -26 -36 174 -318 -205 -80 83 27 147 -32 112 -39 259 -48 -126
3518 -126 -51 123 18 -61 74 61 199 22 -166 -150 117 -36 6 183 49 305 186 -16 194 -116 77 20
3540 20 -82 143 -81 18 -185 149 162 -3 -126 -10 88 -172 -82 -43 -130 -35 53 23 -95 -251 72 389 -172
3563 -172 -157 -72 14 -24 -201 -143 64 204 48 237 27 -21 89 -178 -206 -200 87 303 -60 -200 -31 207 61
3586 61 -278 -355 22 178 -176 -231 -63 -49 118 -197 52 307 115 135 -363 5 -137 -3 -186 -221 -14 281
3608 281 180 -161 119 82 186 -102 -263 39 93 -195 -47 -113 -35 -44 28 -99 -209 131 299 -291 -263 -103 76
3631 76 290 -79 -184 145 317 -32 8 -300 75 -137 30 -127 -59 117 95 -112 -273 -17 143 -45 -216
3652b16L11K5j11K98l43J76J3j10k3KRM4N3k73K65q1J15k14j40L59m8P6m71J86
3676i8O8L00l86m6K38Pk12J28k14K07J15Ok89K33J56k00j15l6K45j28L3j72l7
3699a97L33M3k4l11r1K74J11l28M87n03L72j95O1j40K59o6k66J77O1j08K46l05
3721a10K12J03j02j70o3J28J73kk18m4N8J11M3K27l33J82o2J02k44P9J01l8j51
3744a8q8j1J38j93jK05k22j11K51R7O8m1N2m2l83M08J25l19M5L5m9K44l23J66
3768C3P1j69O3o4l6m3J13P4k74L00j73oJ6K34K01l68j41K26O2k56Q5J28n2K16
3792B40k05rj10J45k75R6J13k8R4L4J01r7N0j54p8p3J48J4m0n3j3K40j72q4K52
3817A36l43j1K69k2j34K64m6k20J7j39M82k84j20P0o9L16j78L0J20j74%M1k04
$$ plain form
3652 -216 95 120 9 307 -36 140 153 43 20 22 31 75 128 -145 120 39 154 -60 -200 159 111 187 -284 -98
3676 -98 -30 270 -116 -162 76 83 -129 -1 -215 -8 107 113 -176 57 213 13 -102 -138 107 -21 12 -160 -197
3699 -197 136 179 155 -156 -247 27 138 -190 297 -206 166 -29 32 -108 151 85 -181 -4 57 -51 195 -110
3721 -110 102 205 103 -67 -130 -2 171 169 -49 -93 -35 76 119 346 13 195 133 235 -9 70 171 133 -18
3744 -18 -106 -117 21 -172 -173 32 -190 -301 -50 47 115 74 126 84 -299 109 234 -85 -40 -5 -54 190 -133 33
3768 33 104 -65 -2 -66 -102 -145 -32 42 -232 68 -105 -111 -95 139 340 -28 -169 57 119 -137 -52 76 24 240
3792 240 35 26 -84 61 -214 -118 -5 -33 61 95 196 99 149 -5 -83 -156 -8 6 -34 -87 -100 140 -32 -116 136
3817 136 -207 -218 51 29 -105 159 113 -107 -90 -229 253 -31 -151 -81 -150 166 -12 18 138 -36 -36 5 -199
3840a99j22M32j84K2J25L20k95k84M7L6L28k26k77K37J52j92j05K94R3P9l02k21
3862b42N0L3J53J83j73j1N7p3j4k9R6nJ75m81K27K30m0k53J27J48m55K75Q9q6
3886a9Jj46L14m53K26K31qk49j55J94O4L1n1J39j25K96l24j35j38L26p9j39J21
3909g8Q7J27k44K13J12p1l0j22k80K35J70j79j3k6N4K00j34k54K93KK3k20J61
3932B6O6J54M3m81PJ97k55K09j1L1M5J99l60J16Q4k00J36J39l77L94J2j20k03
3955a49J66r3J13K64j56M2k87R4q8K51L9J00l20J76k87L00j49Qm6Q2K30l87K96
3978A99j78L5rk23K35j74J23J3ko4R1m9j72N8K14n5K02k51Q8j78L81l0n65L97
4002H6k06J53O3j55J36o0K58k59o3p6J24Nj46K74l74Qj3J09p4R0J48k36J71k47
$$ plain form
3840 -199 -321 111 -73 -51 74 394 99 -185 -138 -102 226 0 -277 -40 112 -80 -185 109 202 281 -21 -242
3862 -242 -192 -159 -6 177 4 -7 50 -23 -37 -66 30 25 200 -281 -54 176 136 -117 10 158 -297 -22 67 -19
3886 -19 -18 -164 150 -303 -77 154 146 -103 -258 -64 0 31 -20 119 -6 290 -34 -169 -307 19 -60 -199 -78
3909 -78 9 136 -108 105 217 146 116 -6 -286 -51 119 -60 -73 -99 -45 155 21 -233 60 62 85 -135 26
3932 26 92 246 289 -192 -185 12 -243 -34 -45 -14 31 230 -130 -14 70 -130 6 145 -232 162 174 54 -149
3955 -149 17 -76 37 301 145 187 -100 -6 -94 157 196 296 -24 152 -135 165 16 24 -22 60 290 -97 199
3978 199 21 56 47 -176 59 -115 8 21 19 -45 46 -3 -175 -117 97 42 244 -7 81 -97 284 254 -311 86
4002 86 -120 33 96 -59 77 17 275 16 -47 -123 1 6 -140 134 -240 -232 -245 -136 -210 -120 28 -208 -37 -284
4026b84N27l74R6m4j01J41O1JL4J82l20jr3R9R7J20k05J5r5L04j22j70R6j7K3
4051c0J25O1l22J64O1j30m6j48L61k02J65p5K09l98J1K74P9r8j11p8%l0K69n7
4075E4q7j8M4J46j28KK04k5j87Q8j88N9N8j73J15j1m8J79P2N0k78K6O6j9n5Q7
4101C3j43K02l3k65m2L73k54k25J50O5nO3J16l41J07J60J75l48J8Q0O3L46k67
4124B8J39j8l68K85Q5k82M49o01oK21J07j25K07j10Q0N8l09P2q3M81k50r2Q2j31
4148h1o4L29j43j09L35k61J6q4m4j09R9M1M3J09J89j68J00j09k4m0J43j21J10
4171A57j49J38k41r9R2J88J02o8j48K82j07j59pj34J78kM8k04J54J18j15j60Q6
4194e0J14j71J89%Q5j50q5p6L04J79l16K18m33K83o3J58k82l3J11N1o1M3M5L4
$$ plain form
4026 -284 243 -131 -35 -79 -180 -39 22 23 57 239 -81 -82 -175 -76 21 141 -64 -49 -144 160 38 -132 -36 -53 -30
4051 -30 95 156 -166 -2 59 -71 -117 -265 96 -106 59 -16 193 -205 -194 80 159 61 -50 -128 -128 -158 111 54
4075 54 -33 -51 -7 139 11 13 217 192 5 93 -95 -36 22 -151 -36 -47 -95 84 156 206 -72 -46 20 1 -54 33
4101 33 -110 92 59 -206 -248 125 -129 -354 -204 -139 -144 -81 35 -306 -199 -39 136 -212 -194 -114 -51 295 28
4124 28 167 149 -219 66 151 -131 318 -283 -289 -68 39 -86 121 11 91 149 -160 -88 -171 310 60 -32 50 -81
4148 -81 -145 184 41 -68 267 6 22 -62 -106 -215 -116 -75 -32 77 266 98 198 89 65 25 168 47 157
4171 157 8 146 -95 -194 -102 86 188 120 -28 254 147 -12 -19 -153 25 23 71 -133 21 139 24 -136 -50
4194 -50 64 -107 82 82 167 17 -68 -144 160 339 23 241 -192 91 28 186 -96 -129 -18 33 -28 15 60 94
4218I4j84J13m5oK03k43J06l03L06R0k68J1K29q9l10M38jj82K21j74j64J33L55
4241C30n35K88R5l04J04J11J00l96K31P6j33o6N8KK16j92l0j0k4K45j29j28l71
4264d62P17m27J9J22J10n7o2j27L10j87P1k5k11K96K74k57k33L7M6J25j98k2K95
4287A54j76j24J32K49l14R8J28l74M59j52j83J58p1j7J41p6K3m8P7M2k84L33j26
4310D9M0k10n0O7J67j53M0j13J62P8j09Q2l4J06Q4k11L3o5K59%k57j53Q2J54l2
4335A6qK24M5k21Q7k37J13P0Ln3N7J18j94j56L27l17Q8j08K41l48J40Q2J50j57
4359c8j19J64P4m65N01j91l0r2J16K46j99J13k48L4M3J34P4n2l04L97j00k23K40
4382G5j56o0K09p1mJ0K00p4j88K06o9R1l67L2K63j91L8K01R9l60K23j62J12o2
$$ plain form
4218 94 -90 23 -22 -28 175 -68 38 -265 41 131 -137 -126 103 14 -296 142 141 -41 180 6 -158 -25 330
4241 330 -205 83 178 -126 -22 89 189 -207 24 100 -33 -99 -41 -39 177 -15 -45 -55 -79 166 37 -91 -462
4264 -462 255 -172 -153 -31 79 22 -40 -167 143 -44 27 2 -209 87 361 104 -129 -92 -46 79 -119 -141 154
4287 154 -22 -146 -14 235 -79 19 147 -227 232 80 -103 55 -16 -33 108 32 55 7 84 126 -158 175 49
4310 49 89 -121 -171 -104 63 -90 -50 -163 -1 77 -32 50 16 122 206 -5 28 -37 222 222 -35 -188 -106 48 16
4335 16 8 232 277 56 143 -94 19 89 92 39 96 214 20 -136 191 -126 -38 -146 95 -253 -113 -31 119 -38
4359 -38 -157 7 81 -384 117 -74 -104 -196 -80 166 -33 80 -168 -134 -91 43 117 65 -239 158 58 -165 75
4382 75 -81 -141 68 -3 -7 3 203 129 -59 147 78 169 -198 -166 97 -94 -56 145 244 -116 107 -55 57 -5
4406eMk69K62OJ07k69J14J41O6l45J24J03L7K8L0j05n8Q9j62M8j55J77Jn8j71
4431b60L79k25J54k19l7K25K47n45J31j0K76k75J57m3n8K50n3q2J05j57J47L6
4453A43l39K27m5J22k78Q7O1J90k18j4O3Q3J15l27o5J84J26k04K18m6k53J90l6
4476a6K81k40j1j54K99m85L76K16k19K78l08Q6n9j82m9J76P7j34N42m63j72J64
4498Co8J41q3K47l77J51M3j09j5N9o8J39p5K25j71j69k5K16j5K0M9j15j09L45
4522B39k41j70K97k74L37q6j87K29j18J37q7k53K20K57n84L83o5J81N9l21j03
4543a50J96K09l66P5n3RJ83p6r1O4K22k17l4RJ60J77k07p4j55J99j06J33M7k27
4567g3r6L16j82J11j74M3J65K6k80J85J30J0l56L84k26j6n3J54j5Q1j65O5k47
$$ plain form
4406 -5 -1 -270 -8 -2 105 -164 -50 91 157 -188 -64 39 76 104 134 29 -29 60 -102 -54 -209 -32 -31 -89 -260
4431 -260 119 -106 48 -171 -208 17 264 -281 -150 -160 116 -159 -2 -45 -103 147 94 12 117 -40 107 143
4453 143 -196 31 -14 108 -170 -83 -22 168 -50 -64 -1 82 197 -130 -195 -11 115 -89 129 83 -170 20 -16
4476 -16 265 25 14 -140 159 -326 50 266 47 325 17 103 44 -138 -187 -11 66 -68 474 11 -161 3
4498 3 -65 76 -7 240 -137 14 57 -52 -67 -8 -76 63 -12 213 42 -127 -152 64 49 69 118 3 -106 239
4522 239 -2 -172 125 -149 188 102 -85 144 26 163 76 -177 43 300 -284 99 34 215 274 -47 -150
4543 -150 46 255 -111 -36 -89 -80 103 27 -64 0 222 5 -29 -20 140 317 110 36 -119 80 -26 107 154 -73
4567 -73 -169 147 -35 76 -98 -55 110 136 -144 41 171 181 -175 209 -17 -33 -86 68 53 134 -31 34 -213
4590b13j2R4J78R3k62Q4q0J57Rn8R8l8l9nJ46m5J48j27K6k14j20K53J34o2j05
4615D0j14J30k77M32k76R2K99l47j51J27K27p3k8k03K29j85l3K10j26J49j00R2
4637A14K5k5j62J99l00L39Mk65K9N8J43J87l32J19r1o9J23J33q1k35J73m5qM5
4661G8j68o8p6K91j2o1R7q4k3j65K71o1O5l2J4n2o7r8K70o2K3k31J23K74j64j23
4687d1L08j89j0r6L1p4j5J62k30K36j03J34j53J87k22P8L5q7j3l6J64k46J90n9
4711d9q4R8J63q6k51L4L12n7l1k06J97q5K49m12Q7J60k9J28k88K68kPN0n15O5
4736b77L24j56K6J95p4j17p7j04m4M68j52j37K22p0k42J92J4j7p0K15j50j7R4
4759D6n0O3K8j21R7Q8k39L05kk47J17k99K25j45q6K20q8L39m46K63o1KR2K88m23
$$ plain form
4590 -213 -225 -131 47 140 -122 -38 -118 39 48 -10 88 50 11 6 152 107 255 128 154 -60 -180 73 207 145 40
4615 40 -74 56 -221 211 -65 27 326 -21 -172 -45 182 109 81 -122 107 -78 -111 99 -27 122 22 114
4637 114 139 114 -48 151 -149 190 194 -71 -42 16 159 346 14 133 42 -27 96 229 148 -87 86 41 33 78
4661 78 -90 -158 -234 57 45 -16 81 -3 -26 -191 80 19 84 52 66 14 -53 -151 119 57 80 -151 -28 246 82 -41
4687 -41 267 78 68 -28 3 -71 -86 76 -154 82 -21 113 -40 147 -75 3 38 -49 -62 -98 66 -180 10 -49
4711 -49 -133 -35 128 42 -209 -175 137 80 49 -157 40 -45 204 -208 -121 39 10 138 -150 118 116 123 173 -342 -277
4736 -277 47 -109 -83 112 38 -79 -156 -260 -304 164 12 -125 97 27 -215 -23 -9 -26 -96 119 -31 -48 46
4759 46 -4 59 87 -34 63 151 -88 217 215 -32 85 -214 11 -134 -220 0 -88 251 -195 68 7 9 101 389 -34
4784c4j15j80J97J26j97J74K88j19j33J90O3j91P7k00k05J31j46M1J64jk6P7j4
4807c3P3j02K21j91J09k27J08qK43k29K74l36K23j06J08k05L60l15rk9J05J37
4829A71m2j29k59L94J22k76r7K85j88k10J04J26K05j79J9k56N6K96j58j68J44
4850d0J68j43K00n18L95j34L21j30J46m52J80J33k48J62j4n7o7k8o5K86J00k76
4872h1Q2L11l11o1M42m75N3J38j70J42q6n2O2L4j65L3J97r1J08j70Q4j24M0K9
4896c1r7K13m4j25nm5J61q8k1L86l56J05K6j61P4m7p1J59Nn3k69J75M8p6J45j50
4922a42J82K75k95n1r0J12j33L4N9o3J09P1K51j11l83q5L31O9j85j05J80K00j81
4945D9J9l7n6j94L47K0k00J93r4L6l59M1k3L22K44k96r9J83r0k75L17mK17l67
$$ plain form
4784 -34 -149 -329 -132 -6 -203 -29 259 140 7 197 260 69 146 -54 -259 -128 -274 -233 -69 -70 -96 -19 -33
4807 -33 40 -62 159 -32 77 -150 -42 -50 193 -36 238 -98 125 19 127 -78 282 -33 -42 -71 34 171
4829 171 129 0 -259 135 257 -19 -116 169 -19 -229 -125 1 206 27 46 -210 -154 142 -16 -184 -40
4850 -40 128 -15 185 -333 62 -72 249 119 265 -187 -7 126 -122 40 26 -31 -98 -126 -191 95 195 -81
4872 -81 1 312 1 -60 382 -93 -40 98 -72 70 -16 -68 -6 28 -137 -104 93 2 110 -60 24 -100 -60 -31
4896 -31 -128 85 41 -84 -89 -134 27 -61 -82 304 -52 53 79 -82 -8 -55 -126 33 38 -15 -284 -109 -61 -137 8 -142
4922 -142 40 315 20 -31 -121 -9 -142 -108 -49 -112 -3 68 319 208 -175 -260 71 140 -45 -150 30 230 49
4945 49 68 31 -25 -219 128 148 -52 141 47 83 -276 -235 -258 64 308 12 -87 96 6 -269 48 44 261 -106
4969a06O0J86j38l13M25L8j02J62k24M9j23K3jL9J6K53l55q4R4K43O4k32q4J03
4993gk8L5Km3J43K15k11Pm9J34r8l17L14j84J29j90M3K28LO7k04O5k16L14J2q8
5019G6j36K13Rj06j01K39k19j46J05q7K48k74K06j14K00J3j68K9k17L13j88Q6
5041a9J0J41J06j53j33P8N4k92N18n53K64P4k5o5j05n3R9R1J88n31M31j09j39
5064a23J43m0k06K36n0R2O6jJ52j28j77k75M18l03%K10Rm77N14P7k30p8R8J45
5088G2k38J68l1o2Q2M0j46J15J07l18K96j32j96K10J43k01J30j20J16J50l81p6
5110b72N7m4L51k53RK45k2j41j6P3l28M13j14J66k27J97j00Q6j19k7q9n9J43M1
5134c0J92k57K66q3j26J9l7N5k50J48l2J48J67q0k70j5J92Q7K0j46P8J95l09K94
$$ plain form
4969 -106 -46 140 2 -311 114 152 50 212 -12 37 -86 -63 -64 -25 -9 244 -111 -195 -101 142 206 -26 -110 -7
4993 -7 -35 0 2 -41 102 317 106 113 64 198 100 -217 97 -87 42 -148 -105 123 126 193 -11 54 -162 152 164 76
5019 76 -60 153 162 56 -45 194 -25 -171 -66 -153 95 -179 27 -87 113 126 -42 -13 -230 83 -105 -19
5041 -19 -9 132 238 85 -48 30 84 -208 310 -243 21 95 70 5 -100 -153 -54 37 225 -306 125 16 -123
5064 -123 20 -20 -226 10 -40 52 118 117 269 141 -36 -311 107 -196 -196 14 23 -454 60 137 -93 -171 -73 72
5088 72 -166 2 -29 -91 -9 31 -115 0 107 -211 85 -47 -243 -33 110 -91 39 -81 35 185 -196 -272
5110 -272 -215 -259 92 -161 -152 93 71 -70 -86 -13 -341 72 -42 124 -103 94 -6 80 -39 -66 -155 -214 -71 -30
5134 -30 162 -95 171 88 -38 -19 -56 -1 -251 -103 -135 13 180 100 -170 -185 7 94 114 -32 46 241 -68 226
5158B26j07n1o5k5R2k79L49q6j07k1L6K24l63J71q7MK09Oj44n4Pj57J86m0K33
5183A57o2j10Q4j82K37R6j52K5l31L78j41o4R3J4Ok24J13j35L77j68k8J23k10
5206a04J65j50J94j15j89L14k56L34jl28r7K78P3K2n8o3j1L16k72r1R6l5m0j25
$$ plain form
5158 226 119 68 3 -22 70 -209 140 54 -53 -74 -38 186 -177 -6 -93 -89 120 126 -18 -72 -65 -222 -36 -76 157
5183 157 95 -15 69 -113 124 220 68 93 -238 140 -1 -65 28 42 48 -176 -63 -198 179 11 -17 106 -104
5206 -104 61 -89 105 -10 -199 115 -141 193 192 -136 -233 45 118 140 82 19 8 324 52 -39 57 22 -18 -143
$$ [...]
8191a59
##END NTUPLES=NMR FID
##END=
