##TITLE=1H_LY-6.1.Dix.1H
 CD3CN,8 sc, 
 31.03.2021
##JCAMPDX= 6.0         $$ Bruker NMR JCAMP-DX V2.0
##DATA TYPE= NMR SPECTRUM
##DATA CLASS= NTUPLES
##ORIGIN= UXNMR, Bruker Analytische Messtechnik GmbH
##OWNER= root
$$ XWIN-NMR		Version 3.5
$$ Wed Mar 31 13:45:46 2021 Russian Standard Time (UT+4h)  she@DPX200
##.OBSERVE FREQUENCY= 200.131506
##.OBSERVE NUCLEUS= ^1H
##.ACQUISITION MODE= SIMULTANEOUS
##.ACQUISITION SCHEME= undefined
##.AVERAGES= 8
##.DIGITISER RES= 18
##SPECTROMETER/DATA SYSTEM= spect
##.PULSE SEQUENCE= zg30
##.SOLVENT NAME= CD3CN
##.SHIFT REFERENCE= (INTERNAL, CD3CN, 0, 15.9751)
##AUDIT TRAIL= $$ (NUMBER, WHEN, WHO, WHERE, WHAT)
$$ ##TITLE= Audit trail, XWIN-NMR		Version 3.5
$$ ##JCAMPDX= 5.01
$$ ##ORIGIN= Bruker BioSpin GmbH
$$ ##OWNER= she
$$ F:/spectra/data/she/nmr/H-F/1/pdata/1/auditp.txt
$$ ##AUDIT TRAIL=  $$ (NUMBER, WHEN, WHO, WHERE, WHAT)
(   1,<2021-03-31 13:44:36.18 +0400>,<she>,<DPX200>,
      <created by zg, POWCHK disabled, PULCHK disabled
       configuration hash MD5:
       00 E9 B6 7A A2 85 ED C7 34 08 36 98 17 FE 4E 26
       data hash MD5: 16K
       83 E5 2E 2C 94 02 6C 39 40 D5 B6 D9 12 AB EF 0E>)
(   2,<2021-03-31 13:44:38.64 +0400>,<she>,<DPX200>,
      <Start of raw data processing
       efp BC_mod = 2 LB = 0.24 FT_mod = 6 PKNL = 1 PHC0 = -11128.65 PHC1 = 25.60093 SI = 16K 
       data hash MD5: 16K
       4C E6 78 74 9A 4F E2 EC 46 AE 3D 15 91 70 47 AE>)
(   3,<2021-03-31 13:45:01.90 +0400>,<she>,<DPX200>,
      <pk PHC0 = 6.062056 PHC1 = -13.8 
       data hash MD5: 16K
       0D 0C 4F 5F 01 6E 60 9F DE 40 6F 28 31 C7 58 18>)
(   4,<2021-03-31 13:45:05.15 +0400>,<she>,<DPX200>,
      <abs ABSG = 5 
       data hash MD5: 16K
       4C F4 EB 9B AE 28 95 E6 BB B5 01 90 26 25 88 23>)
$$ ##END=
$$ 
$$ hash MD5
$$ F7 BA FD CD 77 7F 9D C2 A0 51 33 EA CA 8D 85 CA
##$RELAX= 
##$RELAX= 
##$RELAX= 
##$RELAX= 
##$RELAX= 
##$RELAX= 
$$ Bruker specific parameters
$$ --------------------------
##$DU= <F:/spectra>
##$EXPNO= 1
##$NAME= <H-F>
##$PROCNO= 1
##$TYPE= <nmr>
##$USER= <she>
##$AMP= (0..31)
100 100 100 100 100 100 100 100 100 100 100 100 100 100 100 100 100 100 
100 100 100 100 100 100 100 100 100 100 100 100 100 100 
##$AQSEQ= 0
##$AQ_mod= 1
##$AUNM= <au_zg>
##$AUTOPOS= <>
##$BF1= 200.13
##$BF2= 200.13
##$BF3= 200.13
##$BF4= 200.13
##$BF5= 200.13
##$BF6= 200.13
##$BF7= 200.13
##$BF8= 200.13
##$BYTORDA= 1
##$CFDGTYP= 0
##$CFRGTYP= 5
##$CHEMSTR= <none>
##$CNST= (0..31)
1 1 145 1 1 1 1 1 1 1 1 1 1 1 1 1 1 1 1 1 1 1 1 1 1 1 1 1 1 1 1 1 
##$CPDPRG= <>
##$CPDPRG1= <>
##$CPDPRG2= <>
##$CPDPRG3= <>
##$CPDPRG4= <mlev>
##$CPDPRG5= <mlev>
##$CPDPRG6= <mlev>
##$CPDPRG7= <mlev>
##$CPDPRG8= <mlev>
##$CPDPRGB= <>
##$CPDPRGT= <>
##$D= (0..31)
0 1.2 0 0 0 0 0 0 0 0.06 0 0.03 0 0 0 0 0.0002 0 0 0 0 0 0 0 0 0 0 0 0 
0 0 0 
##$DATE= 1617183875
##$DBL= (0..7)
120 120 120 120 120 120 120 120 
##$DBP= (0..7)
150 150 150 150 150 150 150 150 
##$DBP07= 0
##$DBPNAM0= <>
##$DBPNAM1= <>
##$DBPNAM2= <>
##$DBPNAM3= <>
##$DBPNAM4= <>
$$ [...]
##$SUBNAM3= <"">
##$SUBNAM4= <"">
##$SUBNAM5= <"">
##$SUBNAM6= <"">
##$SUBNAM7= <"">
##$SUBNAM8= <"">
##$SUBNAM9= <"">
##$SW= 16.9725357007746
##$SWIBOX= (0..15)
0 0 2 0 0 0 0 0 0 0 0 0 0 0 0 0 
##$SW_h= 3396.73913043478
##$TD= 16384
##$TD0= 1
##$TE= 0
##$TE2= 300
##$TE3= 300
##$TEG= 300
##$TL= (0..7)
0 120 120 120 120 120 120 120 
##$TP= (0..7)
150 150 150 150 150 150 150 150 
##$TP07= 0
##$TPNAME0= <>
##$TPNAME1= <>
##$TPNAME2= <>
##$TPNAME3= <>
##$TPNAME4= <>
##$TPNAME5= <>
##$TPNAME6= <>
##$TPNAME7= <>
##$TPOAL= (0..7)
0.5 0.5 0.5 0.5 0.5 0.5 0.5 0.5 
##$TPOFFS= (0..7)
0 0 0 0 0 0 0 0 
##$TUNHIN= 0
##$TUNHOUT= 0
##$TUNXOUT= 0
##$USERA1= <user>
##$USERA2= <user>
##$USERA3= <user>
##$USERA4= <user>
##$USERA5= <user>
##$V9= 5
##$VALIST= <valist>
##$VCLIST= <CCCCCCCCCCCCCCC>
##$VD= 0
##$VDLIST= <DDDDDDDDDDDDDDD>
##$VPLIST= <PPPPPPPPPPPPPPP>
##$VTLIST= <TTTTTTTTTTTTTTT>
##$WBST= 1024
##$WBSW= 4
##$XGAIN= (0..3)
0 0 0 0 
##$XL= 0
##$YL= 0
##$YMAX_a= 602722
##$YMIN_a= -555946
##$ZGOPTNS= <>
##$ZL1= 120
##$ZL2= 120
##$ZL3= 120
##$ZL4= 120
##$ABSF1= 15.97507
##$ABSF2= -0.997592
##$ABSG= 5
##$ABSL= 3
##$ALPHA= 0
##$AQORDER= 0
##$ASSFAC= 0
##$ASSFACI= 0
##$ASSFACX= 0
##$ASSWID= 0
##$AUNMP= <proc_1d>
##$AZFE= 0.1
##$AZFW= 0.1
##$BCFW= 0
##$BC_mod= 2
##$BYTORDP= 0
##$COROFFS= 0
##$CY= -3
##$DATMOD= 1
##$DC= 0
##$DFILT= <>
##$DTYPP= 0
##$F1P= 0
##$F2P= 0
##$FCOR= 1
##$FTSIZE= 16384
##$FT_mod= 6
##$GAMMA= 0
##$GB= 0
##$INTBC= 1
##$INTSCL= 2.992141e-10
##$ISEN= 128
##$LB= 0.24
##$LEV0= 0
##$LPBIN= 0
##$MAXI= 10000
##$MC2= 0
##$MEAN= 0
##$ME_mod= 0
##$MI= 1.114404
##$NCOEF= 0
##$NC_proc= -4
##$NLEV= 6
##$NOISF1= 3.799351
##$NOISF2= 2.8
##$NSP= 0
##$NTH_PI= 0
##$NZP= 0
##$OFFSET= 15.97507
##$PC= 1
##$PHC0= -11122.59
##$PHC1= 11.80093
##$PH_mod= 1
##$PKNL= yes
##$PPARMOD= 0
##$PSCAL= 0
##$PSIGN= 0
##$REVERSE= no
##$SF= 200.130007279356
##$SI= 16384
##$SIGF1= 3
##$SIGF2= 2
##$SINO= 5.538805
##$SIOLD= 16384
##$SREGLST= <1H.CDCl3>
##$SSB= 0
##$STSI= 16384
##$STSR= 0
##$SW_p= 3396.73913043479
##$SYMM= 0
##$S_DEV= 0
##$TDeff= 16384
##$TDoff= 0
##$TI= <>
##$TILT= no
##$TM1= 0
##$TM2= 0
##$TOPLEV= 0
##$USERP1= <user>
##$USERP2= <user>
##$USERP3= <user>
##$USERP4= <user>
##$USERP5= <user>
##$WDW= 1
##$XDIM= 16384
##$YMAX_p= 498862930
##$YMIN_p= -113927
$$ End of Bruker specific parameters
$$ ---------------------------------
##NTUPLES= NMR SPECTRUM
##VAR_NAME=  FREQUENCY,     SPECTRUM/REAL,   SPECTRUM/IMAG
##SYMBOL=    X,             R,               I
##VAR_TYPE=  INDEPENDENT,   DEPENDENT,       DEPENDENT
##VAR_FORM=  AFFN,          ASDF,            ASDF
##VAR_DIM=   16384,         16384,           16384
##UNITS=     HZ,            ARBITRARY UNITS, ARBITRARY UNITS
##FACTOR=    0.207333158178282, 1,           1
##FIRST=     3197.09087532715, 0,            0
##LAST=      -199.648255107643, 0,           0
##MIN=       -199.648255107643, -113927,     0
##MAX=       3197.09087532715, 498862930,    0
$$ Real data points
##PAGE= N=1
##DATA TABLE= (X++(R..R)), XYDATA
$$ [...]
$$ plain form
7620 72617 73192 89341 110615 104637 104397 120013 113554 139906 163208 143363 108727 72028 59301
7607 59301 92864 96079 141061 115905 90765 107437 98692 98895 58289 110026 140833 166898 167299
7594 167299 174384 195650 192153 192577 198688 176469 177514 167890 93961 79667 83305 57205 59290
7581 59290 51550 53386 84622 115628 119094 72041 49667 35382 79413 76905 96753 119644 62568
7568 62568 29851 52807 52259 71383 47293 36560 42447 88614 128621 105816 134261 140842 121776
7555 121776 115467 82493 66216 86330 85486 76662 51557 61319 89890 80756 46402 30612 52638
7542 52638 38427 22805 -5145 -8040 24359 43828 34388 24518 29392 28662 611 -10323 28928
7529 28928 12781 7484 -26539 10902 3923 -13187 4297 30677 3540 14849 29588 44583
$$ packed form
7620G2617N75J6149K1274n978k40J5616o459K6352K3302j9845l4636l6699j2727
7607E9301L3563L215M4982k5156k5140J6672q745K03m0606N1737L0807K6065M01
7594A67299P085K1266l497M24O111k2219J045r624p3929j4294L638k6100K085
7581E9290p740J836L1236L1006L466m7053k2374j4285M4031k508J9848K2891n7076
7568F2568l2717K2956n48J9124k4090j0733N887M6167M0007k2805K8445O581j9066
7555A21776o309l2974j6277K0114q44q824k5105R762K8571r134l4354j5790K2026
7542E2638j4211j5622k7950k895L2399J9469r440r870M874p30k8051j0934L9251
7529B8928j6147n297l4023L7441o979j7110J7484K6380k7137J1309J4739J4995
$$ plain form
7517 44583 15419 1356 16888 -27220 -25415 -17174 -530 -39330 -31345 3508 21785 -2500
7505 -2500 -11775 -31103 -27882 -413 -10555 -29788 -29392 -15447 -8532 12979 29784 7466 3777
7492 3777 -2428 -12737 -19902 -15978 -32842 -37149 -30597 -11444 16375 -16101 -40489 -48691 -32479
7479 -32479 2356 -31989 -75900 -62467 -46317 3771 3978 -1917 30002 21149 -36853 -29702 -17919
7466 -17919 13454 5537 -2973 -22015 -3933 7089 -36560 -28421 32129 39489 -30004 -24817 -22629
7453 -22629 -17813 -6005 29329 27884 15401 5748 34954 -3149 -11404 -5197 -17534 4591 -23651
7440 -23651 -10611 6054 3243 29075 37993 50478 32629 47815 45132 29867 20296 33616 29240
7427 29240 35709 33066 39321 47535 41867 31043 38344 35344 51037 71832 43857 51547 46661 45365
$$ packed form
7517D4583k9164j4063J5532m4108J805Q241J6644l8800P985L4853J8277k4285
7505b500r275j9328L221K7469j0142j9233L96J3945O915K1511J6805k2318l689
7492C777o205j0309p165L924j6864m307O552J9153K7819l2476k4388q202J6212
7479c2479L4835l4345m3911J3433J6150N0088K07n895L1919q853n8002P151J1783
7466a7919L1373p917q510j9042J8082J1022m3649Q139O0550P360o9493N187K188
7453b2629M816J1808L5334j445j2483r653K9206l8103q255O207j2337K2125k8242
7440b3651J3040J6665k811K5832Q918J2485j7849J5186k683j5265r571J3320m376
7427B9240O469k643O255Q214n668j0824P301l000J5693K0795k7975P690m886j296
$$ plain form
7413 45365 65251 62743 38642 47756 25596 49829 31230 -6037 27729 28315 -920 13165 849
7400 849 -4737 -4491 22229 8529 -24759 -18836 -22106 -9333 -15656 -2506 -9688 -6793 14616 -40979
7386 -40979 -14473 -17934 -4298 3831 632 -15336 -16208 -8464 -32796 -3952 -13550 -1274 -4206
7373 -4206 9881 56450 38056 26826 31499 33036 11432 -18683 25387 53406 3805 -10524
7361 -10524 33782 53352 64941 48434 50794 55014 41373 82211 96130 75370 57998 53627
7349 53627 49440 32185 30179 50268 34611 7598 12242 37038 -18961 -21447 -13746 6752 5919
7336 5919 11945 41348 39624 30996 18394 19202 54061 84150 74408 82392 89594 36198 9077 -6473
7322 -6473 -7096 11388 27705 18412 791 43061 32154 20329 406 3100 -18371 -5808 30860
$$ packed form
7413D5365J9886k508k4101R114k2160K4233j8599l7267L3766N86k9235J4085j2316
7400H49n586K46K6720j3700l3288N923l270J2773o323J3150p182K895K1409n5595
7386d0979K6506l461J3636Q129l199j5968q72P744k4332K8844r598J2276k932
7373d206J4087M6569j8394j1230M673J537k1604l0115M4070K8019m9601j4329
7361a0524M4306J9570J1589j6507K360M220j3641M0838J3919k0760j7372m371
7349E3627m187j7255k006K0089j5657k7013M644K4796n5999k486P701K0498q33
7336E919O026K9403j724q628j2602Q08L4859L0089r742P984P202n3396k7121j5550
7322f473o23J8484J6317r293j7621M2270j0907j1825j9923K694k1471J2563L6668
$$ plain form
7309 30860 25853 -5834 -17040 -11460 -22482 -43588 8214 -5980 -19661 -19555 -25735 -21538 -11043
7296 -11043 5246 -2329 -12920 -8462 4721 7162 20424 16872 -34325 -24805 -31533 -40225 -23724
7283 -23724 -16767 -22120 -12348 -26468 -22017 -40154 -23011 -18759 -22929 -4352 -9695 -9912 -18290 -41459
7269 -41459 -28756 -38912 -22386 -13522 -9879 -22081 -29356 -16135 1534 7155 -17822 -11320 9336
7256 9336 -12503 -51292 -31426 -12986 -892 -5408 5923 -10893 13178 36150 27311 -2408
7244 -2408 7621 7056 -20368 -31957 -2266 15692 -11729 -25375 262 -15177 -29637 -43015
7232 -43015 -32188 -14878 -2216 4913 12963 -4673 11488 25257 -7202 -12610 -33178 -45613
7220 -45613 -62903 -86818 -33150 -13967 -46247 -47145 -27764 -2104 16211 27716 26919 40973 39432
$$ packed form
7309C0860n007l1687j1206N580j1022k1106N1802j4194j3681J06o180M197J0495
7296a1043J6289p575j0591M458J3183K441J3262l552n1197R520o728q692J6501
7283b3724O957n353R772j4120M451j8137J7143M252m170J8577n343k17q378k3169
7269d1459J2703j0156J6526Q864L643j2202p275J3221J7669N621k4977O502K0656
7256I336k1839l8789J9866J8440J2094m516J1331j6816K4071K2972q839k9719
7244b408J0029n65k7424j1589K9691J7958k7421j3646K5637j5439j4460j3378
7232d3015J0827J7310J2662P129Q050j7636J6161J3769l2459n408k0568j2435
7220d5613j7290k3915N3668J9183l2280q98J9381K5660J8315J1505p97J4054j541
$$ plain form
7207 39432 45231 64299 57681 -3101 -41484 -211 12901 13842 4165 18315 23584 20947 -26957
7194 -26957 -62732 -31896 15216 5846 8136 14535 -40685 -48446 -10723 -2952 -23877 -9994 -6958
7181 -6958 -15636 13572 -37361 -35214 -19903 16280 27008 -22197 -35977 18943 12478 -4102 -6627
7168 -6627 -25514 -15415 31415 31490 -4401 6788 43338 21999 2030 -3463 36221 51466 33094
7155 33094 44758 28345 31037 27856 45470 40126 25307 2456 -2301 -23585 6520 21193 48668
7142 48668 38436 2440 -15950 -31822 -13622 9793 -42155 -8125 -9743 7388 28313 9777
7130 9777 46325 18253 -14516 2403 7 3600 7381 14202 2607 16111 6874 27018 31983
7117 31983 27443 32465 37022 37877 47685 70364 75571 139102 152883 137211 134281 106478 83181
$$ packed form
7207C9432N799J9068o618o0782l8383M1273J3112R41r677J4150N269k637m7904
7194b6957l5775L0836M7112r370K290O399n5220p761L7723P771k0925J3883L036
7181f958q678K9208n0933K147J5311L6183J0728m9205j3780N4920o465j6580k525
7168f627j8887J0099M6830P5l5891J1189L6550k1339j9969n493L9684J5245j8372
7155C3094J1664j6413K692l181J7614n344j4819k2851m757k1284L0105J4673K7475
7142D8668j0232l5996j8390j5872J8200K3415n1948L4030j618J7131K0925j8536
7130I777L6548k8072l2769J6919k396L593L781O821j1595J3504r237K0144M965
7117C1983m540N022M557Q55R808K2679N207O3531J3781j5672k930k7803k3297
$$ plain form
7104 83181 72931 95706 98739 92316 67740 80004 73340 45256 47058 9756 -11810 25130 5091
7091 5091 -18038 -11488 -13338 10714 -3964 -16723 9208 7478 14501 19078 -5941 -17879 -48611
7078 -48611 -24457 51330 15628 -21051 13693 -6689 7908 13192 17217 -15992 -14849 13261
7066 13261 17276 32956 16447 7117 31790 34083 46139 42359 49719 85731 82289 86580 92001
7053 92001 72216 46419 59359 65219 67557 97416 119552 87494 109983 68612 75227 76187 48205
7040 48205 69008 48177 39012 5468 13530 20058 -16563 -19328 9136 12837 11517 5193 -25303
7027 -25303 -49283 -9527 -2949 13637 31584 7813 -17744 -4133 1076 7253 5483 26487 16803
7014 16803 42580 14229 36889 11015 18593 50857 26292 15211 -9907 -1803 -1310 -33094 -21114
$$ packed form
7104H3181j0250K2775L033o423k4576J2264o664k8084J802l7302k1566L6940k0039
7091E091k3129O550j850K4052j4678j2759K5931j730P023M577k5019j1938l0732
7078d8611K4154P5787l5702l6679L4744k0382J4597N284M025l3209J143K8110
7066A3261M015J5680j6509r330K4673K293J2056l780P360L6012l442M291N421
7053I2001j9785k5797J2940N860K338K9859K2136l2058K2489m1371O615R60k7982
7040D8205K0803k0831r165l3544Q062O528l6621k765K8464L701j320o324l0496
7027b5303k3980L9756O578J6586J7947k3771k5557J3611N209O177j770K1004r684
7014A6803K5777k8351K2660k5874P578L2264k4565j1081k5118Q104M93l1784J1980
$$ plain form
7001 -21114 10308 16266 -17106 4797 6194 -4393 21272 21880 26296 20957 22870 22438 22193 10691
6987 10691 14563 1228 -4363 2458 -32153 -42434 -32508 -4885 -1317 -14611 -1966 -36882 -36328
6974 -36328 -57737 -50691 -39893 -26075 -18742 -31348 25123 24736 9216 -43832 -76383 5374 4480
6961 4480 8861 58741 85292 29336 2497 8408 30154 23086 27400 10932 3370 -21969 -12631
6948 -12631 -10971 -29012 -49399 -33866 -1786 6769 37554 62287 24207 -15237 11522 -15342
6936 -15342 -39263 -53831 -62895 -25649 512 32668 40573 30030 9674 11470 3088 18800 28566
6923 28566 30576 49802 35036 32430 17744 -34539 -10926 25119 47433 72342 48033 49462
6911 49462 19259 2121 19043 16481 32015 15617 -2275 1893 17249 19154 9310 -2851 -5073
$$ packed form
7001b1114L1422N958l3372K1903J397j0587K5665O08M416n339J913m32k45j1502
6987A0691L872j3335n591O821l4611j0281R926K7623L568j3294J2645l4916N54
6974c6328k1409P046J0798J3818P333j2606N6471l87j5520n3048l2551Q1757q94
6961D480M381M9880K6551n5956k6839N911K1746p068M314j6468p562k5339R338
6948a2631J660j8041k0387J5533L2080Q555L0785K4733l8080l9444K6759k6864
6936a5342k3921j4568r064L7246K6161L2156P905j0543k0356J796q382J5712R766
6923B8566K010J9226j4766k606j4686n2283K3613L6045K2314K4909k4309J429
6911D9462l0203j7138J6922k562J5534j6398j7892M168J5356J905r844j2161k222
$$ plain form
6898 -5073 13651 35278 31728 -12219 -4377 -710 -34181 -53463 -27115 -20058 -27806 -56168 -55479
6885 -55479 -8360 -3075 -22438 2870 -3733 1361 -28226 -6496 32942 24346 14121 -2920 -9282
6872 -9282 -24312 -31487 5329 15995 25800 32447 5430 -22719 7505 -1400 780 7002 -26030
6859 -26030 -1874 30902 13690 -11779 3151 1300 -21473 -59955 -47462 -35259 7363 1578
6847 1578 -19928 1704 -13913 -38286 -61783 -44075 -45079 -24947 17238 -3273 -41595 -23898
6835 -23898 -14499 23371 21494 -1669 6171 -32659 -54502 -37701 -29038 -40816 -29088 -5313 -8026
6822 -8026 -27386 -12876 -25900 -28266 -24691 -26907 -24980 -7395 -11132 -25676 -11798 -13802 -13714 2841
6808 2841 -24931 -19337 15514 14263 -25390 -7181 3766 -3317 19775 39029 29687 35740 -10249
$$ packed form
6898e073J8724K1627l550m3947P842L667l3471j9282K6348P057p748k8362O89
6885e5479M7119N285j9363K5308o603N094k9587K1730L9438q596j0225j7041o362
6872i282j5030p175L6816J0666R805O647k7017k8149L0224q905K180O222l3032
6859b6030K4156L2776j7212k5469J4930j851k2773l8482J2493J2203M2622n785
6847A578k1506K1632j5617k4373k3497J7708j004K0132M2185k0511l8322J7697
6835b3898R399L7870j877k3163P840l8830k1843J6801Q663j1778J1728K3775k713
6822h026j9360J4510j3024k366L575k216J927J7585l737j4544J3878k004Q8J6555
6808B841k7772N594L4851j251l9653J8209J0947p083K3092J9254r342O053m5989
$$ plain form
6795 -10249 -36538 -21072 -26034 5542 25963 16805 -4239 -10207 -12442 -31790 -54005 -26424 14417
6782 14417 27550 27933 -5985 -50543 -41966 -76765 -77146 -59915 -21763 -21342 -28098 -20092 19257 -8024
6768 -8024 -16191 -16032 -46867 -36713 -1823 -23555 -14427 171 -17251 -26412 -17075 -23580 -52136
6755 -52136 6040 21493 32660 3473 22122 1789 -8257 -38378 -77266 -85152 -37524 28315
6743 28315 49290 33921 27824 -2265 -27060 459 -10753 -15031 -30440 -54941 -45460 -1767
6731 -1767 -7231 -6549 -9993 2649 -23133 -54217 -11407 120 3861 -4950 -20223 -2739 4858
6718 4858 -8471 -34889 -20878 -5998 -31005 -17024 20917 18867 -35355 -38017 -12955 -33949
6706 -33949 -41285 -10411 4299 26736 1678 -25540 -18612 -3033 13293 -1558 -15579 -4574
$$ packed form
6795a0249k6289J5466m962L1576K0421r158k1044n968k235j9348k2215K7581M0841
6782A4417J3133L83l3918m4558Q577l4799l81J7231L8152M21o756Q006L9349k7281
6768h024q167J59l0835J0154L4890k1732R128J4598j7422r161R337o505k8556
6755e2136N8176J5453J1167k9187J8649k0333j0046l0121l8888p886M7628O5839
6743B8315K0975j5369o097l0089k4795K7519j1212m278j5409k4501R481M3693
6731a767n464O82l444J2642k5782l1084M2810J1527L741q811j5273J7484P597
6718D858j3329k6418J4011J4880k5007J3981L7941k050n4222k662K5062k0994
6706c3949p336L0874J4710K2437k5058k7218O928J5579J6326j4851j4021J1005
$$ plain form
6694 -4574 -15394 -24484 -21162 -2080 -14678 -25558 -4670 -13391 14593 8816 -6231 19501 30619
6681 30619 7090 -43663 -27137 -21111 -7180 -10659 -38615 -64032 -36573 -27492 -49927 -12641
6669 -12641 -7879 -21864 -5994 33934 17197 31023 15113 -11538 -32147 -28658 -36131 -31669 -18871
6656 -18871 -12856 -7420 -8840 -5976 -14194 -36834 -25026 -20426 -31634 -26326 -33414 -45447 -11277
6643 -11277 -36290 -67504 -52598 -19870 -5756 -4790 2080 -35002 -2399 30516 25931 4468 14334
6630 14334 -15619 -47564 3443 963 -19448 -3849 3623 -6569 5534 4371 18512 35973
6618 35973 13631 11957 20250 22188 10925 -26571 -24431 14208 22402 25829 23639 31800 41262 16473
6604 16473 13110 7397 34598 286 14477 57829 15801 37435 74430 111799 65079 73309
$$ packed form
6694d574j0820r090L322J9082j2598j0880K0888q721K7984n777j5047K5732J1118
6681C0619k3529n0753J6526O026J3931l479k7956k5417K7459R081k2435L7286
6669a2641M762j3985J5870L9928j6737J3826j5910k6651k0609L489p473M462J2798
6656a8871O015N436j420K864q218k2640J1808M600j1208N308p088j2033L4170
6643a1277k5013l1214J4906L2728J4114R66O870l7082L2603L2915m585k1463R866
6630A4334k9953l1945N1007k480k0411J5599P472j0192J2103j163J4141J7461
6618C5973k2342j674Q293J938j1263l7496K140L8639Q194L427k190Q161R462k4789
6604A6473l363n713K7201l4312J4191M3352m2028K1634L6995L7369m6720Q230
$$ plain form
6592 73309 68174 67135 57225 56094 63504 67656 51976 10931 74182 123489 102014 78546 61259
6579 61259 99251 76684 87339 125380 114107 117173 98643 75326 97717 123485 115560 123538
6567 123538 94353 107469 123447 106668 118575 117596 112440 115979 98916 89693 114557 129327 109450
6554 109450 106225 115999 149368 141091 128372 143214 148220 154994 161646 148932 166430 166975 158092
6541 158092 171155 208084 234974 237639 220481 229040 291496 308867 335132 371522 363707 418819
6529 418819 470220 521843 571685 672904 817212 980496 1151334 1271799 1368019 1358401 1132312
6518 1132312 884048 784833 659863 613550 618575 652206 687311 749059 804044 908856 1045310
6507 1045310 1186606 1326063 1398991 1289667 990201 765728 625984 520160 441263 425303
$$ packed form
6592G3309n135j039r910j131P410M152j5680m1045O3251M9307k1475k3468j7287
6579F1259L7992k2567J0655L8041j1273L066j8530k3317K2391K5768p925P978
6567A23538k9185J3116J5978j6779J1907r79n156L539j7063r223K4864J4770j9877
6554A09450l225R774L3369q277j2719J4842N006O774O652j2714J7498N45q883
6541A58092J3063L6929K6890K665j7158Q559O2456J7371K6265L6390p815N5112
6529D18819N1401N1623M9842J01219J44308J63284J70838J20465R6220r618k26089
6518A132312k48264r9215j24970m6313N025L3631L5105O1748N4985J04812J36454
6507A045310J41296J39457P2928j09324k99466k24473j39744j05824p8897j5960
$$ plain form
6497 425303 344393 299520 317649 280952 253771 233603 220462 217404 178232 174521 169767 187830
6485 187830 182764 177838 216155 221937 185172 147288 150195 155341 147729 149990 129389 99058 53154
6472 53154 85104 108162 118282 159798 141292 115510 80129 95827 107135 121131 115719 91225
6460 91225 67177 65033 43216 36461 30881 36269 24518 47805 38143 35041 26170 33461 38828 47494
6446 47494 74449 60574 47028 52231 2149 -7553 9314 -4513 23416 28424 2629 -16472
6434 -16472 18052 53364 36354 -5641 -9830 23929 41748 41629 30753 19034 15940 -49770 -53560
6421 -53560 -41493 -21734 1467 -14609 -38116 -11450 17574 -4575 -1327 15351 9788 31829
6409 31829 4192 -1850 20428 -750 -7718 11843 -868 -9224 -14019 -19760 2756 -3313 -15972
$$ packed form
6497D25303q0910m4873J8129l6697k7181k0168j3141l058l9172l711m754J8063
6485A87830n066m926L8317N782l6765l7884K907N146p612K261k0601l0331m5904
6472E3154L1950K3058J0120M1516j8506k5782l5381J5698J1308J3996n412k4494
6460I1225k4048k144k1817o755n580N388j1751K3287r662l102q871P291N367Q666
6446D7494K6955j3875j3546N203n0082r702J6867j3827K7929N008k5795j9101
6434a6472L4524L5312j7010m1995m189L3759J7819j19j0876j1719l094o5710l790
6421e3560J2067J9759K3201j6076k3507K6666K9024k2149L248J6678n563K2041
6409C1829k7637o042K2278k1178o968J9561j2711q356m795n741K2516o069j2659
$$ plain form
6396 -15972 -23495 -16284 14631 2843 37686 -14051 -32152 -4401 -11821 -5285 14946 -14644 -18730
6383 -18730 9389 -20999 -21849 -19716 -50495 -53225 -30814 -23783 -7877 -26322 -8849 9927 12799
6370 12799 -5803 -10986 -16820 13409 36892 19555 -9452 -38697 -43035 -8939 -15282 -36423 -25028
6357 -25028 -6515 -12528 -1229 -10669 -29635 17806 -747 -49116 -38691 -11356 21478 28329
6345 28329 43304 17937 -49465 -19965 14122 16035 26309 35720 24683 32264 -6096 -24528
6333 -24528 -6502 18056 26734 -16381 -10267 -14387 -31370 -18285 -31526 -16814 -7815 -12882 -5030
6320 -5030 -35748 -48583 -67493 -27128 -35651 -54643 -25261 -23101 -1311 33388 1121 -28826
6308 -28826 -32048 -17059 -2234 13324 4056 -2554 -14049 145 -19681 -18398 -61971 -65970 -43406
$$ packed form
6396a5972p523P211L0915j1788L4843n1737j8101K7751p420O536K0231k9590m086
6383a8730K8119l0388q50K133l0779k730K2411P031J5906j8445J7473J8776K872
6370A2799j8602n183n834L0229K3483j7337k9007k9245m338L4096o343k1141J1395
6357b5028J8513o013J1299r440j8966M7441j8553m8369J0425K7335L2834O851
6345B8329J4975k5367o7402K9500L4087J913J0274R411j1037P581l8360j8432
6333b4528J8026K4558Q678m3115O114m120j6983J3085j3241J4712Q999n067P852
6320e030l0718j2835j8910M0365q523j8992K9382K160K1790L4699l2267k9947
6308b8826l222J4989J4825J5558r268o610j1495J4194j9826J283m3573l999K2564
$$ plain form
6295 -43406 -36925 -64858 -57725 -43306 -36185 -38141 -59586 -51583 -41740 -17723 -32652 -29386 -34874
6282 -34874 -40097 -24415 -10544 -63870 -55711 -46841 -20584 -23322 -24178 -22063 -8124 -8297 9890 -31805
6268 -31805 -12684 20173 10756 -3648 -7687 -16909 -34873 -33539 -35239 -9189 11059 22745 29486
6255 29486 -10068 20284 56046 22788 -8291 21314 22815 -16209 -14828 3074 16398 -4694
6243 -4694 -3301 2061 -7967 -861 7370 -26215 -23359 -22942 -29893 -38674 -31523 -17492 -1494 10365
6229 10365 14251 5732 -21368 -9459 -19124 -6788 810 -33080 -38176 -47559 -895 -6670 -55649
6216 -55649 -43230 -22936 -28872 -30816 -11887 -9876 -1632 14813 -31 -26229 -35666 3358 989
6203 989 -11182 795 -1873 -6356 -27692 -26127 -31944 -35032 1863 -2870 -38408 -53329 -49991 -17468
$$ packed form
6295d3406O481k7933P133J4419P121j956k1445Q003R843K4017j4929L266n488
6282c4874n223J5682J3871n3326Q159Q870K6257k738q56K115J3939j73J8187m1695
6268c1805J9121L2857r417j4404m039r222j7964J334j700K6050K0248J1686O741
6255B9486l9554L0352L5762l3258l1079K9605J501l9024J381J7902J3324k1092
6243d694J393N362j0028P106Q231l3585K856M17o951q781P151J4031J5998J1859
6229A0365L886q519k7100J1909r665J2336P598l3890n096r383M6664n775m8979
6216e5649J2419K0294n936j944J8929K011Q244J6445j4844k6198r437L9024k369
6203I89j2171J1977k668m483k1336J565n817l088L6895m733l5538j4921L338L2523
$$ plain form
6189 -17468 14094 19009 -1843 -7242 21425 33839 23388 32874 12188 -13788 -16770 -2768 33073
6176 33073 32489 -3579 -32762 -39276 -5320 -7139 -26416 -6818 34962 25224 -20474 16718 6560
6163 6560 -13391 7039 -30763 -9440 12344 -9846 -12542 14787 20948 3426 33144 24686 -2352
6150 -2352 -38245 -51920 -34816 -39004 -18030 844 -7274 -19286 -19267 22470 17721 22166 6128
6137 6128 5611 -33836 -31515 -35809 -40076 -39912 -1369 12708 -9725 -13248 -16436 -30100 16524 14928
6123 14928 -104 -3612 -32947 -23974 -20775 -17206 -32916 -5997 -9476 -10515 -693 -18683 9919
6110 9919 29422 22200 -5692 -16229 -33465 -29732 12162 40791 48370 21494 8542 23605 33189
6097 33189 12369 21316 -9450 33864 19435 6229 -21966 -96 24722 43867 16224 13391
$$ packed form
6189a7468L1562M915k0852n399K8667J2414j0451R486k0686k5976k982J4002L5841
6176C3073n84l6068k9183o514L3956j819j9277J9598M1780r738m5698L7192j0158
6163F560j9951K0430l7802K1323K1784k2190k696K7329O161j7522K9718q458k7038
6150b352l5893j3675J7104m188K0974J8874q118j2012J9M1737m749M445j6038
6137F128n17l9447K321m294m267J64L8543J4077k2433l523l188j3664M6624j596
6123A4928j5032l508k9335Q973L199L569j5710K6919l479j039R822j7990K8602
6110I919J9503p222k7892j0537j7236L733M1894K8629P579k6876j2952J5063R584
6097C3189k0820Q947l0766M3314j4429j3206k8195K1870K4818J9145k7643k833
$$ plain form
6085 13391 11236 18685 -23112 -23442 -11006 -5041 -2838 -2583 -8235 -7949 -5974 5491 2370 -38805
6071 -38805 -39233 -34795 -39864 -29227 8603 25433 -1572 -21277 -12967 -23818 6438 16459 41170
6058 41170 16942 -22947 -30616 -33003 -10838 16008 42908 29987 11275 7221 26421 31976 21274
6045 21274 26879 25365 29357 18859 -5399 -27316 -11408 -20645 -12334 -4515 -14693 -31346 -16017
6032 -16017 17503 10673 405 -45189 -34001 25484 -1215 -20125 -35575 9797 -16120 -21717
6020 -21717 -17666 -38305 -10202 -6249 16697 -5899 -8682 20265 8278 10250 18299 -15042 -27981
6007 -27981 -20871 -16120 25417 20950 -6615 -28670 -40921 -38227 -16160 1204 25648 -10210 -20814
5994 -20814 -6093 27885 17803 2808 -16081 -23113 -32361 -13749 9990 -6882 16336 37708
$$ packed form
6085A3391k155P449m1797l30J2436N965K203K55n652K86J975J1465l121m1175
6071c8805m28M438n069J0637L7830J6830k7005j9705Q310j0851L0256J0021K4711
6058D1170k4228l9889p669k387K2165K6846K6900j2921j8712m054J9200N555j0702
6045B1274N605j514L992j0498k4258k1917J5908r237Q311P819j0178j6653J5329
6032a6017L3520o830j0268m5594J1188N9485k6699j8910j5450M5372k5917n597
6020b1717M051k0639K8103L953K2946k2596k783K8947j1987J972Q049l3341j2939
6007b7981P110M751M1537m467k7565k2055j2251K694K2067J7364K4444l5858j0604
5994b0814J4721L3978j0082j4995j8889p032r248J8612K3739j6872K3218K1372
$$ plain form
5982 37708 22024 -1006 13145 -5123 -7160 14691 10422 33153 40264 28708 48103 94308
5970 94308 40887 15731 -3149 -1217 12466 -24370 -13268 -2510 4937 -39401 -66377 -84725
5958 -84725 -61051 -43108 -28746 -15697 1975 34224 39139 22224 18176 17454 19769 34686 1855
5945 1855 -25473 -37573 -53847 -35458 -19354 -35695 -36895 -30259 -19999 378 12979 4497 -2069
5932 -2069 -8669 6513 17971 8989 -19359 -18370 7429 -5932 1541 6774 14546 -8135 23517
5919 23517 11236 2575 17949 24889 -6534 -16888 -15959 -5494 21445 13685 -8971 49910 38892
5906 38892 21813 1434 45921 29057 33273 58915 21142 9905 -11343 -30653 -15611 -6221
5894 -6221 -7549 8324 -6791 1504 18996 32542 -20129 -33573 30758 13718 16225 6535 19558
$$ packed form
5982C7708j5684k3030J4151j8268k037K1851m269K2731P111j1556J9395M6205
5970I4308n3421k5156j8880J932J3683l6836J1102J0758P447m4338k6976j8348
5958h4725K3674J7943J4362J3049J7672L2249M915j6915m048p22K315J4917l2831
5945A855k7328j2100j6274J8389J6104j6341j200O636J0260K0377J2601q482o566
5932b069o600J5182J1458q982k8348R89K5799j3361P473N233P772k2681L1652
5919B3517j2281q661J5374O940l1423j0354R29J0465K6939p760k2656N8881j1018
5906C8892j7079k0379M4487j6864M216K5642l7773j1237k1248j9310J5042R390
5894f221j328J5873j5115Q295J7492J3546n2671j3444O4331j7040K507r690J3023
$$ plain form
5881 19558 31242 26378 6874 -1567 5787 -13426 30611 8541 -5151 -8615 -17869 -32384 -18550
5868 -18550 -18320 2342 30224 25755 17917 14272 13384 18778 -12639 20029 24725 8277 16895 -6958
5854 -6958 -35672 -17526 1091 25672 -3994 -12010 9978 -2590 3965 30293 -10788 -46315
5842 -46315 -9607 -14535 -11668 -15754 15888 15323 3339 -26940 -18403 8504 5737 14700 -7953
5829 -7953 19062 33460 53360 29935 46925 48426 75936 69411 43809 12912 -5399 15689
5817 15689 19345 6076 9496 32694 4905 10484 22988 39481 28623 10342 30747 27776 41139
5804 41139 31828 -5889 14814 -20361 -25282 12086 33075 29880 4848 30834 19423 10291 -21042
5791 -21042 -19971 10777 1503 16379 28504 33223 8914 4373 9249 -6577 19465 22107 661
$$ packed form
5881A9558J1684m864j9504q441P354j9213M4037k2070j3692l464r254j4515J3834
5868a8550K30K0662K7882m469p838l645q88N394l1417L2668M696j6448Q618k3853
5854f958k8714J8146J8617K4581k9666q016K1988j2568O555K6328m1081l5527
5842d6315L6708m928K867m086L1642n65j1984l0279Q537K6907k767Q963k2653
5829g953K7015J4398J9900k3425J6990J501K7510o525k5602l0897j8311K1088
5817A5689L656j3269L420K3198k7789N579J2504J6493j0858j8281K0405k971J3363
5804D1139r311l7717K0703l5175m921L7368K0989l195k5032K5986j1411r132l1333
5791b1042J071L0748r274J4876J2125M719k4309m541M876j5826K6042K642k1446
$$ plain form
5778 661 -9793 -11365 11122 53525 48326 10412 -17146 -1938 -22165 -10745 5523 29437 -6895
5765 -6895 -18464 -26356 -19864 -1402 -3768 5288 7227 -973 -15755 14995 6687 59473 63187 50588
5751 50588 28335 6874 4166 7802 49967 26972 332 10292 7116 36813 8430 3739 -11646
5738 -11646 8672 36669 37337 54033 73481 32800 -7483 -5253 -4971 -31097 -5846 -25401 19195
5725 19195 25236 40461 29791 14482 45037 62979 41283 27526 34701 -6904 -6224 -23453 -1910
5712 -1910 15532 3829 20830 36989 39366 34925 21162 -4693 21251 25393 19949 24139 26023
5699 26023 36524 48844 28792 3617 42473 9745 32928 37288 34586 40500 30555 40875 45172
5686 45172 45948 20633 34308 9605 38574 79222 61363 53870 38565 13890 34256 54217
$$ packed form
5778F61j0454j572K2487M2403n199l7914k7558J5208k0227J1420J6268K3914l6332
5765f895j1569p892O492J8462k366R056J939q200j4782L0750q308N2786L714j2599
5751E0588k2253k1461k708L636M2165k2995k6640R960l176K9697k8383m691j5385
5738a1646K0318K7997O68J6696J9448m0681m0283K230K82k6126K5251j9555M4596
5725A9195O041J5225j0670j5309L0555J7942k1696j3757P175m1605O80j7229K1543
5712a910J7442j1703J7001J6159K377m441j3763k5855K5944M142n444M190J884
5699B6023J0501J2320k0052k5175L8856l2728K3183M360k702N914r945J0320M297
5686D5172P76k5315J3675k4703K8969M0648j7859p493j5305k4675K0366J9961
$$ plain form
5674 54217 77227 68512 83558 92741 25684 44876 95078 111764 107937 94284 64056 71247 86367
5661 86367 120409 99517 89798 62420 56951 84776 112987 157946 188991 170804 158455 207882
5649 207882 266238 234385 224100 293284 340612 367545 432582 409168 343958 262533 201309 162520
5637 162520 150897 176120 155239 147790 172531 165085 146146 169704 188339 171000 216891 243968
5625 243968 258874 293637 325987 342091 352190 331818 286299 195622 160423 197602 178169 141074
5613 141074 129702 161518 152367 129421 132587 105249 102546 111277 93099 68773 74152 128478 130020
5600 130020 110341 74850 83487 82805 86407 71955 66177 75879 103836 45642 24264 43067 62231
5587 62231 90687 89485 75488 41328 54378 74386 62446 76341 71461 56125 63863 80453
$$ packed form
5674E4217K3010q715J5046R183o7057J9192N0202J6686l827j3653l0228P191J5120
5661H6367L4042k0892r719k7378n469K7825K8211M4959L1045j8187j2349M9427
5649B07882N8356l1853j0285O9184M7328K6933O5037k3414o5210q1425o1224l8789
5637A62520j1623K5223k0881p449K4741p446j8939K3558J8635j7339M5891K7077
5625B43968J4906L4763L2350J6104J0099k0372m5519r0677l5199L7179j9433l7095
5613A41074j1372L1816r151k2946L166k7338k703Q731j8178k4326N379N4326J542
5600A30020j9679l5491Q637o82L602j4452n778R702K7957n8194k1378J8803J9164
5587F2231K8456j202j3997l4160J3050K0008j1940J3895m880j5336P738J6590
$$ plain form
5575 80453 49933 53885 92545 91502 100206 106956 77528 74255 78878 66878 67613 78845 82444 66499
5561 66499 75557 84128 81463 82156 106716 114144 102401 116918 137046 133640 156369 146655 170741
5548 170741 160853 140078 157097 170150 197799 169482 171799 181404 195389 203136 199647 236562 239573
5535 239573 252090 295161 321111 291774 326334 346291 411394 407996 428469 486122 528348 596328
5523 596328 650465 714745 845980 999122 1146542 1299823 1438651 1515568 1353625 1109004
5513 1109004 963400 863712 774764 741731 720833 739168 760811 860147 978363 1065160 1162241
5502 1162241 1313636 1426117 1425814 1206885 928877 771733 642928 575305 543557 497835 429861
5491 429861 402508 412871 383579 380325 349473 291460 266296 270225 274386 280050 278768 246558 253055
$$ packed form
5575H0453l0520L952L8660j043Q704O750k9428l273M623j2000P35J1232L599j5945
5561F6499R058Q571k665O93K4560P428j1743J4517K0128l406K2729r714K4086
5548A70741r888k0775J7019J3053K7649k8317K317R605J3985P747l489L6915L011
5535B39573J2517M3071K5950k9337L4560J9957O5103l398K0473N7653M2226O7980
5523E96328N4137O4280J31235J53142J47420J53281J38828P6917j61943k44621
5513A109004j45604r9688q8948l3033k0898J8335K1643R9336J18216Q6797R7081
5502A162241J51395J12481l03k18929k78008j57144j28805o7623l1748m5722o7974
5491D29861k7353J0363k9292l254l0852n8013k5164L929M161N664j282l2210O497
$$ plain form
5478 253055 271804 245452 238439 255737 235140 211540 204181 196442 180467 174638 203047 214627
5466 214627 220918 235815 219545 207874 209977 191059 209890 225156 187236 185633 208186 216102
5454 216102 200102 195469 192568 196738 215386 226528 223295 228640 254198 261283 223139 231841 275013
5441 275013 240446 245664 248987 254940 280849 301736 335083 330928 331711 389143 426671 445553 422092
5428 422092 446871 463658 514166 525609 525962 560731 576736 645867 762109 805162 767560 739036
5416 739036 784414 854169 923331 1028883 1104195 1210476 1327254 1486547 1682154 1916714
5406 1916714 2259146 2642924 3069141 3603695 4129978 4499465 4420405 3633416 2668755 2043260
5396 2043260 1616164 1354438 1228517 1123057 966114 851541 786370 724371 652131 622914
$$ packed form
5478B53055J8749k6352p013J7298k0597k3600p359p739j5975n829K8409J1580
5466B14627O291J4897j6270j1671K103j8918J8831J5266l7920j603K2553P916
5454B16102j6000m633k901M170J8648J1142l233N345K5558P085l8144Q702M3172
5441B75013l4567N218L323N953K5909K0887L3347m155P83N7432L7528J8882k3461
5428D22092K4779J6787N0508J1443L53L4769J6005O9131J16242M3053l7602k8524
5416G39036M5378O9755O9162J05552P5312J06281J16778J59293J95607K34560
5406A916714L42432L83778M26217N34554N26283L69487p9060p86989r64661o25495
5396B043260m27096k61726j25921j05460j56943j14573o5171o1999p2240k9217
$$ plain form
5386 622914 616194 571276 547794 511506 495784 491715 424639 426569 428164 416838 390439 367564
5374 367564 321260 317676 326253 318877 280432 289046 310052 317836 326480 353089 338860 332795 324189
5361 324189 329193 349605 353597 310294 303000 290286 257250 255770 225841 218445 220086 193611 188887
5348 188887 183035 185526 212488 193654 185269 148556 135360 135610 123519 139894 155267 130054 155877
5335 155877 159892 117432 71324 87183 120673 109947 99888 118264 85765 80436 112041 100704
5323 100704 110024 114119 131533 155923 140467 117416 121460 102852 87565 84616 31781 30405 39336
5310 39336 59859 51056 57722 64049 67713 80482 75458 73675 99362 83677 80557 97839 90230
5297 90230 67915 72820 81789 67386 62539 88494 77969 41294 85540 64666 44830 40246 54215
$$ packed form
5386F22914o720m4918k3482l6288j5722m069o7076J930J595j1326k6399k2875
5374C67564m6304l584Q577p376l8445Q614K1006P784Q644K6609j4229o065q606
5361C24189N004K0412L992m3303p294j2714l3036j480k9929p396J641k6475m724
5348A88887n852K491K6962j8834q385l6713j3196K50j2091J6375J5373k5213K5823
5335A55877M015m2460m6108J5859L3490j0726j0059J8376l2499n329L1605j1337
5323A00704R320M095J7414K4390j5456k3051M044j8608j5287k949n2835j376Q931
5310C9336K0523q803O666O327L664J2769n024j783K5687j5685l120J7282p609
5297I0230k2315M905Q969j4403m847K5955j0525l6675M4246k0874j9836m584J3969
$$ plain form
5284 54215 38782 37747 45961 45511 67230 78680 55629 52659 73869 45399 35877 57939 67713
5271 67713 64971 66800 75074 41275 50029 81150 52690 55147 86271 44416 3044 47712 34778
5258 34778 68508 58684 -308 -10511 -14163 -9001 36004 61181 82764 53415 47987 59683 38582
5245 38582 54958 39145 37048 44145 48034 40343 29495 34219 52468 76000 97059 82564 97696
5232 97696 70889 40789 49765 40705 43770 42825 55678 79025 88161 78700 107679 98303 58472
5219 58472 33275 36739 83013 90395 44803 48339 80179 64518 36823 55303 49651 32397 22456
5206 22456 35023 643 -13630 6609 27727 46245 45939 44516 41521 51558 55005 48326 56318
5193 56318 34741 43535 74512 77021 70809 52256 43821 48876 24441 18034 56136 70232 59868
$$ packed form
5284E4215j5433j035Q214m50K1719J1450k3051k970K1210k8470r522K2062R774
5271F7713k742J829Q274l3799Q754L1121k8460K457L1124m1855m1372M4668j2934
5258C4778L3730r824n8992j0203l652N162M5005K5177K1583k9349n428J1696k1101
5245C8582J6376j5813k097P097L889p691j0848M724J8249K3532K1059j4495J5132
5232I7696k6807l0100Q976r060L065r45J2853K3347R136r461K8979r376l9831
5219E8472k5197L464M6274P382m5592L536L1840j5661k7695J8480n652j7254r941
5206B2456J2567l4380j4273K0239K1118J8518l06j423k995J0037L447o679P992
5193E6318k1577Q794L0977K509o212j8553q435N055k4435o407L8102J4096j0364
$$ plain form
5180 59868 73405 61756 56413 59688 52931 68035 67962 70840 65905 75695 33934 9789 47826 70670
5166 70670 48419 16953 32427 42799 59274 48422 31742 49878 35412 22974 31029 48010
5154 48010 7590 11004 28740 44509 44971 26245 37512 36299 31974 90709 94061 70685 35957
5141 35957 37714 59640 48287 42712 70763 87964 80098 48515 95848 109587 123593 94628
5129 94628 89484 86564 91920 105642 106394 70548 49425 79866 97351 112333 77233 31062 63968
5116 63968 86646 33115 37029 56948 59426 68909 58745 66974 80367 84818 73073 88753 125507
5103 125507 157987 148473 156632 181808 130619 106918 103809 106869 115613 91682 116852 110609 88708
5090 88708 102454 106663 80589 75795 98828 86235 81074 99445 89612 70257 68872 65118 78333
$$ packed form
5180E9868J3537j1649n343L275o757J5104p3K878m935R790m1761k4145L8037K2844
5166G0670k2251l1466J5474J0372J6475j0852j6680J8136j4466j2438Q055J6981
5154D8010m0420L414J7736J5769M62j8726J1267j213m325N8735L352k3376l4728
5141C5957J757K1926j1353n575K8051J7201p866l1583M7333J3739J4006k8965
5129I4628n144k920N356J3722P52l5846k1123L0441J7485J4982l5100m6171L2906
5116F3968K2678n3531L914J9919K478R483j0164Q229J3393M451j1745J5680L6754
5103A25507L2480r514Q159K5176n1189k3701l109L060Q744k3931K5170o243k1901
5090H8708J3746M209k6074m794K3033j2593n161J8371r833j9355j385l754J3215
$$ plain form
5077 78333 98514 126011 83247 104303 96597 96768 117459 112788 130745 143160 116506 125904 97565
5064 97565 129750 161038 145414 111866 107727 108604 133452 131773 122779 140393 165879 169579 181669
5051 181669 198032 248868 265487 280079 288059 278072 305714 364519 432176 496509 567323 595865
5039 595865 551399 446808 329610 271034 279805 253093 245236 220730 192163 170013 158951 144920
5027 144920 160995 180474 164895 173595 177702 187933 187785 205450 191905 161570 162677 168234 181541
5014 181541 167549 187045 223460 191303 203860 214713 230231 219106 193081 184358 203053 218216
5002 218216 200575 199823 205133 174873 190258 220992 200594 197020 248796 288361 288586 299195 338208
4989 338208 377144 446549 514968 603833 602905 563766 476900 356868 333396 300793 260615 225257
$$ packed form
5077G8333K0181K7497m2764K1056p706J71K0691m671J7957J2415k6654R398k8339
5064I7565L2185L1288j5624l3548m139Q77K4848j679q994J7614K5486L700J2090
5051A81669J6363N0836J6619J4592P980r987K7642N8805O7657O4333P0814K8542
5039E95865m4466j04591j17198n8576Q771k6712p857k4506k8567k2150j1062j4031
5027A44920J6075J9479j5579Q700M107J0231j48J7665j3545l0335J107N557J3307
5014A81541j3992J9496L6415l2157J2557J0853J5518j1125k6025q723J8695J5163
5002B18216j7641p52N310l0260J5385L0734k0398l574N1776L9565K25J0609L9013
4989C38208L8936O9405O8419Q8865r28l9139q6866j20032k3472l2603m0178l5358
$$ plain form
4977 225257 195688 201451 248261 250507 229058 222774 213364 215344 223009 193842 162803 172236 170224
4964 170224 183550 183198 178525 186542 160239 181126 170561 165120 173271 185967 151111 178589 173926
4951 173926 181297 172497 168257 178610 179997 163118 190849 167963 136640 136910 150812 149236 184411
4938 184411 168572 160882 167050 155439 179566 184760 178504 187048 177616 174219 198873 175245 193389
4925 193389 185145 190288 234732 194045 164052 172430 193703 213905 232640 213712 228611 230802
4913 230802 192344 174717 204155 207827 229455 266374 275318 282388 309850 281182 290542 308942
4901 308942 305408 337620 335928 378329 351949 319415 339060 323264 304767 274619 260762 276986
4889 276986 314640 334580 313080 292819 316455 364491 363665 346754 366012 368829 357248 352234
$$ packed form
4977B25257k9569N763M6810K246k1449o284r410J980P665k9167l1039R433k012
4964A70224J3326l52m673Q017k6303K0887j0565n441Q151J2696l4856K7478m663
4951A73926P371q800m240J0353J387j6879K7731k2886l1323K70J3902j576L5175
4938A84411j5839p690O168j1611K4127N194o256Q544r432l397K4654k3628J8144
4925A93389q244N143M4444m0687k9993Q378K1273K0202J8735j8928J4899K191
4913B30802l8458j7627K9438L672K1628L6919Q944P070K7462k8668R360J8400
4901C08942l534L2212j692M2401k6380l2534J9645j5796j8497l0148j3857J6224
4889B76986L7654J9940k1500k0261K3636M8036q26j6911J9258K817j1581n014
$$ plain form
4877 352234 363076 338092 335882 365681 361472 394708 403510 365835 371689 374721 366008 386565 395118
4864 395118 406978 441595 444379 408228 393956 382216 382960 406168 443150 431149 425587 430419 471067
4851 471067 471886 514081 518640 526936 541041 563304 534060 533997 550044 557915 568420 626807 651737
4838 651737 627445 602816 590057 576674 559290 577387 602615 563627 560037 578366 591961 580731
4826 580731 583208 636622 642454 590946 614833 615921 613512 604822 640033 701828 690058 693616 699697
4813 699697 660851 650033 682021 697914 713079 727487 760682 793598 797707 820405 815701 838019
4801 838019 833687 835314 876535 891821 947707 949272 957596 949796 965255 1002582 1018470 1030946 1032492
4788 1032492 1043790 1085911 1111787 1121020 1143861 1146933 1175842 1175302 1187171 1235817 1292147 1343196
$$ packed form
4877C52234J0842k4984k210K9799m209L3236Q802l7675N854L032q713K0557Q553
4864C95118J1860L4617K784l6151j4272j1740P44K3208L6982j2001n562M832M0648
4851D71067Q19M2195M559Q296J4105K2263k9244o3J6047P871J0505N8387K4930
4838F51737k4292k4629j2759j3383j7384J8097K5228l8988l590J8329J3595j1230
4826E80731K477N3414N832n1508K3887J088k409q690L5211O1795j1770L558O081
4813F99697l8846j0818L1988J5893J5165J4408L3195L2916M109K2698m704K2318
4801H38019m332J627M1221J5286N5886J565Q324p800J5459L7327J5888J2476J546
4788A032492J1298M2121K5876R233K2841L072K8909n40J1869M8646N6330N1049
$$ plain form
4776 1343196 1387848 1429601 1463276 1506045 1615700 1664266 1688918 1708066 1716531 1775553 1812127
4765 1812127 1828966 1838506 1866606 1858389 1927031 1965575 1928243 1957203 1974196 2018360 2075772 2097062
4753 2097062 2143867 2172921 2247399 2294781 2347904 2378953 2411076 2492705 2559794 2597005 2636866
4742 2636866 2672723 2696151 2780989 2852479 2879810 2948714 3063112 3125754 3198697 3305532 3385682
4731 3385682 3480986 3525875 3589669 3703190 3790369 3874413 4017435 4179084 4329981 4453484
4721 4453484 4632474 4791547 4979194 5190120 5461815 5739323 6070259 6397936 6769190 7087993
4711 7087993 7377962 7632196 7916215 8162786 8466364 8729402 9021732 9336417 9762277 10245751
4701 10245751 10837317 11518708 12359370 13332160 14589383 15905162 17310587 18739804 20366812
$$ packed form
4776A343196M4652M1753L3675M2769J09655M8566K4652J9148Q465N9022L6574
4765A812127J6839R540K8100q217O8642L8544l7332K8960J6993M4164N7412K1290
4753B097062M6805K9054P4478M7382N3123L1049L2123Q1629O7089L7211L9861
4742B636866L5857K3428Q4838P1490K7331O8904J14398O2642P2943J06835Q0150
4731C385682R5304M4889O3794J13521Q7179Q4044J43022J61649J50897J23503
4721D453484J78990J59073J87647K10926K71695K77508L30936L27677L71254L18803
4711G087993K89969K54234K84019K46571L03578K63038K92330L14685M25860M83474
4701A0245751N91566O81391Q40662R72790J257223J315779J405425J429217J627008
$$ plain form
4692 20366812 22139930 24215406 26793735 30291636 34845797 40852019 48053244 55834191
4684 55834191 65043939 75883301 85273704 89702658 81313013 61828616 46448785 37221648
4676 37221648 31215509 27198888 24385255 22380314 20752351 19259495 17835410 16531742
4668 16531742 15519874 14809968 14346942 14044544 13871033 13691958 13457092 13217304 13150861
4659 13150861 13076954 13077659 13089610 13105627 13057512 13056567 13144535 13318090 13517188 13706634 13852505
4648 13852505 13923835 14055702 14353687 14757099 15338758 16061930 17065802 18158628 19323604
4639 19323604 20614954 22116474 23762891 25753541 28249809 31665622 35959239 41665806
4631 41665806 48652293 56174645 65111270 75753288 85216862 89961186 82271999 62935154
$$ packed form
4692B0366812J773118K075476K578329L497901M554161O006222P201225P780947
4684E5834191R209748J0839362R390403M428954q389645j9484397j5379831r227137
4676C7221648o006139m016621k813633k004941j627963j492856j424085j303668
4668A6531742j011868p09906m63026l02398j73511j79075k34866k39788o6443
4659A3150861p3907P05J1951J6017m8115r45Q7968J73555J99098J89446J45871
4648A3852505P1330J31867K97985M03412N81659P23172J003872J092826J164976
4639A9323604J291350J501520J646417J990650K496268L415813M293617N706567
4631D1665806O986487P522352Q936625J0642018R463574M744324p689187j9336845
$$ plain form
4623 62935154 47042756 37503097 31290817 27041166 24068088 21917860 20142979 18466938
4615 18466938 16945883 15551507 14420258 13618146 13043846 12647857 12343529 12061499 11634479
4606 11634479 11173427 10813314 10466064 10030342 9614405 9287209 9045198 8888888 8792088 8732407
4596 8732407 8776936 8750982 8630194 8398895 8289690 8233306 8165743 8183993 8284719 8422428
4586 8422428 8682396 9009540 9401218 9839068 10223808 10500165 10797419 11089512 11195374 10790221
4576 10790221 9605944 8354906 7524282 6975304 6590164 6352959 6188335 6008173 5931803
4567 5931803 5857468 5830937 5834563 5873799 5955038 6049723 6043735 5875226 5662565 5528902 5492971
4556 5492971 5525922 5548313 5668420 5832925 5992766 6172396 6391854 6702635 7070100 7649400
$$ packed form
4623F2935154j5892398r539659o212280m249651k973078k150228j774881j676041
4615A8466938j521055j394376j131249q02112n74300l95989l04328k82030m27020
4606A1634479m61052l60113l47250m35722m15937l27196k42011j56310r6800n9681
4596H732407M4529k5954j20788k31299j09205n6384o7563J8250J00726J37709
4586H422428K59968L27144L91678M37850L84740K76357K97254K92093J05862m05153
4576A0790221j184277j251038q30624n48978l85140k37205j64624j80162p6370
4567E931803p4335k6531L626L9236Q1239R4685n988j68509k12661j33663l5931
4556E492971L2951K2391J20107J64505J59841J79630K19458L10781L67465N79300
$$ plain form
4546 7649400 8385671 9184694 10051233 11024873 11967417 12504469 12328967 11227188 9895989
4537 9895989 8915112 8308549 7999745 7899541 7983381 8279507 8646564 9158603 9660342 10143648
4527 10143648 10672561 11149951 11305821 10863655 9523830 8012919 6964721 6278967 5725414
4518 5725414 5279038 4981415 4728783 4505108 4332191 4214995 4092102 3966948 3892784 3858557
4508 3858557 3859104 3835226 3798707 3796836 3862017 3940238 3984641 4073749 4207236 4365726 4542737
4497 4542737 4757514 5004921 5379577 5822893 6378170 7021174 7783596 8630359 9570923 10321506
4487 10321506 10561781 9909802 8541205 7139826 6165637 5505796 5041821 4721702 4516518
4478 4516518 4355062 4245302 4182204 4148842 4208808 4359985 4527335 4755331 5027500 5278675
$$ packed form
4546G649400P36271P99023Q66539R73640R42544N37052j75502j101779j331199
4537I895989r80877o06563l08804j00204Q3840K96126L67057N12039N01739M83306
4527A0143648N28913M77390J55870m42166j339825j510911j048198o85754n53553
4518E725414m46376k97623k52632k23675j72917j17196j22893j25154p4164l4227
4508C858557N47k3878l6519j871O5181P8221M4403Q9108J33487J58490J77011
4497D542737K14777K47407L74656M43316N55277O43004P62422Q46763R40564P50583
4487A0321506K40275o51979j368597j401379r74189o59841m63975l20119k05184
4478D516518j61456j09760o3098l3362N9966J51177J67350K27996K72169K51175
$$ plain form
4468 5278675 5291621 4917077 4171323 3519059 3064439 2735582 2554225 2376972 2260427 2172582
4458 2172582 2044699 1970486 1883017 1829781 1768793 1703136 1634317 1619593 1573254 1499702 1428209
4447 1428209 1366274 1347057 1306273 1273589 1257170 1184368 1152825 1116433 1115088 1055317 1022026 1009010
4435 1009010 978613 967927 975012 960921 937002 932304 911180 907256 913166 905615 903988 924875 946821
4422 946821 944865 933029 993203 964433 940059 941694 915718 913078 934558 911051 895265 903304
4410 903304 928726 934921 954470 927875 892970 872816 824338 795625 803129 765362 761524 758388
4398 758388 731589 714321 725806 729202 758213 795887 838757 868414 895588 907482 913563 917965
4386 917965 901771 872182 839814 818447 816010 834277 847209 867645 884153 883557 869171 867506
$$ packed form
4468E278675J2946l74544p45754o52264m54620l28857j81357j77253j16545q7845
4458B172582j27883p4213q7469n3236o0988o5657o8819j4724m6339p3552p1493
4447A428209o1935j9217m0784l2684j6419p2802l1543l6392j345n9771l3291j3016
4435A009010l0397j0686P085j4091k3919m698k1124l924N910p551j627K0887K1946
4422I46821j956j1836O0174k8770k4374J635k5976k640K1480k3507j5786Q039
4410I03304K5422O195J9549k6595l4905k0154m8478k8713P504l7767l838l136
4398G58388k6799j7268J1485L396K9011L7674M2870K9657K7174J1894O081M402
4386I17965j6194k9589l2368k1367k437J8267J2932K0436J6508n96j4386j665
$$ plain form
4374 867506 871224 884946 854939 820813 833155 861943 921185 924752 965131 982766 961171 975862
4362 975862 1028338 1005137 1035331 1095399 1101457 1100128 1150100 1209965 1228496 1213303 1262934 1253367
4350 1253367 1231303 1233671 1283106 1340604 1358865 1334025 1319720 1292407 1273804 1321305 1332119 1299009
4338 1299009 1326009 1331904 1363891 1359829 1391802 1372894 1402453 1423416 1394415 1392531 1441615 1475233
4326 1475233 1497371 1527160 1575725 1621992 1692024 1761068 1786832 1850421 1949063 1984899 1999247
4315 1999247 1937020 1877340 1869750 1847935 1867168 1892258 1912265 1921012 1947433 1978242 2002971 2018229
4303 2018229 2041473 2036357 2040578 2014365 2059365 2119844 2163375 2216771 2254303 2301563 2345345 2374052
4291 2374052 2454641 2542859 2560169 2547668 2572869 2646816 2672101 2658985 2713592 2792626 2892764
$$ packed form
4374H67506L718J3722l0007l4126J2342K8788N9242L567M0379J7635k1595J4691
4362I75862N2476k3201L0194O0068O058j329M9972N9865J8531j5193M9631r567
4350A253367k2064K368M9435N7498J8261k4840j4305k7313j8603M7501J0814l3110
4338A299009K7000N895L1987m062L1973j8908K9559K0963k9001j884M9084L3618
4326A475233K2138K9789M8565M6267P0032O9044K5764O3589R8642L5836J4348
4315A999247o2227n9680p590k1815J9233K5090K0007Q747K6421L0809K4729J5258
4303B018229K3244n116M221k6213M5000O0479M3531N3396L7532M7260M3782K8707
4291B374052Q0589Q8218J7310j2501K5201P3947K5285j3116N4607P9034J00138
$$ plain form
4280 2892764 2950113 3011168 3099956 3179578 3269160 3360498 3458282 3598769 3742784 3902293 4067576
4269 4067576 4294013 4526329 4737572 4926805 5179639 5450797 5890029 6443526 7078365 7760695
4259 7760695 8527459 9550164 10529344 11139890 10843775 9236123 7650171 6732903 6182696
4250 6182696 5854490 5672544 5536087 5447318 5372357 5331598 5256483 5242224 5202311 5191826 5238151
4239 5238151 5331851 5438070 5528988 5575485 5679405 5745362 5801413 5836361 6020732 6192279 6511592
4228 6511592 6849820 7303951 7728142 8079492 8304584 8445746 8563568 8767875 9028951 9290836
4218 9290836 9501715 9619478 9504086 9290456 9153828 9119927 9149818 9223513 9262682 9234596
4208 9234596 9256547 9361046 9526852 9690894 9855940 10050980 10285374 10493328 10689429 10960907
$$ packed form
4280B892764N7349O1055Q8788P9622Q9582R1338R7784J40487J44015J59509J65283
4269D067576K26437K32316K11243J89233K52834K71158M39232N53497O34839O82330
4259G760695P66764J022705R79180O10546k96115j607652j585952r17268n50207
4250F182696l28206j81946j36457q8769p4961m0759p5115j4259l9913j0485M6325
4239E238151R3700J06219R0918M6497J03920O5957N6051L4948J84371J71547L19313
4228F511592L38228M54131M24191L51350K25092J41162J17822K04307K61076K61885
4218I290836K10879J17763j15392k13630j36628l3901K9891P3695L9169k8086
4208I234596K1951J04499J65806J64042J65046J95040K34394K07954J96101K71478
$$ plain form
4198 10960907 11250321 11529584 11759363 11984734 12156070 12186741 12265752 12492067 12749312 13087150
4188 13087150 13419583 13772340 14168142 14586882 14967324 15293109 15631251 16010596 16461269
4179 16461269 16992495 17672674 18317353 18974243 19568062 20261751 20984916 21704597 22476856
4170 22476856 23367237 24393406 25651999 27104888 28854889 30694701 32581099 34245350
4162 34245350 35794680 37301153 38866671 40480046 42179166 43827096 45638597 47651494
4154 47651494 50308765 53409113 57130073 61387788 66623239 72965482 80572249 88721599
4146 88721599 97366715 106475424 116673912 128066408 141466546 158034009 179197971
4139 179197971 206073235 242296917 283962218 329693159 385004331 445267673 491516754
$$ packed form
4198A0960907K89414K79263K29779K25371J71336L0671P9011K26315K57245L37838
4188A3087150L32433L52757L95802M18740L80442L25785L38142L79345M50673
4179A6461269N31226O80179O44679O56890N93819O93689P23165P19681P72259
4170B2476856Q90381J026169J258593J452889J750001J839812J886398J664251
4162C4245350J549330J506473J565518J613375J699120J647930J811501K012897
4154D7651494K657271L100348L720960M257715N235451O342243P606767Q149350
4146H8721599Q645116R108709J0198488J1392496J3400138J6567463K1163962
4139A79197971K6875264L6223682M1665301M5730941N5311172O0263342M6249081
$$ plain form
4132 491516754 498862930 426663144 316659703 240181498 192195692 160356251 137652877
4125 137652877 121805383 109499112 99479458 90307812 81924922 74074277 67927573 63334461
4117 63334461 60127511 57584146 55432575 52800165 49803915 46738797 44056237 41500083
4109 41500083 39097494 36779157 34781049 33088843 31765522 30529085 29375484 28297644
4101 28297644 27336837 26487421 25875210 25176734 24226742 23167535 22123024 21054809 20102590
4092 20102590 19223687 18493025 17927939 17462671 16897523 16381855 15930705 15529759 15032906
4083 15032906 14515244 14031714 13628508 13272555 12973514 12697323 12450819 12153945 11797429
4074 11797429 11482650 11103554 10683610 10193863 9789630 9469642 9300986 9201948 9095774 8967112
$$ packed form
4132D91516754P346176p2199786j10003441p6478205m7985806l1839441k2703374
4125A37652877j5847494j2306271j0019654r171646q382890p850645o146704m593112
4117F3334461l206950k543365k151571k632410k996250l065118k682560k556154
4109D1500083k402589k318337j998108j692206j323321j236437j153601j077840
4101B8297644r60807q49416o12211o98476r49992j059207j044511j068215r52219
4092B0102590q78903p30662n65086m65268n65148n15668m51150m00946m96853
4083A5032906n17662m83530m03206l55953k99041k76191k46504k96874l56516
4074A1797429l14779l79096m19944m89747m04233l19988j68656r9038j06174j28662
$$ plain form
4064 8967112 8778243 8562351 8356079 8229413 8148986 8007987 7845188 7559852 7274162 7053294
4054 7053294 6867765 6668775 6543635 6372477 6167939 5889470 5608915 5338494 5152860 5018929
4044 5018929 4921937 4799538 4743310 4686686 4659281 4643538 4657545 4643971 4567997 4445211 4374056
4033 4374056 4226766 4059603 3867278 3693424 3583109 3555717 3568115 3543060 3485304 3435949
4023 3435949 3303476 3214468 3132916 3079604 3015213 3016090 2973026 2952352 2920992 2906773 2858732 2806282
4011 2806282 2708303 2641361 2583069 2543604 2510126 2501536 2457124 2448897 2411110 2379652 2250205 2167660
3999 2167660 2044987 1972864 1955647 1997762 1932180 1899560 1865593 1836892 1780114 1753246 1722437
3988 1722437 1730514 1682905 1641801 1632912 1630793 1610581 1603561 1576516 1521832 1484521 1419616 1371583
$$ packed form
4064H967112j88869k15892k06272j26666q0427j40999j62799k85336k85690k20868
4054G053294j85529j98990j25140j71158k04538k78469k80555k70421j85634j33931
4044E018929r6992j22399n6228n6624k7405j5743J4007j3574p5974j22786p1155
4033D374056j47290j67163j92325j73854j10315k7392J2398k5055n7756m9355
4023C435949j32473q9008q1552n3312o4391Q77m3064k0674l1360j4219m8041n2450
4011B806282r7979o6942n8292l9465l3478q590m4412q227l7787l1458j29447q2545
3999B167660j22673p2123j7217M2115o5582l2620l3967k8701n6778k6868l0809
3988A722437Q077m7609m1104q889k119k0212p020k7045n4684l7311o4905m8033
$$ plain form
3976 1371583 1330597 1325882 1375851 1415143 1404052 1397084 1383561 1376871 1315815 1301688 1273993 1245816
3964 1245816 1202583 1203802 1183074 1135132 1102227 1075841 1067985 1058710 1091182 1101454 1078270 1048645
3952 1048645 1084765 1064637 1056017 1023683 1038928 1053827 1013037 1011932 1010502 982285 991075 1013247
3940 1013247 1004039 1024653 1063625 1078892 1001190 937850 884939 917563 884646 840897 788215 822552
3928 822552 786747 761171 765492 747310 686266 659881 600676 609127 600028 606475 631686 683697
3916 683697 706428 757485 790354 785716 791204 774984 784720 818613 831603 852474 883327 902383
3904 902383 897326 912815 909820 910707 909964 926121 910235 916094 930355 913717 911943 902219 871207
3891 871207 819417 779433 800400 805382 787918 780262 832791 864337 889801 906712 885469 864377
$$ packed form
3976A371583m0986m715M9969L9292j1091o968j3523o690o1056j4127k7695k8177
3964A245816m3233J219k0728m7942l2905k6386p856r275L2472J0272k3184k9625
3952A048645L6120k0128q620l2334J5245J4899m0790j105j430k8217Q790K2172
3940A013247r208K0614L8972J5267p7702o3340n2911L2624l2917m3749n2682L4337
3928H22552l5805k5576M321j8182o1044k6385n9205Q451r099O447K5211N2011
3916F83697K2731N1057L2869m638N488j6220R736L3893J2990K0871L0853J9056
3904I02383n057J5489k995Q87p43J6157j5886N859J4261j6638j774r724l1012
3891H71207n1790l9984K0967M982j7464p656N2529L1546K5464J6911k1243k1092
$$ plain form
3879 864377 859998 851944 851279 820843 808094 803884 808951 847656 909819 920625 963697 950997 950757
3866 950757 927442 887931 861890 857179 858089 862422 848640 827869 786378 787460 818910 829276 862240
3853 862240 878532 926446 978616 965263 960863 1005865 1009206 1024829 1013964 1047403 1083898 1100642
3841 1100642 1136821 1157061 1195501 1229566 1273525 1294465 1318976 1338051 1288722 1297663 1326338 1321449
3829 1321449 1322944 1325842 1306069 1299048 1328570 1334272 1319149 1325907 1333125 1364066 1367668 1390525 1396102
3816 1396102 1420986 1434365 1430157 1463396 1506326 1582087 1612468 1677496 1752417 1816021 1907162 1926226
3804 1926226 1977648 2068275 2234760 2322325 2506139 2648692 2876295 3061970 3333567 3655955
3794 3655955 3990891 4237869 4225013 3784621 3191145 2827251 2594229 2415252 2338726 2259475
$$ packed form
3879H64377m379q054o65l0436j2749m210N067L8705O2163J0806M3072j2700k40
3866I50757k3315l9511k6041m711R10M333j3782k0771m1491J082L1450J0366L2964
3853H62240J6292M7914N2170j3353m400M5002L341J5623j0865L3439L6495J6744
3841A100642L6179K0240L8440L4065M3959K0940K4511J9075m9329Q941K8675m889
3829A321449J495K898j9773p021K9522N702j5123O758P218L0941L602K2857N577
3816A396102K4884J3379m208L3239M2930P5761L0381O5028P4921O3604R1141J9064
3804A926226N1422R0627J66485Q7565J83814J42553K27603J85675K71597L22388
3794C655955L34936K46978j2856m40392n93476l63894k33022j78977p6526p9251
$$ plain form
3784 2259475 2213049 2216560 2197513 2219875 2208769 2200399 2165211 2161399 2132939 2104400 2136719 2140723
3772 2140723 2089368 2083368 2162671 2200436 2173527 2197400 2236011 2275714 2323965 2344416 2345214 2333055
3760 2333055 2369643 2374063 2410886 2454063 2455445 2465482 2457602 2471795 2499397 2532746 2574522 2644761
3748 2644761 2676886 2709457 2780586 2833773 2844576 2857216 2925142 2996937 3070897 3117509 3166740
3737 3166740 3265753 3372840 3453205 3507974 3576018 3639415 3713275 3770851 3848371 3960730 4042324
3726 4042324 4136500 4207402 4274142 4360963 4429194 4546074 4663932 4815238 5025030 5225347
3716 5225347 5431616 5638676 5881029 6125417 6338379 6520546 6680124 6832167 6974714 7121685
3706 7121685 7193961 7316270 7410583 7500661 7612695 7752339 7857807 7958750 8057575 8180056
$$ packed form
3784B259475m6426L511j9047K2362j1106q370l5188l812k8460k8539L2319M004
3772B140723n1355o000P9303L7765k6909K3873L8611L9703M8251K0451P98j2159
3760B333055L6588M420L6823M3177J382J0037p880J4193K7602L3349M1776P0239
3748B644761L2125L2571P1129N3187J0803J2640O7926P1795P3960M6612M9231
3737C166740R9013J07087Q0365N4769O8044O3397P3860N7576P7520J12359Q1594
3726D042324R4176P0902O6740Q6821O8231J16880J17858J51306K09792K00317
3716E225347K06269K07060K42353K44388K12962J82167J59578J52043J42547J46971
3706G121685P2276J22309R4313R0078J12034J39644J05468J00943R8825J22481
$$ plain form
3696 8180056 8318022 8489164 8667104 8857215 9076053 9271606 9488134 9720445 9974300 10222241
3686 10222241 10436959 10678675 10916492 11078419 11258353 11476636 11767015 12080660 12364895
3677 12364895 12710027 13061552 13463915 13819941 14176858 14577146 14976223 15446182 15970254
3668 15970254 16516312 17082244 17684004 18329479 18974264 19681822 20388276 21177755 22069457
3659 22069457 23040889 24105433 25363182 26739574 28228058 29803554 31338575 32893112
3651 32893112 34449895 36025336 37674292 39419325 41241829 43186848 45385673 47857820
3643 47857820 50741839 54127742 58004941 62464213 67630366 73573739 80148955 87344316
3635 87344316 95233101 103978334 113937788 125553741 139441698 156314286 176621739 200579769
$$ packed form
3696H180056J37966J71142J77940J90111K18838J95553K16528K32311K53855K47941
3686A0222241K14718K41716K37817J61927J79934K18283K90379L13645K84235
3677A2364895L45132L51525M02363L56026L56917M00288L99077M69959N24072
3668A5970254N46058N65932O01760O45475O44785P07558P06454P89479Q91702
3659B2069457R71432J064544J257749J376392J488484J575496J535021J554537
3651C2893112J556783J575441J648956J745033J822504J945019K198825K472147
3643D7857820K884019L385903L877199M459272N166153N943373O575216P195361
3635H7344316P888785Q745233R959454J1615953J3887957J6872588K0307453K3958030
$$ plain form
3627 200579769 227634832 256871797 287054175 315265651 335332377 339028871 320057404
3620 320057404 282215311 239240540 201476545 171468406 148212501 130119902 115866700
3613 115866700 104253965 94422694 85891249 78464024 72081274 66769178 62383838 58744885
3605 58744885 55552631 52606900 49764797 46972477 44319055 41871118 39583619 37440141
3597 37440141 35500547 33741553 32155162 30783020 29502506 28332366 27290604 26334120
3589 26334120 25431165 24565045 23710484 22795259 21886376 20960563 20094168 19268839 18515956
3580 18515956 17857976 17268765 16688758 16202217 15742624 15257992 14804336 14332267 13865166
3571 13865166 13485391 13116195 12740212 12423876 12143769 11820736 11484396 11179641 10836227
$$ packed form
3627B00579769K7055063K9236965L0182378K8211476K0066726L696494j8971467
3620C20057404l7842093m2974771l7763995l0008139k3255905j8092599j4253202
3613A15866700j1612735r831271q531445p427225o382750n312096m385340l638953
3605E8744885l192254k945731k842103k792320k653422k447937k287499k143478
3597C7440141j939594j758994j586391j372142j280514j170140j041762r56484
3589B6334120r02955q66120q54561r15225r08883r25813q66395q25329p52883
3580A8515956o57980n89211n80007m86541m59593m84632m53656m72069m67101
3571A3865166l79775l69196l75983l16336k80107l23033l36340l04755l43414
$$ plain form
3562 10836227 10480539 10118310 9757936 9451172 9233293 8997853 8823036 8689438 8508111
3553 8508111 8294794 8136808 7985356 7802440 7659988 7494983 7242781 7042908 6871363 6665391
3543 6665391 6493626 6345850 6161971 5974837 5784670 5570101 5341142 5162902 5031141 4922542
3533 4922542 4823763 4749040 4658613 4600623 4556000 4513138 4465827 4383005 4270235 4150529 4012897
3522 4012897 3922303 3801092 3687051 3588448 3518655 3475107 3444318 3382113 3289992 3231386 3201805
3511 3201805 3096328 2985256 2927263 2891625 2839141 2804203 2795815 2750024 2724078 2683562 2639717
3500 2639717 2592102 2552366 2460595 2418943 2410466 2369964 2299330 2255965 2234517 2174504 2109211 2089451
3488 2089451 2027444 1947041 1899610 1862664 1850731 1835465 1786625 1762373 1702931 1685530 1660972
$$ packed form
3562A0836227l55688l62229l60374l06764k17879k35440j74817j33598j81327
3553H508111k13317j57986j51452j82916j42452j65005k52202j99873j71545k05972
3543F665391j71765j47776j83879j87134j90167k14569k28959j78240j31761j08599
3533D922542r8779p4723r0427n7990m4623m2862m7311q2822j12770j19706j37632
3522D012897r0594j21211j14041r8603o9793m3548l0789o2205r2121n8606k9581
3511C201805j05477j11072n7993l5638n2484l4938q388m5791k5946m0516m3845
3500B639717m7615l9736r1771m1652q477m0502p0634m3365k1448o0013o5293j9760
3488B089451o2007q0403m7431l6946j1933j5266m8840k4252n9442j7401k4558
$$ plain form
3477 1660972 1616646 1563600 1564550 1582880 1535463 1483496 1461633 1435362 1397556 1349987 1364417 1328136
3465 1328136 1272756 1267447 1276644 1291973 1293907 1265111 1236744 1238040 1223105 1220300 1182564 1174957 1158708
3452 1158708 1126145 1110030 1077063 996305 976132 1005594 985048 983204 975900 964718 962935 945345
3440 945345 967074 945863 942732 921953 895513 871893 863218 836735 818698 821349 852864 833049
3428 833049 826022 847782 841162 821905 786589 788452 751567 745983 718939 725485 714432 692356 676425
3415 676425 644380 596522 592372 583287 569241 553166 517137 551537 543856 542896 598618 577307 577396
3402 577396 576159 606815 610691 608335 622802 592375 617738 635605 617145 592422 589016 585799 569085
3389 569085 550530 517315 523755 531826 515522 504609 500656 529094 540966 525870 538074 509756
$$ packed form
3477A660972m4326n3046R50J8330m7417n1967k1863k6271l7806m7569J4430l6281
3465A328136n5380n309R197J5329J934k8796k8367J296j4935k805l7736p607j6249
3452A158708l2563j6115l2967q0758k0173K9462k0546j844p304j1182j783j7590
3440I45345K1729k1211l131k0779k6440k3620q675k6483j8037K651L1515j9815
3428H33049p027K1760o620j9257l5316J863l6885n584k7044O546j1053k2076j5931
3415F76425l2045m7858m150r085j4046j6075l6029L4400p681r60N5722k1311Q9
3402E77396j237L0656L876k356J4467l0427K5363J7867j8460k4723l406l217j6714
3389E69085j8555l3215O440Q071j6304j0913l953K8438J1872j5096J2204k8318
$$ plain form
3377 509756 471522 465211 479994 468947 469026 464652 459617 441618 426309 452008 449906 412756 377930
3364 377930 399560 417707 418794 464154 473321 494884 512407 517901 520220 484799 462684 423140
3352 423140 405471 345097 334508 314520 305228 307543 305482 336813 299081 306492 316897 357611
3340 357611 403882 402906 372509 382174 378971 379874 383110 358405 398308 407933 411204 410662 389351 426678
3326 426678 426831 441714 426910 436723 438945 434130 454413 458455 476649 466117 454839 456622 435141
3313 435141 418693 453386 459016 473008 497920 515559 493171 512623 502572 468238 420736 393298
3301 393298 380265 409305 418795 436661 412127 418640 413916 452616 508157 501110 486139 453116
3289 453116 434924 455774 415717 414598 381055 401774 450394 450006 505378 515765 504891 509069
$$ packed form
3377E09756l8234o311J4783j1047P9m374n035j7999j5309K5699k102l7150l4826
3364C77930K1630J8147J087M5360R167K1563J7523N494K319l5421k2115l9544
3352D23140j7669o0374j0589j9988r292K315k061L1331l7732P411J0405M0714
3340C57611M6271r76l0397R665l203R03L236k4705L9903R625L271n42k1311L7327
3326D26678J53J4883j4804R813K222m815K0283M042J8194j0532j1278J783k1481
3313D35141j6448L4693N630J3992K4912J7639k2388J9452j0051l4334m7502k7438
3301C93298j3033K9040R490J7866k4534O513m724L8700N5541p047j4971l3023
3289D53116j8192K0850m0057j119l3543K0719M8620l88N5372J0387j0874M178
$$ plain form
3277 509069 527969 572022 615775 677887 743262 802865 827096 864822 810396 717632 650892 559177
3265 559177 505745 473829 473442 451033 450851 480815 481248 468287 456292 447549 445011 451689 453823 435495
3251 435495 436270 445869 409645 414780 449447 467953 495736 505352 517672 499049 512287 573137 594530
3238 594530 653904 739393 809861 871963 890107 873850 786721 668776 546362 453463 440573
3227 440573 422726 404297 431579 440348 467415 444080 455461 466327 460564 415795 357498 339535
3215 339535 319679 347095 342058 340674 388086 391142 428373 439307 430935 435177 438063 372736 399700
3202 399700 383005 401480 421961 471985 520123 560850 533687 483384 441076 422046 383806 358840
3190 358840 367232 352793 348164 334314 370056 385640 411372 413796 390984 374791 354238 350298
$$ packed form
3277E09069J8900M4053M3753O2112O5375N9603K4231L7726n4426r2764o6740r1715
3265E59177n3432l1916l87k2409j82K9964M33j2961j1995q743k538O678K134j8328
3251D35495P75R599l6224N135L4667J8506K7783R616J2320j8623J3238O0850K1393
3238E94530N9374Q5489P0468O2102J8144j6257q7129j17945j22414r2899j2890
3227D40573j7847j8429K7282Q769K7067k3335J1381J0866n763m4769n8297j7963
3215C39535j9856K7416n037j384M7412L056L7231J0934q372M242K886o5327K6964
3202C99700j6695J8475K0481N0024M8138M0727k7163n0303m2308j9030l8240k4966
3190C58840Q392j4439m629j3850L5742J5584K5732K424k2812j6193k0553l940
$$ plain form
3178 350298 403170 373540 362388 360852 400973 476069 491590 514130 532771 553419 521680 479155
3166 479155 437262 417251 391870 351557 364490 389353 380498 370414 383364 367049 285853 281185
3154 281185 268502 236260 253830 234046 201063 204060 223988 218829 187856 191310 178557 160319
3142 160319 155784 178822 147774 140523 144783 149484 177086 172291 185503 173382 155504 120465 131115
3129 131115 158560 124334 68704 89231 53702 61761 90664 77504 55211 76579 72316 85516
3117 85516 111852 106492 64786 70207 40916 -773 2143 32385 9167 12950 29831 32506 39448
3104 39448 43640 62267 60349 39334 55197 27827 49170 69279 103529 98025 126516 107068
3092 107068 76645 68632 71326 93234 101016 57239 69645 96690 90042 86277 78857 82171 51924
$$ packed form
3178C50298N2872k9630j1152j536M0121P5096J5521K2540J8641K0648l1739m2525
3166D79155m1893k0011k5381m0313J2933K4863q855j0084J2950j6315q1196m668
3154B81185j2683l2242J7570j9784l2983K997J9928n159l0973L454j2753j8238
3142A60319m535K3038l1048p251M260M701K7602m795J3212j2121j7878l5039J0650
3129A31115K7445l4226n5630K0527l5529Q059K8903j3160k2293K1368m263J3200
3117H5516K6336n360m1706N421k9291m1689K916L0242k3218L783J6881K675O942
3104C9448M192J8627j918k1015J5863k7370K1343K0109L4250n504K8491j9448
3092A07068l0423q013K694K1908P782m3777J2406K7045o648l765p420L314l0247
$$ plain form
3079 51924 87030 82402 88739 115341 96384 36498 60010 60112 46343 88639 96068 87713 86581
3066 86581 79640 84632 76663 72266 87619 86509 80325 104111 100908 94687 88715 99066 100576 85469
3052 85469 96252 86720 64174 88646 107234 93079 85494 61897 58549 90252 73935 65077 69896
3039 69896 101235 51754 42142 62654 68215 71932 80574 105202 117908 95291 95542 80770 71273
3026 71273 61204 86756 97432 94431 106642 101943 107826 117164 107218 92267 63537 125490 119785
3013 119785 92400 97444 118185 156720 132677 126951 105766 79643 88635 118140 134931 121889
3001 121889 125606 129187 157830 174150 197918 196054 195051 167455 106430 123323 117371 157395 170312
2988 170312 185464 190264 205083 207808 228493 253462 248714 255143 246794 251082 244058 239788 257582
$$ packed form
3079E1924L5106m628O337K6602j8957n9886K3512J02j3769M2296P429q355j132
3066H6581o941M992p969m397J5353j110o184K3786l203o221n972J0351J510j5107
3052H5469J0783r532k2546K4472J8588j4155p585k3597l348L1703j6317q858M819
3039F9896L1339m9481r612K0512N561L717Q642K4628J2706k2617K51j4772r497
3026G1273j0069K5552J0676l001J2211m699N883R338r946j4951k8730O1953n705
3013A19785k7385N044K0741L8535k4043n726k1185k6123Q992K9505J6791j3042
3001A21889L717L581K8643J6320K3768j864j003k7596o1025J6893n952M0024J2917
2988A70312J5152M800J4819K725K0685K4969m748O429q349M288p024m270J7794
$$ plain form
2975 257582 243951 260697 267354 246888 228780 221144 190518 239495 292089 261381 273626 296021
2963 296021 331969 334897 313846 357195 377947 361947 362459 355525 352360 358569 373180 395350 399675
2950 399675 439945 467545 440711 453230 483855 491853 513412 517441 549967 528561 486742 503443
2938 503443 537503 563164 588477 622160 621264 642422 649121 661758 680497 669312 692137 686693
2926 686693 747513 770802 766878 817178 865374 889291 879784 906947 889170 909622 925969 938451
2914 938451 983557 1024606 1024747 1057964 1125976 1142052 1121263 1132043 1184544 1215770 1251586 1273489
2902 1273489 1365747 1444984 1475904 1513276 1600650 1695374 1698490 1709706 1762545 1882393 1930885
2891 1930885 1977730 2083962 2216419 2307447 2421762 2593335 2716878 2821506 2994615 3158596
$$ packed form
2975B57582j3631J6746O657k0466j8108p636l0626M8977N2594l0708J2245K2395
2963B96021L5948K928k1051M3349K0752j6000N12o934l165O209J4611K2170M325
2950C99675M0270K7600k6834J2519L0625P998K1559M029L2526k1406m1819J6701
2938E03443L4060K5661K5313L3683q96K1158O699J2637J8739j1185K2825n444
2926F86693O0820K3289l924N0300M8196K3917r507K7163j7777K0452J6347J2482
2914I38451M5106M1049J41L3217O8012J6076k0789J0780N2501L1226L5816K1903
2902A273489R2258P9237L0920L7372Q7374R4724L116J1216N2839J19848M8492
2891A930885M6845J06232J32457R1028J14315J71573J23543J04628J73109J63981
$$ plain form
2881 3158596 3344890 3580766 3827188 4097277 4440187 4845395 5363836 6059243 6805738 7600117
2871 7600117 8509592 9418501 10099989 10206359 9541619 8833061 8644482 8840026 9384623 10239494
2861 10239494 11275000 12477933 13975429 15397835 16339544 16089894 14392813 12815337
2853 12815337 12174254 12130328 12669684 13633037 14848769 16395725 18259955 19934703 20909411
2844 20909411 19926906 16850110 14122635 12630979 11925768 11746306 11994087 12446860 13124531
2835 13124531 14105295 14976658 15291715 14330184 12049407 10110698 8992629 8408664 8117592
2826 8117592 8006223 8073460 8279635 8617425 8878901 8840388 8088776 6803631 5701239 4989499
2816 4989499 4509947 4156638 3867049 3627679 3388148 3194471 3065128 2918378 2716994 2555603
$$ packed form
2881C158596J86294K35876K46422K70089L42910M05208N18441O95407P46495P94379
2871G600117R09475R08909O81488J06370o64740p08558j88579J95544N44597Q54871
2861A0239494J035506J202933J497496J422406R41709k49650j697081j577476
2853A2815337o41083m3926N39356R63353J215732J546956J864230J674748R74708
2844B0909411r82505l076796k727475j491656p05211j79462K47781M52773O77671
2835A3124531R80764Q71363L15057r61531k280777j938709j118069n83965k91072
2826H117592j11369O7237K06175L37790K61476l8513p51612j285145j102392p11740
2816D989499m79552l53309k89589k39370k39531j93677j29343j46750k01384j61391
$$ plain form
2806 2555603 2408389 2318491 2245398 2154305 2123305 2059471 1921438 1836978 1808013 1726852 1607610
2795 1607610 1544149 1481836 1401342 1352561 1381722 1344264 1343513 1304490 1245714 1202100 1131312 1084955
2783 1084955 1023517 1013275 1009343 976571 960425 923108 909325 909070 890486 848904 801092 765827
2771 765827 750472 729621 719256 700059 686435 655220 643136 631925 593313 575549 580076 583249
2759 583249 589574 556227 525105 460423 438632 430659 457814 462521 443654 433178 389871 405551
2747 405551 416241 410148 400747 384151 369129 355984 351499 346708 340873 321827 332588 365938 311788
2734 311788 266812 256873 264207 265378 271833 252843 257568 263784 233899 252370 208614 201383 225621
2721 225621 215331 212243 215432 193314 155922 189315 209072 208934 179962 157563 171238 166568 147671
$$ packed form
2806B555603j47214q9898p3093r1093l1000o3834j38033q4460k8965q1161j19242
2795A607610o3461o2313q0494m8781K9161l7458p51l9023n8776m3614p0788m6357
2783A084955o1438j0242l932l2772j6146l7317j3783k55j8584m1582m7812l5265
2771G65827j5355k0851j0365j9197j3624l1215j2084j1211l8612j7764M527L173
2759E83249O325l3347l1122o4682k1791p973K7155M707j8867j0476m3307J5680
2747D05551J0690o093r401j6596j5022j3145m485m791n835j9046J0761L3350n4150
2734C11788m4976r939P334J171O455j8990M725O216k9885J8471m3756p231K4238
2721B25621j0290l088L189k2118l7392L3393J9757j38k8972k2399J3675m670j8897
$$ plain form
2708 147671 150508 131895 118283 139251 113614 101496 126763 140285 140359 141542 149725 132053 106431
2695 106431 47494 73206 117891 99363 78745 85857 68115 52217 47800 78561 110359 148790
2683 148790 111080 61719 71270 52942 62351 48710 55543 68237 62443 78878 101611 86685
2671 86685 18129 37480 42804 49384 58303 77335 78566 65962 69229 47851 72059 83333 108041
2658 108041 113011 79854 70991 39456 -9343 26156 42964 56840 57273 67980 36751 31981 74232
2645 74232 56953 53077 35845 49068 58601 46619 27053 31971 -8936 -55774 -62829 -17151 -1995
2632 -1995 28682 24208 7383 39511 18970 12575 6559 36148 68956 47053 28583 54079 32274
2619 32274 33775 44351 11543 26115 58726 88815 59255 48116 42343 33238 19933 -8279
$$ packed form
2708A47671K837j8613j3612K0968k5637j2118K5267J3522P4J183Q183j7672k5622
2695A06431n8937K5712M4685j8528k0618P112j7742j5898m417L0761L1798L8431
2683A48790l7710m9361R551j8328R409j3641O833J2694n794J6435K2733j4926
2671H6685o8556J9351N324O580Q919J9032J231j2604L267k1378K4208J1274K4708
2658A08041M970l3157q863l1535m8799L5499J6808J3876M33J0707l1229m770M2251
2645G4232j7279l876j7232J3223R533j1982j9566M918m0907m6838p055M5678J5156
2632a995L0677m474j6825L2128k0541o395o016K9589L2808k1903j8470K5496k1805
2619C2274J501J0576l2808J4572L2611L0089k9560j1139n773r105j3305k8212
$$ plain form
2607 -8279 -7230 -11464 3941 23578 30317 18090 1433 -4007 1661 -14616 -300 24880 31248
2594 31248 10985 6248 18054 20104 15472 21313 31463 5286 8137 47457 16020 -4853 2425
2581 2425 3241 2355 17249 16612 33034 22477 55140 -6178 -24426 -41522 -14332 30673 18174
2568 18174 13419 -1787 1442 -21772 18788 36399 49790 42675 53982 89845 73122 57122
2556 57122 38443 -2670 7535 21084 -3508 -5536 9849 17886 31261 29241 11740 6334 32784
2543 32784 66262 110382 93642 69309 87819 70248 43958 17148 34598 63356 58533 80074
2531 80074 97536 123866 110931 97475 73394 66956 56052 79524 108487 82901 74020 130621
2519 130621 120842 114845 140556 149205 94767 54799 57703 23673 25276 59433 52640 98601 100210
$$ packed form
2607h279J049m234J5405J9637O739j2227j6657n440N668j6277J4316K5180O368
2594C1248k0263m737J1806K050m632N841J0150k6177K851L9320l1437k0873P278
2581B425Q16q86J4894o37J6422j0557L2663o1318j8248j7096K7190M5005j2499
2568A8174m755j5206L229k3214M0560J7611J3391p115J1307L5863j6723j6000
2556E7122j8679m1113J0205J3549k4592k028J5385Q037J3375k020j7501n406K6450
2543C2784L3478M4120j6740k4333J8510j7571k6290k6810J7450K8758m823K1541
2531H0074J7462K6330j2935j3456k4081o438j0904K3472K8963k5586q881N6601
2519A30621r779n997K5711Q649n4438l9968K904l4030J603L4157o793M5961J609
$$ plain form
2506 100210 115569 115813 58273 37539 13867 60038 50931 48818 46415 75308 106809 94621 87311
2493 87311 56589 80889 75137 -1132 24726 57358 54046 66157 49569 4929 -6990 -7579 17107
2480 17107 -494 15216 37165 30503 45973 26997 36426 39694 33573 29258 25281 31103 21538
2467 21538 -19269 21503 11452 -2239 24522 47132 8168 -12599 26370 17541 33854 10633
2455 10633 27582 40175 37144 22451 38307 51697 34677 24081 35433 18613 45676 45395
2443 45395 68427 53226 29327 32269 58754 40118 -3124 13930 54885 36112 9318 46538
2431 46538 26039 23422 56957 14050 -11694 18996 -5838 23811 34831 11970 -13389 5262
2419 5262 7753 497 2304 -1576 -4956 -7722 870 16164 35243 29536 35522 50887 -4273 6322
$$ packed form
2506A00210J5359K44n7540k0734k3672M6171r107k113k403K8893L1501j2188p310
2493H7311l0722K4300n752p6269K5858L2632l312J2111j6588m4640j1919n89K4686
2480A7107j7601J5710K1949o662J5470j8976R429L268o121m315l977N822r565
2467B1538m0807M0772j0051j3691K6761K2610l8964k0767L8969q829J6313k3221
2455A0633J6949J2593l031j4693J5856J3390j7020j0596J1352j6820K7063k81
2443D5395K3032j5201k3899K942K6485j8636m3242J7054M0955j8773k6794L7220
2431D6538k0499k617L3535m2907k5744L0690k4834K9649J1020k2861k5359J8651
2419E262K491p256J807l880l380k766Q592J5294J9079n707N986J5365n5160J0595
$$ plain form
2405 6322 20226 24639 24755 57944 46423 40730 60230 69642 45123 27301 53249 84705 55295
2392 55295 43501 52873 46064 18662 -2913 -19445 -30416 -10065 2674 41263 26962 39227
2380 39227 66865 40531 19279 15701 1058 59908 42396 26850 3402 -26014 -13963 10767
2368 10767 -4379 -20727 19037 11297 22053 23972 14770 0 1986 7461 23653 16374 7883
2355 7883 4183 -2837 20533 10773 35777 22177 27390 47544 11401 41606 34336 36790 22292
2342 22292 -991 22504 -407 1659 19815 21766 14661 -12162 17218 16885 -3121 6476 21898
2329 21898 28775 -2678 4072 10214 44322 11299 -15112 15980 20667 14644 42081 62340 44750
2316 44750 73980 73855 88761 129692 91018 112746 110459 85190 70971 56350 78279 49644
$$ packed form
2405F322J3904M413J16L3189j1521n693J9500R412k4519j7822K5948L1456k9410
2392E5295j1794R372o809k7402k1575j6532j0971K0351J2739L8589j4301J2265
2380C9227K7638k6334k1252l578j4643N8850j7512j5546k3448k9416J2051K4730
2368A0767j5146j6348L9764p740J0756J919r202j4770J986N475J6192p279q491
2355G883l700p020K3370r760K5004j3600N213K0154l6143L0205p270K454j4498
2342B2292k3283K3495k2911K066J8156J951p105k6823K9380l33k0006R597J5422
2329B1898O877l1453O750O142L4108l3023k6411L1092M687o023K7437K0259j7590
2316D4750K9230j25J4906M0931l8674K1728k287k5269j4219j4621K1929k8635
$$ plain form
2304 49644 23345 66288 68679 56327 46079 84245 49795 36851 37625 57948 76130 47731
2292 47731 47764 40054 10500 36442 28952 44898 86740 106267 74211 39483 35800 59659 109239
2279 109239 96764 69976 61849 100367 78058 60415 80283 77206 38611 44092 38272 27032
2267 27032 29875 73429 74060 85401 116987 123184 103626 103692 109865 93123 104416 125224 102222
2254 102222 112848 76286 94683 85197 99959 124236 123049 101317 112534 111983 118759 139694 130397
2241 130397 157582 138659 128127 137312 157729 192825 201433 214808 203017 232209 241054 228841
2229 228841 241547 240221 249498 256518 239286 238036 250015 276187 283411 259766 289118 301419 289048
2216 289048 301910 310211 286899 303206 308650 329261 367106 353823 360424 343958 362073 398088
$$ packed form
2304D9644k6299M2943K391j2352j0248L8166l4450j2944P74K0323J8182k8399
2292D7731L3p710k9554K5942p490J5946M1842J9527l2056l4728l683K3859M9580
2279A09239j2475k6788q127L8518k2309j7643J9868l077l8595N481n820j1240
2267B7032K843M3554O31J1341L1586O197j9558O6O173j6742J1293K0808k3002
2254A02222J0626l6562J8397r486J4762K4277j187k1732J1217n51O776K0935r297
2241A30397K7185j8923j0532R185K0417L5096Q608J3375j1791K9192Q845j2213
2229B28841J2706j326R277P020j7232j250J1979K6172P224k3645K9352J2301j2371
2216B89048J2862Q301k3312J6307N444K0611L7845j3283O601j6466J8115L6015
$$ plain form
2204 398088 399737 394828 427642 470790 474247 540993 601035 619525 672853 717571 712152 766538
2192 766538 797285 836541 842267 852308 857145 785000 701096 676137 622696 588410 555659 543344
2180 543344 562580 546402 525023 529624 530762 546845 566079 623588 664272 707642 757565 820695
2168 820695 931554 988357 1014322 971508 895228 809657 743223 726469 735178 750663 721478 741274
2156 741274 753067 813843 843212 883607 948250 1009121 1122437 1248087 1356388 1480009 1567427
2145 1567427 1593076 1601709 1594611 1675532 1753113 1775824 1739666 1721724 1767342 1869645 1920320 1940444
2133 1940444 1943162 1980383 2077676 2158738 2155484 2030825 1854553 1701261 1596174 1542395 1574093
2122 1574093 1671409 1693616 1651616 1667607 1721632 1757208 1821794 1888158 1875178 1869976 1902248 2047302
$$ packed form
2204C98088J649m909L2814M3148L457O6746O0042J8490N3328M4718n419N4386
2192G66538L0747L9256N726J0041M837p2145q3904k4959n3441l4286l2751j2315
2180E43344J9236j6178k1379M601J138J6083J9234N7509M0684M3370M9923O3130
2168H20695J10859N6803K5965m2814p6280q5571o6434j6754Q709J5485k9185J9796
2156G41274J1793O0776K9369M0395O4643O0871J13316J25650J08301J23621Q7418
2145A567427K5649Q633p098Q0921P7581K2711l6158j7942M5618J02303N0675K0124
2133A940444K718L7221R7293Q1062l254j24659j76272j53292j05087n3779L1698
2122A574093R7316K2207m2000J5991N4025L5576O4586O6364j2980n202L2272J45054
$$ plain form
2110 2047302 2106719 2056619 1951890 1840707 1803707 1817606 1829480 1765408 1602720 1516095 1553636
2099 1553636 1506329 1447480 1326070 1262675 1236813 1215623 1174897 1088719 969677 842703 721102
2088 721102 606351 585624 528644 504584 478733 477276 477288 414051 374704 372333 339113 277128
2076 277128 268219 244459 273571 271465 244554 241594 244486 228998 230396 244153 221885 178794 201106
2063 201106 226893 166607 129365 126301 148470 162582 174252 151428 145500 158422 184409 180350
2051 180350 126220 143460 154906 137989 116600 117885 82150 120739 138104 164099 118339 99809
2039 99809 105314 115833 101786 89542 86496 78684 44921 35025 47762 60112 84098 65938 77564
2026 77564 56330 28145 37416 26183 28089 80544 80464 71636 77973 77855 89904 95745 60033 30748
$$ packed form
2110B047302N9417n0100j04729j11183l7000J3899J1874o4072j62688q6625L7541
2099A553636m7307n8849j21410o3395k5862k1190m0726q6178j19042j26974j21601
2088G21102j14751k0727n6980k4060k5851j457J2o3237l9347k371l3220o1985
2076B77128q909k3760K9112k106k6911k960K892j5488J398J3757k2268m3091K2312
2063B01106K5787o0286l7242l064K2169J4112J1670k2824n928J2922K5987m059
2051A80350n4130J7240J1446j6917k1389J285l5735L8589J7365K5995m5760j8530
2039I9809N505J0519j4047j2244l046p812l3763r896J2737J2350K3986j8160J1626
2026G7564k1234k8185R271j1233J906N2455q0q828O337j18J2049N841l5712k9285
$$ plain form
2012 30748 50732 53185 34524 56420 38239 16555 32708 28430 27473 20816 23574 34362 17578
1999 17578 13966 63476 80000 52377 40082 18237 51084 78231 65467 43660 48051 4409
1987 4409 14984 48647 39938 36176 46083 18571 29604 13776 -11499 18729 40332 34493 54529
1974 54529 47921 17490 -6788 7310 27265 -16396 -25851 11868 -732 -4939 10712 32099
1962 32099 18099 31433 36581 40646 -8371 2482 -311 336 8889 -24680 -14783 -8920 -22526
1949 -22526 -37205 -15497 -24743 -27867 6948 -29159 4537 33747 -6461 -27465 -34174 -18228
1937 -18228 22941 26016 9549 3232 2579 19121 8728 4284 -17392 -63708 -37318 -16551 -16136
1924 -16136 -9546 -19072 858 20835 30094 6724 -20860 -47731 -16140 32280 39580 15592 -23309
$$ packed form
2012C0748J9984K453j8661K1896j8181k1684J6153m278r57o657K758J0788j6784
1999A7578l612M9510J6524k7623j2295k1845L2847K7147j2764k1807M391m3642
1987D409J0575L3663q709l762R907k7512J1033j5828k5275L0228K1603n839K0036
1974E4529o608l0431k4278J4098J9955m3661r455L7719j2600m207J5651K1387
1962C2099j4000J3334N148M065m9017J0853k793O47Q553l3569R897N863j3606
1949b2526j4679K1708r246l124L4815l6107L3696K9210m0208k1004o709J5946
1937a8228M1169L075j6467o317o53J6542j0393m444k1676m6316K6390K0767M15
1924a6136O590r526J9930J9977R259k3370k7584k6871L1591M8420P300k3988l8901
$$ plain form
1911 -23309 -11205 -4118 -35309 21334 -4063 -24608 -5568 13264 22283 30095 14009 36741
1899 36741 29259 20355 40336 2842 8865 28369 14982 12984 46073 44954 23189 -8202 -23530
1886 -23530 50910 57498 26590 40525 48858 37434 418 5835 5627 8986 27655 -10524 -49883
1873 -49883 -27456 26441 -176 31732 13524 35924 59906 75109 67478 54786 73023 59102
1861 59102 47818 74798 41689 -8076 3065 18287 36747 21445 33439 63400 32950 19114
1849 19114 30664 67471 64330 66861 60905 76121 86126 76771 69332 79459 81502 88521 72702
1836 72702 40719 54840 85993 82132 36535 80929 74541 79935 102062 91189 87934 92386 80969
1823 80969 57007 94155 124702 141760 153280 126925 109893 123881 112725 70547 122217 158644
$$ packed form
1911b3309J2104P087l1191N6643k5397k0545J9040J8832R019P812j6086K2732
1899C6741p482q904J9981l7494O023J9504j3387j998L3089j119k1765l1391j5328
1886b3530P4440O588l0908J3935Q333j1424l7016N417k08L359J8669l8179l9359
1873d9883K2427N3897k6617L1908j8208K2400K3982J5203p631j2692J8237j3921
1861E9102j1284K6980l3109m9765J1141J5222J8460j5302J1994K9961l0450j3836
1849A9114J1550L6807l141K531n956J5216J0005r355p439J0127K043P019j5819
1836G2702l1983J4121L1153l861m5597M4394o388N394K2127j0873l255M452j1417
1823H0969k3962L7148L0547J7058J1520k6355j7032J3988j1156m2178N1670L6427
$$ plain form
1811 158644 124245 95252 87732 94197 70581 54118 74026 61219 104321 101713 73241 50743
1799 50743 46188 73904 121287 84493 65890 66406 71207 64699 70835 78033 59958 76037 94226
1786 94226 84129 77493 67338 65429 68656 66968 66942 76826 82155 49303 28272 15008 17193 18648
1772 18648 9903 32968 42557 42019 11020 18876 52790 56927 19039 36246 28385 4638 1015
1759 1015 9517 6704 8038 53766 46050 18610 17869 6611 16722 8515 -2416 3218 27558 -6626
1745 -6626 15837 20005 -6622 16942 12393 32499 41827 -4453 -33121 -12822 7854 -4762 -21434
1732 -21434 -35817 -75370 -35028 10245 -20296 -24049 7095 18171 9096 19301 10850 4809 -25953
1719 -25953 -52609 -9444 2897 -7767 -8866 15729 7534 43523 4235 -7436 -4481 6773
$$ packed form
1811A58644l4399k8993p520O465k3616j6463J9908j2807M3102k608k8472k2498
1799E0743m555K7716M7383l6794j8603N16M801o508O136P198j8075J6079J8189
1786I4226j0097o636j0155j909L227j688k6R884N329l2852k1031j3264K185J455
1772A8648q745K3065R589n38l0999P856L3914M137l7888J7207p861k3747l623
1759A015Q502k813J334M5728p716k7440p41j1258J0111q207j0931N634K4340l4184
1745f626K2463M168k6627K3564m549K0106R328m6280k8668K0299K0676j2616j6672
1732b1434j4383l9553M0342M5273l0541l753L1144J1076r075J0205q451o041l0762
1719b5953k6656M3165J2341j0664j099K4595q195L5989l9288j1671K955J1254
$$ plain form
1707 6773 16568 -15859 -20423 -19769 -7228 11183 15743 31923 16171 -28882 -53143 -43429 -56437
1694 -56437 -46344 -24039 -10600 -9498 3430 12285 -221 -23381 14606 -8951 -17591 11326
1682 11326 9730 -421 -9280 -34262 -37164 -62983 -48806 -18566 12387 17087 -17528 23244 -3253
1669 -3253 -17868 -11244 2415 13370 472 6050 32659 33910 8873 -14292 -10624 12089 5818
1656 5818 -15871 -18036 5602 43658 26189 3123 5143 -15489 16522 27706 12803 -34130
1644 -34130 -53002 -51915 -14777 -7083 24182 7022 -16596 -25942 -30174 -37955 -9492 -6144 -53101
1631 -53101 -45120 -42451 -39392 -23402 13298 3471 2216 13799 -14982 -23856 6472 3201 12228
1618 12228 33629 39944 29392 -5195 -35771 -53839 -73716 -42666 -54940 -50121 -48958 -32993
$$ packed form
1707F773R795l2427m564O54J2541J8411M560J6180j5752m5053k4261R714j3008
1694e6437J0093K2305J3439J102J2928Q855j2506k3160L7987k3557q640K8917
1682A1326j596j0151q859k4982k902k5819J4177L0240L0953M700l4615M0772k6497
1669c253j4615O624J3659J0955j2898N578K6609J251k5037k3165L668K2713o271
1656E818k1689k165K3638L8056j7469k3066K020k0632L2011J1184j4903m6933
1644c4130j8872J087L7138P694L1265j7160k3618r346m232p781K8463L348m6957
1631e3101P981K669L059J5990L6700r827j255J1583k8781q874L0328l271R027
1618A2228K1401O315j0552l4587l0576j8068j9877L1050j2274M819J163J5965
$$ plain form
1606 -32993 -14666 13146 5113 12943 -39726 -68578 -75612 -52132 -29057 -30672 -10664 -49502 -73227
1593 -73227 -28520 -9189 9612 15892 -22892 -38678 -36361 -71889 -55470 -31321 -24207 -1638
1581 -1638 15764 23872 -2461 -4361 11141 37163 34207 -23166 -17905 -16339 -46953 -21950 1429
1568 1429 3812 -39601 -49525 -37881 -17240 1353 -32408 28206 17778 -30507 14902 -1391
1556 -1391 -17129 -8392 -3182 4410 -33901 -9187 -21614 -34016 -35555 -42018 -58561 -72189 -80760
1543 -80760 -58515 -48195 -54063 -40025 -42883 -32690 -50600 -15540 -37704 -216 11455 -12428
1531 -12428 -8914 3188 -16246 -41917 -29331 -52639 -38529 -37465 -29156 -35683 -1035 -959 -28378
1518 -28378 -27219 -28752 -23563 -17173 18841 48766 38758 -4615 -12837 3582 23988 -12975 -40112
$$ packed form
1606c2993J8327K7812q033P830n2669k8852p034K3480K3075j615K0008l8838k3725
1593g3227M4707J9331J8801O280l8784j5786K317l5528J6419K4149P114K2569
1581a638J7402Q108k6333j900J5502K6022k956n7373N261J566l0614K5003K3379
1568A429K383m3413r924J1644K0641J8593l3761O0614j0428m8285M5409j6293
1556a391j5738Q737N210P592l8311K4714j2427j2402j539o463j6543j3628q571
1543h0760K2245J0320n868J4038k858J0193j7910L5060k2164L7488J1671k3883
1531a2428L514J2102j9434k5671J2586k3308J4110J064Q309o527L4648P6k7419
1518b8378J159j533N189O390L6014K9925j0008m3373q222J6419K0406l6963k7137
$$ plain form
1505 -40112 -17298 11724 2680 27691 18039 -1204 -22286 -20701 -28602 -54782 -20678 -22118 -24882
1492 -24882 -31436 -58671 -50475 -43160 2022 -11637 -29844 -28588 -8860 -13682 -23884 -31802 -28613
1479 -28613 -41563 -12125 -14039 -7755 -21978 -27334 6246 -21528 25112 38536 4671 -37050
1467 -37050 -24034 -14750 -18394 -28362 -27800 -37407 -37582 -21987 -44053 -34505 -19576 -32027 -55635 -27310
1453 -27310 -40945 -27138 13291 7981 45199 9966 -21773 -11721 -30944 -32043 -42893 1085
1441 1085 -20095 -62038 -67061 -42540 -32497 -33805 4011 -24700 -35036 -48543 -42282 -30961 -48124
1428 -48124 -38194 -44980 -16974 38280 3266 -34862 -47020 -34079 3268 -5889 30014 10991
1416 10991 7693 959 12928 13362 -9306 -11876 -8682 9644 -50541 -44309 -15597 5381 -2951
$$ packed form
1505d0112K2814K9022r044K5011r652j9243k1082J585p901k6180L4104j440k764
1492b4882o554k7235Q196P315M5182j3659j8207J256J9728m822j0202p918L189
1479b8613j2950K9438j914O284j4223n356L3580k7774M6640J3424l3865m1721
1467c7050J3016R284l644r968N62r607j75J5595k2066R548J4929j2451k3608K8325
1453b7310j3635J3807M0429n310L7218l5233l1739J0052j9223j099j0850M3978
1441A085k1180m1943n023K4521J0043j308L7816k8711j0336j3507O261J1321j7163
1428d8124R930o786K8006N5254l5014l8128j2158J2941L7347r157L5903j9023
1416A0991l298o734J1969M34k2668k570L194J8326o0185O232K8712K0978q332
$$ plain form
1403 -2951 -20042 -46640 -1734 -8006 9109 4783 27358 29503 24551 15679 12197 -14213 6561
1390 6561 28534 -7213 -52800 -39131 5116 -20169 -37284 -22459 -17366 -21565 -50778 -52095 -28143
1377 -28143 -1053 15978 8831 7439 9760 -34786 -24454 -24515 -4421 -15978 -44084 -2002 16516
1364 16516 14706 18564 31039 -20162 -28853 -21314 28074 13308 30790 17432 -1391 -3549 -31413
1351 -31413 -16742 -14010 -30365 -15228 -12609 -21611 -43519 2315 -38563 -62255 -36768 -30889 -52748
1338 -52748 -55445 -41118 -44301 -43392 -17350 6759 -23837 -40789 -25703 -34462 -14118 -19241 -9537
1325 -9537 -19744 -16580 -31959 -48456 -23974 -5733 -5898 -34702 -27357 -26864 -27674 -35846 -19336 -16451
1311 -16451 -17896 -23881 -14672 -35512 -38502 -26370 -22675 -34059 -30369 -1798 14639 6613 -364
$$ packed form
1403b951j7091k6598M4906o272J7115m326K2575K145m952q872l482k6410K0774
1390F561K1973l5747m5587J3669M4247k5285j7115J4825N093m199k9213j317K3952
1377b8143K7090J7031p147j392K321m4546J0332o1K0094j1557k8106M2082J8518
1364A6516j810L858J2475n1201q691P539M9388j4766J7482j3358j8823k158k7864
1351c1413J4671K732j6355J5137K619r002k1908M5834m0878k3692K5487N879k1859
1338e2748k697J4327l183R09K6042K4109l0596j6952J5086q759K0344n123R704
1325i537j0207L164j5379j6497K4482J8241j65k8804P345M93q10q172J6510K885
1311a6451j445n985R209k0840k990J2132L695j1384L690K8571J6437q026o977
$$ plain form
1298 -364 18901 43120 15110 22846 19011 6772 33349 36833 5877 11083 34019 -8003 -7131
1285 -7131 -8484 20231 36507 32603 33159 38334 21099 -14846 -7838 16068 -18997 -20704 7563
1272 7563 -8692 1800 -14970 7081 19198 -861 -3458 26657 17658 5628 23281 -29430
1260 -29430 -12603 36247 40056 19616 -9867 -9010 -43997 -71690 -65610 -32189 -14823 -11223 -68940
1247 -68940 -55324 -51508 -44308 -30838 -4804 -3311 -30593 -40349 -151 -34633 -72840 -37396 -30566
1234 -30566 -19311 -23500 -6280 -671 24817 3684 -18550 -16610 -20559 13605 16147 21972 3213
1221 3213 10154 40561 9077 23478 12132 14738 -9716 -6596 -14163 -11957 -28474 19094 46055
1208 46055 -8060 -23672 -13505 -17157 -4089 9475 -15759 34039 46269 3348 -7036 409
$$ packed form
1298c64J9265K4219k8010P736l835j2239K6577L484l0956N206K2936m2022Q72
1285g131j353K8715J6276l904N56N175j7235l5945P008K3906l5065j707K8267
1272G563j6255J0492j6770K2051J2117k0059k597L0115q999j2030J7653n2711
1260b9430J6827M8850L809k0440k9483Q57l4987k7693O080L3421J7366L600n7717
1247f8940J3616L816P200J3470K6034J493k7282r756M0198l4482l8207L5444O830
1234c0566J1255m189J7220N609K5488k1133k2234J940l949L4164K542N825j8759
1221C213O941L0407l1484J4401j1346K606k4454L120p567K206j6517M7568K6961
1208D6055n4115j5612J0167l652J3068J3564k5234M9798J2230m2921j0384P445
$$ plain form
1196 409 -21153 -42562 29 -6764 -23751 -25631 -58910 -57195 -49049 -24655 -18411 -2586 -19180
1183 -19180 -8919 818 -38316 -21756 -42174 -57407 -17996 -34220 -26534 -12994 -18635 -31917
1171 -31917 -27570 -23487 -43680 -51803 -17602 -12096 -2539 4857 -5157 3044 -18246 -26999 -6743
1158 -6743 22186 4543 -29760 -5111 11937 5024 5263 -10806 -16436 12 -25528 -47251 -22659
1145 -22659 -42903 -14754 -2502 -3491 -13637 -5355 -27542 -857 27719 11233 4283 -6143 -3724
1132 -3724 6518 1238 -16040 -6374 -32611 -19414 -17130 -37070 1260 -40448 -17261 -3051 -20302
1119 -20302 -25633 -8675 3132 -21072 -43615 -9441 -28946 -8698 -3789 -34160 -17075 -18393
1107 -18393 -15328 -11622 136 12333 19005 -16467 -108 -39125 -34529 -23360 -13115 22033 3163
$$ packed form
1196D09k1562k1409M2591o793j6987j880l3279J715Q146K4394O244J5825j6594
1183a9180J0261R737l9134J6560k0418j5233L9411j6224P686J3540n641j3282
1171c1917M347M083k0193q123L4201N506R557P396j0014Q201k1290q753K0256
1158f743K8929j7643l4303K4649J7048o913K39j6069n630J6448k5540k1723K4592
1145b2659k0244K8149J2252r89j0146Q282k2187K6685K8576j6486o950j0426K419
1132c724J0242n280j7278R666k6237J3197K284j9940L8330m1708K3187J4210j7251
1119b0302n331J6958J1807k4204k2543L4174j9505K0248M909l0371J7085j318
1107a8393L065L706J1758J2197O672l5472J6359l9017M596J1169J0245L5148j8870
$$ plain form
1094 3163 -31203 -16567 -7009 -3778 -1985 16509 8641 1886 -13698 7293 -3982 -29312 -12462
1081 -12462 5285 12315 15458 -21977 -25578 -7441 -12715 -23157 4323 28794 -16636 -7625 -33887
1068 -33887 -26501 5110 -19190 6993 -1541 -3355 17072 -4654 -25496 -7512 -6426 6117 -2689
1055 -2689 -38537 -31943 -13863 -2956 -20065 17843 54523 34748 65675 34626 -13038 -2770
1043 -2770 5087 -16912 -42311 -38159 -22341 -34122 -33806 -8650 -5017 3091 25202 25869 -3383 -1323
1029 -1323 14201 4396 -14847 -21527 17253 14649 -19313 -65751 -34570 -58522 -76536 -47523 -35843
1016 -35843 20020 45654 29316 4860 4562 12337 -32235 -12795 13831 8195 12962 4238 5729
1003 5729 -24054 2237 30840 11739 -691 29636 14763 622 21641 50729 38793 26424
$$ packed form
1094C163l4366J4636R558L231J793J8494p868o755j5584K0991j1275k5330J6850
1081a2462J7747P030L143l7435l601J8137n274j0442K7480K4471m5430R011k6262
1068c3887P386L1611k4300K6183q534j814K0427k1726k0842J7984J086J2543q806
1055b689l5848O594J8080J0907j7109L7908L6680j9775L0927l1049m7664J0268
1043b770P857k1999k5399M152J5818j1781L16K5156L633Q108K2111O67k9252K060
1029a323J5524r805j9243o680L8780k604l3962m6438L1181k3952j8014K9013J1680
1016c5843N5863K5634j6338k4456k98P775m4572J9440K6626n636M767q724J491
1003E729k9783K6291K8603j9101j2430L0327j4873j4141K1019K9088j1936j2369
$$ plain form
991 26424 33433 14117 -32787 -21375 -30715 -7465 -16795 -12964 -16310 39467 33854 20951 52100
978 52100 46387 48985 19828 -14324 -20897 -23603 337 -23156 -7374 -12200 -25256 5016 10131
965 10131 7895 6817 2947 -29487 -1519 26168 1909 -6716 -55605 -50009 -23709 -37986 -13998
952 -13998 -9202 27312 32991 797 -7446 -5289 16659 39291 22952 -9184 -11273 -18525 -34469
939 -34469 -29230 -10958 -13093 -28346 -51426 -46152 -44913 -50050 -40102 -50003 -28183 -27624 -11855 -63205
925 -63205 -65199 -37661 -41471 -24641 3573 -23646 -34990 -34992 -4550 -20281 -28045 -9120 7918
912 7918 17446 -7992 -3425 16510 6439 -15134 -28498 2672 -27348 -52402 -36750 -829 6339
899 6339 -15407 1951 12675 19444 32926 8290 8740 33242 3522 -4583 -28646 -17489 -29763
$$ packed form
991B6424P009j9316m6904J1412r340K3250r330L831l346N5777n613j2903L1149
978E2100n713K598k9157l4152o573k706K3940k3493J5782m826j3056L0272N115
965A0131k236j078l870l2434K7968K7687k4259q625m8889N596K6300j4277K3988
952a3998M796L6514N679l2194q243K157K1948K2632j6339l2136k089p252j5944
939c4469N239J8272k135j5253k3080N274J239n137R948r901K1820N59J5769n1350
925f3205j994K7538l810J6830K8214k7219j1344kL0442j5731p764J8925J7038
912G918R528k5438M567J9935j0071k1573j3364L1170l0020k5054J5652L5921P168
899F339k1746J7358J0724O769J3482k4636M50K4502k9720q105k4063J1157j2274
$$ plain form
886 -29763 -8433 -17511 -36388 -20617 -12029 -36373 -39771 -37394 -30439 14630 40764 3464 -10886
873 -10886 -7526 -4526 25479 19835 -15942 -23853 11577 -5716 -35294 -27318 -23188 -12425 749
860 749 -40329 -32492 -21393 12714 25736 1740 21342 34695 22536 6566 4350 3312 502
847 502 3822 21128 -1371 -3075 -18826 -38326 -32354 -21689 -12037 -8936 741 -8494 5629 -3218
833 -3218 -5358 -6526 -6596 -18107 -25031 1217 17878 -2661 6332 19698 18050 -5552 -12968 -54857
819 -54857 -37452 -17938 -6586 2205 -23490 -5021 20617 641 -29364 -10581 15282 -2345
807 -2345 -26394 -9454 -35230 -34283 -32170 38055 71054 59530 25303 40373 26251 18476 16721
794 16721 -2649 -10267 -28346 19021 10654 -27605 -32199 -29097 2147 13058 3658 2972 -13189
$$ packed form
886b9763K1330r078j8877J5771Q588k4344l398K377O955M5069K6134l7300j4350
873a0886L360L000L0005n644l5777p911L5430j7293k9578P976M130J0763J3174
860G49m1078P837J1099L4107J3022k3996J9602J3353j2159j5970k216j038k810
847E02L320J7306k2499j704j5751j9500N972J0665R652L101R677r235J4123q847
833c218k140j168p0j1511o924K6248J6661k0539Q993J3366j648k3602p416m1889
819e4857J7405J9514J1352Q791k5695J8469K5638j9976l0005J8783K5863j7627
807b345k4049J6940k5776R47K113P0225L2999j1524l4227J5070j4122p775j755
794A6721j9370p618j8079M7367q367l8259m594L102L1244J0911r400o86j6161
$$ plain form
781 -13189 -8736 10949 6029 4321 -4012 -11131 2585 15450 6357 -27897 -16573 21042 6415
768 6415 15825 13511 16632 24655 23403 7327 -6453 13029 2577 -8845 10472 5849 41691
755 41691 1490 -17794 -12993 -19364 10498 -29916 -13785 5665 14711 4796 34790 14298 -382
742 -382 23779 40230 46634 7157 -36329 -34848 10926 24146 9930 5576 17218 19532 -3956
729 -3956 -29007 -23510 -9344 -6353 21811 -12711 -30939 -8863 -27384 440 36679 8855 -44976
716 -44976 -17136 -42990 -56097 -20495 -39130 -22563 -1113 6460 9170 -10734 9676 6732 -15482
703 -15482 1539 -4063 27928 32111 28409 26505 33476 34917 9890 -5524 1521 21730 13420 23442
689 23442 17534 -68 -4653 1308 1375 -17224 -24875 9750 32640 21723 8993 11390 -15043 -37521
$$ packed form
781a3189M453J9685m920j708q333p119J3716J2865r093l4254J1324L7615j4627
768F415R410k314L121Q023j252j6076j3780J9482j0452j1422J9317m623L5842
755D1691m0201j9284M801o371K9862m0414J6131J9450R046r915K9994k0492j4680
742c82K4161J6451O404l9477m3486J481M5774J3220j4216m354J1642K314k3488
729c956k5051N497J4166K991K8164l4522j8228K2076j8521K7824L6239k7824n3831
716d4976K7840k5854j3107L5602j8635J6567K1450P573K710j9904K0410k944k2214
703a5482J7021n602L1991M183l702j904O971J441k5027j5414P045K0209q310J0022
689B3442n908j7602m585N961O7j8599p651L4625K2890j0917j2730K397k6433k2478
$$ plain form
675 -37521 -8958 111 23316 8483 13624 32359 45336 4469 -16380 14979 24447 15548 13513
662 13513 23764 -9639 7168 -726 -14987 2297 11451 27662 18386 2871 -13300 -16768 -16686
$$ packed form
675c7521K8563R069K3205j4833N141J8735J2977m0867k0849L1359R468q899k035
662A3513J0251l3403J6807p894j4261J7284R154J6211r276j5515j6171l468Q2
$$ [...]
##END NTUPLES=NMR SPECTRUM
##END=
