##TITLE=1H_LY-4Dix.H2O
 CD3CN,8 sc, 
 11.03.2021
##JCAMPDX= 6.0         $$ Bruker NMR JCAMP-DX V2.0
##DATA TYPE= NMR FID
##DATA CLASS= NTUPLES
##ORIGIN= UXNMR, Bruker Analytische Messtechnik GmbH
##OWNER= root
$$ XWIN-NMR		Version 3.5
$$ Thu Mar 11 11:29:52 2021 Russian Standard Time (UT+4h)  she@DPX200
##.OBSERVE FREQUENCY= 200.131506
##.OBSERVE NUCLEUS= ^1H
##.DELAY= (6, 6)
##.ACQUISITION MODE= SIMULTANEOUS
##.ACQUISITION SCHEME= undefined
##.AVERAGES= 8
##.DIGITISER RES= 18
##SPECTROMETER/DATA SYSTEM= spect
##.PULSE SEQUENCE= zg30
##.SOLVENT NAME= CD3CN
##.SHIFT REFERENCE= (INTERNAL, CD3CN, 0, 15.7039)
##AUDIT TRAIL= $$ (NUMBER, WHEN, WHO, WHERE, WHAT)
$$ ##TITLE= Audit trail, XWIN-NMR		Version 3.5
$$ ##JCAMPDX= 5.01
$$ ##ORIGIN= Bruker BioSpin GmbH
$$ ##OWNER= she
$$ F:/spectra/data/she/nmr/H-F/1/audita.txt
$$ ##AUDIT TRAIL=  $$ (NUMBER, WHEN, WHO, WHERE, WHAT)
(   1,<2021-03-11 11:28:43.10 +0400>,<she>,<DPX200>,
      <created by zg, POWCHK disabled, PULCHK disabled
       configuration hash MD5:
       00 E9 B6 7A A2 85 ED C7 34 08 36 98 17 FE 4E 26
       data hash MD5: 16K
       E6 0A D0 51 33 0C 83 9A 6B 82 5C 10 E6 AE D3 D2>)
$$ ##END=
$$ 
$$ hash MD5
$$ 1F DE 11 46 28 40 0F 23 FF D7 57 FC 6D 61 57 75
##$RELAX= 
##$RELAX= 
##$RELAX= 
##$RELAX= 
##$RELAX= 
##$RELAX= 
$$ Bruker specific parameters
$$ --------------------------
##$DU= <F:/spectra>
##$EXPNO= 1
##$NAME= <H-F>
##$PROCNO= 1
##$TYPE= <nmr>
##$USER= <she>
##$AMP= (0..31)
100 100 100 100 100 100 100 100 100 100 100 100 100 100 100 100 100 100 
100 100 100 100 100 100 100 100 100 100 100 100 100 100 
##$AQSEQ= 0
##$AQ_mod= 1
##$AUNM= <au_zg>
##$AUTOPOS= <>
##$BF1= 200.13
##$BF2= 200.13
##$BF3= 200.13
##$BF4= 200.13
##$BF5= 200.13
##$BF6= 200.13
##$BF7= 200.13
##$BF8= 200.13
##$BYTORDA= 1
##$CFDGTYP= 0
##$CFRGTYP= 5
##$CHEMSTR= <none>
##$CNST= (0..31)
1 1 145 1 1 1 1 1 1 1 1 1 1 1 1 1 1 1 1 1 1 1 1 1 1 1 1 1 1 1 1 1 
##$CPDPRG= <>
##$CPDPRG1= <>
##$CPDPRG2= <>
##$CPDPRG3= <>
##$CPDPRG4= <mlev>
##$CPDPRG5= <mlev>
##$CPDPRG6= <mlev>
##$CPDPRG7= <mlev>
##$CPDPRG8= <mlev>
##$CPDPRGB= <>
##$CPDPRGT= <>
##$D= (0..31)
0 1.2 0 0 0 0 0 0 0 0.06 0 0.03 0 0 0 0 0.0002 0 0 0 0 0 0 0 0 0 0 0 0 
0 0 0 
##$DATE= 1615447722
##$DBL= (0..7)
120 120 120 120 120 120 120 120 
##$DBP= (0..7)
150 150 150 150 150 150 150 150 
##$DBP07= 0
##$DBPNAM0= <>
##$DBPNAM1= <>
##$DBPNAM2= <>
##$DBPNAM3= <>
##$DBPNAM4= <>
##$DBPNAM5= <>
##$DBPNAM6= <>
##$DBPNAM7= <>
##$DBPOAL= (0..7)
0.5 0.5 0.5 0.5 0.5 0.5 0.5 0.5 
##$DBPOFFS= (0..7)
0 0 0 0 0 0 0 0 
##$DE= 6
##$DECBNUC= <off>
##$DECIM= 32
##$DECNUC= <off>
##$DECSTAT= 4
##$DIGMOD= 1
##$DIGTYP= 9
##$DL= (0..7)
0 120 120 120 120 120 120 120 
##$DP= (0..7)
150 150 150 150 150 150 150 150 
##$DP07= 0
##$DPNAME0= <>
##$DPNAME1= <>
##$DPNAME2= <>
##$DPNAME3= <>
##$DPNAME4= <>
##$DPNAME5= <>
##$DPNAME6= <>
##$DPNAME7= <>
##$DPOAL= (0..7)
0.5 0.5 0.5 0.5 0.5 0.5 0.5 0.5 
##$DPOFFS= (0..7)
0 0 0 0 0 0 0 0 
##$DQDMODE= 0
##$DR= 18
##$DS= 0
##$DSLIST= <SSSSSSSSSSSSSSS>
$$ [...]
##$SUBNAM2= <"">
##$SUBNAM3= <"">
##$SUBNAM4= <"">
##$SUBNAM5= <"">
##$SUBNAM6= <"">
##$SUBNAM7= <"">
##$SUBNAM8= <"">
##$SUBNAM9= <"">
##$SW= 16.9725357007746
##$SWIBOX= (0..15)
0 0 2 0 0 0 0 0 0 0 0 0 0 0 0 0 
##$SW_h= 3396.73913043478
##$TD= 16384
##$TD0= 1
##$TE= 0
##$TE2= 300
##$TE3= 300
##$TEG= 300
##$TL= (0..7)
0 120 120 120 120 120 120 120 
##$TP= (0..7)
150 150 150 150 150 150 150 150 
##$TP07= 0
##$TPNAME0= <>
##$TPNAME1= <>
##$TPNAME2= <>
##$TPNAME3= <>
##$TPNAME4= <>
##$TPNAME5= <>
##$TPNAME6= <>
##$TPNAME7= <>
##$TPOAL= (0..7)
0.5 0.5 0.5 0.5 0.5 0.5 0.5 0.5 
##$TPOFFS= (0..7)
0 0 0 0 0 0 0 0 
##$TUNHIN= 0
##$TUNHOUT= 0
##$TUNXOUT= 0
##$USERA1= <user>
##$USERA2= <user>
##$USERA3= <user>
##$USERA4= <user>
##$USERA5= <user>
##$V9= 5
##$VALIST= <valist>
##$VCLIST= <CCCCCCCCCCCCCCC>
##$VD= 0
##$VDLIST= <DDDDDDDDDDDDDDD>
##$VPLIST= <PPPPPPPPPPPPPPP>
##$VTLIST= <TTTTTTTTTTTTTTT>
##$WBST= 1024
##$WBSW= 4
##$XGAIN= (0..3)
0 0 0 0 
##$XL= 0
##$YL= 0
##$YMAX_a= 251665
##$YMIN_a= -259573
##$ZGOPTNS= <>
##$ZL1= 120
##$ZL2= 120
##$ZL3= 120
##$ZL4= 120
##$ABSF1= 10
##$ABSF2= 0
##$ABSG= 5
##$ABSL= 3
##$ALPHA= 0
##$AQORDER= 0
##$ASSFAC= 0
##$ASSFACI= 0
##$ASSFACX= 0
##$ASSWID= 0
##$AUNMP= <proc_1d>
##$AZFE= 0.1
##$AZFW= 0.1
##$BCFW= 1
##$BC_mod= 2
##$BYTORDP= 1
##$COROFFS= 0
##$CY= 11.3945322036743
##$DATMOD= 1
##$DC= 2
##$DFILT= <>
##$DTYPP= 0
##$F1P= 15.9154993809931
##$F2P= -4.1035820241983
##$FCOR= 0.5
##$FTSIZE= 0
##$FT_mod= 4
##$GAMMA= 1
##$GB= 0.15
##$INTBC= 1
##$INTSCL= 1
##$ISEN= 128
##$LB= 0.24
##$LEV0= 0
##$LPBIN= 0
##$MAXI= 10000
##$MC2= 0
##$MEAN= 0
##$ME_mod= 0
##$MI= 1.114404
##$NCOEF= 0
##$NC_proc= 0
##$NLEV= 6
##$NOISF1= 3.799351
##$NOISF2= 2.8
##$NSP= 1
##$NTH_PI= 0
##$NZP= 0
##$OFFSET= 15.70392
##$PC= 1
##$PHC0= -11279.83
##$PHC1= 13.40094
##$PH_mod= 1
##$PKNL= yes
##$PPARMOD= 0
##$PSCAL= 0
##$PSIGN= 0
##$REVERSE= no
##$SF= 200.130013532006
##$SI= 16384
##$SIGF1= 3
##$SIGF2= 2
##$SINO= 400
##$SIOLD= 16384
##$SREGLST= <1H.CDCl3>
##$SSB= 0
##$STSI= 0
##$STSR= 0
##$SW_p= 3612.71676300578
##$SYMM= 0
##$S_DEV= 0
##$TDeff= 0
##$TDoff= 0
##$TI= <>
##$TILT= no
##$TM1= 0
##$TM2= 0
##$TOPLEV= 0
##$USERP1= <user>
##$USERP2= <user>
##$USERP3= <user>
##$USERP4= <user>
##$USERP5= <user>
##$WDW= 1
##$XDIM= 8192
##$YMAX_p= 0
##$YMIN_p= 0
$$ End of Bruker specific parameters
$$ ---------------------------------
##NTUPLES= NMR FID
##VAR_NAME=  TIME,          FID/REAL,        FID/IMAG
##SYMBOL=    X,             R,               I
##VAR_TYPE=  INDEPENDENT,   DEPENDENT,       DEPENDENT
##VAR_FORM=  AFFN,          ASDF,            ASDF
##VAR_DIM=   8192,          8192,            8192
##UNITS=     SECONDS,       ARBITRARY UNITS, ARBITRARY UNITS
##FACTOR=    0.0002944,     1,               1
##FIRST=     0,             0,               0
##LAST=      2.4114304,     0,               0
##MIN=       0,             -259573,         0
##MAX=       2.4114304,     251665,          0
$$ Real data points
##PAGE= N=1
##DATA TABLE= (X++(R..R)), XYDATA
$$ plain form
0 0 0 0 0 0 0 0 0 0 0 0 0 0 0 0 0 -8 8 -8 8 -8 13 -16 16 -16 24 -24 29 -32 40 -45 48 -56 64 -72 80 -93 101
37 101 -115 125 -141 157 -173 192 -210 234 -258 285 -315 347 -380 418 -464 510 -564 623 -693 773
57 773 -865 973 -1104 1264 -1464 1726 -2079 2584 -3363 4698 -7418 15063 -79322 -259573
71 -259573 51860 191106 -53005 -153074 -2888 28639 -10645 24210 -34556 -146030 1958
82 1958 176841 -24194 -241436 -8039 224413 -90 -203492 -4879 136706 4420
92 4420 -42310 14419 -30427 -234 130172 38761 -153953 -21885 211721 65397 -178731
103 -178731 -37011 180255 56420 -103705 -12019 58153 -1016 26948 41719 -89871 -66682
114 -66682 135118 73115 -168267 -92266 143992 65568 -140826 -73406 74246 15997 -54422
$$ packed form
0@%%%%%%%%%%%%%%%qJ6j6J6j6K1k9L2l2M0m8N3o1P2q5R3j04J20j36J52j73J94
37A01k16K40k66K98l30L65m02M44m92N43o00O62p27P98q82R74j074J187j316J466
57G73j638J838k077K368k728L190l805M663n947Q061j2116K2481r4385j80251
71b59573L11433J39246k44111j00069J50186L1527l9284L4855n8766j11474J47988
82A958J74883k01035k17242K33397K32452k24503k03402J98613J41585j32286
92D420m6730N6729m4846L0193J30406r1411j92714J32068K33606j46324k44128
103a78731J41720K17266j23835j60125R1686P0172n9169K7964J4771j31590K3189
114f6682K01800o2003k41382P6001K36258p8424k06394O7420J47652n8249p0419
$$ plain form
125 -54422 -4790 -21710 -61696 42257 75235 -97034 -114717 104975 107978 -115172 -94454
136 -94454 101322 69388 -63276 -19589 44212 -3524 7877 66082 -12050 -77345 58065
147 58065 124913 -48788 -107779 77384 114506 -58534 -68118 62069 34392 -38438 16383
158 16383 18260 -60160 -4660 81868 -20723 -113370 14189 99921 -40701 -109022 26535
169 26535 62512 -51900 -46078 33475 -14334 -46932 39816 25535 -81421 -20361 93261 4087
181 4087 -94163 11583 88777 -14879 -58669 38411 45953 -33623 2045 58139 -16279 -40964
193 -40964 61963 51265 -65010 -21881 86847 14601 -72050 14194 62980 -29111 -41439
204 -41439 41559 15111 -57167 -960 51367 -31872 -60981 36471 34068 -65314 -30065 55704
$$ packed form
125e4422M9632j6920l9986J03953L2978j72269j7683K19692L003k23150K0718
136i4454J95776l1934j32664M3687O3801m7736J1401N8205p8132o5295J35410
147E8065O6848j73701n8991J85163L7122j73040r584J30187k7677p2830N4821
158A6383J877p8420N5500Q6528j02591r2647J27559Q5732j40622o8321J35557
169B6535L5977j14412N822P9553m7809l2598Q6748j4281j06956O1060J13622q9174
181D087r8250J05746P7194j03656m3790R7080P542p9576L5668N6094p4418k4685
193d0964J02927j0698j16275M3129J08728p2246q6651Q6244M8786r2091j2328
204d1439Q2998k6448p2278N6207N2327q3239k9109R7452k403r9382L5249Q5769
$$ plain form
216 55704 -9132 -67704 19867 45206 -50196 -38448 53864 14275 -60017 1869 54662 -16812
228 -16812 -38911 38911 29443 -43746 2131 64276 -12310 -53419 45127 60797 -45080 -34766
240 -34766 61458 27065 -46257 3059 40746 -18414 -19727 40061 3199 -56553 10628 63298
252 63298 -30091 -72622 32351 55943 -46836 -49019 34037 13450 -37042 3672 14845 -40104
264 -40104 -10394 53921 -8053 -73383 12173 75310 -18415 -70196 22262 57411 -19029 -27612
276 -27612 24006 4110 -13111 35512 17396 -53369 -3663 79823 7895 -77944 2214 78195
288 78195 1845 -56165 4303 34001 -6308 -3204 11534 -29197 -20251 52836 20743 -76352
300 -76352 -28879 76510 21213 -77035 -23673 52147 8928 -32714 -4201 -1925 -13367 25441
$$ packed form
216E5704o4836n8572Q7571K5339r5402J1748R2312l9589p4292O1886N2793p1474
228a6812k2099P7822r468p3189M5877O2145p6586m1109R8546J5670j05877J0314
240c4766R6224l4393p3322M9316L7687n9160j313N9788l6862n9752O7181N2670
252F3298r3389m2531J04973K3592j02779k183Q3056k0587n0492M0714J1173n4949
264d0104K9710O4315o1974o5330Q5556O3137r3725n1781R2458L5149p6440q583
276b7612N1618j9896j7221M8623j8116p0765M9706Q3486p1928q5839Q0158P5981
288G8195p6350n8010O0468K9698m0309L104J4738m0731Q946P3087l2093r7095
300g6352M7473J05389n5297r8248N3362P5820m3219m1642K8513K276j1442L8808
$$ plain form
312 25441 23517 -50855 -37839 64218 45374 -68379 -45087 64381 41283 -44740 -23604 26292
324 26292 10048 4428 15581 -23418 -30676 46441 51854 -52164 -58602 56115 63661 -46137
336 -46137 -54386 33011 37883 -14659 -14095 -5987 -15359 21040 38873 -36312 -62685 38016 70591
349 70591 -39340 -74485 27853 60976 -18550 -43288 3053 13972 7024 15176 -16718 -44551
361 -44551 21278 66963 -21053 -77791 18621 78663 -10237 -64149 4307 43549 4929 -12867
373 -12867 -8056 -16340 10899 45926 -7852 -66512 4167 78510 1896 -77104 -6710 64131
385 64131 9813 -41524 -10541 12262 7290 17024 -2388 -43716 -5259 62094 12645 -70995
397 -70995 -18776 68894 21343 -56592 -19710 36089 13461 -10976 -4091 -14745 -7319 36842
$$ packed form
312B5441j924p4372J3016J02057j8844j13753K3292J09468k3098q6023K1136M9896
324B6292j6244n620J1153l8999p258P7117N413j04018o438J14717P546j09798
336d6137q249Q7397M872n2542N64Q108r372L6399J7833p5185k6373J00701L2575
349G0591j09931l5145J02338L3123p9526k4738M6341J0919o948Q152l1894k7833
361d4551O5829M5685q8016n6738R6412O0042q8900n3912O8456L9242l8620j7796
373a2867M811q284K7239L5027n3778n8660P0679P4343p6614p9000P0394P0841
385F4131n4318n1337L0983K2803m972R734j9412m1328L8457O7353m9449q3640
397g0995N2219Q7670m7551p7935L6882N5799k2628k4437O885j0654P426M4161
$$ plain form
409 36842 18281 -52506 -27367 58910 31582 -57074 -31987 45631 25282 -30077 -15594 9148
421 9148 497 9985 13910 -27984 -28184 39527 37512 -44862 -41255 43493 38700 -35004 -28390 24076
435 24076 15529 -8348 3346 -3264 -18328 17080 35215 -22968 -42048 29139 46357 -27188
447 -27188 -39954 24676 29523 -18084 -13488 10452 -5122 -3940 20815 -4539 -36423 7295 41647
460 41647 -13860 -46402 12451 37738 -16567 -29830 12817 11656 -13842 2804 9734 -19824
472 -19824 -7818 31798 4797 -38541 380 41551 -2460 -34199 9900 28237 -10072 -11394
484 -11394 17579 1615 -15138 15903 18985 -22695 -12999 32384 10942 -32321 -2885 30803
496 30803 -4347 -24940 10826 14210 -19462 -6851 19942 -7376 -25441 11547 18070 -23553
$$ packed form
409C6842j8561p0787K5139Q6277k7328q8656K5087P7618k0349n5359J4483K4742
421I148q651R488L925m1894k00O7711k015q2374L607Q4748m793p3704O614N2466
435B4076q547k3877J1694o610j5064L5408J8135n8183j9080P1187J7218p3545
447b7188j2766O4630M847m7607M596K3940j5574J182K4755k5354l1884M3718L4352
460D1647n5507l2542N8853K5287n4305j3263M2647j161k5498J6646O930k9558
472a9824J2006L9616k7001m3338L8921M1171m4011l1739M4099J8337l8309j322
484a1394K8973j5964j6753L1041L082m1680R696M5383k1442m3263K9436L3688
496C0803l5150k0593L5766L384l3672J2611K6793k7318j8065L6988O523m1623
$$ plain form
508 -23553 -17886 22193 4807 -27807 116 21841 -12637 -20287 18288 12660 -23991 -5030 26132
521 26132 -1298 -21122 11878 18848 -13999 -5547 24101 1439 -21056 13918 26965 -15551
533 -15551 -18704 25113 18374 -21649 -7473 21637 524 -14580 9258 6067 -19499 8 23251
546 23251 -11566 -31843 12113 26549 -21291 -29201 14849 15132 -18562 -10914 7635 -6789 -6683
559 -6683 14837 -2709 -28118 5924 34485 -8995 -35694 12210 35617 -7635 -22825 10937
571 10937 16544 -1767 4966 5977 -12722 3531 32418 2021 -34768 3776 42746 1006 -36290
584 -36290 583 28502 148 -15652 -1491 -2762 -3284 14072 336 -33080 -9441 34878 4754
597 4754 -44886 -13893 33741 7103 -30802 -11665 11426 3009 474 -447 -17867 -7140 30313
$$ packed form
508b3553N667M0079j7386l2614K7923K1725l4478p650L8575n628l6651J8961L1162
521B6132k7430j9824L3000O970l2847Q452K9648k2662k2495L4974J3047m2516
533a5551l153M3817o739m0023J4176K9110k1113j5104K3838l191k5566J9507K3243
546B3251l4817k0277M3956J4436m7840p910M4050K83l3694P648J8549j4424J06
559f683K1520j7546k5409L4042K8561m3480k6699M7904K3407m3252j5190L3762
571A0937N607j8311O733J011j8699J6253K8887l0397l6789L8544L8970m1740l7296
584c6290L6873K7919k8354j5800J4161j271n22J7356j3736l3416K3639M4319l0124
597D754m9640L0993M7634k6638l7905J9137K3091q417k535r21j7420J0727L7453
$$ plain form
610 30313 14772 -35464 -16762 40918 24103 -30510 -16773 27378 19449 -6238 -3939 -592 1609
623 1609 20950 15762 -24379 -19789 33924 30116 -30576 -30427 25476 27087 -17632 -22052 2589 5826
637 5826 3402 1506 -19904 -22313 18443 25358 -28382 -40214 18331 34414 -19142 -35812 5814
650 5814 21378 -262 -9325 -8778 -6787 15264 24091 -14531 -32174 18463 44477 -8364 -37729
663 -37729 9891 38780 4206 -18987 -2240 10625 12740 12553 -8185 -23277 10405 37518 -5172
676 -5172 -42481 109 39735 1919 -35635 -9921 17571 5727 -8381 -12354 -15289 1958 21674
689 21674 -5287 -39177 -7028 37039 5925 -40336 -13582 29284 12270 -18370 -10722 4516
701 4516 8530 13257 1302 -20902 -2280 35445 15105 -31087 -11964 36261 21355 -21571 -12763
$$ packed form
610C0313j5541n0236J8702N7680j6815n4613J3737M4151p929k5687K299L347K201
623A609J9341n188m0141M590N3713l808o0692J49N5903J611m4719m420K4641L237
637E826k424j896k1410k409M0756O915n3740j1832N8545J6083n3556j6670M1626
650E814J5564k1640r063N47J991K2051Q827l8622j7643N0637K6014n2841k9365
663c7729M7620K8889l4574k3193J6747J2865K115j87k0738j5092L3682K7113m2690
676e172l7309M2590L9626l7816l7554K5714K7492j1844j4108l973k935J7247J9716
689B1674k6961l3890L2149M4067l1114m6261K6754M2866j7014l0640P648J5238
701D516M014M727j1955k2204J8622L7725k0340m6192J9123M8225j4906m2926Q808
$$ plain form
714 -12763 17640 14048 -185 -2419 -8049 -3066 19413 11549 -25927 -18871 25459 18741 -27370
727 -27370 -23344 15979 13342 -14475 -13684 -1587 -2066 2812 4162 -16088 -18345 14957 19220 -20343
741 -20343 -24325 16909 21514 -13322 -15460 9936 10367 -654 3167 421 -6489 9783 20507 -5579
755 -5579 -18403 13517 26325 -6878 -17898 11125 17090 -5199 -5696 5484 -1573 -2643 9441
768 9441 -628 -17930 -715 17771 -5120 -23586 612 14894 -8177 -16519 2533 3199 -9581
781 -9581 -1869 4383 -10064 -8265 11846 4107 -17042 -3068 17409 993 -14142 4313 13586
794 13586 -3533 -4268 11116 4251 -7033 7030 13558 -5241 -6307 14018 8931 -10605 -650
807 -650 14108 -965 -10327 6751 8215 -10378 -5877 10581 -354 -14158 -9 8144 -8267
$$ packed form
714a2763L0403l592j4233k234n630M983K2479p864l7476P056M4330o718m6111
727b7370M026L9323k637k7817P91J2097m79M878J350k0250k257L3302M263l9563
741b0343l982M1234M605l4836k138K5396M31j1021L821k746o910J6272J0724k6086
755e579j2824L1920J2808l3203j1020K9023N965k2289m97J1180p057j070J2084
768I441j0069j7302J7215J8486k2891j8466K4198J4282k3071q342J9052O66j2780
781i581P712O252j4447J799K0111p739k1149J3974K0477j6416j5135J8455R273
794A3586j7119p35J5384o865j1284J4063O528j8799j066K0325n087j9536R955
807f50J4758j5073r362J7078J464j8593M501J6458j0935j3804J4149Q153j6411
$$ plain form
820 -8267 -10214 5611 185 -13208 -735 8776 -9060 -13328 8363 8125 -13203 -8034 11394 3603
834 3603 -9540 971 7282 -3399 -393 10797 -291 -9909 8907 16958 -6325 -11914 12587
847 12587 15229 -7000 -6899 8948 5337 -2597 3514 988 -8341 2671 13509 -5738 -18545 4764
861 4764 17065 -7862 -19032 2792 10485 -5461 -8704 -1481 -3565 -1104 7065 -4106 -17292
874 -17292 1515 19257 -3049 -22063 1092 19967 814 -14077 -474 8879 3789 2882 -136
887 -136 -7865 3137 19132 2656 -19608 -767 24686 6188 -18871 -4490 15693 6576 -6116
900 -6116 -4311 -2370 1691 10134 576 -18440 -6387 19736 6734 -23354 -12145 16690 8893
913 8893 -14332 -11024 2953 4384 2394 -2352 -12337 -5095 16330 9270 -19467 -13353 19236 16167
$$ packed form
820h267j947J5825n426j3393J2473R511j7836m268K1691k38k1328N169J9428p791
834C603j3143J0511O311j0681L006J1190j1088r618J8816Q051k3283n589K4501
847A2587K642k2229J01J5847l611p934O111k526r329J1012J0838j9247j2807K3309
861D764J2301k4927j1170K1824P693j5946l243P223k084K461Q169j1171j3186
874a7292J8807J7742k2306j9014K3155J8875j9153j4891J3603R353n090r07l018
887a36p729J1002J5995j6476k2264J8841K5453j8498k5059J4381K0183r117j2692
900f116J805J941M061Q443r558j9016J2053K6123j3002l0088J1209K8835p797
913H893k3225L308J3977J431j990m746r985P242K1425p060k8737O114L2589l069
$$ plain form
927 16167 -14355 -13988 10328 13028 -548 -4793 -3752 967 12829 9248 -13596 -12778 17174 19355
941 19355 -13325 -18875 10600 17872 -4411 -12644 -1604 4828 5905 2425 -11054 -12368 10537
954 10537 16718 -12180 -22875 7005 20765 -5460 -19902 -1208 11468 3488 -4546 -7690 -5648
967 -5648 8250 13727 -7761 -19868 6023 23914 -1696 -21997 -371 19442 5412 -10317
979 -10317 -5541 3310 8012 7977 -5024 -14495 4022 21429 407 -22681 -3259 21489 6241
992 6241 -16677 -8018 8724 7039 -932 -6310 -8774 1867 14392 511 -20160 -5808 20085
1005 20085 7638 -19293 -10302 13481 9350 -7303 -7836 -521 4208 7665 324 -13067 -4616 17057
1019 17057 9098 -17007 -10835 15696 12210 -10591 -9854 5766 7300 988 -1978 -5878 -2692 10484
$$ packed form
927A6167l0522L67K4316K700j3576m245J041M719J1862l581k2844Q18K9952K181
941A9355l2680n550K9475P272k2283q233J1040O432J077l480j3479j314K2905
954A0537O181k8898j0695K9880J3760k6225j4442J8694J2676p980q034l144K042
967e648J3898N477k1488j2107K5891J7891k5610k0301K1626J9813j4030j5729
979a0317M776Q851M702l5j3001r471J8517J7407k1022k3088J9422K4748j5248
992F241k2918Q659J6742j685p971n378k464J0641J2525j3881k0671J4352K5893
1005B0085j2447k6931Q991K3783m131j6653n33P315M729L457p341j3391Q451K1673
1019A7057p959k6105O172K6531l486k2801P37J5620J534o312k966l900L186J3176
$$ plain form
1033 10484 7820 -12397 -11119 12638 12836 -10956 -12442 7587 9494 -3906 -5562 -537 142 3622
1047 3622 4662 -6532 -9404 7602 11968 -7943 -12947 6796 11687 -5115 -8619 3072 4287
1060 4287 -951 774 -913 -5538 2372 9209 -3186 -11435 3391 11627 -3488 -10384 3141 7050
1074 7050 -3099 -3304 2532 -1211 -2243 4963 1630 -7927 -992 9658 202 -9442 1103 8486
1088 8486 -1857 -5581 3455 3237 -3903 624 5203 -2789 -4406 5641 4087 -6523 -2171 7156
1102 7156 366 -6576 1883 5101 -4179 -3714 5279 1201 -6819 -122 5917 -2617 -5802 3023 2758
1117 2758 -5144 -1095 4838 -2731 -5837 4542 4841 -6684 -4246 7242 3128 -6427 -1044 5392
1131 5392 -42 -2256 3083 684 -3900 3430 6947 -4268 -6639 7065 8121 -6078 -5966 6141
$$ packed form
1033A0484k664k0217J278K3757J98k3792j486K0029J907j3400j656N025O79L480
1047C622J040j1194k872J7006M366j9911n004J9743M891j6802l504J1691J215
1060D287n238J725j687m625P910O837j2395q249J4826Q236j5115o896J3525L909
1074G050j0149k05N836l743j032P206l333r557O935J0650r456r644J0545P383
1088H486j0343l724R036k18p140M527M579p992j617J0047j554j0610M352R327
1102G156o790o942Q459L218r280M65Q993m078q020O697O039q534l185Q825k65
1117B758p902M049N933p569l106J0379K99j1525K438J1488m114r555N383O436
1131E392n434k214N339k399m584P330L517j1215k371J3704J056j4199J12J2107
$$ plain form
1145 6141 4980 -3513 -1842 1301 -1332 1019 4077 -3733 -7915 4057 8796 -5860 -11288 3844
1159 3844 8905 -4285 -8290 724 2922 -207 117 -2968 -5768 3192 8875 -3876 -11646 3257
1173 3257 12893 -1271 -11044 714 9562 2312 -3430 -1507 68 4061 7385 -1804 -9806 2895
1187 2895 14298 330 -13383 -911 12761 3341 -8812 -4337 3760 3959 1017 -4074 -7789 643
1201 643 10440 -349 -15285 -4258 13266 3794 -13329 -7176 6979 5440 -3247 -5775 -3477 2706
1215 2706 7870 307 -11223 -3349 13768 7510 -11898 -7680 11435 10132 -4915 -6378 2128 6243
1229 6243 5524 -270 -7477 -1498 11924 7055 -11045 -9005 10451 11156 -7485 -11252 2991 7956
1243 7956 -106 -5711 -5938 -1407 6749 3758 -11083 -10474 8152 10425 -8537 -13659 3044 10498
$$ packed form
1145F141j161q493J671L143k633K351L058p810m182J1972M739j4656n428J5132
1159C844N061j3190m005R014K198l129L24l085k800Q960N683j2751p770J4903
1173C257R636j4164r773J1758Q848p250n742J923J575L993L324r189q002J2701
1187B895J1403j3968j3713J2472J3672r420j2153M475Q097J99k942n091l715Q432
1201F43R797j0789j4936J1027J7524r472j7123O153J4155j539q687k528K298O183
1215B706N164p563j1530P874J7117o258j9408M218J9115j303j5047j463Q506M115
1229F243p19n794p207N979J3422m869j8100K040J9456P05j8641l767J4243M965
1243G956q062n605k27M531Q156k991j4841O09J8626K273j8962n122J6703P454
$$ plain form
1257 10498 -989 -8758 -3383 3512 5449 2093 -6180 -6609 7574 12426 -4621 -12461 4844 14822
1271 14822 667 -9494 -787 8138 5851 -583 -4687 -2554 6324 8978 -3621 -11801 1890 13608
1285 13608 6 -13893 -3250 9536 2964 -6981 -6214 -1084 3513 3574 -5269 -10664 405 10507
1299 10507 -273 -13696 -4469 10861 4773 -9060 -5999 4606 5397 1024 -2687 -4496 2099 10358
1313 10358 2616 -9714 -2106 12578 6930 -7773 -5108 7689 7778 -1588 -4059 -198 3061 4965
1327 4965 940 -7331 -3885 8569 5253 -9827 -7771 6392 5579 -6113 -7233 108 2486 -131
1341 -131 -2889 -4978 -2939 3861 3521 -6747 -7448 5310 7256 -5199 -6925 3855 5608 -814 -1575
1356 -1575 432 876 3605 4072 -1747 -3273 4705 7594 -1488 -5322 3705 7298 -1163 -3692 2271
$$ packed form
1257A0498j1487p769N375O895J937l356q273m29J4183M852j7047p840J7305R978
1271A4822j4155j0161Q707Q925k287o434m104K133Q878K654j2599q180J3691J1718
1285A3608j3602j3899J0643J2786o572r945P67N130M597O1q843n395J1069J0102
1299A0507j0780j3423R227J5330o088j3833L061J0605P91m373l711j809O595Q259
1313A0358p742j2330P608J4684n648j4703K665J2797Q9r366k471L861L259J904
1327D965m025q271L446J2454l316j5080K056J4163q13j1692j120P341K378k617
1341a31k758k089K039O800l40j0268p01J2758J946j2455j726J0780J753o422p61
1356a575K007M44K729M67n819j526P978K889r082l834R027L593q461k529N963
$$ plain form
1371 2271 2462 -714 844 -71 -3563 93 3954 -2039 -6379 109 3851 -2628 -5863 -219 1898
1386 1898 -2897 -3171 686 -1224 -3248 1189 1362 -4036 -1553 4157 353 -3884 1290 3980 -830
1401 -830 -1344 3345 2521 -1493 808 4444 1023 -1828 2568 3836 -1028 -357 3658 365 -2347 2454
1417 2454 2701 -3375 -2103 3593 842 -4599 -1918 2271 -485 -3622 -1320 -173 -2312 -1009 905
1432 905 -3325 -4315 2554 2714 -5232 -4080 3893 2633 -3421 -1922 2013 1493 696 1078 -591 -839 3753
1449 3753 4728 -2111 -3747 4776 6897 -2140 -4162 3475 4762 -155 -1132 -386 -153 2662 2645 -3420
1465 -3420 -4916 2746 5360 -3274 -7765 495 5620 -1502 -6468 -1946 1542 663 -560 -3558 -4626
1480 -4626 2120 5565 -3075 -7960 1240 7773 232 -6717 -1417 5658 3588 -1657 -2369 79 3832
$$ packed form
1371B271J91l176J558r15l492L656L861n993m340O488L742o479l235N644K117
1386A898m795k74L857j910k024M437J73n398K483N710l804m237N174K690m810
1401h30n14M689q24m014K301L636l421k851M396J268m864O71M015l293k712M801
1417B454K47o076J272N696k751n441K681M189k756l137K302J147k139J303J914
1432I05m230r90O869J60p946J152P973j260o054J499L935n20p97L82j669k48M592
1449C753R75o839j636Q523K121r037k022P637J287m917r77P46K33K815j7o065
1465c420j496P662K614q634m491Q260N125p122m966M522L488q79j223k998j068
1480d626O746L445q640m885R200O533p541o949N300P075k070n245p12K448L753
$$ plain form
1495 3832 5411 -843 -6115 1689 9840 1679 -7832 -1314 7892 3865 -4077 -3836 1423 4091 1852
1510 1852 -3392 -5338 682 6542 176 -9455 -3937 7526 3389 -7918 -5915 3085 3894 -1236 -4655
1525 -4655 -3716 1690 5422 -376 -7592 -2505 7840 4974 -6578 -5711 5676 7204 -1768 -4722 359
1540 359 4276 4435 119 -5011 -1089 7814 4970 -6242 -5568 5750 7361 -2905 -6800 548 5346
1555 5346 1504 -3423 -4275 -679 4458 2690 -6346 -6689 4370 6665 -4419 -8333 774 6004 399
1570 399 -5123 -3342 1575 3920 1150 -4385 -4259 3945 7108 -2306 -7665 1588 8393 1156 -5596
1585 -5596 -1446 4114 3924 242 -3259 -2154 3953 5671 -1899 -6581 826 7732 1171 -7129 -2534
1600 -2534 5323 2897 -3110 -3666 -730 2427 2798 -2483 -6101 135 6251 406 -7294 -2841 5468
$$ packed form
1495C832J579o254n272P804Q151q161r511O518R206m027p942K41N259K668k239
1510A852n244j946O020N860o366r631N518J1463m137j1307K003R000Q09n130l419
1525d655R39N406L732n798p216N087J0345k866j1552Q67J1387J528q972k954N081
1540C59L917J59m316n130L922Q903k844j1212O74J1318J611j0266l895P348M798
1555E346l842m927q52L596N137j768r036l43J1059K295j1084l914R107N230n605
1570C99n522J781M917K345k770n535J26Q204L163r414n359R253O805p237o752
1585e596M150N560j90l682l501J105O107J718p570m682P407O906o561q300M595
1600b534P857k426o007n56K936L157L71n281l618O236O116n845p700M453Q309
$$ plain form
1615 5468 3076 -4361 -4011 1656 3238 830 -2026 -3070 685 5432 1500 -5676 -2195 6221 3838
1630 3838 -4312 -3358 3285 3967 -425 -2433 -890 1614 3106 654 -3832 -2099 4537 3461 -4424
1645 -4424 -4172 3322 3650 -2428 -3392 280 1512 660 -646 -2449 -1376 2494 2209 -3167 -3685 2495
1661 2495 3689 -2208 -3590 1380 2610 -621 -1111 -111 -209 1041 1767 -1177 -2383 1687 3280 -1139
1677 -1139 -2879 1373 2908 -789 -1754 958 939 -600 371 539 -1465 -236 2066 -119 -2494 415
1693 415 2160 -843 -1911 937 1132 -1371 -712 1367 -121 -1631 552 1332 -1190 -971 1312 214
1709 214 -1432 596 1246 -1392 -965 2052 717 -2278 -492 2297 309 -1956 -174 1261 -161 -339
1725 -339 514 -791 -839 1781 1124 -2580 -1346 2891 1435 -2706 -1345 2140 1248 -1060 -747 5 296
$$ packed form
1615E468k392p437L50N667J582k408k856j044L755M747l932p176L481Q416k383
1630C838q150R54O643O82m392k008J543K504J492k452m486J733O636j076p885
1645d424K52P494L28o078r64L672J232q52j306j803J073L870k85n376n18O180
1661B495J194n897j382M970J230l231m90J000r8J250P26k944j206M070J593m419
1677a139j740M252J535l697r65K712j9j539R71J68k004J229K302k185k375K909
1693D15J745l003j068K848J95k503O59K079j488j510K183P80k522K19K283j098
1709B14j646K028O50k638M27L017j335k995J786K789j988k265J782J435j422j78
1725c39Q53j305m8K620o57l704J234M237j456m141J361L485q92k308L13P52K91
$$ plain form
1742 296 1281 698 -2105 -1369 2905 2270 -2866 -2525 2644 2622 -1719 -2190 595 1376 659 -345 -1891 -1084
1760 -1084 2515 2112 -2975 -3373 2410 3623 -2039 -3886 725 2881 220 -1957 -1603 99 2242 1515
1776 1515 -2756 -3095 2626 4156 -1827 -4508 1056 4544 402 -3243 -1140 2032 2472 456 -2394
1791 -2394 -1949 2712 4106 -1724 -4771 1064 5308 367 -4658 -1569 3334 2315 -1558 -3001 -1071
1806 -1071 2477 2699 -2255 -4903 573 5231 105 -5840 -1943 4315 2447 -3078 -3327 597 3036
1821 3036 1541 -2333 -3457 1311 5145 439 -5325 -1338 5489 3165 -3705 -3145 2633 3977 319
1836 319 -2605 -1711 2201 4085 -78 -4690 -1205 5151 2848 -4533 -3821 2916 3915 -1489 -4051 -1123
1852 -1123 2274 2179 -1410 -4298 -1259 4025 2074 -4678 -4135 2977 4102 -2120 -4458 90 3386 1513
$$ packed form
1742B96R85n83k803P36M274o35n136L41N169k2m341m71K785P81p17j004j546Q07
1760a084L599m03n087l98N783J213n662j847M611K156k661k177L54J702K143p27
1776A515m271l39N721J530n983k681N564L488m142l645K103L172M40k016k850
1791b394M45M661J394n830l047N835M244m941n025L089M903j019l873j443J930
1806a071L548K22m954k648N476M658n126n945L897O258j868n525k49L924K439
1821C036j495l874j124M768L834m706n764L987O827k324o870N60N778J344l658
1836C19k924Q94L912J884m163m612L485O356k303p381P12O737R99n404k562K928
1852a123L397r5l589k888L039N284j951o752N43P112J125o222k338M548L296j873
$$ plain form
1868 1513 -1805 -2693 247 3805 2059 -3270 -2910 3504 4819 -1577 -4054 1203 4539 1156 -2450
1883 -2450 -1513 1431 2968 971 -2762 -2486 2586 3823 -1969 -4792 479 4139 139 -4014 -1955
1898 -1955 1657 1650 -883 -2854 -2037 1655 2600 -1904 -4489 156 4140 344 -4126 -1400 3014 2058
1914 2058 -1214 -1878 40 2245 2308 -758 -2608 946 4371 1097 -3331 -752 3803 2318 -1862 -1713
1930 -1713 1097 2088 765 -1159 -1970 360 2705 248 -3590 -1696 2738 1444 -3110 -2643 1060 1265
1946 1265 -1051 -1916 -1244 85 1145 -154 -2577 -1375 2307 1632 -2349 -1945 1966 2154 -759 -1216
1962 -1216 719 1392 979 503 -472 -103 2007 1940 -949 -1189 1947 2275 -858 -1234 1042 1217 -357 -466
1980 -466 -51 -378 8 496 -863 -1744 176 824 -1327 -2034 161 429 -1385 -1165 255 -317 -1065 -42
$$ packed form
1868A513l318q88K940L558j746n329L60O414J315o396k477N257L336l383l606
1883b450R37K944J537j997l733K76N072J237n792k823N271L660m000m153K059
1898a955L612pk533j971Q17L692R45m504k585M645L984l796m470K726M414r56
1914B058l272o64J918K205O3l066j850L554L425l274m428K579M555j485m180J49
1930a713K810R91j323j924q11K330K345k457l838J894M434j294m554M67L703K05
1946A265k316q65O72J329J060j299k423J202L682o75l981M04L911J88k913m57
1962a216J935O73m13m76r75L69K110o7k889k40L136L28l133l76K276J75j574j09
1980d66M15l27L86M88j359q81J920O48k151p07K195K68j814K20J420n72p48J023
$$ plain form
1998 -42 306 -839 -434 792 190 -763 520 1016 -247 -46 1502 842 -632 543 1979 617 -705
2015 -705 755 1607 319 -100 560 254 87 831 229 -1358 -367 1541 -24 -2294 -884 1325 12
2032 12 -1971 -1201 60 -60 -495 -905 -1526 -543 1242 30 -2451 -1077 2030 1094 -1990 -1321 1513
2049 1513 1560 -186 -679 -36 1084 1946 704 -1431 -191 2991 2105 -1684 -1482 2323 2551 -645 -1674
2066 -1674 230 1511 1032 -612 -1907 -635 2019 1081 -2757 -2757 1409 2202 -1867 -3390 -260 1844
2082 1844 168 -2023 -2020 -124 1777 704 -2556 -2313 1975 3037 -1323 -3255 745 3558 886 -2063
2098 -2063 -909 1856 2639 627 -1790 -1027 2723 3286 -1102 -3133 1078 4125 616 -3191 -1166 2339
2114 2339 1997 -1023 -2642 -938 2002 1783 -2160 -3720 398 3421 -307 -4378 -1817 2723 1674
$$ packed form
1998d2L48j145M05J226o02r53J283M96j263K01J548o60j474J175J436j362j322
2015g05J460Q52j288m19O60l06j67P44o02j587R91J908j565k270J410K209j313
2032A2j983P70J261j20m35m10o21R83J785j212k481J374L107r36l084O69K834
2049A513M7j746m93O43J120Q62j242k135J240L182q86l789K02L805K28l196j029
2066a674J904J281m79j644j295J272K654r38l838%M166P93m069j523L130K104
2082A844j676k191LJ896J901j073l260K43M288J062m360j932M000K813k672k949
2098b063J154K765P83k012k417P63L750N63m388k031M211L047l509l807K025L505
2114B339l42l020j619J704K940k19l943j560M118L023l728m071K561M540j049
$$ plain form
2129 1674 -2403 -2910 30 2221 1093 -2134 -2723 1111 3667 169 -3655 -830 3904 2436 -2271
2144 -2271 -2194 1858 3218 640 -1859 -1158 1976 3248 14 -3176 -518 3845 1991 -2952 -2601 2011
2160 2011 2853 -884 -2942 -991 1659 1607 -1316 -3193 -835 2676 1137 -3401 -2913 1879 2643 -1486
2176 -1486 -3218 -281 2189 1093 -1424 -2069 261 2733 1283 -2320 -1823 2463 3168 -922 -2621 787
2192 787 3101 892 -1516 -1034 1172 2171 719 -1822 -1381 1892 2487 -1284 -2902 416 2726 148
2208 148 -2468 -1247 1065 1118 -571 -1947 -1291 1065 1575 -1319 -2870 118 2483 29 -2588 -943
2224 -943 1703 1189 -799 -1263 -54 1301 1388 -557 -1636 607 2547 603 -2016 -416 2245 1346
2240 1346 -943 -922 652 1279 514 -572 -1034 306 1613 253 -1899 -827 1618 799 -1614 -1343 580
$$ packed form
2129A674m077n07K940K191j128l227n89L834K556l498l824K825M734j468m707
2144b271P7M052J360k578k499P01L134J272l234l190K658M363j854m943L51M612
2160B011Q42l737k058J951K650n2k923j877K358L511j539m538M88M792P64m129
2176a486j732K937K470j096k517o45K330K472j450l603M97M286P05m090j699L408
2192G87K314k209k408M82K206R99j452k541M41L273N95l771j618L318K310k578
2208A48k616J221K312N3j689j376O56K356N10k894j551K988K365k454k617J645
2224i43K646n14j988m64J209J355Q7j945j079K243J940j944k619J600K661q99
2240A346k289K1J574O27p65j086m62J340J307j360k152J072K445q19k413K71J923
$$ plain form
2257 580 734 -521 -934 -619 -10 660 -27 -1434 -792 1190 788 -1283 -1080 879 990 -522 -637 345
2275 345 405 275 281 -240 -291 826 934 -486 -619 908 947 -485 -412 660 438 -280 -6 292 -268 -171 430
2296 430 -130 -590 42 454 -429 -576 294 60 -809 -206 556 -269 -869 102 579 -308 -637 178 180 -137 105
2317 105 36 -448 140 906 -21 -1002 229 1342 84 -1037 -9 1026 395 -380 -321 -7 459 676 -287
2336 -287 -1073 171 1430 103 -1668 -407 1428 622 -1110 -875 412 724 189 -751 -1003 278 1461
2353 1461 -21 -1831 -604 1751 921 -1555 -1205 967 1349 -205 -1110 -526 785 1209 -162 -1695
2369 -1695 -361 1986 1048 -1784 -1393 1372 1667 -623 -1577 -113 1249 937 -613 -1543 -87 1882
2385 1882 860 -1855 -1547 1553 1949 -979 -2061 180 1840 621 -1248 -1326 406 1798 579 -1875
$$ packed form
2257E80J54j255m13L15O09O70o87j407O42J982m02k071K03J959J11j512j15R82
2275C45O0j30On21n1J117J08j420j33J527L9j432P3J072k22p18K74K98n60R7O01
2296D30n60m60O32M12q83j47Q70k34q69O03P62q25o00R71M77q87l29Q15Kl17K42
2317A05o9m84N88P66r27r81J231J113j258j121J028J035o31p75N9L14M66K17r63
2336b87p86J244J259j327j771J261J835q06j732K35J287L12n35r40k52J281J183
2353A461j482j810J227K355q30k476L50K172L82j554r05N84J311M24j371j533
2369a695J334K347r38k832L91K765K95k290r54J464J362l12j550r30J456J969
2385A882j022k715L08L100L96k928j082K241J660j219j869p8J732J392j219k454
$$ plain form
2401 -1875 -1410 1705 2106 -1152 -2455 362 2302 362 -1866 -1147 948 1649 -104 -1970 -1094 1705
2417 1705 1844 -1337 -2476 581 2575 141 -2448 -920 1664 1544 -715 -1831 -349 1897 1477 -1440
2433 -1440 -2150 840 2757 66 -2607 -693 2302 1580 -1325 -1765 410 1964 918 -1567 -1737 1040
2449 1040 2509 -237 -2799 -625 2541 1268 -1984 -1902 900 1885 -39 -1878 -1245 1107 1795 -595
2465 -595 -2553 -429 2466 1014 -2235 -1729 1429 1921 -498 -1840 -373 1506 1398 -669 -1841 103
2481 103 2349 1070 -1929 -1422 1816 2128 -789 -1886 164 1774 880 -999 -1388 262 1808 501
2497 501 -1939 -1413 1459 1634 -1265 -2140 198 1566 48 -1503 -1086 396 1135 4 -1639 -1081 1222
2514 1222 1416 -999 -1769 477 1825 152 -1367 -453 1092 1056 6 -838 -290 1224 1400 -488 -1309
$$ packed form
2401a875M65L115M01l258j303K817J940j940k228P19K095P01j753j866Q76K799
2417A705J39l181j139L057J994k434k589J528K584j20k259j116J482K246m20k917
2433a440p10K990J917k691k673J914K995p22k905m40K175J554j046k485j70K777
2449A040J469k746k562K174L166j273l252Q2K802R85j924j839O33K352O88k390
2465e95j958K124K895j452l249N06L158M92k419j342J467J879j08k067j172J944
2481A03K246j279k999N07L238L12k917j097K050J610q94j879l89J650J546j307
2497E01k440N26K872J75k899q75K338J368j518j551M17J482P39j131j643N58K303
2514A222J94k415p70K246J348j673j519R14J545l6j050q44N48J514J76j888q21
$$ plain form
2531 -1309 579 1883 214 -1318 -235 1183 811 -512 -778 -97 678 628 -589 -1288 -44 1161 -153
2548 -153 -1707 -607 933 256 -1030 -841 27 396 56 -552 -836 51 883 123 -1056 -345 1138 674
2566 674 -647 -325 771 663 139 83 119 352 839 474 -456 -114 922 653 -478 -308 646 410 -369
2585 -369 -307 120 -150 -237 63 -378 -680 -104 127 -643 -687 38 -73 -666 -325 119 -258 -532 43 279 -327
2606 -327 -375 355 378 -173 32 396 123 305 696 39 -190 649 999 -1 -379 468 982 172 -427 21
2626 21 509 332 3 -366 -504 252 664 -592 -1346 0 896 -356 -1442 -615 529 148 -775 -998 -328
2645 -328 446 325 -740 -1177 191 1342 59 -1471 -229 1562 758 -746 -517 625 1258 656 -586
2662 -586 -542 947 1706 131 -1254 -111 1775 1048 -1155 -1121 973 1311 -208 -1273 -737 645 1063
$$ packed form
2531a309J888J304j669j532J083J418l72j323k66O81P75n0j217o99J244J205j314
2548a53j554J100J540o77j286J89Q68L69l40o08k84Q87Q32p60j179P11J483m64
2566F74j321L22J096j08n24n6L6K33M87l65r30L42J036k69j131J70R54k36p79
2585c69O2M27k70q7L00m41l02N76K31p70m4P25j11n93L41M44l77k74N75K36o06
2606c27m8P30K3n51K05L64k73J82L91o57k29Q39L50j000l78Q47N14q10n99M48
2626B1M88j77l29l69j38P56M12j256p54J346Q96j252j086Q27J144l81r23k23O70
2645c28P74j21j065m37J368J151j283j530J242J791q04j504K29J142O33o02j242
2662e86M4J489P59j575j385J143J886p27k203L4K094L38j519j065N36J382M18
$$ plain form
2679 1063 -606 -1902 -465 1496 450 -1922 -1551 735 1216 -804 -1882 -456 1058 703 -856 -1477
2695 -1477 -31 1755 743 -1701 -1104 1701 1904 -564 -1448 396 2026 1014 -854 -1004 827 1919
2711 1919 602 -1414 -910 1673 1987 -1006 -2047 442 1994 271 -1672 -1247 718 1387 -374 -2098
2727 -2098 -1074 1293 1175 -1525 -2338 190 1993 -85 -2327 -970 1375 1205 -705 -1666 -352 1751
2743 1751 1380 -1214 -1618 998 2396 229 -1870 -427 2086 1627 -870 -1349 655 1884 819 -1081
2759 -1081 -1369 999 2174 -204 -2295 -444 1933 922 -1603 -1752 524 1467 -215 -1847 -1192 739
2775 739 1193 -739 -2190 -601 1818 700 -1978 -1452 1070 1426 -394 -1425 -405 1329 1251 -549
2791 -549 -1303 306 1903 897 -1246 -899 1534 1820 -448 -1287 365 1454 772 -583 -1010 306 1490
$$ packed form
2679A063j669j296J437J961j046k372L71K286M81k020j078J426J514l55j559o21
2695a477J446J786j012k444N97K805K03k468q84J844J630j012j868j50J831J092
2711A919j317k016N04K583L14k993j041K489J552j723j943M25J965O69j761j724
2727b098J024K367j18k700q13K528J803k078k242J357K345j70j910r61J314K103
2743A751l71k594m04K616J398k167k099J443K513m59k497m79K004J229j065j900
2759a081k88K368J175k378k091J851K377j011k525j49K276R43j682j632O55J931
2775G39M54j932j451J589K419j118k678N26K522L56j820j031J020J734p8j800
2791e49p54J609J597j006k143L47K433K86k268q39J652J089o82j355m27J316J184
$$ plain form
2808 1490 347 -1440 -934 1003 1091 -845 -1643 -1 1112 27 -1298 -942 203 585 -68 -1230 -942
2825 -942 746 874 -808 -1248 296 1146 85 -913 -383 734 814 30 -454 -63 795 1047 -125 -797
2843 -797 455 1376 203 -758 -2 757 567 -101 -412 -95 487 463 -387 -718 -62 622 -74 -1007 -480 486
2863 486 58 -713 -487 -101 -96 -32 -275 -653 -146 394 34 -521 -258 418 384 -293 -145 361 303 41 201 211
2885 211 27 450 534 -98 -74 478 337 -91 44 261 82 -101 49 206 -169 -240 194 120 -425 -321 154
2906 154 -170 -278 -81 -253 -360 75 111 -508 -473 179 295 -337 -566 73 431 58 -340 -84 140 391 378
2927 378 -274 -405 597 885 -237 -639 287 901 219 -543 -261 485 628 -5 -574 -256 535 740 -400
2946 -400 -1097 126 1038 20 -1137 -511 622 525 -368 -898 -317 670 520 -747 -1032 205 1166 46
$$ packed form
2808A490j143j787N06J937Q8j936p98J642J113j085j325L56J145L82o53j162K88
2825i42J688J28j682m40J544Q50j061r98N30J117Q0p84m84L91Q58K52j172o72
2843g97J252R21j173r61P56P59j90o68l11L17N82k4q50l31O56O84o96r33N27R66
2863D86m28p71K26L86NO4k43l78N07N40l60n55K63O76l4o77J48N06n8k62J60J0
2885B11j84M23Q4o32K4N52j41m28J35K17j79j83J50J57l75p1M34p4n45J04M75
2906A54l24j08J97j72j07M35L6o19L5O52J16o32k29O39L58l73l98K56K24K51j3
2927C78o52j31J002K88j122m02R26O14o82p62K82P46J43o33n69L18P91K05j140
2946d00o97J223R12j018j157O26J133r7q93n30N81R87j50j267k85J237R61j120
$$ plain form
2964 46 -1324 -523 1187 801 -723 -838 267 1012 472 -685 -834 564 1386 -44 -1328 -272 1437
2981 1437 931 -923 -1075 590 1288 58 -1114 -581 703 1131 -314 -1545 -330 1439 714 -1308
2997 -1308 -1232 722 1290 -203 -1382 -450 980 843 -601 -1351 -140 1371 656 -1310 -1167 963 1488
3014 1488 -445 -1429 -132 1293 792 -809 -1113 349 1435 428 -1260 -996 1125 1477 -605 -1685
3030 -1685 51 1599 493 -1197 -1020 571 1239 119 -1361 -800 1131 1311 -775 -1659 204 1662
3046 1662 450 -1425 -940 982 1246 -252 -1338 -368 1168 1095 -843 -1517 372 1701 168 -1595
3062 -1595 -724 1167 1085 -660 -1310 -57 1220 644 -967 -1208 409 1560 -14 -1629 -564 1394
3078 1394 984 -888 -1206 291 1266 372 -1016 -824 708 1253 -122 -1378 -363 1388 924 -1000 -1113
$$ packed form
2964D6j370Q01J710l86j524j15J105P45n40j157j49J398Q22j430j284J056J709
2981A437n06j854j52J665O98j230j172N33J284M28j445j231J215J769p25k022
2997a308P6J954N68j493j179R32J430j37j444p50J211J511p15j966J43K130N25
3014A488j933r84J297J425n01j601l04J462J086j007j688K64K121L52k082j080
3030a685J736J548j106j690J77J591O68j120j480N61J931J80k086q84J863J458
3046A662j212j875M85J922K64j498j086R70J536p3j938o74J889J329j533j763
3062a595Q71J891q2j745o50J253J277n76j611k41J617J151j574j615J065J958
3078A394m10j872l18J497R75q94j388J92J532N45j375j256J015J751m64j924j13
$$ plain form
3095 -1113 600 1244 -35 -1028 -478 741 879 -291 -1082 -172 1055 501 -1090 -944 630 1040 -332
3112 -332 -1119 -241 761 462 -533 -876 -13 875 329 -874 -688 657 974 -277 -854 37 862 419 -461
3131 -461 -407 290 711 315 -507 -397 629 782 -267 -684 202 787 169 -490 -230 216 361 16 -453 -311
3151 -311 222 361 -273 -697 -55 485 -23 -594 -303 191 111 -206 -305 -168 62 190 -86 -367 -18 438 156
3172 156 -270 -104 364 285 -18 68 194 117 251 234 -40 -20 309 213 -103 -108 219 96 -127 3 75 -138 -156
3195 -156 103 -56 -322 -251 85 -120 -318 -190 -55 -155 -82 -69 -262 -210 149 125 -338 -249 243 315 -85 -238
3217 -238 173 304 256 63 -75 61 484 418 -157 -221 457 634 -53 -395 75 516 216 -308 -282 27 351
3238 351 72 -549 -505 215 512 -384 -946 -142 505 16 -753 -591 148 418 -74 -697 -412 453 635 -351
$$ packed form
3095a113J713O44j279r93N50J219J38j170p91R10J227n54j591J46J574M10j372
3112c32p87Q78J002k99r95l43Q63Q88n46j203J86J345L17j251n77Q91Q25m43q80
3131d61N4O97M21l96q22J10J026J53j049m17Q86N85o18o59K60M46J45l45m69J42
3151c11N33J39o34m24O42N40n08n71K91M94q0l17r9J37K30J28k76k81L49M56k82
3172A56m26J66M68p9l03Q6J26p7J34j7k74K0L29r6l16nL27j23k23J30P2k13j8
3195a56K59j59k66P1L36k05j98J28J35j00P3J3j93N2L59k4m63Q9M92P2m00j53
3217b38M11J31m8j93j38J36M23o6n75o4O78J77o87l42M70M41l00n24K6L09L24
3238C51k79o21M4P20K97q96n62Q04O47m89p69J62P39K70m92o23K85Q65J82r86
$$ plain form
3258 -351 -791 103 996 267 -750 -343 715 787 -58 -503 2 908 743 -335 -713 322 1081 243 -880
3277 -880 -438 839 685 -434 -864 -6 713 265 -759 -906 223 825 -133 -1247 -575 753 540 -859
3295 -859 -1018 186 816 109 -882 -611 553 902 -69 -1009 -170 1093 741 -648 -797 670 1176 142
3313 142 -797 -242 911 936 -195 -858 102 1137 599 -799 -838 582 1034 -234 -1062 -281 800 487
3331 487 -674 -983 -8 817 159 -1087 -903 520 827 -501 -1239 -152 920 423 -822 -795 374 961
3349 961 124 -849 -479 863 1030 -320 -964 216 1225 571 -743 -499 695 1045 23 -734 -220 862
3367 862 801 -467 -941 135 982 124 -1015 -628 576 573 -516 -989 -241 628 261 -747 -919 119 799
3386 799 -68 -1073 -431 766 628 -579 -834 148 798 310 -563 -445 510 934 70 -659 -64 940 709
$$ packed form
3258c51m40Q94Q93p29j017M07J058P2q45m45N05R06j65j078l78J035P59q38j123
3277h80M42J277j54j119m30Q58P19m48j024j47J129O02r58j114O72J328k13j399
3295h59j59J204O30p07r91K71J164L49r71r40Q39J263l52j389j49J467N06j034
3313A42r39N55J153K5j131o63R60J035n38j398l9J420M52j268q28P81J081l13
3331D87j161l09R75Q25o58j246J84J423L07j328p38J087J072m97j245K7J169N87
3349I61q37r73L70J342J67j350o44J180J009o54j314K44J194L50j022p57N14J082
3367H62o1j268m74J076Q47q58j139L87J204lj089m73P48Q69l67j008j72J038O80
3386G99q67j005O42J197j38j207k55R82O50m88q73J18R55M24q64p29N95J004k31
$$ plain form
3405 709 -417 -527 479 850 132 -523 -214 472 560 -140 -678 -130 649 239 -648 -646 244 446 -235 -693
3425 -693 -270 287 161 -410 -565 -100 401 110 -554 -445 290 409 -230 -499 61 447 267 -147 -88 204
3445 204 426 230 -144 -88 384 504 -5 -243 220 477 151 -193 -19 122 171 83 -189 -154 21 127 -187
3466 -187 -355 -114 40 -149 -328 -163 -34 -135 -158 -145 -90 -102 9 -7 -97 -74 97 105 -45 68 117 76 87 208
3490 208 139 -59 166 267 161 6 139 237 157 83 22 30 29 222 27 -220 -126 209 19 -237 -213 73 58 -197
3514 -197 -292 -195 21 43 -131 -331 -173 216 103 -346 -265 159 367 -73 -224 25 275 238 -72 -172 33 423
3536 423 250 -230 -289 405 512 -91 -389 30 507 277 -238 -270 102 403 137 -387 -312 265 377 -236 -636
3557 -636 -88 457 85 -473 -446 162 364 -126 -548 -342 358 422 -307 -589 37 671 212 -543 -309 487 585
$$ packed form
3405G09j126j10J006L71p18o55L09O86Q8p00n38N48P79m10q87KQ90K02o81m58
3425f93M23N57j26n71j55M65N01k91o64J09P35J19o39k69N60L86j80m14N9K92
3445B04K22j96l74N6M72J20n09k38M63K57l26l44J74J41M9q8k72L5J75J06l14
3466a87j68K41J54j89j79J65J29j01k3J3N5j2J11j6r0K3J71Qj50J13M9m1J1J21
3490B08o9j98K25J01j06j55J33R8q0p4o1QjJ93j95k47R4L35j90k56K4K86j5k55
3514a97r5R7K16K2j74k00J58L89j13m49Q1M24K08m40j51K49K50l7l10j00K05L90
3536D23j73m80n9O94J07o03k98M19M77k30n15l2L72L01k66n24P5N77J12o13m00
3557f36N48N45l72n58K7O08K02m90m22K06P00O4p29k82O26O34m59p55K34P96R8
$$ plain form
3578 585 -43 -463 -90 640 529 -286 -560 228 779 152 -657 -334 549 589 -318 -654 35 603 262 -497
3598 -497 -548 228 679 -48 -818 -362 588 377 -466 -669 102 667 105 -631 -466 386 623 -87 -753 -231
3618 -231 696 504 -493 -597 335 799 75 -667 -245 530 623 -219 -655 -2 774 341 -558 -572 428 698
3638 698 -113 -696 -258 569 416 -379 -673 51 659 207 -629 -456 369 636 -243 -745 -152 588 274 -450
3658 -450 -520 159 634 111 -590 -365 477 574 -226 -688 19 751 224 -512 -433 335 587 -26 -566 -199 527
3679 527 479 -337 -553 99 664 156 -601 -323 384 511 -224 -520 -109 493 264 -380 -440 145 605 60 -608
3700 -608 -252 488 405 -312 -456 135 455 182 -333 -274 237 508 -50 -468 -135 455 232 -356 -424 147 381
3721 381 3 -384 -147 235 307 -71 -424 -33 356 214 -269 -250 184 358 -65 -296 -26 257 233 -116 -211
$$ packed form
3578E85o28m20L73P30j11q15k74P88N51o27q09L23Q83M0r07l36O89N68l41p59
3598d97n1P76M51p27p70M56R50k11q43k03P71N65n62p36J65Q52K37p10o66N22
3618b31R27j92r97j04R32M64p24p42M22P75R3q42m36O53P76m33q99j4J000K70
3638F98q11n83M38Q27j53p95k94P24O08m52q36J73Q25K67q79n02N93P40l14p24
3658d50p0O79M75n23p01K25Q42R7q00m62P07P32n27p36P9P68K52o13n40L67P26
3679E27m8q16k16O52N65n08p57K78P07J27p35k96M11O02k29o44o0N85M60n45o68
3700f08L56P40q3p17j44N91L20k73n15N9N11K71n58m18L33N90k23n88o8N71K34
3721C81l78l87K37L82P2l78l53L91L89j42m83J9M34J74m23k31K70K83k4l49r5
$$ plain form
3742 -211 39 332 106 -187 -140 218 180 -89 -296 -21 241 50 -135 -135 20 89 23 -175 -127 38 79 -127 -155
3765 -155 -40 89 -21 -149 -45 53 24 -34 -7 -66 49 56 9 -56 34 102 64 53 77 57 16 41 153 -12 -51 30
3791 30 133 69 2 8 27 29 23 -17 -83 -10 122 -16 -198 -119 38 -11 -195 -146 23 90 -72 -108 -134 58 108 -29 -179
3818 -179 -41 233 131 -103 -117 156 170 16 -162 6 156 158 20 -183 19 260 121 -176 -147 169 233 -57
3840 -57 -266 -110 187 85 -168 -246 5 226 29 -302 -323 179 216 -151 -365 -57 200 102 -241 -311 42 273
3862 273 83 -325 -158 284 365 -80 -300 88 398 197 -219 -175 243 377 56 -240 -93 342 306 -195 -337
3883 -337 67 455 82 -340 -234 224 288 -229 -423 -102 316 193 -371 -460 103 379 -24 -487 -202 350 329
3904 329 -234 -405 80 389 136 -341 -319 226 456 12 -384 -68 498 335 -196 -275 209 425 105 -279 -182
$$ packed form
3742b11K50K93k26k93M7L58l8k69k07K75K62j91j85%J55O9o6j98M8J65M1k06k8
3765a55J15J29j10j28J04R8k9n8K7n9J15Pm7o5R0O8l8j1K4k0m1K5J12j65l9Q1
3791C0J03o4o7OJ9Kom0o6P3J32j38j82P9J57m9j84M9J69O7j62l6k6J92N0j37j50
3818a79J38K74j02k34j4K73J4j54j78J68J50Kj38k03K02K41j39k97K9L16O4k90
3840e7k09J56K97j02k53p8K51K21j97l31k1N02L7l67k14L08K57r8l43p0L53K31
3862B73j90m08J67M42Q1m45k20L88L10k01m16M4M18J34l21k96J47M35l6n01j42
3883c37M04L88l73m22J06M58O4n17j94L21M18j23n64q9N63K76m03m63K85N52k1
3904C29n63j71M85L09k53m77K2N45K30m44l96L16N66j63n31p9M84K16l20l84R7
$$ plain form
3925 -182 332 401 -123 -385 -28 418 218 -316 -343 133 374 -142 -481 -187 284 208 -260 -443 56 379 59
3946 59 -398 -296 228 351 -109 -483 -57 380 240 -298 -275 134 398 92 -307 -156 340 372 -126 -298 43
3967 43 435 178 -267 -208 168 355 -14 -357 -187 267 238 -225 -360 60 267 23 -337 -233 110 240 -158
3988 -158 -404 -144 218 107 -240 -302 162 352 5 -338 -121 311 220 -107 -228 71 362 175 -211 -142 230
4009 230 328 54 -157 -36 329 204 -177 -161 71 241 67 -196 -167 116 214 -123 -301 -45 164 -9 -208
4030 -208 -243 45 71 -104 -212 -114 96 75 -114 -191 -13 194 56 -156 -83 136 105 47 -40 53 170 98 -37 -5
4054 -5 105 190 59 -88 -7 107 119 -52 -90 46 62 -8 -72 -49 2 -16 -54 -49 -51 -16 1 -56 -109 -14 -9 -72 -59 -29 -31 -86
4084 -86 9 35 7 -28 35 60 51 27 7 80 107 93 6 -20 40 123 65 17 -6 147 -10 -10 -9 1 63 -3 -111 -63 62 49
$$ packed form
3925a82N14O9n24k62L57M46k00n34k7M76K41n16l39K94M71p6m68j83M99L23l20
3946E9m57J02N24J23m60l74M26M37j40n38K3M09K64l06l99J51M96L2m98j72L41
3967D3L92k57m45N9L76J87l69l43J70M54k9m63j35M20K07k44l60J04L43J30l98
3988a58k46K60L62j11l47o2M64J90l47l43K17M32r1l27j21K99K91j87l86O9L72
4009B30R8k74k11J21L65j25l81J6K32J70j74k63K9K83R8l37j78K56K09j73j99
4030b08l5K88K6j75j08R8K10k1j89p7J78K07j38k12P3K19l1n8q7R3J17p2j35L2
4054eJ10Q5j31j47Q1J14J2j71l8J36J6p0o4K3N1j8l8NkL5J7n7n3R5No3J3L0kn5
4084h6R5K6k8l5O3K5rk4k0P3K7j4q7k6O0Q3n8m8k3J53j57%JJ0O2o6j08M8J25j3
$$ plain form
4114 49 -69 -141 -92 6 34 -184 -149 48 52 -75 -151 -65 40 111 -88 -175 31 184 73 -120 -40 141 191 -8 -104
4139 -104 61 154 123 -26 -87 97 250 92 -89 -67 193 115 -142 -147 50 138 57 -178 -137 73 104 -56 -224 -93
4163 -93 123 104 -168 -193 85 154 -8 -158 -92 140 220 9 -193 14 169 127 -172 -192 154 302 36 -197 -35
4186 -35 230 214 -72 -116 30 251 81 -172 -148 143 196 -81 -220 -96 150 93 -194 -195 65 189 43 -260 -155
4209 -155 145 174 -200 -295 -30 257 89 -199 -181 125 242 -48 -215 -31 217 193 -112 -181 65 313 80 -198
4231 -198 -102 196 210 -70 -253 -7 210 174 -199 -217 108 251 -18 -251 -113 146 82 -171 -265 31 207 59
4253 59 -237 -157 129 191 -85 -240 -27 252 130 -160 -239 51 234 12 -182 -34 188 165 -66 -169 45 252
4275 252 28 -133 -131 167 158 -52 -181 -9 163 136 -195 -170 -16 173 32 -167 -161 128 150 -110 -187 -26 137
$$ packed form
4114D9j18p2M9R8K8k18L5J97Mj27p6Q6J05P1j99q7K06J53j11j93Q0J81N0j99r6
4139a04J65R3l1j49o1J84J53j58j81K2K60p8k57nJ97Q8q1k35M1K10L1j60j68J31
4163i3K16j9k72k5K78O9j62j50O6K32Q0k11k02K07J55m2k99k0L46J48k66k33J62
4186c5K65j6k86m4J46K21j70k53K4K91N3k77j39J24K46n7k87jK60J24j46l03J05
4209a55L00K9l74r5K65K87j68k88J8L06J17k90j67J84K48k4l05o9K46K48k33k78
4231a98R6K98J4k80j83K46K17l6l73j8L25J43k69k33J38K59o4k53r4K96J76j48
4253E9k96Q0K86O2k76j55K13K79j22k90p9K90J83k22j94J48K22k3k31j03K14K07
4275B52k24j61KK98rk10j29J72J72k7l31K5J54J89j41j99OK89K2k60p7J61J63
$$ plain form
4298 137 111 -109 -155 32 204 48 -177 -80 173 194 -87 -138 8 219 -4 -87 -59 60 148 10 -156 -59 161
4321 161 140 -100 -143 70 132 3 -132 -49 140 134 -43 -152 -23 81 107 -130 -71 52 73 -53 -162 3 44
4344 44 123 -73 -96 5 63 39 -69 -63 56 82 5 -141 29 75 -19 -89 -1 32 67 -15 -71 -11 2 32 -42 9 20 44
4372 44 1 -68 -20 32 -15 -9 2 -19 -42 -14 -59 37 8 -32 -41 21 65 -15 6 -6 8 23 -115 -31 23 39 -43 -137 -15 22
4402 22 -51 -67 -46 6 63 11 -63 -20 35 96 -70 -87 19 86 18 -123 -22 78 101 -9 -68 -23 137 46 -72 -78 69
4429 69 139 -11 -92 -6 145 89 -98 -94 58 156 53 -125 -80 123 118 -67 -161 10 186 78 -144 -108 113 135 3
4454 3 -178 -99 127 118 -93 -182 25 156 74 -167 -66 124 111 -36 -212 35 205 153 -128 -157 154 222 30 -226
4478 -226 -48 151 131 -105 -150 6 250 81 -213 -136 94 185 -13 -230 -72 123 100 -192 -232 -9 213 17
$$ packed form
4298A37k6k20m6J87J72j56k25R7K53K1k81n1J46K11k23q3K8J19Q8j38j66R7K20
4321A61k1k40m3K13O2j29j35Q3J89oj77j09J29J04K6k37N9J23K1j26j09J65M1
4344D4P9j96k3J01N8k4j08OJ19K6p7j46J70M6r4p0Q8L3L5q2n6O0J3L0p4N1J1K4
4372D4m3o9M8N2m7OJ1k1k3K8m5R6k9m0rO2M4q0K1j2J4J5j38Q4N4J6q2r4J22L7
4402B2p3j6K1N2N7n2p4M3N5O1j66j7J06O7o8j41J01J00K3j10n9M5J60r1j18oJ47
4429F9P0j50q1Q6J51n6j87MJ52R8j03j78M5K03nj85r4J71J76j08k22L6K21K2j32
4454Cj81P9K26rk11q9K07J31q2k41J01J90j3j47j76K47J70n2k81k9L11O8j92k56
4478b26J78J99k0k36m5J56K44j69k94P7K30R1j98k17J58J95k3k92m0K23K22j96
$$ plain form
4500 17 -239 -175 181 203 -21 -181 -27 270 149 -180 -161 121 270 20 -172 -61 179 200 -37 -226 16 285
4522 285 119 -207 -184 126 238 -100 -327 -46 211 125 -236 -248 74 245 -36 -302 -204 148 160 -108 -277 -16
4544 -16 239 89 -217 -201 99 196 -14 -219 -76 236 246 -82 -216 22 278 70 -179 -139 136 238 -16 -202
4566 -202 -52 200 149 -138 -230 131 251 -22 -213 -113 157 149 -145 -253 -49 173 63 -212 -194 46 163 -21
4588 -21 -245 -116 161 117 -76 -242 34 215 63 -152 -120 137 185 27 -154 -11 235 136 -98 -155 57 161
4610 161 -16 -136 -71 156 190 33 -114 1 165 95 -172 -143 77 131 -89 -157 -88 89 57 -101 -174 -67 104
4633 104 48 -161 -162 67 134 -30 -135 17 184 60 -56 -20 62 135 -4 -50 26 149 123 -17 -16 106 100 41 -91
4658 -91 -11 58 78 -60 -30 8 12 -10 -36 -61 -42 -47 -73 -104 -91 17 16 -36 -107 -3 -23 -41 -51 -4 -26 6 -6 -13 22 2 -31
$$ packed form
4500A7k56O4L56K2k24j60J54K97j21l29J9K82J49k50j92J11K40K1k37j89K42K69
4522B85j66l26K3L10J12l38k27K81K57q6l61j2L22J71k81k66R8L52J2k68j69K61
4544a6K55j50l06J6L00R7k10k05J43L12J0l28j34K38K56k08k49M0K75J02k54j86
4566b02J50K52n1k87r2L61J20k73j91J00K70qk94j08K04K22j10k75J8K40J17j84
4588b1k24J29K77m4j93j66K76J81j52k15L2K57M8j58j81J43K46r9k34n7K12J04
4610A61j77j20O5K27L4j57j47J15J64p0k67K9K20N4k20o8O9J77l2j58p3J07J71
4633A04n6k09jK29O7j64j05J52J67j24j16L6Q2P3j39m6P6J23k6j40JJ22on9j32
4658i1Q0O9K0j38L0L8Mk2k6k5J9nk6l1J3J08jn2p1J04k0j8j0M7k2L2j2pL5k0l3
$$ plain form
4689 -31 72 78 23 -5 69 121 79 21 7 20 89 105 -18 -17 110 100 6 -89 -17 94 67 -93 -147 63 -4 -55 -125 -89
4717 -89 66 10 -120 -208 -88 83 43 -197 -109 106 133 -29 -180 -39 190 111 -88 -86 111 282 75 -173 -28
4740 -28 243 222 -35 -119 60 243 81 -144 -68 149 215 -55 -223 -53 133 100 -194 -180 44 179 -32 -199
4762 -199 -167 139 133 -101 -250 -56 244 73 -227 -265 158 252 6 -222 -43 211 207 -76 -188 118 291 166
4784 166 -168 -107 220 293 33 -202 -33 281 154 -139 -188 63 262 73 -285 -221 194 190 -187 -352 -83 217
4806 217 80 -324 -281 107 191 -68 -306 -114 201 210 -189 -271 22 308 134 -214 -132 219 306 -6 -258 0
4828 0 295 239 -151 -221 113 339 107 -283 -138 162 256 -154 -283 6 290 145 -245 -275 81 244 -55 -304
4850 -304 -188 228 202 -246 -281 42 272 21 -282 -206 136 223 -108 -256 -30 281 239 -175 -182 159 356 82
$$ packed form
4689c1J03On5k8P4N2m2n8j4J3O9J6j23JJ27j0r4r5P2J11k7j60n4K10o7n1p0L6
4717h9J55n6j30q8J20J71m0k40Q8K15K7j62j51J41K29p9j99KJ97J71k07k48J45
4740b8K71k1k57q4J79J83j62k25P6K17O6k70j68J70J86l3k94J4K24J35k11j67
4762a99L2L06ok34j49J94L00j71l00l8M23R4k46k28J79K54mk83j12L06J73j25
4784A66l34O1L27P3k60k35J69L14j27k93m9K51J99j89l58O4M15ml77j65K69L00
4806B17j37m04M3L88Q4k59k38J92L15Rl99q2K93K86j74l48Q2L51Q7l12k52K58
4828@K95n6l90p0L34K26k32l90J45L00R4m10j29K89K84j45l90l0L56J63k99k49
4850c04J16M16k6m48l5L23K30k51l03P6L42Q7l31j48K26L11m2m14pL41J97k74
$$ plain form
4872 82 -224 -124 250 261 -116 -210 2 314 162 -194 -119 136 248 -35 -187 -68 212 133 -156 -228 9 215
4894 215 103 -243 -187 102 192 -72 -274 -24 218 136 -157 -178 61 179 23 -159 -20 172 173 -63 -163 -15
4916 -15 208 116 -121 -97 88 153 42 -151 -76 169 97 -56 -152 14 193 48 -155 -100 131 88 -37 -113 -53 89
4940 89 20 -91 -73 39 123 -13 -134 -67 95 11 -36 -104 -14 79 55 -12 -77 70 62 32 -63 -31 43 94 1 -18 16 97
4968 97 50 8 10 35 17 40 23 43 40 23 3 -15 12 46 -47 28 49 -2 -19 -9 67 -15 -17 -72 23 10 -29 -42 -16 101 17
4999 17 -89 -48 65 92 -13 -100 -53 99 66 -103 -72 22 125 37 -50 -85 121 135 -5 -148 20 183 83 -136
5023 -136 -137 86 118 25 -120 -37 153 122 -104 -154 24 228 53 -156 -101 141 180 -29 -159 -63 149 169 -134 -172
5047 -172 23 231 7 -198 -154 138 194 -61 -234 51 256 78 -186 -138 168 277 -30 -259 -65 231 156
$$ packed form
4872H2l06J00L74J1l77r4K12L12j52l56P5K55J12k83j52J19K80p9k89p2K37K06
4894B15j12l46N6K89R0k64k02K50K42q2k93k1K39J18j56j82J39J92Jk36j00J48
4916a5K23r2k37K4J85O5j11j93P5K45p2j53r6J66J79j45k03N5K31m3j25p6O0J42
4940H9o9j11J8J12Q4j36j21O7J62q4m7o8R0R3k4o7o5J47ql0r5L2P4N1r3j9L4Q1
4968I7m7m2KK5j8K3j7K0lj7k0j8K7L4r3P5K1n1j7J0P6q2kn5R5j3l9j3K6J17q4
4999A7j06M1J13K7j05q7M7J52l3j69L1R4J03q8q7l5K06J4j40j43J68J63j00k19
5023a36jK23L2r3j45Q3J90l1k26n0J78K04j75k09N5K42L9k09j30R6K12K0l03l8
5047a72J95K08k24k05M4K92N6k55j73K85K05j78k64M8L06J09l07k29J94K96p5
$$ plain form
5068 156 -146 -209 96 253 45 -180 -142 207 224 -47 -231 -54 274 179 -191 -255 121 259 41 -283 -128 231
5090 231 210 -100 -307 52 307 124 -217 -238 160 264 -57 -265 -134 303 175 -204 -263 70 346 111 -255
5111 -255 -151 243 257 -66 -263 -17 270 161 -180 -164 137 354 45 -226 -77 227 259 -109 -339 -12 304
5132 304 127 -258 -204 155 258 -38 -303 -118 216 215 -188 -332 50 233 19 -309 -181 182 220 -70 -377
5153 -377 0 241 146 -186 -214 127 338 52 -264 -123 258 241 -77 -169 50 280 124 -211 -190 155 284 2
5175 2 -308 -112 267 223 -154 -256 33 257 9 -239 -133 175 183 -87 -258 -69 205 130 -227 -223 76 188 -14
5198 -14 -230 -73 139 146 -47 -149 20 240 99 -104 -131 124 189 50 -135 -52 187 174 -49 -161 73 109 92
5221 92 -107 -117 89 157 -18 -172 -31 132 -12 -133 -160 32 67 -41 -155 -100 29 42 -29 -115 -32 113 61 -36
$$ packed form
5068A56l02o3L05J57k08k25L8L49J7k71j84J77L28r5l70o4L76J38k18l24J55L59
5090B31k1l10k07L59K55j83l41k1L98J04l21k08J31M37j28l79n9L33K76k35l66
5111b55J04L94J4l23j97K46K87j09l41J6L01K17l09k71J49L04L2l68k30L27L16
5132C04j77l85N4L59J03k96k65J85L34jm03j44L82J83k14l28J28L63L8k90l07
5153c77L77K41r5l32k8L41K11k86l16J41L81j7l18r2K19K30j56l35K1L45J29k82
5175Bl10J96L79m4l77j02K89K24k48k48J06L08Qk70j71J89K74p5l57MK99J12k02
5198a4k16J57K12Pj93j02J69K20j41k03k7K55O5j39j85Q3K39j3k23j12K34L6j7
5221I2j99j0K06O8j75j54J41J63j44j21k7J92L5j08j14N5J29J3p1q6Q3J45n2r7
$$ plain form
5245 -36 -19 54 71 28 -56 -20 60 105 29 2 56 128 66 -64 17 93 73 18 -7 23 40 52 -37 -17 -11 29 13 -72 -77 -9 -50
5276 -50 -52 -64 -56 -56 -14 6 -55 -61 -104 -33 -15 -22 -53 -4 13 113 29 26 29 127 116 -14 -15 54 103 57 -62 21 149 126 81 -63
5308 -63 19 88 99 -81 -53 58 107 -37 -208 -66 86 15 -131 -194 -8 57 -64 -164 -185 54 92 -26 -259 -58
5332 -58 187 104 -133 -125 92 229 24 -155 -61 199 237 -82 -199 84 299 132 -125 -79 213 284 2 -167 -3
5355 -3 230 193 -165 -275 32 225 3 -245 -184 105 200 -124 -319 -118 156 111 -207 -245 59 234 -29 -306
5377 -306 -135 212 230 -225 -298 69 278 107 -233 -71 204 365 52 -238 -31 325 228 -171 -226 94 276
5398 276 87 -233 -195 212 225 -137 -276 -30 283 136 -288 -233 105 200 -59 -353 -130 247 171 -167 -292 32
5420 32 316 39 -204 -192 200 260 -24 -281 0 367 192 -112 -184 92 341 86 -256 -93 299 259 -39 -219
$$ packed form
5245c6J7P3J7m3q4L6Q0M5p6k7N4P2o2j30Q1P6k0n5k5L0J7J2q9K0OM0j6q5nO8m1
5276e0kj2Q%M2K0o1om3P1J8pl1M9J7J00q4lLR8j1j30jO9M9m6j19Q3J28k3m5j44
5308f3Q2O9J1j80K8J11M9j44j71J42J52p1j46o3J86O5j21j00k1K39L8j18k33K01
5332e8K45q3k37QK17J37k05j79R4K60L8l19j17K83K15j67k57M6K92P1k82j69J64
5355cK33l7l58j10L07J93k22k48O1K89R5l24j95K01K74m5l18l8L04J75k63k77
5377c06J71L47J8m55p3L67K09j71l40J62K75J61l13k90K07L56r7l99n5L20J82
5398B76j89l20L8M07J3l62j39K46L13j47m24N5L38R5k59k94K23L77p6l38j25L24
5420C2K84k77k43J2L92O0k84k57K81L67j75l04p2K76K49k55l42J63L92m0k98j80
$$ plain form
5442 -219 47 291 144 -217 -213 128 225 -24 -325 -135 199 164 -202 -293 30 234 26 -251 -231 139 220 -35
5464 -35 -283 -40 214 111 -142 -186 109 258 93 -239 -91 221 228 -47 -183 54 254 88 -187 -56 143
5485 143 207 -49 -109 -98 159 135 -135 -169 70 188 -4 -188 -109 66 117 -80 -244 -81 82 83 -158 -149 117 173
5509 173 -21 -146 -73 68 118 -40 -140 43 184 82 -56 -37 91 100 81 -129 -7 101 156 11 -25 68 112
5532 112 54 1 -43 95 102 19 -105 -33 44 44 -35 -124 -5 62 46 -76 -45 -41 46 -45 -59 -5 0 21 -44 -5 44 1 16 -31
5562 -31 72 1 5 3 23 35 55 85 50 35 6 23 -20 58 38 -19 8 60 30 -51 26 -7 37 -10 -14 -39 55 56 34 -93 -44
5593 -44 46 10 -68 -13 -52 42 -7 -74 -68 15 106 -53 -43 1 119 47 2 -62 41 136 47 -130 13 90 148 4 -89 11
5621 11 137 102 -66 -85 13 118 -2 -154 -89 166 45 -124 -148 15 175 64 -142 -94 70 149 -71 -230 -21
$$ packed form
5442b19K66K44j47l61ML41R7k49l01J90L34l5l66r1L23K04k08k77K0L70Q1k55
5464c5k48K43K54j03k53m4K95J49j65l32J48L12Pk75j36K37K00j66k75J31J99
5485A43O4k56o0J1K57k4k70l4K39J18j92j84P9J75N1j97j64J63J63Jk41RK66N6
5509A73j94j25P3J41N0j58j00J83J41j02j38J9J28Rj9k10J22J08N5j45l6R3M4
5532A12n8n3m4J38Pq3j24P2P7%p9q9J19O7j6j22L1MQ7r1j4N4NK1o5L9M9m3J5m7
5562c1J03p1MkK0J2K0L0l5j5k9J7m3P8k0n7K7N2l0q1P7l3M4m7mk5R4Jk2j27M9
5593d4R0l6p8N5l9R4m9o7OQ3R1j59J0M4J18p2m5o4J03R5q9j77J43P7N8j44r3J00
5621A1J26l5j68j9R8J05j20j52O5K55j21j69k4J63J60j11k06M8J64P9k20j59K09
$$ plain form
5644 -21 145 62 -142 -106 87 224 -32 -131 -70 160 152 -45 -236 -28 236 75 -128 -96 159 163 -44 -189 -52
5667 -52 207 164 -132 -138 135 280 55 -234 -102 181 194 -122 -218 -37 241 152 -165 -156 70 238 -19 -240 -81
5690 -81 189 210 -165 -197 36 215 20 -210 -83 146 254 -7 -245 -34 247 113 -128 -141 104 235 27
5711 27 -189 -133 208 165 -92 -242 -8 257 106 -165 -190 180 224 -40 -249 -42 199 128 -111 -186 16 243
5733 243 73 -197 -77 118 206 -70 -247 -36 247 87 -166 -123 91 217 59 -245 -88 162 193 -88 -164
5754 -164 27 214 98 -189 -200 103 183 17 -199 -99 235 186 -124 -174 34 204 74 -202 -78 209 164 -81
5776 -81 -111 11 194 85 -118 -97 24 184 18 -198 -96 169 137 -122 -175 11 155 50 -113 -135 69 160
5798 160 -51 -191 -39 141 87 -107 -113 94 163 -5 -117 10 111 166 -16 -113 17 178 81 -119 -35 125 145
$$ packed form
5644b1J66q3k04L6J93J37k56r9O1K30qj97j91K08K64j61k03L2K55Mk07j45J37
5667e2K59m3k96oK73J45k25k89J32K83J3l16r6J81K78q9l17RK26J68k57k21J59
5690h1K70K1l75l2K33J79j95k30J27K29J08k61k38K11K81j34k41j3K45J31k08
5711B7k16N6L41m3k57j50K34K65j51k71k5L70M4k64k09K07K41p1k39p5K02K27
5733B43j70k70J20J95Q8k76j77K11K83j60k53M3K14J26j58l04J57K50L1k81p6
5754a64J91J87j16k87j1L03Q0j66k16J00L34m9l10n0K08J70j30k76J24K87m5k45
5776h1l0J22J83j09k03K1J21J60j66k16J02K65l2k59n3J86J44j05j63k2K04R1
5798A60k11j40J52J80n4j94oK07O9j68j12J27J01N5j82r7J30J61r7k00Q4J60K0
$$ plain form
5821 145 -9 -100 19 95 47 -44 -33 28 79 85 -82 5 26 20 -50 -122 -50 39 76 -84 29 28 24 29 -69 -44 14 88 -21
5850 -21 -50 -14 110 41 4 -17 39 106 51 -17 51 52 68 -5 51 -18 -19 43 23 -52 9 3 9 28 -26 -21 -3 -29 -46 -102 -30 -31 0
5883 0 -29 -52 -23 14 -3 -39 -59 -3 52 52 -16 -50 54 83 16 -54 -8 56 68 31 -12 77 108 53 -27 0 79 178 63 -25
5913 -25 -8 83 103 -30 -67 -3 110 40 -169 -90 53 21 -94 -164 -84 33 18 -110 -156 -3 135 5 -122 -43 151
5938 151 187 -13 -115 26 233 140 -74 -121 90 220 55 -103 29 228 160 -42 -116 58 241 56 -149 -127
5960 -127 132 157 -6 -211 -41 131 126 -129 -199 37 220 -32 -199 -112 83 181 -77 -231 28 209 75 -183
5982 -183 -180 165 258 -9 -127 -43 303 154 -104 -120 116 260 94 -151 -41 224 218 -76 -171 15 271 147 -107
6005 -107 -172 32 246 -41 -264 -127 128 115 -149 -262 49 241 37 -253 -145 166 135 -102 -225 -5 179
$$ packed form
5821A45j54r1J19P6m8r1J1O1N1Oj67Q7K1op0p2P2Q9L7j60J13jmNr8K5N8P4j09
5850b1k9L6J24o9l7k1N6O7n5o8O8JJ6p3N6o9jO2k0p5O1oOJ9n4NJ8k6j7n6P2jL1
5883@k9k3K9L7j7l6k0N6N5%o8l4J04K9o7p0M6O4J2l7m3Q9L1n5q0K7P9R9j15q8
5913b5J7R1K0j33l7O4J13p0k09P9J43l2j15p0Q0J17j5j28m6J53J38j30j27P9J94
5938A51L6k00j02J41K07r3k14m7K11J30j65j58J32J99o8k02p4J74J83j85k05K2
5960a27K59K5j63k05J70J72nk55p0K36J83k52j67Q7J95R8k58j54K59J81j34k58
5982a83LL45R3k67j18Q4L46j49k58j6K36J44j66k45J10K65ok94r5J86K56j24k54
6005a07o5K04K14k87k23J37K55j3k64j13L11J92k04k90J08L11l1k37j23K20J84
$$ plain form
6026 179 90 -184 -132 116 249 30 -167 -65 188 227 -59 -141 36 248 95 -116 -48 109 182 19 -182 20
6048 20 150 189 -125 -187 51 209 -13 -204 -137 97 140 -62 -211 -25 110 55 -170 -144 56 163 26 -183
6070 -183 -79 130 78 -60 -124 12 242 102 -128 -56 129 171 -8 -81 18 148 86 -69 -105 56 169 21 -98
6093 -98 -46 101 118 -50 -115 -24 109 90 -165 -132 76 134 23 -133 -65 115 102 -101 -115 -17 100 10 -58 -75 61
6118 61 147 28 -39 41 114 94 25 -43 60 83 91 -16 5 107 51 -8 -48 6 85 30 4 27 16 32 -4 -46 -37 -35 20 -34
6148 -34 -42 -4 2 13 -36 -78 11 10 -2 23 8 -53 31 48 5 11 -14 13 66 6 1 28 60 82 57 28 45 42 60 -7 16 44 38 54
6182 54 -18 17 37 40 -3 -75 -6 57 15 -52 -45 -30 56 0 -78 -42 58 9 -12 -74 25 91 11 -89 -52 -1 81 4 -60 10
6212 10 112 121 -13 -22 47 144 82 -107 -52 99 152 -22 -112 22 121 83 -75 -110 85 196 55 -94 -25 43 145
$$ packed form
6026A79q9k74N2K48J33k19j97J02K53L9k86q2J77K12j53k11O8J57P3j63k01K02
6048B0J30L9l14o2K38J58k22j91O7K34M3k02j49J86J35n5k25K6K00J07j37k09
6070a83J04K09n2j38o4J36K30j40k30P2J85M2j79p3R9J30o2j55l6J61J13j48j19
6093i8N2J47J7j68o5R1J33j9k55L3K08N8j11j56O8J80j3k03j4R8J17r0o8j7J36
6118F1Q6j19o7Q0P3k0o9o8J03K3Qj07K1J02n6n9m0N4P9n5k6K3j1J6l6m2RKN5n4
6148c4qL8OJ1m9m2Q9jj2K5j5o1Q4J7m3Ok5K7N3o0nK7L2K2k5k9J7lJ8o7K3K8oJ6
6182E4p2L5K0Lm3p2O9O3m2o7PJ5Q6n6p8L6J00m9k1o2R9O6q0j00L7N1Q2p7o4P0
6212A0J02Rj34rO9R7o2j89N5J51N3j74r0J34R9l8j58l5J95J11j41j49O9O8J02
$$ plain form
6237 145 -46 -143 -24 144 65 -88 -137 63 157 -16 -182 -84 158 100 -62 -152 15 181 69 -130 -121 99 151
6260 151 49 -178 -23 171 211 -153 -157 104 181 74 -189 -119 113 198 -85 -203 -19 244 97 -148 -111 114
6282 114 240 -56 -187 -61 199 152 -124 -185 50 231 14 -196 -168 145 188 -5 -231 1 254 68 -109
6303 -109 -114 50 218 87 -179 -87 181 219 -73 -226 46 239 44 -169 -125 99 254 -41 -201 -27 249 203
6325 203 -80 -210 6 153 9 -190 -125 149 146 -85 -205 3 188 98 -165 -191 117 271 8 -207 -86 197
6347 197 144 -83 -161 54 214 22 -158 -155 134 186 -50 -164 -9 181 100 -152 -163 89 217 -29 -214 -96
6369 -96 130 139 -102 -139 73 186 73 -133 -118 91 166 10 -117 -62 114 126 -62 -113 24 154 49 -101 -62
6392 -62 138 134 -40 -128 -14 115 66 -104 -45 34 112 33 -103 -73 137 154 -27 -134 -8 125 44 -44 -81 60 121
$$ packed form
6237A45j91r7J19J68p9j53m9K00R4j73j66R8K42n8j62r0J67J66j12j99RK20N2
6260A51j02k27J55J94M0l64mK61P7j07k63P0K32Q5k83j18J84K63j47k45L7K25
6282A14J26k96j31J26K60m7k76o1K35J81k17k10K8L13M3j93k26K32K53j86j77
6303a09nJ64J68j31k66R2K68L8k92j53K72J93j95k13M4K24J55k95j60J74K76m6
6325B03k83j30K16J47j44j99O5K74lk31j20K08J85r0k63k6L08J54k63k15J21K83
6347A97n3k27p8K15J60j92j80LK89N2k36j14J55J90q1k52j1K52J28k46j85J18
6369i6K26Rk41l7K12J13j13k06J5K09P5j56j27N5J76J2j88n1J37J30j05j50L9
6392f2K00mj74q8J14J29m9j70N9P9P8p9j36L0K10J7j81j07J26J33q1q8l7J41O1
$$ plain form
6417 121 13 -61 -66 88 52 -16 -109 37 125 37 -35 -22 66 97 2 -65 -26 -15 -2 -59 -45 22 57 -36 -54 -16 39 35 -30
6446 -30 -43 4 -3 10 -12 -23 18 -8 6 -7 24 -19 26 56 27 41 6 19 83 32 17 11 21 68 52 31 -8 92 76 -11 -44
6477 -44 -28 12 -37 -46 -34 36 16 -65 -22 0 52 29 -13 -53 -22 48 38 -19 9 51 89 31 -95 -4 143 82 -60 -62 102
6506 102 130 30 -66 69 130 98 -59 -81 89 110 69 -67 -43 122 73 -60 -131 -66 124 46 -72 -139 42 167
6530 167 -75 -135 -162 127 103 -23 -164 -24 140 79 -109 -177 83 179 8 -107 -13 162 127 -70 -78 61 214
6553 214 112 -126 -30 158 216 6 -123 -60 167 171 -144 -238 49 185 59 -209 -153 95 97 -82 -303 6 167
6576 167 101 -188 -217 51 231 47 -249 -100 209 189 -135 -145 67 263 125 -124 -89 221 258 47 -169 32
6598 32 281 235 -137 -149 80 221 38 -187 -89 172 198 -60 -260 -10 224 86 -212 -169 100 187 9 -263
$$ packed form
6417A21j08p4nJ54l6o8r3J46Q8q8p2J3Q8L1r5o7L9J1J3n7J4O7L5r3j8L8N5mo5
6446c0j3M7pJ3k2j1M1k6J4j3L1m3M5L0k9J4l5J3O4n1j5oJ0M7j6k1l9J00j6q7l3
6477d4J6M0m9rJ2P0k0q1M3K2N2k3m2m0L1P0j0n7K8M2L8n8j26R1J47o1j42kJ64
6506A02K8j00r6J35O1l2j57k2J70K1m1j36K4J65m9j33p1O5J90p8j18o7J81J25
6530A67k42o0k7K89k4j26j41J40J64o1j88o8K60R6j71j15R4J75l5j97qJ39J53
6553B14j02k38R6J88N8k10j29O3K27Ml15r4K87J36j26k68N6K48Kj79k21L09J61
6576A67o6k89k9K68J80j84k96J49L09k0l24j0K12J96j38k49L5L10L7k11k16K01
6598C2K49m6l72j2K29J41j83k25R8K61K6k58k00K50K34j38k98M3K69Q7j78k72
$$ plain form
6620 -263 -79 145 119 -203 -261 63 249 38 -219 -122 171 178 -67 -179 -5 255 177 -103 -78 124 319 57
6642 57 -154 -60 228 224 -94 -164 98 274 66 -142 -119 121 176 -26 -224 -25 148 107 -132 -204 7 192 20
6665 20 -210 -129 97 133 -50 -181 29 223 131 -96 -137 75 216 80 -174 -37 163 144 -50 -63 92 193
6687 193 133 -83 -100 110 140 60 -112 -9 142 120 -53 -120 36 103 -33 -127 -90 21 126 -37 -164 -7 115
6710 115 44 -131 -140 20 64 70 -117 -31 109 87 -72 -131 55 158 14 -39 -13 68 76 53 40 -9 114 111 35 19 103
6737 103 79 23 -17 16 76 47 2 -14 -3 40 -36 -25 -60 -36 16 -7 -70 -46 -36 -37 24 -41 12 -31 -32 -17 48 0 -111 -15
6767 -15 44 6 28 22 42 95 26 26 81 113 77 50 -2 44 98 65 -24 7 100 65 -12 -57 31 95 3 -91 -79 58 87 -69
6797 -69 -102 -20 53 25 -70 -168 43 113 -4 -110 -36 90 114 -20 -136 7 126 90 -51 -48 92 181 45 -92 5
$$ packed form
6620b63J84K24k6l22n8L24J86k11k57R7K93Pk45j12J74K60p8k80K5K02J95k62
6642E7k11R4K88ml18p0K62J76k08k08K3K40N5k02j98J99J73m1k39p2K11J85j72
6665B0k30Q1K26L6j83j31K10J94r2k27m1K12J41j36k54J37K00j9j94j3J55J01
6687A93o0k16j7K10L0q0j72J03J51k2j73o7J56O7j36r4L7J11J05j63j27J57J22
6710A15p1j75rJ60M4Oj87Q6J40k2j59n9J86J03j44n3K6Q1Qk3j3m9J23lp6j6Q4
6737A03k4n6m0L3O0k9m5j6J1M3p6J1l5K4N2k3o3K4J0jO1o5N3m3jJ5O5m8j11R6
6767a5N9l8K2oK0N3o9%N5L2l6k7n2M6N4l3q9L1R3l5p7m5Q8O4r2r4J2J37K9j56
6797f9l3Q2P3k8r5r8K11P0j17j06P4J26K4j34j16J43J19l6j41LJ40Q9j36j37R7
$$ plain form
6822 5 167 88 -27 -67 78 213 120 -87 -94 126 134 -71 -174 -23 153 105 -119 -196 31 169 -15 -203 -137 86
6846 86 105 -87 -242 -67 192 60 -97 -180 90 206 21 -169 -108 221 178 -49 -122 98 264 99 -168 -86
6868 -86 164 209 -19 -114 -23 282 163 -113 -132 100 255 16 -194 -144 222 249 -96 -249 -38 226 66 -172
6890 -172 -162 38 197 12 -278 -93 225 175 -133 -209 11 293 109 -208 -135 196 251 -3 -184 -35 210 212
6912 212 -80 -87 122 275 31 -210 -110 252 235 -75 -221 -20 284 124 -184 -238 89 216 3 -215 -143 169
6934 169 184 -139 -212 -28 224 121 -171 -164 151 210 -4 -126 -27 206 152 -132 -157 142 277 85 -144 -68 186
6957 186 214 -100 -197 27 219 132 -158 -176 77 180 10 -232 -66 144 139 -112 -170 -8 194 34 -209 -68
6979 -68 103 148 -19 -148 -38 178 121 -107 -102 68 158 4 -119 -59 87 152 -36 -113 20 142 105 -124 -117 39
$$ packed form
6822EJ62p9j15m0J45J35r3k07pK20Qk05j03J51J76m8k24p7K27J38j84j88O6K23
6846H6J9j92j55J75K59j32j57q3K70J16j85j90O1L29m3k27p3K20J66j65k67Q2
6868h6K50M5k28r5R1L05j19k76j9K32J55k39k10N0L66K7l45j53K11K64j60k38
6890a72J0K00J59j85k90J85L18n0l08p6K20K82j84l17P3L31N5k54j81J49K45K
6912B12k92pK09J53k44k41J00L62j7l10j46K01L04j60l08n4L27J27k13k18P2L12
6934A69J5l23p3J84K52j03k92PL15N9k14j22R9K33n4k84k5K99J35j92k29P6K54
6957A86K8l14r7K24J92q7k90j8K53J03j70k42J66K10nk51n8J62K02j60k43J41
6979f8J71M5j67j29J10K16n7k28NJ70R0j54j23O0J46O5j88p7J33J22l7k29PJ56
$$ plain form
7003 39 135 -2 -105 -6 131 139 -50 -90 41 98 52 -86 -61 35 146 -35 -66 5 109 83 -30 -42 68 76 2 -13
7029 -13 -46 70 79 -4 -48 19 51 1 -34 -39 -3 58 -3 -51 -1 9 -7 -4 -21 -3 70 -37 -9 45 -8 3 11 -42 -23 7 -20
7060 -20 -45 51 -11 13 26 44 56 49 -29 51 93 49 -9 26 130 68 16 -33 55 90 16 -44 -51 58 36 -32 -86 -22 96 63
7090 63 -127 -70 47 79 -22 -77 -66 46 116 -41 -138 46 130 54 -42 -108 81 130 54 -111 -11 138 146 -20 -79
7115 -79 70 191 82 -101 -100 150 154 -9 -122 -28 193 71 -140 -140 -1 154 4 -168 -131 110 135 -119 -200 -41
7139 -41 169 39 -171 -157 106 189 35 -171 -26 182 211 -73 -158 81 238 93 -185 -104 168 257 -25 -182
7161 -182 17 203 142 -121 -141 105 246 46 -272 -145 210 190 -108 -225 -7 150 85 -222 -268 94 213 -80
7183 -80 -204 -121 177 227 -151 -222 -5 283 86 -147 -126 173 292 -1 -228 -69 268 176 -109 -202 87 317
$$ packed form
7003C9R6j37j03R9J37Qj89m0J31N7m6j38K5R6J11j81l1P1J04k6j13j2J10Qp4j5
7029a3l3J16Rq3m4O7L2n0l5nL6O1o1m8N0J0j6Lj7J8P3j07K8N4n3J1Qn3J9L0k7
7060b0k5R6o2K4J3J8J2pp8Q0M2m4n8L5J04o2n2m9Q8L5p4o0pJ09k2o8n4O4J18l3
7090F3j90N7J17L2j01n5J1J12P0j57r7J84Q4p6r6o6J89M9p6j65J00J49Qj66n9
7115g9J49J21j09j83JK50Mj63j13R4K21j22k11%J39J55j50j72L7K41K5k54q1J59
7139d1K10j30k10J4K63Q3j54k06J45K08K9k84q5K39J57j45k78Q1K72Q9k82j57
7161a82J99J86o1k63k0K46J41k00l18J27L55k0k98j17K18J57o5l07m6L62J19k93
7183h0j24Q3K98N0l78p1K17K88j97k33K1K99J19k93k27J59L37r2k85r3K89K30
$$ plain form
7205 317 71 -178 -89 212 271 -61 -235 12 291 109 -161 -211 157 257 -44 -268 -104 298 166 -158 -233
7226 -233 3 201 47 -210 -182 171 225 -58 -262 -69 276 198 -225 -172 45 271 71 -179 -31 211 248 -22
7248 -22 -175 52 357 173 -147 -82 94 273 -46 -220 2 203 136 -106 -194 70 217 37 -234 -172 167 153
7270 153 -65 -251 -36 178 50 -125 -231 34 198 19 -194 -101 170 161 -78 -136 89 165 126 -77 -59 163
7292 163 202 22 -148 -42 118 148 -65 -123 118 173 66 -101 -20 87 97 -14 -125 -5 55 84 -133 -92 12
7315 12 64 -18 -108 -98 73 31 -43 -80 -10 49 1 -108 -87 47 164 69 -16 37 80 130 38 -19 46 95 83 -1 29 95
7343 95 75 28 -22 8 47 47 41 59 23 11 -44 -38 -8 14 -21 -22 -12 13 -79 -60 23 20 -15 -71 -20 -8 35 18 16 41 80 52 -39
7376 -39 47 95 126 11 -11 130 119 107 35 8 160 118 1 -30 -2 123 86 -39 -62 84 124 -6 -134 -35 110
$$ packed form
7205C17k46k49Q9L01N9l32j74K47K79j82k70n0L68J00l01k24J64M02j32l24p5
7226b33K36J98j54k57K8L53N4k83k04J93L45p8m23N3K17K26k00k50J48K42L7k70
7248b2j53K27L05j84l20O5J76J79l19j74K22K01o7k42q8K64J47j80k71O2L39j4
7270A53k18j86K15K14j28j75j06K65J64j79k13R3K71rk39n8K25P6l9k03J8K22
7292A63L9j80j70J06J60L0k13n8K41N5j07j67Q1J07J0j11j11J20O0K9k17M1J04
7315A2N2q2r0J0J71m2p4l7P0N9m8j09K1J34J17r5q5N3M3N0r2n7O5M9j2q4L0O6
7343I5k0m7n0L0L9%oJ8l6j2n5OL0K2l5jJ0K5r2J9Q3ll5n6N1J2M3j7kK5L9k8r1
7376c9Q6M8L1j15k2J41j1j2p2k7J52m2j17l1K8J25l7j25k3J46M0j30j28R9J45
$$ plain form
7401 110 48 -100 -131 13 69 3 -166 -127 67 88 -82 -165 -26 151 80 -86 -116 71 178 21 -116 -80 182
7424 182 189 -35 -115 76 248 96 -111 -86 190 239 27 -144 -4 291 198 -110 -198 101 188 -16 -200 -97 137
7447 137 132 -79 -266 -12 122 47 -200 -239 50 167 -76 -192 -58 164 170 -72 -187 56 267 95 -129 -98
7469 -98 192 315 29 -152 -33 250 183 -41 -168 38 291 98 -168 -123 152 231 -30 -243 -79 178 123 -211
7491 -211 -182 51 158 -9 -319 -117 161 164 -76 -274 3 214 70 -180 -163 122 286 23 -187 -59 248
7512 248 228 -57 -181 77 287 112 -167 -84 171 255 -50 -194 -19 250 134 -153 -184 92 224 4 -261
7533 -261 -135 168 146 -122 -243 -2 231 75 -179 -193 62 242 -24 -229 -65 235 135 -160 -201 92 207
7554 207 53 -151 -57 195 186 -40 -85 33 218 95 -104 -139 144 232 52 -188 -60 156 146 -59 -173 -7
$$ packed form
7401A10o2j48l1J44N6o6j69L9J94K1j70q3J39J77p1j66l0J87J07j57j37L6K62
7424A82Pk24q0J91J72j52k07K5K76M9k12j71J40K95r3l08q8K99Q7k04j84J03K34
7447A37nk11j87K54J34p5k47l9K89J17k43j16J34K22Ok42j15K43K11j72k24L1
7469i8K90J23k86j81J19K83o7k24j27K06K53j93k66M5K75P9k61k13J64K57n5l34
7491b11K9K33J07j67l10K02K78Lk40j98K77K11j44k50J7K85J64k63k10J28L07
7512B48k0k85j24K58K10j75k79Q3K55Q4l05j44J75K69j16k87l1K76J32k20k65
7533b61J26L03k2k68j21K41K33j56k54j4K55J80k66k05J64L00j00k95m1K93J15
7554B07j54k04R4K52rk26m5J18J85j23j99l5K83Q8j80k40J28K16j0k05j14J66
$$ plain form
7576 -7 134 80 -213 -68 87 173 -12 -209 -61 163 79 -97 -177 57 179 30 -117 -78 110 91 -23 -113 87
7599 87 164 68 -35 -92 89 162 44 -86 -50 110 50 24 -28 0 89 63 -47 -30 73 99 -11 -78 6 9 39 -32 -83
7626 -83 6 54 30 -46 -72 82 29 -36 -31 24 47 5 -34 38 34 15 41 -106 23 20 59 43 7 0 19 -40 -2 22 -35 -43 41
7657 41 33 17 -32 10 25 15 6 2 10 32 6 7 -19 42 101 45 -34 1 63 84 16 -65 -48 92 75 -44 -72 43 109 51 -82
7688 -82 -15 117 111 -36 -84 -14 111 50 -110 -82 127 153 -11 -155 -35 130 95 -120 -76 42 129 50 -129 -41 87
7713 87 185 -27 -139 13 164 83 -73 -134 102 213 28 -135 -41 134 172 -49 -147 73 174 34 -155 -100 126
7736 126 214 -59 -171 -47 104 84 -117 -160 63 178 32 -170 -123 128 126 -67 -179 -17 220 72 -198 -155
7758 -155 177 244 6 -167 -44 215 184 -148 -162 94 184 67 -180 -48 114 188 -56 -157 -51 265 77 -147
$$ packed form
7576gJ41n4k93J45J55Q6j85j97J48K24q4j76q0K34J22j49j47L9J88j9j14r0K00
7599H7P7r6j03n7J81P3j18j30L6J60o0k6n2K8Q9k6j10J7J03K6j10o7Q4LL0p1n1
7626h3Q9M8k4p6k6J54n3o5NN5K3m2l9P2mj9K6j47J29lL9j6l6pJ9n9L8K4n7qQ4
7657D1qj6m9M2J5j0rmQK2k6Jk6O1N9n6p9L5O2K1o8q1J7J40j7j19k8J15O6n8j33
7688h2O7J32oj47m8P0J25o1j60K8K09K6j64j44J20J65l5k15M4J18Q7p9j79Q8J28
7713H7R8k12j12J52J51q1j56o1K36J11j85j63R4J75L8k21r8K20J01j40j89N5K26
7736A26Q8k73j12J24J51k0k01m3K23J15j46k02M7K51kj93j12J62K37j48k70M3
7758a55L32O7k38j73J23K59l1l32j4K56R0j17k47J32J62P4k44j01J06L16j88k24
$$ plain form
7780 -147 -168 96 250 32 -167 -56 117 136 -137 -162 34 185 102 -147 -156 95 215 28 -198 -37 164 178
7802 178 -137 -191 47 236 108 -177 -114 135 207 13 -208 12 232 125 -117 -159 70 219 81 -164 -130 93
7824 93 161 -80 -188 -6 190 87 -175 -148 114 204 -19 -196 -100 177 121 -123 -207 0 212 24 -183 -89 107
7847 107 185 -29 -139 -20 169 135 -133 -145 61 200 49 -131 -81 188 183 -82 -126 59 204 32 -125 -120 77
7870 77 129 -2 -153 -12 130 109 -99 -152 32 132 11 -130 -62 61 77 -46 -154 10 173 72 -89 -89 61
7893 61 128 9 -64 20 127 169 21 -72 30 190 41 -38 -45 98 61 2 -53 16 99 66 12 -61 10 107 18 -5 18
7920 18 19 65 -31 -42 16 28 -7 -34 -76 38 14 -9 -40 -20 -1 68 -19 40 43 75 87 36 10 77 31 95 34 77 52 72 77
7951 77 14 32 90 31 16 32 -38 -25 -6 0 -17 -26 -64 2 -21 -20 -48 33 0 31 -31 -4 -23 6 -47 -49 -5 77 71 -35 -58 19
$$ packed form
7780a47k1K64J54k18j99J11J73J9k73k5J96J51q3k49rK51J20j87k26J61K01J4
7802A78l15n4K38J89j28k85O3K49P2j94k21K20K20j07k42m2K29J49j38k45L4K23
7824I3O8k41j08J82J96j03k62K7K62R0k23j77R6K77n6k44q4K07K12j88k07R4J96
7847A07P8k14j10J19J89l4k68j2K06J39j51j80N0K69nk65m4J85J45j72j57NJ97
7870G7N2j31j51J41J42k1k08n3J84J00j21j41O8J23J6j23j08J64J63j01j61%J50
7893F1O7j19p3Q4J07M2j48r3J02J60j49p9pJ43l7n9n5O9Q3l3n4p3P1R7q9k3K3
7920A8JM6r6j1N8J2l5k7m2J14k4k3l1K0J9O9q7N9LL2J2n1k6O7m6O4o1M3k5K0N
7951G7o3J8N8n9j5J6p0J3J9Oj7rl8O6k3Jk8Q1l3L1o2K7j9K9n3kM4Q2oj06k3P7
$$ plain form
7983 19 72 91 15 -47 81 104 83 -15 38 180 130 -4 -63 22 108 56 -25 -29 101 107 -55 -80 -42 110 60 -64 -127 27
8011 27 81 -30 -155 -68 39 104 -58 -135 -12 129 43 -84 -91 81 151 5 -75 4 139 178 -58 -70 160 192 114
8036 114 -99 -57 155 177 -27 -148 60 185 49 -108 -119 73 110 -31 -189 -25 174 65 -91 -141 12 160
8058 160 10 -134 -109 75 102 -72 -190 -39 163 115 -118 -118 127 223 5 -111 -28 189 169 -31 -94 60 214
8081 214 116 -84 -76 135 201 -23 -109 32 216 131 -97 -140 35 161 13 -146 -93 159 107 -94 -184 -60 192
8104 192 23 -131 -165 38 195 19 -107 -56 151 118 -56 -163 0 164 48 -90 -101 117 165 -11 -105 -41
8126 -41 124 150 -62 -94 74 155 51 -117 -96 112 133 -35 -190 -6 147 105 -82 -89 105 109 -12 -104 -45 110
8150 110 109 -27 -90 -36 135 62 -97 -93 94 101 7 -85 -1 94 87 -54 -73 72 144 27 -112 -37 127 127 40 -119 23
$$ packed form
7983A9N3J9p6o2J28K3k1r8N3J42n0j34n9Q5Q6n2q1mJ30Oj62k5L8J52n0j24o3J54
8011B7N4j11j25Q7J07O5j62p7J23J41q6j27pJ72P0j46q0P9J35L9k36j2K30L2p8
8036A14k13M2K12K2k04j21K08J25j36j57j1J92L7j41j58J64J99j09j56n0J53J48
8058A60j50j44K5J84K7j74j18J51K02m8k33%K45R6k18j16Q3K17k0k00o3J54J54
8081B14r8k00QK11O6k24q6J41J84q5k28m3J75J26j48j59N3K52n2k01r0J24K52
8104A92j69j54l4K03J57j76j26N1K07l3j74j07J63J64j16j38j1K18M8j76r4O4
8126d1J65K6k12l2J68Q1j04j68K1K08K1j68j55J84J53m2j87pJ94Mj21r2N9J55
8150A10jj36o3N4J71p3j59MJ87Pr4r2Q4R5pj41j9J45P2j17j39P5J64%q7j59J42
$$ plain form
8177 23 174 57 -47 -34 44 147 -1 -105 -36 115 108 -58 -91 16
$$ packed form
8177B3J51j17j04J3P8J03j48j04O9J51pj66l3J07
8191A6
$$ Imaginary data points
##PAGE= N=2
##DATA TABLE= (X++(I..I)), XYDATA
$$ plain form
0 0 0 0 0 0 0 0 0 0 0 0 0 -8 8 -8 8 -8 16 -16 24 -24 32 -38 41 -49 57 -72 81 -90 105 -122 138 -161 183 -206
34 -206 234 -264 293 -329 370 -412 458 -507 563 -627 692 -766 846 -929 1025 -1130 1243 -1369
52 -1369 1513 -1669 1843 -2038 2263 -2519 2818 -3166 3585 -4100 4746 -5580 6716 -8352 10918
67 10918 -15556 26554 -108442 20118 233272 -77265 -176728 9630 91383 -11649 107
78 107 -16662 -81160 21046 173517 -7727 -200927 17736 251665 16927 -202654 10410
89 10410 189889 18764 -75642 17926 18698 3933 93545 26957 -137932 -25687 189822 45269
101 45269 -199054 -55297 178655 42074 -151653 -44738 72240 -5075 -27742 8877 -72762
112 -72762 -68597 102714 58854 -167044 -94783 149487 71678 -151603 -76735 104831 43715
$$ packed form
0@%%%%%%%%%%%qJ6j6J6j6K4l2M0m8N6p0P9r0J06j29J53j71J95k27K60k99L44l89
34b06M40m98N57o22O99p82Q70r65J070j190J319j458J612j775J954k155K373k612
52a369K882l182L512l881M301m782N337n984O751p685Q846j0326J2296j5068J9270
67A0918k6474M2110j34996J28560K13154l10537r9463J86358Q1753j03032J1756
78A07j6769o4498J02206J52471j81244j93200K18663K33929k34738k19581K13064
89A0410J79479j71125r4406R3568P72j4765Q9612o6588j64889J12245K15509j44553
101D5269k44323J43757K33952j36581j93727J06915J16978p7315k2667L6619q1639
112g2762M165J71311m3860k25898P2261K44270p7809k23281P4868J81566o1116
$$ plain form
123 43715 -65619 -10128 18731 -24458 38520 76654 -62814 -87689 113225 124882 -100971
134 -100971 -91689 122185 94720 -72585 -34899 63119 16528 -10586 40796 -6309 -69925 37232
146 37232 103082 -55853 -121609 59831 108111 -75576 -100910 52987 43368 -60511 -18625
157 -18625 18697 -49198 -20370 63560 -16974 -106724 11320 103030 -31853 -109583 31856
168 31856 86739 -38942 -53581 46105 20229 -35690 33747 43798 -54667 -15363 97631 20580
180 20580 -87146 12279 100763 -5821 -67785 32821 58357 -31875 -18875 48869 -8144
191 -8144 -50336 38979 45182 -67745 -41325 72742 13080 -87243 -6853 61419 -29526 -60101
203 -60101 28448 21134 -56737 -14277 49265 -20724 -61573 31150 46028 -53339 -33516 61823
$$ packed form
123D3715j09334N5491K8859m3189O2978L8134j39468k4875K00914J1657k25853
134a00971R282K13874k7465j67305L7686R8018m6591k7114N1382m7105o3616J07157
146C7232O5850j58935o5756J81440M8280j83687k5334J53897r619j03879M1886
157a8625L7322o7895K8828Q3930q0534q9750J18044R1710j34883p7730J41439
168C1856N4883j25681j4639R9686k5876n5919O9437J0051r8465L9304J12994p7051
180B0580j07726R9425Q8484j06584o1964J00606K5536r0232J3000O7744n7013
191h144m2192Q9315O203j12927K6420J14067n9662j00323Q0390O8272r0945l0575
203f0101Q8549p314p7871M2460O3542o9989m0849R2723J4878r9367J9823R5339
$$ plain form
215 61823 12032 -60738 17703 61038 -31479 -37425 58550 32213 -51954 94 64440 -3427
227 -3427 -41678 33604 39873 -37185 -10045 58126 -4722 -57997 30299 58280 -46693 -50004
239 -50004 52350 28652 -58404 -16136 39804 -15695 -35463 24380 6097 -53993 -1134 55906
251 55906 -25238 -73277 28152 62563 -42854 -55452 40016 31427 -36039 -4276 27685 -20318
263 -20318 -10062 50857 4249 -61004 14728 79879 -11354 -69699 24913 69211 -16973 -39866
275 -39866 25079 19139 -16421 17764 16648 -44583 -10349 67565 4770 -81834 -4444 77459
287 77459 -2754 -71173 -1948 42746 -8415 -22404 5378 -16491 -19178 38805 18008 -68402
299 -68402 -27257 76321 24211 -79127 -23306 65893 17127 -42358 -5704 17014 -2574 16166
$$ packed form
215F1823m9791p2770P8441M3335r2517n946R5975k6337q4167N2048O4346o7867
227c427l8251P5282O269p7058K7140O8171o2848n3275Q8296K7981j04973l311
239e0004J02354k3698q7056M2268N5940n5499j9768N9843j8283o0090N2859N7040
251E5906q1144m8039J01429L4411j05417j2598R5468q589o7466L1763L1961m8003
263b0318J0256O0919m6608o5253P5732O5151r1233n8345R4612M4298q6184k2893
275c9866O4945n940l5560L4185j116o1231L4234P7914o2795q6604P7390Q1903
287G7459q0213o8419O9225M4694n1161j3989K7782k1869k687N7983k0797q6410
299f8402M1145J03578n2110j03338N5821Q9199m8766n9485L6654K2718j9588J8740
$$ plain form
311 16166 20674 -36569 -28489 61207 44872 -65018 -43671 70111 46293 -53713 -31508 37540
323 37540 18415 -10142 3183 -14271 -23577 35413 41176 -51351 -57311 53887 60705 -53796
335 -53796 -62115 38432 45355 -26035 -28493 2512 -2147 12551 26257 -30560 -52637 37429 67513
348 67513 -39821 -74015 34447 69394 -23011 -52589 11519 30178 3280 1598 -11218 -29257
360 -29257 20721 58025 -20578 -72821 21138 80599 -14043 -72219 7740 55152 642 -28669
372 -28669 -6957 -1945 9738 31454 -10111 -57668 5850 73500 -1639 -79881 -4990 71578
384 71578 8137 -54265 -10956 27017 9081 2379 -5298 -31161 -1321 53968 8981 -67907
396 -67907 -16015 71287 20536 -63994 -21157 47042 16970 -23954 -9175 -2175 -1607 26332 12864
$$ packed form
311A6166M508n7243Q080Q9696j6335j09890K1347J13782k3818j00006K2205O9048
323C7540j9125k8557J3325j7454r306N8990N763r2527n960J11198O818j14501
335e3796q319J00547O923p1390k458L1005m659J4698J3706n6817k2077R0066L0084
348F7513j07334l4194J08462L4947r2405k9578O4108J8659k6898j682j2816j8039
360b9257M9978L7304p8603n2243R3959N9461r4642n8176P9959M7412n4510k9311
372b8669K1712N012J1683K1716m1565m7557O3518O7650p5139p8242P4891P6568
384G1578o3441o2402M3309L7973j7936o702p677k5863K9840N5289m4987p6888
396f7907N1892Q7302n0751q4530M2837O8199l0072m0924J4779P000N68K7939j3468
$$ plain form
409 12864 -45800 -23354 56689 29889 -59254 -32568 52141 29303 -38394 -20915 20043 8632
421 8632 908 7137 -19032 -20896 35104 34043 -42459 -39581 45729 41414 -39229 -33671 30543 23034
435 23034 -15807 -5878 2678 -10813 10609 27138 -20866 -39839 25916 44386 -29516 -45003
447 -45003 25254 34375 -22690 -23086 13093 3029 -8352 12120 -1500 -30170 5337 39137 -11276
460 -11276 -45160 13299 43032 -14371 -33866 15583 22072 -12331 -3080 13239 -10051 -7303 28018
473 28018 8020 -34233 -613 42328 49 -37240 7372 32710 -9310 -19585 14273 6566
485 6566 -16805 6839 16588 -20734 -17524 26635 10540 -34690 -8964 30081 -2700 -30311 5716
498 5716 17852 -17252 -12288 18489 -1651 -24140 8892 21758 -18026 -18225 23704 12367 -24359
$$ packed form
409A2864n8664K2446Q0043k6800q9143K6686Q4709k2838o7697J7479M0958j1411
421H632p724O229k6169j864N6000j061p6502K878Q5310m315q0643N558O4214p509
435B3034l8841R929Q556j3491K1422J6529m8004j8973O5755J8470p3902j5487
447d5003P0257R121n7065l96L6179j0064j1381K0472j3620k8670L5507L3800n0413
460a1276l3884N8459K9733n7403j9495M9449O489l4403R251J6319k3290K748L5321
473B8018j9998m2253L3620M2941m2279l7289M4612K5338m2020j0275L3858p707
485F566k3371K3644R749l7322L210M4159j6095m5230K5726L9045l2781k7611L6027
498E716J2136l5104M964L0777k0140k2489L3032J2866l9784j99M1929j1337l6726
$$ plain form
511 -24359 -1114 26778 -4631 -19247 17980 18977 -19161 -6507 27961 4186 -21900 8779
523 8779 22272 -11471 -11086 20349 4234 -22507 6432 23975 -15766 -24261 19392 17126 -25787
536 -25787 -15375 19601 1557 -21134 1605 7739 -17212 -5612 19193 -8234 -29866 10440
548 10440 28324 -18073 -29021 18229 22757 -16533 -12386 14641 3830 -5265 13101 4418 -19131
561 -19131 7358 34850 -4743 -32779 13709 39069 -7555 -27551 11369 21804 -5101 -5043 4253
574 4253 -8965 -1570 22183 -2173 -35880 -1015 37187 -4034 -43142 -3193 29911 -3367
586 -3367 -25661 -4062 3619 -3497 6039 -503 -25979 -6367 33518 6450 -41030 -9255 40681
599 40681 11689 -31497 -7815 23805 10161 -2793 1118 -6162 108 27976 14415 -30368 -12960
$$ packed form
511b4359K3245K7892l1409j4616L7227R97l8138J2654L4468k3775k6086L0679
523H779J3493l3743L85L1435j6115k6741K8939J7543l9741q495M3653k266m2913
536b5787J0412L4976j8044k2691K2739O134k4951J1600K4805k7427k1632M0306
548A0440J7884m6397j0948M7250M528l9290M147K7027j0811r095J8366q683k3549
561a9131K6489K7492l9593k8036M6488K5360m6624j9996L8920J0435k6905N8R296
574D253j3218P395K3753k4356l3707L4865L8202m1221l9108L9949L3104l3278
586c367k2294K1599P681p116R536o542k5476J9612L9885k7068m7480L1775M9936
599D0681k8992m3186K3682L1620j3644j2954L911p280O270K7868j3561m4783J7408
$$ plain form
612 -12960 41848 23385 -34204 -19038 31037 19593 -16455 -11859 2555 2255 9810 5443 -25193
625 -25193 -20522 27100 22401 -36139 -34223 25166 25930 -25269 -28387 7181 11530 -1985 -4433 -13658
639 -13658 -13419 18847 23904 -23915 -32815 24916 39543 -17207 -33503 15346 32150 151 -12429
652 -12429 -1039 4763 15830 19012 -12225 -25823 19494 41420 -11769 -40457 10395 39710
664 39710 -2684 -29748 -4229 13880 6148 -1063 -13194 -21076 6625 27841 -11333 -44225 -721
677 -721 38623 -2161 -41504 -8936 24610 5886 -15036 -10684 -4465 6950 18853 -3328 -30173
690 -30173 488 40663 8808 -36992 -7259 38487 16458 -20912 -8506 14885 13143 7563
702 7563 -972 -14857 527 30708 10366 -32866 -13184 34549 16781 -30180 -18666 18346
$$ packed form
612a2960N4808j8463n7589J5166N0075j1444l6048M596J4414l00P555m367l0636
625b5193M671M7622m699n8540J916N9389P64n1199l118L5568M349j3515k448r225
639a3658K39L2266N057m7819q900N7731J4627n6750j6296M8849J6804l1999j2580
652a2429J1390N802J1067L182l1237j3598M5317K1926n3189k8688N0852K9315
664C9710m2394k7064K5519J8109p732p211j2131p882K7701K1216l9174l2892M3504
677g21L9344m0784l9343L2568L3546j8724k0922M352O219J1415J1903k2181k6845
690c0173L0661M0175l1855m5800K9733M5746k2029l7370J2406K3391j742n580
702G563q535j3885J5384L0181k0342m3232J9682M7733j7768m6961J1514L7012
$$ plain form
714 18346 11725 -11300 -11123 -6969 -3283 10861 4301 -26424 -18699 23215 16374 -29573 -23844 20041
728 20041 17146 -16693 -14624 6045 5950 2876 4035 -8388 -9778 17952 21526 -15369 -19410 21965
742 21965 26503 -12265 -15839 14773 16000 -2683 -1269 2597 -3209 6196 14779 -7296 -19612 9465
756 9465 22220 -11364 -23932 7406 15757 -10552 -14120 2636 -721 -6957 2700 -1879 -16698
769 -16698 -2662 15819 -4387 -22973 1324 18396 -5194 -16381 5356 10452 -5277 -1355
781 -1355 8606 -2390 -4303 13532 8736 -12113 -868 20319 4861 -13366 4175 16402 -1778
794 -1778 -7125 9025 5526 -8329 2030 10727 -6423 -10684 8883 6576 -14029 -6712 10435
807 10435 -2428 -14824 1341 6768 -11296 -9635 8229 507 -14730 -1658 9756 -5521 -10404
$$ packed form
714A8346o621k3025J77M154L686J4144o560l0725P725M1914o841m5947N729M3885
728B0041k895l3839K069K0669r5l074J159j2423j390K7730L574l6895m041M1375
742B1965M538l8768l574L0612J227j8683J414L866n806R405Q583k2075j2316K9077
756I465J2755l3584j2568L1338Q351k6309l568J6756l357o236R657m579j4819
769a6698J4036J8481k0206j8586K4297J7072k3590j1187K1737N096j5729L922
781a355R961j0996j913J7835m796k0849J1245K1187j5458j8227J7541J2227j8180
794a778n347J6150l499j3855J0359Q697j7150m261J9567k307k0605P317J7147
807A0435j2863j2396J6165N427j8064J661J7864p722j5237J3072J1414j5277m883
$$ plain form
820 -10404 6321 4940 -9539 -188 11735 -3298 -10008 10363 12603 -9082 -6090 14797 8254
833 8254 -8296 1000 10842 8 -1890 8997 1646 -9137 5779 14434 -7240 -14451 9581
846 9581 13397 -10759 -12334 6911 4773 -7580 -2885 -201 -8016 -1187 8986 -6496 -18324 3467
860 3467 16353 -8048 -19844 4334 14186 -4773 -10093 2013 2901 794 6170 -587 -11121 4390
874 4390 20247 -597 -19239 4069 23396 1781 -15518 1022 13385 3779 -1836 -988 -4532
887 -4532 2371 14185 -199 -19854 -1920 22058 2781 -23260 -6677 16363 4247 -12708
899 -12708 -7231 259 1461 4753 -2233 -16067 -4891 18278 5613 -22928 -10319 20003 10491
912 10491 -15830 -10011 9218 8568 509 -2563 -6439 -105 16025 8714 -16880 -10080 21188 16445
$$ packed form
820a0404J6725j381j4479R351J1923j5033o710K0371K240k1685K992K0887o543
833H254j6550R296R842j0834j898J0887p351j0783J4916Q655k1674p211K4032
846I581L816k4156j575J9245k138j2353M695K684p815O829J0173j5482j1828K1791
860C467J2886k4401j1796K4178R852j8959n320J2106Q88k107N376o757j0534J5511
874D390J5857k0844j8642K3308J9327k1615j7299J6540J2363r606n615Q48l544
887d532O903J1814j4384j9655J7934K3978j9277k6041J6583K3040j2116j6955
899a2708N477P490J202L292o986j3834J1176K3169j2665k8541J2609L0322r512
912A0491k6321N819J9229o50q059l072l876O334J6130p311k5594O800L1268m743
$$ plain form
926 16445 -15780 -14261 13679 14818 -4737 -8538 -1211 3316 8615 4081 -13816 -11681 15121 15633
940 15633 -16492 -20508 11098 17641 -8824 -16791 105 7719 2768 -2286 -9627 -8396 10359 14275
954 14275 -12144 -20534 9638 22227 -6260 -20469 2515 16581 3096 -7482 -4994 309 9124
967 9124 10860 -7234 -16175 7964 23216 -3110 -22702 1282 21765 3454 -14883 -5446 6993
980 6993 6959 2217 -6953 -11839 4187 17787 -2470 -23242 -2603 21803 4135 -20202 -8026
993 -8026 12221 7093 -5485 -7307 -4418 3902 11644 -928 -17706 -3254 20650 7019 -19823
1006 -19823 -8816 17119 10477 -10164 -8354 3911 6656 4675 -1567 -10188 -2088 15775 7328
1019 7328 -17066 -10025 16855 11907 -13265 -11290 8265 8809 -2381 -4880 -3707 -510 8233 5154
$$ packed form
926A6445l2225J519K7940J139j9555l801P327M527N299m534j7897K135K6802N12
940A5633l2125m016L1606O543k6465p967J6896P614m951n054p341J231J8755L916
954A4275k6419q390L0172J2589k8487j4209K2984J4066j3485j0578K488N303Q815
967I124J736j8094q941K4139J5252k6326j9592K3984K0483j8311j8337R437J2439
980F993l4m742r170m886J6026J3600k0257k0772K0639K4406j7668k4337J2176
993h026K0247n128j2578j822K889Q320P742j2572j6778J4452K3904j3631k6842
1006a9823J1007K5935o642k0641J810J2265K745j981o242q621Q100J7863q447
1019G328k4394P041K6880m948k5172J975J9555N44j1190k499J173L197Q743l079
$$ plain form
1033 5154 -11934 -9979 12507 11997 -12314 -13109 9249 10926 -5971 -7878 1522 2885 2167 2258 -5212
1048 -5212 -7165 7273 11012 -7870 -12672 7482 12640 -5961 -10265 4138 6586 -1979 -1732 -74
1062 -74 -3233 1696 7500 -2841 -10595 3289 11801 -3449 -11249 3328 8877 -3014 -5235 2917
1076 2917 1153 -2238 3361 2123 -6421 -1129 9149 838 -9532 575 9282 -1317 -6992 2745
1090 2745 4504 -3738 -1376 4520 -1793 -4995 4134 4121 -6474 -3519 6685 1013 -7359 399 5556
1105 5556 -3470 -4885 4474 2171 -6460 -837 6301 -1392 -6039 2732 4402 -4044 -1761 5276 -590
1120 -590 -5024 4100 5856 -5228 -4092 7644 4216 -6457 -1612 6552 983 -3493 1931 1784 -3306
1135 -3306 1590 5582 -3954 -6998 5683 7274 -7158 -7677 5730 4990 -5556 -4118 1732 -423
$$ packed form
1033E154j7088J955K2486n10k4311p95K2358J677j6897j907R400J363p18R1p470
1048e212j953J4438L739j8882m802K0154N158j8601m304J4403K448q565K47J658
1062g4l159M929N804j0341p754J3884Q512j5250p800J4577N549j1891k221Q152
1076B917j764l391N599j238q544N292J0278q311j0370J0107Q707j0599n675R737
1090B745J759q242K362N896o313l202R129j3j0595K955J0204n672q372P758N157
1105E556r026j415R359k303q631N623P138p693m647Q771J670q446K283P037n866
1120e90m434R124J756j1084J136J1736l428j0673M845Q164n569m476N424j47n090
1135c306M896L992r536l044J2681J591j4432n19J3407p40j0546J438N850k155
$$ plain form
1149 -423 -834 2035 -3173 -6667 3449 8029 -5578 -10616 4765 10160 -4227 -8695 2737 5946
1163 5946 -73 -941 -887 -2373 3910 8210 -2838 -9639 4475 13330 -1481 -11440 1724 11109 1341
1178 1341 -6130 -1624 2120 2911 3739 -3155 -9016 2005 11839 -1949 -14823 -1379 12473 1252
1192 1252 -11949 -4926 5396 3381 -2297 -4985 -5268 1767 8730 -964 -13412 -2216 14564 4193
1206 4193 -13377 -5249 10895 7055 -4465 -4934 784 5412 6821 -209 -8657 -787 13741 6474
1220 6474 -12276 -6994 12568 9657 -7865 -8203 3707 6491 1622 -3674 -7102 -1210 9231 3520
1234 3520 -12683 -9209 9881 9175 -10244 -12627 4231 8839 -2566 -7897 -3811 1508 5978 2246
1248 2246 -9354 -7353 9977 10962 -8082 -11692 6648 13155 -1042 -8782 -148 7489 5715 440
$$ packed form
1149d23m11K869n208l494J0116M580j3607n038J5381N395j4387m468J1432L209
1163E946o019q68N4j486O283M300j1048o801J4114Q855j4811r959J3164R385r768
1178A341p471M506L744P91Q28o894n861J1021R834j3788j2874J3444J3852j1221
1192A252j3201P023J0322k015n678k688k83P035O963r694j2448J1196J6780j0371
1206D193j7570Q128J6144l840j1520m69N718M628J409p030q448P870J4528p267
1220F474j8750N282J9562k911j7522l38J1910K784m869n296l428N892J0441n711
1234C520j6203L474J9090p06j9419k383J6858M608j1405n331M086N319M470l732
1248B246j1600K001J7330R85j9044l610J8340O507j4197p740Q634P637j774n275
$$ plain form
1262 440 -4849 -3304 8149 10757 -5254 -12019 5399 14461 -1796 -12243 -747 8835 3064 -4961
1276 -4961 -6115 -1836 4699 4802 -6237 -11804 1564 11664 -2240 -15282 -2803 10898 2226
1289 2226 -9302 -5425 2476 4597 2167 -4628 -7138 3230 11237 261 -11592 -1253 13503
1302 13503 5861 -9012 -4329 8264 7127 -597 -2981 -1745 3470 8529 953 -9627 -1892 11689
1316 11689 4786 -10358 -6393 7429 6135 -5387 -6933 -298 2629 1466 -2354 -7513 -3791 6850
1330 6850 3448 -10595 -7811 7245 5967 -7073 -7104 2750 4721 -100 -2657 -2261 494 5218 4008
1345 4008 -4465 -4559 7218 8813 -4089 -6015 5871 7613 -1211 -2487 1643 2146 2470 2388 -2276 -3420
1361 -3420 3471 5510 -3354 -6910 2114 5809 -3237 -6593 709 2012 -2694 -2049 -909 -3518 -1080
$$ packed form
1262D40n289J545J1453K608j6011o765J7418R062j6257j0447J1496R582n771q025
1276d961j154M279O535J03j1039n567J3368J0100j3904j3042J2479J3701q672
1289B226j1528L877P901K121k430o795k510J0368Q007j0976j1853J0339J4756
1302A3503p642j4873M683J2593j137p724k384J236N215N059p576j0580P735J3581
1316A1689o903j5144L965J3822j294j1522j546O635K927j163l820n159L722J0641
1330F850l402j4043K784J5056j278j3040l1R854J971m821k557L96K755M724j210
1345D008q473r4J1777J595j2902j926J1886J742q824j276M130N03L24q2m664j144
1361c420O891K039q864l556R024L695r046l356P302J303m706O45J140k609K438
$$ plain form
1376 -1080 2762 -2175 -6203 275 4480 -1915 -5251 906 3878 -1165 -2277 2251 1647 -1270 2056
1391 2056 3388 -1626 -367 5382 2161 -2897 1683 5127 49 -1689 2998 2621 -1779 -349 3339
1406 3339 289 -3208 538 2594 -2362 -2859 1551 -517 -4085 42 1425 -4134 -3566 2344 298
1421 298 -5199 -2313 2582 -22 -3642 -1010 1449 -660 -573 1745 -853 -2261 3547 4268 -3198 -2548
1437 -2548 5655 4481 -2671 -1204 3869 2822 350 743 252 -122 2891 3320 -2514 -4007 3578 5412
1453 5412 -3754 -6030 2396 3904 -2604 -3786 -1078 -551 556 389 -4130 -4891 2137 4255 -3969 -7465
1469 -7465 1254 6210 -1389 -6507 -414 4055 1415 -840 -1814 -1600 3522 5981 -1891 -6084 3192
1484 3192 9023 481 -6391 46 7229 3446 -2951 -2404 1487 3675 3058 -2137 -5820 1268 7946
$$ packed form
1376a080L842m937m028O478M205o395l336O157K972n043j112M528o04k917L326
1391B056J332n014J259N749l221n058M580L444n078j738M687l77m400J430L688
1406C339l050l497L746K056m956m97M410k068l568M127J383n559N68N910k046
1421B98n497K886M895k604l620K632K459k109Q7K318k598j408N808P21p466O50
1437b548Q203j174p152J467N073j047k472L93m91l74L013M29n834j493P585J834
1453E412r166k276Q426J508o508j182K708N27J107j67m519p61P028K118q224l496
1469g465Q719M956p599n118O093M469k640k255r74K14N122K459p872m193R276
1484C192N831q542o872O437P183l783o397N47L891K188o17n195l683P088O678
$$ plain form
1499 7946 -398 -9458 -1964 7430 1908 -6875 -4757 1903 3194 -667 -4762 -4498 1296 5319 -932
1514 -932 -8743 -2563 8322 3532 -8060 -4800 5749 5283 -1921 -3899 -755 3942 5375 -427 -5821
1529 -5821 -239 8690 4545 -6525 -4770 6991 7303 -3288 -5652 1482 4884 2267 -2077 -4893
1543 -4893 -740 6336 2703 -7609 -5870 5562 5957 -5083 -7906 1018 5592 -201 -5220 -3569
1557 -3569 856 3958 1282 -5872 -5119 5292 6718 -4523 -7569 2897 7525 148 -5249 -1494
1571 -1494 3916 4328 345 -3687 -2115 4863 6367 -2595 -7045 2385 8690 102 -6892 -1152 5135
1586 5135 2835 -2020 -3840 -1420 3416 3684 -3315 -6667 898 6791 -332 -8147 -2405 5811 2283
1601 2283 -4746 -3742 903 2816 1603 -2675 -4719 1300 6307 156 -6762 -1485 6816 3344 -4671
$$ packed form
1499G946q344r060P494R394n522q783K118O660J291l861m095K64N794M023o251
1514i32p811O180J0885m790j1592L260J0549m66p204j978L144M697J433n802n394
1529e821N582Q929m145j1070J755J1761L12j0591k364P134L402k617m344k816
1543d893M153P076l633j0312J739J1432L95j1040k823Q924M574n793n019J651
1557c569M425L102k676p154P53J0411J426j1241l046J0466M628p377n397L755
1571a494N410M12l983m032J572O978J504q962m450R430O305q588o994N740O287
1586E135k300m855j820K420M836K68o999l352P565N893p123p815N742Q216l528
1601B283p029J004M645J913j213m278k044O019N007o151o918N277Q301l472q015
$$ plain form
1616 -4671 -3293 3472 4087 55 -2281 -1579 1791 4688 785 -5379 -1558 6331 3205 -5232 -3611
1631 -3611 3820 3753 -1889 -3445 -459 1861 1817 -767 -3792 -1681 3985 2554 -4868 -4235 3636 3759
1647 3759 -3159 -3790 1179 2408 141 -1207 -1662 -388 2564 1889 -2765 -2883 2978 3962 -2181 -3513
1663 -3513 2039 3415 -787 -1669 428 682 758 1228 -1022 -2024 1574 2913 -1407 -3089 1222 2869
1679 2869 -1088 -2429 754 1313 -895 -417 421 -1096 -528 1725 -52 -2495 165 2258 -713 -2084
1695 -2084 887 1471 -1249 -885 1389 258 -1500 380 1562 -829 -1126 1344 593 -1377 211 1388
1711 1388 -957 -1001 1742 855 -2176 -571 2326 385 -2124 -221 1666 18 -805 339 -186 -681
1727 -681 1307 1058 -2241 -1201 2819 1409 -2742 -1401 2558 1374 -1601 -967 584 493 730 213 -1710
$$ packed form
1616d671J378O765O15m032k336P02L370K897l903o164L821P889l126q437J621
1631c611P431o7n642j556K986K320m4k584l025K111N666j431p422O33P871J23
1647C759o918o31M969J229k267j348m55J274K952o75m654j18N861R84o143j332
1663c513N552J376m202q82K097K54P6M70k250j002L598J339m320j682M311J647
1679B869l957j341L183N59k208M78Q38j517N68K253j777k443K660K093k971j371
1695b084K971N84k720L64K274j131j758J880J182k391k97K470p51j970J588J177
1711A388k345m4K743q87l031J605K897j941k509J903J887j648q23J144n25m95
1727f81J988k49l299J040M020j410m151J341L959j184k975O34J551r1K37n17j923
$$ plain form
1744 -1710 -1083 2488 1852 -3055 -2498 2733 2539 -2314 -2515 1097 1723 -72 -1070 -1466 -458 2136 1474
1761 1474 -2866 -2796 2719 3466 -2289 -3784 1442 3576 -142 -2405 -795 1109 2104 944 -2383 -2149
1777 -2149 2900 3913 -2082 -4284 1627 4742 -181 -3866 -746 2801 1890 -825 -2521 -1255 2545
1792 2545 3000 -2436 -4768 1198 5006 -542 -5407 -1234 3849 1722 -2725 -2959 46 2604 1731 -2584
1808 -2584 -3983 1340 5125 -217 -5595 -962 5235 2413 -3573 -2699 2115 3534 773 -2462 -2279
1823 -2279 2182 4677 -230 -5058 -614 5709 2525 -4566 -3137 3230 3684 -1208 -3508 -1196 2259
1838 2259 2827 -1385 -4760 -913 4713 1727 -5280 -3735 3517 3634 -2517 -4352 -73 3005 1535
1853 1535 -1943 -3387 74 4275 1822 -4244 -2990 4097 4504 -2216 -4076 1486 4340 1142 -2257
$$ packed form
1744a710O27L571o36m907N57N231j94m853k01L612O26j795r98l96J008K594o62
1761A474m340P0N515P47n755j495N226K134l718k263J610J904R95j160l327K34
1777b149N049J013n995k202N911L115m923l685L120L547r11k715j696J266L800
1792B545M55n436k332N966L808n548m865M173N083k127m447k34L005K558q73m315
1808b584j399N323L785n342n378M633O197k822n986Q74M814J419k761l235J83
1823b279M461K495m907m828M444O323l184p091J429O367M54m892k300K312L455
1838B259N68m212l375L847N626k986p007J545P252J17o151j835M279L078j470
1853A535l478j444L461M201k453o066J254P087M07o720j860N562K854l198l399
$$ plain form
1868 -2257 -1713 1448 3672 1288 -3312 -2298 3702 4113 -2476 -4488 1452 4331 -168 -3710 -1632
1883 -1632 1746 1969 -594 -3336 -2193 2358 2793 -2733 -4822 821 4190 -476 -4439 -1317 2681
1898 2681 1739 -1354 -2361 -618 2411 2652 -1587 -3339 1377 4721 496 -3818 -445 4036 2189
1913 2189 -1665 -1579 1067 2478 1558 -1300 -2255 1053 3702 54 -3943 -1028 3510 1349 -3185 -2365
1929 -2365 1164 1507 -633 -2150 -1868 352 1956 -535 -3637 -1388 2870 1250 -3213 -2240 1922 1916
1945 1916 -998 -1574 -9 1230 1564 268 -1555 -186 2897 2012 -1846 -1339 2732 2598 -948 -1279
1961 -1279 1172 1705 444 -204 -611 -164 1322 984 -1653 -1744 1205 1410 -1742 -2186 494 848 -1237
1978 -1237 -1384 -357 -429 -477 32 -893 -1536 171 1023 -976 -1573 699 1227 -695 -655 1022 714 -287
$$ packed form
1868b257N44L161K224k384m600J014O000M11o589k012N940K879m499l542K078
1883a632L378K23k563k742J143M551M35n526k089N643L369m666l963L122L998
1898B681r42l093j007J743L029K41m239j752M716L344m225m314L373M481j847
1913B189l854Q6K646J411r20k858r55L308K649l648l997K915M538k161m534Q20
1929b365L529L43k140j517K82K220J604k491l102K249M258j620m463R73M162o
1945A916k914n76J565J239L34j296j823J369L083q85l858N07M071j34l546l31
1961a279K451N33j261o48m07M47J486l38k637r1K949K05l152m44K680L54k085
1978a237j47J027p2m8N09r25o43J707Q52j999n97K272N28j922M0J677l08j001
$$ plain form
1996 -287 536 1137 76 160 1352 807 -207 702 1367 73 -140 1258 738 -798 20 1366 -8 -1401
2014 -1401 -35 977 -468 -1228 -290 -204 -747 -258 -424 -1621 -857 973 -320 -2400 -881 1474 67
2031 67 -1924 -800 887 488 -222 -317 -385 441 1719 625 -1496 -132 2795 1640 -1573 -637 2263
2048 2263 1967 -343 -729 465 1240 1326 -19 -1558 -336 2286 1102 -2471 -1968 1792 1703 -1863 -2558
2065 -2558 2 1153 -141 -1635 -2032 -529 1513 435 -2860 -2328 1874 2280 -1892 -3052 736 2677
2081 2677 294 -1788 -922 1274 2346 899 -1803 -1132 2795 3274 -1220 -2708 1526 3927 494 -2499
2097 -2499 -618 2275 2062 -465 -2148 -795 2251 2116 -2101 -3509 797 3389 -650 -4139 -1326
2112 -1326 2353 1191 -2243 -2827 -417 1940 1026 -2460 -3078 1076 3543 -395 -4003 -737 3728 1918
$$ packed form
1996b87Q23O01j061Q4J192n45j014R09O65j294k13J398n20j536Q18J346j374j393
2014a401J366J012j445p60R38Q6n43M89j66j197P64J830j293k080J519K355j407
2031F7j991J124J687l99p10r5o8Q26J278j094k121J364K927j155l213R36K900
2048B263k96k310l86J194P75Q6j345j539J222K622j184l573N03L760q9l566o95
2065b558K560J151j294j494l97J503K042j078l295N32M202M06m172j160L788J941
2081B677k383k082Q66K196J072j447k702O71L927M79m494j488M234K401l433k993
2097b499J881K893k13k527j683J353L046j35m217j408M306K592m039l489K813
2112a326L679j162l434n84K410K357r14l486o18M154K467l938l608L266M465j810
$$ plain form
2128 1918 -2365 -2154 1545 2991 908 -1850 -1506 2090 3671 -83 -3359 -109 4211 2010 -2897
$$ packed form
2128A918m283K11L699J446k083k758L44L596J581l754l276L250M320k201m907
$$ [...]
8191G4
##END NTUPLES=NMR FID
##END=
