##TITLE=1H_LY-4Dix.60.4
 CD3CN,8 sc, 
 12.03.2021
##JCAMPDX= 6.0         $$ Bruker NMR JCAMP-DX V2.0
##DATA TYPE= NMR FID
##DATA CLASS= NTUPLES
##ORIGIN= UXNMR, Bruker Analytische Messtechnik GmbH
##OWNER= root
$$ XWIN-NMR		Version 3.5
$$ Fri Mar 12 12:56:08 2021 Russian Standard Time (UT+4h)  she@DPX200
##.OBSERVE FREQUENCY= 200.131506
##.OBSERVE NUCLEUS= ^1H
##.DELAY= (6, 6)
##.ACQUISITION MODE= SIMULTANEOUS
##.ACQUISITION SCHEME= undefined
##.AVERAGES= 8
##.DIGITISER RES= 18
##SPECTROMETER/DATA SYSTEM= spect
##.PULSE SEQUENCE= zg30
##.SOLVENT NAME= CDCl3
##.SHIFT REFERENCE= (INTERNAL, CDCl3, 0, 15.7039)
##AUDIT TRAIL= $$ (NUMBER, WHEN, WHO, WHERE, WHAT)
$$ ##TITLE= Audit trail, XWIN-NMR		Version 3.5
$$ ##JCAMPDX= 5.01
$$ ##ORIGIN= Bruker BioSpin GmbH
$$ ##OWNER= she
$$ F:/spectra/data/she/nmr/H-F/1/audita.txt
$$ ##AUDIT TRAIL=  $$ (NUMBER, WHEN, WHO, WHERE, WHAT)
(   1,<2021-03-12 12:55:04.26 +0400>,<she>,<DPX200>,
      <created by zg, POWCHK disabled, PULCHK disabled
       configuration hash MD5:
       00 E9 B6 7A A2 85 ED C7 34 08 36 98 17 FE 4E 26
       data hash MD5: 16K
       54 CA 89 80 93 58 D3 7A 04 44 D4 3D 90 F2 66 75>)
$$ ##END=
$$ 
$$ hash MD5
$$ 5F 1E EA 84 E1 22 65 4B CB 29 53 97 07 17 08 E1
##$RELAX= 
##$RELAX= 
##$RELAX= 
##$RELAX= 
##$RELAX= 
##$RELAX= 
$$ Bruker specific parameters
$$ --------------------------
##$DU= <F:/spectra>
##$EXPNO= 1
##$NAME= <H-F>
##$PROCNO= 1
##$TYPE= <nmr>
##$USER= <she>
##$AMP= (0..31)
100 100 100 100 100 100 100 100 100 100 100 100 100 100 100 100 100 100 
100 100 100 100 100 100 100 100 100 100 100 100 100 100 
##$AQSEQ= 0
##$AQ_mod= 1
##$AUNM= <au_zg>
##$AUTOPOS= <>
##$BF1= 200.13
##$BF2= 200.13
##$BF3= 200.13
##$BF4= 200.13
##$BF5= 200.13
##$BF6= 200.13
##$BF7= 200.13
##$BF8= 200.13
##$BYTORDA= 1
##$CFDGTYP= 0
##$CFRGTYP= 5
##$CHEMSTR= <none>
##$CNST= (0..31)
1 1 145 1 1 1 1 1 1 1 1 1 1 1 1 1 1 1 1 1 1 1 1 1 1 1 1 1 1 1 1 1 
##$CPDPRG= <>
##$CPDPRG1= <>
##$CPDPRG2= <>
##$CPDPRG3= <>
##$CPDPRG4= <mlev>
##$CPDPRG5= <mlev>
##$CPDPRG6= <mlev>
##$CPDPRG7= <mlev>
##$CPDPRG8= <mlev>
##$CPDPRGB= <>
##$CPDPRGT= <>
##$D= (0..31)
0 1.2 0 0 0 0 0 0 0 0.06 0 0.03 0 0 0 0 0.0002 0 0 0 0 0 0 0 0 0 0 0 0 
0 0 0 
##$DATE= 1615539303
##$DBL= (0..7)
120 120 120 120 120 120 120 120 
##$DBP= (0..7)
150 150 150 150 150 150 150 150 
##$DBP07= 0
##$DBPNAM0= <>
##$DBPNAM1= <>
##$DBPNAM2= <>
##$DBPNAM3= <>
##$DBPNAM4= <>
##$DBPNAM5= <>
##$DBPNAM6= <>
##$DBPNAM7= <>
##$DBPOAL= (0..7)
0.5 0.5 0.5 0.5 0.5 0.5 0.5 0.5 
##$DBPOFFS= (0..7)
0 0 0 0 0 0 0 0 
##$DE= 6
##$DECBNUC= <off>
##$DECIM= 32
##$DECNUC= <off>
##$DECSTAT= 4
##$DIGMOD= 1
##$DIGTYP= 9
##$DL= (0..7)
0 120 120 120 120 120 120 120 
##$DP= (0..7)
150 150 150 150 150 150 150 150 
##$DP07= 0
##$DPNAME0= <>
##$DPNAME1= <>
##$DPNAME2= <>
##$DPNAME3= <>
##$DPNAME4= <>
##$DPNAME5= <>
##$DPNAME6= <>
##$DPNAME7= <>
##$DPOAL= (0..7)
0.5 0.5 0.5 0.5 0.5 0.5 0.5 0.5 
##$DPOFFS= (0..7)
0 0 0 0 0 0 0 0 
##$DQDMODE= 0
##$DR= 18
##$DS= 0
##$DSLIST= <SSSSSSSSSSSSSSS>
$$ [...]
##$SUBNAM2= <"">
##$SUBNAM3= <"">
##$SUBNAM4= <"">
##$SUBNAM5= <"">
##$SUBNAM6= <"">
##$SUBNAM7= <"">
##$SUBNAM8= <"">
##$SUBNAM9= <"">
##$SW= 16.9725357007746
##$SWIBOX= (0..15)
0 0 2 0 0 0 0 0 0 0 0 0 0 0 0 0 
##$SW_h= 3396.73913043478
##$TD= 16384
##$TD0= 1
##$TE= 0
##$TE2= 300
##$TE3= 300
##$TEG= 300
##$TL= (0..7)
0 120 120 120 120 120 120 120 
##$TP= (0..7)
150 150 150 150 150 150 150 150 
##$TP07= 0
##$TPNAME0= <>
##$TPNAME1= <>
##$TPNAME2= <>
##$TPNAME3= <>
##$TPNAME4= <>
##$TPNAME5= <>
##$TPNAME6= <>
##$TPNAME7= <>
##$TPOAL= (0..7)
0.5 0.5 0.5 0.5 0.5 0.5 0.5 0.5 
##$TPOFFS= (0..7)
0 0 0 0 0 0 0 0 
##$TUNHIN= 0
##$TUNHOUT= 0
##$TUNXOUT= 0
##$USERA1= <user>
##$USERA2= <user>
##$USERA3= <user>
##$USERA4= <user>
##$USERA5= <user>
##$V9= 5
##$VALIST= <valist>
##$VCLIST= <CCCCCCCCCCCCCCC>
##$VD= 0
##$VDLIST= <DDDDDDDDDDDDDDD>
##$VPLIST= <PPPPPPPPPPPPPPP>
##$VTLIST= <TTTTTTTTTTTTTTT>
##$WBST= 1024
##$WBSW= 4
##$XGAIN= (0..3)
0 0 0 0 
##$XL= 0
##$YL= 0
##$YMAX_a= 485660
##$YMIN_a= -500981
##$ZGOPTNS= <>
##$ZL1= 120
##$ZL2= 120
##$ZL3= 120
##$ZL4= 120
##$ABSF1= 10
##$ABSF2= 0
##$ABSG= 5
##$ABSL= 3
##$ALPHA= 0
##$AQORDER= 0
##$ASSFAC= 0
##$ASSFACI= 0
##$ASSFACX= 0
##$ASSWID= 0
##$AUNMP= <proc_1d>
##$AZFE= 0.1
##$AZFW= 0.1
##$BCFW= 1
##$BC_mod= 2
##$BYTORDP= 1
##$COROFFS= 0
##$CY= 11.3945322036743
##$DATMOD= 1
##$DC= 2
##$DFILT= <>
##$DTYPP= 0
##$F1P= 15.9154993809931
##$F2P= -4.1035820241983
##$FCOR= 0.5
##$FTSIZE= 0
##$FT_mod= 4
##$GAMMA= 1
##$GB= 0.15
##$INTBC= 1
##$INTSCL= 1
##$ISEN= 128
##$LB= 0.24
##$LEV0= 0
##$LPBIN= 0
##$MAXI= 10000
##$MC2= 0
##$MEAN= 0
##$ME_mod= 0
##$MI= 1.114404
##$NCOEF= 0
##$NC_proc= 0
##$NLEV= 6
##$NOISF1= 3.799351
##$NOISF2= 2.8
##$NSP= 1
##$NTH_PI= 0
##$NZP= 0
##$OFFSET= 15.70392
##$PC= 1
##$PHC0= -11281.96
##$PHC1= 14.60094
##$PH_mod= 1
##$PKNL= yes
##$PPARMOD= 0
##$PSCAL= 0
##$PSIGN= 0
##$REVERSE= no
##$SF= 200.130013532006
##$SI= 16384
##$SIGF1= 3
##$SIGF2= 2
##$SINO= 400
##$SIOLD= 16384
##$SREGLST= <1H.CDCl3>
##$SSB= 0
##$STSI= 0
##$STSR= 0
##$SW_p= 3612.71676300578
##$SYMM= 0
##$S_DEV= 0
##$TDeff= 0
##$TDoff= 0
##$TI= <>
##$TILT= no
##$TM1= 0
##$TM2= 0
##$TOPLEV= 0
##$USERP1= <user>
##$USERP2= <user>
##$USERP3= <user>
##$USERP4= <user>
##$USERP5= <user>
##$WDW= 1
##$XDIM= 8192
##$YMAX_p= 0
##$YMIN_p= 0
$$ End of Bruker specific parameters
$$ ---------------------------------
##NTUPLES= NMR FID
##VAR_NAME=  TIME,          FID/REAL,        FID/IMAG
##SYMBOL=    X,             R,               I
##VAR_TYPE=  INDEPENDENT,   DEPENDENT,       DEPENDENT
##VAR_FORM=  AFFN,          ASDF,            ASDF
##VAR_DIM=   8192,          8192,            8192
##UNITS=     SECONDS,       ARBITRARY UNITS, ARBITRARY UNITS
##FACTOR=    0.0002944,     1,               1
##FIRST=     0,             0,               0
##LAST=      2.4114304,     0,               0
##MIN=       0,             -500981,         0
##MAX=       2.4114304,     485660,          0
$$ Real data points
##PAGE= N=1
##DATA TABLE= (X++(R..R)), XYDATA
0@%%%%%%%%%%%%Qj6J6j6J6k4L2l2M0m8N6p0Q3r3J04j22J43j63J87k12K36k67L04
35A62l44L84m30M80n33N93o58P30q06Q90r84J085j196J318j450J594j757J941
53A019k142K368k628K923l262L661m138M715n429O347p567R266j1802J5973k3952
68a4648M4277j85112l45498O05523K67267m76157j99463L01594P1518r3607N4941
79C0635q9331k05561K59026L34849l62353m26914M31155M68352m23906m24832
89d08880L87444L15464k74010j39179J42962l8506J1680K12375j21668l50625
99b62943J97767M52669k31217m99585K34809M72135k18744l82086J77930K20225
109A60960j38487l1978P5122j78383k1162L36181l9312m44225O1112M72593p0708
$$ plain form
0 0 0 0 0 0 0 0 0 0 0 0 0 0 8 -8 8 -8 8 -16 16 -16 24 -24 32 -38 45 -48 56 -66 77 -86 101 -111 125 -142 162
35 162 -182 202 -228 252 -281 312 -346 384 -422 468 -516 569 -627 691 -759 835 -922 1019
53 1019 -1123 1245 -1383 1540 -1722 1939 -2199 2516 -2913 3434 -4133 5133 -6669 9304 -14648
68 -14648 29629 -155483 -500981 104542 371809 -104348 -303811 -2217 69301 -24306 30635
79 30635 -58696 -264257 -5231 329618 -32735 -459649 -28494 439858 15952 -408880
89 -408880 -21436 294028 20018 -119161 23801 -14705 -3025 209350 87682 -262943
99 -262943 -65176 387493 156276 -343309 -108500 363635 144891 -237195 -59265 160960
109 160960 22473 -9505 65617 -112766 -133928 202253 162941 -281284 -220172 252421 181713
120A81713m52684O6017L72303p2854k44833Q7978Q4975j03148Q9981J22658k42705
131a10599j20779L67769J11936m16825p4121M09777M6755l32792m249K35695l7003
142G5564j12801R8136j1063j57289J33824K02423k36744k22905L00045K03992
152B73182l26111j59405K94955P8804k32233k57J33258q5744m5044J52835m1776
163D2464k19240J06358K57151j64841k63955K02734K26779k16675j52085K06393
173B5083N7025j66958N1432J16396j39362m8997K10938k487k42869N2788K58012
184A71001q6975k36542J26648J90444j53642j09746J69511J4956j63912P9629
194A372J36845j60905r6882K09855M1783k32593O820K17569n9944j90561R9904
$$ plain form
120 181713 -270971 -204954 167349 94495 -150338 -62360 22615 -80533 9448 132106 -110599
131 -110599 -231378 136391 248327 -168498 -242619 167158 213913 -118879 -123128 112567 75564
142 75564 -37237 60899 49836 -107453 26371 228794 -7950 -230855 69190 273182
152 273182 -52929 -212334 82621 161425 -70808 -71065 62193 -23551 -68595 84240 42464
163 42464 -176776 -70418 186733 21892 -242063 -39329 187450 -29225 -181310 25083
173 25083 82108 -84850 -33418 82978 -56384 -105381 105557 103070 -139799 -87011 171001
184 171001 84026 -152516 -25868 164576 10934 -98812 70699 85655 -78257 1372
194 1372 138217 -22688 -119570 90285 132068 -100525 -93705 123864 63920 -126641 -26737
205b6737J38653j44828q0243J72400L833j85084O8483J67201j31958j25740J74059
216C0039O7162j88990J942J84328o3423j56059J19805J23878j55475p7955J83720
227F8972L1698j84834K9403J66552q4402j17172J34547N3440j64844J8293J76743
238A28396q3412j70303J30914J44445j60380j10469J63597O0702j54547o626J23704
249F6021o1598q4126J23389K6563j76917K7992K02825p7841k04528J09129J78930
260A29839j22160j31585J19606O9299j02282N438Q2088p8891n4351J52490K9048
271I8539k04677L754K33762k9826k23237N3422J83809o4622j16120P0092L5510
282D0406p0275M8201O8277j25685o7783J84586O2803k22869n5549K27537L5630
$$ plain form
205 -26737 111916 -32912 -113155 59245 63078 -122006 -53523 113678 -18280 -144020 30039
216 30039 97201 -91789 -89847 94481 31058 -125001 -5196 118682 -36793 -114748 68972
227 68972 100670 -84164 -54761 111791 27389 -89783 44764 98204 -66640 -48347 128396
238 128396 44984 -125319 5595 150040 -10340 -120809 42788 103490 -51057 -57683 66021
249 66021 4423 -79703 43686 70249 -106668 -78676 124149 46308 -158220 -49091 129839
260 129839 7679 -123906 -4300 64999 -37283 -31845 50243 -28648 -82999 69491 98539
271 98539 -106138 -102384 131378 101552 -121685 -68263 115546 50924 -65196 4896 40406
282 40406 -29869 18332 86609 -39076 -106859 77727 140530 -82339 -137888 89649 125279
293A25279k02607j1605J42176k0490o5411M9450k0772p9657R6798J03435j56185
304c9589j20128J90275J24927j95873j12791J76871Q4300j33144l5584P4699k1315
315g352m858Q2849n9151j32216J11566J68435j38811j81831J44870J73049j28937
326B7613j39119R7735Q3134n7673j1374J4121o8518K4487J41398n6728j97756
337a42680P4062K23305p8763k18128O7563J79432n0082j16552K8733L5123j1606
348i593N1647J029j32656L243J96251k038k30637p06K31491M558j96163n115J33569
361D4880K788n1309O474l4277k0524J13492L9554j74338n7233K09460O9963k14835
373f5905p2424J88393O1875j35679l9239O3875O528J3747L1355q5855p0194J40664
$$ plain form
293 125279 -77328 -88933 53243 32753 -32658 16792 -3980 -83637 13161 116596 -39589
304 -39589 -159717 30558 155485 -40388 -153179 23692 107992 -25152 -60736 13963 -7352
315 -7352 -12210 70639 11488 -120728 -9162 159273 20462 -161369 -16499 156550 27613
326 27613 -111506 -13771 69363 11690 316 14437 -54081 -29594 111804 55076 -142680
337 -142680 -68618 154687 75924 -142204 -74641 104791 54709 -61843 -33110 2013 -9593
348 -9593 42054 43083 -89573 -86330 109921 107883 -122754 -123460 108031 112589 -83574 -88689 44880
361 44880 47668 -3641 2833 -31444 -51968 61524 101078 -73260 -130493 78967 148930 -65905
373 -65905 -138329 50064 111939 -23740 -62979 896 7424 21171 52526 -33329 -103523 37141
385C7141J02331j72370j22976J77456J26028j57686j09427J18036P3749o4966
395G316k2974P120l4465M7520Q9037r0080j32203J15247J57311j21960j59718
406a37849J11330J38379q7720r5699N5935L7654k2360K7321r339q9991L4325J40098
418A02084n1932j69491N9610J74247n8404j53391N1052J11109m0058n2365K9052
429A513j2349j9227P5195J2559j25507o817J57983K241j66042M089J50721j1255
441F3104j14064K0451O2918l1292o147M1837m9833n1494R5418N4917j26813n3146
453i4144J37909M2448j31623k5503J07336Q27p1567K5965K7390n2016J6714P2596
465E6332n5273q4565Q4513Q6762j00311p5430J04766N3892r4254k1916P5391j2051
$$ plain form
385 37141 139472 -32898 -155874 21582 147610 -10076 -119503 -1467 72282 7316
395 7316 -15658 -8538 -43003 4517 93554 3474 -128729 -13482 143829 21869 -137849
406 -137849 -26519 111860 24140 -71559 -15624 22030 -330 26991 17652 -72339 -38014 102084
418 102084 50152 -119339 -59729 114518 56114 -97277 -46225 64884 24826 -27539 1513
429 1513 -10836 -30063 45132 57691 -67816 -74633 83350 85591 -80451 -76362 74359 63104
441 63104 -50960 -30509 32409 1117 -5030 36807 -13026 -64520 30898 85815 -40998 -94144
453 -94144 43765 86213 -45410 -70913 36423 37250 -34317 -8352 19038 -32978 -16264 56332
465 56332 1059 -83506 1007 87769 -12542 -87972 16794 70686 -23568 -45484 29907 17856
477A7856m8091M7461J9764p5805J0208R5341l5671j00656N5930R2476o9480p1938
489f2605P5082M0884p4781n782O5784l1436n2784O1275L2687q4684j2092R4214
501D5762j2623r3055L4507P7831n4884n4781O8970K5565p6369N561P6228l3843
513H869o5589N7809M8548p1192k2561P8180m153p3623L4225O4471n8682m6124
525d9822P8577K6130q6547l323Q4707j7717p1402L6964M7627n3308j7796O2384
537C6474j6175o8110M5296O4694p0931n8517Q3684M2587q7725k4399P6437M39
549B3754n7188K2858K9238m6336Q44O6320k9937p9217N4367Q4877o7497p8340
561g6257P2976O4691o5014l8308N2161Q507k9971K8084Q593n9484J3758Q6977
$$ plain form
477 17856 -30235 17226 36990 -38815 -28607 66734 31063 -69593 -13663 78813 9333 -62605
489 -62605 12477 53361 -21420 -27202 38582 7146 -45638 15637 48324 -36360 -48452 45762
501 45762 33139 -59916 -25409 52422 -2462 -57243 11727 37292 -39077 -33516 42712 8869
513 8869 -56720 1089 49637 -21555 -44116 34064 29911 -43712 -9487 54984 -3698 -49822
525 -49822 28755 54885 -31662 -34985 49722 32005 -39397 -2433 45194 -8114 -25910 36474
537 36474 20299 -47811 -2515 62179 -8752 -67269 16415 59002 -28723 -53122 23315 23754
549 23754 -33434 -10576 18662 -27674 -26830 39490 9553 -69664 -15297 69580 2083 -76257
561 -76257 -3281 61410 -3604 -41912 10249 18756 -11215 16869 25462 -34022 -20264 66713
573F6713k9547j02666M0459J05504m4485r3911M1082O6798l4616l1729K2883j1761
585e276j4740N1631M177q8530O24J09514o177j18179O161J07660p504q3645Q222
598c6062M6089j0506j573J5014m2068j9590Q1492K7176j05481l0585J17388L4326
610G5620j07798k9484Q6433K2597m9818o525J0147j1730L2073L3331o6683n2323
622f4160R0147O5373r9416p1426R1389O4878p3446n0097M2422K2137j1180P638
634A4259k2983m2494M6674P0369o4393r2417O8552R9481o3601r2609M8675P1225
646D0738k7011l7202N707j494J5706M4821k7869p9532L6620J07206l4091j15208
658g1609K8865J10030j6968q4932O862M8926L055l625q513m1820R031Q0094o099
$$ plain form
573 66713 37166 -65500 -25041 80463 35978 -57933 -16851 49947 15331 -16398 6485 -5276
585 -5276 -20016 31615 35792 -52738 -52114 57400 51223 -66956 -60795 46865 39361 -44284 -36062
598 -36062 10027 -479 -2052 12962 -29106 -48696 32796 59972 -45509 -76094 41294 75620
610 75620 -32178 -61662 24771 47368 -2450 -8975 1172 -10558 21515 54846 -11837 -64160
622 -64160 25987 91360 -8056 -79482 11907 76785 3339 -46758 -4336 17801 6621 14259
634 14259 -8724 -51218 -4544 65825 1432 -90985 -22433 77048 13447 -79162 -30487 40738
646 40738 13727 -23475 -17768 -19262 -3556 41265 13396 -66136 -29516 77690 43599 -71609
658 -71609 -42744 67286 50318 -34614 -27752 21174 24229 20604 12091 -29729 -20698 59396 53297
671E3297j07915k173J16465Q273j11525j5894Q6238J5361n2556j3428Q247L077
683a2533L3183P762p1312k1636R5742L3337j06082m1179J00990M3861q0151l6916
695e4934N1260K5169j3313l614k1038j6822N4035M0868p3802n6478Q5031O6765
707H3127q0294o4638O6266N3443m3174l3002J6033N558Q856K2455l2068n0920
719d8358M5336O9309n4289q0943N1586P6278m5609o3475L1468L7944j7967q872
731g592K776k3155R065N1023j7131p1107K2123Q2219k1637p9533K2354O7793j8092
744A9106m2823J6847J5690j2272J6317J1469m1970q315O3212P291p2907m566P3065
757D0144P12o3391M146M4692j2216k2616J8431m069k6454K5475K8714m5452l0854
$$ plain form
671 53297 -54618 -56791 59674 67947 -43578 -59472 26766 42127 -10429 -23857 -15610 -12533
683 -12533 20650 28412 -42900 -64536 31206 64543 -41539 -82718 18272 62133 -18018 -54934
695 -54934 -3674 21495 8182 4568 -16470 -33292 20743 61611 -12191 -68669 16362 83127
707 83127 2833 -61805 4461 57904 14730 -18272 -2239 3319 12175 34630 2562 -48358
719 -48358 -3022 66287 11998 -68945 -17359 58919 13310 -50165 -18697 19247 1280 -7592
731 -7592 -4816 -27971 -18906 32117 14986 -56121 -33998 48221 26584 -52949 -30595 37198 19106
744 19106 -23717 -6870 8820 -3452 12865 24334 -17636 -25951 37261 44552 -28355 -32921 40144
757 40144 40856 -22535 -18389 26303 14087 -8529 9902 5833 -20621 4854 33568 -11884 -42738
770d2738N4765K5614n9326j9198N3449P313m3592N355K8215j8915j0826L1118
782A1234n482l8743K1941M3109l2711l8434M1574L1355m2323j6475M1566K382
794A8993l3875J4746K6050k7734j4349L8612K875m3528R381M2150k1090l5964
806b3733K9745K3256l7443j0390L8793n968l8859J7919L1576k9617k3500L4219
818E998J0165l6694L131L3328j8229k7066L1386J8153m1227p105M6741k601m4219
831b8239J2707L8123j8149k4594K4392R968k5584R134K7096k4925k4415L9684
843A5198K1389m7534j5810M9719Q863m4545j305L2159q186j6493J5909l094k5117
856a8847J9548L0127l5079l4961M2773L3798m6355l0570M1625K1003l1994q894
$$ plain form
770 -42738 12027 37641 -21685 -40883 12566 19879 -23713 -18358 9857 -9058 -19884 11234
782 11234 5752 -32991 -11050 32059 -652 -39086 2488 33843 -8480 -24955 16611 18993
794 18993 -14882 -136 25914 -1820 -16169 22443 25318 -18210 -8829 33321 12231 -23733
806 -23733 6012 29268 -8175 -18565 20228 14260 -24599 -6680 24896 -4721 -28221 5998
818 5998 16163 -20531 -17400 15928 -2301 -29367 2019 20172 -21055 -28160 18581 15980 -28239
831 -28239 -15532 22591 4442 -20152 4240 14208 -11376 -2242 24854 -71 -24486 15198
843 15198 36587 -10947 -26757 22962 31825 -12720 -14025 18134 9948 -6545 9364 6270 -18847
856 -18847 701 30828 -4251 -39212 3561 37359 -8996 -39566 2059 23062 -8932 -17826
868a7826J7115n669j022K1339j3882l4643K6961M5644l3473m9415L6361M8456
880C9946l1086l8865K4225K5031j2744m413K056j6493Q785L6807j5810n2279J9431
893a5409O0504j9337o0601J5142N0819j0769l4390M180J0918m14J2422l190l6365
906b6490K665N3518j986o4086j238O4166L863n5132o082L7869O311j4766l306
919d694r460j075L3300Q363n0048j4720O0857K1333o0705k3442N2752K3109l5908
932c38j6916J5126P537P565M999k7847j8811M2603L0691n0701l9206M9341M1020
945D5063m1717l7412K7014K6118j0941j0660o927q538K1175K6679l1387m2466
957d3999L5144N2101l3156n4288K6455M8007j5703l3405M137J4415O830Q691j4203
$$ plain form
868 -17826 -711 -6380 -7402 13937 55 -34588 -7627 38017 4544 -44871 -8510 39946
880 39946 8860 -30005 -5780 19251 6507 2094 4150 -12343 -3558 33249 17439 -34840 -15409
893 -15409 45095 25758 -34843 -19701 31118 20349 -14041 -9861 1057 643 13065 9875 -26490
906 -26490 -23825 29693 27707 -36379 -37617 26549 30412 -24720 -30802 7067 13378 -1388 -4694
919 -4694 -14154 -15229 18071 26434 -23614 -38334 22523 43856 -16849 -40291 12461 35570 -338
932 -338 -17254 -2128 5409 12974 17973 -9874 -28685 13918 44609 -6092 -45298 4043 45063
945 45063 3346 -34066 -7052 19066 8125 -2535 -9462 -18000 3175 29854 -1533 -43999
957 -43999 -8855 43246 10090 -44198 -17743 30264 14561 -18844 -14707 -292 6538 15229 1026
970A026k9938J8878M8430j8727n8532J5680O0565r045n3216K332L7797L751j6463
983B538p461p702Q141L0137o684m7983J766N7770L314n9761q592N1904J0965l6873
997h521j1266J6156Q275N400k505k5974n014M1970J3062n1312j9183N2798K3048
1010C6934m6223k2491L3792J8296j6836r722j316q48J8711J2476l1777k2860L9622
1023G758L0295m1192l2966L6854L0446k7808k2731J5619J0963k816K849r222j6998
1036a8949J8516K8436k4233l6063K5856L7724k3896l4164J9405K5128j3221j2309
1048g770O577k516o8J6636n013k8277Q826L5730j0972l7698J1788L4301j1568
1061I976k5876J0607J3932r261p00P981j2290o697K3143M861l0493k462L3116
$$ plain form
970 1026 -28912 -10034 38396 19669 -38863 -23183 37382 28337 -24879 -22547 15250 19001 2538
983 2538 -4923 -12625 -4484 25653 18969 -29014 -27248 30522 33836 -25925 -34517 17387 28352 -8521
997 -8521 -19787 -3631 4644 10044 7539 -18435 -23449 18521 31583 -19729 -38912 13886 36934
1010 36934 -9289 -31780 2012 20308 3472 -6250 -7566 -8414 10297 22773 -9004 -31864 7758
1023 7758 38053 -3139 -36105 749 31195 3387 -19344 -3725 7238 4422 7271 -1951 -18949
1036 -18949 -433 28003 3770 -32293 -6437 31287 7391 -26773 -7368 17760 4539 -7770
1048 -7770 -1193 -3709 -3777 12859 7846 -20431 -11605 24125 13153 -24545 -12757 21544 9976
1061 9976 -15900 -5293 8639 -622 -1322 6659 -5631 -12328 10815 15676 -14817 -17279 15837
1074A5837n33l1031M119K4807p705j5694J1127N259j3830N371J5401j4318j4821
1087a6011K1076J2628k4552q369K5367K269k2807M621J7865j1114j1443J6277
1099E807M012j9460L014J9789r517j7894J4421J3074j8223o754K0065j131k0224
1112a3021Q562J8038j5014j4097J8762Q619j9755k177J7980m421j3587J1203Q185
1125I277j6876j509K1469m287k3471R923K3099j3145j9170J4930J2773j4041l776
1138d804J1299n650p617J4784L666k2487o33K7311k378k9127L799K6601n586k0634
1152a1456N935J0557o645Q28O246j3090o250K2917O027k9496o333L2093O487k9625
1166a1805n733K3529M195j3361m95J927l583J0929Q986k1196j3003K9039J6436
$$ plain form
1074 15837 15304 -15727 -11608 13199 5494 -10200 927 6186 -7644 -2273 13128 -1190 -16011
1087 -16011 5065 17693 -6859 -15228 10139 12408 -10399 -5778 12087 973 -10470 5807
1099 5807 9819 -9641 -6627 13162 3645 -14249 172 13246 -4977 -11731 8334 7203 -13021
1112 -13021 -4459 13579 -1435 -15532 3230 11849 -7906 -10083 7897 3476 -10111 1092 9277
1125 9277 -7599 -9108 12361 8074 -15397 -5474 17625 4480 -14690 240 13013 -1028 -4804
1138 -4804 6495 845 -6772 8012 11678 -10809 -11442 15869 13491 -15636 -11837 14764 9178 -11456
1152 -11456 -5521 5036 -1609 -781 5465 -7625 -13875 9042 15069 -14427 -20760 11333 17820 -11805
1166 -11805 -17538 5991 10186 -3175 -3670 -1743 -5326 5603 14589 -6607 -19610 9429 25865
1179B5865l1398j7286K9016J6711k2049j3544J2311P709j568L9r577r437J8162
1192D954J7907k4934k4979K6463K7590k4962k6902J8216K1303r551j3139n52K024
1205f562R163R704j5052k1227J8269L0506j7745l5085J5512L4875j0241k7345
1217a5228M428J6692K642k159p731j1254J0812K4139j0231l3256P983L7760l720
1230B0877l6982p48L0243L655j8969o001L808N768J1066n119k5139J509L3608
1243A7576J776l7492o927L4951J0433k8336j2405J7486J0667m070n860r781k65
1256a2247K2420P630l0310j3064L3955J7683l0254j8649K3206J8107j2035j3155
1268f713J116O327R543L810j7791j3997K3337K2327k5589k7316K3299K6641j7534
$$ plain form
1179 25865 -5533 -22819 6197 22908 859 -12685 -374 7335 5767 5806 -3771 -13208 4954
1192 4954 22861 -2073 -27052 -589 27001 2039 -24863 -6647 14656 5105 -8034 -8586 -6562
1205 -6562 2601 12305 -2747 -23974 -5705 24801 7056 -28029 -12517 22358 12117 -15228
1217 -15228 -10800 5892 8534 6375 -1356 -12610 -1798 22341 12110 -21146 -13163 24597 20877
1230 20877 -16105 -16853 13390 17045 -1924 -7925 -4117 1651 12717 7598 -17541 -16032 17576
1243 17576 19352 -18140 -25067 9884 20317 -8019 -20424 -2938 7729 3659 -2201 -11982 -12247
1256 -12247 10173 17803 -12507 -25571 8384 26067 -4187 -22836 370 18477 6442 -6713
1268 -6713 -5597 730 10273 14083 -3708 -17705 5632 27959 2370 -24946 -1647 24994 7460
1281G460k3010Q177J4504P69n435r404o233J3961J6528j6721k6002J5645L1572
1294B1811j3587l1961R276K6762l732j6776j570M867O878Q448r175j8700R968
1307g491K7459o820l1000L639L1737O37k6701k803J8433L848o174l626o938K858
1321b942J8047j872k6162r25K8848L317k8651o614K3312P234j6748o977P041K986
1335a06K695R94j2821n908K0698Q681k4723j0061K4510J0579j9981r084J4078
1348d49P120o152k372L3k438O781R147j1362j3440J5964J6094j7357j4749J6573
1362C393J1149j2812o210P580O30k689L932j742r460L964J2942o882j6301Q178
1376d328J5753j0414j3484J0520P560j0110j510P514m649m470R132J671j1283
$$ plain form
1281 7460 -15550 -7373 7131 7900 2465 -6939 -13172 789 17317 596 -25406 -9761 21811
1294 21811 8224 -23737 -14461 12301 8569 -8207 -9777 -4910 1968 10416 1241 -17459 -7491
1307 -7491 19968 13148 -17852 -14213 17524 18161 -8540 -11343 7090 10938 4764 1138 -5800 -2942
1321 -2942 15105 13233 -12929 -13854 14994 18311 -10340 -16954 6358 13592 -3156 -10133 -3092 -106
1335 -106 2589 3583 -9238 -15146 5552 14233 -10490 -20551 3959 14538 -5443 -14527 -449
1348 -449 6671 519 -1853 -1820 -4258 2523 11670 308 -13132 2832 18926 1569 -13180 3393
1362 3393 14542 1730 -4480 3100 3730 1041 4973 3231 -6229 -2265 10677 3795 -12506 -4328
1376 -4328 11425 1011 -12473 -1953 5607 -4503 -6013 1501 -3148 -7618 1514 3185 -8098
1389h098N31J3008j869j2630M564J2098o517q572R786M777j0740J196J0992n521
1403C005q367R002N414j0031j635R798j939r145M936P923q493p116J0946M196
1417H494j3541j536J2682k841j0520N362N039p718J33P858n322q108Q795Q075
1431F852j0883q289J2565P754j2003n283J0995K062o908L271K284p057M103J0724
1445A0187p969j2104J1018J3081j0876j2440R535J0687o957p536M034K077j637
1458A100M371k244j1535M966J5976p742j8741P586J7554o609j5008L016J0032
1471B722l02m260k138k733K894J0390k538j7140K257K1989j074k2309O59J9434
1485G851J421j2367k472M607M142L993l059j1244J376J7274K453k1217n699K2080
$$ plain form
1389 -8098 -7567 5441 3572 -9058 -4494 7604 1087 -7485 2301 7078 -3662 -2466 8526 3005
1403 3005 -5362 3640 9054 -977 -2612 7186 5247 -3898 1038 8961 468 -6648 4298 8494
1417 8494 -5047 -6583 6099 3258 -7262 -1900 3139 -4579 -4446 3412 -1910 -10018 -1223 6852
1431 6852 -4031 -12320 245 7999 -4004 -9287 1708 3770 -3138 133 2417 -4640 -537 10187
1445 10187 2218 -9886 1132 14213 3337 -9103 432 11119 4162 -3374 660 2737 1100
1458 1100 5471 3227 -8308 -3342 12634 4892 -13849 -6263 11291 4682 -10326 -7310 2722
1471 2722 2420 -1840 -3978 -6711 -3817 6573 4035 -13105 -10848 11141 10067 -12242 -11583 7851
1485 7851 9272 -3095 -5567 -960 3182 7175 4116 -7128 -5752 11522 13975 -7242 -12941 9139
1499I139Q016k0123q627J3959O928n531n431m056J716J1876J433j8059o165K0004
1513E079J0292j9972j3927J6862J4659j1936j2616N078P988K800j127j0324n177
1526a2321J6078J1299j7766j5082J6913J7926j2211j7784P080J5498r39r506m023
1539d838J565Q523P268j1207j5241J2243K0109j1250k1858P365J9869k883j5684
1552f019k494Q634N518p73p752q064P211J5676n922k1384L322K3549p82k1501
1566a0781j862J5855M583p599n873r70O115R343l706j5351L56K0129L912k1354
1580g203o728J9701Q584j4497p995O974O103J598l130r678n44J4942M771j8115
1594e217q793J7643J1493j5395j2866J0642J1229n244p626j341J901P227L883
$$ plain form
1499 9139 17155 -2968 -11595 2364 9292 3761 -1670 -5726 -4010 7866 9299 -8760 -14925 5079
1513 5079 15371 -4601 -18528 -1666 12993 1057 -11559 -6481 1507 4307 3180 -7144 -12321
1526 -12321 3757 15056 -2710 -17792 -879 17047 4836 -12948 -5868 9630 8691 -815 -4838
1539 -4838 -3273 5250 12518 1311 -13930 -1687 18422 7172 -14686 -7321 12548 9665 -6019
1552 -6019 -8513 121 5639 4866 -2886 -10950 -3739 11937 6015 -15369 -12047 11502 10720 -10781
1566 -10781 -12643 3212 7795 196 -5677 -6647 -532 8811 5105 -10246 -9890 10239 14151 -7203
1580 -7203 -13931 5770 14354 -143 -8138 -1164 4939 6537 3407 -6271 -6815 8127 12898 -5217
1594 -5217 -14010 3633 15126 -269 -13135 -2493 8736 3492 -4134 -5475 -3574 3653 7536
1607G536j2165r031J4452J2876j4018j4784J1394J4893o954j2389K504Q307J949
1620D570j880n010n045P960J1366q871j5657Q740J7185o736j6013M088J2355r09
1634F143p319k003J301L532M648l885j0718L305J4884k848j6922J743J5890j082
1648F669j2503j8P411N31j416r55l898L35Q686O23j1908j698J3665K491j3414
1663e399k110J1506J339p743L07L174j833J850L120n675m076Q280M667r644m651
1678f888R906L809r198k115P374l83m913K875J859n139J088O262l836o450N693
1693e6N535o764l895P108J771o965M27O506k738n462M803M007o228j556O502j003
1709A992n691L651L847n739j705P349l79q144J973Q331l167p519L803N762m168
$$ plain form
1607 7536 -4629 -13660 792 13668 -350 -15134 -3740 11153 4199 -8190 -5686 2621 4570
1620 4570 2690 -2320 -7365 595 11961 3090 -12567 -3827 13358 6622 -9391 -5303 7052 6143
1634 6143 -1176 -3179 -1878 1654 6302 2417 -8301 -4996 9888 7040 -9882 -8139 7751 6669
1648 6669 -5834 -5852 1559 2090 674 -281 -4179 -3844 4842 5465 -6443 -8141 5524 8015 -5399
1663 -5399 -7509 3997 5336 -2407 -2100 1074 -759 1091 4211 -1464 -5540 2740 7407 -2237 -6888
1678 -6888 3018 6827 -2371 -4486 2888 2505 -2408 467 2326 -2813 -1725 4537 701 -5749 -56
1693 -56 5479 -1285 -5180 1928 3699 -3266 -2839 3667 929 -4533 270 4277 -1951 -3507 2995 1992
1709 1992 -3699 -48 3799 -1940 -3645 3704 3325 -4819 -2846 5485 2318 -5201 -1398 4364 196
1724A96k886L786n70l104M344K040p566r34R939Oj0844M98J0391p54q303P68N188
1741B195r07j077J309l410j855P560K645j0954k997J2267L320j1883l434R429
1755B208L111n895j967J130K44L507J989p721m652J0822O799j2070q362J1470
1769F13Q454q783p432M950N222l42j516m138k294P811O610r971r967J0503J2336
1784A2056r178j2896O662J1318k922p788j120K794M691K794p214q555Q139J3003
1798A1784p774j5797N563J5900k636j3977p61R433L485l333n626l648O368J0082
1812I063n652j5168L944J7793q82j7715j853J4946M757r807n906L172O371M233
1826G296m965j0631K771J5604N57j8004l742J7599O486j4416q114Q860Q136k408
$$ plain form
1724 196 -2690 1096 526 -2578 1766 3806 -3760 -4694 5245 5251 -5593 -5095 5296 4542 -3761 -2993 2195
1741 2195 1288 211 1520 -1890 -3745 3815 6460 -4494 -7491 4776 8096 -3787 -7221 2208
1755 2208 5319 -576 -2543 -1413 -1169 2338 4327 -3394 -8046 2776 9575 -2495 -10857 613
1769 613 9067 284 -7148 -2198 3024 2682 1166 -2972 -5266 2545 9155 -816 -10783 -280 12056
1784 12056 2878 -10018 -3356 7962 5040 -2748 -3868 -1074 3617 6411 -803 -9358 -1219 11784
1798 11784 4010 -11787 -6224 9676 7040 -6937 -7698 1735 5220 1887 -3739 -7387 -1019 9063
1812 9063 3411 -11757 -7813 9980 9098 -8617 -10470 4476 9233 -574 -6480 -3308 3063 7296
1826 7296 2331 -8300 -5529 10075 10632 -7372 -11114 6485 12971 -1445 -9559 -699 7437 5029
1840E029o646m624L247J0399L61j4648m935J6180Q287j5370j0886J1790J1342
1853I526o845r801Q88O256M902j481r556l578J2456Q862j2854j2199J1515J4268
1867A2359q035j3205L883J0626R80n849m772K13P737N967r018j1077Q717J4360
1881A2886o848j5597L718J3976p60j0470k692M815M452J283n839p571N204J2170
1895H727l911j5366J495J5598R33j3731k833R440M273l727m350j913L352Q085
1909F072j447j1788o02J4351L325j4075m686J2093N891p983n225L135L940K047
1923E048j458o784j405R939M302j2000o865J1468P726r870p867O211N998k670
1937A773l637j746N5M731L394p417o672Q465Q657q126r333O886Q676m393o300
$$ plain form
1840 5029 -1617 -6241 -2994 7405 7766 -6882 -11817 4363 12650 -2720 -13606 -1816 9526
1853 9526 2681 -7120 -6232 24 4926 3445 -6111 -9689 2767 11629 -1225 -13424 -1909 12359
1867 12359 4324 -8881 -4998 5628 6608 759 -4013 -3800 3937 9904 886 -10191 -1474 12886
1881 12886 6038 -9559 -5841 8135 7375 -3095 -5787 -972 3480 4763 -1076 -8647 -3443 8727
1895 8727 4816 -10550 -9055 6543 7476 -6255 -9088 352 4625 898 -3452 -5365 -2013 6072
1909 6072 4625 -7163 -7765 6586 9911 -4164 -8850 3243 9134 1151 -4074 -939 3001 5048
1923 5048 3590 -3194 -4599 5340 9642 -2358 -9223 2245 9971 101 -7766 -1555 4443 1773
1937 1773 -1864 -3610 -3555 1176 4570 -2847 -9519 -1054 7603 -523 -9856 -2970 5706 1313 -4987
1952d987K313L348N40Q67k302m115L975P448m223q977M679R489l749q486L147
1967a033O230k297l153J308m36o72L514k89o652N61P717j276q461J318P258k116
1983A521n954K226L302k981q12L003j809k875L956K582n324j409O142M25n739
1998c746J557N464k629l850M142K847m615q60N004k76m190J946K989l090j090
2013c97M091j047m890K902M960m783n122N287M103n599l412M153J583l154K5Q01
2029d99k553J088M575l205o523M486P413m695p591M513O915l207m629J847K244
2044A79K99J466j475m555L026P927l049r470L019J0370j905r403Q03P074M79l571
2060A214j675r77K180M857k341q839J094J0914j91j2171j626J0639K733q303l726
$$ plain form
1952 -4987 -2674 674 1214 2081 -221 -4336 -361 7087 2864 -6113 -1434 8055 4306 -4180 -1033
1967 -1033 5197 2900 -253 1055 619 -53 3461 3172 -3480 -2919 4798 3522 -4939 -3621 3637 1521
1983 1521 -4433 -2207 1095 -1886 -2698 305 -1504 -4379 -423 2159 -3165 -4574 1568 1993 -3746
1998 -3746 -2189 3275 646 -3204 938 3785 -830 -1690 3314 3038 -1152 794 3783 693 -397
2013 -397 3694 2647 -2243 659 5619 836 -4286 1001 5104 -495 -3907 246 1829 -1325 -1300 -499
2029 -499 -3052 -1964 2611 -594 -7117 -2631 4782 87 -7504 -2991 3924 717 -3912 -2065 179
2044 179 478 1944 469 -4086 -1060 6867 3818 -5652 -2633 7737 5832 -3571 -2768 4306 4785 1214
2060 1214 -461 -1438 742 5599 3258 -5581 -4487 6427 6236 -5935 -7561 3078 5811 -2492 -6218
2075f218L832L482R58k775n839J130R771J268j1954l454J2615N713j0596o639
2089h706P779O974k885n303j638L149O531P00r990l810J1828P081j1509r364R423
2104B60J0196n939r472J238O632K915l188o929j989R182O351j0401j0760R063
2118b841J2693o753j3211K908J1266J184p647m715K413P392L401q144q576P944
2132b686J2975n565j4878K933J5082O81j2028l501P682O155j596p074m195O676
2146F61R764m995j3625K078J5217J061j4882m008J1399N867o895p148P69O149
2160A412N026m635j0249J498J3168J696j4432m967J2987P317r807q033N086P508
2174C575N26n314n204K176R634J955j1453n576J2284Q443j0221r557P147R563
$$ plain form
2075 -6218 -2386 1096 2054 -721 -6560 -5430 4341 5609 -6345 -9799 2816 8529 -2067 -8706
2089 -8706 -927 6047 3162 -2141 -3779 -630 5901 6601 -3389 -7199 4629 11710 201 -9163 260
2104 260 10456 4517 -4955 -3717 2915 5830 2642 -4287 -6276 2906 9257 -1144 -11904 -2841
2118 -2841 9852 3099 -10112 -7204 4062 5246 -2401 -7116 -4703 2689 6090 -2054 -10630 -2686
2132 -2686 10289 4724 -10154 -7221 7861 8542 -3486 -6987 695 6850 5254 -1820 -6015 661
2146 661 10425 5430 -8195 -6117 9100 10161 -4721 -8729 2670 8537 1642 -5506 -4737 1412
2160 1412 6438 1803 -8446 -6948 6220 7916 -6516 -11483 1504 8821 -986 -9019 -3933 3575
2174 3575 4101 -1213 -6417 -4241 5393 7348 -4105 -9681 2603 11046 825 -8732 -1585 7978
2188G978l000p425j199M205M818K7p556m385Q742P737q576j0455O758J0783m292
2203D160r951P73O923J951l141m379j661N409N801n481r279M527J1218k941j1161
2218g232R29R507J269n946k554K112L488K610l057o340K383R296p32j0439o95
2233e401J0330J961q320k623N343K643j675k052k408P65N616L98p949k198Q721
2248C151L103q662l809O706L539m486k708J494J114J280P70l783k550N434M176
2263D769o201m715O110M837n068l685L642K535j968k87M40j621J242L468k169
2278A329m668K985N240l515m856L673L683l465k073K741K27k348J429J441k978
2293a155p65L788l67m246J354L629k265l119L367J794l977p95M365m12m037J357
$$ plain form
2188 7978 4978 -2447 -3646 559 5377 5404 -2152 -6537 2205 9942 1366 -9089 -2331 8452 4160
2203 4160 -5791 -5018 1905 3856 715 -3664 -5325 84 5885 404 -8875 -4348 6870 3929 -7232
2218 -7232 -6303 3204 4473 -1473 -4027 -1915 1573 4183 1126 -5214 -2831 6465 5733 -4706 -5401
2233 -5401 4929 6890 -1430 -4053 1290 3933 2258 206 -2202 -1437 4179 4577 -3372 -5570 3151
2248 3151 6254 -2408 -6217 489 4028 -458 -3166 -1672 -558 722 1492 -2291 -4841 593 4769
2263 4769 -1432 -6147 -37 4800 -268 -3953 -311 2224 256 -31 409 -1212 30 3498 1329
2278 1329 -3339 -354 4886 1371 -3485 188 3871 406 -1667 1074 1301 -1047 382 1823 -1155
2293 -1155 -1920 1868 1501 -2745 -1391 2238 -27 -3146 221 2015 -1962 -2757 1608 1196 -2841 -1484
2309a484L341j854j927K313K66k085J660K124l375j961M995J845n680j651N845
2324B372J299m910p88L191J96r32M40j579j362L725K294n475l353O267M076o407
2340i46m290N161L941l203l000O33J341J979Q62m236l159N703N202o159o624N598
2356a197P213l957o679J948M944O59k437k777q34M395M307n320p105N224Q825
2371G209l890r534K087Q450Q1o041k208K645L738J418m403n335L952Q680k883
2386C966j0532J041J0817J138r459k915O396M293k323m778k164M025O467k403
2400C569r747M9J1577K353j1230m724R088O144n574o558J179N584L219l348p255
2415e674N53R924K577j0999n580J0193P790p745q650M228Q009O7n741m245K704
$$ plain form
2309 -1484 1857 3 -1924 389 655 -1430 230 2354 -1021 -2982 2013 3858 -1822 -3473 2372
2324 2372 3671 -1239 -2027 1164 1360 428 868 -711 -2073 1652 3946 -1529 -4882 1385 5461 -946
2340 -946 -5236 -75 3866 663 -2337 -1704 -363 1616 2478 -1758 -4917 786 5988 -171 -6795 -1197
2356 -1197 6016 2059 -4620 -2672 2272 2931 494 -2283 -3117 1278 5585 265 -6840 -1616 7209
2371 7209 3319 -6215 -4128 4322 4403 -1638 -3846 -1201 2537 3955 -448 -5783 -1831 6849 3966
2386 3966 -6566 -5525 5292 6430 -3029 -5944 452 4745 2422 -2356 -4520 -495 5972 3569
2400 3569 -6178 -6129 5448 7801 -3429 -8153 935 7079 1505 -5053 -3874 1710 4929 1581 -5674
2415 -5674 -5121 4803 7380 -3619 -9199 994 8784 1039 -7611 -3383 4626 4693 -1048 -5293 -2589
2430b589P574J306r376n206R746Q339q147j0334N452J0494j740q986k047N692
2444A78N295j433p522l349Q156P488p441j0721N334J1879k410j1484q73R033L678
2459E808n224n740M81O490M421o041q595M587J1314k047j2022o08J1080L138q033
2474i91m890M161N745O34n158m872L695Q621j343j0777j273J1153L604r690n308
2489f689O577N864k744n461j669L799N082j527p884j505Q978M019q817o090P235
2504h32O586m585o131J396M500J892k074m346q59O320L634o656n584O032P245
2519F538m367p176K581O272l37l709j656Q95L304K237l993m987L983O674l255
2534C004p608J766O877k78n670r15K966J575m66j786k885J417N107j195o660L70
$$ plain form
2430 -2589 4985 6291 -3085 -8291 1455 9794 1647 -8687 -3235 7259 5519 -3467 -5514 178
2444 178 5473 4040 -3482 -6831 1325 8813 1372 -9349 -4015 7864 5454 -6030 -6903 2130 5808
2459 5808 584 -5156 -4675 1815 6236 195 -8400 -3813 7501 5454 -6568 -7176 3904 7042 -991
2474 -991 -5881 -1720 4025 4659 -499 -5371 -1676 6945 5602 -5175 -6448 4705 8309 -1381 -6689
2489 -6689 -112 5752 3008 -2453 -4122 -323 4759 3232 -4652 -6157 2821 6840 -1977 -8067 -832
2504 -832 5754 1169 -4962 -3566 934 2826 752 -3594 -4453 1867 5501 -1155 -6739 -707 6538
2519 6538 2171 -5005 -2424 3848 3511 -198 -1854 -959 2345 4582 589 -4398 -415 6259 3004
2534 3004 -4604 -2838 4039 3761 -1909 -2824 142 1717 1251 -535 -3420 -2003 3104 1909 -4751 -4381
2550d381O911M54o238r57M634J187k195j142J84P25K213M09l762j097N192J906
2566D043n345j727N058J600l609r64K181L10l75N41j189j552K168K188k966k896
2582b534L182K580l679k102L087P05k568J48J740j734q66K202M0k598O21K500
2598G24j200k113J884J541k254n81L083j21l152J427L236j967k186K267J431j456
2614E63j84J061q66m36K256N6l559P8M521l47m968P5M488l35l677p2J464J04N97
2633H19o62k960L84M445k35n495r30N966J618n567k194M299K411k004j746m49
2649b300J149L455J37n488q59O798K451o324l528N562M674l609m790J600L769
2664B697J017j960l584n21N476K900o805n020O314O023n174o617K448N805J90
$$ plain form
2550 -4381 2530 2984 -3254 -4211 423 1610 -585 -1727 -1543 -818 1395 1804 -1958 -3055 2137 4043
2566 4043 -1302 -3029 2029 3629 20 -944 1237 1547 1172 1713 524 -1028 1140 3328 362 -2534
2582 -2534 648 3228 -451 -2553 534 1239 -1329 -1181 559 -1175 -2041 161 201 -2397 -1776 724
2598 724 -476 -2589 -705 836 -1418 -1999 1084 963 -2189 -762 2474 507 -1679 588 2019 563
2614 563 379 1440 574 138 2394 2450 -1109 -1031 3490 3143 -1825 -1750 2738 2403 -1274 -1346 118 222 819
2633 819 157 -2803 -2419 2026 1791 -3704 -4634 1332 2950 -2617 -4811 -512 1899 -105 -1851 -2300
2649 -2300 -1151 2304 2441 -3047 -3906 2892 5343 -981 -4509 1053 5727 2118 -2672 -1072 2697
2664 2697 3714 1754 -1830 -2351 3125 6025 -780 -5800 514 6537 1363 -5254 -2806 2999 3189
2679C189m891k702K178M371P93n442m251N394O945m660q365L100Q654q15o900
2694c402j554M681M081j182n182j729N402N226m011p677K407R389Nr484j875P758
2710B853L510m475m698K23M984L654m654p106K765Q672m07r624k857Q757M844
2725F441p042o097L530N958K37m809m258K667P578k26r216k172R452M731p558
2740g84o432M930P715j515o871j330N045M551j503o995j632Q390M933q210p040
2755f748O372Q074l391q050k62O562L078m343n658Q92O335K840o525o817N536
2770b105Q655l926r470J439Q187J205n875l625K717N336P39n659l741N019O526
2785E422k813q287J024R060J111p764k193N292L619j695m081j664L907M818k957
$$ plain form
2679 3189 -1702 -4404 -2226 2145 2938 -2504 -6755 -1361 5584 924 -7441 -4341 4313 3498 -3402
2694 -3402 -4956 -275 3806 2624 -2558 -4287 1115 6341 2330 -5347 -2940 6449 6454 -3030 -4905 2853
2710 2853 6363 1888 -2810 -2587 2397 6051 1397 -5709 -2944 5728 5321 -4303 -7160 1597 6441
2725 6441 -601 -6698 -3168 2790 3027 -1782 -6040 -3373 4205 3979 -5237 -7409 2043 6774 -784
2740 -784 -7216 -2286 5429 3914 -2957 -4287 758 5309 3806 -3189 -4821 3569 8502 292 -6748
2755 -6748 -376 7698 4307 -3743 -4005 2557 5635 1292 -4366 -3474 2861 5701 -824 -7641 -2105
2770 -2105 6550 2624 -6846 -5407 2780 3985 -1890 -5515 -2798 2538 3277 -2382 -6123 -1104 5422
2785 5422 2609 -5678 -4654 4406 5517 -2247 -4440 852 4471 2776 -1305 -2969 938 5756 2799
2800B799o638R99P389J032p372l007O024M076m373m296J360L112J485j894m518
2815c822K75O048R99o467k551N613L695m242m103K270M094m63k644j122Q65K943
2831A388J446l907k973M647M013l896l985K872L742j075k910k16J741J224j44
2846A967j851j642J831L272k075m350J671M366j615l775P74K108k28o64n00r37
2862a648P53J801n99k717J77L266K39l556j23L234ok145N61R56r17R29R21j543
2880d17o28K125P32k059o53K048O80j907k68J856n31j422J394P27k195n4K120
2897A548r19j596J038P15j123l39J126o39j301R69J588j490k059K053J776k034
2913f87j431J816O80r84N58j78j118J178K010j720k326J786L104j531l259J192
$$ plain form
2800 2799 -3839 -2840 4549 5581 -1791 -4798 1226 5302 929 -3367 -2007 1105 2590 696 -3822
2815 -3822 -3547 2501 3500 -2967 -5518 95 3790 -452 -4555 -2285 1809 1346 -1298 -2420 -1555 1388
2831 1388 2834 -1073 -4046 601 4614 718 -3267 -395 3347 2272 -638 -854 887 2111 1967
2846 1967 116 -1526 305 3577 1502 -2848 -1177 3189 1574 -2201 -1427 681 453 -211 -711 -1648
2862 -1648 -895 906 307 -2410 -2233 1033 1272 -2284 -2407 827 821 -1324 -763 193 -724 205 1126 -417
2880 -417 -1045 1080 1812 -247 -900 1148 1828 -79 -347 1509 978 -444 950 1677 -518 -572 1548
2897 1548 629 -967 71 786 -337 -676 450 -189 -1490 -521 1067 -423 -2482 -429 1347 -687
2913 -687 -2118 -302 378 -606 -48 -226 -1344 -166 1844 124 -2202 -416 2688 1157 -2102 -910
2929i10L024m03k107j01O52Q28R74j353k709J563L965j679m623R61M409O6m093
2946a536j200K897J823j356k061q55J744L030j254m730L86N740M80n569j569M721
2962F91K407k661l028O11L025J600k119l483Q56N100Q33n771k382N698L593m621
2978C49m055K488L918K32l401k639J988M441j48n574j881N466L928m817n389L316
2994a778N753j491m954q78L258L150j208m545j289N258L469m856n127L452O271
3009D485j481o429m34N441K214l269l619M69M432K468m360m814L363O594j917
3024C143o972j95O319K255m796l795K525M491J89m152l269L181N658j535p158
3039d111k76P362J996o163l661M048M764j383m775j480L884L940k211n763N1O653
$$ plain form
2929 -910 2114 1711 -396 -497 155 983 1957 604 -2105 -542 3423 1744 -2879 -1918 2491 2557 -1536
2946 -1536 -2736 161 1984 628 -1433 -2288 -544 2486 1232 -3498 -3112 2628 3108 -2461 -4030 691
2962 691 3098 437 -2591 -1980 1045 2645 526 -2957 -2101 2999 3832 -1939 -4321 1377 4970 349
2978 349 -3706 -1218 2700 2932 -469 -3108 -1120 3321 3173 -2401 -4282 1184 5112 295 -5094 -1778
2994 -1778 3975 2484 -2470 -3348 -90 3060 1852 -2693 -3982 1276 4745 -111 -5238 -1786 4485
3009 4485 3004 -3425 -3859 1582 3796 527 -3092 -2623 1809 4277 -83 -4897 -1534 5060 3143
3024 3143 -3829 -4024 2295 4550 -246 -4041 -1516 2975 3164 -988 -4257 -1076 4582 3047 -4111
3039 -4111 -4387 2975 4971 -1192 -4853 -805 3959 2576 -2199 -3679 205 4145 1934 -3829 -3778 2875
3055B875K089o384l905N235M875l253m955M64M358K255l046m367R76N627J319
3070D163n948l381N290N096l850n778J726N523M66m151k446K041M206J87m961
3085a817k428M835M451l856n549K203N817l41n174j272L546K749j484l504j063
3100b887L709K992l040m748K074N374r35n132p24M299J889k882k510P18K717J346
3116B260k364l125J581M421n43m793m30M582J337l324j927J816K191j69j780j400
3132a667J157K761j61l443q78L782J526l459j826K393J871j227j671l6P60J188
3148A070j27j838r03K122J607k444j973K003J998j583j656Q68J036k21q9k72o90
3165a092P90J477r72j818J109K058r57j542P44J212n52n45O08r0m18P91L54j248
$$ plain form
3055 2875 4964 -1420 -5325 -90 4785 1532 -3423 -2959 1399 3654 608 -3759 -2783 2844 4163
3070 4163 -1785 -5166 124 5220 1370 -4408 -2682 2841 3307 -844 -3290 -1249 2957 3144 -1817
3085 -1817 -4245 590 5041 1185 -4364 -2161 3656 3315 -1859 -3131 415 3164 1680 -1824 -2887
3100 -2887 822 3814 774 -3974 -1900 3474 2539 -2593 -3317 982 2871 -11 -2521 -1803 914 2260
3116 2260 -104 -3229 -1648 2773 2230 -2563 -2993 1589 2926 -398 -2325 -509 1682 1513 -267 -1667
3132 -1667 -510 2251 2090 -1353 -2231 1551 3077 -382 -2208 185 2056 829 -842 -878 -118 1070
3148 1070 943 -895 -1798 324 1931 -513 -2486 -483 1515 -68 -1724 -856 180 -41 -130 -402 -1092
3165 -1092 -302 1175 203 -1615 -506 1552 595 -947 -203 1009 457 -88 520 430 12 803 1157 -91
3183i1k47J418q5j334N6J175o04p47O76K66j129O4J180m33j367M84J201p98q35
3202a150P92Q9m92M16M84j094l05J607N15j830l59J894N42j358m12Q93L99O9k41
3221D59n93l48J649P90k184j164K251J610k138j768J500J465o37j271m95N02J232
3238H60K62k058j277K152K224k362k770J768K804r71k495j53J890J170p58j915
3254a629n39K440K081k353l017K034L863r91l802J9L475J075k143j996O93K595
3270A805J075k601k678K081L849j170m731M6M488J006l699k268K149K693m56k888
3286a299j683K239L312j485m536J74M868J171m517k363L410L269j642l406j78
3301b666L183K270k037l695Q06M662J198m834k471M262L625k766l980Q97L843
$$ plain form
3183 -91 -338 1080 995 -339 -283 892 288 -459 217 483 -646 -582 598 165 -1202 -718 483 -315 -1150
3202 -1150 -358 -269 -761 -345 139 -955 -1260 347 862 -968 -1327 567 1109 -249 -661 232 631 700 459
3221 459 -134 -482 1167 1957 -227 -1391 860 2470 332 -1436 64 1529 892 -379 -874 -372 860
3238 860 1122 -936 -2213 -61 2163 -199 -2969 -1201 1603 632 -1863 -2016 -126 1044 286 -1629
3254 -1629 -2168 272 2353 0 -3017 -983 2880 1889 -1913 -1894 1581 2656 513 -1483 -790 1805
3270 1805 2880 279 -2399 -318 3531 2361 -2370 -2324 2164 3170 -529 -2797 -648 2045 1589 -1299
3286 -1299 -2982 -743 2569 1084 -3452 -3278 1590 2761 -1756 -4119 -709 2560 918 -2488 -2666
3301 -2666 517 2787 750 -2945 -2139 2523 3721 -1113 -3584 678 4303 1537 -2443 -1546 2297
3316B297J056k920k681J287L807M13m385k363M139L471l233m552J557M361N2l801
3332a495j807K268L058m86l951j353L905L116l270m288K015M932l03m590r99L518
3348B70K634j794l244j41L609K363k991l924K238M840o45n094q49M462K123l082
3364G75l107J209L233Q01l162k618J905M079j069m771n52M600J705l761k882K283
3380a332L180o39k995j349K342K993j207l864j41M363J701l990k370K911L298
3395B901j505l158N4K798J526j537k588K11L439R67l429k197L096K863k229l230
3411b018Q87K870J57k151j458Q74K061K08k416j695K346K453k000k806J054K831
3427A197k94k389n08J564J211l81j424o51J593J728j286k244R90K564k11k318
$$ plain form
3316 2297 3353 433 -2248 -961 2846 3259 -1126 -3489 650 4121 888 -3664 -2107 2254 2306 -1495
3332 -1495 -3302 -1034 2024 1538 -2413 -3766 139 3255 -15 -4303 -2288 2644 2341 -2249 -3248 270
3348 270 2904 1110 -2134 -2275 1334 3697 706 -3218 -980 3860 3215 -1879 -2728 1734 3857 775
3364 775 -2332 -1123 2110 2911 -251 -2869 -964 3115 2046 -2725 -3277 1323 3028 -733 -3615 -1332
3380 -1332 1848 1209 -1786 -3135 -793 2200 993 -2871 -3012 1351 3052 -938 -3308 -397 2901
3395 2901 1396 -1762 -1708 1090 2616 1079 -1509 -1298 2141 3108 -321 -2518 578 3441 1212 -2018
3411 -2018 -1131 1739 1896 -255 -1713 -839 1222 1430 -986 -2681 -335 2118 118 -2688 -1634 1197
3427 1197 903 -1486 -1994 -430 781 400 -1024 -1675 -82 1646 360 -1884 -894 1670 1459 -859
3443h59n0J829N91j150n35J19O89P11n63j372L47J750k61j945mJ576J05j374l21
3462g17P37N5k06p2m33k70P97L72j042m56J055M36r16k69Q24q7m21M42M43n91
3482c19j22Q45l0n79J77O24k32l04N14J8n59L59P16p12p16O00R38q15q10N09N56
3503F58m64k47P1l70L55N76o16j283Q20J370q01j537M50J505k26j078q3N45M20
3522F5J95o00p91P12J576m95j919K69K213J29j829n05J340J005o33j084l01J051
3540C98J247p11j990J03K563K67k603j036K157J315j364j708L19J539O79j061
3556A14j842L80K461M01k731j219K501K012k035k288J021K400K13j953j164J056
3572f73K276L9k787j092K816K224k328k883J569L281m80k860q74K138J792j030
$$ plain form
3443 -859 -909 920 1511 361 -174 -55 634 1345 782 -590 -243 1507 1246 -699 -703 873 978 -396 -717
3462 -717 20 75 -131 -203 -636 -906 -109 263 -779 -1235 -180 256 -660 -929 -105 -192 -613 -171 272 -319
3482 -319 -441 404 374 -205 -28 596 364 60 574 592 33 392 1108 396 -320 280 1218 403 -407 102 658
3503 658 194 -53 18 -352 3 579 -37 -1320 -500 870 69 -1468 -1018 487 261 -817 -900 -355 65
3522 65 260 -340 -1131 -419 1157 662 -1257 -988 1225 1354 -475 -980 360 1365 732 -352 -653 398
3540 398 1645 934 -1056 -953 1610 1877 -726 -1762 395 1710 346 -1362 -1043 496 1175 114
3556 114 -1728 -1348 1113 1514 -1217 -2436 65 2077 42 -2246 -1225 1175 1388 -565 -1729 -673
3572 -673 1603 1642 -1145 -2237 579 2803 475 -2408 -839 2442 1962 -898 -1772 366 2158 1128
3588A128k507m85K821J837k534l002J775L525q29l570n04L052J485k005k292M40
3604a665K797J011k694k470J993L599r34m167jL794J329k904k215J651K765qk734
3621h53j625K351K969j252l851J40M045J222l691k196K447K835r95l003o05K548
3637D86K057j616l275K80L808R19l589k201K956K880j740l147K66K851J236k085
3653H6k343P42L186O11l327j870K998K953k200l419R80L362L90k740j614J634
3669e71K661k89k915j323K904K548k367l384J287L618p0l258j061K255K115j039
3685A111k580l12K392J867k161k832J273L488l30l483p14K864J549j751k081M79
3701a221K226Q71j952k050J303K838m19l253l50K991J249k499j738J460J950k32
$$ plain form
3588 1128 -1379 -1864 957 2794 260 -2742 -967 2558 1729 -1841 -2345 707 2192 187 -2105 -1665
3604 -1665 1132 2143 -551 -3021 -1028 2571 1637 -2530 -2531 1263 2592 -312 -2527 -876 1889 1881 -853
3621 -853 -2478 -127 2842 1590 -2261 -2121 1924 3146 -545 -2741 -294 2541 1546 -1457 -2062 486
3637 486 2543 927 -2348 -2068 1740 2659 -930 -3131 -175 2705 965 -2182 -1916 935 2171 86
3653 86 -2257 -1515 1671 2282 -1045 -2915 83 3036 836 -2583 -1603 1759 2149 -591 -2205 -571
3669 -571 2090 1801 -1114 -2437 467 3015 648 -2736 -1449 2169 2099 -1159 -2220 35 2150 1111
3685 1111 -1469 -1781 611 2478 317 -2515 -1242 2246 1916 -1567 -2281 583 2132 381 -1700 -1221
3701 -1221 1005 1876 -76 -2126 -823 2015 1596 -1657 -2007 984 2233 -266 -2004 -544 1406 1174
3717A174j817q91J256J919o08k468k09K536J052k378j586J767J855r96j530q9
3733a013J293Q92o59j419o7J755P94j765j293J576J432j114j453N56J226j4q52
3750a25m65K25P67M50j162p02R48J059q78j263P30J039l80p74R7L78N5R0k47k82
3770d40K59N26j57p85L68P07l25n21M15N30n95j86N33R9n78J49M18j89k35J61
3790A54P5k77K50J69m82m05R42J66r56l98R49M62r88l78N44K97q9k58m52R1Q31
3811B47L38j311l96J324Q61j156j034Q84J029l03q95j22O77O98r0j167n13J422
3829D93J070j318j531J096J808o90j763P1J312O40q15j205l0J396P28j478j544
3846a760J069K145p87k297M6K167N77j527j248P27J603L51j536j350J382K195
$$ plain form
3717 1174 -643 -1534 -278 1641 1033 -1435 -1644 892 1944 -434 -2020 -253 1602 606 -924 -1013
3733 -1013 280 1172 513 -906 -973 782 1576 -189 -1482 94 1526 412 -1041 -485 741 727 -125
3750 -125 -590 -365 402 852 -310 -1012 -64 995 117 -1146 -416 623 243 -531 -434 -56 -1 89 -158 -440
3770 -440 -181 345 188 -597 -229 478 153 -368 47 577 -18 -204 329 428 -150 -1 417 228 -7 154
3790 154 229 -48 202 371 -111 -516 426 592 -364 -762 187 649 -339 -717 -173 124 35 -223 -675 -584 247
3811 247 585 -726 -1122 202 1063 -93 -1127 -243 786 483 -412 -534 143 841 751 -416 -929 493
3829 493 1563 245 -1286 -190 1618 928 -835 -764 548 1188 373 -832 -862 534 1262 -216 -1760
3846 -1760 -691 1454 667 -1630 -1584 583 1160 -367 -1615 -888 715 1066 -470 -1820 -438 1757
3862A757p48k638P9K794P68k209j437J521J981m34j941q67J664J869r83k685J90
3879a319K940P94k910j658K070K184j182k500k1K154J266j580k372M18K993O18
3895A895l182j635K540K652j884k883O50K779Q00k169j891J325K837m1k907j393
3911b507K948K391j915l125J094L346J20k820j305J893K193n60k907o86K759K019
3927B938k337l018J240L440k72l619p21K538J878j593k521P8K617J294k342k556
3943b956J566L334n43l368o12L034J874k343k220R37K742L93k135j727J640K818
3959B434n60l354m50L351J514k618k185J359K636j95k514j128J824K083r11k879
3975a593k27K798J378k703k366J991K487q45k634l56K058J482j355k241L29K618
$$ plain form
3862 1757 1009 -1629 -1550 1244 2012 -197 -1634 -113 1868 1434 -507 -1374 290 2159 1176 -1509 -1319
3879 -1319 1621 2415 -495 -2153 -83 2101 919 -1581 -1602 552 1818 238 -2134 -1716 1277 1895
3895 1895 -1287 -2922 -382 2270 386 -2497 -1847 932 1732 -437 -2328 -1003 1834 1793 -1114 -2507
3911 -2507 441 2832 917 -2208 -1114 2232 2352 -468 -1773 120 2313 1753 -1154 -1840 919 2938
3927 2938 601 -2417 -1177 2263 1991 -1628 -2349 189 2067 474 -2047 -1969 648 1942 -400 -2956
3943 -2956 -1390 1944 1401 -1967 -2579 455 2329 -14 -2234 -1297 1445 1838 -297 -2024 -384 2434
3959 2434 1874 -1480 -1930 1421 2935 317 -1868 -509 2127 1932 -582 -1710 114 2197 1286 -1593
3975 -1593 -1820 978 2356 -347 -2713 -722 1765 920 -1714 -2070 -12 1470 115 -2126 -1797 821
3991H21P88k382j783J941K713j217k714L40K520Q50j793j493Q46J949N18k134
4007b30j359J986J900j055k456K87K531M48k279j009J208J395m53j570p08J312
4023e2J619j257k138O59K107q7j920p52J648J091r80j174K23J090M70o56j208
4040a317L85J806J54j845l01J635P71j077q17O22P75K8o80k10K93O72L4q47m65
4059c84J039M79j175n61Q58M05o06l06K3J95N6k08j93j51K19K12l36m04M82L97
4079D1o93j96Q47l0o52K54N52j25l36J55L06J15L2q1j33K03M33o8q35J03J235
4100A127k74j179P1J103L4q88k56L04N49mo69o22M07R28j96j382k29J530M63j518
4120g01p73J197Q23n76q62k43Q06J015m36j585K41J826L90j527r26J429J539r17
$$ plain form
3991 821 1609 -773 -2556 -615 2098 881 -1833 -1493 1027 1877 84 -1409 -563 1386 1904 -230
4007 -230 -1589 397 2297 1242 -1214 -927 1604 2052 -227 -1236 -28 1367 914 -656 -1364 -52
4023 -52 1567 310 -1828 -1169 938 851 -1069 -1821 -173 918 -62 -1236 -1013 77 547 -109 -1317
4040 -1317 -932 874 1028 -817 -1118 517 1288 211 -606 16 791 819 139 -71 222 894 928 81 -384
4059 -384 655 1134 -41 -602 256 661 55 -251 -228 -33 23 -185 -378 -529 -310 -98 -434 -838 -356 41
4079 41 -652 -848 -1 -31 -683 -429 123 -2 -338 -183 123 238 270 189 56 259 692 624 -211 -108 1127
4100 1127 853 -326 -255 848 882 -6 -262 42 591 587 -82 -704 -297 631 435 -947 -1176 354 817 -701
4120 -701 -1474 -277 546 -30 -892 -1135 -329 686 250 -1335 -1094 732 1122 -405 -1331 98 1637 720
4138G20j693L21J512N04q93j167K15J779M23k046j016J692J554j290j768K53J901
4155A001L78j859j068J030J481K9j962j104J922J977j696k347R12K461q7k024
4171i56r83J538J796o67k013l36J978J603j581k311R29K931R7k961q65K343J673
4188B215j214k224L2K382J130k098k120J282K619k55k924j102K857J859k262k364
4204b187R77K421M21k297j692J419K891p45l144m46L070J521k385k409J544L043
4220B002m89k679q25K037K078j093k709r3L141J326k847k184K040K860q83k996
4236a314m51K599J436j840k162N56K583P99k639k112K126K813j313l130J63K915
4252A029Q54k112j975J110K589j27k578j118K104K348j215l087L95L276M97k731
$$ plain form
4138 720 -973 -652 860 1364 471 -696 -481 1298 1721 -325 -1341 351 1905 615 -1153 -900 1001
4155 1001 1379 -480 -1548 -518 963 992 -970 -2074 -152 1825 129 -2218 -1306 1155 1068 -956
4171 -956 -1939 -401 1395 728 -1285 -1621 357 1960 379 -1932 -1003 1928 2025 -936 -1801 542 2215
4188 2215 1001 -1223 -1191 1191 2321 223 -1897 -615 2004 1749 -1175 -2277 580 2439 177 -2187
4204 -2187 -1210 1211 1632 -665 -2357 -938 1953 1208 -1936 -2382 688 2209 -176 -2585 -1041 2002
4220 2002 1513 -1166 -1991 46 2124 1031 -1678 -1771 1370 2696 -151 -2335 -295 2565 1682 -1314
4236 -1314 -1765 834 2270 430 -1732 -1176 1407 2206 -433 -2545 -419 2394 1081 -2049 -1886 1029
4252 1029 1883 -229 -2204 -1094 1495 1368 -1210 -2328 -224 2124 909 -2178 -1783 1493 1990 -741
4268g41j273J832K061o11k315p23K273J676j528k376N65K733N34k652j478K202
4284A79J911j365j933m6J899R84j369k028Q02K417J03k635r40K056J795j413k209
4301a792O74K039L93j667j153Q10J867M9k125q96K163J469j671j745Q46J975j
4318A235j786o70J293J156n98j351l09J551R59j325j696J044J778l47j689l27
4334a082J335P70p85j083K04J146L78r44j036N98J560m24j624J16J491J25j002
4351b57m19M61P18j6p69l48N44P08k68r07J4Q82K24r32k08P86J51n18q0K44m9
4372c9J38R2m84J74K48O4m10j6M68Kn32J59N86k96n18K65N45k83k81K0K23P1M2
4395B38m34j70L96N68m91o82M68Q36k46j167J23R05J95p85l56K82O82J43p73p70
$$ plain form
4268 -741 -2014 -182 1879 1268 -1047 -1770 503 2179 651 -1725 -1160 1573 2107 -545 -2023 179
4284 179 2090 725 -1208 -1254 645 1629 260 -1768 -966 1451 1554 -1081 -2021 35 1830 417 -1792
4301 -1792 -1118 921 1314 -353 -1506 -696 1171 1220 -905 -1801 362 1831 160 -1585 -739 1236 1235
4318 1235 -551 -1221 72 1228 630 -721 -1030 521 1480 155 -1541 -497 1281 934 -755 -1082
4334 -1082 253 1023 238 -845 -641 505 883 -61 -1097 -499 1061 637 -987 -871 620 745 -257
4351 -257 -676 -215 503 487 -282 -630 -86 622 354 -553 -539 343 567 -365 -573 213 364 -154 -234 10 -39
4372 -39 99 191 -293 -119 129 193 -217 -233 235 237 -295 -136 450 154 -364 -99 446 163 -118 -98 125 196 238
4395 238 -196 -366 30 598 107 -575 -107 729 483 -684 -561 344 539 -246 -602 -320 362 505 -268 -1038
4415a038R46J039o54j361L20J487J18j403n48J182Q13m91r85j80R69J047q69j554
4433a162M93J916p6j855m91J628R21r85j432L34J569L72j173j360P87J770j20
4450A136k174n98K071J072j597j497P05J857K3j538r87J163J614m25k022m55K151
4467D99J226j748j767J114K185l41k037m47J691J379r06k030M8K245R06k002j826
4484a811J584K148n66k580j67K088J079j474j778L19K158O42k212j627J764K274
4500A841r57k759k8K599J083k060j798J113K176L7k066j317J975K182j149k692
4516a820J45L000Q81k517j688J762K312p39k332n75K236J655j490k400M83K768
4532A681M71k748j474K112K145j163k604M5K302R13j678j940O49K569K05k651
$$ plain form
4415 -1038 -92 947 293 -1068 -748 739 857 -546 -1094 88 901 410 -575 -755 214 1261 392 -1162
4433 -1162 -669 1247 1171 -684 -1175 453 1374 389 -1043 -709 860 1232 59 -1301 -514 1256 1136
4450 1136 -1038 -1636 435 1507 -90 -1587 -882 975 998 -540 -1527 -364 1250 825 -1197 -1652 499
4467 499 1725 -23 -1790 -676 1509 1168 -869 -1316 375 1754 848 -1182 -1134 1111 2017 15 -1811
4484 -1811 -227 1921 1355 -1225 -1392 696 1775 301 -1477 -1158 1000 1642 -570 -2197 -433 1841
4500 1841 884 -1875 -1903 696 1779 -281 -2079 -966 1210 1247 -819 -2136 -161 2021 872 -1820
4516 -1820 -1675 1325 2206 -311 -1999 -237 2075 1336 -996 -1571 665 2320 830 -1570 -1087 1681
4532 1681 2152 -596 -2070 42 2187 1024 -1580 -1535 767 1680 2 -1938 -1289 1280 1485 -1166
4548a166j228K194K159j608k319L63K566N16k013j321J229K159j39k410p01K160
4564D41J768j677k251Q96K483R3k211r61J664J575p62j843m20J980J219j689k002
4581a697J052K146j77k350o67J909J206j212j626K02J601P75j521j575J119J952
4597A137l08k075m86J938J069j302j467O80J640K34j232r27R29J503k48j830j76
4614i21J650J004j447j240Q21J485k58j299n50R13R41m13j472r7J362O50j307
4631a78j104Q96J213n79j364N8J027M52o07p70J64R14L50q51p98P86R95m10j009
4650h15L44Q75J68o68k61M43M49J11m62k76M15N43k81q36K85P15k90n48Q5L85
4670C81j03j81j43L5j7O4q6k53M7J87j74k50K16K11l16l93M94K72l64k98M36L33
$$ plain form
4548 -1166 -2394 -200 1959 351 -1968 -1605 961 1477 -536 -1857 -628 1531 1392 -1018 -1719 441
4564 441 2209 532 -1719 -823 1660 1753 -458 -1419 245 1820 1058 -785 -1205 775 1994 305 -1697
4581 -1697 -645 1501 1324 -1026 -1693 216 1422 210 -1416 -1214 387 1162 -359 -1934 -815 1137
4597 1137 829 -1246 -1732 206 1275 -27 -1494 -814 826 1060 -172 -1099 -170 1333 1085 -745 -921
4614 -921 729 1733 286 -954 -133 1352 1094 -205 -755 158 1099 686 -786 -883 479 1129 -178
4631 -178 -1282 -386 827 248 -1116 -1058 -31 421 -186 -956 -792 122 472 -379 -1177 -391 604 194 -815
4650 -815 -471 404 572 -96 -357 86 535 646 184 -92 323 866 585 -251 34 749 459 -89 -4 381
4670 381 278 97 -46 -11 -28 36 -50 -303 -256 -69 -243 -493 -277 -66 -382 -775 -281 -9 -373 -671 -235 98
4692I8k38k62J84J86K39M9m14k05Q28L59p76m53P11P94o41o56K01P90R9p87m01
4713b95K05Q49n4r39o68J076P69q38j339N63J304r7j449l18R95P27l72j241PJ170
4733E5Q21j109j269Q44J691l29j616k55J595R11j028j240L21J720K88j456r78
4750a034J029J744n78k001j30J897Q71j731j299Q94J606j80j819o45J300J463
4766A387r83j892J11K045O99k050j302J366J899o26j996k16J619J197j029j825
4782a596M46K266M19k137j242J875J899r94k196J87K071P83j403j643Q28K033
4798A596J87k364r34J889J701j400k212M39K261L85j980j336J248J901l45k244
4814a208p21K194J407j541k277Q54K422K39k345r77J730J742p98k083j89K132
$$ plain form
4692 98 -140 -402 -218 -32 207 256 -158 -363 465 824 48 -405 306 1100 459 -197 4 794 893 106 -295
4713 -295 -90 759 705 -234 -902 174 943 105 -1234 -671 633 536 -913 -1231 -236 491 119 -1122 -1115 55
4733 55 876 -233 -1502 -658 1033 704 -912 -1167 428 1339 311 -929 -608 1112 1400 -56 -1034
4750 -1034 -5 1739 1161 -840 -970 927 1798 67 -1232 -338 1268 1088 -731 -1376 -76 1387
4766 1387 404 -1488 -1377 668 1367 -683 -1985 -619 1280 654 -1342 -1558 61 1258 229 -1596
4782 -1596 -1150 1116 1535 -602 -1844 31 1930 936 -1260 -1073 998 1781 378 -1265 -437 1596
4798 1596 1783 -581 -1515 374 2075 675 -1537 -1098 1163 1548 -432 -1768 -520 1381 1036 -1208
4814 -1208 -1929 265 1672 131 -2146 -1292 1130 1369 -976 -1953 -223 1519 721 -1362 -1551 581
4830E81J308j723j987J144K401r7k487p51K160J510j427j965L80K067P53j933
4846f6j448J148K085m43k400n54K238J213j696j877Q86K093Rj969r14J452J581
4863A338o36k200k03K317Q96j754j612J200K030m35j978l14J503J333r67j609
4879a091M5J832Q13j758j200J236J789o55j838k10J716P39j115j315M11J521J70
4896A090j437r98J274J389o83j825J37J580M02j155r49N62J335j36j115o86J096
4913a19R83m84j461K36J419K89j077q12R71Q62k99r16k48Q58P47o60q95J14J135
4932F43L31j211m85Q71P79o05q79K31O61K78n05p03K43P48Rp99l54P95M96n18
4952B6o42M04N18j28l99j01J85L11M9l21k92L58N01n73j99K42M89m09j32R8J80
$$ plain form
4830 581 1889 166 -1821 -677 1724 1627 -860 -1611 549 2059 632 -1333 -953 1114 1867 -66
4846 -66 -1514 -366 1719 1276 -1124 -1678 560 1773 77 -1800 -914 1179 1188 -781 -1695 -243 1338
4863 1338 702 -1498 -1701 616 1512 -242 -1854 -654 1376 941 -1037 -1351 152 1485 518 -1091
4879 -1091 -1046 786 1599 -159 -1359 -123 1666 1011 -827 -1037 679 1418 303 -1012 -601 920 1090
4896 1090 -347 -1345 -71 1318 635 -1190 -1053 527 929 -226 -1175 -613 722 586 -529 -1215 -119
4913 -119 864 380 -1081 -845 574 863 -214 -1026 -55 807 508 -408 -656 202 949 289 -606 -492 643
4932 643 974 -237 -722 149 928 323 -556 -325 336 614 109 -594 -351 397 406 -393 -747 48 544 26
4952 26 -616 -212 306 178 -221 -322 -137 174 223 -98 -390 -32 469 -104 -303 -61 428 19 -113 -15 165
4973A65j78l6J21k8P5J1o2j25J28J13k84o2L68K5m23L0L89j22l30n5K54L04j01
4996A77m66n2L21L47l02m23O9Q04q5p34l28R07M63o99n57K84O82J46p59m62O07
5017f0P48j62j151o9J169M73j061p19N74J160l78j043k11Q39Q13o05j146P0J389
5036F30L67j317q86J163J162o27j291j45J498O62j168j025M33J419J42j488q01
5053a272J315J302q25j759L56J694L92j655p84R36J384m55j499m83J561J156j171
5070A93j594O01J924L9j779q72J547J228p81j499K3J571Q15j329j446P86J894
5087A321q7j963o05J710J191j127j632L63J682N26j686j094J072J564k48j964
5103i77n70J958J086j347j722O63J882J19j683q49J110J522n09j868j26J897Q98
$$ plain form
4973 165 -13 -49 72 44 119 130 68 -57 71 184 -100 -162 206 231 -192 -162 227 105 -225 -280 -26 278 177
4996 177 -289 -341 -20 327 25 -398 -329 475 390 -344 -672 235 698 -1 -558 -274 408 554 -205 -667 -60
5017 -60 688 526 -625 -694 475 948 -113 -832 -258 902 524 -519 -730 109 922 317 -829 -759 630
5036 630 997 -320 -1206 -43 1119 492 -799 -944 554 1216 48 -977 -544 875 1017 -471 -1272
5053 -1272 43 1345 520 -1239 -883 811 1203 -452 -1236 -300 1084 629 -870 -1353 208 1364 193
5070 193 -1401 -800 1124 1163 -616 -1488 59 1287 506 -993 -970 601 1416 87 -1359 -573 1321
5087 1321 1234 -729 -1334 376 1567 440 -1192 -829 853 1379 -307 -1401 -329 1235 987 -977
5103 -977 -1547 411 1497 150 -1572 -909 973 1092 -591 -1440 -330 1192 683 -1185 -1311 586 1484
5120A484j612j494J114J806k05j923m01J494J254q61j797K16J789P24j614j457
5136a483J230J796m41k052j91J794R40j358j549M21J832J56j557j060J294J609
5152A381q23j920k4J996O77j600j176Q95J511k09j394o18J306J272q16j588K60
5169h70J733M11j545r71J291J348n44j476k32J422Q46j141j211M05J627O0j598
5186d45o37J207J013p17j333J79J192M09j009q77M63J197K9j346n35J075J027
5203H92r23r96L00J231J18r97m13O66P12j33r86j19R40N91o42p88L77R63O9j010
5223a48l02O92N73l23o27j44O10M22o10p14M56O23n9q98k73P38L35n44l41J32
5243d02L83J16k85m92L12O12j29o02n3N78K21l72j42J57K86R4k89j09J03L29k6
$$ plain form
5120 1484 -128 -1622 -508 1298 1093 -830 -1231 263 1517 656 -1141 -925 864 1588 -26 -1483
5136 -1483 -253 1543 1102 -950 -1141 653 1593 235 -1314 -893 939 1095 -462 -1522 -228 1381
5152 1381 558 -1362 -1386 610 1287 -313 -1489 -594 917 708 -686 -1304 2 1274 458 -1130 -870
5169 -870 863 1274 -271 -1242 49 1397 853 -623 -855 567 1413 272 -939 -534 1093 1153 -445
5186 -445 -1082 125 1138 421 -912 -733 459 868 -141 -1018 -555 642 671 -675 -1210 -135 892
5203 892 -31 -1027 -727 504 622 -375 -788 -122 590 457 -529 -648 292 883 241 -547 -170 793 862 -148
5223 -148 -450 242 815 492 -135 -279 331 753 143 -571 -115 508 449 -449 -722 16 351 -193 -534 -402
5243 -402 -19 97 -188 -680 -368 244 115 -487 -540 38 259 -113 -255 -98 188 282 -7 -116 -13 316 290
5264B90k38q8L63J5k41p8K65%j81K5N4j33K8K6j9j33K8j45L3R2q4j1k73J46K95
5289C6k59l20K45K72j65k32K9L30J37j68j82Q2K81K99l01m33L48N36k47n76J19
5310a69Q29Nn09m27K77O27ro49k05M33O39n72q68K16R56j2r57m39O92P34m46q47
5332g01p9Q07N01o69r37M37J166j2j121o26J245Q45o51j120M02J118K16j089m99
5351g67O61J143j37j323m01J432P07j099j043N25J396o3j442l99R56R90n37j383
5369g84m0J182P27j222j278R11J368l16j379m25J262Q72q79j319M55J379L19j236
5387d03r41J073J541p41j568qJ657N87j193r33O38J401Lj403o09J070J218o42
5405G47j550J8J579O24j495r96Q45J373l77j465l59J183J109j060j529M33J608
$$ plain form
5264 290 52 -36 327 342 101 23 288 288 107 132 186 53 81 107 88 -45 -17 -162 -129 -37 -121 -132 -405 -259 36
5289 36 -223 -543 -298 -26 -191 -423 -394 -64 73 -95 -277 -195 86 385 84 -349 -1 535 288 -288 -169
5310 -169 660 665 156 -271 6 633 624 -25 -230 203 842 270 -598 -382 574 562 -395 -834 -142 592 146 -701
5332 -701 -780 27 528 -141 -1078 -641 525 513 -608 -1234 11 856 205 -915 -513 605 821 -268 -767
5351 -767 -106 1037 900 -423 -824 608 1315 216 -827 -302 1094 1031 -411 -810 146 1136 599 -784
5369 -784 -824 358 1085 -137 -1415 -504 864 548 -831 -1256 6 878 -1 -1320 -865 514 833 -403
5387 -403 -1344 -271 1270 529 -1039 -1047 610 1197 4 -929 -291 1110 1113 -290 -899 171 1389 747
5405 747 -803 -785 794 1418 -77 -1073 -228 1145 768 -697 -1056 127 1236 176 -1353 -920 688
5422F88J96j482r23J218J272o36j433N5J313P04j033j072N53J420J30j505o29
5439a164J367J096p46j394J51J529L34j077r57Q04J221l36j218m94J325Q41r77
5456C05j307N12J270R6j224q02R97J111o34j158j11J234O16j041j076N48J337
5473F73m4j359k21R54P58n90j069K74J230K54r85p40N92J122j89j026k76J041
5491C99O59q87q33N51P27J73p89o69O45Q12l19r93L8P68L33o62p61N44P64j76
5511C24p91j22N30N42l42p98R1P22K13p07l79N69N58j89o97J21M57L03k30m77
5531c02K04M84J07l93l83L79M54k79l55Q2J55J22l03j52J75K11J7k57j95K21J69
5552A61p3l94J80J46L8j93Nj4L6J81j70k9J2M3P5j43k4J03J35k0j96K27q9j8J27
$$ plain form
5422 688 884 -598 -1521 -303 969 333 -1100 -1045 268 972 -61 -1133 -580 840 970 -535 -1164
5439 -1164 203 1299 553 -841 -690 839 1173 96 -861 -57 1164 828 -390 -884 441 1282 305
5456 305 -1002 -490 780 876 -348 -1150 -153 958 324 -834 -945 289 905 -136 -1212 -664 673
5473 673 629 -730 -951 3 761 171 -898 -624 606 860 -125 -865 -273 849 660 -366 -642 399
5491 399 1058 171 -662 -111 616 789 0 -669 -24 788 469 -524 -486 282 615 -47 -808 -264 500 324
5511 324 -467 -589 -59 483 141 -657 -566 156 369 -338 -717 -148 410 221 -476 -355 102 405 175 -302
5531 -302 -98 386 493 100 -283 96 550 271 -84 -2 153 275 -28 -180 -5 206 223 -34 -229 -8 161
5552 161 88 -306 -126 20 58 -135 -130 -144 -108 73 -97 -126 -114 -71 4 -139 -163 -60 75 55 -141 86 -3 -21 106
5577A06M3k06J50J95o4j84k9j14K61O6j46p5m7K27O1l46k64L73K60k90k02P8K07
5600F0J17k53k69J84M12r0m77K7L77L01m02m67K76N00j01m38r8L93L28j92m76
5621b88o5N52L69n26n10K51P37j05o65k78P39N27o29o00K1P86K77o66n94O56O38
5642F27k64r36Q8O57M72o51p70L95Q51Q1q72m09P48P61l92j088J21R76L20r47
5662b32n89O57Q38n6j164k05R38O64p17q64L02J067J69j202n18R74Q52o34j010
5681g30Q8J064M77q10j057N70J186n5j147n30J075R06q49j102L69J241J37j105
5699b72o85P77J047k37j300j61J157O28q32j053N15J191j27j106m31Q73Q80m90
5717C74j131N7J052N11q80j004O29J236k31j162k70R34Q34q36r17K59J209R8q90
$$ plain form
5577 106 149 -57 93 288 224 40 11 -103 158 224 78 3 -44 183 244 -102 -366 7 267 -23 -225 -147 60
5600 60 177 -76 -345 -161 251 161 -316 -289 88 389 -13 -480 -204 296 195 -243 -341 52 380 188 -288
5621 -288 -353 199 568 42 -468 -217 520 415 -250 -528 211 738 109 -491 -470 316 593 -73 -667 -11 627
5642 627 363 -573 -485 172 644 -7 -777 -382 469 550 -322 -731 17 778 386 -702 -581 395 715 -232
5662 -232 -821 -164 674 618 -546 -751 187 851 134 -730 -428 639 808 -394 -912 62 914 280 -730
5681 -730 -642 422 899 89 -968 -398 788 733 -414 -944 131 1037 188 -914 -545 696 833 -272
5699 -272 -957 -180 867 630 -670 -831 326 954 122 -931 -416 775 648 -458 -889 -16 864 374
5717 374 -757 -700 352 863 -17 -1021 -392 844 613 -549 -819 115 949 113 -804 -545 664 762 -128
5736a28p18O55J066k11j324m0J136M25q14q75N71R56l3j029m13Q89O43l90j011
5755f45oJ076K97r97p34P83Q44j67r82k59P88P30o17q82J81J100K61r62o25O84
5775a32R69l96j010K8R33K81o44o54M51Q46j5q78m80P68O64m93p30J27P50K82
5795F67q59m27M33O30j23p21k30O62M57m49o67K03O54J04o23k88N17M58j80o73
5815d55J79M23K12l52m75L69N35ro20j20M02L72l01l97J30L39J09k71l54K79K86
5836B81l7l65j24M40P4l25l52L12K78j47k20n4J13M2Q9k23L8J20K7j11PO2J08
5859C3j50l8J07M3K2L7m1m7n6K46k1m1Q3j74J2N9R0M8k22P2J27j40j85P0K33n8
5885A09j16j50N4J35l4q1k45K36J98j81k64P4L82O3l47k86L79K66j82k66k3K40
$$ plain form
5736 -128 -846 -191 875 664 -660 -700 436 861 47 -828 -257 699 666 -363 -776 113 756 366 -645
5755 -645 -651 425 722 -275 -1009 -226 618 451 -531 -790 -2 728 111 -771 -590 510 771 -191 -816 -132
5775 -132 837 441 -569 -541 392 673 29 -625 -174 672 657 -221 -701 67 731 238 -492 -365 385 667
5795 667 -192 -619 -186 444 321 -400 -630 32 489 40 -627 -424 230 334 -289 -577 -60 398 218 -455
5815 -455 -276 147 359 7 -468 -99 436 427 -193 -313 89 461 160 -237 -107 232 341 70 -284 -5 281
5836 281 244 -121 -245 195 269 -56 -408 -96 182 35 -185 -239 -126 -84 5 -218 -180 -60 -33 -144 -137 -75 33
5859 33 -117 -155 -48 -5 17 54 13 -34 -90 156 135 94 177 3 15 74 164 212 -10 62 189 49 -136 -66 167 109
5885 109 -7 -157 -103 32 -2 -83 -328 -92 106 -75 -339 -265 117 180 -167 -453 -74 192 10 -256 -279 -39
5907c9M06l04k89O9L64K64m71l66N02M46k55n07qM35K63k42o10J30O47R6o47l11
5929d27N62M15l88p03P9N82J99n02m83L21P13k11o85k33P95M70m81q02K88R27
5949D36L6o99m15N44P36k09r02q7R41M40p51o28L61R97j66r11k61P43P11o13q04
5970e01O7Q71K34p78o55N28J006l54j121j73R40O85p74q08L02R36K01j023o68
5989a085Q77Q51m55r85Q0J111M08r75p19P76Q63k7j139l22R89Q33p35j015K95
6008c74J153J02j070n59P63R60m40j133l9J001M70p65r57M88J000K7j151m17R11
6027c0O76n07r86J58R60K86q77n94M49J001j34j031j83J007O10o23r63M33J036
6046F88P1r13n10Q06Q70m29r54j17Q64L97o52q04M41R99j09r84k92O63O47l88
$$ plain form
5907 -39 367 63 -226 -157 207 471 0 -366 136 582 327 -180 -188 247 510 268 -342 -212 435 531 -116 -427
5929 -427 135 550 162 -541 -462 120 319 -183 -666 -345 368 157 -528 -761 34 504 23 -779 -491 436
5949 436 472 -227 -642 -98 638 429 -473 -560 381 821 70 -558 -197 800 634 -277 -538 205 916 303 -501
5970 -501 -434 437 671 -107 -762 -234 772 418 -703 -876 64 749 -25 -833 -531 405 606 -417 -1085
5989 -1085 -208 643 188 -797 -717 394 802 -173 -892 -116 747 720 -419 -741 248 1081 346 -669 -374
6008 -374 779 881 -189 -748 15 975 535 -598 -637 364 834 69 -888 -400 600 627 -524 -941 -30
6027 -30 646 139 -847 -689 271 557 -320 -914 -465 536 402 -629 -812 195 805 182 -781 -348 688
6046 688 759 -154 -664 142 1012 583 -371 -488 376 773 121 -683 -242 757 648 -336 -628 35 682 294
6066B94q33M8P07L25p10o31N29O77r3r86q7R01L72n56o75K74Q04N2p04l40N21
6087a11P31k93p57j00Q96L40o63n53M18N80m9n78k04M70M81m53m69P0M52L49o24
6108f7l73L44N11j91o07l6M51K51l80k90J36L98Q8m43k43L59L20j92m79J90L65
6129A12L9k13j53J82K84j21j31j71K66K73j73k50J4L22J6l54O3NK31j94j60O1
6151e2N4N4m1o6p9J73k7r8L5k1m0l1M2L5j30L5%M6P2j29L2K6J83j35j7O9J22O9
6179A81j81p2Q7K82k12k51J43K89L9l26q1J53K66p6m63J02L33J66m79k09K52K77
6201B20r6m34k5L23L16l33k97L7L28J96m32k81L27M12l5o08qM26M20m02n24K69
6223b01N23J47n96l29N68M14j94o05r7O96L23o99l87K12P42M5p80k62N15N81m03
$$ plain form
6066 294 -539 -491 216 541 -169 -800 -271 406 313 -673 -760 141 513 -43 -718 -444 360 412 -292 -632 -111
6087 -111 620 327 -430 -530 366 706 43 -510 -92 488 439 -139 -343 127 608 155 -314 -244 208 557 -67
6108 -67 -440 -96 415 224 -383 -419 32 283 -97 -387 -251 147 235 -208 -451 -92 228 36 -443 -253 112
6129 112 151 -62 -215 -33 251 130 -1 -172 94 367 194 -56 -42 280 296 -58 5 10 241 47 -113 -52
6151 -52 2 56 15 -51 -130 43 16 -82 -47 -68 -108 -139 -97 -62 -192 -157 -157 -111 -39 -168 -136 -110 73 -62 -79 -10 112 181
6179 181 0 -72 15 297 85 -166 -23 266 305 -21 -102 51 317 241 -222 -120 213 379 -100 -309 -57 220
6201 220 124 -310 -335 -12 304 -29 -326 -289 39 235 -197 -478 -151 261 226 -382 -390 36 456 54 -470 -201
6223 -201 322 469 -127 -456 112 526 332 -273 -370 326 649 -50 -437 -225 517 562 -218 -480 35 616 213
6244B13p61O4P90L16q09n68N25P76k37p58j38P18N59n82o64R2Q62K28q38n63O38
6265a37Q29m12p82p4R18M73p47p58M02J034j49r87l73Q70Q69o43j083K13J103
6284E66J80r72o33O39Q84j37j120j16R89M94n72j102M08J097J07j125m96R18Q47
6303H56n00j061l1J078M69r14p88O53J115k41j193l01J056P53q16r61K78J127
6321E79K34r80p06P72R39k77j214j53J058N93p99q52M15J110j73r62m75Q87Q40
6340H36o01j022J75J105L76r60p84O40R40j73j043j08Q03N23o51p39J90J047K44
6359G98j122m93O48R10l27r99J9Q96M19o69q11L24J024q8q55l68P04P17n23q75
6379f71J83Q76K23p71n20O11O46j58p00k15O54N72m68p53J61O74K11q20k43M70
$$ plain form
6244 213 -548 -484 306 622 -187 -755 -230 546 309 -449 -587 131 690 108 -556 -464 398 626 -212 -775 -137
6265 -137 692 280 -502 -576 342 815 68 -690 -288 746 597 -390 -763 107 976 333 -750 -537 566
6284 566 746 -226 -859 -220 664 527 -593 -709 280 774 202 -900 -492 605 712 -413 -909 9 856
6303 856 356 -705 -736 342 811 -103 -891 -238 877 636 -557 -858 198 951 135 -826 -548 579
6321 579 813 -167 -873 -101 838 561 -653 -806 252 845 46 -806 -391 719 546 -416 -891 -4 836
6340 836 235 -787 -612 493 869 -91 -875 -235 705 532 -511 -619 184 707 56 -683 -493 554 798
6359 798 -324 -817 -169 741 414 -585 -566 330 749 80 -731 -407 617 529 -326 -694 10 727 204 -671
6379 -671 -488 388 611 -160 -680 -69 577 419 -281 -496 158 730 262 -491 -330 344 555 -265 -508 -38
6399c8N67l42n62r6O77K74m32n56L44M80L6o86k12O39L49l90n34K28M95J37m20
6420d2l62K34M40p1m88j24M98L23l53l50J62L71Jl57n8K92J78j77k00j20L06J87
6442B90k95j61J57J57j29j28J20p4J04j27l0L9P9k3q5J6K4K6j15N7N7M6j85O4
6466a16K54q8o6r9K20j6n4j03J6J98K3j03k48J39K37lk76J4K76Q6l27j40J25K25
6490A74q0k99q1K31M44l21n17J67L85Q6m46k86L97L22j10m73J16L44K02l19n33
6511e97L58N83O1n96k77O03M36m30m85K12M53J76m90l66L69N05j45n55k27O14
6531B02M59n80n76K05P61M8q02k24M26N08j62q39m0P42L79o82o55L21R37kq73
6552d47k65O38O70n20n98J2Q56L99p40p16M65J003j81q76k05P34P21o59q65K42
$$ plain form
6399 -38 529 187 -375 -471 206 480 48 -508 -164 316 352 -334 -546 93 442 52 -482 -254 241 378 -42
6420 -42 -404 -170 270 199 -289 -413 85 408 55 -295 -133 238 239 -118 -176 116 294 117 -83 -203 103 290
6442 290 -5 -166 -9 148 19 -109 11 -63 41 -86 -116 -77 2 -21 -106 -90 -66 -40 -155 -98 -41 5 -180 -116
6466 -116 138 50 -16 -115 105 89 35 -68 -52 146 169 66 -182 -43 194 191 -85 -71 205 291 -36 -176 -51 174
6490 174 94 -205 -286 -55 389 68 -449 -282 103 189 -257 -543 -146 176 66 -407 -291 53 255 -64 -597
6511 -597 -239 344 405 -191 -468 135 571 141 -344 -132 321 497 7 -359 10 515 370 -185 -412 202
6531 202 661 81 -495 -290 471 519 -283 -507 -81 427 265 -574 -614 128 507 -175 -830 -509 428 426 -447
6552 -447 -712 -74 596 76 -522 -510 346 745 5 -711 -246 757 576 -300 -505 229 950 291 -574 -332
6572c32R38K36r80m54M14R74k06j170j82J048N67q65q43M11J015oj101m20P33
6591b23R13n68j011N3J143M18r78o77N52J025r7j125k62J014P92o40r68K54J150
6610G65R1j050n25O76R92m41j081P2R33N52q29r50M83J068l3j120n23R99P57n57
6630B79j212J88J195J81j028p10O89J023k58j115j15R07P85p56r98N04J081O2
6648G02j020m06P75P78m28r66J24Q64M84o98q93N26R28n8j029k78Q49O20o29q47
6668f02K50Q90L6p58n65M24Q34j22r70j62Q43L63o41o47M00P47l6p32k79N58O75
6689E06l34n90j43P34M19n31n27L20P62j99o15r5O06L46l33n91Q2N79J99n40m25
6710c70L07M96n3o44n7M03K90l86l75K0N87j09l61k37L47K70j27l62L4L37R0l00
$$ plain form
6572 -332 606 842 -138 -592 -178 796 590 -580 -762 286 853 -12 -855 -444 571 565 -536 -956 -223
6591 -223 690 122 -889 -836 307 725 -253 -930 -378 647 550 -575 -837 177 969 329 -639 -385 765
6610 765 856 -194 -719 -43 949 508 -573 -501 432 984 155 -795 -312 756 723 -397 -920 79 836 279
6630 279 -933 -745 450 631 -397 -1107 -418 605 347 -768 -883 24 809 53 -945 -441 640 702
6648 702 -318 -724 51 829 401 -565 -441 423 907 209 -684 -158 770 712 -317 -595 254 874 245 -602
6668 -602 -352 538 574 -184 -749 -325 509 387 -583 -745 98 461 -180 -827 -427 320 284 -448 -727 -169 506
6689 506 172 -418 -561 173 592 61 -466 -146 616 417 -198 -293 313 659 326 -265 -183 396 595 55 -370
6710 -370 -63 433 380 -264 -321 82 372 -14 -389 -369 218 109 -252 -489 -142 128 1 -361 -327 10 100 -200
6732b00k06K95K41o8k58N9J75J12j9k36P1L83j44j76k8J88L9j56k7O4Q3lj7l9
6756A33r6L1oK9j29OPj53O1J45j28j67J53J23j36o8M7J16k9j29j17J11J65J25
6780I4j39k36K82K94k19l35J58L32J08l54k27L51L15j23m11j07N36K21l56m91
6800c07J28N62J6n75j91M58K61l12m04n9N21K01m81m36L69N52j01p08l5O02L68
6821D29l93p30L72O42Rn01m56N08O53k18p36KP81L35n69o50L06P82k7p74k07N91
6843A49N25l72o20j05P82L33q39n69M52Q67k87p64k14P08O02o02p84J65R02K33
6863E62q07n92N80Q69l00q60j43R60M78o11r00L22R92J78j012m79P95P18k00j116
6883e66O3R66L69q59o87N36Q05o0r79l64Q46P56p77p83Q8J023L39r11p19O69J093
$$ plain form
6732 -200 -406 -111 130 62 -196 -137 38 150 131 -105 -34 349 205 29 1 189 228 72 45 109 192 189 172 133
6756 133 37 68 62 91 -38 -32 -25 -178 -117 28 -100 -267 -114 9 -127 -195 -148 -32 -61 -190 -307 -196 -31 94
6780 94 -45 -281 1 295 76 -259 -101 231 339 -15 -242 109 424 301 -110 -217 319 540 184 -307
6800 -307 -179 383 399 -176 -367 91 352 40 -364 -423 98 299 -182 -618 -249 303 202 -506 -541 61 429
6821 429 36 -694 -322 320 329 -172 -628 -120 533 315 -421 -419 362 697 128 -522 -216 566 539 -235 -442 149
6843 149 674 302 -318 -423 359 692 -147 -716 -264 603 316 -448 -662 46 648 46 -738 -573 329 562
6863 562 -245 -837 -257 612 312 -548 -691 269 747 136 -764 -442 550 728 -284 -763 32 750 550 -566
6883 -566 -503 463 832 -27 -714 -178 627 567 -412 -776 70 826 49 -734 -646 377 716 -195 -914 -245 848
6904H48n06j020j91J166M24p18q78L75J141M5j061n31Q86P76l10j155K6J240L14
6923H71r44o81N82Q47m2j056l11R18P79p55q51K13J044K8q64n90O74Q22l43r61
6943f20r1R69N23q08p60M52R38m6j129j95P48O26m96q10J65J023J09p06n73M44
6963b37Q92k26r12j29Q58M60o22p45L37P80Q2p08m77O49N75k60p30q7O92M20p25
6984a13n03M51N74r6o75r8M58L78k09o20R4O83R1n75l24L84M65j11o19MN26K40
7006D05l62m68K07L84J04l65l18L75L69j53m74j0M06K41k89l94K97J23J49l73
7026a46o6J09L42k04k94K02J21Q6k29m2J36K06j11k34p4L96l4j43n5M8J24m4j45
7049e1j3K9Q8k12J48J7m2lL2kjk3n4J09p5J16j67J2M2M9o3k04K15J91j35j70J01
$$ plain form
6904 848 342 -678 -869 297 721 3 -875 -500 641 686 -375 -906 -20 756 446 -709 -683 557 871
6923 871 -73 -754 -172 675 633 -423 -734 184 963 208 -643 -430 614 642 -222 -812 -138 684 341 -620
6943 -620 -711 258 781 -27 -787 -335 603 557 -572 -767 -19 607 111 -699 -534 489 598 -108 -681 -237
6963 -237 655 429 -483 -612 246 706 84 -661 -324 456 538 -170 -647 2 577 317 -413 -500 192 612 -113
6984 -113 -616 -165 409 313 -362 -460 -2 376 167 -453 -359 324 415 -160 -484 -100 365 254 -365 -361 165 405
7006 405 43 -425 -218 166 270 -95 -413 -38 331 178 -296 -306 100 341 52 -342 -45 78 227 -146
7026 -146 -212 -103 239 35 -259 -57 64 150 -79 -121 15 221 110 -124 -198 198 164 21 -34 14 138 94 -51
7049 -51 -64 -35 53 -159 -11 6 -36 -39 -7 -9 -10 -33 -87 22 -53 63 -104 -92 -50 -1 -64 -268 -53 138 3 -167 -66
7076f6O8K03k35k16K01K89j0l06m6J58K97k54l12J13L12Rm27l5K53L77k50m22
7098b99K3M33J01k95m47K94M80o9n41j38M18L77j73p59L13N29K02o43m21L68O16
7119C69j72n71p4O67K88m25n03J63P07k8n44l99N06O81l24o20l8P36K17p30n01
7140e95M17O97j51o81j82N86M96m19p71J96P14J70q43l76O08O58k94p13j28P37
7160A26M30n76n86L02P94Q7r37k49N52P31l74r39K23Q58L40q33m91L98O98p7o95
7181b18l79R29M91n18q75L9R57J20p46o65N82Q22j27r65j69Q50M74o36p83L87
7201d30R03O8r41l56O19P90l46r86J17Q02M74o64p60N04Q53k7q91k84O43P71m85
7222C74r18K16Q96K35q03n63N20P45k70q49k32P65O53o96p84K81Q89n0p48m72
$$ plain form
7076 -66 2 205 -30 -246 -45 244 234 -72 -118 40 337 83 -229 -116 196 205 -222 -257 -4 373 123 -299
7098 -299 -276 157 258 -37 -484 -190 290 221 -320 -458 -40 337 164 -595 -282 247 449 -194 -615 -247 369
7119 369 197 -374 -448 219 507 82 -421 -258 449 421 -123 -522 -16 665 341 -279 -317 419 636 -94 -595
7140 -595 -178 519 368 -313 -495 91 587 168 -603 -407 307 477 -366 -742 -134 524 230 -483 -611 126
7160 126 556 -20 -606 -304 490 577 -360 -609 -57 674 300 -639 -416 442 782 -51 -542 -144 554 477 -218
7181 -218 -597 332 823 305 -570 -531 426 546 -200 -865 -283 539 412 -553 -722 128 602 -34 -817 -430
7201 -430 473 541 -400 -756 -137 653 307 -679 -562 240 714 50 -710 -206 647 620 -271 -555 88 859 374
7222 374 -544 -328 568 803 0 -563 -43 702 432 -417 -649 116 769 73 -711 -430 459 409 -339 -811
7242h11N86O98k85q51P8Q49L26p64o24M92Q44o7q85k48Q10M94n01n97J26Q00J01
7263E71o77l33M61N96j36p23r9O96L27n51n64L35M61O6n77l74N41M75l13o64J9
7284d63N81K44n89l49L62M21m0n67k10N70M01l34m12J40M35J32m23k79M15K91
7304C26j29m65R8L14L18l59k28P2M85n6l43k30K82L74l00k79mL87Jk72k16J13
7326a11K71j02k74n7J60K17j76j93J9K71j2j85j28J11J97L9k12R5O7J32j57l6
7348f4J12L9po4J31p7nrN0J01K8j50M1O5j53O4j11K8kp3k9pJ19j04qk01J48J97
7376E9j03k41O9J64J07k85r8J82K43m4l09o0L23K80l32k43J32L84L1k44j41K32
7398A06L84l15l11R9L10J42m03k04J03O22k96n06p3M40K45l81l71R9O26j06m76
$$ plain form
7242 -811 -225 473 188 -663 -585 264 590 -174 -798 -306 538 471 -414 -662 148 642 141 -456 -330 470 571
7263 571 -106 -439 22 618 482 -241 -340 356 683 132 -432 -97 364 430 -147 -521 20 495 182 -482 -463
7284 -463 118 362 -227 -576 -214 207 167 -400 -610 -40 361 27 -385 -245 190 322 -101 -380 35 326
7304 326 197 -268 -170 144 462 103 -125 -53 432 376 33 -197 85 459 159 -120 -124 263 264 -8 -224 -111
7326 -111 160 58 -216 -273 -113 104 -72 -265 -246 25 13 -172 -300 -189 8 47 -165 -70 -3 129 -28 -64
7348 -64 48 87 80 16 147 70 65 56 106 207 235 85 126 191 38 102 -9 19 17 -56 -85 -92 27 -77 -85 -286 -138 59
7376 59 -44 -285 -216 -52 55 -230 -328 -146 97 53 -256 -316 7 287 -45 -288 -156 228 259 15 -126 106
7398 106 490 175 -136 -37 273 415 12 -192 -89 533 237 -269 -342 98 343 -38 -409 -310 316 210 -266
7419b66l37N15M00k05n39p1O96J79n72m22L21O88q5o37j78N55M44l28n68J75N85
7440C50J11o02l16M98N01o9p28j61O78L86m82o01K58O65L4p68l48O30N02l42o95
7461d99m2P33K75o32m38L52O41p3p26k22P40M00m66n58K2P37K27o73l77N08O38
7482E67k07p08j33P01M98n50o53K30P81M2p49l28O06M67k12p60N0P32K20o12n47
7503e65L01P22m5q05j74N80N15m67n69oQ09J68n48m69M35N35j09q25r3Q02L91
7524E83l89p76K70P09J51p29k52M18O29l08p18p0Q21J98m85o00M42N70j31o19
7544b86j53N35L92l87o18J38P43J59o80n22N20N54j53p03j0N68K94l99m13P0O92
7565C41R1p10p9L53N00m62m20N1O13J31m65l24L00N25j70m53j30M35L10l15l92
$$ plain form
7419 -266 -603 -88 312 107 -432 -503 193 372 -200 -622 -301 387 302 -335 -513 42 486 158 -410 -235 350
7440 350 461 -141 -457 41 542 473 -255 -416 262 648 166 -435 -177 488 522 -246 -594 36 538 196 -499
7461 -499 -541 192 467 -165 -603 -251 390 317 -409 -631 109 509 43 -515 -493 244 471 -202 -579 -71 567
7482 567 360 -348 -481 220 718 168 -485 -255 526 568 -181 -509 97 564 352 -408 -358 374 594 -18 -565
7503 -565 -264 458 413 -392 -566 14 529 62 -507 -513 296 464 -84 -553 -118 417 308 -517 -610 192 583
7524 583 194 -582 -312 397 548 -181 -433 -15 614 306 -412 -482 339 537 52 -548 -106 464 333 -286
7544 -286 -439 96 488 101 -517 -379 364 523 -157 -679 -159 395 242 -461 -471 97 391 -8 -421 -351 341
7565 341 432 -278 -357 -4 496 34 -386 -335 278 409 -56 -380 -80 445 275 -178 -308 127 437 122 -270
7586b70J07L93Q4l49k93K70L94j53m12mK95K53l33l57J90L25R5m27J6J56K57j83
7608E4k96M1K49J16j20k00j6L09K2k55n2K24Q0q4k32RK24O8j71j68J96P4j5j38
7632h1R1J08k7n2j41J30LP7q4j28Q7J63j35pj9rP4n5k4jk7j5N5q2R8M3P7r0o3
7661c4K4l2R9Q3p7k58J26J84Q4j98p6N5J46j25j61Q5M7J12nk12PK88M5k96nJ27
7687C3J87j49k41LK94J13m05j14L03K30j41l23J6K65J70j35l64J33L91K6m63k09
7709c80L12L24k05k16r8L54K39m21k91K04L71J7m69j08L55L76l58l96O2O58M5
7730C75n11k60L17N30k10n20o6N12L09l92n30K35N78L1o86n4L32M46k74o02J35
7751c05N43K07n24n67M83O02j32n46l17O25M17m27n39J32O06J74o57k83M35N20
$$ plain form
7586 -270 -163 230 314 -35 -328 -58 336 183 -229 -233 62 315 -18 -375 -185 140 235 -192 -176 -20 237 54
7608 54 -242 -201 48 164 44 -156 -172 137 159 -96 -148 76 156 72 -160 -151 73 141 -30 -198 -2 72 57 -81
7632 -81 10 118 91 39 -102 28 31 108 24 -104 -17 146 11 4 -15 -24 50 -5 -29 -30 -57 -72 -17 -99 -1 42 119 29 -34
7661 -34 -10 -42 57 140 63 -195 -69 115 199 1 -75 -20 126 1 -160 -75 -28 84 79 -133 -126 162 207 -89 -94 33
7687 33 220 71 -170 -167 127 240 -165 -279 24 254 113 -210 -194 71 241 106 -258 -125 266 292 -171 -380
7709 -380 -68 256 51 -165 -263 91 330 -91 -382 -178 193 210 -259 -367 -12 364 6 -390 -328 330 375
7730 375 -136 -396 -79 451 241 -279 -345 167 476 84 -446 -211 367 398 -288 -342 -10 436 162 -440 -305
7751 -305 238 445 -79 -646 -163 439 307 -239 -556 69 486 59 -480 -348 258 432 -225 -508 -73 447
7771D47k69n38k6N50K70l98o00L43O22o2o06j75O17L86l92n28J44N32J47l79n35
7792d50K58O56j79n37k64O60K46l64m99J27N63K15o04l25M78M24j51q14J22N75
7812A37K56n16m30L41N20P0n04l34N88L87l16m89J30N25J40n64l03L15N32j15
7832C70m91k74O06K69l32n84J41N56J05m31l21K80N70k78n77j7N79K40m89l93
7852d71K90L81O6n44k00M27M17k89m23Q1N56R9m06l61K21M74k2m68r0L92J94j39
7874A85m44J22L85P7l18k13J57M60k72l04j26M35J54k77l38J64M31j12l68j83
7894c85L12J93k05k84P9M01J01l79j46J49L64n7l90j7L52J42l27m6N4K15J61k06
7916H1j93J62J62j16o1p1K31L0k36p3M0J48j7j56j25J12J34k2k29R9O0P0j72n3
$$ plain form
7771 447 178 -360 -386 164 434 36 -564 -221 401 339 -267 -442 175 561 169 -359 -215 317 464 85 -450
7792 -450 -192 464 285 -252 -516 144 390 26 -473 -346 217 432 -172 -497 -19 405 254 -560 -438 137
7812 137 393 -123 -553 -212 308 378 -126 -460 128 515 199 -290 -160 365 505 -59 -362 -47 485 370
7832 370 -121 -395 211 480 148 -436 -295 261 366 -65 -386 -106 464 186 -391 -408 171 411 -78 -471
7852 -471 -181 200 266 -278 -478 -51 366 77 -346 -265 291 390 -16 -377 -156 318 296 -172 -262 130 324 185
7874 185 -259 -137 248 325 7 -206 -49 411 139 -165 -291 144 298 21 -317 -153 278 166 -202 -385
7894 -385 -73 120 -85 -369 -290 111 212 -167 -313 -164 200 143 -247 -264 88 230 -97 -143 -89 126 287 81
7916 81 -112 50 212 96 35 -36 195 225 -11 -84 -44 104 87 -69 -194 -82 52 30 -199 -100 -40 30 -142 -195
7940a95J17O6l0q6L0K6m5N4P8o0L9k8Q6j08J68p9J6J2nL3nL7pj1Qp4P7K2p2q2
7970a8M1O5q5k08J21L7J62j23k39J21K24L3k96j57K55J55j71j63kJ88J37k32l6
7993a91L7K40K4k04o8K70N3Pk49p0L10J21k96k24L21K19J8l99J3K65J86l76j75
8016a68l5L46J37l90j36J64K32n6m50JL10L03l72l32J96M22o7l96j03L37L88k68
8038F3l92J46L43J97l89l45L22M13j22m38j14N07K46l99l84J24O42P8o43j37L18
8059C6L77k70n24J04N82J59n81k74J80M75k5o40p2N03L05l01m87J64M57J26m95
8080b01k43M88L81l29n10Q3M98K46m00m08K52N56j4o17m5L14M79l90m88J78M68
8101B98J52n06k72K12M72j52m62j12M52L18m35m37K21N68j05m33l17M15N13k51
$$ plain form
7940 -195 -78 -12 -42 -128 -98 -72 -117 -63 15 -45 -6 -34 52 -56 112 33 49 61 56 89 84 121 114 103 111 37 114 136 64 -18
7970 -18 23 88 3 -205 -84 -47 115 -8 -247 -126 98 131 -165 -322 -67 88 -83 -246 -248 -60 77 -155 -191
7993 -191 -154 86 110 -94 -162 108 161 168 -81 -151 159 280 -16 -240 81 300 318 -81 -68 197 383 7 -168
8016 -168 -203 143 280 -110 -246 -82 150 94 -356 -355 -45 258 -114 -446 -250 172 105 -291 -394 -57 331 63
8038 63 -329 -183 160 357 -32 -377 -55 358 236 -202 -316 191 437 38 -346 -222 420 498 -145 -282 36
8059 36 413 143 -381 -277 305 464 -117 -391 -211 264 239 -401 -473 30 335 34 -453 -289 168 294 -201
8080 -201 -444 44 425 96 -414 -331 167 413 13 -395 -143 413 399 -218 -263 51 530 140 -348 -170 298
8101 298 450 -56 -328 -116 356 204 -258 -370 82 400 -35 -472 -251 317 212 -221 -538 -123 390 139
8121A39n88J23M29J63k55m42K42L86J06n68j11M39K62k33m52R6N02J17l67k86
8141b98L34L10k0n67o5M46K70k96m11J29M92j3m72k10L34K65j38l17k5L79J16
8162B43k50l95J46M46r2l60j08L27K82j91k88J15K54J54l85j94K37K49J32m85
8182a63p6L69J85l22k23J49K60Q9l03
$$ plain form
8121 139 -449 -326 103 266 11 -431 -189 197 303 -265 -376 63 325 92 -360 -264 238 355 -12 -298
8141 -298 36 346 326 -241 -306 140 410 114 -297 -168 324 311 -161 -371 -37 228 90 -227 -252 127 243
8162 243 -7 -402 -256 190 98 -262 -370 -43 239 48 -240 -125 129 283 -102 -296 -59 190 322 -163
8182 -163 -239 130 315 -7 -230 -81 179 268 -35
8191c5
$$ Imaginary data points
##PAGE= N=2
##DATA TABLE= (X++(I..I)), XYDATA
0@%%%%%%%%%%Qj6J6k4L2m0M8n6P2q8J05j29J53j78K10k45K85l31L81m38N03n76
32c08O56p42Q40r49J067j195J340j500J671j855K059k283K525k792L084l403L751
49A966m133M553n015N529o098O730p441Q250r172J0233j1475J2952j4741J6959
63I097j9796K3572k8877L6927n0718Q0604k58372K52732M06624o03051j94593
74c45851L67852J66416k13521J0458j0903j13344J71565K87603l23017l75440
84c78182L98915M64927m38515m49917M08113L83816l41662k28786K06770N0906
94G6385o8838J27807p7215k86813J59501M05753k23851m86490K31809M92689k33599
105A17138m37525J96615L06362j61902j30237J06520p5068m8447K65086j0642
$$ plain form
0 0 0 0 0 0 0 0 0 0 0 0 8 -8 8 -16 16 -24 24 -32 40 -48 57 -72 81 -97 113 -132 153 -178 203 -235 268 -308
32 -308 348 -394 446 -503 564 -631 709 -791 880 -975 1084 -1199 1326 -1466 1618 -1785 1966
49 1966 -2167 2386 -2629 2900 -3198 3532 -3909 4341 -4831 5402 -6073 6879 -7862 9097
63 9097 -10699 12873 -16004 20923 -29795 50809 -207563 45169 451793 -151258 -345851
74 -345851 22001 188417 -25104 -14646 -25549 -138893 32672 320275 -2742 -378182
84 -378182 20733 485660 47145 -402772 5341 389157 47495 -181291 25479 76385
94 76385 7547 135354 58139 -228674 -69173 336580 112729 -373761 -141952 350737 117138
105 117138 -320387 -123772 182590 20688 -109549 -3029 -78097 -126544 138542 127900
115A27900l97313N5446M68406o5542m66586P0709M22451o5234l10749Q2787J70743
126I3018r2508N448J16132j67124j21942L13138J20011m00413r3895M21560N9760
137B53185l77964k7491K85039j6831j78081O3812M8599j31318P1241J79756j91625
148b1678k19152K71089K15529l20944j87273L15108J20158k68791l9967J84097
158D8176m3189q7403J21205J245j86108P7530K43772j35244k63413J88892K52835
169B18298k10605j90973K16862J08516j87400r05J44936r6897q1945J79196K2270
180A21353k30596K8550K53014p1310k52283J05836K15938j43421j55149J61969
190C3901O1257j71359L1377J50751j24947j20202J87757O8404k26488j7942K27595
$$ plain form
115 127900 -269413 -213967 254439 188897 -277689 -206980 215471 150237 -160512 -77725 93018
126 93018 510 5958 122090 -45034 -166976 146162 266173 -134240 -228135 193425 253185
137 253185 -124779 -152270 132769 115938 -62143 1669 50268 -81050 -9809 169947 -21678
148 -21678 -240830 30259 245788 -75156 -262429 52679 172837 -95954 -135921 48176
158 48176 4987 -82416 38789 40034 -146074 -68544 175228 39984 -223429 -34537 218298
169 218298 7693 -183280 33582 142098 -45302 -46207 98729 1832 -80113 99083 121353
180 121353 -109243 -80693 172321 101011 -151272 -45436 170502 27081 -128068 33901
190 33901 95158 -76201 -44824 105927 -19020 -139222 48535 116939 -109549 -127491 100104
201A00104l4466k06138Q0503J66782j22205j10184J61692M4355j80542L4652J81494
212A16047j00728j47417J57798R9955j82992l1316J90715l2604j70864R4113J41579
223A34286j38959j01474J71590N5523j87585k433J78334n8676j45947J10016Q5340
234A00015j53498j9069J71805n3855j77212J08167J57951j49727j29655J63686
244A8608Q6104j61518l5215J40921k6803j05503R3785N7064j51838K167J94224
255A11996n3480k05844R7001J96052j16734j56432J23913J03269j11102l1880
265d3241R3650m1755o7932J17353M2257j81413j2907K23017j7642k33456M1915
276h0154K06406o1059j53518O7157P5925p1693N617O8303q9334o8884J57074O4988
$$ plain form
201 100104 65638 -140500 -59997 106785 -15420 -125604 36088 80443 -100099 -65447 116047
212 116047 15319 -132098 25700 125655 -57337 -88653 102062 69458 -101406 -7293 134286
223 134286 -4673 -106147 65443 120966 -66619 -69052 109282 50606 -95341 14675 100015
234 100015 -53483 -72552 99253 45398 -131814 -23647 134304 -15423 -145078 18608
244 18608 104712 -56806 -92021 48900 22097 -83406 10379 67443 -84395 -82228 111996
255 111996 58516 -147328 -50327 145725 28991 -127441 -3528 99741 -11361 -43241
265 -43241 50409 8654 -59278 58075 100332 -81081 -93988 129029 111387 -122069 -80154
276 -80154 126252 65193 -88325 -21168 54757 -16936 -11319 56984 -32350 -101234 55840 120828
288A20828k07752o0666K28988M6492k19390k4352J75811l901j05048L5497K2822
299I329o4285O1190R3092j28394j12292J77468J25076j95814j20280J90041J01536
310A36667j57053o1656J05948Q356m0229N2787k8443j09366Q7622J52462j28613
321A8482j78622J44140J80048j39836j59755J14341J13056p9050m9146L5219k8806
332b9929N528J06049m2142j72811O7127K14334p8250k24793P4819K02661n9204
343F3389j50580L9711P7920j9056Q518N969r3259K231J67706k925k17069R77K35792
356A19324K937k17794n055J67781M813r3962Q80Q383j3117P5298K9607j47138
368f8043m8999J95376O4310k16325p2830K05172O8619j65080n2028J01198K3834
$$ plain form
288 120828 -86924 -147590 81398 127890 -91500 -115852 59959 56058 -48990 -13493 9329
299 9329 -54956 6234 99326 -29068 -141360 36108 161184 -34630 -154910 35131 136667
310 136667 -20386 -82042 23906 32262 -7967 44820 16377 -92989 -5367 147095 18482
321 18482 -160140 -16000 164048 24212 -135543 -21202 91854 12804 -36342 -1123 -29929
332 -29929 -24401 81648 39506 -133305 -66178 148156 69906 -154887 -80068 122593 63389
343 63389 -87191 -47480 30440 11384 19902 25871 -67388 -65157 102549 99624 -117445 -116468 119324
356 119324 122261 -95533 -100588 67193 72006 -21956 -21076 -12693 -25810 49488 79095 -68043
368 -68043 -117042 78334 142644 -73681 -146511 58661 127280 -37800 -89828 11370 35204
379C5204k5084J1900n1255n1100J15810Q7612j59985j14244J78233J27037j70235
390a6107j20219J40068R3784r2745m9540L6132n464K1233O2525p0785j12604J05076
402h646J47383j20942j61475J18443J52054j00764j19576P2559O7987l9188n300
413B535N964n9636K2916J17331m4218j57676N7172J75312n9816j66802N5449J34811
425H3342m5565q3100L4405K0239k3694M4684J5530j02358r570J44287M497j65438
437h2741N47J61164p809j34851J5349Q9447k6020l5087L6344k2646m7258P3984
449B0423N3789j13410n4860J34838M8741j36871l4695J21491J4124r0613J2837
460b4206N0439l9095m465O3572l6647p9246P1620Q7447r3765q2356J04405O6074
$$ plain form
379 35204 10120 22020 -29235 -80335 35475 123087 -36898 -151142 27091 154128 -16107
390 -16107 -136326 3742 97526 4781 -44759 -8627 -14091 7142 69667 -1118 -113722 -8646
402 -8646 138737 17795 -143680 -25237 126817 26053 -93523 -20964 47023 7835 2535
413 2535 8499 -51137 -28221 89110 44892 -112784 -55612 119700 59884 -106918 -51469 83342
425 83342 37777 -45323 -10918 9321 -14373 30311 45841 -56517 -66087 78200 82697 -82741
437 -82741 -82194 78970 71161 -63690 -48341 41106 15086 -20001 16343 -6303 -53561 20423
449 20423 74212 -39198 -94058 40780 89521 -47350 -82045 39446 53570 -37043 -24206
460 -24206 26233 -12862 -17327 46245 9598 -69648 1972 89419 -4346 -86702 17703 83777
472H3777j00864l8654Q5821N161o2558K9984L3928o3037m969Q6671k3847j00317
484f8904M6305R7672o4095q4254P2655N7095p6371k4076P0957j3306o0184M7236
496G30M3106p4261k2592R1152jr4720K4319Q7148m4820o6568O3294M1161p2977
509b5029r256P7890j9658p1436M7173N8323o5271l6000P5892R652p6980J9223
521a5477O9724m7450n6214O9290L5876q4467j5239Q6282q117p9838K6867N9926
533D1163m6234l4088N7988L60o6409L1079O6701n9174o2339P8726N1422q6861
545b7666l3820Q4001J3302o7242J1722M4502l4022j3590N7608j5008p2944M3600
557i557Q3980o1724q2453P1956P3263o9985n2569N9653K3863m1860R389J8890
$$ plain form
472 83777 -17087 -55741 30080 35241 -27317 2667 36595 -26442 -31411 55260 31413 -68904
484 -68904 -22599 75073 10978 -73276 -621 56474 -19897 -43973 26984 13678 -46506 730
496 730 43836 -30425 -53017 38135 38134 -56586 -32267 54881 10061 -56507 6787 47948 -25029
509 -25029 -34285 43605 23947 -47489 -316 58007 -7264 -43264 32628 42280 -34700 -15477
521 -15477 54247 6797 -49417 19873 55749 -28718 -43957 42325 34208 -45630 -18763 41163
533 41163 -5071 -39159 18829 19189 -47220 -16141 50560 -8614 -70953 7773 59195 -27666
545 -27666 -61486 22515 35817 -31425 -19703 24799 -9223 -22813 34795 19787 -53157 -9557
557 -9557 74423 12699 -69754 2202 75465 5480 -47089 12564 36427 -5433 3956 22846
569B2846m4788K408P3520k2989r7149L4980J05274m4180j02554M2965Q1120l8999
581A2454n0862K8429R915j8884L2064R035p1207j090J01016l295j15380O944J15563
594E4702o104r6787Q664O6803q205k3358J3234k0025j6168O3470K3879r4630k8700
607f3225J13724L3206j14866l2851R8754K6387o9654j5738K9694k842J0626K1492
619C4707n1263m4168P9420N8764r7647p0332R6487O8953q4424n9242N8438L6881
631B6574k6982p588o434k4901L6338N7659n6259q1993O8651R8442o6384r7037
643g9914N8040Q4374l7418n4688J7139J9042O108K3905k2176o3031L3342R4937
655G9660l6142j13578L1688J14346k3655j00115J1155O7580k493k7765p114k0407
$$ plain form
569 22846 -21942 -19534 53986 30997 -66152 -31172 74102 29922 -72632 -29667 51453 12454
581 12454 -38408 -9979 -64 -18948 13116 22151 -49056 -50146 50870 47575 -67805 -60861 54702
594 54702 48598 -48189 -39525 27278 19073 -4285 8949 -11076 -27244 36226 60105 -34525 -63225
607 -63225 50499 83705 -31161 -64012 34742 61129 -8525 -24263 5431 2589 13215 34707
619 34707 -16556 -60724 18696 77460 -20187 -90519 5968 74921 -9503 -68745 -10307 26574
631 26574 -408 -7996 -14430 -39331 -2993 54666 -1593 -83586 -14935 83507 17123 -79914
643 -79914 -21874 62500 25082 -29606 -12467 6575 12683 36588 14412 -48619 -15277 79660
655 79660 43518 -70060 -38372 75974 52319 -47796 -36641 30939 28446 681 -6433 -26840
667b6840Q663O1333r039r6462J525J13747M980j16581j2645J00582J6299p0424
679b4862j4865L1335R301J3334K613n2496j4160Q6253K8763j02152l6952J06346
691C2458M4136r1343m0597O7158L2537l2173j4809l932o496L8351K9082o5601
703a1229m9899Q0406O2155q4997o7720P3820N9394n6398m4905K8767J8990l903
715D481P576k1690l7803L9123O1056n1109p6586N3920Q0347m9095p1027L9632
727b1175N2193k4313k3038J0850o420M249L8555j2627o1271K0677P8807k1570
739C4917q1784K2661P5406k0073n6164J7496K9583j4703K27J1428l0376j0250
751b1632N2935P072o9949o802P3388K108p0138P64N4219q616l4816J4919Q814
$$ plain form
667 -26840 -18177 43156 34117 -62345 -60820 52927 57907 -58674 -71319 29263 45562 -24862
679 -24862 -39727 -8392 909 14243 16856 -35640 -49800 36453 65216 -36936 -73888 32458
691 32458 76594 -14749 -55346 11812 44349 12176 -2633 -6565 -13061 25290 54372 -11229
703 -11229 -61128 19278 81433 -3564 -71284 2536 61930 5532 -39373 -10606 8384 4481
715 4481 12057 -9633 -47436 -8313 52743 1634 -74952 -21032 59315 10220 -60807 -21175
727 -21175 31018 6705 -16333 -5483 -11903 -7654 30901 18274 -42997 -22320 56487 34917
739 34917 -46867 -24206 51200 31127 -25037 -7541 22042 7339 7566 18994 -11382 -21632
751 -21632 31303 38375 -31574 -38376 35012 37120 -33018 -32254 21965 13349 -21467 -6548 2266
764B266k2961J5073K7782l6359l0041N1398K8831n7575k2344N7817J4235m8479
776b0357m37L6975j1435j8886K6046L328l4843J4479M2211k7454m1217L7982L5758
789D2150m2560k4284M2282R354l8419N868K9648k1977k0976L2992Q119m2513K566
802a7750M2873j5999m0325K5005K9659l4368j7499L8272J977l9486J2352L5720
814B0431k4044k7666L2793J7690l5570l281L6159j0157k9947K5783K3398l6194
826a0605j2048M5079K688m5859Q264M2481j5738l1817K1841J7352k5285o32K6201
839B1922j7605k6287L2355K2566m4883j9434M9055J1847m8467n907L8682l841
851A0003k5425J1910O463k0864J1363K7720k7821l2788L9806L5092m5087l2441
$$ plain form
764 2266 -20695 -5622 22160 -14199 -44240 7158 35989 -21586 -43930 13887 28122 -20357
776 -20357 -20794 16181 4746 -14140 11906 15234 -19609 -5130 37081 9627 -31590 6392 42150
789 42150 -410 -24694 17588 26942 -11477 -5609 24039 2062 -18914 14078 22197 -20316 -17750
802 -17750 25123 9124 -31201 -6196 23463 -10905 -28404 9868 11845 -27641 -15289 20431
814 20431 -3613 -31279 1514 19204 -16366 -19647 16512 6355 -23592 2191 25589 -10605
826 -10605 -22653 22426 25114 -20745 -12481 30000 14262 -17555 4286 21638 -3647 -4279 21922
839 21922 4317 -21970 10385 32951 -11932 -31366 17689 29536 -18931 -24838 13844 10003
851 10003 -15422 -3512 2951 -17913 -6550 21170 -6651 -39439 367 35459 -9628 -42069
863d2069M5165K6742l6970j4731K5324K468q697J3957o212k7788K1385M1230l0682
876I122m8123L5785M9931l4390m4408K7984L2458j9024j5279P035o311K965K6651
889B4396j3087m5702J7749N6866k0228o2101J7170N6464j3394m3772P240K3102
901D703k183O48j564k4742L351M6025k379n9554P45O5764L025o0376m809M7903
915A6557O887k6479m933K972J741K2130M723m2482j1423N6565J8241o2074k3018
928d0593N7695K3615m5336k0841K5573J2367l950k057j8451j2088L5604K4753
940C6291m7846l5860N0782M0913m6543m0239L4911L2556j9106j8825J947J334
952i685J4627J8258k6778l5017L4316M8350l4565n3864L0531N2321k1091m1351
$$ plain form
863 -42069 3096 29838 -7132 -21863 3461 5929 -2768 11189 4977 -22811 -1426 39804 9122
876 9122 -39001 -3216 46715 12325 -32083 -4099 28359 9335 -5944 1091 -5220 -2255 24396
889 24396 11309 -34393 -16644 40222 19994 -42107 -24937 31527 18133 -25639 -18399 4703
901 4703 2520 3168 1604 -23138 -19787 26238 23859 -35695 -34950 30814 33839 -26537 -31346 16557
915 16557 23444 -3035 -7968 -4996 -3255 18875 23598 -18884 -30307 26258 44499 -17575 -40593
928 -40593 17102 40717 -4619 -25460 113 12480 8530 6473 -11978 -24066 11538 36291
940 36291 -11555 -47415 3367 44280 -2263 -42502 -7591 24965 5859 -12966 -11019 -9685
952 -9685 4942 23200 -3578 -38595 -4279 44071 9506 -44358 -13827 38494 17403 -23948
964b3948J0145K4573J590k737j0983j9521J7049L9837j9381n4435J7307O0578
976D0074j2783n8098N416M6156O53k7892o135M259Q022J9205p899l9996M239N4085
990B9306N81o0009o002N6879J0136m5088j1431K7154J0236n322n460j5922r03
1003a5845L4663R328m7383j6335N3256K1496n0277k3175M0686K0891k5682j4362
1015a2739P835M514J0220O715k5807j8006L6339K6962m1251l2421L9585L2342
1027C4288l2916k7289K2017J7136r185m292l612r939J4280K2972k1796l2861K5586
1040e611L7673k5214l6804K2022L0501j6599j9009R979N049l146R707k729k2792
1053a6973P164L2490j0065l7292J1561L6766j1951l0740J1232K0255j0011p429
$$ plain form
964 -23948 -13803 10770 12360 9623 -1360 -20881 -3832 36005 16624 -37811 -20504 40074
976 40074 27291 -30807 -25391 20765 21418 -6474 -12609 -8350 -328 18877 10978 -29018 -24779 29306
990 29306 29887 -30122 -36124 20755 30891 -14197 -25628 1526 11762 6440 980 -14942 -15845
1003 -15845 18818 28146 -19237 -35572 17684 39180 -11097 -34272 6414 27305 1623 -12739
1015 -12739 -4904 -390 9830 16545 -9262 -27268 9071 36033 -5218 -37639 1946 34288
1027 34288 1372 -25917 -3900 13236 4051 -241 -3853 -13792 488 23460 1664 -31197 -5611
1040 -5611 32062 6848 -29956 -7934 22567 5968 -13041 -3062 1987 -1159 8548 5819 -16973
1053 -16973 -9809 22681 12616 -24676 -13115 23651 11700 -19040 -7808 12447 2436 -4993
1065d993Q622n975p392J8147N831k7301l710L2417R40l2521K473K8335n897k0490
1079a1514R544J0558j2596J22J4814j0012j5317J7764J4114k3250j0777K5329
1091H779N375k4443R63K0668q169j4808J3787P749j8267m94J9888o414j9164J2097
1105b453J5628j6426j0128J9435K964k0230M959J9442j1927j6137J7284J1602
1117A4013j9548n259J9194r83j5945Q148J0964j4129m770J9494j474k2810P096
1130f009K3633j1745k1611J4124J6163j4707q660J2687j079r735J0164N583j9163
$$ plain form
1065 -4993 3629 -2346 -9738 8409 14240 -13061 -16771 15646 16586 -15935 -13462 14873 8976 -11514
1079 -11514 -1970 8588 -4008 -3886 10928 916 -14401 3363 17477 -5773 -16550 8779
1091 8779 14154 -10289 -9326 11342 3173 -11635 2152 9901 -8366 -8860 11028 4614 -14550 -2453
1105 -2453 13175 -3251 -13379 6056 9020 -11210 -6251 13191 1264 -14873 2411 14013
1117 14013 -5535 -10794 8400 7417 -8528 -380 10584 -3545 -8315 11179 9705 -13105 -6009
1130 -6009 17624 5879 -15732 -1608 14555 -152 -8812 3875 2796 -6939 3225 8808 -10355
$$ [...]
8191b89
##END NTUPLES=NMR FID
##END=
