##TITLE=1H_LY-4Dix
 CD3CN,8 sc, 
 11.03.2021
##JCAMPDX= 6.0         $$ Bruker NMR JCAMP-DX V2.0
##DATA TYPE= NMR FID
##DATA CLASS= NTUPLES
##ORIGIN= UXNMR, Bruker Analytische Messtechnik GmbH
##OWNER= root
$$ XWIN-NMR		Version 3.5
$$ Thu Mar 11 10:50:51 2021 Russian Standard Time (UT+4h)  she@DPX200
##.OBSERVE FREQUENCY= 200.131506
##.OBSERVE NUCLEUS= ^1H
##.DELAY= (6, 6)
##.ACQUISITION MODE= SIMULTANEOUS
##.ACQUISITION SCHEME= undefined
##.AVERAGES= 8
##.DIGITISER RES= 18
##SPECTROMETER/DATA SYSTEM= spect
##.PULSE SEQUENCE= zg30
##.SOLVENT NAME= CDCl3
##.SHIFT REFERENCE= (INTERNAL, CDCl3, 0, 15.7039)
##AUDIT TRAIL= $$ (NUMBER, WHEN, WHO, WHERE, WHAT)
$$ ##TITLE= Audit trail, XWIN-NMR		Version 3.5
$$ ##JCAMPDX= 5.01
$$ ##ORIGIN= Bruker BioSpin GmbH
$$ ##OWNER= she
$$ F:/spectra/data/she/nmr/H-F/1/audita.txt
$$ ##AUDIT TRAIL=  $$ (NUMBER, WHEN, WHO, WHERE, WHAT)
(   1,<2021-03-11 10:49:49.75 +0400>,<she>,<DPX200>,
      <created by zg, POWCHK disabled, PULCHK disabled
       configuration hash MD5:
       00 E9 B6 7A A2 85 ED C7 34 08 36 98 17 FE 4E 26
       data hash MD5: 16K
       5F 4E 48 3F CD 2B 4C B2 66 C5 66 0B B8 98 35 64>)
$$ ##END=
$$ 
$$ hash MD5
$$ 90 A7 47 5D BB C6 31 53 A3 3B CC 49 0A 62 76 ED
##$RELAX= 
##$RELAX= 
##$RELAX= 
##$RELAX= 
##$RELAX= 
##$RELAX= 
$$ Bruker specific parameters
$$ --------------------------
##$DU= <F:/spectra>
##$EXPNO= 1
##$NAME= <H-F>
##$PROCNO= 1
##$TYPE= <nmr>
##$USER= <she>
##$AMP= (0..31)
100 100 100 100 100 100 100 100 100 100 100 100 100 100 100 100 100 100 
100 100 100 100 100 100 100 100 100 100 100 100 100 100 
##$AQSEQ= 0
##$AQ_mod= 1
##$AUNM= <au_zg>
##$AUTOPOS= <>
##$BF1= 200.13
##$BF2= 200.13
##$BF3= 200.13
##$BF4= 200.13
##$BF5= 200.13
##$BF6= 200.13
##$BF7= 200.13
##$BF8= 200.13
##$BYTORDA= 1
##$CFDGTYP= 0
##$CFRGTYP= 5
##$CHEMSTR= <none>
##$CNST= (0..31)
1 1 145 1 1 1 1 1 1 1 1 1 1 1 1 1 1 1 1 1 1 1 1 1 1 1 1 1 1 1 1 1 
##$CPDPRG= <>
##$CPDPRG1= <>
##$CPDPRG2= <>
##$CPDPRG3= <>
##$CPDPRG4= <mlev>
##$CPDPRG5= <mlev>
##$CPDPRG6= <mlev>
##$CPDPRG7= <mlev>
##$CPDPRG8= <mlev>
##$CPDPRGB= <>
##$CPDPRGT= <>
##$D= (0..31)
0 1.2 0 0 0 0 0 0 0 0.06 0 0.03 0 0 0 0 0.0002 0 0 0 0 0 0 0 0 0 0 0 0 
0 0 0 
##$DATE= 1615445389
##$DBL= (0..7)
120 120 120 120 120 120 120 120 
##$DBP= (0..7)
150 150 150 150 150 150 150 150 
##$DBP07= 0
##$DBPNAM0= <>
##$DBPNAM1= <>
##$DBPNAM2= <>
##$DBPNAM3= <>
##$DBPNAM4= <>
##$DBPNAM5= <>
##$DBPNAM6= <>
##$DBPNAM7= <>
##$DBPOAL= (0..7)
0.5 0.5 0.5 0.5 0.5 0.5 0.5 0.5 
##$DBPOFFS= (0..7)
0 0 0 0 0 0 0 0 
##$DE= 6
##$DECBNUC= <off>
##$DECIM= 32
##$DECNUC= <off>
##$DECSTAT= 4
##$DIGMOD= 1
##$DIGTYP= 9
##$DL= (0..7)
0 120 120 120 120 120 120 120 
##$DP= (0..7)
150 150 150 150 150 150 150 150 
##$DP07= 0
##$DPNAME0= <>
##$DPNAME1= <>
##$DPNAME2= <>
##$DPNAME3= <>
##$DPNAME4= <>
##$DPNAME5= <>
##$DPNAME6= <>
##$DPNAME7= <>
##$DPOAL= (0..7)
0.5 0.5 0.5 0.5 0.5 0.5 0.5 0.5 
##$DPOFFS= (0..7)
0 0 0 0 0 0 0 0 
##$DQDMODE= 0
##$DR= 18
##$DS= 0
##$DSLIST= <SSSSSSSSSSSSSSS>
$$ [...]
##$SUBNAM2= <"">
##$SUBNAM3= <"">
##$SUBNAM4= <"">
##$SUBNAM5= <"">
##$SUBNAM6= <"">
##$SUBNAM7= <"">
##$SUBNAM8= <"">
##$SUBNAM9= <"">
##$SW= 16.9725357007746
##$SWIBOX= (0..15)
0 0 2 0 0 0 0 0 0 0 0 0 0 0 0 0 
##$SW_h= 3396.73913043478
##$TD= 16384
##$TD0= 1
##$TE= 0
##$TE2= 300
##$TE3= 300
##$TEG= 300
##$TL= (0..7)
0 120 120 120 120 120 120 120 
##$TP= (0..7)
150 150 150 150 150 150 150 150 
##$TP07= 0
##$TPNAME0= <>
##$TPNAME1= <>
##$TPNAME2= <>
##$TPNAME3= <>
##$TPNAME4= <>
##$TPNAME5= <>
##$TPNAME6= <>
##$TPNAME7= <>
##$TPOAL= (0..7)
0.5 0.5 0.5 0.5 0.5 0.5 0.5 0.5 
##$TPOFFS= (0..7)
0 0 0 0 0 0 0 0 
##$TUNHIN= 0
##$TUNHOUT= 0
##$TUNXOUT= 0
##$USERA1= <user>
##$USERA2= <user>
##$USERA3= <user>
##$USERA4= <user>
##$USERA5= <user>
##$V9= 5
##$VALIST= <valist>
##$VCLIST= <CCCCCCCCCCCCCCC>
##$VD= 0
##$VDLIST= <DDDDDDDDDDDDDDD>
##$VPLIST= <PPPPPPPPPPPPPPP>
##$VTLIST= <TTTTTTTTTTTTTTT>
##$WBST= 1024
##$WBSW= 4
##$XGAIN= (0..3)
0 0 0 0 
##$XL= 0
##$YL= 0
##$YMAX_a= 763970
##$YMIN_a= -702105
##$ZGOPTNS= <>
##$ZL1= 120
##$ZL2= 120
##$ZL3= 120
##$ZL4= 120
##$ABSF1= 10
##$ABSF2= 0
##$ABSG= 5
##$ABSL= 3
##$ALPHA= 0
##$AQORDER= 0
##$ASSFAC= 0
##$ASSFACI= 0
##$ASSFACX= 0
##$ASSWID= 0
##$AUNMP= <proc_1d>
##$AZFE= 0.1
##$AZFW= 0.1
##$BCFW= 1
##$BC_mod= 2
##$BYTORDP= 1
##$COROFFS= 0
##$CY= 11.3945322036743
##$DATMOD= 1
##$DC= 2
##$DFILT= <>
##$DTYPP= 0
##$F1P= 15.9154993809931
##$F2P= -4.1035820241983
##$FCOR= 0.5
##$FTSIZE= 0
##$FT_mod= 4
##$GAMMA= 1
##$GB= 0.15
##$INTBC= 1
##$INTSCL= 1
##$ISEN= 128
##$LB= 0.24
##$LEV0= 0
##$LPBIN= 0
##$MAXI= 10000
##$MC2= 0
##$MEAN= 0
##$ME_mod= 0
##$MI= 1.114404
##$NCOEF= 0
##$NC_proc= 0
##$NLEV= 6
##$NOISF1= 3.799351
##$NOISF2= 2.8
##$NSP= 1
##$NTH_PI= 0
##$NZP= 0
##$OFFSET= 15.70392
##$PC= 1
##$PHC0= -11118.03
##$PHC1= 8.400941
##$PH_mod= 1
##$PKNL= yes
##$PPARMOD= 0
##$PSCAL= 0
##$PSIGN= 0
##$REVERSE= no
##$SF= 200.130013532006
##$SI= 16384
##$SIGF1= 3
##$SIGF2= 2
##$SINO= 400
##$SIOLD= 16384
##$SREGLST= <1H.CDCl3>
##$SSB= 0
##$STSI= 0
##$STSR= 0
##$SW_p= 3612.71676300578
##$SYMM= 0
##$S_DEV= 0
##$TDeff= 0
##$TDoff= 0
##$TI= <>
##$TILT= no
##$TM1= 0
##$TM2= 0
##$TOPLEV= 0
##$USERP1= <user>
##$USERP2= <user>
##$USERP3= <user>
##$USERP4= <user>
##$USERP5= <user>
##$WDW= 1
##$XDIM= 8192
##$YMAX_p= 0
##$YMIN_p= 0
$$ End of Bruker specific parameters
$$ ---------------------------------
##NTUPLES= NMR FID
##VAR_NAME=  TIME,          FID/REAL,        FID/IMAG
##SYMBOL=    X,             R,               I
##VAR_TYPE=  INDEPENDENT,   DEPENDENT,       DEPENDENT
##VAR_FORM=  AFFN,          ASDF,            ASDF
##VAR_DIM=   8192,          8192,            8192
##UNITS=     SECONDS,       ARBITRARY UNITS, ARBITRARY UNITS
##FACTOR=    0.0002944,     1,               1
##FIRST=     0,             0,               0
##LAST=      2.4114304,     0,               0
##MIN=       0,             -702105,         0
##MAX=       2.4114304,     763970,          0
$$ Real data points
##PAGE= N=1
##DATA TABLE= (X++(R..R)), XYDATA
$$ [...]
422 -148038 -89099 108011 133114 -51736 -153922 -15567 139906 69625 -111565 -121306 50671
433 50671 133355 -1265 -139756 -65883 99798 96260 -64932 -127476 1486 117590 45275
444 45275 -99632 -89187 59531 112278 -9401 -108700 -31604 98271 79617 -52175 -88371
455 -88371 24388 108131 35416 -77072 -53687 65759 92522 -13459 -84807 -12709 84233
466 84233 52821 -54405 -71946 21306 76849 7115 -78180 -47294 45138 51978 -35609 -78902
478 -78902 -14379 51556 18299 -57700 -59156 14151 46669 -8184 -59360 -27101 36815 34549
490 34549 -24423 -42138 6924 44327 19031 -24077 -16635 28960 41637 6950 -16284 6122
502 6122 36424 27887 -1069 -4904 15820 25798 12390 -4159 -1763 10066 8995 -1583 -6764
515 -6764 -5033 -5733 -8950 -6379 -6273 -16971 -22696 -12606 -2319 -11017 -29006 -27213 -3296 6453
529 6453 -15850 -35804 -16038 19114 13640 -23676 -29878 11345 40243 12568 -28607 -12814 42176
542 42176 52006 -727 -32321 13007 66997 41718 -24569 -27205 39558 70579 10961 -49475
554 -49475 -15399 59119 52012 -33139 -65840 5943 65245 13119 -74662 -62246 31587 56149
566 56149 -33446 -98648 -35463 57328 31501 -74359 -91897 10309 72718 -995 -94335 -55649
578 -55649 60345 73703 -34143 -89336 356 100053 54849 -62381 -62843 58653 114212 17130
590 17130 -80109 -21628 102123 95640 -32821 -83384 24541 119345 46723 -82835 -68598
601 -68598 64644 103511 -20187 -117170 -36442 91620 60995 -85269 -121171 10132 99884
612 99884 2640 -129804 -89138 61700 85417 -55370 -137420 -28965 102824 54217 -97435
623 -97435 -108528 44402 123402 8498 -115310 -49837 107977 113535 -40841 -107846 20994
634 20994 145418 70597 -85375 -75325 86085 142871 3707 -114368 -26461 126275 97727
645 97727 -71432 -118218 27309 132176 24215 -131590 -90920 77982 103760 -57256 -153701
656 -153701 -35487 110019 50660 -120681 -131905 34736 116184 -13647 -146375 -70808 97436
667 97436 96488 -68212 -130714 11904 137075 52662 -102875 -80809 87101 138678 -4745
678 -4745 -112375 -12763 135734 99821 -61517 -94398 50854 142767 33834 -105513 -56568
689 -56568 96924 107615 -42230 -120689 -8869 112383 46447 -105252 -104610 40881 97105
700 97105 -24820 -133275 -59999 77226 60616 -81101 -122176 1083 93807 15042 -105637
711 -105637 -76585 58455 90459 -25604 -99741 -12725 98607 65158 -53781 -68812 45325
722 45325 110377 26794 -68889 -25664 84451 89179 -16394 -67237 12983 94694 46788 -56179
734 -56179 -55027 41442 76390 -6158 -79644 -33763 53962 42001 -53055 -81864 -5413 51972
746 51972 1692 -77124 -62281 21507 42306 -29637 -76986 -25926 43315 26923 -44106 -55462
758 -55462 12513 56089 11225 -44924 -21718 44410 53696 -2280 -33645 10019 60448 39529
770 39529 -15561 -17910 32146 55421 16809 -24763 -6887 38601 36404 -10758 -30358 1617
782 1617 30416 9116 -31069 -31050 4808 15409 -16173 -39683 -22451 4728 -47 -27972 -35549
795 -35549 -11485 5418 -8498 -26526 -19185 1099 6849 -6002 -13781 -1797 12340 9970 1897
808 1897 3284 11583 16014 14086 11821 13318 14924 14083 15743 17402 12598 6397 9377 15697 12548
823 12548 778 -5368 3649 12533 1296 -16963 -14919 3581 6571 -14785 -30880 -15994 7626
836 7626 -231 -30568 -34392 -3720 14363 -9160 -37580 -22885 15669 19130 -18318 -34549 799
849 799 35076 16752 -24955 -21252 26786 46020 5623 -29786 -1345 48269 40738 -13214 -29132
862 -29132 19658 56447 19974 -34601 -21317 37320 47081 -11047 -49352 -7501 47031 23988
874 23988 -43992 -51215 12807 45794 -7374 -65441 -36120 34690 34742 -37371 -68083 -6645 51012
887 51012 14760 -57349 -49952 28479 56618 -9229 -63307 -17362 58712 47506 -32958 -54156
899 -54156 20197 74691 23593 -51681 -32410 52565 69887 -9559 -60448 -3523 71577 45008
911 45008 -43972 -55937 26536 72233 6559 -69829 -37865 52047 55371 -35802 -78483 -6608
923 -6608 66665 24140 -69095 -65453 29543 66722 -13504 -84499 -32614 61354 50198 -47234
935 -47234 -76480 10651 79207 21731 -69628 -49411 52692 77334 -13878 -75879 -9556 81132
947 81132 53925 -48519 -64567 31647 88076 14751 -73290 -37800 64476 70826 -30370 -79823
959 -79823 -834 80805 34711 -68129 -65786 37677 77149 -11009 -87809 -32242 67406 52967
971 52967 -52865 -82098 11096 79612 15631 -78927 -53737 51624 70628 -24607 -82865 -11573
983 -11573 77032 44242 -56537 -65154 31727 81725 6453 -73530 -31679 64330 63373 -31434
995 -31434 -70731 7138 77559 29786 -59805 -50588 41581 69622 -10524 -71226 -18633 62367
1007 62367 43856 -44738 -63743 15593 66435 8868 -64739 -38929 44176 52860 -24828 -64938
1019 -64938 -5900 58488 28014 -47870 -48665 25338 56657 -1478 -56180 -22204 46227 41197
1031 41197 -26712 -50583 5637 52494 17724 -42836 -33624 28378 44873 -7400 -46061 -11494
1043 -11494 40158 28871 -26813 -38830 9734 42039 7954 -37161 -23406 26590 34059 -11006
1055 -11006 -36951 -3981 34728 19181 -24660 -28030 13099 33272 2518 -29796 -13887 23748
1067 23748 24232 -11822 -27317 113 27039 11250 -21225 -20112 10951 22159 -1798 -23525
1079 -23525 -9901 16170 13763 -12122 -20233 -45 15984 4229 -15903 -12791 6985 13169 -3059
1092 -3059 -14654 -3971 10701 8156 -5620 -8994 2651 11381 4012 -4992 -1963 6485 8041 2522
1106 2522 -1489 1660 5844 4737 1944 1019 769 1192 2897 2591 -523 -3651 -2536 1637 2784 -4135
1122 -4135 -10349 -3721 4981 805 -10514 -12752 -836 7958 -1922 -16897 -10686 8090 9494 -8496
1136 -8496 -17593 -2069 16809 8946 -14923 -14147 12354 22973 1352 -18447 -4473 24681 22943
1149 22943 -9138 -19580 9863 32411 11658 -20603 -14429 21530 30464 -5690 -30202 -3754
1161 -3754 30356 16905 -24229 -30748 7827 31510 -1282 -39812 -22370 22820 23427 -21411 -42533
1174 -42533 -6444 32837 11773 -37723 -34362 16938 35717 -5448 -41516 -14780 36526 31787
1186 31787 -22484 -37569 12353 48230 15446 -33710 -22789 34914 48104 -6397 -40857 -169
1198 -169 49895 30926 -27955 -36739 19254 51854 5566 -47105 -22958 36261 36868 -22665 -52807
1211 -52807 -6312 44692 16052 -48549 -45330 17686 41445 -9478 -57693 -26768 38046 33204
1223 33204 -33627 -53697 4095 49681 14946 -45964 -36311 33603 53585 -8113 -50212 -5169
1235 -5169 55370 39791 -27797 -42110 22789 64715 14323 -46668 -21805 46119 51637 -14975
1247 -14975 -52588 -1285 58011 26614 -45778 -45584 22580 50799 -5301 -61807 -29715 41567
1259 41567 35035 -38516 -61433 -1107 47965 11022 -55858 -46713 27560 48138 -16565 -59887
1271 -59887 -14298 48386 34454 -34345 -48721 19254 61783 11803 -46860 -20995 46481 53593
1283 53593 -11371 -47317 6033 63232 30134 -36879 -33185 30675 55490 1057 -50459 -17377
1295 -17377 46570 35005 -32024 -48975 4744 44175 7907 -51155 -39737 24635 35728 -22730
1307 -22730 -54958 -15023 33802 19060 -38257 -46341 11239 40999 -1689 -43328 -20032 31429
1319 31429 35776 -13689 -38053 5844 47084 20644 -25173 -19234 26519 43883 5763 -29933
1331 -29933 -3280 40955 29299 -15170 -23889 10877 36052 11524 -29137 -20313 21457 24230
1343 24230 -13309 -32312 -9612 19042 9989 -26899 -32713 2434 18119 -8075 -30385 -19350
1355 -19350 8604 13921 -13889 -28856 -3343 19074 6184 -15688 -14567 8556 22539 4864
1367 4864 -14902 -1188 22260 18130 -680 -5974 7727 23280 14973 -6207 -3210 15960 16871
1380 16871 2595 -6325 -1835 10840 10539 -7359 -12324 1333 5500 -3066 -11052 -11896 -3871 1163
1394 1163 -8502 -16119 -8038 -2604 -5830 -8377 -10260 -7460 -549 -2332 -7395 -3119 234 -202 2395
1409 2395 2104 279 4081 6802 5738 7259 5854 3100 9138 12893 6055 2541 6275 8916 11001
1424 11001 4651 -4245 2572 12146 4406 -7087 -5862 1130 6489 -1332 -15444 -11220 5831 3231
1438 3231 -13962 -18278 -6641 5500 172 -19346 -19515 4181 10796 -8287 -19519 -7650 12104
1451 12104 12724 -10211 -18273 7314 23490 6359 -13401 -6444 17942 26028 846 -17868 4463
1464 4463 30137 16684 -11694 -12680 13170 28868 5530 -23869 -9407 24036 18976 -14331 -25779
1477 -25779 -1126 23199 7248 -29523 -25699 12140 20130 -12336 -33806 -13859 19428 15131
1489 15131 -24173 -33347 5031 27673 1389 -29490 -18830 20047 28957 -8605 -31484 541
1501 541 34893 18533 -18801 -20791 17171 38719 6896 -29033 -8401 33543 28812 -12099 -27481
1514 -27481 4873 36990 14770 -29895 -23882 20859 30212 -8011 -36267 -13245 27469 20046
1526 20046 -27495 -37616 5425 30420 1150 -36852 -26111 19413 29289 -14878 -40842 -5431
1538 -5431 32897 16717 -26197 -30839 13223 39354 3642 -35006 -12771 33182 31584 -12501
1550 -12501 -31790 4392 42284 18472 -29081 -22819 24654 37667 -2643 -34752 -9744 34875
1562 34875 26188 -24382 -34406 9076 35548 4881 -35906 -25222 22709 30566 -16292 -41733
1574 -41733 -5782 31602 14676 -30188 -34018 11557 34900 -2297 -38552 -15445 28451 26184
1586 26184 -16643 -34003 3267 38279 13553 -29118 -20753 23532 34073 -3244 -31356 -5357
1598 -5357 34793 23453 -21411 -26123 13041 33556 5069 -29281 -15796 24593 25815 -14383
1610 -14383 -31017 155 27762 10221 -25240 -24490 12506 26108 -6114 -30814 -9530 21294
1622 21294 15859 -16712 -26401 3424 25459 4165 -24133 -14240 15644 20566 -5563 -22872 -2660
1635 -2660 23499 12904 -15133 -15588 9548 21373 3068 -17853 -7988 17409 16221 -8265 -16152
1648 -16152 2515 17321 6736 -13407 -12475 8871 15046 -3228 -15823 -4652 11250 8662 -8499
1661 -8499 -14065 1396 12525 1288 -12089 -7822 5903 9118 -2580 -11428 -2792 9460 5039
1674 5039 -6854 -7609 2262 8508 2241 -7311 -4576 5748 6579 -2306 -5703 -683 5356 4004 -3428
1689 -3428 -4669 2354 4963 346 -3028 -1742 1771 3094 -393 -3233 -583 2180 992 -777 -1214
1704 -1214 -531 1244 1298 -347 -681 -484 64 1381 1136 -1796 -2002 1125 2830 855 -2573 -2392 2013
1721 2013 4166 -1221 -5331 -1538 4020 2908 -3726 -6345 328 6415 932 -7615 -5413 4404 6541
1736 6541 -2370 -9436 -2424 8643 5656 -7480 -8332 3664 10919 1529 -10202 -5105 10007 10799
1750 10799 -4159 -11437 1142 14016 6822 -9591 -9769 7937 15462 -332 -14536 -4788 13527
1763 13527 11332 -8560 -15901 2058 16374 3743 -16342 -12037 9363 14510 -5560 -20078 -5087
1776 -5087 16083 9077 -14786 -17904 5171 18263 659 -19901 -10336 15343 16521 -8632 -19436
1789 -19436 1039 21586 9713 -16126 -14260 13018 22620 -577 -19931 -4976 21324 17194
1801 17194 -10908 -19370 5680 24460 6371 -20019 -14051 14875 20631 -6506 -24577 -5186
1813 -5186 20651 11682 -18279 -22563 5309 21758 -180 -25918 -14583 15650 17613 -12133 -25882
1826 -25882 -1424 22724 9336 -20516 -19097 12319 24433 -1546 -23615 -6659 23168 19535
1838 19535 -11652 -21071 6995 27928 9473 -20001 -13482 18463 25317 -3892 -23698 -3034
1850 -3034 24996 15313 -17265 -22064 7954 24641 1470 -26054 -15037 16659 18507 -12857 -28303
1863 -28303 -3521 22156 8061 -23496 -22249 9656 22253 -4285 -27197 -9723 20805 16766
1875 16766 -14642 -23049 5651 26469 7210 -20598 -12708 18835 24510 -4182 -21320 122
1887 122 26457 16282 -14600 -17071 11921 25972 2672 -21673 -9464 19198 18203 -11026 -23275
1900 -23275 85 21003 6135 -21603 -18801 9119 17523 -6844 -25666 -9040 15862 10044
1912 10044 -16542 -21572 2848 18388 1397 -20185 -11186 13718 16568 -6422 -17345 1174
1924 1174 20326 10600 -11493 -10599 11773 20300 2499 -12895 -1985 17414 14525 -5603 -11762
1937 -11762 4947 17110 5349 -12207 -8424 8672 12005 -4300 -14859 -4260 9353 4690
1949 4690 -11512 -14060 -22 7907 -2643 -14504 -9290 4153 5229 -6706 -12114 -2507 7319
1962 7319 2891 -7597 -6643 4039 8603 1224 -5437 -419 8755 8099 -59 -2389 4243 10169 5805
1977 5805 -891 -165 6138 7744 2347 -2234 415 4813 3497 -1777 -3298 -633 1583 -1036 -4532
1992 -4532 -4636 -2220 -1177 -3789 -5751 -4914 -2927 -2770 -3746 -4610 -3616 -2499 -1543 -1392 -2005 -2193 -516
2009 -516 1889 1557 376 20 2534 4890 4139 1295 1474 5259 6954 3547 366 1586 6542 6696
2025 6696 917 -2411 1780 6623 3108 -3946 -4631 1599 4910 -1713 -8733 -5432 2758 2211 -6898
2040 -6898 -11244 -3421 4284 -881 -11003 -9698 1992 5616 -4126 -11868 -4369 7907 6001 -6830
2054 -6830 -9508 3740 12596 3972 -8323 -3815 11449 13980 -403 -8967 2741 15987 9767
2067 9767 -6520 -7617 8576 16296 2127 -12235 -4589 12831 10938 -7544 -15435 182 13725
2080 13725 2769 -15999 -13706 6314 11860 -6588 -20112 -7957 11404 7343 -13989 -18322 1699
2093 1699 15190 1005 -17750 -10595 12281 15411 -6262 -16802 621 19540 10500 -11619 -11337
2106 -11337 11440 21448 2473 -15026 -3403 19038 16584 -7022 -15522 4800 21316 7152
2118 7152 -16017 -12414 11408 17375 -4942 -21022 -6218 16080 9726 -15704 -20541 2288 16740
2131 16740 181 -22002 -14238 11409 14428 -9532 -22487 -3224 18011 8663 -16278 -16589 9080
2144 9080 20646 521 -18746 -6188 18750 17483 -7656 -16803 5107 23518 9112 -14916
2156 -14916 -10702 14437 21205 -1754 -18734 -3176 19901 13288 -13087 -18102 5165 19562 1887
2169 1887 -20773 -12906 12613 14968 -9629 -22836 -3761 17064 7110 -18422 -18711 6940 17727
2182 17727 -2444 -21128 -8591 15921 14036 -10583 -18167 3682 20672 6329 -15521 -10567
2194 -10567 13777 19282 -2462 -16580 -555 19777 12415 -10641 -13509 8085 19656 2481
2206 2481 -16067 -7349 14100 13721 -8105 -17118 58 15589 5050 -15198 -13725 6979 13192
2219 13192 -4247 -17977 -6284 11293 8195 -11045 -15103 2198 13261 1495 -13745 -8179
2231 -8179 9287 11604 -3937 -12154 -220 13125 7183 -7843 -7716 6695 12857 1698 -9141
2244 -9141 -2685 10628 9161 -3898 -8115 2057 10476 3600 -7602 -6058 5221 7586 -2010 -8738
2258 -8738 -2715 5917 3417 -5580 -7548 186 5394 30 -7095 -4938 2269 3819 -2825 -6320 -1433
2273 -1433 4135 2101 -2911 -3555 1211 4113 824 -2695 -1046 2994 3161 169 -1266 443 3182
2288 3182 2341 -16 -506 1177 2176 1292 -350 -418 489 852 703 -96 -1170 -788 240 604 -625 -1729
2306 -1729 -1145 380 629 -1295 -3009 -1085 1315 879 -2134 -2953 116 2839 525 -3057 -2373 2341
2322 2341 3748 -441 -4105 -860 4416 3293 -2561 -4293 1495 5831 1650 -4779 -3182 4210 5851
2337 5851 -1279 -6441 -1196 6473 3893 -4931 -6198 2227 7669 1151 -7681 -4109 6067 6984 -3492
2352 -3492 -9096 -403 8793 4330 -7346 -7818 4396 10138 -335 -10588 -4058 8790 7965 -5708
2366 -5708 -10740 1339 11309 3401 -10531 -8278 7112 10862 -3009 -12790 -3059 11527 7286 -9042
2380 -9042 -11879 3878 12965 1262 -13083 -7322 10216 11324 -5488 -13930 -281 14142 6800
2393 6800 -11282 -10965 7339 14970 -51 -14583 -4931 13624 11869 -7740 -14419 2638 16555
2406 16555 4922 -13698 -10243 9726 14815 -3717 -16260 -3412 14550 8829 -11571 -14936 4126
2419 4126 15338 868 -16731 -9326 10958 12610 -7080 -16943 -1155 15723 6714 -13623 -13066
2432 -13066 7772 16390 -731 -16223 -5635 14935 12896 -8107 -15029 3423 18391 6312
2444 6312 -13566 -10405 11350 16982 -2507 -16540 -3254 16350 11062 -10931 -15223 4751 17116
2457 17116 1846 -16961 -10171 11317 13193 -7766 -18209 -2375 15179 6150 -14997 -14704 6400
2470 6400 15199 -1711 -17668 -7355 13478 11667 -9252 -15839 2484 17318 5485 -13703 -10053
2483 -10053 11282 16888 -2249 -14849 -1450 17107 11434 -9267 -12611 6609 17833 3060
2495 3060 -14444 -7361 12258 13138 -6512 -15951 -651 14690 5422 -13685 -12997 5894 12344 -3343
2509 -3343 -16912 -6698 10701 7678 -10539 -14512 1302 12114 1569 -13504 -8744 8655 11498
2522 11498 -4153 -12660 -271 12972 7572 -7531 -8235 7039 13641 1867 -9049 -2205 11151
2535 11151 10342 -3211 -8653 2544 11676 4437 -7682 -6049 5438 8413 -1770 -9782 -2996 6557
2549 6557 3364 -7310 -8906 58 5124 -1263 -9195 -6040 2676 3208 -4793 -7692 -1784 4035 1881
2564 1881 -4820 -4705 2493 5290 137 -3333 -356 4607 5025 449 -1509 2867 6081 3428 231
2579 231 519 3301 4588 1846 -490 712 2848 1939 -342 -808 -468 427 -58 -2171 -2381 -1551 -1875
2596 -1875 -2154 -1974 -3279 -3252 -1764 -1943 -2328 -2947 -3169 -1656 28 -1188 -2839 -1400 1290 1649 -62
2613 -62 -1579 738 4256 3466 -370 -72 3692 5746 3184 -498 184 5493 6148 632 -2283 1751
2629 1751 5415 3297 -2419 -4187 1754 5266 -608 -6904 -3890 2345 2865 -4570 -9077 -2714 4073
2644 4073 -416 -8777 -7544 1024 4081 -2423 -9601 -4633 5589 4732 -5384 -7589 1633 8868 3718
2659 3718 -6566 -4391 7686 10846 -195 -6713 913 11441 8610 -4043 -7121 5625 13093
2672 13093 2966 -8564 -4026 9132 10145 -3799 -11955 -1067 11411 3656 -10918 -10538 3069
2685 3069 9294 -2847 -15318 -7388 8365 6087 -9823 -13998 -588 10589 1966 -13180 -9788
2698 -9788 7749 11358 -3606 -12800 -1675 13019 9580 -7475 -10215 7159 16333 3510 -10389
2711 -10389 -4106 12890 14560 -3019 -12351 2303 16437 7181 -10249 -10017 7082 14243 -664
2724 -664 -15619 -6077 11460 8307 -9778 -15288 -420 12147 2002 -16223 -12099 7326 10461
2737 10461 -5899 -16381 -4796 11659 7549 -11174 -13454 4935 14608 1526 -12544 -6119 11580
2750 11580 14082 -3758 -12777 2459 16692 8391 -8291 -8894 8758 16956 1670 -13412 -3770
2763 -3770 13699 11171 -7141 -13300 1333 14568 4016 -14347 -10959 7567 10863 -5203 -15956
2776 -15956 -5705 10725 6679 -12458 -14630 2695 11313 -599 -14032 -8630 8695 11193 -5775
2789 -5775 -13972 396 13642 5945 -8876 -8637 7460 14923 890 -11405 -1753 13148 10394
2802 10394 -4709 -9909 3437 14511 4619 -10416 -6325 9138 10773 -2564 -11689 -2583 10343
2815 10343 5839 -9789 -10867 3008 8760 -1339 -12019 -7444 6265 6722 -7151 -11631 -507
2828 -507 7952 2057 -8453 -7765 4335 8905 -1659 -8845 -1172 8287 5809 -3321 -6207 3165 9912
2843 9912 2870 -5567 -1365 6754 6976 -263 -4899 582 7672 4264 -4345 -3702 2927 5131 36
2858 36 -5294 -3003 3578 2799 -4164 -5226 -515 2043 -414 -4702 -4510 342 1935 -2311 -4258 -1369
2874 -1369 901 840 -1466 -2791 447 2375 534 -991 103 1207 1622 1424 71 721 2284 1710
2890 1710 1060 1489 753 755 1706 1434 340 558 418 573 1161 -388 -2055 -183 1374 -418 -2130 -2038
2908 -2038 -835 1169 -669 -4075 -2139 1301 710 -1950 -3306 -1380 2381 1249 -3428 -3213 1691
2923 1691 3350 -36 -3097 -1660 3499 4383 -1685 -3878 1456 4961 2435 -2848 -3123 3139 6147
2938 6147 282 -5275 -737 5312 4060 -2586 -5497 640 6662 1767 -6317 -4380 4033 5383 -1936
2953 -1936 -7430 -2593 6098 3979 -6155 -7033 1789 7131 809 -7722 -5144 5671 7074 -3221
2967 -3221 -8414 -132 8022 4144 -6578 -7213 4032 9851 -83 -9177 -3099 8247 7228 -4541
2981 -4541 -9260 1155 11223 3315 -9334 -6776 6408 9495 -1783 -10933 -3005 10351 6645
2994 6645 -7782 -9890 3295 11083 1567 -11002 -6470 8583 9577 -4621 -11623 -209 11139
3007 11139 5314 -9167 -9616 5564 11925 -549 -11979 -4085 9869 8436 -6162 -11606 1566
3020 1566 12477 3144 -10818 -7918 7105 10903 -2611 -12999 -2923 11656 7124 -8842 -10921
3033 -10921 3876 12494 1880 -12229 -6895 9791 10364 -5102 -12245 -12 12339 6088 -9393
3046 -9393 -9421 6380 12773 -409 -11735 -4198 10574 9212 -6253 -11674 1827 12656 3031 -10975
3060 -10975 -8029 6827 10799 -2926 -12782 -2900 10542 6650 -8831 -11065 2847 11131 1235
3073 1235 -12046 -6966 8390 9698 -4870 -11782 -545 11724 5759 -9271 -8871 6051 12040
3086 12040 -382 -10717 -3230 10302 9315 -5405 -10029 2832 12397 3569 -9457 -6383 7052
3099 7052 9963 -2497 -10986 -1717 9947 5332 -7818 -9171 2787 9401 -273 -10419 -5411 6476
3113 6476 6483 -5296 -10196 -831 8276 2620 -8502 -7195 4598 7933 -1673 -8759 -2323 7805 6055
3128 6055 -4846 -6825 2826 8755 2305 -5997 -2804 6549 7715 -1292 -5937 545 7586 3711 -4401
3143 -4401 -4383 3300 6306 -233 -6170 -2337 4133 2920 -3567 -5764 -475 3578 -81 -5679 -4043
3158 -4043 1293 2143 -2266 -5120 -1760 2238 1000 -2975 -3393 871 2844 -60 -2612 -736 2706
3173 2706 2703 -176 -954 1317 2891 1998 137 350 2020 2329 1146 565 1121 1407 1237 649 322 54
3191 54 199 -53 -224 -321 -1207 -1445 -866 -524 -1365 -2457 -2135 -657 -648 -2028 -3020 -1432 467 -369 -2410
3210 -2410 -2124 409 1945 9 -2188 -555 2848 2780 -451 -1681 1908 4852 2822 -1082 -655 3591
3226 3591 4665 1002 -2404 267 4659 3326 -1557 -3001 1436 4675 968 -4536 -3261 2316 3345
3241 3345 -2657 -6355 -2267 3209 775 -5461 -6198 95 3751 -1423 -6904 -4525 3223 3864 -3271
3256 -3271 -6494 -133 6392 3000 -4738 -4072 4181 7666 822 -5337 -940 7951 7070 -2421 -5228
3271 -5228 3051 9286 3655 -5685 -3672 5969 7694 -1494 -8070 -1426 7477 4240 -6507 -8203 1623
3286 1623 7061 -760 -10061 -5865 4592 5263 -5549 -10723 -1769 7589 2075 -8752 -7770 3688
3300 3688 8405 -1410 -9683 -3035 8600 7569 -4723 -8153 3320 11513 3914 -7285 -4290 8457
3314 8457 10982 -1260 -8203 196 11014 6820 -6141 -7419 4377 10242 573 -9991 -5196 7220
3328 7220 7057 -5209 -11067 -962 8143 2098 -10176 -8844 3279 7807 -2785 -11788 -4633 7109
3342 7109 5571 -6700 -10166 1336 9879 2330 -8921 -5734 7164 9977 -1444 -8620 50 11059
3356 11059 7397 -5353 -6492 5341 11655 2236 -8090 -3364 8553 8842 -3309 -8981 419 9552
3370 9552 3581 -8226 -7963 3832 7751 -2318 -10811 -4751 6321 4856 -6947 -10307 -282 7371
3384 7371 951 -9475 -6998 4495 7289 -3044 -9213 -1851 8372 5355 -5518 -6776 4244
3397 4244 9899 1947 -7000 -2683 8174 8461 -2074 -6504 1756 9595 4484 -5394 -4936 4910 8124
3412 8124 -567 -7401 -2259 6428 4631 -5135 -7508 438 5782 29 -7816 -5854 3025 4011 -3844
3427 -3844 -8014 -2061 4833 1564 -5822 -5816 1852 5344 -250 -5685 -2162 5079 4776 -1825 -4203 2011
3443 2011 6510 2609 -2556 -1354 4260 5380 405 -2966 456 5134 3443 -1814 -2661 1842 3841
3458 3841 464 -3409 -2036 1830 1688 -2133 -3605 -874 1051 -409 -3169 -2881 -289 257 -1601 -2591
3474 -2591 -1547 286 -39 -1602 -1255 -218 568 9 -192 -22 667 613 795 703 848 938 962 1653 1481 940
3494 940 477 1254 1916 1500 -164 -262 1011 1454 83 -1377 -455 1027 462 -1340 -2441 -432 949
3511 949 -372 -2991 -2378 222 1116 -1683 -3648 -1541 1569 799 -2632 -3018 512 2764 260 -3326
3527 -3326 -1563 2723 3379 -583 -2776 251 4344 2811 -2129 -2289 2688 5241 953 -3195 -1064
3542 -1064 3977 3965 -1783 -4096 576 4818 1717 -4156 -3728 2167 4363 -1410 -5958 -2218 3948 2767
3558 2767 -3951 -5821 274 4702 699 -5776 -4302 3294 4828 -1802 -6416 -1302 5771 3688 -4281
3573 -4281 -5419 2506 7123 934 -5908 -2830 5755 6620 -2339 -6524 497 7680 3500 -5544 -5044
3588 -5044 3956 7656 -326 -7780 -2449 6564 5155 -4408 -7461 1130 7348 1677 -7525 -5398 4700
3603 4700 6946 -2258 -8692 -1809 7269 4327 -6092 -7272 2605 8064 334 -8288 -4040 6684
3617 6684 6585 -3444 -8246 448 8906 3714 -6863 -6269 4754 8583 -751 -8484 -2370 7889 6197
3632 6197 -5183 -7865 1939 8704 1878 -7928 -5532 5561 7319 -2497 -8886 -1359 8091 4506
3646 4506 -5908 -7094 3154 8515 307 -8229 -3958 6515 6456 -3620 -8286 -12 8328 3331
3660 3331 -6822 -6191 4132 7970 -819 -8510 -2794 6999 5616 -4878 -7504 1472 8077 2016
3674 2016 -7477 -5228 4985 7338 -2487 -8002 -1518 7391 4498 -5380 -6533 2675 7771 880 -7327
3689 -7327 -3633 5884 6372 -2846 -7076 238 7510 3155 -5715 -5202 3523 7073 -420 -6927 -2064
3704 -2064 6174 4599 -3932 -6580 1110 6510 1556 -6468 -4422 4059 5100 -2245 -6778 -1205 5642
3719 5642 2947 -4716 -5338 2029 5570 -90 -5646 -2631 4492 4259 -2493 -4974 643 5473 2214
3734 2214 -3966 -2774 3126 4784 -332 -4143 -618 4537 2873 -2494 -3001 1451 4095 549 -3507
3749 -3507 -1993 2574 2495 -1498 -3410 -448 2649 328 -3017 -2876 972 1979 -1133 -2969 -1213 1413
3765 1413 678 -1778 -2218 189 1513 397 -1553 -638 1342 1312 -430 -376 699 1618 979 -113 492
3782 492 1155 1262 532 700 925 896 208 246 665 687 -330 -355 451 584 -400 -1306 -389 418 -388 -1592 -1970
3803 -1970 -198 454 -1233 -2646 -1383 533 358 -2020 -2323 -110 1644 9 -2303 -1395 1880 2511
3819 2511 -336 -1997 295 3142 2263 -1039 -1366 2147 3842 1462 -1937 -314 3277 3259 -1029 -2886
3835 -2886 829 3876 1563 -3019 -2847 1505 3128 -1111 -4513 -1940 2771 1795 -3293 -5055 -240
3850 -240 3408 164 -4844 -3736 1989 3336 -1836 -5470 -1193 4270 2900 -3362 -4060 1816 5367
3865 5367 1296 -4064 -1732 4986 5434 -931 -4068 1051 6463 3589 -3270 -3299 3288 6359 304 -5357
3881 -5357 -1549 4969 4326 -3368 -6164 168 5684 1007 -6709 -5185 2667 4783 -2648 -7956 -2714
3896 -2714 4891 2647 -5528 -6814 1068 5988 330 -7146 -3941 4893 5665 -2328 -6152 544 7502
3911 7502 3940 -4783 -4723 4596 8076 740 -5621 -1319 7069 5983 -2863 -5893 1837 7736 2094
3926 2094 -6104 -4518 4439 6333 -2239 -8007 -2276 6006 2968 -6043 -7322 906 5884 -572 -8394
3941 -8394 -4584 4449 4710 -3995 -7627 -557 6384 2793 -6138 -5411 3834 7267 77 -6283 -1537
3956 -1537 6900 6070 -2755 -5171 2578 8386 2820 -4673 -3104 5069 7357 -823 -5969 -880 6595
3971 6595 4053 -4413 -5741 1609 6052 227 -7096 -4430 3752 4155 -3512 -7413 -1435 4813 1739
3986 1739 -6163 -5924 2210 5337 -1427 -6485 -2768 4571 4551 -3176 -5441 1250 6438 2513 -4078 -2786
4002 -2786 4764 6458 97 -4450 486 6605 4289 -2568 -3472 2458 6150 1443 -4605 -2332 4058
4017 4058 3915 -2044 -5107 -520 3984 1066 -4801 -4355 1081 2828 -1725 -5814 -2529 2554 1973 -3731
4033 -3731 -4667 373 3277 184 -3633 -2481 2299 3439 -925 -3174 494 3918 2072 -1330 -1402 2362
4049 2362 4163 1121 -1689 465 3299 2419 -236 -1576 953 2771 952 -1851 -1111 1292 1165 -723
4065 -723 -2050 -1016 653 33 -2031 -2106 -451 -347 -1369 -1878 -1415 -430 -461 -1468 -1035 -327 -405 -526 -61
4084 -61 51 204 668 302 661 1040 568 477 1306 1629 1036 634 738 1604 1851 225 -489 1095 1908 379
4104 379 -775 -874 533 1286 -543 -2450 -791 1354 0 -2262 -2442 -233 1082 -1083 -3437 -1729
4120 -1729 1229 689 -1919 -2913 -332 2238 739 -2981 -1799 2102 2823 -391 -2312 -335 3217 2817
4136 2817 -1500 -2090 2183 4392 1263 -2002 -1132 3167 3862 -421 -3347 190 3945 1805 -2578 -3204
4152 -3204 936 3753 -343 -4660 -2270 2697 2005 -2545 -4883 -872 3521 995 -4539 -3847 1871
4167 1871 3423 -890 -4905 -1845 3834 3072 -3101 -4328 1359 5018 1513 -3618 -2759 3633 5484
4182 5484 -777 -4766 78 5341 3527 -2870 -4050 2491 6011 671 -4930 -2389 4136 3976 -2161
4197 -2161 -5524 -303 5469 1869 -5526 -4681 2489 4578 -1408 -6303 -2480 4952 3578 -4441 -6088
4212 -6088 1193 5737 1010 -5524 -3981 4182 5834 -2162 -6187 -208 5929 3232 -4133 -4661 3091
4227 3091 6673 287 -5756 -1876 5122 5195 -2411 -6036 680 6600 2037 -5304 -4125 3296 5294
4242 5294 -1091 -6434 -1998 5460 3344 -4295 -5766 1252 5425 517 -5975 -4076 3870 4786 -2512
4257 -2512 -6035 -405 5455 2864 -4246 -4899 2640 6084 -277 -5338 -1902 4579 4485 -2440 -5178 882
4273 882 5940 1781 -4632 -3630 2954 5083 -683 -5237 -1387 4946 3114 -3319 -4581 1256 5030
4288 5030 1221 -4697 -3023 3559 4125 -1835 -4773 -486 4307 2455 -3954 -4130 2001 4627 -311
4303 -311 -4411 -2028 3649 3644 -2301 -4467 494 4617 1393 -3531 -2899 2421 3853 -466 -4345 -817
4319 -817 3732 2038 -2317 -3306 778 3808 493 -3554 -1985 2757 2677 -1330 -3139 -100 3116 1660
4335 1660 -2759 -2398 1573 3090 -236 -2744 -965 2315 2033 -1265 -2729 798 2540 512 -2089
4350 -2089 -1160 982 1578 -554 -2357 8 1843 572 -1455 -1463 464 1212 -168 -1567 -629 1002 399
4367 399 -1011 -919 -57 857 449 -920 -495 501 445 -204 -253 428 572 414 -25 356 547 22 -61 652 502
4388 502 300 -47 97 626 483 -451 -552 645 709 -514 -988 -219 605 551 -1084 -1563 206 1000 -592
4407 -592 -2061 -867 792 883 -1415 -2158 -31 1921 247 -1745 -1355 1255 2016 -501 -2189 -348
4423 -348 2700 1747 -1368 -1403 1422 3006 870 -2098 -649 2567 2892 -719 -2374 415 2950 1368
4439 1368 -2180 -2382 1426 2811 -655 -3342 -1329 2310 1732 -2471 -3841 130 2765 195 -3455
4454 -3455 -2967 1548 2785 -1229 -4116 -1167 3166 1888 -2536 -3150 1078 4175 1035 -3268 -1825
4469 -1825 3601 3975 -1001 -3430 201 4704 2968 -2479 -2939 2466 4852 520 -3938 -1630 3676
4484 3676 3590 -2290 -4722 159 4295 1097 -4501 -4153 2079 3921 -1397 -5734 -2152 3587 2276 -3708
4500 -3708 -5010 728 4782 798 -5257 -3190 3292 4573 -1534 -4875 -439 5461 3309 -3213 -3692
4515 -3692 2788 5989 968 -4318 -1398 5068 4971 -1909 -4282 1453 5851 2001 -4557 -3629 3191 4876
4531 4876 -1434 -5750 -1390 4252 2569 -4263 -5402 654 4556 31 -6126 -3715 3146 3807 -2825
4546 -2825 -5904 -751 4821 2097 -4525 -4354 2385 5423 116 -4867 -1484 4861 4572 -1898 -4265
4561 -4265 1280 6169 2397 -3563 -2462 4063 5682 -284 -4348 -480 5006 3350 -2965 -4312 1381
4576 1381 4499 254 -5167 -3297 2906 3382 -2699 -5391 -1188 3723 1345 -4422 -4509 1218 3760 -746
4592 -746 -5061 -2070 3295 2980 -2332 -4214 666 4646 1843 -3038 -2259 3054 4606 34 -3237 -55
4608 -55 4470 3374 -1555 -2820 1815 4551 1045 -3140 -1716 2766 3188 -1449 -3730 -471 2906 969
4624 969 -3190 -3227 753 2211 -1201 -3904 -1965 1390 1316 -2482 -3663 -412 2188 -94 -3061 -1681
4640 -1681 1378 2045 -661 -1951 -145 2831 1906 -857 -1147 1850 2771 1191 -959 -81 2449 2201
4656 2201 -37 -1021 973 2117 843 -642 -636 937 908 -757 -1305 -725 254 -272 -1299 -1408 -322 -373
4674 -373 -1005 -1711 -893 -588 -922 -919 -581 -357 -625 -612 -445 473 97 -104 337 889 992 425 120 918 1740
4695 1740 1025 146 411 1639 1709 130 -401 782 1985 855 -778 -816 1055 1352 -540 -2105 -792
4712 -792 1166 650 -1864 -2488 -326 809 -576 -2838 -1808 819 899 -1863 -2953 -519 1813 676
4728 676 -2147 -2119 1378 2653 -5 -2296 -312 2982 2507 -892 -1909 1373 3924 1601 -1978 -783
4744 -783 2694 3504 -226 -2524 71 3572 2180 -2081 -2602 1072 3288 -90 -3808 -2032 1938 2250
4760 2250 -2234 -4329 -578 2604 672 -3829 -3522 1270 2740 -681 -4176 -1531 3080 2827 -2294
4775 -2294 -3603 769 4373 1549 -3298 -2150 3231 4418 -195 -3516 -297 4831 3344 -2115 -3105
4790 -3105 1979 5013 1095 -3900 -2325 3183 3818 -1736 -4736 -349 4307 1731 -4157 -4214 1755 3846
4806 3846 -750 -5309 -2547 3138 2807 -3251 -5235 124 4249 843 -4626 -3431 3120 4323 -1027
4821 -1027 -4895 -792 4756 3290 -2807 -3918 2124 5715 1190 -4083 -2106 4217 4695 -1320 -4459
4836 -4459 49 5137 2626 -3828 -3575 2159 4851 -416 -5252 -1839 3914 3070 -3312 -5121 517
4851 517 4402 771 -4910 -3390 2709 3867 -1836 -5077 -980 4056 2358 -3419 -3825 1458 4392
4866 4392 488 -4000 -2019 3725 4029 -1419 -4003 561 4759 2054 -2942 -2760 2550 4503 45
4881 45 -3836 -1165 3752 2757 -2328 -3856 638 3838 821 -3909 -2596 2181 3256 -1276 -4267 -938
4897 -938 3139 1612 -2897 -3383 923 3306 294 -3669 -1801 2616 2894 -1513 -3193 316 3459 1737
4913 1737 -2488 -2278 1739 3273 -198 -2881 -877 2697 2291 -1452 -2679 625 3210 948 -2573
4928 -2573 -1843 1732 2399 -680 -2747 -370 2346 1550 -1873 -2067 742 2066 6 -2177 -1198 1545
4944 1545 1717 -1029 -1835 147 1600 481 -1535 -1197 905 1421 -369 -1407 -200 1407 853 -818
4960 -818 -1067 477 1173 -63 -945 -159 666 527 -442 -582 227 520 142 -633 -445 298 160 -165 -148 147
4980 147 187 -55 -135 169 463 -136 -191 474 627 -85 -493 9 904 481 -597 -401 400 711 -108 -1124
5000 -1124 -287 914 757 -991 -1248 282 1273 -86 -1677 -803 1063 1325 -916 -1943 -39 1683
5016 1683 704 -1599 -1419 967 1912 -260 -2079 -426 2321 1665 -1461 -1949 1167 2671 707 -2234
5032 -2234 -1112 1857 2492 -579 -2362 -75 2841 1445 -2000 -2361 1178 2832 -251 -2923 -1357
5047 -1357 2098 2074 -1432 -3381 105 2741 838 -3084 -2783 1420 2671 -761 -3498 -1169 2782 2217
5063 2217 -2309 -2999 867 3255 1060 -3187 -1927 2743 3620 -703 -3183 -48 3885 2477 -2418
5078 -2418 -2714 1604 4062 582 -3423 -1658 3061 3381 -1373 -3893 -13 3811 1170 -3624 -3327 1629
5094 1629 3540 -575 -4698 -2022 3305 2192 -2702 -4562 288 3969 726 -4009 -3066 2535 3911
5109 3911 -1192 -4478 -785 4540 2748 -2696 -3532 2097 5063 752 -3791 -1512 3990 3998 -1538 -4082
5125 -4082 632 4639 2082 -3435 -3300 2207 4428 -719 -4754 -1747 3744 2764 -3114 -5060 327
5140 327 4168 565 -5083 -3630 2575 3287 -1900 -5232 -1206 4013 2122 -3305 -3972 1691 4395 325
5156 325 -4310 -1770 3720 4109 -1576 -3568 762 4931 2262 -2843 -2206 2793 4632 61 -3694 -792
5172 -792 4022 3148 -2549 -3683 934 3870 812 -3823 -2754 2156 3103 -1859 -4838 -1204 2778 1311
5188 1311 -3303 -3619 780 3034 -171 -3989 -1934 2711 2543 -1880 -3301 61 3749 1718 -2286
5203 -2286 -2109 2330 3582 316 -2636 -346 3437 2767 -1026 -1984 1303 3507 1141 -2391 -1439 1966
5219 1966 2835 -648 -2611 -552 2197 974 -2509 -2673 381 1769 -473 -3368 -1955 1191 874 -1799
5235 -1799 -2568 -209 1680 155 -2164 -1839 1051 1521 -122 -1697 -77 1955 1474 -643 -777 1179
5251 1179 2255 910 -532 269 1738 2066 212 -476 804 1543 730 -721 -458 528 762 -460 -835
5268 -835 -528 38 -310 -995 -1118 -594 -538 -967 -874 -771 -581 -884 -796 -307 -412 -558 -429 -253 476 14 -674
5289 -674 -55 566 1090 101 -240 843 1449 775 -226 107 1392 1771 377 -376 743 1715 1191 -490
5307 -490 -937 906 1427 -73 -1804 -817 1056 715 -1675 -2189 -191 1095 -349 -2481 -1727 353 1152
5324 1152 -1209 -2758 -1082 1764 604 -2118 -2181 729 2510 259 -2441 -819 2389 2572 -894 -1846
5340 -1846 882 3473 1702 -1772 -1138 2172 3060 189 -2009 55 2893 2012 -1612 -2452 1081 3078
5356 3078 192 -3092 -1859 1497 2088 -1563 -3877 -874 2273 903 -3096 -3280 556 2592 -768
5371 -768 -3970 -1808 2352 2246 -1682 -3337 -41 3459 1534 -2769 -2158 2445 3773 -44 -2865 -509
5387 -509 4004 3111 -1498 -2749 1478 4385 1381 -2609 -1977 2546 3422 -998 -3636 -623 3189 1678
5403 1678 -2921 -3573 688 3549 -116 -4352 -2439 2442 2540 -2288 -4416 -909 3388 1429 -3578 -3200
5419 -3200 1865 3765 -330 -3822 -1662 3774 3125 -1863 -3494 1193 4598 1646 -2902 -2196 2874
5434 2874 4304 -357 -3363 -95 4181 2630 -2308 -3248 1393 4004 112 -3840 -2034 2650 2496
5449 2496 -1866 -4348 -706 3293 958 -3725 -3400 1454 2975 -831 -4311 -1715 2894 2430 -2421
5464 -2421 -3628 653 3620 895 -2939 -2206 2517 3653 -461 -2954 -106 3646 2465 -1775 -2655
5479 -2655 1231 3641 405 -3053 -997 2536 2692 -1020 -3051 43 3057 1006 -2734 -2103 1185
5494 1185 2471 -437 -3324 -1550 2023 1393 -2176 -2610 -129 2284 382 -2501 -2040 1519 2592 -625
5510 -625 -2561 -281 1983 1711 -1296 -2150 887 2707 477 -1711 -863 1834 2152 -433 -2114 149
5526 149 2523 1139 -1634 -1396 798 1990 38 -2061 -702 1497 1097 -1103 -1669 -134 1356 413
5542 413 -1521 -1313 519 1063 -745 -1505 -237 1128 485 -934 -1357 496 1254 -161 -823 -400 617
5559 617 532 -243 -657 495 641 242 -415 5 257 675 89 -527 195 553 172 -133 153 190 -105 -6 -139
5580 -139 18 15 -420 -124 13 161 -527 -439 125 111 -221 -862 -309 812 365 -1017 -696 404 825 201
5600 201 -1020 -233 979 964 -768 -1037 154 1248 629 -1199 -1043 1017 1447 -113 -1488 -173 1330
5617 1330 1045 -995 -1521 641 1647 253 -1792 -981 1364 1381 -650 -1975 19 2527 454 -1845
5633 -1845 -1443 1031 2051 -43 -2003 -717 2142 1544 -1182 -1912 695 2166 613 -2273 -1733 1415
5649 1415 2109 -977 -2352 -616 2368 1292 -1971 -2257 875 2368 -112 -2681 -1389 1983 2251 -1123
5665 -1123 -2683 -29 2880 793 -2280 -1906 1585 2838 -47 -2890 -739 2917 2061 -1529 -2491 892
5681 892 3077 1049 -2577 -2071 1872 2950 -756 -3007 -487 2713 1703 -2269 -3171 869 3217 70
5697 70 -3089 -1903 2105 2482 -1481 -3494 -227 3059 1146 -2544 -2602 1380 2966 -152 -3332 -899
5713 -899 2775 2400 -1553 -2989 761 3430 1170 -2857 -1830 2402 3340 -488 -2952 -425 3545 2192
5729 2192 -1962 -2944 1224 3624 464 -3258 -1759 2520 2660 -1393 -3591 -281 3051 1158 -3217
5744 -3217 -2852 1196 2935 -674 -3974 -1528 2594 2365 -1919 -3110 245 3116 833 -2862 -1894 2257
5760 2257 2746 -526 -2890 -222 3273 2180 -1690 -2228 1528 3361 409 -2530 -1046 2514 2653 -954
5776 -954 -2766 274 2954 1112 -2303 -2286 1163 2529 -610 -3139 -1118 1880 1377 -1983 -2938 -71
5792 -71 2102 154 -2380 -1902 1186 1799 -727 -2532 -314 2045 1479 -1389 -1646 1104 2591 555
5808 555 -1624 -707 2036 1833 -417 -1336 631 2378 1069 -1224 -920 932 1970 103 -1670 -748
5824 -748 1234 1182 -1016 -1711 39 1514 -115 -2092 -1386 530 1095 -735 -1953 -732 724 280 -1229
5841 -1229 -1516 117 908 -4 -1210 -541 1168 1051 -4 -452 390 1158 621 -157 -16 860 1377 207
5859 207 114 611 1045 861 42 90 243 753 -187 -340 -196 -10 -154 -502 -596 -185 -297 -497 -580 -385 -455 -908
5881 -908 -697 -304 -163 -521 -964 -407 234 -154 -497 -46 470 805 -60 -340 405 964 1128 -193 -166 850
5901 850 1368 410 -643 271 1526 1339 -242 -713 572 1556 333 -1269 -764 1053 927 -735 -1784
5918 -1784 -671 856 217 -1640 -1728 190 1053 -493 -2492 -1184 871 930 -1246 -2039 -385 1532 317
5935 317 -1644 -1292 1137 1848 59 -1573 -41 2411 1675 -820 -1096 1270 2589 740 -1527 -536
5951 -536 2008 2182 -454 -1742 176 2225 961 -1714 -1888 869 1912 -459 -2500 -1139 1327 1273
5967 1273 -1461 -2798 -251 1821 158 -2732 -1907 1002 1884 -851 -2614 -781 2101 1429 -1638 -1929
5983 -1929 709 2904 889 -1968 -767 2312 2664 -263 -1897 562 3149 1751 -1520 -1486 1418 3000
5999 3000 212 -2516 -1013 1984 1865 -1528 -2812 -92 2221 232 -2593 -2372 1028 2222 -1017
6014 -1017 -3428 -1357 2091 1243 -2248 -2840 141 2621 491 -2635 -1579 1830 2408 -520 -2535 -274
6030 -274 3056 1854 -1588 -1766 1542 3132 530 -2174 -451 2618 2215 -1011 -2019 391 2837 974
6046 974 -2059 -2015 1319 2431 -617 -2915 -1131 1965 1435 -1965 -3021 171 2020 100 -2927 -1925
6062 -1925 1241 1676 -1222 -2846 -327 2227 1287 -1885 -1825 1041 2520 233 -2072 -507 1994 2125
6078 2125 -779 -1622 622 2500 1145 -1541 -1069 1571 2405 -177 -1794 -339 1653 1263 -1538 -1678
6094 -1678 605 1789 168 -2028 -1130 902 1428 -1258 -2208 -516 1098 658 -1767 -1746 317 1471
6110 1471 -94 -1932 -833 1162 1263 -859 -1431 -9 1717 724 -994 -715 1206 1665 -54 -943
6126 -943 -79 1652 1164 -635 -1007 551 1304 468 -1052 -682 768 952 -563 -1280 -472 711 130 -777
6144 -777 -965 -128 500 -253 -938 -732 227 196 -531 -618 -184 518 65 -778 -140 223 421 74 -415 112 406
6165 406 361 114 55 148 243 212 363 515 244 76 217 280 282 101 36 220 103 192 -470 -120 -36 165 -616 -379
6189 -379 19 259 -107 -598 -400 167 345 -269 -479 -22 400 194 -760 -596 608 622 -96 -960 36 1073
6209 1073 671 -724 -860 566 1139 109 -957 -592 1002 884 -154 -1118 109 1502 797 -1011 -1182
6226 -1182 536 1128 -211 -1434 -531 1275 894 -1033 -1393 175 1249 144 -1664 -714 1122 1221 -607
6243 -607 -1569 29 1651 861 -1367 -1351 636 1911 -153 -1950 -575 1746 1169 -1003 -1559 374 2053
6260 2053 627 -1780 -923 1013 1966 -563 -2038 -447 1673 1128 -1455 -1585 557 1958 384 -1833
6276 -1833 -801 1518 1589 -816 -1980 53 2061 723 -1630 -1777 962 2041 -179 -2309 -690 1744
6292 1744 1589 -1224 -2092 180 2095 544 -2022 -1358 1078 1662 -379 -2145 -518 1657 1276 -1302
6308 -1302 -1944 358 2110 518 -1891 -997 1471 1788 -500 -1998 -205 2026 1089 -1522 -1587 885
6324 885 1945 170 -2091 -464 1921 1568 -1051 -2076 279 2253 810 -1907 -1255 1291 1982 -211
6340 -211 -2345 -616 1940 1282 -1531 -1977 453 1676 157 -1994 -1138 1557 1709 -826 -2140 -311
6356 -311 1844 766 -1571 -1505 877 1910 -135 -1776 -730 1935 1331 -744 -1573 601 2287 742
6372 742 -1572 -977 1161 1858 -338 -1500 -240 1578 1037 -1179 -1334 614 1625 2 -1795 -1048
6388 -1048 1214 1140 -695 -1740 -252 1271 -24 -1250 -1409 501 1107 -395 -1605 -412 1210 1028
6404 1028 -700 -1032 355 1446 562 -717 -570 984 1101 -195 -848 171 1252 858 -105 -539 683
6421 683 1143 240 -840 -223 714 782 -451 -900 -241 634 180 -992 -686 114 314 -449 -1012 -565 249
6440 249 -40 -621 -809 -12 487 188 -523 -191 128 345 -18 -381 188 518 491 -16 -114 428 450 240 72
6461 72 261 389 598 78 26 397 209 25 -204 -70 202 113 50 50 -107 -117 -199 -189 110 -350 -315 -497 -50
6484 -50 18 -564 -510 -317 260 -58 -507 -391 210 156 99 -295 -75 817 545 -351 -125 280 812 505 -462 -132
6506 -132 887 1001 26 -420 256 1007 507 -369 -545 484 1004 -282 -1135 -609 871 416 -1007 -1203
6524 -1203 -140 639 -351 -1484 -1007 586 824 -715 -1460 -78 999 438 -1271 -1079 789 1230 -203
6541 -203 -1143 -94 1329 1180 -751 -1016 725 1802 449 -967 -441 1304 1649 -313 -1297 136 1595
6558 1595 686 -1012 -1373 494 1422 -19 -1597 -1011 955 886 -1249 -1569 -193 1245 230 -1678 -1256
6575 -1256 584 991 -618 -1937 -529 1305 1300 -1059 -1385 509 1415 397 -1000 -579 1479 1717 -220
6592 -220 -1241 417 1922 1159 -1140 -1221 801 1889 200 -1482 -500 1493 1269 -758 -1737 154 1567
6609 1567 298 -2141 -1585 609 1211 -516 -1966 -707 1158 844 -1236 -1718 246 1472 276 -1526
6625 -1526 -852 1344 1275 -429 -1588 -47 1411 1081 -908 -855 1113 1766 271 -1177 -428 1336 1605
6642 1605 -495 -1253 423 1610 658 -1366 -1222 1029 1465 -258 -1816 -410 1210 851 -1212 -1792
6658 -1792 235 1199 -296 -1584 -937 873 878 -815 -1660 -222 1617 289 -1101 -1268 553 1513 87
6675 87 -1287 -308 1454 1405 -385 -984 615 1650 615 -750 -555 1206 1438 -80 -1009 -232 1342
6692 1342 578 -862 -1087 327 1187 -206 -1465 -951 688 932 -719 -1437 -176 771 169 -1217 -1137
6709 -1137 137 692 -290 -1102 -443 732 451 -413 -885 264 1087 132 -240 -215 475 993 21 -417 237
6728 237 785 534 -284 -55 453 792 -126 -361 -63 526 580 -365 -442 -114 286 -217 -495 -431 -160 222 -274
6749 -274 -808 -387 56 105 -439 -311 40 40 -171 -456 -32 421 413 131 0 20 349 169 133 75 454 215 322
6772 322 230 231 264 -57 140 111 258 -29 -177 -5 374 -360 -197 -68 210 -125 -540 -331 75 384 -190 -619
6794 -619 -177 191 -188 -340 -596 55 399 -200 -639 -381 310 377 71 -604 -172 538 263 -602 -222 365
6814 365 938 171 -616 111 1152 773 -498 -615 69 989 230 -861 -585 621 934 -400 -979 -144
6832 -144 815 190 -818 -955 84 996 -193 -1108 -501 919 777 -549 -1259 34 1102 326 -760
6849 -760 -750 540 1142 -226 -1142 -220 1233 996 -570 -1002 442 1404 351 -945 -724 1215 1005 -540
6867 -540 -1327 -170 1360 678 -855 -1266 718 1206 -123 -1151 -554 1185 1103 -587 -1454 84 1394
6884 1394 354 -1091 -927 654 1219 -143 -1425 -380 1389 858 -952 -1093 440 1517 330 -1286
6900 -1286 -717 879 1150 -480 -1271 -195 1354 1026 -1014 -1134 551 1551 90 -1358 -528 1021
6916 1021 1072 -845 -1305 316 1365 511 -1128 -1022 551 1230 -237 -1513 -287 1181 976 -813 -1292
6933 -1292 161 1394 248 -1249 -748 1067 1243 -149 -1510 -155 1195 824 -782 -1078 567 1400
6949 1400 -73 -1460 -464 822 845 -881 -1183 129 1401 469 -1128 -834 915 1416 89 -1499 -423
6966 -423 1386 774 -757 -999 265 1251 222 -1085 -545 985 951 -401 -1021 12 1335 628 -935
6983 -935 -712 517 1036 51 -948 -503 626 515 -933 -1098 177 1044 299 -712 -720 556 999 -470
7001 -470 -813 -21 805 450 -517 -355 178 1141 -20 -826 -266 588 836 -212 -776 -42 939 192 -492
7020 -492 -289 272 792 20 -617 48 764 642 -216 -565 1 341 161 -294 -352 258 405 -194 -645 -53
7040 -53 386 358 -466 -567 -210 336 162 -267 65 245 244 -355 -151 315 249 66 -23 -139 223 424 -29 224
7062 224 148 199 73 -31 -258 80 53 17 153 248 -265 -107 -293 51 -39 -147 -252 -108 -209 -128 -588 -305
7084 -305 113 163 22 -331 -121 54 77 -504 -375 183 365 -123 -429 231 693 325 -11 -186 344 808 356
7105 356 -497 -117 581 603 -430 -353 18 776 145 -608 -302 448 298 -221 -721 -509 631 400 -872 -1107
7125 -1107 205 688 12 -797 -621 577 525 -749 -1066 396 967 197 -759 -769 577 1018 -268 -957
7143 -957 189 1232 670 -432 -639 332 1255 212 -795 -331 1087 1102 -268 -1107 210 1142 599 -1155
7161 -1155 -744 648 1057 -181 -1341 -584 755 634 -822 -1442 44 804 -71 -1496 -851 472 1089
7178 1089 -633 -1378 -276 1203 732 -697 -1107 757 1559 67 -1064 -136 1027 1112 -125 -922 453
7195 453 1560 697 -715 -786 986 1282 -59 -1274 -224 1296 774 -622 -1115 202 825 258 -1403
7212 -1403 -731 580 803 -612 -1520 -580 960 431 -1100 -1358 344 1097 -73 -1677 -767 1015 1167
7229 1167 -501 -1258 250 1285 770 -851 -723 872 1473 7 -1036 -79 1374 1091 -755 -958 528
7246 528 1401 505 -792 -813 747 1227 -602 -1245 -497 1058 516 -910 -1282 204 1001 -52 -1627 -656
7264 -656 747 824 -914 -1625 -73 1197 213 -998 -899 778 1181 -108 -1054 -71 1220 983 -593 -476
7282 -476 461 1229 446 -745 -288 1030 1198 -423 -697 55 1021 569 -885 -1008 364 878 -304 -1101
7300 -1101 -610 305 275 -717 -976 -337 374 -180 -567 -585 371 358 -314 -659 -283 684 474 -588 -468 437
7320 437 697 138 -511 -163 587 715 -216 -178 237 638 407 -141 -29 342 68 65 -353 -168 321 139 -428
7341 -428 -277 -31 205 -130 -471 -444 79 25 -466 -682 -473 -144 -280 -546 -316 -12 41 -35 -38 77 -20 13 209
7364 209 107 -22 141 157 328 277 301 229 217 87 282 318 163 322 412 31 -192 -15 256 234 -286 -253 182
7387 182 272 -219 -461 -492 -110 106 -429 -867 -444 22 -5 -624 -631 131 587 8 -790 -340 485 263 -324 -406
7409 -406 319 783 396 -417 -316 473 700 205 -605 -22 1008 613 -271 -730 443 696 231 -664 -564
7428 -564 707 802 -330 -1026 -268 636 119 -725 -776 220 808 -98 -929 -668 676 516 -658 -1155 43
7447 43 976 115 -1136 -897 666 791 -249 -1003 -149 1048 950 -572 -582 635 1494 463 -865 -433
7465 -433 974 1087 -359 -1222 240 1350 213 -1025 -981 560 981 -129 -1297 -589 1229 466 -867
7482 -867 -1229 96 1241 233 -1314 -808 643 1284 -556 -1234 -340 1134 664 -875 -840 465 1102
7499 1102 102 -1224 -439 1185 1261 -623 -1192 126 1295 746 -960 -786 786 1367 -118 -1232 -414
7516 -414 1340 675 -796 -914 233 1001 215 -1129 -727 578 998 -404 -1256 -148 1205 640 -842
7533 -842 -1088 416 1163 370 -1184 -724 815 966 -404 -1179 -144 1251 561 -1121 -901 427 1203
7550 1203 -141 -1099 -363 1070 971 -656 -1079 61 1121 259 -872 -792 815 994 -279 -1238 -322 1022
7568 1022 663 -748 -1005 544 1389 263 -1011 -496 1038 843 -487 -768 -246 1027 477 -977 -774
7585 -774 494 1016 -138 -935 -403 873 635 -638 -762 391 964 -45 -788 -790 469 805 -251 -853
7603 -853 -28 764 344 -616 -466 430 484 264 -634 -291 423 667 -218 -513 213 588 427 -760 -491 391
7623 391 760 -13 -639 -263 403 334 -407 -585 147 505 83 -528 4 150 347 62 -521 -213 297 119
7643 119 -168 -186 100 98 -95 -44 -106 359 60 32 -93 193 361 94 -132 103 -53 262 5 49 284 242 235
7666 235 227 378 -116 -120 269 104 182 -171 -185 -345 27 -162 -280 -226 127 73 -330 -545 -182 343 88 -289 -345
7689 -345 228 122 -99 -549 60 503 371 -62 -423 265 257 523 -446 -448 290 833 -191 -352 100 607 446
7710 446 -390 -411 372 770 149 -641 -433 472 701 -242 -957 -124 547 329 -757 -532 211 689 -200 -1077
7730 -1077 -715 656 391 -587 -767 24 808 62 -825 -630 619 880 -229 -895 18 1032 821 -397
7748 -397 -590 605 1230 415 -909 -110 957 1249 -280 -1050 26 1157 681 -1036 -1102 534 1103 -383
7766 -383 -1153 -583 836 624 -1198 -1374 170 962 39 -1261 -892 765 777 -593 -1483 5 926 401
7784 401 -1045 -1092 691 1464 66 -1148 -449 1007 1276 -555 -1109 305 1709 577 -904 -639 829
7801 829 1145 42 -1192 -154 1017 879 -832 -1329 -79 1328 291 -1372 -1267 716 783 -604 -1477
7818 -1477 -365 1082 543 -1344 -1381 260 910 -149 -1356 -770 819 960 -506 -1239 149 1181 676
7835 676 -622 -759 811 1199 55 -1154 -212 1092 1238 -325 -1010 341 1331 304 -974 -672 771
7852 771 1163 -250 -1249 -395 784 643 -977 -1331 281 906 -130 -1484 -877 501 599 -813 -1343 -278
7870 -278 812 301 -842 -1155 441 765 8 -982 -192 958 717 -298 -748 304 1372 575 -259 -188
7888 -188 724 965 22 -810 -123 659 463 -684 -688 342 664 -103 -936 -554 184 193 -357 -1121 -273 558 -98
7909 -98 -643 -758 62 178 -367 -1078 -159 686 429 -286 -372 166 593 437 -391 119 648 632 -27 -274 251
7930 251 421 508 -44 165 444 635 124 138 100 291 398 -68 -441 -197 35 35 -619 -426 -62 50 -71 -484
7952 -484 -286 11 -75 -61 -491 -323 -68 -349 -62 -97 -54 -90 65 233 377 -111 134 221 274 131 198 334 123
7975 123 217 15 4 401 342 360 -283 -165 186 197 -17 -422 124 211 208 -533 -410 92 65 -200 -508 -541 108
7998 108 149 -422 -842 -413 592 72 -705 -738 371 549 -61 -650 -164 873 574 -247 -104 456 978 270
8018 270 -589 -337 818 774 -15 -807 182 905 552 -575 -542 379 938 -15 -817 -440 681 603 -681 -1153
8038 -1153 195 540 81 -1331 -910 542 638 -724 -1465 -240 874 715 -996 -1061 165 1116 -62
8055 -62 -926 -466 875 1074 -222 -1159 328 1544 325 -708 -721 799 1304 93 -1066 -351 1471
8072 1471 840 -819 -966 181 999 195 -1193 -1032 796 645 -417 -1178 -531 937 504 -1073 -1155 445
8090 445 1099 -238 -1191 -635 949 896 -872 -1221 338 1060 416 -1090 -640 661 1371 24 -878 -443
8108 -443 1261 1141 -818 -987 482 1168 465 -1374 -753 698 1073 -312 -1117 -224 1131 630 -1008
8125 -1008 -906 248 1123 81 -1144 -861 907 497 -506 -1445 -65 978 553 -864 -802 655 1256
8142 1256 35 -1102 -271 834 896 -324 -832 308 1120 317 -800 -693 843 1264 -382 -1092 -128
8159 -128 1167 468 -692 -954 171 1260 139 -833 -501 653 711 -563 -1047 -207 1124 285 -934
8176 -934 -554 466 888 -129 -887 -457 698 451 -564 -880 -76 973 292 -748 -391
8191c91
$$ Imaginary data points
##PAGE= N=2
##DATA TABLE= (X++(I..I)), XYDATA
0 0 0 0 0 0 0 0 0 8 0 0 -8 8 -8 16 -24 24 -32 40 -48 57 -66 82 -97 113 -135 160 -184 212 -247 282 -322 369
32 369 -420 473 -534 605 -680 760 -852 951 -1057 1176 -1308 1446 -1599 1769 -1954 2152
48 2152 -2372 2615 -2880 3170 -3497 3858 -4258 4714 -5229 5818 -6499 7303 -8262 9428
62 9428 -10885 12772 -15310 18933 -24560 34532 -57477 226575 -230337 -645215 184111 598768
74 598768 215435 -468904 -446167 223805 580506 -83094 -702105 -275903 504169 309595
84 309595 -473368 -612993 70616 465465 9078 -566673 -388364 245358 434450 -161277
94 -161277 -630266 -119181 556805 239122 -425354 -346489 232649 462894 92817 -379629
104 -379629 -209929 432738 496844 -163808 -408179 138617 530605 208581 -285692 -240206
114 -240206 269596 446128 572 -370845 -121074 353177 303807 -243136 -404881 77899
124 77899 355619 2949 -362344 -239596 126403 231825 -104868 -423590 -163326 279790
134 279790 124571 -321886 -298199 72226 227376 4071 -279145 -178033 193348 247417
144 247417 -90365 -259462 12560 302439 160991 -168765 -144001 180665 280549 39433
154 39433 -151955 -40147 216383 246491 -52447 -206065 71745 269069 56371 -160879
164 -160879 -97439 88941 156728 -16143 -208176 -94276 138731 80867 -161660 -191676 -52
175 -52 101052 -24987 -183853 -128582 49513 67890 -73946 -154464 -59570 95232 63457
186 63457 -113750 -103402 70174 100191 -1650 -50465 -13967 76558 115121 12758 -58961
197 -58961 49782 135310 52874 -18150 15725 64602 77418 33183 -19475 7378 53007 33813
209 33813 -9332 -26864 -4548 19022 -13862 -44309 -19689 -18335 -45054 -27871 -16567 -52168
221 -52168 -50908 -23425 -32773 -28326 -21624 -58954 -40624 28326 3628 -59705 -33274 28865 41982
234 41982 1748 -39329 -4855 73382 68949 -14406 -36653 42837 108414 54928 -49930 -27223
246 -27223 98859 106636 -13990 -64278 9040 98303 75892 -62807 -103413 44157 121132
257 121132 -14032 -130477 -57887 73539 70170 -71125 -148668 -27432 109429 27331 -141992
268 -141992 -124314 48809 112844 -32892 -165642 -59543 121327 88355 -91063 -135536 22901
279 22901 160153 57343 -137598 -94475 128292 163484 -33374 -141778 -5632 169467
289 169467 122095 -93467 -141258 73780 201785 29277 -163660 -80253 141217 157082 -67894
300 -67894 -186954 -10036 177675 76948 -155029 -162056 68203 178334 -17446 -213576
310 -213576 -90338 150558 124884 -114446 -197661 -298 185966 65634 -184366 -153739
320 -153739 116487 190540 -39002 -203558 -49948 187726 141935 -121897 -185866 60224
330 60224 226848 49810 -190224 -115472 160543 203258 -62567 -214627 -9936 220993
340 220993 116515 -158680 -181015 87704 227592 5369 -229167 -98331 181470 164523
350 164523 -113839 -219896 7874 216757 75689 -199324 -168607 120230 205899 -42965
360 -42965 -231538 -64207 197265 140601 -143751 -202617 55817 222805 40215 -204059
370 -204059 -125747 156273 195494 -74681 -219489 -10157 214999 105134 -162365 -171709 94026
381 94026 217891 -1107 -215630 -82510 181308 155998 -111633 -199699 25325 208015
391 208015 61639 -180651 -135851 121079 184448 -41535 -198886 -41400 181038 115307
401 115307 -128771 -163841 57833 185430 24246 -171253 -95997 131496 150976 -66731
411 -66731 -173925 -5024 166399 73795 -131387 -131351 70514 156894 -8517 -163326 -64088
422 -64088 127696 110467 -84684 -150339 14945 147545 41163 -131017 -100467 80609 129234
433 129234 -27097 -140295 -32991 123499 85359 -81609 -111358 37804 129741 27683
443 27683 -105608 -63282 87358 109581 -28991 -107196 -5791 111283 62083 -72507 -82600
454 -82600 41670 102725 6992 -95035 -47055 70774 71600 -44417 -96218 -6348 79439 26150
466 26150 -78761 -72564 30040 67771 -15431 -87560 -35715 55963 44862 -46197 -71307 7580
478 7580 65108 16786 -54660 -37216 40366 59512 -5043 -47116 -1703 57952 41679 -20805
490 -20805 -29349 26129 54473 16586 -25571 -10067 34468 36370 -5512 -25175 1969 27820
502 27820 10893 -21127 -20835 2981 8764 -9638 -24914 -18024 -4436 -6297 -17871 -20351 -14458
515 -14458 -11479 -13140 -10864 -8594 -14248 -15299 -2826 6527 -1805 -13778 -6251 16966 22102 19
529 19 -12839 10127 39449 27383 -8891 -8153 32004 49883 14069 -22210 -278 47225 42548
542 42548 -13882 -36550 12237 53741 14943 -48224 -38369 27963 43068 -23581 -71579 -24874
554 -24874 42474 20278 -61897 -75268 5215 52528 -11098 -85233 -50766 43044 50690 -41518
566 -41518 -85394 -4745 78059 34470 -64996 -57935 50619 93177 4756 -72819 -13722 94641
578 94641 81998 -32243 -66617 34137 112718 42674 -69261 -47494 73081 99678 -14294
589 -14294 -94585 -16747 94056 58001 -73189 -97863 20949 93467 -1129 -117328 -73495
600 -73495 59647 71360 -60406 -130057 -24682 91189 34922 -104302 -104896 39087 104775
611 104775 -10271 -121609 -48384 98743 92507 -54590 -106454 23318 134333 55486 -88037
622 -88037 -67575 89253 135612 -1238 -104837 -13372 129893 97992 -63315 -102063 41125
633 41125 137199 29982 -115491 -74209 85754 106943 -49175 -140669 -26612 109826 48376
644 48376 -117148 -127317 32719 110498 -19350 -152125 -75375 92072 85521 -81354 -141885
655 -141885 3031 129044 40487 -119010 -92051 83300 133158 -16231 -123896 -17045
665 -17045 138771 100941 -68352 -99319 58158 154303 37755 -106600 -53107 110944 124609
676 124609 -36636 -119922 2381 130879 59539 -101396 -102503 52054 114062 -17984 -138331
687 -138331 -59145 88894 68963 -87356 -133370 485 102778 12690 -126247 -91139 62212
698 62212 92461 -42555 -125024 -23252 105157 61768 -79001 -89164 48439 119382 18089
709 18089 -89762 -33031 98826 101273 -26284 -80810 22683 117628 55185 -63619 -55659
720 -55659 61488 101365 -1633 -86236 -23610 79480 57542 -54601 -85782 7122 73305
731 73305 5953 -89979 -66150 34889 51568 -39717 -95499 -29856 53630 25107 -67445 -74882
743 -74882 14551 60644 -2055 -69446 -34334 51083 56606 -21164 -54564 10643 71724 39103
755 39103 -31457 -28534 43263 71976 14249 -36726 -2957 58820 51087 -12674 -35125 14255
767 14255 54556 19651 -36530 -29505 22687 33762 -13377 -48902 -21747 21887 10427 -38121
779 -38121 -48039 -7723 16810 -10187 -45146 -33763 5893 12582 -20508 -36853 -10142 17885
791 17885 8609 -17409 -17598 10575 25505 7850 -8647 3518 24349 24958 9010 2252 15229
804 15229 26549 19066 7527 8255 15404 16079 9885 4778 4258 4616 2332 266 -357 -5279 -11141 -8225
820 -8225 -3686 -7820 -17941 -20173 -9925 -2871 -13391 -27209 -19392 -230 491 -18819 -26756 -6807
834 -6807 14641 4287 -21837 -17533 15452 27602 1318 -20392 352 35543 30522 -7760 -16356
847 -16356 20802 46762 19041 -20139 -9128 36065 43106 -3614 -32505 1553 43731 23885
859 23885 -30381 -36209 15024 40524 -4516 -52575 -27888 28993 26196 -34004 -58687 -8107
871 -8107 39568 6444 -56011 -47070 21335 42483 -16216 -61623 -18365 48934 35591 -36522
883 -36522 -51274 18756 65137 15563 -49365 -26146 51484 62721 -11210 -53084 4513 70826
895 70826 41070 -39322 -45006 33619 71419 6379 -61058 -26341 54696 52845 -32694 -68740
907 -68740 210 63781 19943 -64833 -57976 29300 58395 -17330 -80255 -30119 55583 40664
919 40664 -51241 -74150 9984 70129 12307 -72025 -47576 50079 68111 -20728 -75366 -6864
931 -6864 78318 46793 -50336 -59162 35475 85714 11811 -70031 -30360 68377 70201 -29183 -74520
944 -74520 5862 83311 34770 -64897 -60166 40678 76978 -10425 -84847 -29597 66647 51384
956 51384 -52679 -81887 10508 77130 13383 -80671 -55975 49855 68935 -28223 -87149 -12956
968 -12956 77597 42160 -62077 -69080 33232 83682 3761 -79109 -32950 69617 66904 -35684
980 -35684 -75286 9973 85369 32255 -65028 -52581 48352 77963 -10500 -77398 -17963 71439
992 71439 49699 -48412 -68515 19087 75030 10305 -71907 -42908 49630 59319 -28853 -74325
1004 -74325 -6834 65769 29740 -56549 -57306 29171 64752 -4926 -67952 -25265 55103 46860
1016 46860 -34896 -59849 10441 63664 18128 -53217 -38017 38642 55181 -12210 -56794 -9843
1028 -9843 53438 33671 -36138 -46164 16850 53054 6700 -48155 -26036 36367 40146 -18119
1040 -18119 -46669 -2479 44242 20699 -34373 -34673 18688 41601 -791 -40322 -16065 32647
1052 32647 29559 -18808 -36455 3367 36784 12318 -29995 -24159 19074 31155 -5485 -32890
1064 -32890 -8815 26660 18812 -18826 -27441 4841 26876 4843 -25620 -17245 15391 20594 -7363
1077 -7363 -24203 -5044 19581 11847 -14829 -17580 6291 18916 2818 -15776 -7916 12987 15086
1090 15086 -3361 -12527 1337 15094 8726 -6222 -6772 6341 12428 2709 -6721 -2069 6933 5876
1104 5876 -1462 -5119 -866 2868 860 -3344 -3651 -2824 -2373 -1344 -2016 -4726 -6189 -3867 -231 -169
1120 -169 -5845 -9065 -1942 5806 534 -9312 -7358 4847 10535 24 -11548 -2473 15027 12847
1134 12847 -5699 -10671 7080 21378 9185 -12369 -7858 17765 22416 -2344 -18121 -330
1146 -330 23862 15705 -16229 -21296 10020 25927 -652 -28826 -15678 18551 19587 -17635 -35198
1159 -35198 -3448 26329 5818 -32658 -28767 12191 27856 -8334 -39842 -13560 30348 21944
1171 21944 -23483 -33818 8235 40156 11207 -33448 -20207 31890 39806 -7049 -34337 572
1183 572 45244 29014 -25083 -30333 22854 47978 5502 -38749 -16978 37183 37703 -20730 -46069
1196 -46069 2138 44800 13382 -43074 -38244 19620 40004 -12477 -56110 -20063 36835 24977
1208 24977 -35700 -51046 3591 45548 7556 -50907 -33758 32257 43421 -13572 -49893 -7127
1220 -7127 51733 34281 -32751 -39898 24884 58394 11392 -42587 -19682 46909 52140 -15305
1232 -15305 -47620 6455 58142 26531 -39613 -39695 27163 55083 -4935 -58756 -20890 44465
1244 44465 33366 -35981 -58788 936 50214 7610 -59888 -43440 28169 42579 -20026 -62954
1256 -62954 -17451 48871 30001 -43724 -51266 18430 56221 7248 -51079 -26739 46490 53258
1268 53258 -17575 -49659 7541 62029 31760 -35402 -35954 33873 63021 1792 -50334 -12062
1280 -12062 51629 41138 -27204 -50552 8742 55639 10453 -53974 -35928 30041 39707 -20697
1292 -20697 -60442 -16335 42848 19823 -47569 -50098 12512 41474 -3941 -53682 -28896 35382
1304 35382 36150 -26090 -47018 4322 46734 20054 -33676 -29462 29987 50434 -555 -36361
1316 -36361 -2488 45201 35628 -15767 -31127 16294 49566 12825 -32599 -16531 29187 33975
1328 33975 -9324 -37930 -5809 34276 13699 -32573 -31825 7861 24349 -6172 -39962 -23339
1340 -23339 18590 15841 -24968 -35842 -4402 20671 5906 -27321 -25227 12547 24920 -5436
1352 -5436 -23995 -4097 22767 20846 -6921 -17190 11198 31169 11652 -10968 -3420 19308
1364 19308 25580 4765 -13317 2136 24255 14123 -8440 -9807 5464 15268 3777 -16233
1376 -16233 -11482 8311 6158 -11816 -17088 -8382 2184 -79 -16277 -18634 -2402 2725 -8496
1389 -8496 -14123 -9455 -582 3456 -5195 -10919 -618 6968 1907 -828 683 3728 9467 7801 1877
1404 1877 5486 10376 7931 7880 7915 5055 6829 9389 5658 4402 4209 521 3543 6285 -1365 -6244
1420 -6244 -1115 1021 -1024 -6030 -12206 -6496 3032 -5252 -16018 -11085 -1684 148 -7176 -16803 -10046
1435 -10046 6626 3538 -13291 -12973 2206 11157 3721 -11693 -8135 14759 18942 -2387 -10864
1448 -10864 5629 21442 16058 -5279 -10043 14785 27063 4539 -14165 -1931 19765 19422 -6105
1461 -6105 -20782 2471 24806 5175 -23406 -17154 9581 17673 -7708 -31512 -12552 19485
1473 19485 9037 -25240 -28061 1392 19980 -351 -31354 -20289 18633 21279 -14073 -28406
1485 -28406 -807 27800 16157 -20270 -22281 18414 34874 2241 -24657 -5545 29831 29497
1497 29497 -9381 -25990 9399 38624 12855 -24056 -17110 20798 32157 -3917 -34306 -7937
1509 -7937 31116 17381 -25560 -31257 5222 29225 1409 -38683 -24044 21653 23021 -19371
1521 -19371 -38220 -6556 28898 13993 -30897 -31852 15111 33646 -2852 -34135 -13074 30102
1533 30102 30276 -15324 -33247 7902 41030 14735 -26133 -19969 24122 39716 -1075 -34849
1545 -34849 -5411 37783 25026 -21229 -30797 9447 38348 7448 -37076 -22081 26296 29050
1557 29050 -16321 -39466 -6607 32403 15189 -33829 -34725 14029 32500 -5550 -39411 -18153
1569 -18153 27556 26741 -21523 -37911 4745 37038 10528 -30720 -24022 22592 36813 -5113
1581 -5113 -35438 -3934 37286 24081 -20115 -27953 12840 39449 7589 -32518 -15627 28670
1593 28670 29438 -12526 -32794 -896 33677 14588 -29388 -26330 16292 28702 -5862 -34057
1605 -34057 -12850 25274 19273 -22420 -31427 5594 28255 3227 -28998 -19022 18377 25309 -10074
1618 -10074 -29660 -1844 26863 13455 -18624 -20589 11284 27953 1808 -23823 -7496 21897
1630 21897 19303 -9292 -20558 2735 24969 9388 -18736 -13948 13244 19370 -3155 -20064
1642 -20064 -5769 17816 12112 -13571 -17148 4408 16148 1295 -16753 -11280 9917 13161 -7419
1655 -7419 -16754 -1732 12627 6145 -10534 -12313 4525 13354 117 -12527 -4789 9290 8992
1668 8992 -3759 -10201 348 11199 4810 -7393 -5810 5063 8963 695 -7755 -3260 7270
1681 7270 5911 -3894 -6194 710 6042 2680 -4531 -4607 2416 5030 -988 -4518 -1211 2230 2653 -1387
1697 -1387 -3678 -265 2651 663 -1571 -1549 -10 1334 1425 -1039 -1424 -147 374 1078 313 -1749 -1817
1714 -1817 1461 2115 -731 -2940 -1842 2240 2842 -2113 -5030 -399 4414 1701 -4167 -4953 2096 6520
1730 6520 196 -7203 -2993 6542 6196 -3027 -7512 602 10049 4595 -7641 -6501 6435 10716 -384
1745 -384 -9954 -2610 10940 8689 -6869 -10941 3193 13169 2969 -12387 -9119 8732 12221 -5098
1759 -5098 -16178 -3259 13128 6871 -12510 -15181 4223 15339 -320 -17780 -8873 12510 13005
1772 13005 -8388 -18231 43 18291 7483 -15437 -13370 11120 19598 -1034 -18200 -4306
1784 -4306 19514 15442 -10777 -16822 6682 22541 5662 -17903 -11132 15728 19617 -6359 -21289
1797 -21289 -2069 20950 10492 -17363 -19710 7373 20962 -1285 -24401 -12326 16001 15435
1809 15435 -12795 -25066 -1418 21363 7046 -21695 -18614 11377 21758 -3409 -24541 -7191
1821 -7191 21764 17275 -13281 -21041 7002 26861 7822 -20141 -11958 18854 24522 -4712 -22254
1834 -22254 -782 25763 15108 -16484 -19371 10599 25826 1488 -24384 -12075 18755 18847 -13003
1847 -13003 -26732 -1515 22681 7279 -24189 -21656 10195 21547 -5389 -28305 -10558 20109
1859 20109 15660 -16534 -24879 3989 25670 5551 -22976 -14640 17993 24320 -5340 -23151 -466
1872 -466 26908 16106 -15434 -17551 13042 27692 3476 -21776 -8182 21853 20814 -10519 -22669
1885 -22669 2816 24647 7902 -21938 -18229 11897 20191 -6783 -26742 -9032 18180 11362
1897 11362 -18769 -24142 3037 20095 444 -24274 -15011 13894 17074 -9280 -22445 -1658
1909 -1658 21189 10229 -15463 -14679 11901 22551 1937 -16889 -3660 20369 17158 -7295 -14400
1922 -14400 6567 22181 7381 -13844 -9135 13211 17166 -3798 -16766 -2512 14989 7852
1934 7852 -13255 -15664 3431 12265 -2477 -17586 -10343 7056 7342 -9734 -16764 -3002 9745
1947 9745 2149 -12756 -11143 4494 10136 -1773 -11462 -3105 10378 9019 -3989 -6858 4297
1960 4297 12777 5515 -4437 -1640 9203 11298 1806 -4338 1957 9968 6774 -2416 -4075 3464 7030
1975 7030 962 -5880 -4011 2312 2531 -4089 -7638 -3996 622 -1435 -6560 -7166 -3012 -624 -3228
1990 -3228 -5808 -4793 -941 21 -2343 -3198 -1373 927 1391 464 138 1641 3156 3591 3214 2720 2838
2007 2838 3952 5186 4393 2653 2334 3975 5258 3020 182 258 3309 3619 -443 -3661 -1638 2114
2023 2114 744 -4799 -6542 -2037 1596 -2553 -8538 -7428 -134 1766 -5265 -9950 -4557 3580 1744
2038 1744 -7109 -8166 809 7486 1184 -7481 -3463 8037 9953 -1015 -6395 2420 13119 8472
2052 8472 -4188 -4698 8792 14387 2854 -7965 -1358 12099 10913 -4508 -10381 2231 12990
2065 12990 3403 -12346 -10284 6378 10379 -5616 -17204 -6285 9584 4827 -13515 -16716 633
2078 633 11804 -1547 -17588 -10981 9334 11492 -7551 -16936 -1081 16312 8045 -12016 -11792
2091 -11792 9948 19003 1944 -14199 -2706 18460 16424 -6370 -13407 6285 21327 7486
2103 7486 -13541 -9218 13397 18105 -3537 -18169 -3069 17037 9407 -14462 -18026 4234 16700
2116 16700 -1149 -21656 -12519 11312 12329 -11094 -22221 -3229 16361 5767 -18036 -17030
2128 -17030 8213 18382 -1564 -19841 -7208 17550 15627 -9594 -17171 5226 22939 8448
2140 8448 -15241 -10319 15678 21481 -1791 -17483 -1205 21291 13814 -12034 -16204 7700 21104
2153 21104 2634 -19734 -10897 14261 15386 -9690 -22231 -2581 17791 6140 -19363 -18462 6909
2166 6909 16894 -3972 -23054 -9452 15573 12764 -12747 -20414 2320 20159 5476 -17823 -12683
2179 -12683 13576 19934 -3152 -18277 -1454 20895 13478 -11270 -14265 9207 22038 3327
2191 3327 -16727 -7020 16484 16388 -7425 -17756 1195 18883 6707 -16174 -14131 8728 15429
2204 15429 -4304 -19924 -6787 13263 8973 -12920 -17719 1998 14999 723 -17236 -10955
2216 -10955 10111 12863 -6458 -16273 -1217 15222 7952 -10935 -11288 7667 15946 1088 -12294
2229 -12294 -3519 13227 11826 -5239 -10771 3588 14512 4888 -9798 -6694 8120 11275 -2298
2242 -2298 -11050 -2141 9884 5574 -8097 -9857 2229 8460 -521 -10496 -6091 4961 5327 -4822
2256 -4822 -9377 -1556 6078 2232 -6977 -6479 2418 6162 -345 -6238 -2361 5237 5083 -1949 -4325
2271 -4325 1271 6174 3004 -2651 -2030 3344 4896 671 -2347 -208 3716 2819 -755 -1913 672
2286 672 2585 970 -1584 -1439 168 1107 -380 -1906 -1464 -566 -59 -543 -1711 -1465 -699 -321 37 -906
2304 -906 -1821 -674 869 736 -1059 -1802 46 2201 1319 -1825 -1700 1417 3443 641 -2447 -1062
2320 -1062 3102 3610 -1069 -3478 230 4676 2178 -3299 -3427 2454 5128 120 -5466 -2644 4729
2335 4729 4391 -3198 -6542 158 6373 2256 -5803 -5239 3468 6976 -1060 -7974 -2705 6979 5750
2350 5750 -5000 -8197 1393 9280 2385 -8567 -6197 5938 9087 -2701 -10377 -1990 9878 6184
2364 6184 -7677 -9476 3370 11373 936 -11558 -5878 9113 9423 -5211 -12088 -69 12222
2377 12222 5524 -9852 -9579 6610 12922 -932 -13012 -4086 12338 9815 -7558 -12474 2902
2390 2902 14732 3803 -12621 -8668 9816 13655 -3832 -14952 -2224 14188 8454 -10902 -13252
2403 -13252 4825 15320 741 -15941 -8397 11352 12111 -7692 -16748 -580 15260 5710 -14002
2416 -14002 -12715 7980 15219 -2017 -16587 -5231 14527 11240 -9233 -14624 3922 17461 4780
2429 4780 -14282 -9075 11963 15929 -3486 -15774 -1533 16902 10258 -11026 -13905 6382 17214
2442 17214 1563 -16189 -8703 12425 13377 -7613 -18101 -1186 15801 5986 -15106 -14604 6751
2455 6751 15614 -2615 -18472 -7021 13550 11066 -10423 -16697 2188 16745 4257 -15422 -10610
2468 -10610 11210 15844 -3344 -16170 -1740 16930 10831 -10310 -12724 7371 18380 3004
2480 3004 -14510 -6676 14040 14806 -6387 -15615 863 16634 6429 -14011 -12818 7539 14731
2493 14731 -2789 -17924 -6485 12315 8931 -10917 -16826 1431 13610 1418 -15893 -10575
2505 -10575 8890 12058 -5314 -15434 -1931 13770 7655 -10219 -10811 7073 14870 1459 -11638
2518 -11638 -3886 12827 12032 -4681 -10260 3539 14773 5764 -9001 -6777 8570 12133 -1886
2531 -1886 -11269 -2125 10150 6045 -7966 -10430 1683 9235 -456 -11838 -6934 4812 5475 -5596
2545 -5596 -11319 -2789 6372 1351 -8555 -7673 2581 6198 -1153 -7471 -2776 6472 5612 -2834 -4668
2560 -4668 2785 7148 3589 -2626 -1509 5790 7224 940 -2427 1789 5972 4414 -776 -2347 2215
2575 2215 4618 806 -3056 -1615 1272 1192 -1915 -3923 -2502 253 -1268 -3670 -3740 -2566 -1530 -2072
2591 -2072 -3415 -3225 -1500 -1475 -1555 -1123 -1293 -976 390 958 425 101 745 1864 3241 1929 426 2112
2609 2112 4407 3688 1610 601 2394 5110 3213 -776 -105 3644 3791 339 -2981 -1727 2736 2237
2625 2237 -3456 -5637 -781 2430 -975 -6373 -6181 -105 2771 -3878 -8424 -3579 2647 1352 -5393
2640 -5393 -7295 -52 6167 1006 -6679 -3529 5489 6962 -438 -5507 252 9567 6867 -3639 -4067
2655 -4067 6023 10621 3234 -5642 -2185 9417 9572 -2888 -7892 1535 9632 4124 -7824 -8677
2669 -8677 4160 9125 -2869 -12894 -5368 6917 4916 -8583 -13594 -1150 9377 215 -13640
2682 -13640 -9078 5794 8734 -4099 -13351 -2816 11807 6570 -8946 -9684 5687 13722 3149
2695 3149 -10228 -4199 12757 13118 -3538 -9884 3263 15314 7808 -8482 -8894 9120 15029 -835
2709 -835 -12766 -3459 11893 9262 -8812 -14614 1561 13060 1065 -15478 -10770 6688 10082
2722 10082 -6177 -18000 -5074 12175 5304 -12657 -13834 3711 12698 839 -14966 -7393 12032
2735 12032 12050 -6216 -12331 1909 15635 8100 -9904 -8873 10325 16640 356 -11752 -1778
2748 -1778 14359 12319 -6100 -12584 4568 16017 3595 -12551 -8715 8275 12474 -4617 -16581
2761 -16581 -3870 12438 5376 -12683 -14335 2222 11847 -558 -16722 -9409 9716 9363 -7771
2774 -7771 -14910 -1559 13254 5774 -11763 -10777 8248 14137 -653 -11761 -2870 13299 11848
2787 11848 -5603 -10889 5015 15948 4687 -9595 -5805 9649 13695 -2059 -12546 -581
2799 -581 12991 6120 -9167 -10623 3513 11544 -553 -14230 -7112 8398 7045 -7841 -13336
2812 -13336 -1837 9477 2789 -12063 -9910 5361 8442 -3096 -11067 -3961 8966 7190 -6826
2825 -6826 -8633 4141 10864 2241 -7099 -3844 7939 10011 -1203 -7552 1970 10428 5137 -4400
2839 -4400 -4766 4372 8843 661 -7626 -1906 6370 4345 -4039 -6695 -384 5566 975 -7675 -5424
2854 -5424 2549 3152 -3030 -6523 -3047 3042 1892 -4920 -5197 945 3157 -275 -3377 -2507 2450 3758
2870 3758 -1043 -2575 1367 3565 2025 -120 -369 2052 3881 1380 -678 1205 2334 1729 1092 -76
2886 -76 188 1468 785 -472 -182 -90 -923 158 -567 -1572 -1143 -947 -817 -497 -1574 -2894 -943 793
2904 793 -1232 -2450 -1685 -122 1233 -471 -3006 -845 2834 1420 -1714 -1868 862 3611 2095 -2311
2920 -2311 -1480 3689 4322 -252 -2507 104 4167 3750 -2175 -3525 2238 4997 478 -3939 -2374 2961
2936 2961 4405 -1855 -6193 -1031 4949 1955 -4643 -5417 1190 5517 -10 -7116 -3553 4627 4752
2951 4752 -3461 -6941 -604 6769 3345 -6442 -5726 4214 7324 -540 -7154 -2638 7135 6718 -4279
2966 -4279 -7932 2036 9033 2369 -7034 -5396 5475 8892 -1985 -9624 -1207 8974 5330 -6520
2980 -6520 -8473 2628 10174 899 -10461 -5287 7700 7982 -4552 -10884 -725 10571 4735 -9414
2994 -9414 -8776 5330 10663 -1114 -11361 -4256 10061 8478 -6871 -11084 2380 11885 2769 -10258
3008 -10258 -7793 7609 10837 -3487 -12185 -1588 10900 6393 -8232 -10554 3753 12501 686
3021 686 -11836 -5523 9404 9724 -5344 -12009 24 12806 5298 -10268 -8962 6956 11997 -715
3035 -715 -12281 -4130 11289 9113 -7222 -11464 2722 12590 3231 -11335 -8106 8379 11148 -3646
3049 -3646 -12648 -2171 11189 6773 -8880 -11332 3696 11900 168 -12517 -6145 8764 9311
3062 9311 -5432 -12476 -471 11712 4559 -9993 -8993 5877 11608 -603 -11610 -3700 10896
3075 10896 9128 -6485 -10234 3044 12496 3800 -10251 -7024 8559 11145 -2971 -11088 -1506
3088 -1506 11110 6409 -8092 -10065 3838 11065 -5 -11238 -5617 7872 7768 -5576 -11560
3101 -11560 -458 10019 2724 -9716 -7897 4795 8923 -1905 -10819 -2983 8697 6146 -6099
3114 -6099 -8749 2793 9854 2244 -8069 -4443 7547 8849 -2347 -7775 572 9293 5245 -5561
3128 -5561 -5743 4556 8759 323 -7415 -2474 6368 5268 -3984 -7118 724 6437 749 -6969 -5272
3143 -5272 3050 4591 -2696 -7208 -2138 4087 1777 -5277 -5494 601 3942 -222 -5209 -2299 3428
3158 3428 3440 -1734 -3591 766 4768 2347 -1722 -1350 3160 4377 760 -1405 1006 3662 2833 -390
3174 -390 -956 1455 2725 895 -1091 -856 897 930 -676 -1834 -1021 -258 -1023 -1808 -1771 -1432 -1392 -1455 -1673
3193 -1673 -1413 -1771 -1699 -907 -568 -1183 -1556 -776 964 720 -616 -1129 795 2816 1433 -510 51 2606
3211 2606 3365 1137 -649 853 3982 3134 -481 -891 2071 4153 978 -2440 -1397 2606 2636 -1606
3227 -1606 -4498 -1095 2795 385 -4439 -4686 283 2637 -1866 -5961 -3546 2097 1902 -3680 -6341
3242 -6341 -526 4257 1170 -4594 -3807 3224 5553 -502 -4616 -412 6386 5317 -2039 -3688 3119
3257 3119 8242 3157 -3937 -2231 5962 7343 -734 -5752 -29 7509 4487 -4959 -6061 2422 6837
3272 6837 -352 -8605 -4946 4856 4586 -5077 -9308 -1695 6155 1238 -8646 -7691 2703 6637 -2361
3287 -2361 -9665 -3387 7316 5620 -5549 -7831 2390 9877 2875 -7263 -3905 7924 9801 -1043
3301 -1043 -7749 800 11014 6809 -5340 -6745 5156 10861 1206 -8744 -3911 8322 7894 -5071
3315 -5071 -9891 168 9032 2646 -9729 -8491 3964 7556 -3339 -11946 -4387 7304 4521 -7831
3329 -7831 -10621 998 8943 768 -10105 -6526 6449 8638 -2869 -9485 -268 10647 6146 -5885
3343 -5885 -6820 5712 11564 2040 -8073 -2365 9891 9347 -2894 -8492 1791 11082 4571 -7811
3357 -7811 -6987 5404 9159 -1968 -10554 -3670 7452 5043 -7369 -10605 434 7661 353 -10635
3371 -10635 -7258 4769 6826 -4187 -10616 -2290 8018 4327 -6956 -8076 3370 9445 969
3384 969 -8141 -3033 8559 8647 -2478 -7421 2406 10468 5212 -5610 -4815 6033 9794 214 -7816
3399 -7816 -1338 8192 6016 -4896 -7966 1717 8029 732 -8611 -5816 4233 5294 -4012 -9266
3413 -9266 -2521 5680 2073 -7369 -7659 1724 5871 -1250 -7866 -3488 5113 4642 -3785 -5813 1425
3428 1425 7035 2620 -4433 -2987 5101 6885 -57 -4362 479 6839 4764 -2478 -3556 2766 6266
3443 6266 1241 -4295 -1625 3889 3707 -2121 -4669 -721 3512 637 -4250 -4069 548 2221 -1836
3458 -1836 -4863 -2618 1358 724 -3106 -3668 -231 1670 -384 -2599 -1583 1385 1711 -489 -1428 288
3474 288 2119 1638 127 88 1596 2410 1323 742 1087 1706 1316 986 767 672 821 251 705 210 -268
3493 -268 -824 -166 15 -616 -1735 -1359 -378 -101 -1576 -2589 -1190 277 -402 -2386 -2615 -335 1021
3510 1021 -502 -2509 -1207 1590 1926 -1000 -2043 351 3068 1960 -1501 -1219 2381 3876 616
3525 616 -2038 -188 3951 3263 -1089 -2631 1226 4394 1693 -3074 -2717 2526 3716 -1278 -4565 -1170
3541 -1170 3261 2093 -3595 -4708 523 3833 -57 -5513 -3649 2348 3411 -2420 -5691 -1039 4527
3556 4527 2408 -4256 -4444 2012 5409 254 -5220 -2132 4972 5206 -2073 -5028 1053 6794 3222
3571 3222 -4750 -3897 3800 6906 -385 -6306 -1541 6234 4832 -3998 -6640 1136 7175 1376 -7084
3586 -7084 -4831 4396 6101 -2591 -8011 -1429 6658 3587 -6452 -7138 2289 7369 165 -7982 -3811
3601 -3811 6135 6302 -3838 -7652 531 7991 3259 -6534 -5589 4511 8242 -765 -7921 -1740 7838
3616 7838 5880 -4706 -7361 2271 8857 1927 -7619 -4996 5882 7735 -2830 -8946 -856 8470
3630 8470 4316 -6407 -7334 3081 8274 -66 -8984 -3795 6901 6313 -4127 -8436 590 8477
3644 8477 3052 -7273 -6085 4864 7955 -1267 -8186 -2401 7436 5368 -5074 -7737 1933 8390
3658 8390 1607 -7619 -4871 5661 7182 -2535 -8379 -1107 7797 4164 -6011 -6847 3070 8245 325
3673 325 -7841 -3784 6488 6216 -3598 -7602 356 8114 3153 -6536 -5243 4179 7386 -992 -7558
3688 -7558 -2070 6882 5218 -4387 -6730 1846 7313 1426 -6943 -4389 4829 6094 -2403 -7518 -1113
3703 -1113 6389 3311 -5348 -5966 2460 6464 11 -6943 -3313 4947 4860 -3136 -6051 466 6433 2232
3719 2232 -5155 -4022 3533 5576 -434 -5599 -1022 5843 3946 -3094 -4160 1739 5712 1049 -4434
3734 -4434 -2474 3479 3992 -1821 -4605 -337 4346 1579 -3765 -3766 1734 3313 -927 -4413 -1517 2617
3750 2617 1849 -2590 -3525 208 2836 243 -3149 -1886 2092 2244 -934 -2353 -317 2671 1303 -1229
3766 -1229 -1066 1335 2466 654 -1062 321 2090 1654 13 -251 879 1522 556 -236 -2 667 462
3783 462 -452 -350 -74 -19 -580 -725 -601 -622 -1087 -1210 -597 -639 -1134 -1515 -530 260 -217 -1615 -1194 352
3803 352 1175 -440 -1680 -200 2039 970 -925 -965 1644 2461 742 -1268 256 2798 2590 -294
3819 -294 -1499 1196 3423 1458 -1875 -1638 2177 2982 -737 -3169 -819 2080 1552 -2720 -4010 -95
3835 -95 2531 -591 -4258 -3110 1434 2215 -2532 -4451 -1230 2999 1265 -3589 -3855 1351 4297 345
3851 345 -3946 -1611 4035 3873 -1140 -3738 1186 5861 2898 -2753 -2301 3846 5849 382 -4225 -1121
3867 -1121 5105 4311 -2821 -4699 1027 5011 1109 -5426 -4100 2768 4397 -2397 -7081 -2087 4305
3882 4305 2171 -5135 -6201 578 5237 -280 -6903 -3733 3990 4378 -3032 -6320 -67 6505 3039
3897 3039 -5040 -4582 4269 7291 255 -5654 -992 7077 6104 -2758 -5017 2472 8165 2652 -5531
3912 -5531 -3973 5289 6958 -2150 -6916 -1025 6599 3544 -5824 -7167 1684 5986 -896 -8229 -4653
3927 -4653 4221 4379 -4543 -8294 -803 5846 1936 -6882 -5782 3207 6571 -1002 -7307 -1933 6987
3942 6987 5493 -3753 -5519 2666 8291 2581 -5141 -3011 6265 7443 -1050 -5972 256 7463 4522
3957 4522 -4432 -5351 2963 7015 579 -7019 -3192 4599 4803 -3820 -7456 -1084 5562 1353 -6858
3972 -6858 -6062 1905 4700 -1802 -7759 -3472 4929 3690 -4172 -6149 879 6295 1767 -5698 -3534
3987 -3534 4763 6276 -1180 -5149 322 6723 4715 -3052 -4062 3246 7206 1816 -4299 -1726 4884
4002 4884 5197 -1935 -5359 253 5615 2122 -4959 -4396 1872 4315 -1408 -6280 -2629 3375 2015
4017 2015 -4404 -5586 -270 3887 258 -5503 -3630 2503 3470 -2097 -4629 -316 4395 2662 -2717
4032 -2717 -2768 2506 4826 847 -2606 -261 4230 4080 -927 -2424 1782 4602 1648 -2213 -1344 2191
4048 2191 3203 -332 -3054 -507 2186 646 -2255 -2511 -120 1384 -894 -3333 -2086 479 -63
4063 -63 -2139 -2554 -1189 494 -417 -2197 -1414 453 625 -348 -813 76 1112 965 -91 296 1209 1050
4081 1050 633 1113 1094 1315 1401 967 945 1250 680 142 985 925 -10 -452 -4 628 360 -1257 -1573 -204
4101 -204 420 -1050 -2038 -1531 191 347 -1658 -2865 -764 1285 -234 -2318 -1465 645 1544 -531 -2337
4118 -2337 -417 2562 1801 -1140 -1331 1648 3212 1270 -1721 -535 3023 3227 -471 -1684 766 3540
4134 3540 2033 -1976 -2261 2101 3304 -339 -3093 -1304 2154 2124 -2356 -4130 -190 2866 35 -4067
4150 -4067 -3273 984 2990 -1318 -4965 -1482 3321 1913 -3006 -3880 611 4039 810 -4091 -2238
4165 -2238 3588 4177 -1125 -3557 389 5018 3254 -3052 -3093 2832 5345 399 -4057 -1440 4393 4664
4181 4664 -2060 -4767 734 5188 1557 -4551 -4006 2426 4767 -1363 -6146 -1939 4364 2526 -3839
4196 -3839 -5428 278 5280 677 -5926 -3588 3953 4551 -1872 -6043 -745 5684 3469 -4578 -4696
4211 -4696 3042 6243 219 -5368 -2107 5206 5252 -2739 -5489 1685 6633 2078 -5098 -3948 3786
4226 3786 5911 -1177 -6459 -1174 5554 3442 -4027 -5554 1137 6148 619 -6531 -3437 4115 4594
4241 4594 -2421 -6519 -1060 5718 2742 -5120 -4936 2503 5754 -300 -5664 -2466 5231 4720 -3084
4256 -3084 -5586 1289 6005 2118 -4582 -3683 3874 5732 -1186 -5684 -716 5224 3455 -3494 -5001
4271 -5001 1395 5957 614 -5360 -2936 3767 4104 -1961 -5414 -772 5036 2230 -4407 -4316 2112 4623
4287 4623 -138 -5100 -2245 3980 3752 -2565 -4679 524 4796 1737 -4057 -3429 2921 4639 -1237
4302 -1237 -4461 -678 4019 2708 -2782 -4100 1534 4732 333 -4285 -2101 3113 3525 -1397 -4182
4317 -4182 -548 4234 1701 -3381 -2640 1639 3538 13 -3687 -1425 3228 2586 -1840 -3236 788
4332 788 3393 1105 -2728 -2169 2289 3034 -1108 -2724 -249 2588 1522 -2364 -2443 1049 2598 -376
4348 -376 -2474 -1051 1610 1513 -1329 -2419 225 2064 444 -1638 -956 951 1423 -318 -1605 40
4364 40 1368 662 -900 -636 622 1203 475 -881 -284 1187 670 -417 -9 395 759 29 45 -54 466
4383 466 85 -216 62 136 -159 -558 -347 337 106 -898 -882 103 243 -862 -1292 -239 494 -138 -1356
4402 -1356 -1031 466 1161 -573 -1442 -312 1547 899 -1057 -1244 642 2240 670 -1400 -489 2085
4418 2085 2105 -269 -1446 449 2634 1336 -1789 -1407 1373 2279 -179 -2613 -972 2178 1617 -1928
4434 -1928 -2860 469 2408 91 -3184 -2662 1243 2022 -1616 -3801 -1044 2357 1325 -2555 -3281 1017
4450 1017 3311 -20 -3162 -1681 2960 3095 -729 -3175 524 4146 2203 -2425 -2012 2702 4401
4465 4401 393 -3392 -860 3869 3273 -2125 -3578 572 3993 1178 -3716 -3264 2056 3582 -1463
4480 -1463 -5036 -1256 3397 2061 -3783 -4814 718 3800 -105 -5081 -3180 2938 3498 -2091 -5268
4495 -5268 -526 4767 2567 -3780 -3679 2734 5477 422 -4411 -1257 4900 4729 -1617 -4127 1417
4510 1417 5849 2456 -3972 -3230 3817 5255 -939 -5183 -1122 4854 3234 -4042 -5155 1338 4788
4525 4788 134 -5955 -3573 3278 3713 -3270 -6120 -1077 4473 1740 -5087 -4615 2270 4927 -581
4540 -581 -5307 -1919 5153 4068 -2380 -4249 1553 6306 2140 -4161 -2756 4122 5680 -600 -4659
4555 -4659 -36 5436 3597 -2907 -3992 2198 5560 687 -4741 -2839 3556 3799 -2545 -5642 -678
4570 -678 4172 1003 -5008 -4682 1404 3858 -1226 -5552 -2309 3419 2761 -3253 -4820 369 4717 1261
4586 1261 -3786 -2649 3329 4845 -490 -3881 -108 4978 3452 -1934 -2852 2516 5328 1342 -3181
4601 -3181 -1418 3713 3771 -1245 -3726 126 4245 1657 -3323 -3555 1213 3107 -1079 -4456 -2245 2244
4617 2244 1800 -3136 -4213 -536 2559 -83 -3985 -2652 1345 2451 -1261 -3357 -671 2743 1935
4632 1935 -1636 -2073 1705 3337 927 -2074 -324 3037 2998 -223 -1354 1115 3302 1609 -1262 -900
4648 -900 1802 2498 -270 -1703 -305 1534 813 -1634 -2037 12 690 -969 -2411 -1707 103 -239 -1973
4665 -1973 -1810 -813 256 -416 -1327 -773 92 212 -279 -467 47 560 499 31 380 1027 864 780 579 899
4685 899 976 522 952 1223 1257 395 197 896 1389 404 -602 -116 648 577 -1100 -1472 -129 445 -426 -1934
4705 -1934 -1491 67 347 -1490 -2283 -662 456 -106 -2150 -1895 349 1366 -483 -2140 -611 1991
4721 1991 1670 -747 -1677 1145 3092 1260 -1582 -388 2455 2951 434 -1851 396 3467 1956 -1378
4737 -1378 -1754 1362 3040 1 -2896 -1652 2193 1709 -1861 -3489 -586 2633 553 -3553 -3340 984
4753 984 2430 -1376 -3980 -1549 2390 1777 -2609 -3673 706 3325 740 -3263 -1940 2637 3696
4768 3696 -621 -3355 140 4416 2728 -2137 -2541 2260 4543 871 -3356 -1489 3584 3713 -1185
4783 -1185 -3897 285 4098 1799 -3389 -3489 1670 3745 -758 -4875 -1863 3149 2419 -3255 -4922
4798 -4922 97 4084 407 -4842 -3493 2364 4038 -1430 -4965 -902 4584 2706 -3323 -3743 2029
4813 2029 5120 892 -4278 -1681 4427 4597 -1452 -4163 802 5132 2653 -3418 -3448 3027 4842 -244
4829 -244 -4684 -1644 4480 3241 -2932 -4815 421 4592 907 -5143 -3635 2519 3798 -2176 -5564
4844 -5564 -1285 4272 2451 -3877 -4319 1454 4990 0 -4755 -2001 3878 3755 -1889 -4432 596
4859 596 4880 2111 -3463 -2820 3109 4840 -4 -4038 -901 4394 3150 -2576 -3858 1094 4549
4874 4549 853 -3922 -2957 2733 3480 -1279 -4562 -816 3641 1833 -3568 -3664 1299 3742 -90 -4163
4890 -4163 -2178 2808 2824 -1829 -4047 25 3774 1457 -3428 -2795 2107 3761 -396 -3472 -890 3261
4906 3261 2684 -1598 -2886 897 3626 910 -2743 -1979 2262 2904 -838 -3142 -503 2977 1636 -2205
4922 -2205 -2579 1069 2783 0 -2902 -1371 2148 2134 -1255 -2916 56 2370 716 -2146 -1828 1513
4938 1513 1997 -406 -2414 -423 1942 1286 -1365 -1832 305 2229 149 -1467 -478 1220 1379 -639
4954 -639 -1303 8 1761 572 -961 -825 419 1210 26 -1200 -264 739 579 -318 -705 230 632
4971 632 -64 -585 -246 454 509 -85 -106 106 29 47 28 254 296 -255 -300 168 420 -425 -747 46 787 218
4993 218 -853 -768 452 542 -527 -986 -101 830 531 -1173 -1368 614 1228 -145 -1275 -502 1252 1114
5011 1114 -742 -1535 229 1948 455 -1631 -1063 1609 1897 -357 -1855 42 2292 1141 -1533 -1729
5027 -1729 1117 2268 193 -2293 -789 2237 1705 -1357 -2506 211 2700 804 -2634 -2086 1497
5042 1497 2362 -952 -3326 -739 2552 1499 -2119 -2908 717 3067 157 -3011 -1775 2414 2919 -1001
5058 -1001 -3029 -277 3436 1986 -1888 -2382 1631 3799 580 -3031 -991 3230 2872 -1451 -3370
5073 -3370 180 3706 1216 -3327 -2511 1999 3451 -827 -4356 -1223 3112 2109 -2632 -3952 491
5088 491 3633 241 -4258 -2645 2719 3198 -1566 -4599 -643 3988 2307 -2861 -3497 1879 4665 547
5104 547 -4035 -1629 3752 4026 -1645 -3851 884 4867 2262 -3249 -2664 2656 4512 -378 -4395 -1126
5120 -1126 3988 2810 -2791 -4298 906 4488 577 -5023 -3022 2588 3248 -1953 -5284 -1060 3975
5135 3975 1856 -3867 -4414 1502 4226 -244 -4764 -2027 3841 3454 -2165 -4078 823 4956 2197
5150 2197 -3386 -2549 3184 4978 -356 -3770 -635 4742 3524 -2394 -3673 1681 4661 930 -3911
5165 -3911 -2379 2820 3324 -1754 -4508 -921 3627 1194 -3692 -3906 1019 3176 -796 -4810 -2236
5180 -2236 2693 2406 -2341 -4148 327 3520 1380 -3157 -2475 2412 3753 -260 -3252 -582 3957
5195 3957 3034 -1577 -2594 1479 4292 1190 -2426 -993 2995 3390 -494 -2993 98 2984 1479
5210 1479 -2560 -2786 983 2468 -365 -3259 -1769 1723 1418 -2098 -3599 -595 2067 286 -2761
5225 -2761 -2623 715 1994 -687 -2616 -899 2128 1361 -1312 -1810 787 2655 880 -1342 -444 2193
5241 2193 2255 -35 -1002 843 2351 1367 -549 -826 1596 2000 253 -1358 -177 1240 927 -1106 -1556
5258 -1556 -229 673 -509 -1523 -1188 -14 -190 -1007 -1505 -702 -151 -677 -1049 -665 -148 0 -465 -599
5276 -599 -3 312 -7 -83 329 625 461 543 1042 999 705 496 454 1416 1090 262 -121 866 1209 274 -666
5297 -666 -186 940 681 -756 -1376 -394 574 -221 -2025 -1626 127 575 -1331 -2557 -898 869 147
5314 147 -1639 -2105 188 1303 -209 -2178 -966 1694 1525 -686 -2031 826 2737 1224 -1310 -799
5330 -799 1926 3143 501 -1613 91 3159 2423 -1208 -1842 1405 3106 771 -2525 -1709 1766 2233
5346 2233 -1434 -3020 -670 1995 631 -2985 -2991 754 2290 -855 -3675 -1604 1764 1570 -2208 -3143
5362 -3143 -48 2749 567 -2853 -2111 1990 3384 -127 -2933 -247 3695 2552 -1347 -2165 1475
5377 1475 4124 1264 -2446 -1529 3201 3579 -657 -3114 -61 3557 1907 -2585 -3275 1310 3298 -408
5393 -408 -4100 -2099 2178 2151 -2391 -4076 -411 2930 675 -3802 -3420 1140 3362 -790 -4227 -1443
5409 -1443 3479 2407 -2393 -3307 774 4415 1482 -3158 -1998 3003 3808 -403 -3165 -23 4115
5424 4115 2868 -2140 -3025 1732 4314 478 -3535 -1576 3414 3348 -1801 -4106 98 3387 958 -3590
5440 -3590 -3420 1488 3381 -1337 -4680 -1488 2913 2079 -2820 -3940 136 3360 521 -3814 -2547
5455 -2547 2367 3108 -1088 -3344 -95 3955 2461 -2348 -2427 2067 3867 831 -3026 -1356 3096 3518
5471 3518 -1328 -3084 790 3480 1303 -2757 -2204 1626 3238 -651 -3765 -1012 2594 1664 -2069
5486 -2069 -3270 -33 2823 279 -3300 -2195 1501 2125 -981 -3010 -785 2645 1369 -2169 -2337
5501 -2337 968 2445 422 -2279 -1244 2483 2477 -801 -1973 758 2679 1442 -1556 -1683 1494 2524
5517 2524 34 -2109 -500 2015 1542 -1042 -2338 421 2083 134 -2130 -1391 775 1386 -738 -2382
5533 -2382 -434 1257 619 -1834 -1328 389 1155 -40 -1663 -780 1272 1196 -1073 -1164 313 1354 531
5550 531 -722 -562 782 1230 -77 -751 197 1042 744 -257 -703 394 1142 4 -581 -105 395 707
5568 707 -93 -626 -165 397 -346 -708 162 88 -193 -197 -50 -183 -108 -509 -389 268 361 -497 -152 442 264 -65
5590 -65 -537 -302 717 522 -494 -241 546 694 144 -579 -243 1054 793 -692 -971 463 1018 209 -867
5609 -867 -911 1127 1153 -617 -1450 65 1637 578 -1404 -1192 931 1843 -116 -1819 -344 1597 1254
5626 1254 -988 -1649 425 1904 337 -1989 -1082 1449 1691 -837 -2233 -672 2163 1262 -1992 -1861
5642 -1861 1133 2164 -27 -2371 -1439 1876 2057 -1263 -2525 270 2244 778 -2184 -1965 1318 2531
5658 2531 -380 -2563 -414 2365 1938 -1617 -2209 640 2976 519 -2659 -1370 1946 2637 -662 -2752
5674 -2752 -264 3094 1192 -2225 -2091 1171 2926 168 -3197 -1736 2514 2349 -1669 -3264 -178
5689 -178 2606 902 -2817 -2682 1736 2824 -520 -3419 -817 2482 2088 -1793 -2882 534 3548 608
5705 608 -2584 -1799 2240 3255 -755 -2892 -347 3478 2134 -1847 -2422 1485 3576 547 -3020 -1502
5721 -1502 2889 2795 -1508 -3175 -102 3204 1022 -2953 -3033 1646 3177 -868 -3662 -1208 2715 2052
5737 2052 -2389 -3601 466 3383 557 -3296 -2243 2158 2979 -1001 -3362 -274 3517 1914 -2005
5752 -2005 -2330 1369 3689 765 -2821 -1037 2942 2680 -1352 -2874 541 3421 1560 -2534 -2241 1773
5768 1773 2781 -354 -3203 -1066 2358 1619 -2176 -2761 282 2423 23 -3094 -2194 1462 2139 -1318
5784 -1318 -3178 -456 2326 1117 -1946 -2350 1207 2670 336 -2492 -1010 2119 2298 -997 -1882 526
5800 526 2655 1353 -1562 -1252 1732 2526 -89 -1610 -313 1990 1503 -1004 -1996 469 1773 64
5816 64 -1892 -1498 949 1226 -884 -2354 -826 1085 503 -1704 -1755 32 1035 -292 -1807 -1016 920
5833 920 753 -748 -1279 80 1427 906 -870 -626 974 1509 431 -468 349 1426 1291 -203 -387
5850 -387 762 1270 533 -534 -411 600 669 -246 -693 87 325 -189 -920 -653 -242 -137 -949 -734 -403
5869 -403 -223 -463 -608 -613 -269 -190 -581 -464 142 -89 19 120 526 344 42 -83 373 924 713 237 326
5890 326 1076 1099 48 105 737 851 518 -275 56 743 997 -192 -1173 -201 871 262 -1151 -1650 34
5909 34 809 -476 -1979 -987 502 213 -1041 -1778 -368 984 -175 -1822 -1432 900 1339 -730 -1582
5926 -1582 -340 1739 1232 -873 -1201 1055 2289 623 -1199 -341 2193 2097 -340 -1524 511 2418
5942 2418 1208 -1235 -1351 1287 2047 -348 -2098 -1138 1643 1239 -1646 -2586 50 1904 -17 -2509
5958 -2509 -2069 1028 1293 -1152 -2900 -738 1627 827 -1837 -2088 461 2631 64 -2156 -870 2297
5974 2297 2074 -782 -1620 449 2963 1599 -1455 -1249 1856 2858 298 -1875 -408 2526 2146 -1222
5990 -1222 -2300 430 2638 658 -2338 -1946 1179 1911 -997 -3055 -1179 2061 1222 -2048 -2787 437
6006 437 2104 33 -3031 -1905 1687 2085 -1097 -2821 -173 2688 1468 -1885 -1873 1520 3133 265
6022 265 -2219 -566 2645 2490 -859 -2149 733 2961 1219 -2155 -1450 1793 2482 -480 -2649 -768
6038 -768 2302 1566 -2197 -2781 241 2120 -97 -3044 -2128 1149 1874 -1637 -2835 -592 2270 770
6054 770 -2304 -2382 1038 2547 -363 -2361 -890 2421 1790 -1260 -2060 771 2868 1049 -1988 -1240
6070 -1240 2095 2570 167 -1943 -51 2559 1505 -1079 -1870 991 2032 310 -2317 -1335 1506 1549
6086 1549 -1366 -2401 -400 1758 577 -1948 -2049 387 1525 -423 -2455 -748 1338 1106 -1099
6101 -1099 -1905 259 1743 531 -1446 -1171 1303 1807 -31 -1379 -76 1794 1317 -581 -955 765
6117 765 1869 445 -1154 -508 1252 1311 -459 -1063 -152 944 475 -1045 -1155 474 1016 -411 -1499
6134 -1499 -567 639 404 -830 -1078 -446 768 -54 -773 -559 447 796 -349 -618 -82 810 646 -412
6152 -412 -452 477 717 247 -294 286 768 660 195 -348 283 540 199 -234 -9 341 407 -11 -425 96 -142
6173 -142 31 -232 -51 -109 -108 -452 -106 48 -269 -398 -269 -15 97 -379 -469 78 70 -6 -376 -70 537 611 -222
6196 -222 -703 460 977 176 -664 -395 1009 997 -142 -714 41 917 638 -639 -607 691 1103 -149 -1133
6215 -1133 -183 1153 545 -860 -1162 214 1128 -27 -1128 -836 1000 1102 -745 -1576 -177 1677 557
6232 557 -1223 -1145 576 1551 -210 -1791 -496 1268 1026 -746 -1632 226 1658 340 -1583 -997 1341
6249 1341 1633 -645 -1668 -268 1615 1144 -986 -1401 634 1944 130 -1695 -877 1591 1597 -778 -2178
6266 -2178 228 1705 731 -1418 -1529 1102 1672 -239 -1916 -794 1679 1151 -1250 -1983 525 1791
6282 1791 618 -1667 -1454 1218 1762 -691 -2220 -562 2095 892 -1507 -1832 477 2168 390 -1735
6298 -1735 -1084 1459 1587 -645 -2156 14 2212 934 -1497 -1659 924 2317 -18 -2059 -780 1952
6314 1952 1707 -1300 -1946 385 2486 661 -1785 -1370 1277 1875 -546 -2280 -462 1888 1340 -1505
6330 -1505 -2069 587 2110 84 -2062 -1147 1278 1518 -949 -2072 -116 2173 691 -1614 -1668 978
6346 978 2034 -373 -2060 -664 1957 1523 -997 -1555 483 2259 645 -1606 -1036 1427 1960 -655
6362 -655 -1690 12 1665 1195 -1359 -1543 615 1996 83 -1767 -734 1383 1193 -908 -1920 -128
6378 -128 1431 383 -1594 -1423 491 1305 -511 -1994 -591 1056 813 -983 -1412 469 1596 128
6394 128 -1368 -779 1011 1505 -367 -1161 63 1415 807 -828 -855 761 1164 249 -1086 -270 1170
6411 1170 1100 -496 -867 212 1241 566 -1001 -968 422 1027 -475 -1153 -649 381 215 -746 -1071 -93
6429 -93 498 -263 -1003 -639 275 579 -280 -867 -34 923 351 -323 -325 378 822 311 -315 -150 751 679 229
6450 229 -343 479 583 617 -235 -124 573 444 100 39 54 328 82 -376 -393 -143 -354 -138 -690 -441 -291
6471 -291 -331 -439 -117 -184 -385 -340 -382 -152 -375 -451 -64 159 272 129 21 391 451 317 -290 176 730 802
6493 802 24 6 324 751 425 -311 -301 523 643 185 -503 -265 532 99 -647 -904 -102 564 -162 -1402
6513 -1402 -818 47 391 -769 -1297 -239 542 185 -987 -883 800 520 -345 -1008 -83 1243 802 -574
6531 -574 -854 486 1466 518 -776 -250 1146 1431 -125 -1015 389 1518 941 -732 -883 647 1453
6548 1453 -118 -1422 -790 1129 990 -1002 -1632 13 1154 43 -1641 -1139 658 1103 -782 -1635
6564 -1635 -728 1017 624 -1406 -1505 495 1567 165 -1490 -612 1205 1496 -166 -1419 306 1717
6580 1717 926 -936 -852 730 1743 273 -1187 -372 1453 1339 -686 -1270 283 1658 338 -1626
6596 -1626 -1192 694 1240 -759 -2164 -540 1155 414 -1284 -1687 159 1386 -151 -1938 -1115 1078
6612 1078 1312 -835 -1731 -126 1810 684 -1348 -1156 1123 2039 134 -1156 -421 1845 1606 -491
6628 -491 -1009 846 2032 851 -1468 -843 1182 1572 -317 -1911 -517 1330 1015 -1506 -1896 210
6644 210 1385 -75 -2044 -1480 756 868 -1038 -1860 -369 1606 576 -1516 -1314 603 1629 -307
6660 -307 -1652 -540 1230 1273 -714 -1355 629 1751 496 -989 -666 1227 1791 -28 -997 113 1533
6677 1533 961 -698 -1099 785 1436 109 -1245 -955 683 941 -604 -1591 -176 1101 -30 -1371
6693 -1371 -1297 189 892 -388 -1525 -437 799 527 -611 -1175 268 1074 332 -1000 -498 652 1041
6710 1041 56 -965 11 1172 664 -408 -431 561 1082 244 -634 -433 657 728 -108 -686 278 550 149
6729 149 -574 -706 72 335 -398 -871 -218 195 170 -524 -746 -87 290 -117 -559 -284 303 252 -120 -350 -150
6750 -150 329 338 -136 96 185 546 172 -11 269 593 353 112 115 519 350 310 69 94 208 73 -200 -105 146
6773 146 222 148 -121 -86 -260 -144 -285 -178 -194 -336 -477 160 -123 -178 -368 -236 134 295 -94 -400 15 408
6795 408 207 -274 -304 180 641 166 -555 -118 662 695 -50 -576 211 813 402 -541 -164 513 682 -238 -896
6816 -896 -135 629 501 -748 -945 245 661 3 -1075 -467 577 495 -457 -1140 -6 1230 204 -1077
6834 -1077 -839 536 912 -466 -1036 -237 983 701 -658 -1168 423 1141 367 -1085 -637 1002 1012 -371
6852 -371 -1156 179 1360 356 -1030 -906 521 1198 7 -1374 -539 1032 787 -622 -1419 317 1372
6869 1372 440 -1370 -862 848 1117 -446 -1505 -515 1243 628 -1043 -916 419 1353 209 -1405 -707
6886 -707 947 915 -507 -1328 40 1247 486 -1283 -1007 750 1214 184 -1329 -514 1273 923 -1037
6903 -1037 -1194 319 1311 444 -1095 -931 748 1199 -537 -1332 -71 1121 1059 -1116 -1340 222 1478
6920 1478 277 -1349 -606 795 1174 -443 -1448 -166 1338 461 -967 -804 693 1221 -39 -1250
6936 -1250 -522 1355 1002 -922 -1265 158 1531 425 -1148 -1048 748 1240 -210 -1380 -361 1160
6952 1160 551 -821 -1349 314 1306 124 -1027 -771 933 1049 -377 -1340 200 1518 880 -901 -1206
6969 -1206 499 1057 47 -1306 -411 857 1056 -466 -1116 224 962 109 -971 -863 731 923 -414
6986 -414 -1349 -70 1073 591 -752 -1046 247 1102 140 -833 -416 921 781 -361 -1069 207 1130 446
7004 446 -564 -540 705 966 102 -743 -90 1003 291 -488 -626 305 689 458 -803 -651 418 573 -361
7023 -361 -755 -187 484 227 -418 -564 30 300 -58 -451 -352 237 446 -229 -522 28 403 118 -233 -163 240
7044 240 527 130 96 181 728 183 -7 -123 -164 556 63 -57 -254 216 202 -63 6 -168 8 -175 -168 -313
7066 -313 84 58 -90 -188 -280 -214 -249 -146 -181 -316 -163 -214 74 25 -177 -39 48 484 183 -125 33 300 239
7089 239 -132 -182 202 400 412 29 -302 275 591 360 -1 18 336 231 -79 -513 106 446 249 -423 -725
7110 -725 -161 376 -424 -975 -690 214 369 -491 -878 -177 401 231 -869 -844 491 562 -414 -775 -463 860
7130 860 749 -434 -765 453 1022 337 -405 -312 1051 999 -235 -717 97 1256 461 -760 -788 618 1025
7149 1025 -178 -1230 -220 752 623 -879 -1242 -39 944 -35 -1441 -1136 553 849 -332 -1269 -137
7166 -137 1103 354 -890 -937 392 939 -108 -1116 -477 1057 924 -688 -1097 322 1453 482 -885
7183 -885 -287 999 1531 84 -1148 -49 1278 934 -879 -933 546 1418 241 -1366 -914 990 758
7200 758 -732 -1528 -384 889 527 -1391 -1336 176 1113 -134 -1562 -782 755 867 -678 -1399 108
7217 108 1272 610 -1005 -749 980 1241 11 -1100 -52 1528 1019 -544 -1090 435 1743 416
7233 416 -961 -393 1086 1027 -354 -1463 43 1033 558 -1127 -1393 324 1019 -349 -1414 -547 895
7250 895 721 -834 -1535 -136 902 86 -1147 -787 526 1211 -334 -1162 -327 1314 874 -655 -883
7267 -883 596 1357 552 -996 -365 1042 1087 -102 -940 206 1259 774 -709 -538 504 975 -239
7284 -239 -1050 -633 991 473 -692 -1267 65 868 75 -1213 -737 574 592 -489 -1343 -278 754 143
7302 143 -847 -653 276 759 69 -748 -313 637 902 -6 -623 398 820 460 -268 -386 621 728 52
7321 52 -286 200 748 379 -307 -394 40 489 21 -684 -190 132 383 -137 -574 -248 96 -75 -457 -510 -128
7342 -128 -42 -285 -334 -392 -33 137 12 -188 170 375 255 -99 177 -16 586 -37 225 161 432 253 337 144
7364 144 251 90 153 323 240 168 -97 111 84 -95 -25 -238 37 208 -358 -465 -216 22 -251 -189 -362 162
7386 162 -131 -44 -303 -163 -82 151 -435 -348 103 731 397 -317 -258 456 654 335 -645 91 678 675 -266 -108
7408 -108 267 885 377 -520 -104 552 539 -254 -786 139 526 317 -788 -630 434 439 -119 -1134 -550 306
7428 306 528 -471 -985 -125 779 146 -1181 -539 765 693 -486 -881 -105 972 697 -560 -849 346
7446 346 1326 209 -976 -355 947 1127 -374 -980 342 1275 520 -1017 -675 509 1030 -164 -1067
7463 -1067 -389 802 618 -880 -1063 305 1069 117 -1140 -702 1085 709 -573 -1418 -358 1019 613
7480 613 -849 -875 358 1125 94 -1105 -361 1041 1011 -535 -1140 249 1646 360 -883 -594 702
7497 702 1297 -173 -1243 -132 1196 957 -643 -1068 143 976 323 -1190 -569 831 1141 -566 -1234
7514 -1234 -135 1064 611 -1094 -1268 78 1034 99 -1408 -612 893 1055 -603 -1106 -161 1318 579
7531 579 -852 -846 578 1311 -189 -812 -303 1034 804 -728 -1300 312 1343 447 -886 -923 577 913
7549 913 -424 -1203 -364 1049 673 -578 -1041 282 1127 23 -1351 -818 702 887 -421 -1100 -9
7566 -9 1023 514 -995 -910 521 1003 -111 -989 -572 1017 753 -595 -793 63 1100 279 -1057 -547
7584 -547 613 716 -277 -1008 -190 890 529 -435 -680 392 1051 -105 -937 -415 849 869 -467 -771
7602 -771 72 904 209 -703 -546 600 854 -255 -673 -40 696 576 -502 -518 311 665 0 -591 -315
7621 -315 350 347 -48 -491 -43 412 304 -646 -403 221 194 -269 -399 -145 228 95 -46 -288 179 157 72 -289
7643 -289 -10 82 400 -83 -188 -19 -73 259 -165 332 179 37 127 -89 -230 -5 110 97 126 33 50 69 -36
7666 -36 -77 -238 -168 -48 22 -242 -136 -423 -109 3 -343 -107 188 84 6 -162 -230 35 301 175 -440 -298
7688 -298 195 253 24 -195 156 216 412 -205 -252 314 529 280 -234 -202 509 489 -146 -446 134 391 294 -689
7710 -689 -690 -3 553 -177 -869 -734 533 309 -603 -957 38 868 -61 -792 -504 376 616 -234 -1077 -288
$$ [...]
8191H49
##END NTUPLES=NMR FID
##END=
