##TITLE=1H_LY-3hexyne Pd240
 CDCl3,8 sc, 
 23.9.2021
##JCAMPDX= 6.0         $$ Bruker NMR JCAMP-DX V2.0
##DATA TYPE= NMR FID
##DATA CLASS= NTUPLES
##ORIGIN= UXNMR, Bruker Analytische Messtechnik GmbH
##OWNER= root
$$ XWIN-NMR		Version 3.5
$$ Thu Sep 23 10:36:42 2021 Russian Standard Time (UT+4h)  she@DPX200
##.OBSERVE FREQUENCY= 200.1314
##.OBSERVE NUCLEUS= ^1H
##.DELAY= (6, 6)
##.ACQUISITION MODE= SIMULTANEOUS
##.ACQUISITION SCHEME= undefined
##.AVERAGES= 8
##.DIGITISER RES= 18
##SPECTROMETER/DATA SYSTEM= spect
##.PULSE SEQUENCE= zg30
##.SOLVENT NAME= CDCl3
##.SHIFT REFERENCE= (INTERNAL, CDCl3, 0, 15.7039)
##AUDIT TRAIL= $$ (NUMBER, WHEN, WHO, WHERE, WHAT)
$$ ##TITLE= Audit trail, XWIN-NMR		Version 3.5
$$ ##JCAMPDX= 5.01
$$ ##ORIGIN= Bruker BioSpin GmbH
$$ ##OWNER= she
$$ F:/spectra/data/she/nmr/H-F/1/audita.txt
$$ ##AUDIT TRAIL=  $$ (NUMBER, WHEN, WHO, WHERE, WHAT)
(   1,<2021-09-23 10:35:34.03 +0400>,<she>,<DPX200>,
      <created by zg, POWCHK disabled, PULCHK disabled
       configuration hash MD5:
       00 E9 B6 7A A2 85 ED C7 34 08 36 98 17 FE 4E 26
       data hash MD5: 16K
       93 83 09 FC 15 54 D3 49 77 06 C1 20 BF 9D 3F 77>)
$$ ##END=
$$ 
$$ hash MD5
$$ 72 2B C0 2A BD 7C 34 72 92 E5 77 BF FF 18 A5 F0
##$RELAX= 
##$RELAX= 
##$RELAX= 
##$RELAX= 
##$RELAX= 
##$RELAX= 
$$ Bruker specific parameters
$$ --------------------------
##$DU= <F:/spectra>
##$EXPNO= 1
##$NAME= <H-F>
##$PROCNO= 1
##$TYPE= <nmr>
##$USER= <she>
##$AMP= (0..31)
100 100 100 100 100 100 100 100 100 100 100 100 100 100 100 100 100 100 
100 100 100 100 100 100 100 100 100 100 100 100 100 100 
##$AQSEQ= 0
##$AQ_mod= 1
##$AUNM= <au_zg>
##$AUTOPOS= <>
##$BF1= 200.13
##$BF2= 200.13
##$BF3= 200.13
##$BF4= 200.13
##$BF5= 200.13
##$BF6= 200.13
##$BF7= 200.13
##$BF8= 200.13
##$BYTORDA= 1
##$CFDGTYP= 0
##$CFRGTYP= 5
##$CHEMSTR= <none>
##$CNST= (0..31)
1 1 145 1 1 1 1 1 1 1 1 1 1 1 1 1 1 1 1 1 1 1 1 1 1 1 1 1 1 1 1 1 
##$CPDPRG= <>
##$CPDPRG1= <>
##$CPDPRG2= <>
##$CPDPRG3= <>
##$CPDPRG4= <mlev>
##$CPDPRG5= <mlev>
##$CPDPRG6= <mlev>
##$CPDPRG7= <mlev>
##$CPDPRG8= <mlev>
##$CPDPRGB= <>
##$CPDPRGT= <>
##$D= (0..31)
0 1.2 0 0 0 0 0 0 0 0.06 0 0.03 0 0 0 0 0.0002 0 0 0 0 0 0 0 0 0 0 0 0 
0 0 0 
##$DATE= 1632378933
##$DBL= (0..7)
120 120 120 120 120 120 120 120 
##$DBP= (0..7)
150 150 150 150 150 150 150 150 
##$DBP07= 0
##$DBPNAM0= <>
##$DBPNAM1= <>
##$DBPNAM2= <>
##$DBPNAM3= <>
##$DBPNAM4= <>
##$DBPNAM5= <>
##$DBPNAM6= <>
##$DBPNAM7= <>
##$DBPOAL= (0..7)
0.5 0.5 0.5 0.5 0.5 0.5 0.5 0.5 
##$DBPOFFS= (0..7)
0 0 0 0 0 0 0 0 
##$DE= 6
##$DECBNUC= <off>
##$DECIM= 32
##$DECNUC= <off>
##$DECSTAT= 4
##$DIGMOD= 1
##$DIGTYP= 9
##$DL= (0..7)
0 120 120 120 120 120 120 120 
##$DP= (0..7)
150 150 150 150 150 150 150 150 
##$DP07= 0
##$DPNAME0= <>
##$DPNAME1= <>
##$DPNAME2= <>
##$DPNAME3= <>
##$DPNAME4= <>
##$DPNAME5= <>
##$DPNAME6= <>
##$DPNAME7= <>
##$DPOAL= (0..7)
0.5 0.5 0.5 0.5 0.5 0.5 0.5 0.5 
##$DPOFFS= (0..7)
0 0 0 0 0 0 0 0 
##$DQDMODE= 0
##$DR= 18
##$DS= 0
##$DSLIST= <SSSSSSSSSSSSSSS>
$$ [...]
##$SUBNAM2= <"">
##$SUBNAM3= <"">
##$SUBNAM4= <"">
##$SUBNAM5= <"">
##$SUBNAM6= <"">
##$SUBNAM7= <"">
##$SUBNAM8= <"">
##$SUBNAM9= <"">
##$SW= 20.0188988654967
##$SWIBOX= (0..15)
0 0 2 0 0 0 0 0 0 0 0 0 0 0 0 0 
##$SW_h= 4006.41025641026
##$TD= 16384
##$TD0= 1
##$TE= 0
##$TE2= 300
##$TE3= 300
##$TEG= 300
##$TL= (0..7)
0 120 120 120 120 120 120 120 
##$TP= (0..7)
150 150 150 150 150 150 150 150 
##$TP07= 0
##$TPNAME0= <>
##$TPNAME1= <>
##$TPNAME2= <>
##$TPNAME3= <>
##$TPNAME4= <>
##$TPNAME5= <>
##$TPNAME6= <>
##$TPNAME7= <>
##$TPOAL= (0..7)
0.5 0.5 0.5 0.5 0.5 0.5 0.5 0.5 
##$TPOFFS= (0..7)
0 0 0 0 0 0 0 0 
##$TUNHIN= 0
##$TUNHOUT= 0
##$TUNXOUT= 0
##$USERA1= <user>
##$USERA2= <user>
##$USERA3= <user>
##$USERA4= <user>
##$USERA5= <user>
##$V9= 5
##$VALIST= <valist>
##$VCLIST= <CCCCCCCCCCCCCCC>
##$VD= 0
##$VDLIST= <DDDDDDDDDDDDDDD>
##$VPLIST= <PPPPPPPPPPPPPPP>
##$VTLIST= <TTTTTTTTTTTTTTT>
##$WBST= 1024
##$WBSW= 4
##$XGAIN= (0..3)
0 0 0 0 
##$XL= 0
##$YL= 0
##$YMAX_a= 147393
##$YMIN_a= -181242
##$ZGOPTNS= <>
##$ZL1= 120
##$ZL2= 120
##$ZL3= 120
##$ZL4= 120
##$ABSF1= 10
##$ABSF2= 0
##$ABSG= 5
##$ABSL= 3
##$ALPHA= 0
##$AQORDER= 0
##$ASSFAC= 0
##$ASSFACI= 0
##$ASSFACX= 0
##$ASSWID= 0
##$AUNMP= <proc_1d>
##$AZFE= 0.1
##$AZFW= 0.1
##$BCFW= 1
##$BC_mod= 2
##$BYTORDP= 1
##$COROFFS= 0
##$CY= 11.3945322036743
##$DATMOD= 1
##$DC= 2
##$DFILT= <>
##$DTYPP= 0
##$F1P= 2.36226072786647
##$F2P= -0.459571619588291
##$FCOR= 0.5
##$FTSIZE= 0
##$FT_mod= 4
##$GAMMA= 1
##$GB= 0.15
##$INTBC= 1
##$INTSCL= 1
##$ISEN= 128
##$LB= 0.24
##$LEV0= 0
##$LPBIN= 0
##$MAXI= 10000
##$MC2= 0
##$MEAN= 0
##$ME_mod= 0
##$MI= 1.114404
##$NCOEF= 0
##$NC_proc= 0
##$NLEV= 6
##$NOISF1= 3.799351
##$NOISF2= 2.8
##$NSP= 1
##$NTH_PI= 0
##$NZP= 0
##$OFFSET= 15.70392
##$PC= 1
##$PHC0= -14154.08
##$PHC1= 11.40088
##$PH_mod= 1
##$PKNL= yes
##$PPARMOD= 0
##$PSCAL= 0
##$PSIGN= 0
##$REVERSE= no
##$SF= 200.130013532006
##$SI= 16384
##$SIGF1= 3
##$SIGF2= 2
##$SINO= 400
##$SIOLD= 16384
##$SREGLST= <1H.CDCl3>
##$SSB= 0
##$STSI= 0
##$STSR= 0
##$SW_p= 3612.71676300578
##$SYMM= 0
##$S_DEV= 0
##$TDeff= 0
##$TDoff= 0
##$TI= <>
##$TILT= no
##$TM1= 0
##$TM2= 0
##$TOPLEV= 0
##$USERP1= <user>
##$USERP2= <user>
##$USERP3= <user>
##$USERP4= <user>
##$USERP5= <user>
##$WDW= 1
##$XDIM= 8192
##$YMAX_p= 0
##$YMIN_p= 0
$$ End of Bruker specific parameters
$$ ---------------------------------
##NTUPLES= NMR FID
##VAR_NAME=  TIME,          FID/REAL,        FID/IMAG
##SYMBOL=    X,             R,               I
##VAR_TYPE=  INDEPENDENT,   DEPENDENT,       DEPENDENT
##VAR_FORM=  AFFN,          ASDF,            ASDF
##VAR_DIM=   8192,          8192,            8192
##UNITS=     SECONDS,       ARBITRARY UNITS, ARBITRARY UNITS
##FACTOR=    0.0002496,     1,               1
##FIRST=     0,             0,               0
##LAST=      2.0444736,     0,               0
##MIN=       0,             -181242,         0
##MAX=       2.0444736,     147393,          0
$$ Real data points
##PAGE= N=1
##DATA TABLE= (X++(R..R)), XYDATA
0@%%%%%%%%%%%%%%%%%qJ6j6J6j6J6j6K4l2L2l7M5m8N6o4P2q1Q9j01J14j30J44
$$ 0 0 0 0 0 0 0 0 0 0 0 0 0 0 0 0 0 0 -8 8 -8 8 -8 8 -8 16 -16 16 -21 24 -24 32 -32 40 -41 48 -53 61 -69 75
39G5j58J76j94K11k35K61k86L16l50L87m23M63n13N66o25O92p67Q57r60J080j227
$$ 75 -83 93 -101 110 -125 136 -150 166 -184 203 -220 243 -270 296 -329 363 -404 453 -507 573 -654
60f54J404j625J914k301K850l684N084p819J4914o3660j27665K35953K7315k09605
$$ -654 750 -875 1039 -1262 1588 -2096 2988 -4831 10083 -53577 -181242 54711 82026 -127579
74a27579P5082J56801r4064l5506P9328m8230j9340O8054r3263o3090J53376j716
$$ -127579 -52497 104304 10240 -25266 54062 5832 -13508 54546 -38717 -101807 51569 49853
86D9853j65870J04649J58761j48977r0741J54517R54j33524L6404N4117m9130
$$ 49853 -116017 -11368 147393 -1584 -92325 62192 63146 -70378 -33974 20143 -28987
97b8987K2807K2241n5768N8946P5956j16217m2811J39541l6838j52128Q6470J08765
$$ -28987 -6180 16061 -39707 19239 95195 -21022 -63833 75708 38870 -113258 -26788 81977
109H1977j13841l8716J18363n208o6931L9858Q606m0909K8533j0487o4553N5477
$$ 81977 -31864 -70580 47783 42575 -24356 15502 24108 -16801 11732 1245 -63308 -7831
121g831O2528q1718j5223J05154k2265q9082M9906M4963o7639j4516M2018j6089
$$ -7831 54697 -27021 -42244 62910 40645 -48437 1469 46432 -21207 -35723 6295 -9794
133i794n197K8968j6554J826M3473l3717m8539N2613J8620p1107Q446O2240l0634
$$ -9794 -14991 13977 -2577 -751 42722 9005 -39534 13079 31699 -39408 -30962 31278 644
146F44l0901M7169P182l1258J7810K273l3690J5232J4722l5874J2897M4704l1479
$$ 644 -30257 16912 24094 -7164 10646 12919 -20771 -5539 9183 -26691 -13794 30910 -569
159e69k4282N1352J604n1553J8560K8922l9111j0136L3521j1188j0357L1655n763
$$ -569 -24851 26501 28105 -23448 -4888 24034 -15077 -25213 8308 -2880 -13237 18418 12655
172A2655k4601K4698L255l8457J4805K8347l6234j0429M5523q458l3548L1966
$$ 12655 -11946 12752 16007 -22450 -7645 20702 -15532 -25961 19562 11104 -22444 9522
184I522J9353l8301j362K5131k1576j1592K7243o441j7829K4703N605k6479J4093
$$ 9522 28875 -9426 -10788 14343 -7233 -18825 8418 1977 -15852 8851 14456 -12023 2070
197B070J9951k8823q740K7624j2143k3485K4460J3900k1944M729J7550j4256n991
$$ 2070 22021 -6802 -15542 12082 -61 -23546 914 14814 -7130 -2401 15149 893 -5098
210e098J4208j0011j1609J5471j374j7022J4777J5385j7113j465J9150j0660j7664
$$ -5098 9110 -901 -12510 2961 1587 -15435 -658 14727 -2386 -3851 15299 4639 -13025
223a3025J3483N826j6340K711J2830o730k484J1395k322o991O866j308j2210K987
$$ -13025 458 6284 -10056 -7345 5485 -1245 -3729 7666 5344 -1647 5219 3911 -8299 -5312
237e312P530o527j016R799r41n373N434K173o392j68J965n025j251M257p88j92
$$ -5312 2218 -4309 -5325 4474 3533 -1840 3594 5767 -625 -793 1172 -3853 -5104 -847 -1635 -1827
253a827N904N85m826J268K392m173k359K212r47j782K487J806l29K082J539k469
$$ -1827 4077 4662 -164 1104 3496 -677 -3036 -824 -1771 -3553 -1066 740 411 2493 4032 1563
269A563j780M18j536j736J531J272j036N67K486N34j008P7R7j520j661m11L26
$$ 1563 -217 201 -1335 -3071 -1540 -268 -1304 -737 1749 2283 1275 1352 1449 -71 -1732 -2143 -1817
286a817P42J085O60J40L31K17n64n15j59p30q33K21N62Q7O61J207J17p94l70j83
$$ -1817 -1075 10 670 810 1141 1358 794 279 120 -610 -1443 -1222 -660 -573 88 1295 1412 618 248 65
306F5l88j21r4k35K37M45N5L64O57j87m70O8n22r40L70Q29l78k71P73K04m18K94
$$ 65 -323 -444 -538 -773 -536 -91 -36 328 985 798 328 396 -126 -1066 -696 133 -245 -516 257 461 43 337
328C37K91n16l04L9l17j44M29K57J50L02k43m21K81K12n71j72L72j50k81L59L24
$$ 337 628 112 -192 -153 -470 -614 -185 72 222 524 281 -140 141 353 -218 -390 -18 -168 -449 -90 234
349B34q4J29J12k78k66K7N4O5j7j54L2K30Jn4J96K8j57q4j83j35K00J10j34J58
$$ 234 150 279 391 113 -153 -126 -72 -7 -24 -178 -146 84 85 31 227 255 98 14 -169 -304 -104 6 -128 30
373C0J64k60J28M18l75m39L98j7o43K77N80k86K0N48l63m99N06Oo89L32M10o03
$$ 30 194 -66 62 480 105 -334 64 47 -596 -319 261 -25 -5 543 180 -319 187 193 -496 -164 246 -357
395c57J44Q18m77m56Q66j32j083M72O36q31N9J003n85n96R51k6r91N71N24r77
$$ -357 -213 605 128 -328 538 406 -677 -205 431 -400 -341 662 77 -519 432 406 -585 -14 510 -467
415d67J56R48q21l80J249l56j197R67N70j335L33J203j023n35J367l77j185J080
$$ -467 -311 637 -184 -564 685 329 -868 99 669 -666 -333 870 -153 -688 679 302 -883 197
433A97M32j346N09J032j238j73J540p90j132J481J10j618R36J031j644R4J761
$$ 197 629 -717 -208 824 -414 -587 953 163 -969 512 622 -996 -60 971 -673 -579 1182
450A182j228j046J927j49j885J319R67k012L56J863j575q44K221n99j916J896
$$ 1182 -46 -1092 835 686 -1199 120 1087 -925 -569 1294 -281 -1125 1096 497 -1419 477
466D77O81k501R19K080k270p80K819q84k288K263P82k692J050K032k455m13K825
$$ 477 1158 -1343 -424 1656 -614 -1394 1425 541 -1747 516 1298 -1394 -344 1688 -767 -1180 1645
483A645j526k016K916K17l221J871K320l265l63L482j770k474L100L50l212J896
$$ 1645 119 -1897 1019 1236 -1985 -114 2206 -1059 -1422 2060 290 -2184 916 1266 -1946 -50
499e0K046l212K22L276k459j956L715m65l658K687K150l902L40L785k571k175
$$ -50 1996 -1216 -994 2282 -177 -2133 1582 1117 -2541 146 2296 -1606 -1266 2519 -52 -2227
515b227L692l70l391K571J697l618P86L197k895j414L805j018l227K975J331l739
$$ -2227 1465 1095 -2296 275 1972 -1646 -860 2337 -558 -1972 1833 815 -2412 563 1894 -1845
531a845J109L080k937j183L527j144k739K850Q41l262J373K319k918m03L159j692
$$ -1845 -736 2344 -593 -1776 1751 607 -2132 718 1559 -1703 -330 1989 -929 -1332 1827 135
547A35k057K999Q2l070J932J921l030J7K901j859j697K701j77k356J818R94k479
$$ 135 -1922 1077 1159 -1911 21 1942 -1088 -1071 1830 -29 -1726 975 798 -1558 260 1254 -1225
564a225Q35J984k210n13K604j262j974K410M99k566J145J763k052k38J957j218
$$ -1225 -390 1594 -616 -1129 1475 213 -1761 649 1148 -1418 -273 1490 -562 -800 1157 -61
580f1q87J868p11j597J993M24k409J194J925k282o73K455q58j764J780L91j759
$$ -61 -948 920 209 -1388 605 1029 -1380 -186 1739 -543 -1216 1239 381 -1383 397 788 -971
597i71J011Q73j722O57J528k020m90K503j072k123K314R51k618N79K039j692o61
$$ -971 40 913 -809 -152 1376 -644 -1134 1369 297 -1826 488 1439 -1179 -600 1439 -253 -914
614i14J876q80j134J786l83j820J932R79k736O21K613k113j609K796lk518J344
$$ -914 962 82 -1052 734 351 -1469 463 1442 -1294 -673 1940 -173 -1782 1014 1011 -1507 -163
631a63J329j907L56J565j598k43K002j452j553K604J83k898J459K277k523q35
$$ -163 1166 -741 -385 1180 -418 -661 1341 -111 -1664 940 1123 -1775 -316 1961 -562 -1397
647a397K735o73k009J630M78j828R90J023j833M78J955j855j098K585k82k583
$$ -1397 1338 665 -1344 286 764 -1064 -74 949 -884 -406 1549 -306 -1404 1181 899 -1684
663a684J524J621k235k84K114p78j086J417j69j238J143K40j688R27J428j847
$$ -1684 -160 1461 -774 -1058 1056 278 -808 609 440 -798 345 585 -1103 -176 1252 -595
679e95m81K267n38j833J390Q88j755K3J262q14l53J093m74o12J171j78j314R51
$$ -595 -1076 1191 653 -1180 210 1098 -657 -634 628 -186 -539 554 80 -532 639 461 -853 98
697I8Q11j551j73J507n19r66J031L92r01K37L72o32J61M53o94l3R17m38o53R47
$$ 98 909 -642 -815 692 173 -793 238 630 -271 -34 338 -294 -133 320 -374 -407 510 72 -581 366
717C66K88j034J26O95n68l32N59n5k41M15o8l50M99R1o93J67M72n91k70P01Qm26
$$ 366 654 -380 -254 441 -127 -459 100 45 -196 219 151 -199 300 391 -302 -135 337 -254 -524 177 185 -241
739b41L55K29m18P3K03l86K3L19l68j31N91j9m46L82K49n76p2L84k98k18M10k8
$$ -241 114 343 -75 -2 201 -185 -162 157 -211 -342 249 230 -216 166 415 -161 -233 151 -147 -365 45 17
761A7k48L80J65l55J39K58m75j83L93j56l11M03K12l15J02L11k92j64K48j57k81
$$ 17 -231 149 314 -41 98 356 -119 -302 91 -65 -376 27 239 -76 26 337 45 -119 129 -28 -309
782c09K21J20j95J80K73j65j08J95j57k55J31L3k09Q1K18p3K1K38o0j97N1qk08
$$ -309 -88 32 -163 17 290 125 17 212 55 -200 -69 -36 -245 -164 54 -19 2 240 180 -17 34 26 -182
805a82OJ42l9mJ85K6r5P5L4j79q8O2n8o5J20J32j8L4R5m9q6k0l1r0j8L0nN0R3
$$ -182 -176 -34 -73 -77 108 134 39 114 148 -31 -119 -57 -115 -180 -60 72 54 88 183 134 48 28 -3 -93 -111 -81 -86 -36 57
834E7N4k0Pk9j02m3J3m2j7N8O2L2N2M4k2o3l9n6q0L1J2J4O5Q3J8j0L0j4q7l5l5
$$ 57 111 91 98 69 -33 -76 -63 -105 -122 -64 -2 30 82 126 104 41 2 -54 -134 -103 -91 -77 -12 71 89 79 109 95 8 -27 -62
865f2m2NO5M8L7N6Ml8l0k4o1l9mJ2MN9P9J8J3j4m3n1m6l2j6PN2L6L4M1K6ln8l0
$$ -62 -104 -99 -34 14 51 107 111 73 43 19 -42 -81 -85 -73 -69 -10 69 87 100 86 43 -8 -54 -86 -102 -95 -43 -7 27 68 94 91 33 3
899Cn0n0KL7jL2J02Pl5L8%q9l7K0m6l4R2L6mN6L1o2j2Mj00n0Q2k0p0J23Q9q1L6
$$ 3 -47 -97 -95 -58 -59 -27 75 82 47 85 85 -4 -41 -21 -67 -101 -9 27 23 79 110 48 36 40 -60 -110 -28 -48 -118 5 94 13 49
932D9R3r7j06O2m9j00Q1O2p5P7J35j08m9J61q4k07J01Q9j79M1K16q3m4J56m0j54
$$ 49 142 45 -61 1 -48 -148 -67 -5 -80 -3 132 24 -25 136 52 -155 -54 35 -144 -103 113 30 -14 142 102 -52
958e2J06Nk12O0J69j63l6K81j2k25J60R3k51j6J57j50o1J97l7j11K12L6k40R4
$$ -52 54 59 -153 -93 76 -87 -123 158 146 -79 81 174 -77 -93 64 -86 -147 50 13 -98 114 150 -90 4
982DJ50k52j01K55n3k01K21J40k15N5J84j95o9J86j47j61K43L1k40J71K16k46
$$ 4 154 -98 -199 56 3 -198 23 163 -52 3 187 -8 -77 109 -38 -199 44 75 -165 6 222 -24
1004b4n3K65j27k28J92N1k22J12J44j67O2J80j74j07K53j12k66K28J22k90O5K79
$$ -24 -77 188 61 -167 25 76 -146 -34 110 -57 5 185 11 -96 157 45 -221 7 129 -161 -96 183
1026A83j79j26K57o6k25J86L5k54J45J95k74J9L18j70k32L10M4l71J39K29k67
$$ 183 4 -122 135 69 -156 30 65 -189 -44 151 -123 -104 214 44 -188 122 166 -205 -66 163 -104
1047a04l4L02j41j69L08m4l12K49J36l81O4L74k92j84M20l0l80K35K19l91J9L31
$$ -104 -138 164 23 -146 162 118 -194 55 191 -190 -126 248 -44 -228 192 162 -218 17 236 -155 -136 195
1069A95k65j35L78j05l17L50J38m61J14L87l69j86M37n2l66K83K01l83P9L14l00
$$ 195 -70 -205 173 68 -249 101 239 -222 -108 279 -90 -276 161 109 -257 26 227 -156 -77 237 -63
1090f3j22L86j48l19L53J38m27J21L82l14k04L88n0l39K41J62l15N7K79k49j06
$$ -63 -185 201 53 -266 87 225 -202 -81 301 -13 -217 171 121 -218 23 185 -130 -73 206 -43 -149
1111a49L28j06k97K71J38l52M1L10j88j78K79nk26J32J12k17M2J89j88p4K57o6
$$ -149 179 73 -224 47 185 -167 -126 184 -4 -182 97 92 -134 -2 110 -107 -65 124 -64 -138 119 53
1133E3k01J86J11k44NK13j23j14J75j5j37J18O3j84Q1J47j67o3J98m8j77J40Q4
$$ 53 -148 38 149 -95 -90 123 0 -114 61 46 -91 27 90 -94 -13 134 -33 -96 102 54 -123 17 101
1156A01j68J4J40r2n3R4k5q6J02nj11P8Q7j31kJ24o3q5J11Qj13P2M9j04L5R0r8
$$ 101 -67 -53 87 -5 -58 36 11 -75 27 22 -89 -11 76 -55 -57 67 4 -81 30 38 -75 -3 46 -58 -23 67 -31
1183c1k9J23l9j00J10M8j42M0J02r0n8J17j8j04R6L3j16M8R5j06l0J21n2j04R8
$$ -31 -60 63 24 -76 34 82 -60 -20 82 -8 -66 51 33 -71 25 58 -58 -10 85 -21 -51 70 18 -86 12
1208A2M7j25L4R4q4l9J09m0r4J00L1j12M1Q5q7l2J10j7j06R0N4j11J4R4p4m5R6
$$ 12 59 -66 -32 62 -22 -61 48 8 -86 14 45 -67 -26 59 -28 -60 50 33 -73 17 71 -40 -26 68 -6 -51 45
1235D5pq2O2M5r0pR8n7o4Q9Mp9M5N8p0j1P3m4o2Q5pq5L8N2o8%P3k8n7O4J5p0J9
$$ 45 38 -44 18 63 -27 -34 64 7 -57 32 36 -43 2 60 -10 -21 52 8 -54 31 24 -61 -23 29 -39 -39 34 6 -51 13 28 -42 -23
1268b3N7m7l5O9j2m1M0L1o5ON5l6k0M8j7k6L3J2m2J8K2k6rK7ql4K5J9k2MK9l0
$$ -23 34 -13 -48 21 9 -32 8 39 -26 -20 35 -1 -21 27 10 -16 17 29 -13 5 27 1 -8 19 11 -23 2 21 -1 3 32 2
1300BoJ7j9j1K2nk0J1K3k9KJ5J0k8NJ6j4oKPPMk5K1MkqK0oj9J8J0qj9K3mj2Qk
$$ 2 -4 13 -6 -17 5 0 -20 -9 14 -15 -13 2 12 -16 -11 5 -9 -15 -13 -6 1 5 -20 1 5 3 -5 15 9 -10 8 18 10 -9 14 10 -2 6 4
1339Dj2K1kj4PRqj3QJ3k6j1J8NjKmj6J5jRoLpLJ5nnlQj3J1OJM%lpJ2Mnj1J9rr
$$ 4 -8 13 11 -3 4 13 5 -8 0 13 -13 -24 -6 -1 -2 0 -4 -20 -5 -6 3 -3 0 -7 -4 11 6 1 -2 6 -7 4 10 11 15 15 12 5 17 21 16 5 24 15 6
1384FJPmk2K1j0J4jmj2J1kj5RoMoQmmpJ5koMRonOKMrN%J8pj6J1NoLPnkMOj2Nm
$$ 6 7 14 10 -12 9 -1 13 12 8 -4 7 5 -10 -1 -7 -3 -9 -1 -5 -9 -16 -1 -3 -9 -5 4 -2 -7 -1 1 5 -4 1 1 19 12 -4 7 12 6 9 16 11 9 13 19 7 12 8
1433HKrkkMkKnJ5nLpnklqRJoQNnoJ5j3JNKkjQjkQPj4J9j0kKkjqJ5j0KJ1ol0NJ6
$$ 8 10 1 -1 -3 1 -1 1 -4 11 6 9 2 -3 -5 -8 -16 -7 -6 -12 -4 1 -4 -10 5 -8 -7 -2 0 -2 -3 5 4 2 10 17 3 22 12 10 12 10 9 1 16 6 8 19 13 -17 -12 4
1484DrJNLqjJ7j7oJ0j2OPprK3j0j1J7%rjJ6j2rK2lj7J4mqRJ5j5kK2j7j1K8qnJ0
$$ 4 -5 -4 1 4 -4 -5 12 -5 -11 -1 -13 -7 0 -7 -16 7 -3 -14 3 3 -6 -7 9 -3 -12 10 7 -10 4 0 -8 1 16 1 -1 21 4 -7 21 13 8 18
1526A8qj4NOj5JJ9j6rJ8k3PJ2Ol2K4J0k5jK6j8mJ6mj7J9Rm0K5K9l0pL4j3l0M1
$$ 18 10 -4 1 7 -8 -7 12 -4 -13 5 -18 -11 1 7 -25 -1 9 -16 -17 9 -9 -13 3 -1 -18 1 10 -30 -5 24 -6 -13 21 8 -22 19
1562A9Lm6K1K5k6jM8m7pM0pm1L4L6p0lO5n1l3N5j2m8O7Ko4M7K7q3QR0n8m7Q3K
$$ 19 22 -24 -3 22 -4 -5 43 -4 -11 29 22 -19 15 51 -19 -22 43 -8 -41 14 2 -46 21 23 -41 6 33 -50 -42 48 -10 -57 26 28
1596B8o3K2N7o9mO2m0k0P1l8m7Q3Rj00N5O2r4j6J03n7m4R6k0r2Q2M8j23K3R1j03
$$ 28 -35 -13 44 -25 -29 33 -7 -27 44 6 -41 42 51 -49 6 68 -26 -42 61 4 -40 56 36 -56 26 74 -49 -26 65 -38
1626c8l5J40m2j07J19K0j39P7R2j48j6J67j01j05J83Kj71R0J15j60pJ64j29o6
$$ -38 -73 67 25 -82 37 57 -82 -5 87 -61 -77 90 -11 -116 67 69 -102 -12 103 -57 -64 100 -29 -95
1650i5J78k6j71J67Q3k30N5K04j99j00K62o7k06J82J01k41P4J87k13n1K49j19
$$ -95 83 57 -114 53 136 -94 -39 165 -34 -134 128 61 -145 37 138 -103 -29 158 -55 -106 143 24
1672B4k02K34Q7k94J04K26k35o3K50q9j98K14L5k56J38J80k46k2K89j59j85K54
$$ 24 -178 56 143 -151 -47 179 -56 -119 131 42 -156 58 93 -163 -25 155 -91 -113 176 17 -168 86
1694H6M3k78J17J91k15k3K13j24j33K32k3k38J75J24k65K0K81j68j61K51Nk19
$$ 86 129 -149 -32 159 -56 -79 134 10 -123 109 86 -152 23 147 -118 -98 183 15 -146 105 110 -109
1716a09J04J10j73L2J35j49k9J85r2j46K00L7k34J01J49j54p0J89n4j16J35pj33
$$ -109 -5 105 -68 -36 99 -50 -79 106 14 -132 68 105 -129 -28 121 -33 -103 86 32 -84 51 44 -89
1739h9J23L3j67O9J54j54p1K12k9j73J32O8j61L4R9j04pJ13r0n9J56k9j39J06
$$ -89 34 67 -100 -31 123 -31 -102 110 81 -92 40 108 -53 -19 80 -24 -31 82 -8 -67 89 60 -79 27
1763B7P6j72K2J34j24l4J42o0r2J55j7j61J05J10j88k3K01r4j12J69J3j72J06
$$ 27 103 -69 -47 87 -37 -71 71 11 -81 74 57 -104 1 111 -77 -100 101 7 -105 64 77 -95 11
1786A1R3j74K1J71j46p4J94l7j57J51Q6k01K8J46j22o8J55m0j22J25M9j60P3J29
$$ 11 104 -70 -49 122 -24 -98 96 59 -98 53 139 -62 -34 112 -10 -78 77 37 -85 40 89 -71 2 131
1810A31j82k4J75r1j27J52M7j62O4J11j30l2J53p8r7J14K4j55J03J03j25l3J39
$$ 131 -51 -75 100 9 -118 34 81 -81 -17 94 -36 -68 85 7 -90 24 48 -107 -4 99 -26 -59 80
1833H0o6j05J18J6j06N3P8j07J5R8n7m7Q4j0j01O0M2p3LO9m5rM8k0n3M1J9q0K8
$$ 80 14 -91 27 43 -63 -10 68 -39 -24 74 17 -30 54 44 -57 3 45 -28 -25 44 -1 -10 38 18 -35 6 25 -55 -27
1862b7P1m4l7O6Ko1J7L0k4j2K3j4PNnjK7j0l3K1jnnK1pJ1pMJ2Lk1j1J8j2j3MK1
$$ -27 44 0 -37 29 31 -30 -13 17 -7 -19 4 -10 -3 2 -3 -4 23 13 -20 1 0 -5 -10 11 4 15 8 12 24 27 6 -5 13 1 -12 -8 13
1899A3j2mK3j1k2L0pj1lrMjJ2mqNklLkmJ7Ol2J7L0j2j8J5Pk1oK3j3nK3nqJ2lq
$$ 13 1 -3 20 9 -13 17 10 -1 -4 -13 -9 -10 2 -2 -10 -5 -7 -10 -7 -9 -13 4 10 -22 -5 25 13 -5 10 17 -4 -10 13 0 -5 18 13 5 17 14 6
1940FLOj3k6L4jk6K0K8m5kL8qk9QQk2RJ9k3J8J4l2j3L8nl9M1Kk7lM7k8k1N3pm4
$$ 6 9 15 2 -24 10 9 -17 3 31 -14 -16 22 14 -15 -7 1 -21 -12 7 -16 2 16 -16 -29 9 4 -35 6 8 -19 -22 25 -3 -24 29 22 -22
1977b2K9K4n6J9M3l4k1N5j9k9K8J6m9OM5n6j8P4j4n3L9K1n0%M2l6j3M3j6m3N7
$$ -22 7 31 -25 -6 37 3 -18 37 18 -11 17 33 -16 -10 35 -21 -39 35 21 -32 7 28 -22 -22 20 -16 -29 14 -2 -45 12
2008A2Kn9M0L7o5kN2k2m4N5J2m7K7M2o0JO5o1k1O4j3o1O3L2n4kM3m2k7O1l2l8
$$ 12 14 -45 -5 32 -33 -35 17 -5 -49 6 18 -29 -2 40 -20 -19 46 -15 -36 28 15 -46 17 49 -5 -7 36 -6 -33 28 -4 -42
2040d2Q0j7p5N8M0p3mO9k9n7O3j1m3N2J7p9L4O8r2qR7m1p8Q1M5r7M1O0q1jP6p1
$$ -42 38 21 -54 4 44 -29 -33 36 7 -50 13 2 -41 11 28 -51 -17 51 -41 -49 48 7 -71 10 55 -42 -1 59 -22 -23 53 -18
2072a8l5J00j0j12J00P0j36OJ33p5r3J18Mj21P9N2j28L8J12j18m6J63m0j73J50
$$ -18 -53 47 37 -75 25 95 -41 -35 98 23 -70 48 52 -69 10 62 -66 -28 84 -34 -80 83 43 -130 20
2097B0Q6j97J4J72j05r2J60l0j24J31L3j72O8J43j64n2K21m9j96J67R1j97J2J55
$$ 20 106 -91 -77 95 -10 -102 58 28 -96 35 68 -104 -36 107 -57 -109 112 63 -133 34 125 -72 -60 95
2121I5j07p7J71o0j25J68L1j85Q3J54j97q8K38n0j82J40J01j82K9J32j29l2J67
$$ 95 -12 -89 82 22 -103 65 96 -89 -6 148 -49 -137 101 51 -131 9 110 -72 -43 89 -40 -72 95
2144I5j07j26J90K5k01Q6J70j77p8J99l2j42R8O6j34N4Q9j20J4J48j12j08J84
$$ 95 -12 -138 52 77 -124 -38 132 -45 -123 76 44 -98 0 66 -68 -14 75 -45 -31 117 5 -103 81
2167H1kj99Q6J47j50k3J36m7q7J10j5r3Q7K3j26N3J22j27n7J55k7j34P4P1j10
$$ 81 79 -120 -34 113 -37 -60 76 29 -58 52 37 -56 31 54 -72 -19 103 -24 -81 74 47 -87 -13 58 -52
2192e2K2O4o7j2R2n6n2J25k0j46R3R5j56OJ41p6o8J32l0r9J05K1j31M9J15j30
$$ -52 -30 34 -33 -45 47 -9 -61 64 44 -102 -9 86 -70 -64 77 1 -67 65 35 -64 41 62 -69 -20 95 -35
2218c5l4J82p8j27J36N1j61M7J20j42k2J39o9j12J61J2j61Q6J10j65k0J70q9j23
$$ -35 -69 113 35 -92 44 95 -66 -19 101 -41 -63 76 7 -105 56 68 -93 -7 103 -62 -82 88 -1 -124
2242a24J78Oj55Q4J22j69k0J71j01j01J66J8j60Q4J10j48lJ61j02r9J52lj69J10
$$ -124 54 60 -95 -11 111 -58 -78 93 -8 -109 57 75 -85 -1 109 -39 -42 119 17 -82 70 67 -102 8
2266HJ05j49k4J66r5r2J45Lj46Q8Q1j48PJ41j10o6J36j6j46R8R9j30nJ22p7p6
$$ 8 113 -36 -60 106 11 -81 64 67 -79 9 90 -58 -51 90 -20 -86 50 34 -112 -14 85 -45 -50 72 -5 -81
2292h1J13lr4Q4L4j17K6J15q7m7J19k7j01O7O7p7JO8n3l8O8k5l9O0Lo5L4N9p9
$$ -81 32 29 -65 19 53 -64 -38 77 -10 -57 62 35 -66 1 68 -9 -8 60 7 -31 37 12 -27 33 36 -29 5 64 -15
2321a5j5P0j5p2M1J2l1K7Kk5ML9m2j8N3j3m1M4J7m4ML8k7j4K8j0k5L9Ml1L2J1
$$ -15 -30 40 25 -47 -6 6 -25 2 4 -21 -17 22 -20 -38 15 2 -39 5 22 -22 -18 20 -7 -21 7 -3 -28 11 15 -16 16 27
2353B7l7NL7j8l0M1pk7K7Jk3J2J4m4%L7j0k8L3Om5J9K9k7j6L6j5l0K5J0l4K0L6
$$ 27 -10 -5 32 14 -16 25 18 -9 18 19 -4 8 22 -22 -22 15 5 -23 10 16 -29 -10 19 -8 -24 12 -3 -33 -8 2 -32 -12 24
2386B4n0nM2lm4L9J5l9ML5j4pK4Ll3K7Lk6jM1k9k0L1qk8M3Ol4mK1k9lL1j0k8J6
$$ 24 -26 -31 11 8 -36 3 18 -21 -17 18 4 -3 21 24 -9 18 21 -5 -6 35 6 -14 17 9 -19 24 30 -4 -8 13 -16 -19 12 2 -26 -10
2422a0K1l1J2K2k1k0K5j4rJ0M0k5mJ8nqQQk8%J5j9J2J8j2nJ7jj2QJ4k0%J1j7K
$$ -10 11 -20 -8 14 -7 -27 -2 -16 -25 -15 25 0 -4 14 9 1 9 17 -11 -11 4 -15 -3 15 3 -2 15 14 2 10 24 4 4 15 -2 0
2458@J9nj4K3j9rj3K5j1%%rjMO%JRrqPKmJ1Jj0JKLPNj2m%MLMOqPJk7J7J3j0j1
$$ 0 19 14 0 23 4 -5 -18 7 -4 -4 -4 -13 -14 -10 -4 -4 -3 6 -3 -11 -4 -2 -6 5 6 -4 -3 -1 2 9 14 2 -2 -2 2 5 9 15 7 14 15 -12 5 18 8 -3
2504cK0j1mQok0J9Lj3NJ2j7mJ4ok6K6J7l5QJ6j2j6K9J2j9K3jk9LJ6rlK2pk0K6
$$ -3 17 6 2 10 4 -16 3 6 -7 -2 10 -7 -11 3 -3 -29 -3 14 -21 -13 3 -9 -25 4 16 -3 20 19 -10 -7 9 0 -3 19 12 -8 18
2541A8Jk0LL1m2QJ9kj9J5Rm2K8Jj2j0K3j3k4K5Nk1J1K1k9OK5k4j9L7j0l8L9J9
$$ 18 19 -1 2 33 -9 -1 18 16 -3 12 21 -21 7 8 -4 -14 9 -4 -28 -3 2 -19 -8 13 -16 -10 15 -9 -28 9 -1 -39 0 19
2575A9l0JN6m6j4L5j1k6M2j2k3PL4k4j1M9l6k8L3Kk2LJ5k2kM0l4j6K7Ml8K1J7
$$ 19 -11 -10 46 0 -14 21 10 -16 26 14 -9 -2 32 8 -3 46 10 -18 15 17 -5 -2 13 -9 -11 29 -5 -21 6 10 -28 -7 10
2608A0l1%L6j7j5K4mk7K6Qm0PL5l1JM0j7pJ2Jk3J3Rk2ML8l7lM4ql6L7On8J6L1
$$ 10 -21 -21 15 -2 -17 7 3 -24 2 10 -30 -23 12 -19 -18 22 5 -2 10 11 -12 1 10 -12 -8 30 -7 -10 34 26 -10 27 33 -25 -9 22
2644B2k8KK4j8k0L9ln9K6L4n8RM7l0j6M0Qn6M2J6o1J8N6n5j9O0nn2N0L2p2J1M8
$$ 22 -6 -4 20 2 -18 21 18 -41 -15 19 -39 -30 17 -13 -29 11 19 -37 5 21 -40 -22 34 -21 -40 20 15 -37 13 45 -27 -16 32
2677C2m5j6O7k9m1M6J4n6K3O1o7l0Q2m4l8N9J7p0K2N1o7j3P3l1o1P3ko9M5O6p2
$$ 32 -13 -29 38 9 -32 14 28 -28 -5 56 -11 -41 41 -3 -41 18 35 -35 -13 38 -29 -42 31 0 -61 12 10 -59 -14 52 -20
2708b0k1P5k8o7N2L1o8K3N4n4%O7m8k7N8Oq4N2N0p1kO6k6l5M3%m8J8K1m6K0M5
$$ -20 -41 34 6 -61 -9 22 -46 -23 31 -23 -23 44 -4 -31 27 33 -51 1 51 -20 -22 44 18 -17 26 26 -22 -4 17 -29 -9 36
2740C6l2k1N5j1p2M8J2m8JM5k7kK2j2k1L6ml3J5L4m3lL4j3j6K0K6l9K0J1k1MJ8
$$ 36 4 -17 38 27 -45 3 15 -33 -32 13 -14 -16 6 -6 -27 9 5 -28 -13 21 -22 -25 9 -4 -20 0 26 -13 7 18 -3 1 19
2773A9j7j2K2J1k2NK2k8oK6j6j1QOj7L2j8j6JJ0j0j2K0jk5K3Mj7JK9j7j3L3j5
$$ 19 2 -10 12 23 1 6 28 0 -6 20 4 -7 1 7 -10 22 4 -12 -11 -1 -11 -23 -3 -4 -29 -6 -2 -19 -18 11 -6 -19 14 -1
2807ak5K7Nk3J0J3lk5M6nk9J4K1l7JK8k7ML0j3j4K7nl1%K5j5k1L1Mk6J1K2k3j1
$$ -1 -26 1 6 -17 -7 6 3 -22 24 19 -10 4 25 -12 -11 17 -10 -6 24 11 -3 24 19 -12 -12 13 -2 -23 8 12 -14 -3 19 -4 -15
2842a5J9j4j2J5qj1K2J2l0MM0j9j3J4lomK5j6oK7rj3J8mj8NPk4PK4ml1J9J6k5
$$ -15 4 -10 -22 -7 -15 -26 -4 8 -22 -18 22 3 -10 4 1 -5 -9 16 0 -6 21 12 -1 17 13 -5 0 7 -17 -10 14 10 -21 -2 14 -11
2878a1MJ2j5j3K4Lj7J8lj8J8%j2qJ8j1j8K7Lk1J6K1j2j1J0%k1ROjlJ4Nj1J6Oj4
$$ -11 -7 5 -10 -23 1 4 -13 5 2 -16 2 2 -10 -18 0 -11 -29 -2 1 -20 -4 17 5 -6 4 4 -17 -8 -2 -3 -6 8 13 2 18 24 10
2915A0kkqkLK%J3j8nK2pj4Llj4MJOK0Oqj3j%kmnMLJ5Oj1J6%k0P%pj4J9Nl%MjP
$$ 10 8 6 -2 -4 -1 1 1 14 -4 -9 13 6 -8 -5 -8 -22 -18 -17 -11 9 15 7 -6 -7 -7 -9 -13 -18 -14 -11 4 10 -1 15 15 -5 2 2 -5 -19 0 5 2 2 6 5 12
2962A2Pj2j8K4j0nMJlkJ4pj0Nqj3J4Oj3MK0j5kJ4lk6K0nk2J1J6n%J6pljPj1kJ5
$$ 12 19 7 -11 13 3 -2 2 3 0 -2 12 5 -5 0 -8 -21 -7 -1 -14 -10 10 -5 -7 7 4 -22 -2 -7 -29 -18 -2 -7 -7 9 2 -1 -2 5 -6 -8 7
3003Gj6OJ5jqRJ5l8J4J0j2rJ8j3lLK6k5jRk5RPj4j6K5J6j3qK1j3j4Rmk0K4OKM
$$ 7 -9 -3 12 11 3 12 27 -11 3 13 1 -8 10 -3 -6 -3 23 -2 -3 6 -19 -10 -3 -17 -33 -8 8 -5 -13 8 -5 -19 -10 -14 -34 -10 -4 -2 2
3042BKj%PNk1J6k2oJ6J3j1KJ8j3j0K0mk2OQoJ2mj6%J1%j2QJ0k4K0ponJ8Jj2Ql
$$ 2 4 3 3 10 15 -6 10 -12 -18 -2 11 0 2 20 7 -3 17 13 -9 -3 5 -1 11 7 -9 -9 2 2 -10 -2 8 -16 4 -3 -9 -14 4 5 -7 1 -2
3083bnnPj1JK8j1j3K6rkJ3rj3J1J0j6qK6j4j6L0Rk4RJ0l1KL0j7j6J5Nj2RJ6m5
$$ -2 -7 -12 -5 -16 -15 13 2 -11 15 6 4 17 8 -5 6 16 0 -8 18 4 -12 18 27 3 12 22 -9 -7 23 6 -10 5 10 -2 7 23 -22
3120b2RK4k2k7M2Ok7K8J1l8LL0l0nL5j1k3K6K1n3K3L8k9l7M8%m3L4K7l8J1M1l0
$$ -22 -13 11 -11 -38 4 10 -17 11 22 -16 -13 17 -13 -18 17 6 -17 9 30 -23 0 38 9 -28 20 20 -23 11 38 0 11 52 22
3153B2l1L8j8m1L9J2n9K2N6m9k4M1j3l7K3L1m3J3M1n0RL8k5k8M0Mn3L0M2m8qM3
$$ 22 -9 29 11 -30 9 21 -38 -16 40 -9 -33 8 -5 -42 -19 12 -31 -18 23 -27 -18 20 -5 -33 7 11 -42 -12 30 -18 -26 17
3185A7j6j8M5pl7K7J7m3MM6m7nM3qm3K9K5l8OK1l2lL2k4k3L5ml8K3L3l5pL9k8
$$ 17 1 -17 28 21 -16 11 28 -15 -11 35 -12 -17 26 18 -25 4 29 -9 -3 18 -14 -17 15 -9 -32 3 -1 -39 -16 17 -18 -25 14 -14
3219a4j1K5Nk9K3J3l4J6K4l9PM9k4l5M2J2m2RM4m8KL1k9j4N5k7l3L5K6n8J2N5
$$ -14 -25 0 5 -24 -1 12 -22 -6 18 -21 -14 35 11 -24 18 30 -12 -3 41 -7 -5 26 -3 -17 38 11 -22 13 39 -19 -7 48
3251D8n4j6L6Jm8M5J4n1J7K6m7lO3m1m2O1K1o2J7N6n3j1M3j0l3M6J0n9L3L2o2
$$ 48 -6 -22 14 15 -33 12 26 -25 -8 18 -29 -32 31 -10 -52 9 30 -32 -15 41 -12 -23 20 10 -23 23 33 -26 7 39 -23
3282b3NN7l1l5M9Qm3K4K0n0J6L9k9k9N3j3o4N0K5n4jN9l5k8M2lm8K9K8m5J1N0
$$ -23 -18 39 8 -27 22 30 -13 11 31 -19 -3 36 7 -22 31 18 -46 4 29 -25 -26 33 -2 -30 12 9 -39 -10 18 -27 -16 34
3314C4k9k7M8j4m3M5J5n5OL5j6j3L8%k9K6rk7J7K2k1j7N6j9l1K1Nk5RK0k8lK2
$$ 34 5 -22 26 12 -31 14 29 -26 -20 15 -1 -14 24 24 -5 21 12 -15 2 24 3 -14 42 23 -8 13 18 -7 2 22 -6 -9 13
3347A3j2j5L2j2k0J2%qoJ2pqJ0Lj2J6QpPJ0k4J1Rj6mJ7kkNJ4k8PJ0j7%J8pj0K8
$$ 13 1 -14 18 6 -14 -2 -2 -10 -16 -4 -11 -19 -9 -6 -18 -2 6 -1 6 16 -8 3 12 -4 -8 9 7 5 10 24 -4 3 13 -4 -4 14 7 -3 25
3386B5rk8J5J6k4lJ2mj9J9jj3J1J2k9MJ8j5j5K9qj8J5L2l6LL7l0j3K4qj5K5Pk3
$$ 25 16 -12 3 19 -5 -8 4 0 -19 0 -1 -14 -3 9 -20 -16 2 -13 -28 1 -7 -25 -10 22 -14 -11 26 -4 -17 7 -1 -16 9 16 -7
3421gJ4K4l4lK2lk2J9J0k9J6J7k5qJ5Ok5MJ1k1NK8k1kK0j3mPLk9JJ1j3J1K4ok3
$$ -7 7 31 -3 -6 16 13 -9 10 20 -9 7 24 -1 -9 6 12 -13 -9 2 -19 -14 14 -7 -9 11 -2 -6 1 4 -25 -24 -13 -26 -15 9 3 -20
3458b0K4Rk8J2Omj6K4lQKJ0j8nJ7qj1J3nj0QPm%mOk6OJ5k3NQkNNqkQlj9jNjMR
$$ -20 4 13 -15 -3 3 -1 -17 7 4 12 14 24 6 1 18 10 -1 12 7 -3 5 12 8 8 4 10 -16 -10 5 -18 -13 -5 -7 -2 3 -5 -7 1 -2 -21 -22 -17 -18 -14 -5
3503e%nJ8mj1J3%j2N%mJ0jJ3j0Pj5J1jpj3PK0j5jlOkKnj5Qkj5J6J3j2mK2mj3j
$$ -5 -5 -10 8 4 -7 6 6 -6 -1 -1 -5 5 4 17 7 14 -1 10 9 2 -11 -4 16 1 0 -3 3 1 3 -2 -17 -9 -11 -26 -10 3 -9 -13 9 5 -8 -9
3545iJj5J7onJ4RrjJ4mj0J0Oj8QJ4j1j1K9kj9RJj1oJ5rj1K5JqnJ4k1j3K6k7mJ9
$$ -9 -8 -23 -6 -12 -17 -3 6 -3 -4 10 6 -4 6 12 -6 2 16 5 -6 23 21 2 11 12 1 -5 10 1 -10 15 16 8 3 17 -4 -17 9 -18 -22 -3
3585cOj2J1J1j5j1J9k1j2J1Qj3J9J1j1PJ0oj6K5j4oMJ2j6PJ3qj0RKonK0l3J5J7
$$ -3 3 -9 2 13 -2 -13 6 -15 -27 -16 -8 -21 -2 9 -2 5 15 9 -7 18 4 -2 2 14 -2 5 18 10 0 9 11 5 0 20 -13 2 19
3622A9j8KQpk3J6roMJ6j0RJ7j4pJ2oj8%J5j9KK0j0MJJ1NJoj8PJ5j3%J9jmJ3jk6
$$ 19 1 3 11 4 -19 -3 -12 -18 -14 2 -8 1 18 4 -3 9 3 -15 -15 0 -19 -17 3 -7 -3 -2 9 14 15 9 -9 -2 13 0 0 19 18 14 27 26 0
3663@MPj3oJ6j3JK5j3pJ0ol2J7Nj7oM0j8oK1nj1OJ6l0%K1k1MJ5Ql3K4K0k7NK2
$$ 0 4 11 -2 -8 8 -5 -4 21 8 1 11 5 -27 -10 -5 -22 -28 12 -6 -12 9 4 -7 -1 15 -15 -15 6 -15 -11 4 12 -21 3 23 -4 1 23
3701B3k5j4L0Kk5L1J0k9%K0j9k6M2j9k4K9J1l0J2L1l6j2K4ml8J6Pj3RL1j9k2L5
$$ 23 -2 -16 14 16 -9 22 32 3 3 23 4 -22 20 1 -23 6 17 -13 -1 30 -6 -18 6 2 -36 -20 -13 -26 -17 14 -5 -27 8
3734Hql5K8Qk3JM7k6mK5k6lJ8jk5K1Ok1LL9j0m5L9Rl9nL3k5%J8Pj9J7kj7oJ8k5
$$ 8 0 -35 -7 1 -22 -21 26 0 -4 21 -5 -8 10 9 -16 5 11 -10 -7 32 22 -23 16 25 -14 -19 14 -11 -11 7 14 -5 12 10 -7 -13 5 -20
3772b0j5L5rj8K3Qk4PK2j2j0RJj1J9j4qJ7J6plK1k0lMJlMnONrk0QPmqJ4Nj1nJ7
$$ -20 -35 0 -9 -27 -4 4 -20 -13 9 -3 -13 -4 -3 -14 5 -9 -17 0 16 9 6 27 7 4 8 9 6 10 5 11 16 7 -13 -5 2 -2 -10 4 9 -2 -7 10
3814A0oj1Rj2mK3j6j6J7Mj1KJ6j9NJ0jj8J2J0j6J4KnJJ3qjJ3pj7PK3j6lOqoJ4
$$ 10 4 -7 2 -10 -14 9 -7 -23 -6 -2 -13 -11 5 -14 -9 1 0 -18 -6 4 -12 2 4 -1 0 13 5 4 17 10 -7 0 23 7 4 10 2 -4 10
3853A0oj5QNpoJ8nk%%j6PJ5j5jOk%PjpJ3Kk8K5J0j7lPJ3j7NJ4j9QJlKLjjJjkM
$$ 10 4 -11 -3 2 -5 -11 7 2 0 0 0 -16 -9 6 -9 -10 -4 -6 -6 1 0 -7 6 8 -20 5 15 -2 -5 2 15 -2 3 17 -2 6 7 4 6 9 8 7 8 7 5 9
3899Ikoj1%JnPJ5j9RNMj9J3nj0LJ1l%njpQJ4%Kkjj2RJpJ6oLkoJ0NqLj1J4Mqol
$$ 9 7 1 -10 -10 -9 -14 -7 8 -11 -2 3 7 -12 1 -4 -14 -11 0 -3 -3 -8 -9 -16 -8 6 6 8 6 5 -7 2 3 -4 12 6 9 7 1 11 16 8 11 0 14 18 10 4 1
3947AMoPmMj3MoJ1j1MJPqPj0LnKK%JPLjj0QKjRoMpjNMj5J0lJ3plrJ2jPmmpQoj0
$$ 1 5 -1 6 2 6 -7 -3 -9 2 -9 -5 -4 3 -5 2 -8 -5 -10 -8 -6 -6 -5 2 5 4 -6 2 4 3 12 6 10 3 2 7 11 -4 6 3 16 9 6 -3 9 8 15 11 7 0 8 2 -8
3999hRkqOoJJ6mk2J5LjppjQQqNkJ0kQlJJ%ljQonQoLmJoJJ4j1MmrPm%j0JQrnRO
$$ -8 1 -1 -9 -3 -9 -8 8 4 -18 -3 0 -1 -8 -15 -16 -8 0 -8 -3 -5 5 3 11 8 9 10 10 7 6 14 8 3 11 5 8 4 5 -1 0 14 3 7 3 -6 1 -3 -3 -13 -12 -4 -13 -18 -9 -3
4053cRmkj9K3%mKmjOj5J2Rj4J5JpOmr%mJ9Mj1OkLoLjjNm%j2KpLKnPpOnkLl%MK
$$ -3 6 2 0 -19 4 4 0 2 -2 -3 3 -12 0 9 -5 10 11 4 10 6 -3 -3 -7 12 16 5 11 9 12 6 9 8 7 12 8 8 -4 -2 -9 -6 -4 -9 -2 -9 -3 -8 -10 -7 -10 -10 -6 -4
4105dl%J%MJ0rKOrKOJJ0j1JLj4%J3j2lQMnKnMOLj2KrKnNoJ8j2mRj2J2j4JP%qP
$$ -4 -7 -7 -6 -6 -2 8 -1 1 7 -2 0 6 7 17 6 7 10 -4 -4 9 -3 -6 2 6 1 3 -2 2 8 11 -1 1 -8 -6 -11 -6 -12 6 -6 -10 -1 -13 -1 -15 -14 -7 -7 -15 -8
4154h%LQj2jLOkpRPjLlOqRj0mjJ4ppRj2lJ5q%kJ0j3l%kNJKj%JjJJ0j0rK3j3%o
$$ -8 -8 -5 3 -9 -10 -7 -1 -3 -10 -1 6 5 8 5 11 3 12 2 -2 -3 11 4 -3 6 -6 -9 6 -2 -2 -4 6 -7 -10 -10 -12 -7 -6 -4 -5 -5 -4 -5 -4 6 -4 -13 10 -3 -3 -9
4204iJJ1j1QMmKKnMLqJ4jmlKKj2P%ONpnj2J2Jlj6LlNJqLJ1j0Q%%j1J1lLmJ0mr
$$ -9 -8 3 -8 0 4 0 2 4 -1 3 6 -2 12 11 7 4 6 8 -4 3 3 9 14 7 2 -10 2 3 0 -16 -13 -16 -11 -10 -18 -15 -4 -14 -6 -6 -6 -17 -6 -9 -6 -10 0 -4 -13
4253a3J3jJ0k0J6qNJ0j1RjJ2k5J0Mj2OKr%MkJJ2j2j2J2jmoJ0j6mJ3J0nKPj6jJ6
$$ -13 0 -1 9 -11 5 -3 2 12 1 10 9 21 -4 6 10 -2 4 6 -3 -3 1 -1 0 12 0 -12 0 -1 -5 -11 -1 -17 -21 -8 2 -3 -1 6 -10 -11 5
4294Ej5RJ7k1lJ1j2NNJ9j8oPJ0k0J3Pjj0MJpKMj5JJ8k6K1n%j0J1Lj4PQj3pJ8J
$$ 5 -10 -1 16 -5 -8 3 -9 -4 1 20 2 -4 3 13 -7 6 13 12 2 6 7 0 2 6 -9 -8 10 -16 5 0 0 -10 1 4 -10 -3 5 -8 -15 3 4
4335Dk1J5qj1J2J5j9J1J2qqJ3%j5J0J2j7J1PqoNOj1J3Mk3J8nk0%J3lj8K0oJ0q
$$ 4 -17 -2 -10 -21 -9 6 -13 -2 10 2 -6 7 7 -8 2 14 -3 8 15 7 1 6 12 1 14 18 -5 13 8 -12 -12 1 -2 -20 0 -6 4 -4
4373dOj0J2mkj8K2jj7J3Qj9J1PjlQj3J7oMj8RPkj4J9qj4J6Pj7J4QmlJkj0J0j6
$$ -4 2 -8 4 0 -2 -20 2 1 -16 -3 5 -14 -3 4 3 0 8 -5 12 6 10 -8 1 8 6 -8 11 3 -11 5 12 -5 9 17 13 10 11 9 -1 9 -7
4414gKmQj2J3o%J0j3Rj6OJ1j1JRj8J6MKpJ2kj5J1JLoJ2lLklqRMj9J3LQj1NOj1
$$ -7 -5 -9 -1 -13 0 -6 -6 4 -9 0 -16 -10 1 -10 -9 0 -18 -2 2 4 -3 9 7 -8 3 4 7 1 13 10 13 11 8 0 9 13 -6 7 10 18 7 12 18 7
4458GkKj3nJ5lpjNrJ5Kj7MRlj1QJKJppQMKM%NLj5K5rpJ0j5QlNmmKMLlJ1lj9Om
$$ 7 5 7 -6 -11 4 1 -6 -7 -2 -11 4 6 -11 -7 2 -1 -12 -4 -3 -1 0 -7 -14 -6 -2 0 4 4 9 12 -3 22 13 6 16 1 9 6 11 7 3 5 9 12 9 20 17 -2 4 0
4508@KnnLkmJ0JoJ0j0MNlnQpJj0LRoQmNkMjPoLmJK%nKj2J5Lj3NJLj0OlmkkMJm
$$ 0 2 -3 -8 -5 -7 -11 -1 0 -6 4 -6 -2 3 0 -5 3 -4 -3 -13 -10 -1 -7 1 -3 2 0 4 3 10 4 7 3 4 6 6 1 3 -9 6 9 -4 1 2 5 -5 1 -2 -6 -8 -10 -6 -5 -9
4561iPjpJ5lrJ2j1mRrK%J4j0JMoQnNpJ4nm%RokMkKqJ3j0J2Jqmj0QLlnkmmJNMj1
$$ -9 -2 -3 -10 5 2 -7 5 -6 -10 -1 -10 -8 -8 6 -4 -3 1 -5 3 -2 3 -4 10 5 1 1 10 4 2 6 4 6 -2 11 1 13 14 6 2 -8 0 3 0 -5 -7 -11 -15 -14 -9 -5 -16
4612a6MMNpMJ1j2JKlMKkJkJ0ljR%kmNj1mJ0OJjqPj0MjnNJj5Rkkjj2J3l%lJ3j3
$$ -16 -12 -8 -3 -10 -6 5 -7 -6 -4 -7 -3 -1 -3 -2 -4 6 3 2 11 11 9 5 10 -1 -5 5 11 12 11 3 10 0 4 3 -2 3 4 -11 -2 -4 -6 -7 -19 -6 -9 -9 -12 1 -12
4661a2PlPlJJ4k5J5lL%lJ3Rj4J0j2OJ%j1NKkM%jj6J4Lj0MJqOkoNNj2oJJ1j0jJ2
$$ -12 -5 -8 -1 -4 -3 11 -14 1 -2 1 1 -2 11 20 6 16 4 10 11 11 0 5 7 5 9 9 8 -8 6 9 -1 3 4 -4 2 0 -6 -1 4 -8 -14 -13 -2 -12 -13 -1
4707aoj3J5mQJ0qMqQj1NJ2jj0kQ%PJk0J0J8j7rJ4Pl4J5J3nj1J7nk3K2Jk0Q%nN
$$ -1 -7 -20 -5 -9 -1 9 1 5 -3 5 -6 -1 11 10 0 -2 6 6 13 14 -6 4 22 5 -4 10 17 -17 -2 11 6 -5 12 7 -16 6 7 -13 -5 -5 -10 -5
4749eJ0oj4J6Kj7PRlj8K3kj5J2Rk7J8J2j8j1K7%nKRj5lJ4oj0K7j9qK1j0j0PJ5
$$ -5 5 -1 -15 1 3 -14 -7 2 -1 -19 4 2 -13 -1 8 -19 -1 11 -7 -18 9 9 4 6 15 0 -3 11 5 -5 22 3 -5 16 6 -4 3 18
4787A8j7rK0qj5J8j2rJ3kmqK2j5qK0nj6J0K4j8pK1j0j4J8qj0J1J2j7J1J4k4J0
$$ 18 1 -8 12 4 -11 7 -5 -14 -1 -3 -7 -15 7 -8 -16 4 -1 -17 -7 17 -1 -8 13 3 -11 7 -1 -11 0 12 -5 6 20 -4 6
4822FJ0j3j5J8Pk3PQkpJ8j2LQj0j6J2Pk5RJ9j7j2L0j1j3J2Qk4J9J3k4oL5k3j3
$$ 6 16 3 -12 6 13 -10 -3 5 3 -4 14 2 5 13 3 -13 -1 6 -19 -10 9 -8 -20 10 -1 -14 -2 6 -18 1 14 -10 -16 19 -4 -17
4858a7M0j0k6J5L0m7J4Rmj6L9j0k7K1J3l3jL2j9k5L9j1k9K0K0l1j4L9j4j9K5J7
$$ -17 23 13 -13 2 32 -15 -1 8 4 -12 27 17 -10 11 24 -9 -10 22 3 -22 17 6 -23 -3 17 -14 -28 11 -3 -22 3 20
4890B0m7J8K4m2NM5k1k5K9kl5M0J3k8%K6j8k4M8%m1K6J4k7j0L4rk3K8rk5J2J7
$$ 20 -27 -9 15 -27 -22 23 2 -23 6 4 -31 9 22 -6 -6 20 2 -22 26 26 -15 11 25 -2 -12 22 13 -10 18 9 -16 -4 13
4923A3k5J0K3k7k4M7nm3K8K5l7oK9k4j4L3J2l0LK4k5kK6k7pL4Pl6K2J6k4NJ5l1
$$ 13 -12 -2 21 -6 -30 17 12 -31 -3 22 -15 -21 8 -16 -30 3 15 -15 -12 12 -13 -15 11 -16 -23 11 18 -18 4 20 -4 1 16 -15
4957a5MK3jl4L2M%j3J1k5K1J4k8rJ9jj9J1Klj3K8ok3K8j2j7J4J2k2J5J6k7NL0
$$ -15 -11 12 11 -23 9 13 13 0 11 -14 7 21 -7 -16 3 2 -17 -6 -4 -7 -20 8 2 -21 7 -5 -22 -8 4 -18 -3 13 -14 -9 21
4992B1l2kJ6J2k8J8J6j6pJ5mk5K9jk4K2Ok8J3M1l9j2K9Jm4J2L3l4NL2l0j7L1j3
$$ 21 -11 -13 3 15 -13 5 21 5 -2 13 9 -16 13 12 -12 10 16 -12 1 42 3 -9 20 21 -23 -11 22 -12 -7 25 -5 -22 9 -4
5026dj9K3Jk6QL0j7j6L8rk8J0J6k0jK2j0j9K9Nk5K5J7k7pK3j1l1L5Lk4J5Mj5J2
$$ -4 -23 0 1 -25 -17 13 -4 -20 18 9 -19 -9 7 -13 -14 8 -2 -21 8 13 -12 13 30 3 -4 19 8 -23 12 15 -9 6 10 -5 7
5061GJ6k8j0L4j3l1J7K5j7rK6j3k2J8J3l1J4J4l1J0K4k3j4K8qj5NJ3j3lK5poL5
$$ 7 23 -5 -15 19 6 -25 -8 17 0 -9 17 4 -18 0 13 -18 -4 10 -21 -11 13 -10 -24 4 -4 -19 -14 -1 -14 -17 8 1 -5 30
5095C0j9rPkj5J8kj0KJ0jlJ1Ml5K4mrj7K7j5j0K3mk0K3rj8QJ3lpJ6j2KJ3J0k6
$$ 30 11 2 9 7 -8 10 8 -2 0 10 9 6 17 21 -14 10 6 -3 -20 7 -8 -18 5 1 -19 4 -5 -23 -15 -2 -5 -12 4 -8 -6 7 17 -9
5133i%J5j2j4L0j4mJ3J1k7K2J1k8JK2qk0J3%j2J9Kj7J4J6k4j0K5j4j0RJk6J4K9
$$ -9 -9 6 -6 -20 10 -4 -8 5 16 -11 11 22 -6 -5 17 9 -11 2 2 -10 9 11 -6 8 24 0 -10 15 1 -9 0 1 -25 -11 18
5168A8k2j1J3J1l7L3J4l8J5K3j9j6K7ok4K6Ol6K4J9j6j0L9j5j6J7Kk8kL3k5rL7
$$ 18 -4 -15 -2 9 -28 5 19 -19 -4 19 0 -16 11 5 -19 7 13 -23 1 20 4 -6 33 18 2 19 21 -7 -9 24 -1 -10 27
5201B7j7j6J7Nl5J3K7k5j1J9Jk6K5Pk6OJ7k5KL0j1j5J5J0k7J1J5j5MJ3oj8L3q
$$ 27 10 -6 11 16 -19 -6 21 -4 -15 4 5 -21 4 11 -15 -9 8 -17 -15 15 4 -11 4 14 -13 -2 13 -2 2 15 9 -9 24 16
5235A6olJ3j4j4K4j0j5K6km1L4Ok5J3JrjRMj0J4j6j1J6Oj4LJ1jl0L1mk0K3LrJ7
$$ 16 10 7 20 6 -8 16 6 -9 17 15 -26 8 14 -11 2 3 -6 -7 2 6 -4 10 -6 -17 -1 5 -9 -6 5 4 -26 5 1 -19 4 7 -2 15
5273A5jl0J7J7k8j0L0kj8K0Pj0kJ4j5lK4k2j0K1ok0QJ5k0J2%jk1J6J5l5K1J2l2
$$ 15 14 -16 1 18 -10 -20 10 8 -10 10 17 7 5 19 4 1 25 3 -7 14 8 -12 -4 11 -9 3 3 2 -19 -3 12 -23 -2 10 -22
5308b2J6J3j6%K0pm3L8J7k7PK3j5k0K3J1l0K4J1l9J5K8l8KL2qk0J6J1k9J1K9k8
$$ -22 -6 7 -9 -9 11 4 -39 -1 16 -11 -4 19 4 -16 7 18 -12 12 23 -16 -1 27 -11 -9 23 15 -5 11 22 -7 4 33 5
5341Ej0K7k3j7K7Nl1J0J7j9lM2k2j7J9j1k4K2J4k7OK5pk7L3Rl2J6K7m3RK6j9k
$$ 5 -5 22 -1 -18 9 14 -17 -7 10 -9 -12 30 8 -9 10 -1 -25 -3 11 -16 -10 15 8 -19 14 23 -9 7 34 -9 0 26 7 5
5375EK2j2j3J4J2k7mL5j9k1K0Nk2K2Lk4OJ0k1KJ2Lj7K2j9lJ3J7k3mJ4rj3PLrJ0
$$ 5 27 15 2 16 28 1 -3 32 13 -8 12 17 -5 17 20 -4 2 12 -9 -7 5 8 -9 13 -6 -9 4 21 -2 -6 8 -1 -14 -7 -4 -13 -3
5412cPj2J4lj2J0J2j0j4J6NkjOk1K2Nj2mK4j8j4J8Kk2J3Mk3MK0j8lJ7kk4K5J2
$$ -3 4 -8 6 3 -9 1 13 3 -11 5 10 8 7 13 -8 14 19 7 3 27 9 -5 13 15 -7 6 10 -13 -9 11 -7 -10 7 5 -19 6 18
5449A8l7J0K3l0nK8mj8K3J1m1K2J9j6qK8j7j5L1Pl6PL2k7j4L8j4k5L2Ml3J7J5
$$ 18 -19 -9 14 -16 -21 7 3 -15 8 19 -22 0 19 3 -5 23 6 -9 22 29 -7 0 32 5 -9 29 15 -10 22 26 -7 10 25
5482B5l3kL0j2k7K3K0m2J5K5l2oL0qk5L4Rm5J6K9l2nL7k1k7L8Ml1J8J8k0kQJ0
$$ 25 -8 -10 20 8 -19 4 24 -18 -3 22 -10 -16 14 6 -19 15 24 -21 -5 24 -8 -13 24 3 -24 14 18 -13 5 23 3 1 9 19
5516A9k4K1Pk6J3J8k4j0K9j1j7K9j3j7J9Kk2mJ9j8%K4j5j9J6nOqJ0Mj7K6j7Ln
$$ 19 -5 16 23 -3 10 28 4 -6 23 12 -5 24 11 -6 13 15 -7 -11 8 -10 -10 14 -1 -20 -4 -9 -3 -11 -1 3 -14 12 -5 -2 -7
5551gK2l2J8J8j6kJ8j3pK2j5mPmKjJ1mqJ3j6rJ3lrMK3k9kJ9nj5J5Jk4J9%j6JL1
$$ -7 15 -17 1 19 3 1 19 6 -1 21 6 2 9 5 7 6 17 13 5 18 2 -7 6 3 -6 -2 21 -8 -10 9 4 -11 4 5 -19 0 0 -16 -15 16
5591A6j3j6J5lk0J2J0k4K1K4j5jJ6Ml5K1J0k1qK9j3j3K9k0qJ5J4l6oL9l0nL7j0
$$ 16 3 -13 2 -1 -21 -9 1 -23 -2 22 7 6 22 26 -9 12 22 1 -7 22 9 -4 25 5 -3 12 26 -10 -16 23 -7 -12 25 15
5625A5m3M2J4l6kK1j7j6K8j0j9K1J8j9j0L1rk7M1ok7LK4j6j1K5oj8K0Qk0OJ3k7
$$ 15 -28 14 28 -8 -10 11 -6 -22 6 -4 -23 -2 16 -3 -13 18 9 -18 23 17 -10 -7 17 1 -10 15 9 -9 11 19 -1 5 18 -9
5659iRL0j4k4L8j4k6lK8j0j3J7rj8L2j0j3KJ3j8jJ8rj5K1jnJ1kj4OOnj0J8%pL
$$ -9 0 30 16 -8 30 16 -10 -13 15 5 -8 9 0 -18 14 4 -9 -7 6 -12 -13 5 -4 -19 2 1 -4 7 5 -9 -3 3 -2 -12 6 6 -1 2
5697BJ6rjJ2j8JLj3NJ3jrJK5k7LJ3j5nJ3oj1K5j7j2K1nj8PMrrK2lj1MK3k1J0Q
$$ 2 18 9 8 20 2 3 6 -7 -2 11 10 1 2 27 0 3 16 1 -4 9 3 -8 17 0 -12 9 4 -14 -7 -3 -12 -21 1 -2 -13 -9 14 -7 3 11
5737A1j9j0L2kl3K5J6l5J0K7k3lJ8jj7J1Qk9J5J4rj7L0k2rJ2J0k9PK0j7%L1k4
$$ 11 -8 -18 14 12 -21 4 20 -15 -5 22 -1 -4 14 13 -4 7 15 -14 1 15 6 -11 19 -3 -12 0 10 -19 -12 8 -9 -9 22 -2
5771bj7J4Mj9OJ7j2j1K4Jk7K0J5k4jL0k9j6L3j0kQJ4k5ML1l5J0J2rj8J3K4l6J2
$$ -2 -19 -5 -1 -20 -14 3 -9 -20 4 5 -22 -2 13 -11 -12 18 -11 -27 6 -4 -6 2 16 -9 -5 26 -9 1 13 4 -14 -1 23 -13 -1
5806aJ6j0k4J6oj0RQj1KK4l2MK5j6k5J9J8k3jJ2LnQKkJ0lk8J8J1k7MM6k9rJ7M
$$ -1 15 5 -19 -3 -9 -19 -10 -2 -13 -11 13 -19 -15 10 -6 -31 -12 6 -17 -18 -6 -3 -8 0 2 0 10 7 -21 -3 8 -19 -15 31 2 -7 10 14
5844A4ppKoKJ3qMJ2j8j3K0orkJJj8K6mOMrj3J7jk6J4J9k3pL4qnpJ5j3KJ4j5kK7
$$ 14 7 0 2 -4 -2 11 3 7 19 1 -12 8 2 -7 -9 -8 -7 -25 1 -3 3 7 -2 -15 2 1 -25 -11 8 -15 -22 12 4 -1 -8 7 -6 -4 10 -5 -7 20
5886B0j5oK9lm2J9J9k9jL2j0k0QJ7k3K0Ql6LJ8qj7J5Kk1J2K7k1j3K5k3pJ8Rk1
$$ 20 5 -1 28 25 -17 2 21 -8 -9 23 13 -7 1 18 -5 15 23 -13 -10 8 0 -17 -2 0 -21 -9 18 -3 -16 9 -14 -21 -3 6 -15
5921a5J6J2k1%L4k9j0K3Nl3K1K5l8LK9j3j7L3j6k0QRk1JK3pj6K3Nl3RK9l0oK8
$$ -15 1 13 -8 -8 26 -3 -13 10 15 -18 3 28 -10 -7 22 9 -8 25 9 -11 -3 6 -15 -14 9 2 -14 9 14 -19 -10 19 -11 -17 11
5956A1j2j0K0rk1LK2rj0J7j9nQPmJ1MomK4j3j5J8Jj8J2LqJJ3rqKOqNMj3KNMj3
$$ 11 -1 -11 9 0 -21 -18 4 -5 -15 2 -17 -22 -14 -7 -11 0 4 -2 -6 18 5 -10 8 9 -9 3 6 -2 -1 12 3 -5 -3 3 -5 0 4 -9 -7 -2 2 -11
5998a1Ooj0J7lj2J0J0lJMqjlRk1J8mpJ3OLj8K6j1lljqJ5nnQJ5k9NJ2Lk0J7Knj
$$ -11 -5 -11 -21 -4 -7 -19 -9 1 -2 -1 3 -5 -6 -9 0 -21 -3 -7 -14 -1 5 8 -10 16 5 2 -1 -2 -10 5 0 -5 3 18 -11 -6 6 9 -11 6 8 3 2
6041BJ0pj6J0%rNJ4k9QJ1nmK0j3j3J9Lj5%J9j4j6K9%j6J0Rj5mJ5KpPj0%jJ1j0
$$ 2 12 5 -11 -1 -1 -10 -5 9 -20 -12 -1 -6 -10 10 -3 -16 3 6 -9 -9 10 -4 -20 9 9 -7 3 12 -3 -7 8 10 3 10 0 0 -1 10 0
6080@KJ3j1qJ6lj1MJ4j3k0K6jj5QqqNPpj1L5k3oJ9kj5J6Pj7KK3k6JK5j1j3J0J1
$$ 0 2 15 4 -4 12 9 -2 2 16 3 -17 9 8 -7 1 -7 -15 -10 -3 -10 -21 14 -9 -15 4 2 -13 3 10 -7 -5 18 -8 -7 18 7 -6 4 15
6119A5j5OPonJ7j4pRKj0NKlpJ1JlpL%nPj1mJ1j4%J4pjJ1n%lNOj2KQqJ0qQMkj5
$$ 15 0 6 13 7 2 19 5 -2 7 9 -1 4 6 3 -4 7 8 5 -2 1 1 -4 3 -8 -12 -1 -15 -15 -1 -8 -9 2 -3 -3 -6 -1 5 -7 -5 3 -5 5 -3 5 9 7 -8
6166hJ6Jjj5K0Jj4KJ1k5J3J1j9NKmnJ8lrK0pk6RJ9k5j0J1J5k2J1J1k0PJ5j6mK4
$$ -8 8 9 8 -7 13 14 0 2 13 -12 1 12 -7 -2 0 -4 -9 9 6 -3 17 10 -16 -7 12 -13 -23 -12 3 -19 -8 3 -17 -10 5 -11 -15 9
6204Ilj6J8Mj7J1Rj4j1K4%k6J5J7j9pK2j1k1L3j1j0MQk5J3NLj3J3pqJ1mlj2J7
$$ 9 6 -10 8 12 -5 6 15 1 -10 14 14 -12 3 20 1 -6 16 5 -16 17 6 -4 0 8 -17 -4 1 4 -9 4 -3 -11 0 -4 -7 -19 -2
6241bmj1K1qoJ1MlK%j1oJ5Qk0K0noJ3kj9KL3j5k0J8Pj6QRj9jJpkJ8mJKjo%Rk4
$$ -2 -6 -17 4 -4 -10 1 5 2 4 4 -7 -13 2 10 -10 10 5 -1 12 10 -9 -7 26 11 -9 9 16 0 8 17 -2 -3 -2 -9 -11 7 3 4 6 5 -1 -1 8 -16
6285a6nJ1MpJ1j0JJ4nj2MK2j8QqJ7j8%J8j1LKrPOJj2J1kj1J1J0k8MK1j7j5J0k
$$ -16 -21 -10 -6 -13 -2 -12 -11 3 -2 -14 -10 12 -6 2 -6 11 -7 -7 11 0 3 5 -4 3 9 10 -2 9 7 -4 7 17 -11 -7 14 -3 -18 -8 -10
6324a0j3K1kkRKorQkj8PJ2j0kK1mnJ4jk2QJ8k5QJ8k1jK0jj8J0Kj3JK9k3oJ8%k3
$$ -10 -23 -2 -4 -6 3 5 -1 -10 -2 -4 -22 -15 -3 -13 -15 6 2 -3 11 10 -12 -4 14 -11 -3 15 -6 -7 13 12 -6 4 6 -7 -6 23 0 -6 12 12 -11
6365a1J2Pk6MJ1j3jK3lj4K3qlk0K3k0jJ0Qk2L0lj2NJ%nJ2Lk3J6K1k7JK5k7kK0
$$ -11 1 8 -18 -14 -3 -16 -17 6 3 -11 12 4 1 -19 4 -16 -17 -7 1 -21 9 6 -6 -1 0 0 -5 7 10 -13 3 24 -3 -2 23 -4 -6 14
6403A4j2k0K7kj6K3Qk1lJ2j0oJkk2mL1jmkMmJ5j7JMKk7J9J7lk4J8J0mKJj2JPp
$$ 14 2 -18 9 7 -9 14 22 1 -2 10 0 -6 -5 -7 -29 -33 -2 -3 -7 -9 -5 -9 6 -11 -10 -6 -4 -31 -12 5 2 -22 -4 6 2 4 5 -7 -6 1 -6
6444fJ4%mrJ5krnOlrJ1LKPj0LoJj7K1nj8KJ9pj7L9j7pnllQMojK1pqOK6l4jJ5K
$$ -6 8 8 4 -5 10 8 -1 -6 0 -3 -12 -1 2 4 11 1 4 -2 -1 -18 3 -2 -20 -18 1 -6 -23 16 -1 -8 -13 -16 -19 -11 -7 -13 -14 7 0 -8 -2 24 -10 -11 4 6
6490FlQ%j0J0j3rJ5J1k9nK8oj9J6J8k8NK1j5k7K3j0rJ8J0j9JL3k6j4K3ml2J8J4
$$ 6 3 11 11 1 11 -2 -11 4 15 -14 -19 9 3 -16 0 18 -10 -5 16 1 -26 -3 -13 -22 -4 6 -13 -12 21 -5 -19 4 0 -32 -14 0
6526@pMJ2k3NJ6mpQjpJJ8j3jK1j3j2QNolJLj0RJMj7Qj8PJ1oj0KJ0j2J5pnRQj4
$$ 0 -7 -3 9 -14 -9 7 3 -4 4 3 -4 -3 15 2 1 22 9 -3 5 10 4 1 2 5 -5 4 5 9 -8 0 -18 -11 0 -6 -16 -14 -4 -16 -1 -8 -13 -4 4 -10
6570a0lK0j8MmJ3j0KJ4rJPj3LKMoJ0%pJ1rnoJ9j2%jkolJ6nnNj1qJ3%jJ3rrPPm
$$ -10 -13 7 -11 -7 -11 2 -8 -6 8 -1 0 7 -6 -3 -1 3 -3 7 7 0 11 2 -3 -9 10 -2 -2 -3 -5 -11 -14 2 -3 -8 -3 -14 -22 -9 -9 -10 3 -6 -15 -8 -1 -5
6616elQj0j6J8RmLNoj0K3jj2NJ3j6MMpj1K4J3m4L0kk5OJ5r%J3j2oJ3%l2J4K2l6
$$ -5 -8 0 -10 -26 -8 1 -3 0 5 -1 -11 12 11 -1 4 17 1 5 9 2 -9 15 28 -16 14 12 -13 -7 8 -1 -1 12 0 -6 7 7 -25 -11 11 -25
6656b5MJ7nO%%KpJ0qpJ7rj1K2Jj5MK5k3LJ7j0j1J2Jqj0J9Knmkj0NMj4J4J1j5o
$$ -25 -21 -4 -9 -3 -3 -3 -1 -8 2 -6 -13 4 -5 -16 6 7 -8 -4 21 -2 1 18 8 -3 9 10 2 -8 11 13 8 4 2 -8 -3 1 -13 1 12 -3 -9
6697iMJj3K1j1j5NROk0K3k2OJ0nj0K1lk1RQJ1j0J3%j0kJ0kQmnKJoJ0lj1nNppN
$$ -9 -5 -4 -17 4 -7 -22 -17 -8 -2 -22 1 -21 -15 -5 -10 -20 1 -2 -23 -14 -6 5 -5 8 8 -2 -4 6 4 12 8 3 5 6 0 10 7 -4 -9 -4 -11 -18 -13
6740a3LLKQj0nkjLMnoRoMlK4j6kPknQLj3MJ8plLKkJOj3ORprJ2Rk4J6Oj5j0Pj0
$$ -13 -10 -7 -5 3 -7 -12 -14 -15 -12 -8 -13 -19 -10 -16 -12 -15 9 -7 -9 -2 -4 -9 -1 2 -11 -7 11 4 1 4 6 4 5 11 -2 4 13 6 -3 9 18 -6 10 16 1 -9 -2 -12
6788a2mJ2%rNRk1J1Rj5mPMoLJ5k0J1QnmK3k3NQj2lOJ0nLKJj6K1j1pJ2kLj5QpN
$$ -12 -16 -4 -4 -13 -8 1 -20 -9 0 -15 -19 -12 -8 -14 -11 4 -16 -5 3 -2 -6 17 -6 -1 7 -5 -8 -2 8 3 6 8 9 -7 14 3 -4 8 6 9 -6 2 -5 0
6832@%JmkJ2orQpj2J2joPklQj1nQkRQj2MnJ2oK%QmPojoJ6j5QJ3j4rJ1kmrJMpJ3
$$ 0 0 1 -3 -5 7 1 -8 0 -7 -19 -7 -8 -14 -7 -9 -12 -4 -15 -20 -12 -14 -5 3 -9 -5 -10 2 -4 -2 -2 6 2 9 3 2 -4 12 -3 5 18 4 -5 6 4 0 -9 -8 -4 -11 2
6882BmqJ4j1j2J3oJ0j0LloPOjj0J1j0QpPOLjnJ5jj8MJ1mj3R%kJ0mjoR%q%pKJ1
$$ 2 -2 -10 4 -7 -19 -6 -12 -2 -12 -9 -12 -18 -11 -5 -6 -16 -5 -15 -7 -14 -7 -1 2 1 -4 11 10 -8 -4 7 3 -10 -1 -1 -3 7 3 2 -4 5 5 -3 -3 -10 -8 3
6928CMk9J8NrjOlk1L3rj0kK4j5KJ5qj3JRj6J3J5j4KJ0Ok2J9j3j0NJ3j1jJ2mmO
$$ 3 7 -22 -4 1 -8 -9 -3 -6 -27 6 -3 -13 -15 9 -6 -4 11 3 -10 -9 0 -16 -3 12 -2 0 10 16 -6 13 0 -10 -5 8 -3 -4 8 4 0 6
6968FJ0k8PJ0j4pK4j2rLKkPLqj4K2oj5RMrK1Nj4LMJj2LJ6j6J5%qNPj8JJ2nm%J5
$$ 6 16 -12 -5 5 -9 -16 8 -4 -13 -10 -8 -10 -3 0 -8 -22 0 -6 -21 -12 -8 -17 4 9 -5 -2 2 3 -9 -6 10 -6 9 9 1 6 13 -5 -4 8 3 -1 -1 14
7012A4k0PJ9k2Qj2jNJ0j5jJ3pj1jJ2j4MPqj0J6j2J8lPj1J3Jj5nROoNJ7j8RKj2
$$ 14 -6 1 20 -2 6 -6 -7 -2 8 -7 -8 5 -2 -13 -14 -2 -16 -12 -5 -13 -23 -7 -19 -1 -4 3 -8 5 6 -9 -14 -5 1 -5 0 17 -1 8 10 -2
7052bLRj1JMNj9PJ7k6RJ0k0kRQrJ7j2qMPj6jJ1pj6L2Ok3PJ0lj0J2j6oJ8J1l0K2
$$ -2 1 10 -1 0 4 9 -10 -3 14 -12 -3 7 -13 -15 -6 2 -7 10 -2 -10 -6 1 -15 -16 -5 -12 -28 4 10 -13 -6 4 1 -9 3 -13 -19 -1 10 -20 2
7093BKmlJ7j0j5J4Nk0kK5rlQMk0QPj4j3K6rj2QJ3j8PN%j5NNj7J6J0j7J7Mj2K%
$$ 2 4 0 -3 14 4 -11 3 8 -12 -14 11 2 -1 7 11 -9 -1 6 -8 -21 5 -4 -16 -8 5 -13 -6 -1 -1 -16 -11 -6 -23 -7 3 -14 3 7 -5 -3 -3
7134cmMLOj7J5NrQLpnL%j1J3Rj1j2Pjj%JJ0j1mpJ8mj3QPpnqJ1rJ2j0l%J5kOok
$$ -3 -7 -3 0 6 -11 4 9 0 8 11 4 -1 2 2 -9 4 13 2 -10 -3 -4 -5 -5 -4 6 -5 -9 -16 2 -2 -15 -7 0 -7 -12 -20 -9 -18 -6 -16 -19 -19 -4 -6 0 -6 -8
7181hjJ0poJ7j2KJ2okMRpn%NqJmmKKMkJ1j2LMmKMmKj0Rj4qNKLnPPj1MKmJ1mLN
$$ -8 -9 1 -6 -12 5 -7 -5 7 1 -1 3 12 5 0 0 5 -3 -2 -6 -10 -8 -6 -2 -4 7 -5 -2 2 -2 0 4 0 2 -8 1 -13 -21 -16 -14 -11 -16 -9 -2 -13 -9 -7 -11 0 -4 -1 4
7232DKj4MK0j2Jj4J8KnnmMm%MnMm%Lj7J2nLPj0kPKJj3PkkKmONmJ2pj3J6orK0j0
$$ 4 6 -8 -4 16 4 5 -9 9 11 6 1 -3 1 -3 -3 1 -4 0 -4 -4 -1 -18 -6 -11 -8 -1 -11 -13 -6 -4 -3 -16 -9 -11 -13 -11 -15 -9 -4 -8 4 -3 -16 0 -6 -15 5 -5
7280eLMjjlRj3J1p%JJLnLjklrJ5kj0PjnLqLQrQ%%j2RKPj4J7jPomKqJ0JJmJj0q
$$ -5 -2 2 1 0 -3 6 -7 4 -3 -3 -2 -1 2 -3 0 -1 -3 -6 -15 0 -2 -12 -5 -6 -11 -8 -16 -13 -5 -14 -6 -6 -6 -18 -9 -7 0 -14 3 2 9 3 -1 1 -7 3 4 5 1 2 -8 -16
7332a6J5KkkJ2j2%Qjj1%nNlMnLLkJ2j7J7j3J2j2%lJOplJ2qJLR%oKmJ4mnjRj1J
$$ -16 -1 1 -1 -3 9 -3 -3 5 4 -7 -7 -12 -7 -10 -6 -11 -8 -5 -7 5 -12 5 -8 4 -8 -8 -11 -10 -4 -11 -14 -2 -10 -9 -6 3 3 -3 -1 -5 9 5 0 -1 8 -3 -2
7379bJ3rlJJ2j7LJ7kj5kJ6j5j0QqrJ8JjOonPmpnJ3j0QJNj0kRJPPpj0PjJ6lJlo
$$ -2 11 2 -1 0 12 -5 -2 15 13 -2 -4 12 -3 -13 -5 -13 -22 -4 -3 -4 2 -4 -9 -2 -6 -13 -18 -5 -15 -7 -6 -1 -11 -13 -4 -3 4 11 4 -6 1 0 16 13 14 11 5
7426ELmj2J5%jj%qkPmpjLRlnOQj0mJnRj2%LQmKorK4lj0KJ5j3JJ6qKKpKkPmMj2
$$ 5 8 4 -8 7 7 6 5 5 -3 -5 2 -2 -9 -10 -7 2 -1 -6 0 8 -2 -6 -5 -10 -1 -13 -13 -10 -2 -6 -4 -10 -19 5 2 -8 -6 9 -4 -3 13 5 7 9 2 4 2 9 5 9 -3
7477cJ0pJ6j4%LMj0lkNJLj2PPmj2J0Qj6pK3j2nJ9oj9J8J2j3mJ2j1PRm%MMk1J1
$$ -3 7 0 16 2 2 5 9 -1 -4 -6 -1 0 3 -9 -2 5 1 -11 -1 7 -9 -16 7 -5 -10 9 3 -16 2 14 1 -3 9 -2 5 14 10 10 14 18 -3 8
7519HRj4j0J7rqJ3Oj5K0j5%kK4k3j6J6oj5J0J8j6j6K4rmMJ0r%K3j7%Qlj5J8Lj0
$$ 8 17 3 -7 10 1 -7 6 12 -3 17 2 2 0 24 1 -15 1 -5 -20 -10 8 -8 -24 0 -9 -13 -9 1 -8 -8 15 -2 -2 6 3 -12 6 9 -1
7558aJ3Ok1MJ0npJ4Nk7J6Oj1oP%j1PK%pNr%NKj1J8Jk3JK4j1qJ0nmJ5qlKjJ1lJ
$$ -1 12 18 -3 1 11 6 -1 13 18 -9 7 13 2 -4 3 3 -8 -1 1 1 -6 -1 -10 -10 -5 -3 -14 4 5 -18 -17 7 -4 -12 -2 -7 -11 4 -4 -7 -5 -6 5 2 3
7603Ck%lMoRO%j0JRkpqjRplJJ1poJ0j2MJ7j8lJ4rl%J4qKJ0lj3PlmR%Kj0J9pj4
$$ 3 1 1 -2 2 -4 5 11 11 1 2 11 9 2 -6 -7 2 -5 -8 -7 4 -3 -9 1 -11 -7 10 -8 -11 3 -6 -9 -9 5 -3 -1 9 6 -7 0 -3 -7 2 2 4 -6 13 6 -8
7651hJ7nj2J2K0j6%Rj2oJ6j2kPJj1j0L4k1rPJ0j0kK5k9j1J3j2J4J2rpMJ6k2nO
$$ -8 9 4 -8 4 24 8 8 17 5 -1 15 3 1 8 9 -2 -12 22 1 -8 -1 9 -1 -3 22 -7 -18 -5 -17 -3 9 0 -7 -3 13 -9 -14 -8
7689hRrJ0Lj3K3Oj6nJ5lj5K0mj2Qmj0pK9nk1K1Mj8NJomJ5j1QmJj4NJ2j1j1J5q
$$ -8 1 -8 2 5 -8 15 21 5 0 15 12 -3 17 13 1 9 5 -5 -12 17 12 -9 12 16 -2 3 4 -2 -6 9 -2 6 2 3 -11 -6 6 -5 -16 -1 -9
7730ik%J1k0J8PMomPj2J1LpLJ6j6LpJoJ4Or%J2j9QOj8Rj1jqROk2J9Qj1J2%j3M
$$ -9 -11 -11 0 -20 -2 5 9 3 -1 6 -6 5 8 1 4 20 4 7 0 1 -5 9 15 6 6 18 -1 7 13 -5 4 -7 -8 -16 -7 -1 -23 -4 4 -7 5 5 -8 -4
7774dJLj3J5kqkJ4j6ORkrRMOj5MPoJ4rj1J1Qj1oK1j2j0J9j3oJ8Jk3mK0k2KK7j5
$$ -4 -3 0 -13 2 0 -8 -10 4 -12 -6 3 1 -8 1 5 11 -4 0 7 1 15 6 -5 6 14 3 -3 18 6 -4 15 2 -4 14 15 -8 -12 8 -14 -12 15 0
7816@j1K0mj8J4J3k2LJJnK0Mk4J2Oqj2J9oj0J7jj0lK1j8RKlj5J5Rj7NK0j8k1L3
$$ 0 -11 9 5 -13 1 14 -8 -5 -4 -3 -8 12 16 -8 4 10 2 -10 9 3 -7 10 9 -1 -4 17 -1 8 10 7 -8 7 16 -1 4 24 6 -15 18
7855A8j0j4Q%nj4J4Rj2Ooj0K5qrrJ9oj1J2lkJ4KkoRk0KJ4knJ7mppJ0j3OPnoJ0
$$ 18 8 -6 2 2 -3 -17 -3 6 -6 0 -6 -16 9 1 -8 -17 2 -4 -15 -3 -6 -8 6 8 6 0 9 -11 -9 5 3 -2 15 11 4 -3 7 -6 0 7 2 -4 6
7898FJ1k4J2%%j0jlMpJ4moN%oNrONj4J2Pj2rK3LqKkkKQj1jK2kj7OJ3j9lJ0lrJ4
$$ 6 17 -7 5 5 5 -5 -6 -9 -5 -12 2 -2 -8 -3 -3 -9 -4 -13 -7 -2 -16 -4 3 -9 -18 5 8 0 2 0 -2 0 8 -3 -4 18 16 -1 5 18 -1 -4 6 3 -6 8
7944HqpJJ7j3pRpj7K0rj4K4J6k5JK1j3qRkk1J2J2rQLp%J2Mj8OK8l8J0J8mj9K8
$$ 8 0 -7 -6 11 -2 -9 0 -7 -24 -4 -13 -27 -3 13 -12 -11 10 -3 -11 -2 -4 -25 -13 -1 -10 -2 1 -6 -6 6 10 -8 -2 26 -12 -2 16 12 -7 21
7984B1j2k4K3Pj6j2L5k9LJ4lpNQl0j0L6j5j3J3JKqJ9j4j0K3k2oJ9J2j6JNrLNO
$$ 21 9 -15 8 15 -1 -13 22 -7 -4 10 7 0 5 13 -17 -27 9 -6 -19 -6 -5 -3 -11 8 -6 -16 7 -15 -21 -2 10 -6 -5 0 -9 -6 -1 5
8022ErJklPPLoPj4KRorJ1qjRJ1j3MmkmL%qQllqJ3mkRpj4K0klQJ2j3Qnj4J1J1k5
$$ 5 -4 -3 -5 -8 -1 6 9 3 10 -4 -2 7 1 -8 3 -5 -6 3 14 1 5 1 -1 -5 -2 -2 -10 -2 -5 -8 -16 -3 -7 -9 0 -7 -21 -1 -3 -6 2 14 1 9 4 -10 1 12 -13
8071a3J6PJjmPj3PJroJ2JnkKmjJ1j7LQPrj0J8j8qK1mKpNqROk3J5Rj4jQjj1J1L
$$ -13 3 10 11 10 6 13 0 7 8 -1 -7 5 6 1 -1 1 -3 -4 7 -10 -7 1 8 -1 -11 7 -11 -19 2 -2 0 -7 -2 -10 -1 5 -18 -3 6 -8 -9 -1 -2 -13 -2 1
8117APkloOjK%J0j3nN%kkJ3k0LJ1oJLkkpJ3j1qPRkmNj0rJ2KNrJ0ojQj4RRoJNp
$$ 1 8 6 3 -3 3 2 4 4 14 1 -4 1 1 -1 -3 10 -10 -7 4 -2 -1 2 0 -2 -9 4 -7 -15 -8 1 -1 -5 0 -10 -19 -7 -5 0 -9 1 -5 -6 2 -12 -3 6 0 1 6 -1
8167alJ3klRpp%nJ6rLKj7OLjkPkmP%j7
$$ -1 -4 9 7 4 13 6 -1 -1 -6 10 1 4 6 -11 -5 -2 -3 -5 2 0 -4 3 3 -14
8191a4
$$ Imaginary data points
##PAGE= N=2
##DATA TABLE= (X++(I..I)), XYDATA
0@%%%%%%%%%%%%Qj6J6j6J6k4L2l3M1n0N8p2Q8j03J19j37J55j79K07k33K65l03
$$ 0 0 0 0 0 0 0 0 0 0 0 0 0 8 -8 8 -8 8 -16 16 -17 24 -26 32 -40 48 -55 64 -73 82 -97 110 -123 142 -161
34a61L40l82M30m83N43o08O76p50Q35r26J026j135J249j377J521j676J845k032
$$ -161 179 -203 227 -256 287 -321 355 -395 440 -486 540 -595 654 -723 798 -878 967 -1065
52a065K241k473K729l016L341l716M149m649N246n973O871q019R548j1695J4943
$$ -1065 1176 -1297 1432 -1584 1757 -1959 2190 -2459 2787 -3186 3685 -4334 5214 -6481 8462
67H462k0490L2436j00838R6690J28554k45903N0221J79499q2748j08318R5619
$$ 8462 -12028 20408 -80430 16260 144814 -101089 -50868 128631 45883 -62435 33184
78C3184k3025n3836N7729l2846p3185J36520L7636j58830N3326J69363j37663
$$ 33184 10159 -43677 14052 -18794 -91979 44541 82177 -76653 -23327 146036 8373
89H373j31532J51616M3163j51795K5094R8563m3316j0547M5011m3012J6373O7771
$$ 8373 -123159 28457 71620 -80175 -55081 43482 166 -10381 34630 -8382 7991 75762
101G5762r3875o9520J29185K797j49437O6735J38791j01018p1699J22124J4135
$$ 75762 -18113 -87633 41552 44349 -105088 -38353 100438 -580 -72279 49845 63980
112F3980r8454K3497L4417m7872J0710J8855m7734L6902P1248o8729m0962R5591
$$ 63980 -34474 -10977 23440 -24432 -13722 5133 -42601 -5699 65549 -3180 -44142 51449
124E1449o496j03667L5643O6803o2767k8167N9986j09k1493K7976o081j7301K9717
$$ 51449 44953 -58714 -23071 43732 -19035 -47202 12784 12675 -8818 19158 13077 -4224 25493
137B5493k0337n1418M3205L5677o3131l369P1474j9058m6818M1605J7975m3467
$$ 25493 5156 -46262 -3057 32620 -30511 -33880 37594 18536 -28282 13323 31298 -12169
149a2169M466J5681k9346P200K8026k4865M25M4037k2370l6918M1868J1803n5525
$$ -12169 -7703 7978 -21368 -14168 13858 -11007 -10582 33455 11085 -25833 16035 27838 -27687
162b7687P760M1123l0355j8616M0450P56k1835K3560J586l1875J4304J3743l4088
$$ -27687 -19927 21196 -9159 -27775 12675 13431 -8404 15156 16742 -15133 -829 12914 -21174
175b1174N760L5978k5368j9098M3950J837m1085K0666K6063l8523j1713L2688
$$ -21174 -15414 20564 -4804 -23902 20048 21885 -19200 1466 27529 -10994 -22707 9981
187I981j0846j8150K7354L659k3186J6938J2302k7673L455K3367k3488j5628K9563
$$ 9981 -865 -19015 8339 11998 -11188 5750 18052 -9621 -6166 17201 -6287 -21915 7648
200G648j213k5407K0647K0264k4089m699J9886j1417j3211J4547k685j3700J4141
$$ 7648 6435 -18972 1675 21939 -2150 -6849 13037 1620 -11591 2956 271 -13429 712
213G12O445j6058R352J7526j6852r589J7739o006j9836J2567J2381j4876m43J6044
$$ 712 7157 -8901 451 17977 1125 -8464 9275 3269 -16567 -4000 8381 -6495 -6938 9106
227I106m572p597R525p36j0642L982K231j0320K663J1115m091l560R078l8q199
$$ 9106 4534 -3063 6462 5726 -4916 -934 1297 -9023 -6360 4755 664 -2896 6182 6144 -2055
242b055K896L117o972j652M128k465j089N760J014j815L613O0o220l26L158l252
$$ -2055 841 3958 -3014 -4666 -538 -3003 -4092 1668 2682 867 4480 4540 -1680 -2006 1152 -2100
258b100k468L508J097j498K497K288j334rM85l109k337J184R5q21K078K030r07
$$ -2100 -4568 -1060 37 -1461 1036 3324 1990 1981 2466 -643 -2980 -1796 -1701 -2522 -444 1586 679
275F79l8J857k10k142o98Q6j172r26P84J444J076P82J47n35l86k54p75o40M2j28
$$ 679 641 2498 2288 146 -552 -466 -1638 -2564 -1780 -336 740 1522 1669 1134 748 494 -281 -921 -879 -1007
295a007k57P34J042K07J98N89m65j315m91J44q8R1K81O9L37N34ok8K38m42p82
$$ -1007 -1264 -530 512 719 917 1506 1041 -274 -765 -621 -709 -618 -337 -268 69 603 597 569 807 365 -417
316d17m8j04m99N77J040k38m88O34K47o68k5K75n45l67K92L8J6N08K73j03Kk72
$$ -417 -465 -569 -1068 -491 549 311 -177 457 704 36 11 286 -259 -626 -334 -296 -280 228 501 398 400 128
338A28m68K11K79m46j84N01N9k55L20L48k32j39M3k93k33J56J76N0or7N2K22l
$$ 128 -340 -129 150 -296 -480 21 80 -175 145 493 261 122 165 -128 -361 -205 -29 21 15 -82 -30 192 189
361A89j45Q0k9k09q1l1j0K33J83j39M0J58k18m7L05l00m87L81K41m84K01O93k52
$$ 189 44 124 95 -114 -195 -226 -236 -3 180 41 81 239 21 -26 279 -21 -508 -127 114 -370 -169 524 272
384B72l02L99k49o03M28K48o14J94O16m39j11P50l55o94O57J42j039L22R25o38
$$ 272 -30 369 120 -483 -55 193 -421 -227 389 -50 -161 589 234 -460 197 339 -700 -378 547 -91
404i1k73R65l41q68P96K72j044L23Q16q15j78J020m96p05J077J6j308O92R35j195
$$ -91 -364 601 260 -608 188 460 -584 -261 555 -260 -438 582 86 -619 458 474 -834 -142 793 -402
424d02j12J346p12r35J238R8j365P61Q93j281L9J274r20o35J461l36j433J192
$$ -402 -514 832 120 -815 423 521 -844 -83 810 -471 -432 842 -78 -713 748 412 -1021 171
442A71O58j645M50J414j345n11J806o94j502J648M68k001P70J488j747l07K048
$$ 171 829 -816 -366 1048 -297 -808 998 304 -1198 450 918 -1083 -313 1175 -572 -879 1169
459A169j014j427J995J39k199J308J365k297J08K432j669j517K679o8k674J671
$$ 1169 155 -1272 723 862 -1337 -29 1336 -961 -853 1579 -90 -1607 1072 1004 -1670 1
475AJ619k625J41K515j865j306K787n80k553K335J214l230Q51K927k699j436L521
$$ 1 1620 -1005 -864 1651 -214 -1520 1267 687 -1866 469 1683 -1547 -696 2231 -468 -1904 1617
492A617p52l152K574J507l304Q63K790k720r80L398j435k784L239Q14l864J655
$$ 1617 865 -2287 287 1794 -1510 -647 2143 -577 -1557 1841 406 -2378 861 1675 -2189 -534
508e34L103l461r51M040j574l140L279R53l743J592K707l273m72L602j959k451
$$ -534 2569 -892 -1843 2197 623 -2517 762 1715 -2028 -436 2271 -1002 -1474 2128 169 -2282
524b282L527K09l692K118K393l518r2L577k162k248L416j3l295K141J889l258
$$ -2282 1245 1454 -2238 -120 2273 -1245 -1337 2240 78 -2170 1246 1233 -2062 79 1968 -1290
540a290L01K949k309j409L203o86k757K480J151l201R78K648k639j014L113j008
$$ -1290 -989 1960 -349 -1758 1445 759 -1998 482 1633 -1568 -590 2058 -581 -1595 1518 510
556E10k416K434P87k673J081J794k292q6K378j623j344K526m00k413J963J311
$$ 510 -1906 528 1315 -1358 -277 1517 -775 -861 1517 -106 -1450 1076 676 -1737 226 1537
572A537k608L67K272j720j035K103n57j515J657J06j849J438J127k325L87K271
$$ 1537 -1071 -704 1568 -152 -1187 916 359 -1156 501 607 -1242 196 1323 -1002 -615 1656
588A656j847j383K488j32k203J438J138j900L69J412j475j43J726j429j095K369
$$ 1656 -191 -1574 914 782 -1421 17 1155 -745 -376 1036 -439 -582 1144 -285 -1380 989
604I89k71k397J781J635k582j86K436j239j414J883j27j620J437M52j920J212
$$ 989 718 -1679 102 1737 -845 -1031 1405 166 -1248 635 508 -1112 325 777 -1143 69
620F9J518k448k35K786j445k214K562Q39k772P50K040j737m94J851j079j004J894
$$ 69 1587 -861 -1096 1690 245 -1969 593 1432 -1340 -590 1450 -287 -781 1070 -9 -1013 881
637H81o14j907K148R38k852O66K718k079j633K736L5k507J226J304j833L14J558
$$ 881 267 -1640 508 1446 -1406 -740 1978 -101 -1734 1002 1037 -1470 -244 1060 -773 -459 1099
654A099j493l10K016j221j650K301M32k702R46K212j944r63K299k73j697J158
$$ 1099 -394 -704 1312 91 -1559 742 1174 -1528 -582 1630 -314 -1277 1022 749 -948 210
670B10M34j439O97Q09j499L62J675j428r86K132m9k143R94J368j669m10J602m52
$$ 210 644 -795 -98 711 -788 -426 1249 -179 -1165 967 918 -1225 -231 1137 -532 -942 660 208
688B08q14J052q9r18Q62K17j336N66J111j301m98J640j70j253Q35O75j044r7O52
$$ 208 -606 446 357 -561 301 518 -818 -252 859 -442 -940 700 530 -723 112 787 -257 -354 298
707B98m80j18O07m15k65Q77j91q22P07M57j057r7Q74l72m92O33J50m04K65Q4m32
$$ 298 -182 -300 307 -108 -373 504 313 -509 198 655 -402 -499 375 3 -489 144 294 -110 155 239 -193
728a93K80J91o51L7N97l73l58P08J61n82J97L32m45r0L06k69q5L80j77k06N20
$$ -193 87 278 -373 -336 261 -112 -470 238 399 -183 14 346 -99 -189 117 -152 -237 143 -34 -240 280
749B80P5n43J64L41n37j79M86r7k67M05J34l32K21J99m09m7K93l75k27M63N5l26
$$ 280 355 -188 -24 317 -220 -399 87 -10 -277 128 262 -70 151 350 -59 -106 187 -188 -415 48 103 -223
771b23L16K82l56p6K97k47k59K50j0k57K14K60j79L5K37j99k28J49o2k36J49J65
$$ -223 93 375 19 -57 240 -7 -266 -16 -26 -283 -69 191 12 47 284 85 -143 6 -56 -292 -143 22
793B2j36Q4K38o3j08J46o8k62M0P2j28M0J96Pn6J31J7j74qL0j43p1J17N0l1J28
$$ 22 -114 -30 208 145 37 183 115 -147 -107 -35 -163 -123 73 80 24 155 172 -2 -10 20 -123 -194 -77 -27 -58 70
819G0J06o0n0K8p7j20kNk7J9Q3M4L9P0k5p6m1k4q5j1O5K2J8O8N4nKNq7p8j8k5
$$ 70 176 116 66 94 17 -103 -105 -100 -127 -108 -25 19 58 128 103 27 -14 -38 -123 -134 -69 -47 -29 39 93 88 90 95 8 -70 -88 -113
851a13MO3O1L3L6N4l0p1k3k5p6k3K1J6N1Q0L7j1ml1o8n2j0j9MM9N4J9M1K7j0n1
$$ -113 -109 -46 15 48 84 138 108 37 14 -11 -87 -110 -89 -73 -22 58 95 84 80 49 -19 -71 -81 -100 -96 -47 7 26 67 94 84 33
883C3m4m8m6NL0L2K8O2L2kj2om6p7j4Qj4M3P1J5J2M2j2p3kj2q7k7P5pk1J05N7
$$ 33 -11 -59 -105 -100 -70 -38 -10 52 84 82 70 64 18 -59 -73 -65 -79 -36 35 50 62 104 92 19 17 5 -82 -109 -34 -41 -62 43 100
916A00m5jRr2m7K9m9j9J02M4o7R4Q6r7n3P1q7j25Q9L6o7Q3J08q3K2J07j11j08
$$ 100 55 54 63 -29 -76 -47 -96 -115 -13 31 -36 58 144 47 -6 65 -22 -147 -58 -22 -89 -6 102 19 41 148 37 -71
944g1J16l5j82J00J58j29QK02m9j28R8nj95N6Q0j61K5K09r0q6K42lk68Q4J31k25
$$ -71 45 10 -172 -72 86 -43 -35 167 118 -10 88 83 -112 -56 24 -137 -112 97 7 -79 163 160 -108 -24 107 -118
970a18o0K12n2j10J91L4j61J27Q7k49J3J83j73j33K83M0k31J50J94k33m7J87j49
$$ -118 -178 34 -18 -128 63 97 -64 63 150 -99 -86 97 -76 -209 74 114 -117 33 227 -6 -53 134 -15
993a5j21J75k9j78K06J18k40Q6K27k25j51K48m4k58J59J47k01L8J97j48m1J88
$$ -15 -136 39 10 -168 38 156 -84 2 229 4 -147 101 57 -201 -42 105 -96 -58 139 -9 -50 138
1015A38j41j74K28qk66J76K28k51l4K87j25k07K15K2k45J26J30k06N7K48k03r6
$$ 138 -3 -177 51 43 -223 -47 181 -70 -104 183 58 -149 66 88 -157 -31 99 -107 -50 198 -5 -101
1037a01L08j00l08K39J34l41N3L01j92j37L05o1k55K27N0l21J48K21l20k2L88
$$ -101 207 107 -201 38 172 -169 -116 185 -7 -144 161 100 -155 72 122 -199 -51 170 -150 -172 216
1058B16j74k85L64R5m23J24K98l30q9L59j40k21L32K2l60K32K24m15lM25k44l05
$$ 216 42 -243 121 216 -207 -83 215 -115 -204 155 15 -206 126 148 -212 20 244 -171 -174 251 7 -298
1080b98M28Q8m26J85K87l49n6L52k04k20L58k2l65K67K45m12j9M19k18l08L48
$$ -298 130 218 -208 -23 264 -85 -141 211 7 -213 145 123 -242 25 270 -142 -161 258 40 -268 80
1101H0Q1l67J34K66k85l9L03j67j91K86Ql30J78K38l09n0L36j03k53K35R6k56
$$ 80 161 -206 -72 194 -91 -130 173 6 -185 101 109 -221 -43 195 -114 -164 172 69 -184 51 147 -109
1123a09O2J73j73n1K23j18j36K34Lk47J32J70k29n3K39p6j67J54O0j59N6J05j43
$$ -109 -47 126 -47 -98 125 7 -129 105 108 -139 -7 163 -66 -119 120 44 -123 31 91 -68 -12 93 -50
1146e0kJ63j21j15J95%k00R7J51j62m8J52m8r3R4J7j01P6M5j20L1J22j09l1J29
$$ -50 -52 111 -10 -125 70 70 -130 -33 118 -44 -92 60 12 -81 13 30 -71 5 50 -70 -39 83 -26 -57 72
1171G2l4j19J01N3j18M2P7q7k2J02o5n5J03Mj30Q6Q0j34lJ25o6q8J03Rj01P1N7
$$ 72 38 -81 20 73 -45 -3 74 -13 -35 67 2 -53 50 54 -76 10 90 -44 -47 78 12 -76 27 36 -65 6 63
1198F3j07MJ02p7o6J17mj09N9Q6j19LJ10o6o0J04pj01P3O3j03nJ16n8p5J15J2
$$ 63 -44 -40 62 -15 -81 36 32 -77 -18 68 -51 -48 62 -4 -64 40 33 -68 5 68 -35 -40 76 18 -57 58 70
1225G0j17M8Q4j13j5J01k5q0Q3J3j00M1P1q3l5R1k3o9O1K8q5K7P2o1l2P0j4o6
$$ 70 -47 1 85 -28 -43 58 33 -47 36 49 -51 -10 61 -22 -57 34 11 -58 3 31 -54 -27 45 -16 -48 22 8 -58
1253e8O3L0q0J6O4m9k8O8%o4M4L3o9J1O6l3m8O7j1m5L5L7o2kN2l7k5M6ll5K2J6
$$ -58 5 35 -45 -29 35 -14 -42 26 26 -38 6 39 -30 -19 47 14 -34 33 22 -23 12 49 -13 -15 37 0 -25 21 18 -17 5 21
1285B1l8PK5l0j1K3Ql6K4J2k0oK1j2oJ5jk6K8J1l0J1K6j0k8M1rl0J5L2j8oJ1O
$$ 21 -17 -10 15 -15 -26 -3 5 -31 -7 5 -15 -21 0 -12 -18 -3 -4 -30 -2 9 -21 -10 16 6 -22 19 10 -20 -5 27 9 3 14 20
1319B0plnLJj3%QK1k9PJ2j8nJ5nj3KJ%nMpmK8k2j2J4J4j6kK3qkjJ4mKJnkJ3p%
$$ 20 13 10 5 8 9 -4 -4 4 25 -4 3 15 -3 -8 7 2 -11 -9 -8 -8 -13 -9 -16 -20 8 -14 -26 -12 2 -14 -16 7 -1 -3 -4 10 6 8 9 4 2 15 8 8
1363HJ2qj1J9Oj7kRj9PLNj5J0J6k7pJ3Kk5J2Nn%PjoQj2MmJ2mNknmJ6J1pKkJj2
$$ 8 20 12 1 20 26 9 7 16 -3 4 7 12 -3 7 23 -4 -11 2 4 -21 -9 -4 -9 -9 -2 -3 -9 -1 -13 -9 -13 -1 -5 0 -2 -7 -11 5 16 9 11 9 10 -2
1407bMJ9ljj3QKkJ0rkJnKpkLMqoRooMPnNj7J2j2NJ3j2NqLl%qK1LpPRoQ%k3J0M
$$ -2 2 21 18 17 4 12 14 12 22 13 11 12 7 9 2 0 3 7 -1 -7 2 -4 -10 -6 1 -4 1 -16 -4 -16 -11 2 -10 -5 -13 -10 -13 -13 -21 0 3 -4 3 12 6 14 14 -9 1 5
1457ElMNnQOmj6J3jj0Qj1olNjOpjj0lJ5k4J7J2j5j7K7nj0J5Qkj1J6j2JJ4Mk1K8
$$ 5 2 6 11 6 14 20 16 0 13 12 2 10 -1 -7 -10 -5 -6 0 -7 -8 -18 -21 -6 -30 -13 -1 -16 -33 -6 -11 -21 -6 2 0 -11 5 -7 -6 8 12 -9 19
1499A9oj3OJ0oj0K0j7JJ0lj6J4Pj9KJ5j8MJ2j0j5J6jk0J6kj0NOj0jJ1rpK2j2j1
$$ 19 13 0 6 16 10 0 20 3 4 14 11 -5 9 16 -3 -1 14 -4 0 12 2 -13 3 2 -18 -2 -4 -14 -9 -3 -13 -14 -3 -12 -19 3 -9 -20
1537b0J3J9j9JJ8j0qK9rj3J6J1l6L3J9n4RL2k1k4L4jm4K7K7m4PL0l5j0L5j2l2
$$ -20 -7 12 -7 -6 12 2 -6 23 14 1 17 28 -8 25 44 -10 -1 31 10 -14 20 19 -25 2 29 -15 -8 22 -13 -23 12 0 -32
1570c2M2Mo0K5N2o2LN9l0m6N8jm0L0K0n6K3N2o8rR3m2o1P4K9p7K3O1o8k1O8l3
$$ -32 10 14 -46 -21 31 -31 -28 31 1 -45 13 12 -28 2 22 -34 -11 41 -27 -36 57 15 -46 28 57 -20 3 64 -4 -25 43 10
1602A0l6O5j1o0O0K7r9K0P4p2l0R6l1p9Q9K2j08O0O6j15mJ18o8p2J25kj21R1O4
$$ 10 -26 39 28 -32 28 55 -44 -24 50 -22 -52 44 13 -66 23 45 -63 -3 63 -52 -56 62 -6 -78 47 45 -76 15 79
1631G9j52M3J16j09n1J67n5j41J45O8k02O7J44j56m2J88p9j35J80J5j89J13J27
$$ 79 -73 -30 86 -23 -74 93 38 -103 42 110 -92 -25 119 -37 -79 109 30 -105 75 90 -99 14 141
1654A41k08j8K40j57j55K22L9k58J20J74k22j0K32j53j41K41k0k41J90J49k82
$$ 141 -67 -85 155 -2 -157 65 104 -154 -34 140 -82 -92 140 -13 -154 87 67 -174 16 165 -117
1675a17K5K64j70j62K55k6k35J68J37k41M9K18k02r6K93p3k60K20J23k94N4K42
$$ -117 -92 172 2 -160 95 69 -166 2 139 -102 -53 165 -37 -133 160 87 -173 47 170 -124 -70 172
1697A72j73j25K45o5j82J85L9k42J25J87k47n8K97j07k24K10Q5k48M0J72j45l0
$$ 172 -1 -126 119 54 -128 57 96 -146 -21 166 -81 -139 158 51 -173 37 122 -126 -86 86 -59 -89
1719h9J64p9j02J85l0j81J52J05k32L0K21j46j06J79J6j60R5N3j37O6R2j58J6
$$ -89 75 -4 -106 79 49 -132 20 125 -107 -77 144 -2 -108 71 87 -73 22 75 -62 4 96 -62 -46
1742d6J60j13j07J96Pk02R2J01j48j3J42q8l7J11m6j01J40J4j63Q1J02j58JJ52
$$ -46 114 1 -106 90 97 -105 -13 88 -60 -73 69 -19 -56 55 9 -92 48 62 -101 -20 82 -76 -75 77
1766G7p0r9J51j3j27J05N6j72O7J28j51l3J89m6j70J64M7j91O6J25j40k9J75q7
$$ 77 7 -92 59 46 -81 24 80 -92 -25 103 -48 -81 108 62 -108 56 103 -88 -22 103 -37 -66 109 22
1790B2j38J91J7j89R0J41k00l2J82q6j18J55K1j43Q8P4j53L0J35j37p2J73k8j40
$$ 22 -116 75 92 -97 -7 134 -66 -98 84 -2 -120 35 56 -87 1 75 -78 -48 87 -50 -122 51 23 -117
1814a17J30J01j82OJ59j08p5J36k2j18R9O3j36M1J29j10n8J35l0j13P7N5j07K3
$$ -117 13 114 -68 -62 97 -11 -86 50 28 -90 9 72 -64 -23 106 -4 -62 73 43 -70 7 62 -45 -22
1838b2R4q4k9J06l7q5O2L0j03L0Q4o6k2P0l3m2M6No4L4N0o8JQ0k1n0N7J8o9J1
$$ -22 72 -12 -41 65 28 -57 5 35 -68 -38 46 -20 -42 28 -5 -47 -1 4 -60 -26 24 -44 -43 37 16 -34 23 41 -28 -17
1868a7L5k5k0L7rlJ3%mMmk4J2J8j4nRPj7OMMpj9j6K2Lj1J6Nj0j2K1j0j9J6Jlj1
$$ -17 18 -7 -27 10 1 -2 11 11 7 11 7 -17 -5 13 -1 -6 3 10 -7 -1 3 7 0 -19 -35 -13 -10 -21 -5 0 -10 -22 -1 -11 -30 -14 -13 -16 -27
1907b7J3NpK7jlnkj0MPpJ6Pk0%M5k3k9J1J3l7RK6lj1JRk5J6J2k3j4K6j5j9M5n
$$ -27 -14 -9 -16 11 10 7 2 0 -10 -6 1 -6 10 17 -3 -3 42 19 -10 1 14 -23 -14 12 9 -2 -1 8 -17 -1 11 -12 -26 0 -15 -34 11 6
1945Fl3OL6k8l1M2%k5J4Pj1OL5l5NK7k7j1L4kl5K4K8l8J1K9nm2L5J4m9K0K5m2
$$ 6 -27 -21 15 -13 -44 -2 -2 -27 -13 -6 -17 -11 24 -11 -6 21 -6 -17 17 15 -20 4 32 -6 5 34 29 -13 22 36 -13 7 32 -10
1979a0oM8k8l3M4pm9L3J6m9%N0k4l5O8Ko5L0L8m9j5N7k5l1M6Nl9M4J4n9PO2n9
$$ -10 -16 32 4 -29 15 8 -41 -8 8 -41 -41 9 -15 -50 18 20 -45 -15 23 -26 -41 16 -9 -40 6 11 -28 16 30 -29 -22 40 -19
2012a9k3O4on0N0K2m6J1L6m6j8N5l5m1O9J0o5L1M1o0j5M9l4l5N0ol2M9J8p6L0
$$ -19 -42 22 16 -34 16 38 -8 3 39 -7 -25 30 -5 -46 23 33 -32 -1 40 -20 -35 14 -20 -55 -5 -11 -43 6 24 -52 -22
2043b2O1q0j0O5qn9N8J7n0K8L5o0J9N8p1l1J05k3q9O5O0j02QQ8n7n6R1l2o8R6
$$ -22 39 -41 -51 14 6 -53 5 22 -28 0 35 -25 -6 52 -19 -50 55 32 -57 8 68 -34 -26 62 5 -51 40 8 -60 36
2073C6Lj04P3P4j27k4J43n9j19J14M1j26M2R1j04rJ18q7p9J52j3j64J07J24j66
$$ 36 39 -65 8 82 -45 -69 74 15 -104 10 51 -75 -33 58 -46 -55 63 -24 -103 49 36 -128 -21 103 -63
2098f3k8J94p3j24J42J9j52R0Q0j43K0J52j25r7K11Jk17J16J33k03l0J86p8j20
$$ -63 -91 103 30 -94 48 67 -85 5 85 -58 -38 114 -11 -108 103 104 -113 3 136 -67 -97 89 11 -109
2122a09J69j1j46J14P3k01M4J89j51j37K31J0j99J00J43j77k5J59r6p7J45k5j37
$$ -109 60 49 -97 17 90 -111 -67 122 -29 -166 65 75 -124 -24 119 -58 -83 76 -20 -97 48 23 -114
2145a14J53O0k00M7J97j45j15J84J3j69Q7Q8j26J7J08r5l0J28o8j28J38M9j82
$$ -114 39 99 -101 -54 143 -2 -117 67 80 -89 -2 86 -40 -23 85 -10 -40 88 20 -108 30 79 -103
2168a03O6J44j31p8J59k4r9P0K3j08O4N0j07K5J42j03r0J65j4j50O9R7r5k5J06
$$ -103 -37 107 -24 -102 57 33 -66 4 27 -81 -17 33 -74 -49 93 -10 -100 65 51 -99 -30 67 -28 -53 53
2193E3o3l1J04l4r0J06J1j47P4J23j36l1J36l7j02J06K9j30O1P0j33K0J25q9o8
$$ 53 -10 -41 63 29 -61 45 56 -91 -17 106 -30 -61 75 38 -64 42 71 -59 2 72 -61 -41 84 -5 -73
2218g3J49k1j58J16O7j61K0J49j16p9J57j9j31J24P2j80M1J41j35n6J71l5j52
$$ -73 76 55 -103 13 80 -81 -61 88 -28 -107 50 31 -100 24 96 -84 -43 98 -37 -93 78 43 -109
2241a09J45N7j68N0J57j53n7J63m1j51J61M3j60L5J45j34o0J60n7j37J40M6j75
$$ -109 36 93 -75 -25 132 -21 -78 85 44 -107 54 97 -63 -28 117 -17 -77 83 26 -111 29 75 -100
2264a00P6J37j48m8J53n7j31J33M9j54N5R6j11j7J42p4j01J43J7j50P0J13j10
$$ -100 -24 113 -35 -83 70 13 -118 15 64 -90 -35 61 -50 -67 75 1 -100 43 60 -90 -20 93 -17
2287a7n1J45m7q4Q8K6j03L6P4r5mJ02n6p6J04J4j18M6Q5p3m5Q1k9o5O0J7o5O0
$$ -17 -68 77 30 -54 34 60 -43 -7 67 -28 -32 70 14 -62 42 56 -62 -16 69 -4 -49 32 3 -62 -2 15 -50 10
2315A0J3p0J3Q4o9k4O2po6K0N3m4KM5l1k2M9k2k1N2kn2L2L5m1j1N2k8k6K0Kj8
$$ 10 23 -47 -34 50 -19 -43 19 12 -54 -34 19 -25 -23 22 -9 -31 18 -4 -25 27 25 -27 5 40 -1 -12 40 12 -14 6 8 -10
2347a0L1J4m2J2K5m7qN8l2m8M6J1l9K0J9k3rK5l0j0M2pk5K6K1l7MM5k3k7L2pk5
$$ -10 21 35 -7 5 30 -17 -25 33 1 -47 -1 10 -29 -9 10 -13 -22 3 -27 -37 5 -2 -27 -1 20 -17 -13 32 9 -18 14 7 -18
2380a8J5L0k9JK9k9j1L1Jl0K7J6l9jL7rk4K6ok5QK0m6%L8k7j1J8K0l2PK4l1oJ5
$$ -18 -3 27 -2 -1 28 -1 -12 19 20 -10 17 33 -6 -7 30 21 -3 23 17 -8 0 20 -26 -26 12 -15 -26 -8 12 -20 -13 11 -20 -26 -11
2415a1j4j3L7Qk5PK0j5LJ7ol2K3J5qJ7Rj7j6K9j9mMLk4QJ2qOK0j5j4J1%j7MJ6
$$ -11 -25 -38 -1 7 -18 -11 9 -6 -3 14 8 -24 -1 14 6 23 32 15 -1 28 9 5 9 12 -12 -4 8 0 6 26 11 -3 8 8 -9 -5 11
2452A1j4JNj2rPJ9l0J4Kj3NJ5%nOkj2J6J1KpnoJ3QjojPmrJ9oKkk2kPQk2K7qj3
$$ 11 -3 -2 3 -9 -18 -11 8 -22 -8 -6 -19 -14 1 1 -4 2 0 -12 4 15 17 10 5 -1 12 20 19 13 12 19 15 6 25 19 21 19 -3 -5 2 10 -12 15 7 -6
2496foNnLJ1lj4PJmJ6kj2j2K0rrK9j4mJ3j6kJ0K0k5KK5j2mJ4onLMj4qK9j2j1K1
$$ -6 -12 -7 -12 -9 2 -1 -15 -8 -7 -11 5 3 -9 -21 -1 -10 -19 10 -4 -8 5 -11 -13 -3 17 -8 -6 19 7 3 17 11 6 9 13 -1 -9 20 8 -3 18
2537A8%k7J7J2m2RJ8j9j2K7j0j7K0J1l6J4K4j8j4L0Jm0L4J4k9J4J7l0rM1j0l6
$$ 18 18 -9 8 20 -22 -13 5 -14 -26 1 -9 -26 -6 5 -31 -17 7 -11 -25 5 6 -34 0 14 -15 -1 16 -14 -23 18 8 -28
2569b8M2Kl5L2K1l2LK7k9k7L9lj8J7Qj6oK3k6oK4rl5J1K7k6JM2l7j3J6Nk6L5j0
$$ -28 14 16 -19 13 34 2 5 32 3 -24 15 12 -6 11 19 3 -3 20 -6 -12 12 3 -32 -21 6 -20 -19 23 -14 -27 -11 -6 -32 3 -7
2604gk2K0K0j8mL9j4k9K4Nl7L1K2m5RM0k0k3L1Pm6J7J3k7NL0k8KL7k9k3M1j8k7
$$ -7 -29 -9 11 -7 -11 28 14 -15 9 14 -23 8 30 -15 -6 34 14 -9 22 29 -17 0 13 -14 -9 21 -7 -5 32 3 -20 21 3 -24
2638b4J1J4l1J3L5k2k7L4kl7M1Rn8J5N7n9oO2om1L9Rn4K5L2m3J8K8l1k4P1pp0
$$ -24 -13 1 -30 -17 18 -4 -31 3 1 -36 5 14 -44 -29 28 -31 -37 25 19 -22 17 26 -28 -3 29 -14 4 32 1 -23 48 41 -29
2671b9M3L6o6j5O4l4j9N0j2l8L1K0o1K1M7n6l3P8j5o5N9K6p9J7O3m1k9O5l1m1
$$ -29 14 50 -16 -31 33 -1 -20 30 18 -20 11 31 -30 -9 38 -18 -51 27 12 -53 6 32 -47 -30 33 -8 -37 28 -3 -44
2701d4M0K3n1K0N8o0l4R2j6o1N0K8n5QM9n1MM4l2l8M3Rn5J7N8n0l2O2k0m3L3J7
$$ -44 -4 19 -32 -12 46 -14 -48 44 28 -33 17 45 -10 -2 47 -4 0 44 12 -26 17 26 -29 -12 46 -4 -36 26 6 -37 -4 13
2733A3n1J8L8n0NN6l3l1M8Ln0K4K3l9kN5k6j3L1Nl8J9J7l9J4K9l6j2N7j8k5J9
$$ 13 -38 -20 18 -32 -27 29 -4 -35 13 16 -34 -10 13 -26 -28 27 1 -12 19 24 -14 5 22 -17 -3 26 -10 -22 35 17 -8 11
2765A1Qj3rK5j9j1J0oj0J9Pk1NJ8j6k3K6rj8J1J1j0J1J4l1KK3j5pJ7Pj9QJ5kK
$$ 11 19 6 -3 22 3 -8 2 -4 -14 5 12 -9 -4 14 -2 -25 1 -8 -26 -15 -4 -14 -3 11 -20 -18 5 -10 -17 0 7 -12 -4 11 9 11
2801A1NomNkj8J9J8l4QK3k0j7K6J0m1PJ9j8j1K0koJ0kj8lJ9k6MK1j2nLK0k0MJ2
$$ 11 16 10 6 11 9 -9 10 28 -6 2 25 5 -12 14 24 -17 -10 9 -9 -20 0 -2 -8 2 0 -18 -21 -2 -28 -24 -3 -15 -20 -17 3 -17 -13 -1
2839aqmNQk3K1J5j3KJ5%j2J0rrJ1Qj1lK2k2rJ3jk8K2jorJ7j1k2L9oj6J6Mk4j1
$$ -1 -9 -13 -8 0 -23 -2 13 0 2 17 17 5 15 6 -3 8 16 5 2 24 2 -7 6 5 -23 -1 -2 -8 -17 0 -11 -33 6 0 -16 0 4 -20 -31
2878c1K5Jk2J6J6j7jJ4rjkkMNJ4j5J0J9k7OJ4%k0J2J2l6K1QrRPrmKJj9lRplPl
$$ -31 -6 -5 -27 -11 5 -12 -13 1 -8 -9 -11 -13 -9 -4 10 -5 5 24 -3 3 17 17 -3 9 21 -15 6 14 5 14 21 12 8 10 11 -8 -11 -2 -9 -12 -5 -8
2920hkJ0qrMMrMLNjJ4llkJ3j1kKqmJ4MqJ1J2k2NJ3j3j3PJ1kjOj3J2Oj9lKj1j0
$$ -8 -10 0 -8 -17 -13 -9 -18 -14 -11 -6 -7 7 4 1 -1 12 1 -1 1 -7 -11 3 7 -1 10 22 0 5 18 5 -8 -1 10 8 7 13 0 12 18 -1 -4 -2 -13 -23
2964b3J4p%J5Jj3jJ0rrJ1Rk8KK6nMJ3jj4J7j4j5K4%pjK2Jj1%Mj2lJ5k0MRj0lK2
$$ -23 -9 -16 -16 -1 0 -13 -14 -4 -13 -22 -11 -2 -30 -28 -2 -7 -3 10 9 -5 12 -2 -17 7 7 0 -1 21 22 11 11 15 3 0 15 -5 -1 8 -2 -5 17
3005A7j4j1rJ2%k3K8j6j2K3J0j9KJ3plkJj5POjRK4j7kJ3lk2K0Ll0J9K7j5KJMj5
$$ 17 3 -8 -17 -5 -5 -28 0 -16 -28 -5 5 -14 -12 1 -6 -9 -11 -10 -25 -18 -12 -13 -4 20 3 1 14 11 -11 9 12 -18 1 28 13 15 16 20 5
3044EMOr%Jk1RNrnK0j3j5NMj5%K8rLJ3j0j0QmlK%jjJ1%mJ9mj3J2kj4J8NqKJ4r
$$ 5 9 15 6 6 7 -14 -5 0 -9 -14 6 -7 -22 -17 -13 -28 -28 0 -9 -6 7 -3 -13 -5 -9 -12 -10 -10 -11 -12 -1 -1 -5 14 10 -3 9 7 -7 11 16 8 10 24 15
3089A5j2K6rj9jJ3j9OK0j3k4L0pk9K0%k3NJ6qk1L4kk3K4Mk3J0K7l0rM6k4k0L0
$$ 15 3 29 20 1 0 13 -6 0 20 7 -17 13 6 -23 -3 -3 -26 -21 -5 -13 -34 0 -2 -25 -1 3 -20 -10 17 -13 -22 24 0 -20 10
3124A0K3m0J0M0m1j9L4%l0K2J1l9K9J7l4%L7l4k8M4J9n2J0M0m9nL8km3L2j0l3
$$ 10 33 -7 3 43 2 -17 17 17 -13 9 20 -19 10 27 -7 -7 30 -4 -32 12 31 -21 -11 29 -20 -25 13 11 -32 0 -10 -43
3156d3L4J6l6MM9l6l1N1J1n1J6M4m5J1L2k1k2M4ml8L0K0n2K3M1l5l2M8jm3K8O
$$ -43 -9 7 -29 -25 24 -12 -43 8 19 -32 -16 28 -17 -6 26 5 -17 27 23 -15 15 35 -17 6 47 12 -20 28 27 -16 12 18
3188A8l5RJ7l2pM5j1l7M7j0m2J7M3m3j8M7k5k1L2jk4K4J1l7QM9l0k2L8ok1J8J5
$$ 18 -17 -8 9 -23 -30 15 4 -33 14 4 -38 -21 22 -21 -39 8 -17 -38 -6 -7 -31 -7 4 -33 -25 24 -6 -28 10 4 -17 1 16
3221A6k3K0J6n2J9J8j4rL5ml8K0K5l7j2L2k3j4L7ql1L3Pn5L7K5n6KN6k9m7N5J5
$$ 16 -7 13 29 -23 -4 14 0 -9 26 22 -16 4 29 -8 -20 12 -11 -25 12 4 -27 6 13 -42 -5 20 -36 -34 22 -7 -54 1 16
3254A6n3J9L5m1pM9l1k4O0j3m7L3M3n4pN8k8m5O7j1l2L6J6n3PN0n9k1O0j5n0L5
$$ 16 -37 -18 17 -24 -31 18 -13 -37 23 10 -37 -4 39 -15 -22 36 8 -37 30 19 -13 23 39 -14 -7 43 -16 -37 23 8 -42 -7
3286gL5o7OM8k7k2M0nn7M1K2n4K7N5o0k1O9k0m5M9Rm9K0M6m6OL1j8k6M6%m1NN6
$$ -7 28 -39 -33 15 -12 -34 6 1 -56 -15 7 -47 -20 35 -25 -46 23 3 -42 7 16 -33 -13 33 -13 -7 24 6 -20 26 26 -15 -10 46
3320D6n7%M6j5m6M3Kk8J0J9m0J0L2k6j7K9J0m9L0Kk2oK6j9nK0Pk3QK0k1lL1k5
$$ 46 -11 -11 35 20 -26 17 19 -9 1 20 -20 -10 22 -4 -21 8 18 -31 -1 1 -21 -27 -1 -20 -25 -5 2 -21 -13 7 -14 -17 14 -11
3354a1OK4j2j2K6Rl1J4J3k0jJ9j8%J3j6kJ2J2k6jJ7qj6Rqj8L0nk1J9Oj5j0K1j3
$$ -11 -5 19 7 -5 21 30 -1 13 26 6 5 24 6 6 19 3 1 13 25 -1 -2 15 7 -9 0 -8 -26 4 -1 -22 -3 3 -12 -22 -1 -14
3390a4%K1j3pRMj9MJ6k1ML0pk2L4Ok9K1Ql3MK9k2%J3Lk2J9Lj8mK9k2k9K8Nl4R
$$ -14 -14 7 -6 -13 -4 0 -19 -15 1 -20 -16 14 7 -15 19 25 -4 17 25 -8 -4 25 3 3 16 19 -3 16 19 1 -3 26 4 -25 3 8 -26 -17
3428a7K8k0%J2nk0K3Jl2J8K2k8%K8rqK3rj7MK0j5mL0j3j1K2Kk5PLmrJ7j0KJ8q
$$ -17 11 -9 -9 3 -2 -22 1 2 -30 -12 10 -18 -18 10 1 -7 16 7 -10 -6 14 -1 -5 25 12 1 23 25 0 7 10 6 -3 14 4 6 24 16
3466A6j4J5J0l1KLmj0J0JjqJ9ok3Qrj1K2rJ0JJ4j5LJ8qoJKpJ5lOlRjrJ2kj3Jj
$$ 16 2 17 27 -4 -2 1 -3 -13 -3 -2 -3 -11 8 2 -21 -13 -22 -33 -11 -20 -10 -9 5 -10 -7 11 3 -3 -2 0 -7 8 5 11 8 17 16 7 19 17 4 5 4
3509DOj%lOkJ2j6Klj2J1j4%JlJ4mjj1lJLrJ7mqJ0J6rrK5lk5J5Rk5RL8k2KPmqJ
$$ 4 10 9 9 6 12 10 22 6 8 5 -7 4 -10 -10 -9 -12 2 -2 -3 -14 -17 -16 -13 -22 -5 -9 -17 -7 9 0 -9 16 13 -12 3 12 -13 -4 34 12 14 21 17 9 10
3554A0Qk7MJ1mnJ6Rj9jPj3MkrqL1pj1PRj8%J4oj1J3Mk0J5J9k0OJ5k1j2K0JoJ5
$$ 10 18 -9 -5 6 2 -3 13 22 3 2 9 -4 0 -2 -11 -19 12 5 -6 1 10 -8 -8 6 0 -11 2 6 -14 1 20 0 6 21 0 -12 8 9 3 18
3594A8LlNJ8k4j5K5j3j8J9jk0QK7k0pQ%k4J8mk7J5MnkL3k0pJ4rk5K0MoNJ7oQl
$$ 18 21 18 23 41 17 2 27 14 -4 15 14 -6 2 29 9 2 10 10 -14 4 0 -27 -12 -8 -13 -15 18 -2 -9 5 -4 -29 -9 -5 -11 -6 11 5 13 10
3634A0Jj1MOj0NOrLK1lqOLk8K0jj6J3J2k5NK0j6j3KPk2MRj2rK8%j6J3Nk8J4Rj5
$$ 10 11 0 4 10 0 5 11 2 5 26 23 15 21 24 -4 16 15 -1 12 24 -1 4 24 8 -5 -3 4 -18 -14 -5 -17 -26 2 2 -14 -1 4 -24 -10 -1 -16
3675a6%K9j7nK2jj7K3kj0j5K2k5jK9Pj9K1Lk7RJ9m2nL8j3k6L9Jl2J4Rk8oL5l8
$$ -16 -16 13 -4 -9 13 12 -5 18 16 6 -9 13 -12 -13 16 23 4 25 28 1 10 29 -13 -18 20 7 -19 20 21 -11 3 12 -16 -22 13 -25
3711b5%K0J0k8OK5k4j0L5k1j3J7J1k6L1J5k5PJ9j2k8L9j3k0RK8k8oM1j3k7K9j1
$$ -25 -25 -5 5 -23 -17 8 -16 -26 9 -12 -25 -8 3 -23 8 23 -2 5 24 12 -16 23 10 -10 -1 27 -1 -7 34 21 -6 23 12
3744A2j8mJ9k3J0K3l0j6L6%l2K4Qk1j6L2j5j6L0Jj7J9nj8kK0k0kL5Kk8J6K4k5
$$ 12 -6 -10 9 -14 -4 19 -11 -27 9 9 -23 1 9 -12 -28 4 -11 -27 3 4 -13 6 1 -17 -19 1 -19 -21 14 16 -12 4 28 3
3778CpK7j8pJ6MpJ2prNQj6j2K5oj9NRko%q%Oj6%J2pj7K0K1j2LnKoR%mJ3moJ3N
$$ 3 -4 23 5 -2 14 18 11 23 16 7 12 20 4 -8 17 11 -8 -3 6 4 -2 -2 -10 -10 -4 -20 -20 -8 -15 -32 -12 9 -3 0 -5 -3 -9 0 0 -4 9 5 -1 12 17
3823A7j9OJ2j0j2K1jj1QNqJ2Kj3oJ6j4j2J7nkj2PlRknrQpmPOj5%K3qj9J5lLKJ5
$$ 17 -2 4 16 6 -6 15 14 3 11 16 8 20 22 9 3 19 5 -7 10 5 3 -9 -2 -5 4 2 -3 -12 -4 -11 -15 -8 -2 -17 -17 6 -2 -21 -6 -9 -6 -4 11
3866A1j8KK7j1rJ9Lj0j2J6nj3OPj7K2pj5J2Lj3qNK%JLj0jJ3kk1J8qpMloJ0OoJ
$$ 11 -7 -5 22 11 2 21 24 14 2 18 13 0 6 13 -4 18 11 -4 8 11 -2 -10 -5 -3 -3 -2 1 -9 -10 3 1 -20 -2 -10 -17 -13 -16 -22 -12 -6 -12 -11
3908a1PoLkNLMMJmJ3j4NNMlljnnMJ0j4MrMrKJ1pMqLqJ0j6RNj4RMkjLnJ2j4J0M
$$ -11 -4 -10 -7 -9 -4 -1 3 7 8 4 17 3 8 13 17 14 11 10 5 0 4 14 0 4 -5 -1 -10 -8 3 -4 0 -8 -5 -13 -3 -19 -10 -5 -19 -10 -6 -8 -9 -6 -11 1 -13 -3 1
3957Akj0OKMlNPm%Oj1KJ6j0JoJ3knk%KppJNj1J5j2kJoj2J1%MpJ1jjPnNkjKlNk
$$ 1 -1 -11 -5 -3 1 -2 3 10 6 6 12 1 3 19 9 10 4 17 15 10 8 8 10 3 -4 -3 2 -9 6 -6 -8 -7 -13 -25 -14 -14 -10 -17 -6 -7 -8 -1 -6 -1 -3 -4 -2 -5 0 -2
4007b%NmPj5JMQQrPlkmJ5j2Rlq%OmNoLoMj1LlMooPKpJ3j3QrQpJ6jJLj1NNqJ3Q
$$ -2 -2 3 -1 6 -9 -8 -4 4 12 3 10 7 5 1 16 4 13 10 2 2 8 4 9 3 6 0 4 -7 -4 -7 -3 -9 -15 -8 -6 -13 0 -13 -5 -14 -6 -13 3 2 3 6 -5 0 5 -3 10 18
4059A8rNpJ5j5Qj0KJ2j4kJkmmJ7on%%j%nnJ5j6LqNjJKKJpJMmJ1NKKknPJLmLLO
$$ 18 9 14 7 22 7 15 5 7 19 5 3 4 2 -2 -6 11 5 0 0 0 -1 -1 -6 -11 4 -12 -9 -17 -12 -13 -12 -10 -8 -7 -14 -13 -9 -13 -2 3 5 7 5 0 7 8 11 7 10 13 19
4110A9Qj0jll%j2J2knkmJMJn%onOloJ8j3LpJ%J4LkKoJjjKOlKJMoMPrMkPk%oK%
$$ 19 27 17 16 13 10 10 -2 10 8 3 1 -3 -2 2 3 -2 -2 -8 -13 -7 -10 -16 2 -11 -8 -15 -14 -14 0 3 1 3 -3 -2 -3 -4 -2 4 1 3 4 8 2 6 13 4 8 6 13 11 11 5 7 7
4164Gkj3KJ0oPqrMoJQj2QLmJ0opKjJkPMN%JLmKj6J6kRJ0oqpRKqNjoRnmLQomMr
$$ 7 5 -8 -6 4 -2 5 -3 -12 -8 -14 -13 -5 -17 -9 -6 -10 0 -6 -13 -11 -12 -11 -13 -6 -2 3 3 4 7 3 5 -11 5 3 12 22 16 8 1 10 12 4 9 8 2 11 6 2 5 13 7 3 7 -2
4218bLrPj1kOJqJ6kj4RLpnLRPMmn%J6llkljJ0Lj0J1jk4J2J2nPkj9PJlpOjpQlj9
$$ -2 1 -8 -1 -12 -14 -8 -7 -15 1 -1 -15 -6 -3 -10 -15 -12 -3 4 8 4 -1 -1 15 12 9 7 4 3 13 16 6 17 16 -8 4 16 11 18 16 -3 4 5 2 -5 1 0 -7 1 -2 -21
4268b1J1MqJ6j8J0jJlj1J5lJj3K0NrJ0kmjJ4lmJ0Jj6J4j0nJ5Lk0NJ3j0j2OomN
$$ -21 -10 -6 -14 2 -16 -6 -7 -6 -9 -20 -5 -8 -7 -20 0 5 -4 6 4 0 -1 13 10 6 16 17 1 15 5 0 15 18 -2 3 16 6 -6 0 -6 -10 -5
4309eJ3k4NO%qkJ2pj2J5lkJ0Nk0K2j1j0jJ3qmK6jrNNnMQj2JJ7j8oJ3Nk2ROoj6
$$ -5 8 -16 -11 -5 -5 -13 -15 -3 -10 -22 -7 -10 -12 -2 3 -17 5 -6 -16 -17 -4 -12 -16 10 9 0 5 10 5 9 17 5 6 23 5 -1 12 17 -5 4 10 4 -12
4352a2K1qKJj5nJ4J3l1NJ3qj3K4mj5J0mKnO%nJ0pmK4moOJ5j3j2J0kmPJrRj3J5
$$ -12 9 1 3 4 -11 -16 -2 11 -20 -15 -2 -10 -23 1 -3 -18 -8 -12 -10 -15 -9 -9 -14 -4 -11 -15 9 5 -1 5 20 7 -5 5 3 -1 6 7 -2 7 -6 9
4394IljqKMj1kJ0Mj5MMj5%OJmj0PLjmjMkjpK0J1j9PJ3j4K5rnKJ8j0j3Q%j1RJ0
$$ 9 6 5 -3 -1 3 -8 -10 0 4 -11 -7 -3 -18 -18 -12 -11 -15 -25 -18 -15 -16 -20 -21 -17 -19 -20 -27 -7 4 -15 -8 5 -9 16 7 2 4 22 12 -1 7 7 -4 5 15
4439A5rMjLj2JQj1lOj4JJ4Mk8JJ9j3jR%oJ3j5LpQmKJ3mMLKOpLkjJRj0J6j3jlJ0
$$ 15 6 10 9 12 0 1 9 -2 -5 1 -13 -12 2 6 -22 -21 -2 -15 -16 -7 -7 -13 0 -15 -12 -19 -11 -15 -13 0 -4 0 3 5 11 4 7 5 4 5 14 4 20 7 6 3 13
4486A3j2POj0rJ3lpPj3KmM%kMmJl%KKmJoOPlJ0kljrJ0mRPpJKqnJ1MnJ%J2op%j0
$$ 13 1 8 14 4 -5 8 5 -2 5 -8 -6 -10 -6 -6 -8 -4 -8 -7 -10 -10 -8 -6 -10 -9 -15 -9 -2 -5 5 3 0 -1 -10 0 -4 5 12 5 6 8 0 -5 6 10 5 6 6 18 12 5 5 -5
4538eLOKqp%LoJpQljPk0J5NnnJ8plJ4nLpJ0kmJ0rOMjpQj0KPj0J0kpLlJ2j2jkm
$$ -5 -2 4 6 -2 -9 -9 -6 -12 -11 -18 -10 -13 -14 -7 -27 -12 -7 -12 -17 1 -6 -9 5 0 3 -4 6 4 0 10 1 7 11 10 3 11 1 3 10 0 10 8 1 4 1 13 1 0 -2 -6
4588fJNqpMJljlnnK2Mj8J3lJ%lJ4oLJ6qj0RjlOkkJ2J2k6JLrMP%ml%nqkJ2JroJ1
$$ -6 -5 0 -8 -15 -11 -10 -13 -14 -17 -22 -27 -5 -1 -19 -6 -9 -8 -8 -11 3 -3 0 16 8 -2 7 6 3 9 7 5 17 29 3 4 7 -2 2 9 9 5 2 2 -3 -11 -13 -1 0 -9 -15 -4
4639dj4J6kpmjP%jj1KLmPJ7j8lRJnJNLJ1QpjJkjlkOmJ6j4%j0Mj4MMjLojmmP%O
$$ -4 -18 -2 -4 -11 -15 -16 -9 -9 -10 -21 -19 -16 -20 -13 4 -14 -17 -8 -7 -12 -11 -6 -3 8 16 9 8 9 7 6 3 1 7 3 19 5 5 -5 -1 -15 -11 -7 -8 -5 -11 -12 -16 -20 -13 -13 -7
4690goLNqqJ3%pJ0okNLMLoOj3J7Rj9J1Qj3MqJ1qQJ0j3pJ0lnOj7OjLj3J2pj4RJ1
$$ -7 -13 -10 -5 -13 -21 -8 -8 -15 -5 -11 -13 -8 -5 -1 2 -4 2 -11 6 15 -4 7 15 2 6 -2 9 1 9 19 6 -1 9 6 1 7 -10 -4 -5 -2 -15 -3 -10 -24 -15 -4
4736dj7LPJj8J8J0j0k%JQ%Oj9J4Qj2QJ1oqK0nj9RPj3PPqj0K6oj9J2J1k6KQKk0
$$ -4 -21 -18 -11 -10 -28 -10 0 -10 -12 -12 -11 -3 -3 3 -16 -2 6 -6 2 13 7 -1 19 14 -5 4 11 -2 5 12 4 -6 20 14 -5 7 18 -8 -6 2 4 -16
4778a6J3Rk5J9%j9jJ8lj2J7mj6J1Mj0LK0j2KJ3r%J0JoLK4l0mJ7j4j0RRj5J1Pk2
$$ -16 -3 6 -19 0 0 -19 -20 -2 -5 -17 0 -4 -20 -9 -5 -15 -12 8 -4 -2 11 2 2 12 13 7 10 34 4 0 17 3 -7 2 11 -4 7 14 -8
4817hNJ5k4KJ3rj1J5J8j6j6K0j2j1K0rrRMk0J5J2k2J8Qj2j2J9J5k2J8Kj4NK0j6
$$ -8 -3 12 -12 -10 3 -6 -17 -2 16 0 -16 4 -8 -19 1 -8 -17 -8 -4 -24 -9 3 -19 -1 7 -5 -17 2 17 -5 13 15 1 6 26 10
4853A0j0K0pqRKj2PL0m2j2K9k0j5QL0m3J2Pkj6K3jl2K7Rl1J5K4j9j4K9Kk8K7J6
$$ 10 0 20 13 5 14 16 4 11 41 -1 -13 16 -4 -19 -11 19 -24 -12 -5 -7 -23 0 -1 -33 -6 3 -28 -13 11 -8 -22 7 9 -19 8 24
4889B4k4mL3m2rM3j5j7K2J8l9J5M0m4qL4j0m0L6J8l7PK6l1j3L0rm2M1%m1J1L8
$$ 24 0 -4 29 -13 -22 21 6 -11 11 29 -10 5 45 1 -7 27 17 -23 13 31 -6 1 27 -4 -17 13 4 -38 3 3 -38 -27 11
4922A1m0pM8k6k1L5Mj9%J7k3lM6j1k2K6J2l7RK3k1qK4j0j1J5J2k1PJ0k3oK3j6
$$ 11 -29 -36 12 -14 -35 0 4 -15 -15 2 -21 -24 22 11 -11 15 27 -10 -1 22 1 -7 17 7 -4 11 23 2 9 19 -4 -10 13 -3
4956coJ8%k8J7K2k5mLJj9K0lj1J2Ok8J9J1j6OK4k2j5K7Jj1J1Nj3NK1k1pJ8Kj8
$$ -3 -9 9 9 -19 -2 20 -5 -9 -6 -5 -24 -4 -7 -18 -6 0 -28 -9 2 -14 -8 16 -6 -21 6 7 -4 7 12 -1 4 25 4 -3 15 17 -1
4993aK1Ll2K2J4j9nRj0k4RK4l2J9Ok2NK3ol7K9kk1J1L1k3mJ9lk4K2Nl3J3K6j7
$$ -1 20 23 -9 13 27 8 3 12 2 -22 -13 11 -21 -2 4 -18 -13 10 4 -33 -4 -6 -27 -16 15 -8 -12 7 4 -20 2 7 -26 -13 13 -4
5029dk0M5pk4K1Lk9J8K5k5lK5nj1J4J0l0JJ8k3j4L1Lk9RJ2k2jL0m0mK6ll7L7M
$$ -4 -24 21 14 -10 11 14 -15 3 28 3 0 25 20 9 23 33 3 4 22 -1 -15 16 19 -10 -1 11 -11 -12 18 -22 -26 0 -3 -40 -3 1
5065Aj1RJ4k1j3K6Ol2J6J8k3nL1j7oK9ok2J6J4l2J2J7j1JJ4qpJ8j0l0J1Qk5OK7
$$ 1 -10 -1 13 -8 -21 5 11 -21 -5 13 -10 -15 16 -1 -7 22 16 -6 10 24 -8 4 21 10 11 25 17 10 28 18 -12 -1 7 -18 -12 15
5101A5rmJ2j1j4J2j0j4RJ0pj5J7RpNJ5k2OPj1J0NRqJ4j6%J2Kk3%J5k1J1J6j2%
$$ 15 6 2 14 3 -11 1 -9 -23 -14 -4 -11 -26 -9 0 -7 -2 13 -9 -3 4 -7 3 8 17 9 23 7 7 19 21 -2 -2 13 -8 3 19 7 7
5139GKOj7KJ7j9jK0j6j5J0J8k8PJ9j3j8K2k0mK1nj2PJ4j4MK7k1j6K4Rk4K3J9k6
$$ 7 9 15 -2 0 17 -2 -3 17 1 -14 -4 14 -14 -7 12 -1 -19 3 -17 -21 0 -5 -17 -10 4 -10 -6 21 0 -16 8 17 -7 16 35 9
5175ILK2k1j4K2J4m1LL2l1LK2pk1J8Kk7PJ3k1pM5j9k2K9j0j8OK2l6QK5k4nK8R
$$ 9 12 34 13 -1 21 35 -6 -3 29 -2 1 23 16 -5 13 15 -12 -5 8 -13 -20 25 6 -16 13 3 -15 -9 13 -23 -15 10 -14 -19 9 18
5211A8l6J9J9k9OJ8mj3L4k3j6K4J2k2JJ3oj5K2Nj7J2Kj3%Jj4j1J7j8kK3ql1K5
$$ 18 -18 1 20 -9 -3 15 11 -2 32 9 -7 17 29 7 8 21 15 0 22 27 10 22 24 11 11 12 -2 -13 4 -14 -16 7 -1 -32 -7
5246gJ8j8pJ4oj1K1rj4K4mj1J5OppPmj1J8Lj6J9Qj4JMj3LJ7j0qK1Kk3RJ5k9LJ9
$$ -7 11 -7 -14 0 -6 -17 4 -5 -19 5 1 -10 5 11 4 -3 4 0 -11 7 10 -6 13 21 7 8 12 -1 2 19 9 1 22 24 1 10 25 -4 -1 18
5286A8k1j7K0Nk6K4Lk9OK1j0l0L7oj1OJ5j8J1K1j5qJ4lj5K5J1l0J1J9k6oM0j1
$$ 18 -3 -20 0 5 -21 3 6 -23 -17 4 -6 -36 1 -5 -16 -10 5 -13 -2 19 4 -4 10 7 -8 17 28 -2 9 28 2 -4 36 25
5320B5l1L1ll5K1J6k1mL0k9j1K7Kl4J3K0l5KL7k6j1L0j7k2K0Ok7J3K8l5kL9ol0
$$ 25 -6 25 22 -13 8 24 3 -1 29 0 -11 16 18 -16 -3 17 -18 -16 21 -5 -16 14 -3 -25 -5 1 -26 -13 15 -20 -22 17 11 -19
5354a9L0Rk9K1J2j4rK0lj7K0Qk7KL0k5j0L0k5j5K5Kk6J1J1k7NJ6j5pJ4Ok1PJm
$$ -19 11 20 -9 12 24 10 1 21 18 1 21 29 2 4 34 9 -1 29 4 -11 14 16 -10 1 12 -15 -10 6 -9 -16 -2 4 -17 -10 -9 -13
5390a3lK2j8jL0k9kPK4k7J3J3j9j4L0kj4K1j0oJ8lk1J6J4k6KJ3Lj2OPj1j0Rrk
$$ -13 -16 6 -12 -13 17 -12 -14 -7 17 -10 3 16 -3 -17 13 11 -3 18 8 2 20 17 -4 12 26 0 2 15 18 6 12 19 8 -2 7 -2 -4
5427dJ0k2jK3ok8K5Qj3LJ5k7nK1KrJ1Pk5K4J0j8nK9j5k0K5J0k3RJ8k8KK3j8k1
$$ -4 6 -16 -17 6 0 -28 -3 5 -8 -5 10 -17 -22 -1 1 -8 3 10 -15 9 19 1 -4 25 10 -10 15 25 2 11 29 1 3 26 8 -13
5463a3L7j1k6L1Nk3KK3j9l3M2jl8RK9l9RL2j5k6K7mk3J5Oj4JL3j8j9M0Ll7J7K4
$$ -13 24 13 -13 18 23 0 2 25 6 -27 15 14 -24 -15 14 -25 -16 16 1 -25 2 -2 -25 -10 -4 -18 -17 16 -2 -21 19 22 -15 2 26
5498B6m0J9K5k8j0K6Ol5K0J4k6NK0j6j5K6Ol6K5Qj7j2K3j8qJ0Jk0PJ9k0MJ5k6
$$ 26 -14 5 30 2 -8 18 24 -11 9 23 -3 2 22 6 -9 17 23 -13 12 20 3 -9 14 -4 -12 -2 -1 -21 -14 5 -15 -11 4 -22
5532b2pK4Jl3L3J5k2LK4k5LK1Mj9J6Qk2J4MojRj5nJ0Nl2J8J8k7LJ3qMmroJ9mk6
$$ -22 -29 -5 -4 -37 -4 11 -11 -8 16 -9 -6 15 19 0 16 24 2 16 20 14 13 22 7 2 12 17 -15 3 21 -6 -3 10 2 6 2 -7 -13 6 2 -24
5572b4J6J2j3oJ4mLPpoQKk2K0J9k3MJ2pj9J6K0k6OJ4o%K2j4j8K1jl0J2J4j7NN
$$ -24 -8 4 -9 -15 -1 -5 -2 5 -2 -8 0 2 -20 0 19 -4 0 12 5 -14 2 22 -4 2 16 10 10 32 18 0 21 20 -10 2 16 -1 4 9
5610I%k3J2Lk7QJ8k1PNJl1M3Jk4K1J5k2j2K9j5k3L7J6l2jK9k2oK9%l5L2Ql8J5
$$ 9 9 -14 -2 1 -26 -18 0 -21 -14 -9 -8 -39 4 5 -19 2 17 -5 -17 12 -3 -26 11 27 -5 -6 23 1 -5 24 24 -11 21 29 -9 6
5646FK1j8j3L2j9j3QLk0qL6j1j1J5lj3NJk7PJ5nnJ7j0j2J2J2j8MRlLKJ5j3J3J3
$$ 6 27 9 -4 28 9 -4 4 7 -13 -21 15 4 -7 8 5 -8 -3 -2 -29 -22 -7 -12 -17 0 -10 -22 -10 2 -16 -12 -3 -6 -3 -1 14 1 14 27
5684B7j4%Oj3j1J8nj0J5J0j7POj2%%pqLKj1J4Rj0Ln%lNj5qJ9ooJ6poJ2J0k8KK0
$$ 27 13 13 19 6 -5 13 8 -2 13 23 6 13 19 7 7 7 0 -8 -5 -3 -14 0 9 -1 2 -3 -3 -6 -1 -16 -24 -5 -11 -17 -1 -8 -14 -2 8 -20 -18 2
5726BJj0J2Pk6K1J4j5jJ2j1k0K1J4j8J2J6j9rM%k7OJ5k5K3Lk2MK9k0k5K5mj1K
$$ 2 3 -7 5 12 -14 7 21 6 5 17 6 -14 7 21 3 15 31 12 3 7 7 -20 -14 1 -24 -1 2 -20 -16 13 -7 -32 -7 -11 -22 -20
5762b0K4j8j0L3j5j0J6Lk2PJ8k0lK7rj7L1J6l1QK0k7j0L2qj6K1Rk7MJ9j6j2J3
$$ -20 4 -14 -24 9 -6 -16 0 3 -19 -12 6 -14 -17 10 1 -16 15 31 0 8 28 1 -9 23 15 -1 20 29 2 6 25 9 -3 10
5796A0j5qJ9j1rJ3J5k6mJ9j2j8K3lj8J6J0j9J6J9j3k4L1%k2J3J6j5oK5j2PpJ0
$$ 10 -5 -13 6 -5 -14 -1 14 -12 -16 3 -9 -27 -4 -7 -25 -9 1 -18 -2 17 4 -20 11 11 -11 2 18 3 -3 22 10 17 10 20
5830B0j8J1j0j1MK9k4oJ8Ok1nJ7l1OPJlJ0k2J7Pj9j%Rk2OK2j1lJ0J%J2j4OPNk0
$$ 20 2 13 3 -8 -4 25 1 -5 13 19 -2 -7 10 -21 -15 -8 -7 -10 0 -22 -5 2 -17 -18 -18 -9 -31 -25 -3 -14 -17 -7 -6 -6 6 -8 -2 5 10 -10
5870a0J8K4k4mK2Lk9MJ7j8nNJpK1mk9J9J7l0oL0l0pK8ok3QJ7j5OJ9l1pL7k5j3
$$ -10 8 32 8 4 26 29 0 4 21 3 -2 3 4 -3 18 14 -15 4 21 -9 -15 15 -15 -22 6 0 -23 -15 2 -13 -7 12 -19 -26 11 -14 -27
5907b7L2Nl1J2K2j5j5K7J2l2J0J5j3RJ1k4JK0j3k1K8J2l2kK7k8nJ9jk1J4J5l2
$$ -27 5 10 -21 -9 13 -2 -17 10 22 -10 0 15 2 11 22 -2 -1 19 6 -15 13 25 -7 -9 18 -10 -15 4 3 -18 -4 11 -21
5940b1J1J1j5j2K0Lk2K2Nl0jL7rj3K1%k1NJ1j4kK3rj4L2k0OkK0j9KMj3%K1oj9
$$ -21 -10 1 -14 -26 -6 -3 -25 -3 2 -28 -29 8 -1 -14 7 7 -14 -9 2 -12 -14 9 0 -14 18 -2 4 2 22 3 5 9 -4 -4 17 11 -8
5977hJ2LpoJ6k1MjqJ0roPJ3mj2kK1j0j7J7jnPNpRkrJ4LmlJ0mJKlKKPrj1NMoML
$$ -8 4 7 0 -6 10 -11 -7 -8 -16 -6 -15 -21 -14 -1 -5 -17 -19 2 -8 -25 -8 -9 -14 -7 -2 -9 0 -2 -11 3 6 2 -1 9 5 6 8 5 7 9 16 7 -4 1 5 -1 3 6
6025FoQPj2j3J6rj0MLj0J0J1k7PMmj3K1Lj3nK0k0J2J7qnJ7Kk5J2Qq%K0pj0J6j
$$ 6 0 8 15 3 -10 6 -3 -13 -9 -6 -16 -6 5 -22 -15 -11 -15 -28 -7 -4 -17 -22 -2 -22 -10 7 -1 -6 11 13 -12 0 8 0 0 20 13 3 19 18
6065A8j4PJ0j8j4K5j6j3K1lj2PPj7%J1Nk2NJ4j5J0Kj3jJ2Rl1K3Pj6QK1onJ0pj7
$$ 18 4 11 21 3 -11 14 -2 -15 6 3 -9 -2 5 -12 -12 -1 4 -18 -13 1 -14 -4 -2 -15 -16 -4 5 -26 -3 4 -12 -4 17 11 6 16 9 -8
6103hK5Kj8%J2j1KK6j9kJ3rpmPmpLkjlKnj0J5rjK0j6nJ9JpnPp%KJLO%rK0j1qQ
$$ -8 17 19 1 1 13 2 4 30 11 9 22 13 6 2 9 5 -2 1 -1 -2 -5 -3 -8 -18 -3 -12 -13 7 -9 -14 5 6 -1 -6 1 -6 -6 -4 -3 0 6 6 -3 17 6 -2 6
6150FQj4Pj%KNqjK%KOpj1Ol%MmnqmJ6k6RLJ1j0Kjj4J1Qj5K3nnNjJ1j1J8nrK2j1
$$ 6 14 0 7 6 6 8 13 5 4 6 6 8 14 7 -4 2 -1 -1 3 -1 -6 -14 -18 -2 -28 -19 -16 -5 -15 -13 -14 -28 -17 -9 -24 -1 -6 -11 -6 -7 4 -7 11 6 -3 19 8
6197HKqNJ0k0RNj0ORj0jJ3rj5J9Qk4NQj0j4K3j6pROk1J1KmnJ9qj8J9Nm%KljQQ
$$ 8 10 2 7 17 -3 6 11 1 7 16 6 5 18 9 -6 13 21 -3 2 10 0 -14 9 -7 -14 -5 1 -20 -9 -7 -11 -16 3 -5 -23 -4 1 -3 -3 -1 -4 -5 3 11
6241A1qJ4mj9J7J4j9pJ9omJ4nj0KLlo%nmkMKpJ6rj3J4j1qJ3mlJ3mj2J0NkQqOj5
$$ 11 3 17 13 -6 11 25 6 -1 18 12 8 22 17 7 9 12 9 3 3 -2 -6 -8 -4 -2 -9 7 -2 -15 -1 -12 -20 -7 -11 -14 -1 -5 -17 -7 -2 -4 4 -4 2 -13
6285a3J4J5lqJ6j1Qj1PoJj0MJ0oNLQj4%kj4O%Nj1LKj6J1oj0J0QPk4K0Nj0J5pj5
$$ -13 1 16 13 5 21 10 18 7 14 8 9 -1 3 13 7 12 15 23 9 9 7 -7 -1 -1 4 -7 -4 -2 -18 -7 -13 -23 -13 -5 2 -22 -2 3 -7 8 1 -14
6327a4%K2j1j6L6ok2QJ3rPJ8j3k4J2LnJ0Qj0j8L8j5j5K1nrmOj6NJ3oj7K1j2j5
$$ -14 -14 8 -3 -19 17 11 -11 -3 10 1 8 26 13 -11 1 4 -1 9 17 7 -11 27 12 -3 18 13 4 0 6 -10 -5 8 2 -15 6 -6 -21
6364b1NMj3j1L3pNQjknK5l1KJ9Nk0K1KoKKonRj9jK1lk1J7K0k7pK1J2l4J6nj2R
$$ -21 -16 -12 -25 -36 -3 -10 -5 3 2 0 -5 20 -11 -9 10 15 -5 16 18 12 14 16 10 5 14 -5 -6 15 12 -9 8 28 1 -6 15 27 -7 9 4 -8 1
6405ALrRLk3kJ6j3j0RJQmRQj4J2Kj2KQjRQj8%J3Kj5JJ1noNLrNj5PRk1LJ0nj7K0
$$ 1 4 -5 4 7 -16 -18 -2 -15 -25 -16 -15 -7 -11 -2 6 -8 4 6 -6 -4 4 3 12 20 2 2 15 17 2 3 14 9 3 8 11 2 7 -8 -1 8 -13 -10 0 -5 -22 -2
6451bj2%QlNmMoolJ7j9J6jj1mL3j4rJ9Jj8jK2j7NJ5rPQKj2Lkj0pK2nj5J0Pj3k
$$ -2 -14 -14 -6 -9 -4 -8 -4 -10 -16 -19 -2 -21 -5 -6 -17 -21 12 -2 -11 8 9 -9 -10 12 -5 0 15 6 13 21 23 11 14 12 2 -5 17 12 -3 7 14 1 -1
6494aMrrQpj2K6jl4K8J9l3pK5Ol2J7J6j8J3NqkJ4j4pK3Lk2J3NnJK1k0j3K2mj1
$$ -1 3 -6 -15 -7 -14 -26 0 -1 -35 -7 12 -21 -28 -3 3 -29 -12 4 -14 -1 4 -4 -6 8 -6 -13 10 13 -9 4 9 4 5 26 6 -7 15 11 0
6533@pK6j3rJ3Mk0J4jk2KJ1j4qJ1Rj4jJ9k2J0LpjLQj4K1J0j7MJ2%j4QkJ2j2Pj
$$ 0 -7 19 6 -3 10 14 -6 8 7 -15 -13 -2 -16 -24 -13 -4 -18 -19 0 -22 -12 -9 -16 -17 -14 -6 -20 1 11 -6 -2 10 10 -4 4 2 14 2 9 8
6573HJ0qnnK1j4oNjjLqKJ5jj3j3J3j4oJ6j4j0J2J2mJ1j7mrJ7moMOMpJ9j2PJ7j9
$$ 8 18 10 5 0 21 7 1 6 5 4 7 -1 1 16 15 2 -11 2 -12 -18 -2 -16 -26 -14 -2 -6 5 -12 -16 -25 -8 -12 -18 -14 -8 -4 -11 8 -4 3 20 1
6615AoJ5JoMJ7lk2K2lj4J3j2j3MQojNoj7K5k3jKK0k4KK9l1NK7j6j6J5krKJ4Jk4
$$ 1 -5 10 11 5 9 26 23 1 23 20 6 19 7 -6 -2 6 0 -1 4 -2 -19 6 -17 -18 -16 4 -20 -18 11 -20 -15 12 -4 -20 -5 -7 -16 -14 0 1 -23
6656b3M0lk5J9qoRjJj0K2Lj3QJ0k5J1Rj0j4K0j0rPNk0%J7k2nJ8mj3OomkK3Jj8
$$ -23 17 14 -11 8 0 -6 3 2 3 -7 15 18 5 13 23 -2 9 18 8 -6 14 4 -5 2 7 -13 -13 4 -18 -23 -5 -9 -22 -16 -22 -26 -28 -5 -4 -22
6696b2J7ljPjMJJ4j6mJ2LqKMpJ1nKj2J4jlkKrKJ2k0J5j2MonjJ5oj5J7j8Q%NkN
$$ -22 -5 -8 -9 -2 -3 1 2 16 0 -4 8 11 3 5 9 2 13 8 10 -2 12 11 8 6 8 -1 1 13 -7 8 -4 0 -6 -11 -12 3 -3 -18 -1 -19 -11 -11 -6 -8 -3
6741cj1KQkL%krJ6J0j1J6j1LQmj3K0j2loJ6j1JJ0j7MPj0lLOnjl%%%Rj6lJ7l3K0
$$ -3 -14 -12 -4 -6 -3 -3 -5 -14 2 12 1 17 6 9 17 13 0 20 8 5 -1 15 4 5 15 -2 2 9 -1 -4 -1 5 0 -1 -4 -4 -4 -4 5 -11 -14 3 -30 -10
6785a0J0npmJ0j6J5MqNJ1j2jK2kj9RJ0nPJ0lj3KMj1PnmNLppNKj0LMo%jQrMloJ
$$ -10 0 -5 -12 -16 -6 -22 -7 -3 -11 -6 5 -7 -8 14 12 -7 2 12 7 14 24 21 8 10 14 3 10 5 1 6 9 2 -5 0 2 -8 -5 -1 -7 -7 -8 0 -9 -5 -8 -14 -13
6832a3PmkJ4pjMplLJ1nkJ6mKKMrPNj5J2kj2QJ0j8NMllj1J4j6MlJ2k1QlqJLoJ6
$$ -13 -6 -10 -12 2 -5 -6 -2 -9 -12 -9 2 -3 -5 11 7 9 11 15 6 13 18 3 15 13 1 9 19 1 6 10 7 4 -7 7 -9 -5 -8 4 -17 -9 -12 -20 -19 -16 -22 -6
6878fOkkMpKlJMLlNJ3k1OJ2pLlloQRpmJ8kj4RJj2rPPj3J2J0k0Pqjk5L5j5j6J9
$$ -6 0 -2 -4 0 -7 -5 -8 -7 -3 0 -3 2 15 -6 0 12 5 8 5 2 -4 4 13 6 2 20 18 4 13 14 2 -7 0 7 -6 6 16 -4 3 -5 -6 -31 4 -11 -27 -8
6924h%j1QJ4j6PK%j2J2J2j6J6J0j2MK3k3kJ6rj7KK1j7nK5j4j0Qnk1J9Kj7QJ3j3
$$ -8 -8 -19 -11 3 -13 -6 -4 -4 -16 -4 8 -8 8 18 6 10 33 10 8 24 15 -2 0 21 4 -1 24 10 0 8 3 -18 1 3 -14 -6 7 -6
6962fj5K3j3KOJk0J2J2qrRjk3J7QqOJ4j9QJ5Jj7J9Lj6JJ4r%J5Jl0J9Prj5J3oJ
$$ -6 -21 2 -11 -9 -3 -2 -22 -10 2 -6 -15 -6 -7 -30 -13 -5 -13 -7 7 -12 -4 11 12 -5 14 17 1 2 16 7 7 22 23 -7 12 19 10 -5 8 2 3
7003Cj5Nj3K1Lj5PLJj1Mr%J2pjJ0Mj5J1OllOj8kQJ4%kRk0J4Lj0JJ4pj3K9j5Kp
$$ 3 -12 -7 -20 1 4 -11 -4 -1 0 -11 -7 -16 -16 -4 -11 -12 -2 2 -13 -2 4 1 -2 4 -14 -16 -8 6 6 4 13 -7 7 10 0 1 15 8 -5 24 9 11 4
7046DkJ1j0jnqNLoPLj4lJ7j7rK3j2j4J4K3j5KJ0rJjLpJ1kmJL0k6MJ1j6jPKqKJ5
$$ 4 2 13 3 2 -3 -11 -6 -3 -9 -2 1 -13 -16 1 -16 -25 -2 -14 -28 -14 9 -6 -4 6 -3 -2 -3 0 -7 4 2 -2 -1 29 3 7 18 2 1 8 10 2 4 19
7090A9pj1K0k1j4RJ6k9QJ1j9OJ1Pk4QOk4LRj1RRlj5J9%kQMj0%J0lLPJrNPoj3J6
$$ 19 12 1 21 0 -14 -5 11 -18 -10 1 -18 -12 -1 6 -18 -10 -4 -28 -25 -16 -27 -18 -9 -12 -27 -8 -8 -10 -2 2 -8 -8 2 -1 2 9 10 1 6 13 7 -6 10
7133A0Jj4PJ1j2KJ2j7NmppRPk2J2%jqJ2%k0OLqJ0plRJ1r%%J1j1MKNlOmPN%joo
$$ 10 11 -3 4 15 3 5 17 0 5 1 -6 -13 -4 3 -19 -7 -7 -8 -16 -4 -4 -24 -18 -15 -23 -13 -20 -23 -14 -3 -12 -12 -12 -1 -12 -8 -6 -1 -4 2 -2 5 10 10 9 3 -3
7180cK2j7OKljj2K3j4mlOj2qPOj5JJ7j7MojL%M%QJkOJKj0nK2j6%K4j1Kkj0LNP
$$ -3 19 2 8 10 7 6 -6 17 3 -1 -4 2 -10 -18 -11 -5 -20 -19 -2 -19 -15 -21 -22 -19 -19 -15 -15 -7 -6 -8 -2 -1 1 -9 -14 8 -8 -8 16 5 7 5 -5 -2 3 10
7226A0j2jJ9j6J1Mr%kPj2Nljj9J1Nj3QLj5mKJ7jLj0LrJ2MNqLLPnJRk%mJqJ3Om
$$ 10 -2 -3 16 0 11 15 6 6 4 11 -1 4 1 0 -19 -8 -3 -16 -8 -5 -20 -24 -22 -5 -6 -3 -13 -10 -19 -7 -3 2 -6 -3 0 7 2 3 12 10 10 6 7 -1 12 18 14
7273A4qmQlOqqPJ1j0JRj9Mn%p%jRqjOj5NJ5pkNJLj1QkNMpjJ6j0NKjQlj2J5j1M
$$ 14 6 2 10 7 13 5 -3 4 15 5 6 15 -4 0 -5 -5 -12 -12 -13 -4 -12 -13 -7 -22 -17 -2 -9 -11 -6 -5 -2 -13 -5 -7 -2 2 -5 -6 10 0 5 7 6 14 11 -1 14 3 7
7322GNkoqMLkMj7J0JJj0j1J4j0LJMLonQ%Lj0pJ9n%kJ1oJMJ0OrJ1j0J0j7J2jJ2
$$ 7 12 10 4 -4 0 3 1 5 -12 -2 -1 0 -10 -21 -7 -17 -14 -13 -9 -6 -12 -17 -9 -9 -6 -16 -23 -4 -9 -9 -11 0 -6 -5 -1 9 15 6 17 7 17 0 12 11 23
7367B3mj0MOj3OjrMqljJ1k0Qjjj3J5Nj5PPMj0J1jj1J0jj1J1qQMQNj6kJ0moJ0P
$$ 23 19 9 13 19 6 12 11 2 6 -2 -5 -6 5 -15 -7 -8 -9 -22 -7 -2 -17 -10 -3 1 -9 2 1 -10 0 -1 -12 -1 -9 -1 3 11 16 0 -2 8 4 -2 8 15
7411A5lNJj1%J1j6J0mklN%ljLk4MRkj3J4oj2RJ3j0JjkNQJ%jQj0NOj0J1JJpQlj
$$ 15 12 17 18 7 7 18 2 12 8 6 3 8 8 5 4 7 -17 -13 -4 -6 -19 -5 -11 -23 -14 -1 -11 -10 -11 -13 -8 0 1 1 0 8 -2 3 9 -1 10 11 12 5 13 10 9
7458IPoOj0Oj1lLRL%Mj5j2J1nmJ0j1PkrkjRqMPkrJ3oJ0J2qj6J0J9k2NK0pj0J2
$$ 9 16 10 16 6 12 1 -2 1 10 13 13 17 2 -10 1 -4 -8 2 -9 -2 -4 -13 -15 -16 -7 -15 -11 -4 -6 -15 -2 -8 2 14 6 -10 0 19 -3 2 22 15 5 17
7502A7J0qQKj0j0J1j1nJ7j3MopKoJ5nj7J3Pk3J2J3l3OK0j0j2J4kj1RJ2j9J2J0
$$ 17 27 19 27 29 19 9 20 9 4 21 8 12 6 -1 1 -5 10 5 -12 1 8 -15 -3 10 -23 -17 3 -7 -19 -5 -7 -18 -9 3 -16 -4 6
7539Fj3rK5Qj9QJ2j2oK1qqJ2%rJ3%j1rLjoJ1rj0NJ2j7lRoj0OKj0J5LrJ4npmJ8
$$ 6 -7 -16 9 17 -2 6 18 6 0 21 13 5 17 17 8 21 21 10 1 4 3 -3 8 -1 -11 -6 6 -11 -14 -5 -11 -21 -15 -13 -23 -8 -5 -14 0 -5 -12 -16 2
7582Bj1J7kKj5RJ8j8jJJ4j2LRJj4J4j2RQqn%JokJ1j7KjNrNqpJ2%oJ2jj0mNKoR
$$ 2 -9 8 6 8 -7 2 20 2 1 2 16 4 7 16 17 3 17 5 14 22 14 9 9 10 4 2 13 -4 -2 -3 2 -7 -2 -10 -17 -5 -5 -11 1 0 -10 -14 -9 -7 -13 -4
7628dRk0J4OoQOLj4OQj9J1PpLKqqK2j4jMnrJJ0opK1j0k0J1J0k0MJ0j0oJ8jk1J1
$$ -4 5 -15 -1 5 -1 7 13 16 2 8 16 -3 8 15 8 11 13 5 -3 19 5 4 8 3 -6 -5 5 -1 -8 13 3 -17 -6 4 -16 -12 -2 -12 -18 0 -1 -22 -11
7671a1J5k5OK2j3j8K5qKJ3%j0JJ7j3%J0Lj4K3j4mjJ7j0nJ2j5j6J0Rk6OK1pj1O
$$ -11 4 -21 -15 7 -6 -24 1 -7 -5 8 8 -2 -1 16 3 3 13 16 2 25 11 7 6 23 13 8 20 5 -11 -1 8 -18 -12 9 2 -9 -3
7708cMj0NJj1OQj2j4J1J6pnJ5j8QRoLMJkOkjQLlJPlj4J5lj4QqjpJ0rNNjj1LKj6
$$ -3 1 -9 -4 -3 -14 -8 0 -12 -26 -15 1 -6 -11 4 -14 -6 3 -3 0 4 5 3 9 7 6 14 17 14 15 22 19 5 20 17 3 11 3 2 -5 5 -4 1 6 5 -6 -3 -1 -17
7756a7OJqKJ6j1lKNpJ2Qj4QJ4k0lJ2qlROkj1K4j3ljNj6MK1j2J1Pk1lJ0Lj9kJ8
$$ -17 -11 -10 -18 -16 0 -11 -14 -12 -7 -14 -2 6 -8 0 14 -6 -9 3 -5 -8 1 7 5 -6 18 5 2 1 6 -10 -6 15 3 14 21 0 -3 7 10 -9 -11 7
7798Gj8%K3k2pJ5jj9PRk0jK3J0k5K6qpoK5j7kK5j9oJ3PrJ9mj4MJ7k4j5J6J4k0
$$ 7 -11 -11 12 -10 -17 -2 -3 -22 -15 -6 -26 -27 -4 6 -19 7 -1 -8 -14 11 -6 -8 17 -2 -8 5 12 3 22 18 4 8 25 1 -14 2 16 -4
7836dK3Ok5MJOj1%J0k3RJ3k4RRok1J2Rk0J0jJ1j2K2jk5K4Lj6J3J2j9ONkrJ8Lj0
$$ -4 19 25 0 4 5 11 0 0 10 -13 -4 9 -15 -6 3 -3 -24 -12 -3 -23 -13 -14 -3 -15 7 6 -19 5 8 -8 5 17 -2 4 9 7 -2 16 19 9
7876IJ0Qk9jJ0%nQNk5J7jpPkj7JQqLoJ3j4J0pnMj%JJ8qJJRj3P%njJ8j1KRMjoR
$$ 9 19 27 -2 -3 7 7 2 10 15 -10 7 6 -1 6 4 -13 -12 -4 -12 -9 -15 -2 -16 -6 -13 -18 -14 -15 -15 -14 4 -4 -3 -2 7 -6 1 1 -4 -5 13 2 4 13 17 16 10 19
7924A9pJRk0kJ1plJ5Ql1%J2j8oJ3jj5K0Lk2NJ5rlPrqJ3NoJK2j5jK0j0j5K2nj3
$$ 19 12 13 22 2 0 11 4 1 16 24 -7 -7 5 -13 -19 -6 -7 -22 -2 1 -21 -16 -1 -10 -13 -6 -15 -23 -10 -5 -11 -10 12 -3 -4 16 6 -9 13 8 -5
7965eJ4J7k1oK5j4qJ5kpLQnj1PoqJ0Nl6K5J4l0oK0lj8K7pqQKj5nK7j5NJ4qkOK0
$$ -5 9 26 5 -1 24 10 2 17 15 8 11 19 14 3 10 4 -4 6 11 -25 0 14 -16 -22 -2 -5 -23 4 -3 -11 -3 -1 -16 -21 6 -9 -4 10 2 0 6 26
8007B6j4j6K1mj1K1Jj6OLj4nJ3Jj4K0j3mLRj4LnNrMj%J6k2KMRj2j0J4j4J2mQj0
$$ 26 12 -4 17 13 2 23 24 8 14 17 3 -2 11 12 -2 18 5 1 4 13 -1 2 -3 2 -7 -3 -4 -4 12 -10 -8 -4 5 -7 -17 -3 -17 -5 -9 -1 -11
8048a1J1MmjJ0nQj4J7pMJ5k6J7pJ0lnNj5J8j7oRJ5k3MLj0JOmklmJLmNlL%j0J1
$$ -11 0 4 0 -1 9 4 12 -2 15 8 12 27 1 18 11 21 18 13 18 3 21 4 -2 7 22 -1 3 6 -4 -3 3 -1 -3 -6 -10 -9 -6 -10 -5 -8 -5 -5 -15 -4
8092dPj1QNkjJ3kj3J2jj1MJ1pJJ6omQrJLjm%Rj7rkMjNq%KrJ0j0J1q%MMj1kK3p
$$ -4 3 -8 0 5 3 2 15 13 0 12 11 0 4 15 8 9 25 19 15 23 14 15 18 17 13 13 22 5 -4 -6 -2 -3 2 -6 -6 -4 -13 -3 -13 -2 -10 -10 -6 -2 -13 -15 8 1
8140AmJ0NlKMlOJpj3J5JpLKoNNj1NJ2j1j0L%j0LJ2j3kPjlk%j0PkPj1lQNqMjLO
$$ 1 -3 7 12 9 11 15 12 18 19 12 -1 14 15 8 11 13 7 12 17 6 11 23 12 2 5 5 -5 -2 10 -3 -5 2 1 -2 -4 -4 -14 -7 -9 -2 -13 -16 -8 -3 -11 -7 -8 -5 1
8189Aj0J9
$$ 1 -9 10
8191A0
##END NTUPLES=NMR FID
##END=
