##TITLE=1H_LY-3DixiHYD
 CD3CN,8 sc, 
 5.03.2021
##JCAMPDX= 6.0         $$ Bruker NMR JCAMP-DX V2.0
##DATA TYPE= NMR FID
##DATA CLASS= NTUPLES
##ORIGIN= UXNMR, Bruker Analytische Messtechnik GmbH
##OWNER= root
$$ XWIN-NMR		Version 3.5
$$ Fri Mar  5 10:04:32 2021 Russian Standard Time (UT+4h)  she@DPX200
##.OBSERVE FREQUENCY= 200.1315066352
##.OBSERVE NUCLEUS= ^1H
##.DELAY= (6, 6)
##.ACQUISITION MODE= SIMULTANEOUS
##.ACQUISITION SCHEME= undefined
##.AVERAGES= 8
##.DIGITISER RES= 18
##SPECTROMETER/DATA SYSTEM= spect
##.PULSE SEQUENCE= zg30
##.SOLVENT NAME= CD3CN
##.SHIFT REFERENCE= (INTERNAL, CD3CN, 0, 15.7039)
##AUDIT TRAIL= $$ (NUMBER, WHEN, WHO, WHERE, WHAT)
$$ ##TITLE= Audit trail, XWIN-NMR		Version 3.5
$$ ##JCAMPDX= 5.01
$$ ##ORIGIN= Bruker BioSpin GmbH
$$ ##OWNER= she
$$ F:/spectra/data/she/nmr/H-F/1/audita.txt
$$ ##AUDIT TRAIL=  $$ (NUMBER, WHEN, WHO, WHERE, WHAT)
(   1,<2021-03-05 10:03:16.85 +0400>,<she>,<DPX200>,
      <created by zg, POWCHK disabled, PULCHK disabled
       configuration hash MD5:
       00 E9 B6 7A A2 85 ED C7 34 08 36 98 17 FE 4E 26
       data hash MD5: 16K
       00 25 A4 CD 60 B2 12 A3 34 31 C7 24 C4 76 58 7C>)
$$ ##END=
$$ 
$$ hash MD5
$$ A3 1E 2D D6 B6 57 29 6D FE 13 86 A5 66 69 F8 D9
##$RELAX= 
##$RELAX= 
##$RELAX= 
##$RELAX= 
##$RELAX= 
##$RELAX= 
$$ Bruker specific parameters
$$ --------------------------
##$DU= <F:/spectra>
##$EXPNO= 1
##$NAME= <H-F>
##$PROCNO= 1
##$TYPE= <nmr>
##$USER= <she>
##$AMP= (0..31)
100 100 100 100 100 100 100 100 100 100 100 100 100 100 100 100 100 100 
100 100 100 100 100 100 100 100 100 100 100 100 100 100 
##$AQSEQ= 0
##$AQ_mod= 1
##$AUNM= <au_zg>
##$AUTOPOS= <>
##$BF1= 200.13
##$BF2= 200.13
##$BF3= 200.13
##$BF4= 200.13
##$BF5= 200.13
##$BF6= 200.13
##$BF7= 200.13
##$BF8= 200.13
##$BYTORDA= 1
##$CFDGTYP= 0
##$CFRGTYP= 5
##$CHEMSTR= <none>
##$CNST= (0..31)
1 1 145 1 1 1 1 1 1 1 1 1 1 1 1 1 1 1 1 1 1 1 1 1 1 1 1 1 1 1 1 1 
##$CPDPRG= <>
##$CPDPRG1= <>
##$CPDPRG2= <>
##$CPDPRG3= <>
##$CPDPRG4= <mlev>
##$CPDPRG5= <mlev>
##$CPDPRG6= <mlev>
##$CPDPRG7= <mlev>
##$CPDPRG8= <mlev>
##$CPDPRGB= <>
##$CPDPRGT= <>
##$D= (0..31)
0 1.2 0 0 0 0 0 0 0 0.06 0 0.03 0 0 0 0 0.0002 0 0 0 0 0 0 0 0 0 0 0 0 
0 0 0 
##$DATE= 1614924196
##$DBL= (0..7)
120 120 120 120 120 120 120 120 
##$DBP= (0..7)
150 150 150 150 150 150 150 150 
##$DBP07= 0
##$DBPNAM0= <>
##$DBPNAM1= <>
##$DBPNAM2= <>
##$DBPNAM3= <>
##$DBPNAM4= <>
##$DBPNAM5= <>
##$DBPNAM6= <>
##$DBPNAM7= <>
##$DBPOAL= (0..7)
0.5 0.5 0.5 0.5 0.5 0.5 0.5 0.5 
##$DBPOFFS= (0..7)
0 0 0 0 0 0 0 0 
##$DE= 6
##$DECBNUC= <off>
##$DECIM= 32
##$DECNUC= <off>
##$DECSTAT= 4
##$DIGMOD= 1
##$DIGTYP= 9
##$DL= (0..7)
0 120 120 120 120 120 120 120 
##$DP= (0..7)
150 150 150 150 150 150 150 150 
##$DP07= 0
##$DPNAME0= <>
##$DPNAME1= <>
##$DPNAME2= <>
##$DPNAME3= <>
##$DPNAME4= <>
##$DPNAME5= <>
##$DPNAME6= <>
##$DPNAME7= <>
##$DPOAL= (0..7)
0.5 0.5 0.5 0.5 0.5 0.5 0.5 0.5 
##$DPOFFS= (0..7)
0 0 0 0 0 0 0 0 
##$DQDMODE= 0
##$DR= 18
##$DS= 0
##$DSLIST= <SSSSSSSSSSSSSSS>
$$ [...]
##$SUBNAM2= <"">
##$SUBNAM3= <"">
##$SUBNAM4= <"">
##$SUBNAM5= <"">
##$SUBNAM6= <"">
##$SUBNAM7= <"">
##$SUBNAM8= <"">
##$SUBNAM9= <"">
##$SW= 16.9725356469052
##$SWIBOX= (0..15)
0 0 2 0 0 0 0 0 0 0 0 0 0 0 0 0 
##$SW_h= 3396.73913043478
##$TD= 16384
##$TD0= 1
##$TE= 0
##$TE2= 300
##$TE3= 300
##$TEG= 300
##$TL= (0..7)
0 120 120 120 120 120 120 120 
##$TP= (0..7)
150 150 150 150 150 150 150 150 
##$TP07= 0
##$TPNAME0= <>
##$TPNAME1= <>
##$TPNAME2= <>
##$TPNAME3= <>
##$TPNAME4= <>
##$TPNAME5= <>
##$TPNAME6= <>
##$TPNAME7= <>
##$TPOAL= (0..7)
0.5 0.5 0.5 0.5 0.5 0.5 0.5 0.5 
##$TPOFFS= (0..7)
0 0 0 0 0 0 0 0 
##$TUNHIN= 0
##$TUNHOUT= 0
##$TUNXOUT= 0
##$USERA1= <user>
##$USERA2= <user>
##$USERA3= <user>
##$USERA4= <user>
##$USERA5= <user>
##$V9= 5
##$VALIST= <valist>
##$VCLIST= <CCCCCCCCCCCCCCC>
##$VD= 0
##$VDLIST= <DDDDDDDDDDDDDDD>
##$VPLIST= <PPPPPPPPPPPPPPP>
##$VTLIST= <TTTTTTTTTTTTTTT>
##$WBST= 1024
##$WBSW= 4
##$XGAIN= (0..3)
0 0 0 0 
##$XL= 0
##$YL= 0
##$YMAX_a= 237544
##$YMIN_a= -225905
##$ZGOPTNS= <>
##$ZL1= 120
##$ZL2= 120
##$ZL3= 120
##$ZL4= 120
##$ABSF1= 10
##$ABSF2= 0
##$ABSG= 5
##$ABSL= 3
##$ALPHA= 0
##$AQORDER= 0
##$ASSFAC= 0
##$ASSFACI= 0
##$ASSFACX= 0
##$ASSWID= 0
##$AUNMP= <proc_1d>
##$AZFE= 0.1
##$AZFW= 0.1
##$BCFW= 1
##$BC_mod= 2
##$BYTORDP= 1
##$COROFFS= 0
##$CY= 11.3945322036743
##$DATMOD= 1
##$DC= 2
##$DFILT= <>
##$DTYPP= 0
##$F1P= 15.9154993809931
##$F2P= -4.1035820241983
##$FCOR= 0.5
##$FTSIZE= 0
##$FT_mod= 4
##$GAMMA= 1
##$GB= 0.15
##$INTBC= 1
##$INTSCL= 1
##$ISEN= 128
##$LB= 0.24
##$LEV0= 0
##$LPBIN= 0
##$MAXI= 10000
##$MC2= 0
##$MEAN= 0
##$ME_mod= 0
##$MI= 1.114404
##$NCOEF= 0
##$NC_proc= 0
##$NLEV= 6
##$NOISF1= 3.799351
##$NOISF2= 2.8
##$NSP= 1
##$NTH_PI= 0
##$NZP= 0
##$OFFSET= 15.70392
##$PC= 1
##$PHC0= -11124.06
##$PHC1= 16.00094
##$PH_mod= 1
##$PKNL= yes
##$PPARMOD= 0
##$PSCAL= 0
##$PSIGN= 0
##$REVERSE= no
##$SF= 200.130013532006
##$SI= 16384
##$SIGF1= 3
##$SIGF2= 2
##$SINO= 400
##$SIOLD= 16384
##$SREGLST= <1H.CDCl3>
##$SSB= 0
##$STSI= 0
##$STSR= 0
##$SW_p= 3612.71676300578
##$SYMM= 0
##$S_DEV= 0
##$TDeff= 0
##$TDoff= 0
##$TI= <>
##$TILT= no
##$TM1= 0
##$TM2= 0
##$TOPLEV= 0
##$USERP1= <user>
##$USERP2= <user>
##$USERP3= <user>
##$USERP4= <user>
##$USERP5= <user>
##$WDW= 1
##$XDIM= 8192
##$YMAX_p= 0
##$YMIN_p= 0
$$ End of Bruker specific parameters
$$ ---------------------------------
##NTUPLES= NMR FID
##VAR_NAME=  TIME,          FID/REAL,        FID/IMAG
##SYMBOL=    X,             R,               I
##VAR_TYPE=  INDEPENDENT,   DEPENDENT,       DEPENDENT
##VAR_FORM=  AFFN,          ASDF,            ASDF
##VAR_DIM=   8192,          8192,            8192
##UNITS=     SECONDS,       ARBITRARY UNITS, ARBITRARY UNITS
##FACTOR=    0.0002944,     1,               1
##FIRST=     0,             0,               0
##LAST=      2.4114304,     0,               0
##MIN=       0,             -225905,         0
##MAX=       2.4114304,     237544,          0
$$ Real data points
##PAGE= N=1
##DATA TABLE= (X++(R..R)), XYDATA
0@%%%%%%%%%%%%jRj6J6j6K4l2L3m1N0n8P2q6R8j12J31j52J72j96K26k58K91l27
35a73L69m16M64n17N78o43P15p95Q78r68J070j182J305j436J581j743J920k117
53a110K335k581K857l172L533l953M450n045N776o695P894r531J1903j5660K2524
68A3525l8930J47623J15326m00755k3166K99642N7931k60780o9115K15221J03274
79A59796k01146r3328J63334P4009j31699k3135P6730j8430k3582M1935k8773
90d289k7285M7921K3194m1690m8729K2691R1008k6972j08409M8824J02230o5631
102A2863q0241N5556N2772k9094k3154m297P325K7608p123k5649Q655J859J2559
115I639J2055n7775j817R8270j7409j01438K5305P6508k2340n4185J1788M7618
$$ plain form
0 0 0 0 0 0 0 0 0 0 0 0 0 0 -1 8 -8 8 -8 16 -16 17 -24 26 -32 40 -46 52 -60 71 -81 91 -105 121 -137 154 -173
35 -173 196 -220 244 -273 305 -338 377 -418 460 -508 562 -620 685 -751 830 -913 1007 -1110
53 -1110 1225 -1356 1501 -1671 1862 -2091 2359 -2686 3090 -3605 4289 -5242 6661 -8999 13525
68 13525 -25405 122218 237544 -163211 -186377 113265 171196 -89584 -158699 56522 159796
79 159796 -41350 -134678 28656 102665 -29034 -52169 24561 6131 -17451 24484 -4289
90 -4289 -31574 16347 39541 -2149 -50878 -28187 62821 35849 -72560 -23736 78494 12863
102 12863 -67378 -11822 40950 11856 -11298 -15595 -8270 19338 12215 -13434 -4779 -2920 9639
115 9639 21694 -36081 -37898 60372 42963 -58475 -33170 43338 20998 -33187 -21399 26219
127B6219N176m9802j8233N2728J2971m8169J1529K4331l5286J1695L6228l6133
139f746j5919L8726K747k9933j5781K2403L9947k1787n2709L1304N0527m5272
151b493l9454M8758K1460l2695m294M913J394J4832j1555j1584J6639n431n325
164d835J1559j7313J452L7318j7234m2461K3591L0272k4055j2403J9919M824q070
177B564j2479k819K5143j008k6997J7760R962k9433J3847K5205k5361j0052K2670
190I002k540j7364J508J4391J1414j3523k2915J8864K3506l1985j3322M0003m23
203A6616l0617P370J1352k221o4q446M163J2951j4485r139J7898J187r201P860
217E224m996j2079J4856L818j7404J2278J4545j9661q152R775N146M237j0228
$$ plain form
127 26219 31395 -18407 -36640 16088 29059 -19110 -7581 16750 -18536 -6841 29387 -6746
139 -6746 -22665 16061 18808 -11125 -26906 -4503 35444 13657 -39052 -7748 42779 -2493
151 -2493 -41947 6811 28271 -4424 -8718 -3805 -2411 12421 866 -10718 5921 490 -4835
164 -4835 6724 -10589 -9137 28181 10947 -31514 -7923 22349 -1706 -14109 5810 10634 2564
177 2564 -9915 -12734 12409 11401 -15596 2164 12126 -17307 -3460 21745 -3616 -13668 9002
190 9002 6462 -10902 -9394 4997 16411 2888 -20027 -1163 22343 -9642 -22964 17039 16616
203 16616 -14001 -6631 4721 2500 2436 -6010 -1847 11104 -3381 -12520 5378 6565 -2636 5224
217 5224 228 -11851 3005 6823 -10581 1697 16242 -3419 -11571 -1796 3350 7587 -2641
230b641p155J9540k148k4923J4240K2063j8546j2719J4329O73p601N792L022j029
244B897k114p573O533O298j5326O192K0798j8337j6413K1565O577j6915j447J0555
258C290M513o738j1598N883J7173q367j3967J1602K910j2042P023M837q341P644
272C822M281j4757k309J0369M224j040q696j885J3089k549j6466R674J5804j3002
286E59r906R412M84j649O194l180n919K673J687J401l678m847J3451P374k3582
301i526p090K6815M126k4735r19K0433K508j7225q219J6061J3902j6925j3639
314a4433J6614O843j3866R1Q524p22j068l090m963L635O249q59j619k387j897
329b948M679k38o710N782O560q476l502N364j253J389N126n309o941M325O136
$$ plain form
230 -2641 -9796 9744 7596 -17327 -3087 18976 430 -12289 2040 2713 -4888 904 3926 2897
244 2897 783 -6790 -257 6041 -9285 -3093 17705 -632 -17045 4520 11097 -5818 -7265 3290
258 3290 7803 1065 -10533 -4650 12523 4156 -9811 1791 4701 -7341 -318 4519 -3822 3822
272 3822 8103 -6654 -8963 1406 5630 4590 -4106 -5991 7098 4549 -11917 -2243 13561 559
286 559 -9347 65 549 -1100 5094 1914 -4005 -1332 355 1756 -1922 -6769 6682 14056 -9526
301 -9526 -16616 10199 14325 -10410 -11329 9104 11612 -5613 -13832 2229 16131 -794 -14433
314 -14433 2181 9024 -4842 -4751 3773 3051 1983 -1107 -6070 -2435 3814 2955 1336 -1051 -2948
329 -2948 1731 1493 -5217 565 7125 -1351 -4853 511 -742 647 5773 464 -6477 -2152 3984
344C984j704o122J112J0733j251j7953J154K1148j768j9194L328J5753l184j3716
358g680P3J3444K985j3308l457J1781K31q171L849N144n509j960L446k168j676
373b976M454L580k388p209m98Q300K83p721K818O851m404n863K694L510J518n37
389B412m651k128M182L193j852k666J185L757k087q159K985J0530j834r068J172
404c029N956j390m414J328L706l08k895j90J594j307O78M502l336o632M870N911
420E044n734m721P003O113p211r057N390R844l399q378L750P080m662p110M306
435a742O571j845n047r17L067Q74j147J099J009k498j124P35N21L62J419L93j184
452E46j726j168J333L237l63l948L59M116n52m737m9O250K046q284l429Q091M201
$$ plain form
344 3984 2280 -3842 -2730 8003 6752 -11201 -10047 11101 9333 -9861 -6533 9220 6036 -7680
358 -7680 -7607 5837 8822 -4486 -7943 3838 4069 -4102 -253 4891 -618 -2578 868 -1300 -2976
373 -2976 1478 5058 2670 -4539 -5037 3263 3546 -4175 -1357 5494 1090 -4773 -2079 1431 2949 2412
389 2412 -2239 -4367 -185 3008 1156 -1510 -325 3432 1345 -6814 -3829 6701 4867 -4201 -3029
404 -3029 2927 1537 -2877 -1549 2157 1849 -1046 -1236 358 -949 -271 4231 895 -5737 -867 5044
420 5044 -690 -5411 1592 7705 494 -8563 -3173 6671 3272 -5106 -1356 5724 1062 -6048 -1742
435 -1742 4829 2984 -2063 -2980 87 961 -186 913 1922 -576 -1700 -965 -444 -82 1337 1730 546
452 546 -1180 -2348 -1015 2222 1859 -2089 -1730 2386 1834 -2903 -2952 3298 5344 -2940 -6369 1722 5923
469E923p096m188P552M504q609o051P882O868n355n963L913M616m629l827M606
484A46M056k568m608N10L608j32j653J644M81k552j497J823K497r40j021J051
500H45m77j835n61K449K425j894l556J543K974j334k783J732L868k559m497K313
516a347L808j431k672J514K593k200l791K463L542j340k384J222J546k567k075
531c119M082K309l184k037J772J074j667j95K503K97k623j234R93J698P70j053
547C86l84P7j048J39P00J024M40j476o01L67j08K23J004P73j170k775J419L244
565B234j645l289K476M434l464o491L821P516l297p192K715P132k469q465K338
580c646R592j518q814j35P392N70o287K51N879m54n021p81L306J706j335q07l0
$$ plain form
469 5923 -1173 -5361 2191 6695 -1914 -7965 -83 6785 1430 -4533 -620 3996 -633 -4460 146
484 146 4202 1634 -2974 -2464 1144 1012 -641 1003 1484 -1068 -2565 -742 1755 815 -206 845
500 845 368 -1467 -2028 421 2846 952 -2604 -1061 1913 579 -2204 -472 3396 837 -3660 -1347
516 -1347 2461 1030 -1642 -128 2465 265 -3526 -1063 2479 1139 -1245 -23 1523 -1044 -3119
531 -3119 963 3272 88 -1949 -177 897 -770 -965 1538 1835 -788 -2022 -1029 669 1439 386
547 386 2 79 -969 -830 -130 894 1334 -142 -743 -376 -484 -261 743 1516 346 -2429 -1010 2234
565 2234 589 -2700 -224 4210 746 -5745 -1924 5592 2295 -4897 -2182 4950 2481 -5984 -3646
580 -3646 5946 4428 -4386 -4521 2871 3441 -2846 -2595 3284 2830 -2191 -2972 334 2040 705 -102 -132
597a32j155L64K294n32j773Q51J425r77k601L41L938J200l748l000K595M081j978
614A193m277J205N184L23o928k626Q356M377q207n135P015N965o387p039N906
629a075Q379m845q837L071P653j309n938Q55M292o22k764j084J642K413K00j617
645D14k831k22M506J970n494k217N686K239o011l209N915N317m717o502K286O690
661C820n86o435R5N646R35m528l288L145N620j731o341O26N568P11m991j765M161
678F62L371l621m282K155M342m95k952n28O45J645P75l454j275M726K712m768
694c42n034L314P479j520r241R13R615k37j0303k71R970K459r360m489P348O296
710F597n973o500N044N959l973n206J732M833R68m353k517L157K881k226k200
$$ plain form
597 -132 -1287 -923 1371 839 -934 -83 1342 365 -2236 -1895 2043 3243 -505 -3505 -910 3171 1193
614 1193 -3084 -1879 3305 3628 -3300 -5926 2430 6807 -1400 -6535 480 6445 58 -6981 -1075
629 -1075 7304 2459 -6378 -3307 4346 3037 -2901 -2046 2246 1624 -1140 -2224 -582 1831 2031 414
645 414 -2417 -2639 1867 3837 -1657 -3874 1812 4051 -1960 -5169 746 6063 1346 -5156 -2870 3820
661 3820 3234 -3201 -3106 2540 3475 -1053 -4341 -1196 4424 2693 -3648 -3022 2546 3257 -1734 -3499 662
678 662 4033 412 -3870 -1715 2627 2132 -820 -1348 -703 942 1717 -1737 -3012 1714 4426 -342
694 -342 -5376 -2062 5417 3897 -5344 -4431 5184 4947 -5356 -5627 4343 6802 -2558 -7047 301 6597
710 6597 624 -5876 -832 5127 1154 -4052 -2320 2513 3481 -872 -3389 -232 2649 423 -1777
725a777J067J686J63j419j534R14K497j62j570j515K41K935P80m146j140N452
741B472J493o013k910N628M593m265o348L779O720l419o902L428O474k456n961
756c687M22N146J780m303k289L584J428k843r55J413J215Q12j596k120J190K465
772A662q84j574j46J103Q67r95j540R65K315p28k135l79R76J915k11k847O38L337
790B339j050m161R49M138J51l470j320L458J574l787j247M040N73l949j60K966
806A044j17j401L66J022j126j449J231K209j500k022K344J530l230j162L234R25
822A898k209j501J912J601j641j569J497J627j815j422J441Q64j82l90l60N04
838B55M44j576l74J782O89j447o16J201P62j764r05K442J274l354j727M134K039
$$ plain form
725 -1777 -710 976 1139 -280 -1814 -900 1597 1435 -135 -1650 -1409 1526 2306 -1840 -2980 2472
741 2472 3965 -2048 -4958 670 5263 998 -5350 -1571 5149 1730 -5172 -1744 4730 2274 -3687
756 -3687 -3265 1881 3661 -642 -2931 653 2081 -762 -1717 -304 911 1723 127 -1993 -803 1662
772 1662 778 -796 -942 161 1028 33 -1507 -542 1773 1045 -1090 -1469 -493 1422 1211 -1636 -998 2339
790 2339 1289 -2872 -1923 2215 2366 -1104 -2424 1034 2608 -1179 -2426 1614 2187 -1762 -1922 1044
806 1044 927 -474 -108 914 -212 -1661 -430 1779 279 -1743 601 2131 -1099 -2261 973 1898
822 1898 -311 -1812 100 1701 60 -1509 -12 1615 -200 -1622 -181 683 501 111 -249 255
838 255 699 -877 -1251 531 1220 -227 -843 358 1120 -644 -1549 893 2167 -1187 -2914 1220 3259
855C259m218j719M075J388m463j906M523K914m145k963M107K048m193j432L620
870H95J275k598j293K182Q25j504n74J258j75j484R36J533j364q28J819L76k152
887h73q19J661J189r39j198R30J082p45j073l78J459R82j099j772O92K763k62
904A600l120n1L060j26l094k61L552J270l470j754K688J245k056p50J913K46j154
921b62J62J60n91N70J078j203j900J394K613o75l452Q18L965j294m171M69M583
938B264N38m364p12L903Q20l621j314K868J754j837j901J164J603K9j698r65J583
955A14Q32j298p88J041J367k33j709l27Q61M99l99P8j39J45K34L07j021j100J865
974C29J632k373k062K716K730k325l523K170L674k292l770J718M657r68m736L64
$$ plain form
855 3259 -959 -2678 1397 2785 -1678 -3584 939 3853 -292 -3255 852 2900 -1293 -2725 895
870 895 2170 -428 -1721 461 1286 -218 -792 466 291 -1193 -257 1276 -88 -916 903 1279 -873
887 -873 -1692 -31 1158 219 -979 -49 1033 288 -785 -1163 296 1278 179 -1593 -901 1862 1600
904 1600 -1520 -1571 1489 1363 -1731 -1992 1560 2830 -640 -2394 294 1539 -517 -1267 646 892 -262
921 -262 -100 60 -531 39 1117 -86 -1986 -592 2021 1346 -2106 -1288 2677 1383 -2788 -2319 2264
938 2264 2802 -1562 -2274 1629 2449 -1172 -2486 382 2136 299 -1602 -438 1165 1194 -504 -1469 114
955 114 946 -352 -1140 -99 1268 1035 -674 -1001 -140 359 -40 38 -101 44 278 585 -436 -1536 329
974 329 1961 -412 -2474 242 2972 647 -2876 -706 2968 676 -3094 -1376 3281 2313 -2423 -2059
990b059M309m04l721k71L386P64k769o44J849Q46j224r47J91R10L4m44J4J92O66
1009F78n72m20j25k48J082O79j016q75Q45Q46n61j772N85K266k84k435k55K994
1027A412P97l231j309K916J473k582j674K591J912k054j972J265J417o04j348
1042i91K31J659k54q62K%K87L64n91o95N81R29j5j158J29Q90l7j006n54J139J244
1063A292p52j063K09P64J82q78p88J384R35j308j212J250J415r82j642K99J848
1080I53m18j725O68J939p59j982Q30J326j021o00J032O21j100n68J068R00j874
1097g10n60K303J54k284J46K220J7k019n96J755Q38k024q56K398J069k478j036
1114a663K074N66j008o06L74J380n21j849P73J763r37j496P62R07k46n48l47J456
$$ plain form
990 -2059 2250 1846 -1875 -2146 1240 2004 -765 -1409 440 1286 62 -885 -694 216 250 -194 -180 12 678
1009 678 106 -314 -439 -687 395 1074 58 -817 28 874 313 -1459 -874 1392 1108 -1327 -1582 1412
1027 1412 2209 -1022 -2331 585 2058 -524 -2198 393 2305 251 -1721 -456 961 357 -991
1042 -991 -760 899 645 -217 -215 -215 72 436 -155 -850 -269 660 645 -513 -384 506 469 -537 -1091 48 1292
1063 1292 540 -523 -314 450 632 -246 -1034 350 1285 -23 -1235 15 1430 448 -1194 -895 953
1080 953 535 -1190 -522 1417 658 -1324 -494 832 -189 -789 243 864 -236 -804 264 1164 -710
1097 -710 -1270 1033 1187 -1097 -951 1269 1286 -733 -1329 426 1264 -760 -1616 782 1851 -627 -1663
1114 -1663 411 977 -31 -637 -263 1117 596 -1253 -480 1283 346 -1150 -388 519 273 -275 -622 834
1132H34K68k045n53K592l29k121J027J491n69j359j05J658J69j886j41K768q22
1149H77k293J106J542j253r91Q80P08k90q11K0J650m64k431J548J568j747o01
1166i82J592M0o81o35L2J273J28j920N79J945j280j024J068L17j88j49j052O84
1184b53J559j166j047J670j45j339N43K35k01M97l87j79P44p80m22J634m80k224
1202a741J842J341j953p11J673L86j27j824m13K873O7l556J419L196k129j820
1218a477J038J009L30j048j264J717J643k869m98K789r42j322R51j91j37J168
1234H97j098l61J619j340j042K176n81j558J727P17j797M03L6l1J343j638j464
1251a992L296N82l793Q73K862j168j603j9O37K148j231l175K892K625m021j058
$$ plain form
1132 834 1102 -943 -1496 1096 767 -1354 -327 1164 595 -764 -869 789 958 -928 -1069 1699 877
1149 877 -1416 -310 1232 -21 -1012 -132 576 286 -525 -505 1145 681 -1750 -202 1366 -381 -982
1166 -982 610 650 -31 -666 -634 639 767 -1153 -574 1371 91 -933 135 452 264 115 -937 -253
1184 -253 1306 140 -907 763 618 -721 -178 57 -144 353 -34 -213 531 -249 -671 963 483 -1741
1202 -1741 101 1442 -511 -1222 451 837 710 -1114 -1527 1346 1413 -2143 -724 2472 343 -1477
1218 -1477 -439 570 900 -148 -1412 305 1948 -921 -1419 1370 428 -894 57 -134 -271 897
1234 897 -201 -562 1057 -283 -1325 851 270 -1288 439 1156 -641 -238 -202 -233 1110 -528 -1992
1251 -1992 1304 1886 -1907 -1034 1828 660 -943 -962 -325 1823 592 -2583 309 2934 -1087 -2145
1267b145L135m0j221K21n55J055Q37k588M09K525j977r88K238p90r70J947q29
1284B64j008J158o11k61J581j391r84K838p54k763J843J189j503O10n02n73K373
1301A506p58k970K435J769l116O9J745q58P99m1j934J885J243l424O48K556j958
1318d04j21J734j871q9J841j487j05J221j339L68J657k370r7L187j871k323K406
1335C37L50j193J106j100j20K465j942k327L295O82k937J170J013j271J147l96
1351B79j837K606M64l451J436K203k183K6J302j487P41L88j924J533J671k938
1367a171P11K539k942p24K853j080j076J397r88N89J336k697L28L396k566k616
1383b711L663L07k206J185o0o25J535j363j600L409l12k952J958P32j835J319
$$ plain form
1267 -2145 990 950 -271 -50 -605 450 1287 -1301 -892 1633 -344 -1332 906 116 -854 1093 264
1284 264 -744 414 -197 -458 1123 -268 -1252 1586 832 -1931 -88 1101 -402 208 -294 -867 1506
1301 1506 748 -2222 213 1982 -1134 -1065 680 -178 621 580 -1354 531 1774 -1650 -1002 1554 -404
1318 -404 -525 1209 -662 -751 1090 -397 -502 719 -620 -252 1405 -965 -1062 2125 254 -2069 337
1335 337 687 -506 600 -500 -620 1845 -97 -2424 871 1553 -1384 -214 799 -472 675 279
1351 279 -1558 1048 1512 -1939 -503 1700 -483 -457 845 -642 99 487 -1437 96 1767 -1171
1367 -1171 -460 2079 -863 -1587 1266 186 -890 507 -481 108 1444 -1253 -925 2471 -95 -2711
1383 -2711 952 1259 -947 238 178 -447 1088 -275 -1875 1534 1222 -1730 228 960 -875 444
1399D44Pj543J777J03k593K047J328k663R94J420k129L91J100j707J313R94k714
1416a431J190K214l128k94L362j727j167J721q68k08J328j879J97K638k476j490
1432b018L726r65k382K127L11j759J387m55p29J820j014j678K896m31k623K116
1448C29J082k495R19R05j561J223M42k175J735R74k928J327J829k338L80J601
1464A249k102N07J573k151J16K566k200n72K173j299p34J793j148l62J716j760
1480f35m98K764j599j597K600k26k299J487O20p85P29r85m72K220r02k418K768
1497G72J056l262J014J370j338P20p1j063J424K20k495J617J685k504K62J934
1513A341j738k96J405j326M49J032j709L13J933k061m27K220q91j151J344o62
$$ plain form
1399 444 451 -1092 685 788 -1805 242 1570 -1093 -99 1321 -808 -417 683 -1024 289 1283 -1431
1416 -1431 -241 1973 -1155 -1449 1913 186 -981 740 -128 -336 992 -887 -690 1948 -528 -2018
1432 -2018 1708 743 -1639 488 799 -960 427 -28 -757 1063 49 -1629 1267 836 -1787 329
1448 329 1411 -1084 -165 740 -821 402 844 -1331 404 1378 -1550 -223 1606 -732 -352 1249
1464 1249 -853 -346 1227 -924 -808 1758 -442 -1014 1159 -140 -874 919 -229 -591 1125 -635
1480 -635 -1133 1631 32 -1565 1035 809 -1490 -3 617 -168 561 -424 -896 1324 422 -1996 772
1497 772 1828 -1434 -420 950 -388 332 261 -802 622 842 -1653 -36 1649 -855 -593 1341
1513 1341 -397 -693 712 -614 -165 867 -842 -529 1404 -657 -1084 1136 245 -906 438 -224
1529b24m8J582j717o69K593j162k041J971P27j519O30k28m83J532q39j262K009
1546H52K17k408J240J171j769O04R03j401O83K92j196J230K74j848J136J250k174
1563i44K02J909j068p07J019p09K40R07j785M05J852j432r72J582j42n92O76o98
1581b57j85J261q87r60J984j71j636J207p1j031J154p7r25J135k44j200J259J48
1599E04j417J168P44j698L74P19l97J96p4o77Q97L58j857P01J832j397j009J463
1617D30n06O9J17o24M68R74j464k51J583o13q12Q74j16l89N79o78o0J145n37j043
1637h54J261n5j324J071N13p42J71M6l07O71m36r99J403L12j729M05J397o04m85
1656b85MK20M73m42q91J038R97j644m06J591l15p54L88j28L93P0p71R1J203q02
$$ plain form
1529 -224 -272 1310 -407 -1076 1517 355 -1686 285 1012 -507 123 -105 -588 944 105 -1157 852
1546 852 1069 -1339 -99 1072 -697 -93 810 -591 92 384 -812 418 692 -1156 -20 1230 -944
1563 -944 -742 1167 99 -608 411 -298 -58 849 -936 -531 1321 -111 -1083 499 357 -235 441 -257
1581 -257 -442 819 -68 -1028 956 785 -851 356 285 -746 408 331 -594 541 297 -903 356 504
1599 504 -913 255 999 -699 -325 394 -3 193 119 -558 339 697 -1160 -459 1373 -24 -1033 430
1617 430 -76 -7 110 -514 -46 928 -536 -787 796 183 -629 245 129 -260 319 -359 -419 726 189 -854
1637 -854 407 352 -972 99 612 -130 41 87 -220 451 15 -984 419 731 -998 -593 804 200 -285
1656 -285 -281 -61 412 -30 -921 117 1114 -530 -936 655 340 -414 -26 -154 239 309 -462 -371 832 30
1676C0n30P90m0o18L93m1j65O37n97k82O92k29o22P82K43p88K16J93j45K78j40
1697E7k69N14q0j092P16J023q06m33L74J08m3l36K2Q76j54j022L39P78o59m32
1717e19Q39M6n44K1j2M79n1n47K43N31o16n30R26J67p45K85K20n2j92k19K91N10
1739E31k65p41N20J13j86L0J07q3j42p8k94P54R3n48O4M40l45m26M53M00j54m65
1761b22l94Q90J97r96K62P64l18p75K69P83j62n52k10O76J81q54R1R80l90n16
1781b96J55M91l21j95j59P22k01m37j5M66j41l82L30K07l55j54O1L59O1k21j71
1802a96L64j56n03M12O37l06n51J07L14N3l93j6N37J50p95r0P16K61o63j55L26
1823E3K84n88k55O62K73m01l51L10OJ1l02M47J32l80P2L2K51m01JL93j59m80J30
$$ plain form
1676 30 -500 290 250 -368 25 -16 -181 456 -141 -423 269 40 -582 200 443 -345 -129 64 -81 197 57
1697 57 -212 302 222 -870 -154 869 63 -370 4 112 69 -267 -245 631 477 -545 -206 572 -87 -519
1717 -519 320 366 -178 -157 -169 310 259 -288 -45 486 -130 -660 266 433 -312 -27 193 141 -51 -270 21 531
1739 531 266 -475 45 158 -28 2 109 26 -116 -194 -488 266 359 -189 -125 315 -30 -456 -3 397 243 -222
1761 -222 -616 274 471 -525 -263 501 183 -592 -323 460 298 -254 -464 212 393 -461 -370 610 220 -296
1781 -296 -141 350 29 -166 -325 397 196 -241 -256 210 69 -313 17 224 -131 -285 -224 135 196 -25 -196
1802 -196 168 12 -491 -79 558 252 -299 -192 122 175 -218 -234 303 453 -342 -432 284 545 -118 -273 53
1823 53 337 -251 -506 156 429 28 -323 -13 -7 4 -298 149 281 -99 -27 5 256 -145 -144 249 90 -390 -260
1846b60N83j26l90J05L23r1o44K39O21J0n50l16O16K13n80j91P22J84p60l08O59
1867E9L99m51m06M41K58m38l18O40K54m25l02L36J56m13j13O31J1n15j05M81R4
1888B74m08j59P15p7n94p1P21j30l16j13K96O4n07O4M48K61n74j10L77qk73j42
1910b62L49N72n03n06K75M77q4n69J61K88r9l45L02M21j25o24J22M31j61m27J37
1931a70M07q3m43J19M14k18k28L39K14n13j75L46M67m79q5L18Q0n71k19O44K77
1952D41m83l53O71L8m44p5M32K98n80l44L57K51j91p3NK97k34l10K63J04J71m07
1974a66R7m6J88pl0J07m0j86j8K64r0j7O6O3j79j36p4M23n0m30M2M91k69m92M31
1999e8M80k78o33K75M58j27l90K18O24m21n22j3P68k00l97J13K18l3k41j9L65
$$ plain form
1846 -260 323 197 -193 -88 235 144 -500 -261 360 370 -180 -496 120 333 -247 -438 284 468 -292 -600 59
1867 59 458 7 -399 42 300 -138 -456 184 438 13 -289 47 203 -210 -323 308 319 -196 -301 180 274
1888 274 -134 -293 422 345 -249 -320 401 271 -45 -158 138 202 -305 -241 207 468 -106 -216 161 153 -120 -262
1910 -262 87 659 156 -350 -75 402 318 -251 -90 198 99 -246 56 477 352 -272 -150 281 120 -307 -170
1931 -170 237 154 -289 -170 244 26 -202 137 351 -162 -337 9 476 -3 -88 230 310 -261 -480 164 441
1952 441 -42 -395 276 314 -130 -205 227 525 -55 -399 -42 209 18 -55 -50 247 13 -297 -34 70 241 -166
1974 -166 -69 -115 73 66 36 143 103 -83 -101 163 73 56 122 185 6 -130 -204 219 169 -261 -219 272 3 -489 -58
1999 -58 422 144 -489 -214 244 117 -273 -55 569 148 -374 -387 381 181 -216 -103 115 82 -159 -178 187
2020A87j42p2N2k2p2j21L15J47l29M7l18L46m4J07m7N6j02l10J67J98J6r6r2J19
2044a0J11k01j28M82k1m07j31L28O9k27K60l3J04m78n8M79Q6n20K48K87m8m68
2066b76qO95j16m98k23M03L10n62K5N91O9o09l0K21J74m9j67J41K4K6k78J99J90
2089B52l13JN3o8J32j82J81L8j84K9O3o9k82M42L14k19m92L0L70J74l88j62N11
2112B31J40n43l30M67N83n24m87K69M12p9l68j09O35r0m02j15M22J31j28k99k5
2133b09K70j49r5J90O2Q3ok60k43K44L33k18k52%M57L3l94j94O64L14r85l79P32
2156bL61k17m06K34M72r1r45K70O68J28o53m29N72M20k22o22M48L08j57m77J91
2177a49K63K26j44n37L3M36K11l87o7L81q5n3m19K24M05o6n32j91M60J25j70m92
$$ plain form
2020 187 45 -27 25 3 -69 -190 125 272 -57 -10 -328 18 -26 81 34 90 -12 -322 -155 43 59 -37 -129 -10
2044 -10 101 -100 -228 254 233 -174 -305 23 92 -135 125 92 196 -282 -340 139 225 -295 -47 240 192 -276
2066 -276 -284 411 295 -203 -426 -23 287 -275 -250 341 410 -199 -229 -8 166 117 -50 91 115 141 -137 62 252
2089 252 -61 -60 -7 -75 57 -125 56 94 -90 -61 2 -67 -349 93 407 188 -304 -274 96 270 -118 -280 231
2112 231 371 -172 -502 -35 548 24 -463 -194 218 139 -229 -338 297 207 -195 -310 112 243 115 -184 -209
2133 -209 61 -88 -183 7 69 152 146 -114 -357 -113 220 2 -250 -250 207 240 -154 -348 316 630 -355 -734 -2
2156 -2 359 142 -264 -30 442 351 -594 -324 344 472 -181 -610 -38 382 160 -462 -14 294 137 -340 -149
2177 -149 114 340 196 -341 -308 128 339 -48 -115 266 181 128 -291 -67 338 272 -260 -451 9 134 -36 -528
2199e28M95M82k18r22L18P82N4o01k97P03L27p28m75M90N95k82p26L90J20J39
2219A18j53j79J90Q1q3j92O2K84L66k49m92j06M94K61p14n0O52M6o19k50M86M43
2241C96k40p47L80O34j60m54p7M98L44p25m20M99N17k69l71n3N00m4l04r9M45
2262B50J44l67l36L81J88q0l89Q4R6q7J67M0k41J55K51j81m42J09O05k7n91n2
2284c23O09j57m56j18O02K93p61k19M50M45k61k96J92J58r8k09Q5J60P6j48q5
2305f1J68j31J36j17j6JP9o3l4j28K21J72n0l11j2M01p9k85M9J72J31l68k56L89
2329HJ87k42k21K26N8jk59K28K28j04k45M8J74n3J4R9J2k93M5J22J97k18j83K21
2353D8P5j78j79K67L39l00l36L36M1k06j89K71L00j37l23o0M13j47k52k7K96J05
$$ plain form
2199 -528 -33 449 231 -691 -373 409 463 -138 -435 268 595 -133 -608 -118 477 195 -531 -141 -21 118
2219 118 -35 -214 -24 57 -26 -218 -156 128 494 245 -247 -353 141 402 -312 -362 290 336 -283 -533 -47 396
2241 396 156 -591 -211 423 263 -191 -268 230 574 -151 -571 -72 445 176 -195 -248 252 208 -96 -195 250
2262 250 394 27 -309 72 260 180 -209 -125 -29 -116 51 91 -150 5 256 75 -367 -258 347 320 -271 -323
2284 -323 286 129 -327 -445 157 450 -311 -530 -80 365 104 -192 0 158 60 -149 -64 96 172 24 -61
2305 -61 107 -24 112 -5 -21 -20 59 -4 -38 -166 55 227 177 -134 -146 255 176 -109 -60 112 243 -125 -381 8
2329 8 195 -47 -268 -42 16 15 -244 -16 212 108 -137 -89 85 32 46 145 157 -136 -91 31 228 10 -173 48
2353 48 123 -55 -234 33 372 72 -264 72 113 -93 -282 -11 289 152 -171 -231 182 35 -217 -244 52 157
2375A57m63o2M82P6j09k03J53j16j34L28Q5k20k60L76N8k81j62M66L8l19l05L45
2397g0L18j58j16j45L85k27j02j0K38p8j53j97J50K35K6k95O3K88n7l31J3L69
2419A46J26l73N1q0J32R2j85R9j9o8J42n6j8l1J99Ml75N6L23j66k53K48K12q6
2443A20l33K3M03K3m21L2K50m3l27M0L13K8j77N3R8q0m6K64j09k34k1K88k6m03
2467b85K87J39n9o1l02M82L6j60k51J95R9k40M9q7K93K1l48O3K05L2k85O9J77
2490F9l7m0j06J83K06k88k35J68K71k38l7J65J77j46k29J97K65m50j3L53P1n62
2512b56oO06l05k60P0K69ok45j55M39j6k93J3K96j22k89K64Mj0K08l75P3K33l1
2536A06j50L7M6j12L3L8p1K49j21j34J14n8l23N18O8m41K28J88k22j5j24M0M44
$$ plain form
2375 157 -306 -368 114 190 81 -122 31 -85 -219 109 194 -26 -286 90 148 -133 -295 171 209 -110 -415 -70
2397 -70 248 90 -26 -171 214 -13 -115 -125 113 35 -118 -315 -165 70 96 -199 -136 152 95 -236 -223 146
2419 146 272 -101 -50 -130 2 94 -91 8 -11 -79 63 7 -11 -42 157 161 -214 -158 165 -1 -254 -6 206 120
2443 120 -213 -190 213 236 -185 -153 97 54 -273 -233 80 108 -69 -16 82 2 -44 220 111 -123 -144 144 118 -285
2467 -285 2 141 82 21 -281 201 237 77 -174 21 120 -120 -71 -158 135 156 -192 -129 76 108 -177 -108 69
2490 69 32 -8 -114 69 275 -13 -248 -80 191 -47 -84 81 258 112 -117 80 345 -105 -118 235 306 -256
2512 -256 -262 344 39 -221 -151 118 112 -133 -288 151 135 -158 -145 151 29 -260 4 8 -2 206 -169 -96 137 106
2536 106 -44 -7 39 -73 -40 -2 -73 176 55 -79 35 -23 -346 172 240 -201 27 215 -7 -22 -146 -106 338
2559C38l06l34J03L79j7l71L27N1Kk82J8K34L08o82M4K67j30L3J79j30j83M38
2581B86k61n02M07K35k47K88m74P7N23j86n03O08K6k05j38PJ66L12l33l42L49
2602I3J14k98j10L67L8j59n2l66N90J88p01J05K49j71%J63k36K16J27k34J13k9
2624Gr3J50K79k89k21L11k02j55L32l3q4Mj60J8L88j61m09O66l9n56J51J0K50
2647A64Nl59q1N33j24m53M12Q5k35J8P5j64L87O1q62M88M58n88k6L84l3j96J17
2670F6k09J95J53m93J23M52l82j16N10n19n3P08o27j03N41k20j17K15k07J50K55
2691C22m68l47P19M0p39L71K92m03L78l08rL82L5p46J75O28l01R5k60j29M69J47
2713C43p63L36O30n88k80L07j19L55n2n90J35O80l72k39M12m59K62M59p25j70
$$ plain form
2559 338 32 -302 -199 180 163 -208 119 170 172 -110 -92 142 450 -232 -188 79 -51 -18 161 31 -152 286
2581 286 25 -477 -70 165 -82 206 -268 -191 332 146 -357 251 277 72 -66 -59 107 419 86 -256 93
2602 93 207 -91 -201 166 204 45 -7 -373 217 405 -296 -191 58 -113 -113 50 -186 30 157 -77 36 7
2624 7 -86 64 343 54 -167 144 -58 -213 119 86 2 6 -154 -136 252 91 -318 348 309 -247 -96 -86 164
2647 164 169 -190 -271 262 138 -315 97 182 -53 -35 40 -124 263 324 -538 -50 408 -180 -206 178 145 -51 66
2670 66 -143 52 205 -288 -165 287 -95 -211 299 -220 -273 435 -192 -295 246 26 -91 124 -83 67 322
2691 322 -146 -493 226 266 -473 -102 190 -213 165 -143 -152 230 265 -481 -306 322 21 116 -144 -273 196 343
2713 343 -420 -84 546 -42 -322 -15 -134 221 169 -421 -286 394 22 -217 195 -264 -2 457 -268 -438
2733d38Q37j66p06L23N8M32j46p36K98J061n66r12N57O68n66p1j14P6O94n50p22
2754f89P32L85p90N4K40o5N78m70n71P96K78n68k02M27k35K30L9p50N13N60o11
2775a19l29N68l8J94j05n13L9R43n34o91M45O05l81q4n64N27J063j113q42J104
2795A75N21q11k19M3L85M86q87m96J149M58j128k06N69J8L79m04q13Q84N37p81
2815a41l80P34Lj38n1o98P75M69q27k61Q64o7k81j13k34L90P15j053k46P27Mk30
2837c9j65L4K78M32r71l91J253J10r02L06M2J81Q7m22m33R00J06p84K83K31j23
2858A3K23l87n69R35K58q40P6N57k68P4k17m12Q26L96j040k68Q65J44k66q0k06
2879a86N40J94j082k03J164k26n89L63J41P8o1o23J00Q20l13o78O75J04m58L83
$$ plain form
2733 -438 399 233 -473 -150 -92 340 194 -542 -244 817 251 -661 -104 564 -2 -73 -187 -111 583 33 -689
2754 -689 43 428 -362 -308 -68 -133 445 -25 -596 200 478 -90 -292 135 -100 130 169 -581 -68 492 -119
2775 -119 -448 120 82 276 171 -342 -303 640 106 -585 -140 465 84 0 -564 -37 1026 -87 -929 175
2795 175 696 -115 -334 -291 94 580 -307 -803 346 804 -324 -530 39 57 436 32 -781 103 640 -141
2815 -141 -521 213 216 78 27 -671 104 573 -254 -515 349 282 1 -112 -346 44 759 -294 -540 187 191 -39
2837 -39 -204 -170 108 540 -431 -822 431 541 -361 -55 -13 168 255 -167 -600 300 406 -378 -95 136 13
2858 13 236 -151 -720 215 473 -367 -291 266 -2 72 -145 -557 269 665 -375 -643 222 366 100 20 -186
2879 -186 354 548 -534 -737 427 201 -388 -25 116 194 133 -490 -390 430 117 -561 114 218 -240 143
2899A43n6k67L42N7n78L40J58j81K76k26l10L48K68p05J47L49j07m1J19k84M59
2920B51J17o57r9O10j56j89J00j20K01M11p58j6O02j68l31J60R3j24K26k71N7
2941f1M91m36j13K79J02n26M69J21o04K48O0r4R0Q5m06M21j34l87N20J55k86J7
2963A1K02m01L2L10m02Q3K66k44m8L62l02J64L04k96k87M94n3l27J24L5J2J68
2985B07l04j40M66p7k11J30p3m6K8k02j34P76j37p46L71L12k38J00p8r6L66k32
3007D2m36L89R8k52K36J03k35M7L19j86k52N1J90M3k40l63P32J84q12k04P45M5
3029B44k11l33L41L23k26n88J16P91k98m38N0L93N2k70n6N4N04l06o44M45K56
3050A99r5k07q3P4L16l9m54J79K93j02j63p3p8L59J17m10k60L65K52j41k71R3
$$ plain form
2899 143 87 -180 162 219 -359 -19 139 -42 234 8 -302 46 314 -391 -244 105 -2 -43 76 -208 251
2920 251 368 -289 -388 222 66 -123 -23 -143 58 469 -289 -305 297 129 -202 -42 51 -73 153 -118 -61
2941 -61 430 -6 -119 160 262 -264 205 326 -278 -30 30 -64 26 111 -295 126 -8 -395 125 280 -6 11
2963 11 213 -188 -156 154 -248 -165 101 -143 -191 171 -131 33 337 41 -246 248 195 -132 -8 27 39 207
2985 207 -97 -237 229 152 -59 71 -2 -48 -20 -222 -356 420 283 -463 -92 220 -18 82 4 -92 274 42
3007 42 -394 -5 93 -159 77 180 -55 -8 311 125 -127 -76 114 157 -83 -446 286 470 -342 -546 199 244
3029 244 33 -300 41 364 138 -450 -334 457 159 -279 -229 164 216 -54 -110 -56 448 142 -502 -57 199
3050 199 104 -103 -186 -112 204 165 -289 -110 183 81 -82 -155 -233 126 243 -167 -427 -62 190 49 -222 -129
3072a29M24M8q35J62O37K4n03J02K49j01r1k69J8N62j61m56J11O9J86J6k29j19
3094b85O81j49m57j25N58K1l37j11O7M72K8n64J37K86j22k07j64J81M49k79m30
3115c50K40L50Rm73J9L03J71j05m84K50M81j22m38PK13m6r0j42J55J91K4k14j29
3138a80K30Jj00p7m1L76O0k60j89K46K69j36o16K03M24J26o05l1N68J2m21j15
3160b56L06J36l04k49K23M33j36m67K31P2J50k32m0K92O9j36k57R6N2R0m0l3n0
3183e0P3J04j95R7N9p1L0j63j05M06Q3m10r8J57L00j08m24K81K25j10k52r7L72
3206A04M4k94J22K7J94q2l16J25L23o7l90Q4K86K80m56k11K83Q1M2j57p4J92Q3
3229B23m3j60j70L30p9j82j74J88K34j86j99J98K14k08j00j8J70J84l39j2K94
$$ plain form
3072 -129 295 343 -492 -330 307 331 -172 -70 179 78 -13 -282 -264 298 137 -319 -208 -139 47 63 -166 -285
3094 -285 396 247 -210 -335 223 244 -93 -204 -137 335 363 -201 -64 222 100 -107 -271 -90 359 80 -350
3115 -350 -110 240 249 -224 -205 98 269 164 -320 -70 411 289 -149 -142 71 25 -65 -207 -52 139 163 -51 -180
3138 -180 50 51 -49 -126 -167 209 269 9 -180 66 335 199 -417 -214 210 336 -269 -300 268 280 -141 -256
3160 -256 50 186 -118 -367 -144 289 153 -314 -83 -11 139 -93 -133 159 228 92 -165 -69 -17 73 33 0 -50
3183 -50 23 127 -68 29 88 17 47 -116 -221 185 268 -142 -240 -83 217 109 -315 -34 191 81 -171 -268 104
3206 104 148 -146 -24 3 197 115 -201 -76 247 180 -210 -126 160 440 -16 -227 56 137 179 22 -52 140 223
3229 223 180 20 -150 180 101 -81 -255 -67 167 -19 -218 -20 194 -14 -114 -132 38 222 -117 -129 165
3250A65j37j04R9k2J5j02j2P4J14j36J11p7n6j77L93o1om4mr2M5J2l5J36k13r1
3276b05L62pj21j39q6L96j84j55pL13N8k26k22N58o1l09j87K06K31l05j33M67
3298B44k1m04K5J24R0j66KL79r4j74j31k9K89k9l05L63J01k61n3p1J48kk44n8
3322b77K24K12m9j10r8K6J4j14J95MJ54m2j37k1l4O4mj2NQ3L7j44j1J02J91k06
3348E2l96K56L09j21m75K41M24r0l07j55K44J92j42j83J39K22%l16q2K80J21n8
3370A55k84j84M65p1k32o6L57K66m93k93K82M89l71k16j8L87M8l02j47K20K18
3391B10j27k19j02M82j19l59r0M86K9k86j20K14K08k58k67K37K5K80j59j58p8
3412a71K36J31n01o3M95O5n6j75j0K85J22m41j61L71J97m05m28O45N79n25n96
$$ plain form
3250 165 28 -76 23 1 16 -86 -98 -24 90 -46 65 -12 -68 -245 148 87 81 37 33 -59 -14 -2 -37 99 -114 -205
3276 -205 157 150 29 -110 -196 200 16 -139 -146 167 225 -1 -223 335 274 -35 -222 -16 215 -90 -223 244
3298 244 223 -181 -156 -32 58 -108 -106 273 179 5 -126 -155 134 105 -200 163 264 3 -50 -121 27 25 -219 -277
3322 -277 -53 159 110 0 -98 -72 -58 -172 23 27 181 139 2 -19 -53 11 7 -5 0 83 120 -24 -35 67 258 52
3348 52 -344 -88 221 100 -375 -134 290 200 -107 -262 -18 174 32 -151 -12 210 210 -106 -188 92 213 155
3370 155 -129 -313 152 81 -151 -217 140 406 -87 -380 -98 391 20 -196 -214 173 221 -81 -228 -8 210
3391 210 83 -136 -238 244 125 -234 -324 162 191 -95 -215 -1 207 -51 -318 -81 -56 224 65 -93 -171
3412 -171 65 196 -305 -368 127 192 136 -39 -49 236 358 -83 -244 127 324 -81 -509 136 715 190 -406
3433d06K35M07N2p01k9N68J51n61j40L11N13m53m16K56M74j35k20k10L82J13k01
3454a0k73K14L04q6k25r5J88Q2M0k55n7M74r8j68k84J80L96j23m26k5O00j61m01
3477b09o8L76Q3j46n11K73M30j41l55J15K24J14j46k94K23L40j99l77M5L82P0
3498B29m01k03K45J92P3k72j0L70j00l54N6J95J99j16l29K49K16l01j94J81L25
3519B50n3m10r4K66K77k55k35K59K57m50o7J30Q3Q2L5o2j2j13j78L41r8RQ2j11
3543f7n0j02K57J89k70o4P2J34N2j72o2M76l50l5j59J26J67r4j70K38J3k86k0
3566a77J8J65N8k73J96K49j35k50oM30l00j33n7L26N2l28Q6K21p6j96O0L33k40
3589B3m6m1J50P0j46p2j10J50P0p5j7K06L9k58j38K69n3j8k04N9K47j27Jq0J03
$$ plain form
3433 -406 -171 236 288 -413 -442 126 277 -284 -424 -113 400 -53 -469 -213 261 126 -94 -304 78 191 -10
3454 -10 -283 -69 235 149 -76 -171 17 99 139 -116 -173 301 203 35 -249 -69 327 204 -222 -247 353 192 -209
3477 -209 -277 99 182 36 -475 -202 228 87 -268 -153 71 185 39 -255 -32 308 109 -268 -223 159 229
3498 229 -172 -375 -130 62 135 -137 -147 223 123 -231 -175 20 219 103 -226 23 239 -62 -256 -75 250
3519 250 197 -213 -307 -41 236 -19 -254 5 262 -188 -255 -125 -42 40 75 13 1 -112 -290 51 -47 -38 44 -67
3543 -67 -117 -219 38 227 -43 -107 -35 99 151 -21 -83 393 43 8 -151 -25 142 48 -122 116 129 -157 -177
3566 -177 -159 6 64 -209 -13 236 101 -149 -155 275 -25 -158 -215 111 163 -165 -79 142 66 -130 -70 263 23
3589 23 -23 -64 86 156 10 -62 -172 -22 48 -27 -44 162 201 -57 -195 74 21 3 -201 -142 105 -22 -21 -101 2
3614BJ08j19k09J10J93J42l13k7J24N6j7k82M1L75l0k89N6K51J6m73N0J32L74
3637B71k37k36Q4M03j93j2l64L05O2J2k08n2K09J71j36m14J72L79m5m41J46N60
3659D36j67m58j56M66J58j53l40M6M50r7o32J52M34K02m55k82M90K28l03m28L44
3680f5J67p1j04j46L72L3l70J0M4L14k07N9m6M5J77%m40Q7K46R0k38j83L05K79
3704C58j40m75M6N40m0o11M0M29L73o21k21K28N01j45n34P7L30R9n43j40M94L84
3726D29n45j92J91L21j48m76L77M6K97k32l40K1N95j91k58r2L74J29l66j97J34
3747a23K94P3n82J23K85J19k29l51M03L19l87k03J23M16k7l99J1K20O7K4k05j71
3769b00K72J56k90j50J92K61l02k58O2N63q6l60m6J47K48j32l57K24R6K25l76
$$ plain form
3614 2 110 -9 -218 -108 85 227 -86 -113 11 67 50 -232 -191 184 154 -135 -79 172 188 -285 -235 -103 271
3637 271 34 -202 -118 285 92 80 -284 21 83 95 -113 -165 44 215 79 -335 -163 216 171 -270 -124 436
3659 436 269 -189 -345 121 279 126 -214 -168 282 185 -447 -295 139 341 -114 -396 94 322 19 -409 -65
3680 -65 102 31 -73 -219 153 186 -184 -174 -130 184 -23 36 -10 35 212 212 -228 -141 105 195 -43 -226 79 358
3704 358 218 -257 -211 329 289 -322 -282 147 520 -101 -322 -94 407 262 -272 -195 135 234 -309 -449 45 429
3726 429 -116 -308 -117 204 56 -420 -43 3 300 68 -272 -251 344 153 -105 -197 177 306 -60 -257 -123
3747 -123 171 244 -338 -215 70 189 -40 -391 12 331 -56 -259 -136 280 253 -146 -135 85 152 176 -29 -200
3769 -200 72 228 -62 -212 -20 241 -61 -319 -257 306 220 -140 -186 -39 209 77 -280 -56 40 265 -111
3790a11j15N18j19j40m25M01J38k0k28N0J94p5l11RL22J32l94LK26J44l69O2J56
3813D8j02J44j75L1P1n6K23j56k14J76K07m2k64J32R4L5l93L0R1L26j25r0j27
3836a36K74j38j23q3L26J03l71j84L35R7n2l33K23K42n8k57K7K01k21k1m3K58
3858F6P7l32Q9K50k58J88QO5o0j25R1j21L3k1K41m7j91j20L06n7j16J4J33j08
3882ELj24Np9J87J03j06j10P4J05r8J0pM9r5L6N5J06j75J87j36J71j04j15j52
3907b05J56J15R6k84j06K32J41r3j46N9m0J3J18j22N1j42Q9K26k34l5L37j72k65
3930b11J54n3K27r6m2j6J45K00m94N0K21K0k55j5K64O3j62j56O7L07k11k17J09
3953a01J45lM0m04M43N9l16j73M91qk98J17j11J99J00j94q1P1L4q6R6q9p1M20
$$ plain form
3790 -111 -226 292 173 33 -392 9 147 127 -101 -51 143 68 -243 -234 88 220 -174 -171 55 199 -170 -108 48
3813 48 -54 90 -85 -54 17 -39 184 28 -186 -10 197 155 -109 23 117 152 -241 -211 -120 206 81 -9 -136
3836 -136 138 0 -123 -206 120 223 -148 -332 3 100 48 -285 -62 180 122 -135 -108 93 -128 -149 -192 66
3858 66 143 -189 -100 150 -108 80 88 153 93 -32 59 -62 -29 -50 191 144 -47 -167 139 82 -34 -20 113 5
3882 5 8 -116 -111 -190 -3 100 -6 -116 -42 63 -35 -25 -32 17 -78 -42 13 119 -56 131 -5 166 62 -53 -205
3907 -205 -49 66 162 -122 -228 4 145 52 -94 -35 -75 -62 56 -66 -15 -157 -68 158 -76 -111 226 54 -211
3930 -211 -57 -110 117 21 -21 -37 108 308 -186 -136 85 105 -150 -165 99 162 0 -156 -89 218 7 -210 -101
3953 -101 44 41 81 -323 120 179 -137 -310 181 173 -125 -8 -119 80 180 -14 -95 -24 10 -76 20 -69 -140 280
3977B80j34j82mJ12P7pl16M5M42l07k19K06J70jk60n5J61K25k87j07J67K62m12
4000a44J06L0%J58l2m64M92Q7l20j96K55K05l2j61j60K25K83m43q6K80N0j04J1
4023D0j08L7L97l37l96M79J13k60o8N6l8L68k76l66O33j75k84M6J43j13K96K0
4045B07m80K02K71k42n0L0M0J83r1l85L23L07m37oJ49j9L52l10m71M64K94m71
4067a40j99M47P0Q4l38j21K19L39o57q7O21J38l91p9J36j1%k75K8L32J10l03M9
4090b8J06j76K10R6m64L08p8p0J31j59r2N86k91k69K8N24l17k01J98O4J46j77
4112G5l54J52M20k70k93M07Om0p9k58K45L14n18q8L76kn8O7j85K3J87k03p6L26
4136A74K9l97J02Q9j78L06kj9K2Q1l74J13J94M2j72j09j66K68L66n96K16J90j33
$$ plain form
3977 280 146 -36 -40 72 149 142 -174 -129 313 6 -213 -7 163 162 -98 -153 8 233 -54 -161 6 268 -144
4000 -144 -38 -8 -8 150 118 -346 146 233 -87 -283 -28 177 145 -16 -176 49 332 -111 -197 83 133 29 40
4023 40 -68 -31 366 29 -367 112 225 -35 -103 -47 -85 283 7 -359 274 99 -185 -139 4 -109 187 207
4045 207 -273 -71 200 -42 -92 -62 -22 161 70 -315 8 315 -122 -128 21 2 354 44 -427 37 331 -140
4067 -140 -339 108 178 262 -76 -197 22 361 -296 -383 238 376 -15 -94 42 31 31 -244 -216 116 226 -77 -28
4090 -28 78 -98 112 208 -256 52 -26 -96 35 -124 -216 370 79 -190 -162 362 45 -156 42 106 252 75
4112 75 -279 -127 293 23 -270 137 143 103 24 -234 11 325 -193 -281 95 93 35 102 -83 -60 127 -76 -152 174
4136 174 203 -194 -92 -3 -181 125 123 104 126 207 -167 -54 140 182 10 -99 -265 3 369 -227 -11 179 46
4159D6k02Q5j0J52M2k28o3K71j59K5J47j89JL26l11m0L43j97LJ05k43j39M76j69
4183G2lM2Q1k31O7N1l27O01k72l73M33K90o62J89J22p2O4j05j17K58J06n84L26
4206d4M37m43j47L20j12K4l9o2PJ16l59K0N99l19n8J05J34Rq0j69j8M09l81k13
4230b64L02J69k88P8J3q5K11j82j07K53o2l89M71J23k98j9J13j09J4J21l6J83
4252B12k50j23J96qk88J56M68k60j73%J12L5j14%J13O5k33k70M08L4r7j5j81M4
4276a69M37l35l9K01j06o0Qq0k2K84K0m97K48L58k62j75O8J58K42l32j22K82l5
4299G2n7j00Q5J7J45j34j91J45L97m33j44J78J53j38m0OJ40K0j63P2J59k35n6
4322a02K35j41L1N4M0j58L0J55m0j22j22QL15ln65L80L31l13q1j33J37L50l13
$$ plain form
4159 46 -156 -71 -81 71 113 -115 -178 93 -66 -41 106 -83 -82 244 -67 -107 236 39 42 147 -96 -235 241 72
4183 72 69 111 192 -39 28 79 -248 353 81 -292 141 431 -231 -42 80 8 72 -33 -150 108 214 -370 -44
4206 -44 393 -50 -197 123 11 35 -4 -66 -59 57 -302 -282 317 -2 -60 45 179 188 108 -61 -79 330 -51 -264
4230 -264 38 207 -81 -3 10 -75 136 -46 -153 100 38 -351 120 243 -55 -74 39 -70 -56 65 29 212
4252 212 -38 -161 35 27 -261 -105 363 103 -70 -70 42 77 -37 -37 76 141 -92 -362 46 80 -17 -32 -213 -169
4276 -169 268 -67 -106 95 -11 -71 -63 -143 -165 119 139 -358 -110 248 -14 -189 -121 37 279 -53 -175 107 72
4299 72 15 -85 0 17 162 28 -163 -18 379 -54 -198 -20 133 -5 -45 -39 101 121 -42 30 189 -46 -102
4322 -102 133 -8 23 77 117 -41 -11 144 104 -18 -140 -132 183 180 -385 -5 326 13 -68 -201 -64 286 -27
4345b7k44M37J69m14k52L41N5O3m25q9N84J0m82Q2M05k02j59j8K1K09L0k66R2
4368h0K19m4k02J86j84J44K6m9j08M0J79q2ok09K63J65j81j93K33M3l20j04M65
4391B01j47P0k11n4K77J12l62K1O5nJ46j31K5R4N7k38q4K45oo0j08J05j0J97l47
4416a48O2R5L2j1J77j50J76j61j69P5j27J99j68J39J51K4M2l24j7J79k9j27KK87
4440B09q0l48L61j45L2N9k13K16k1j04R4M9j13l8J02j96Q5R5m8kJ67l53l7K59
4464C0M4J0n8k2o5J13j37J68O0l32O6J0J67j20O5K90q4k04j84J37L4N2r9J21N7
4489A19q9p9N6k8j22J5K10l0j09k22K25J85j29p1J58J7n7O6j25K50j12j65K9J37
4513A29o6j98J73k2m2J19o6O5k0j67o5J76l8R6J22r3j31m2J0M3J5R3j57J29k9
$$ plain form
4345 -27 -271 166 335 -79 -331 10 65 128 -297 -386 198 208 -274 -192 213 11 -148 -166 -145 64 94 -172 -80
4368 -80 139 95 -107 79 -105 39 65 16 -92 -52 127 45 39 -170 93 258 77 -116 117 160 -160 -264 201
4391 201 54 124 -87 -141 136 248 -114 -93 -28 -33 113 -18 7 101 158 -80 -164 81 75 15 -93 12 2 199 -148
4416 -148 -86 9 41 30 207 57 233 72 -97 -22 -149 50 -118 21 172 196 238 -86 -103 76 47 -80 -78 209
4440 209 129 -219 142 -3 29 88 -125 91 70 -34 60 109 -4 -42 60 -136 -51 44 -4 -6 161 -192 -229 30
4464 30 74 84 26 4 -61 52 -85 83 143 -189 -123 -113 54 -66 -1 289 205 1 -183 -46 -12 40 -59 62 119
4489 119 30 -49 7 -21 -143 -128 82 52 -57 -279 -54 131 2 -69 89 106 49 115 -10 240 128 -37 -8 129
4513 129 63 -135 38 16 -26 93 27 92 72 -95 -160 16 -22 74 196 103 -28 -70 -60 -17 -2 91 -66 63 34
4538C4j86K01K16k87r7J22J5j20J82k28L46j18j03J3k9O8p2O9N1j68J74k3j04
4561d4L4RL5p5j64K54m5L3k68O7J54Kl7k7J27J57l05j24K93J28j85j76J29J05
4585G7J36l95O4L75j86k24P1J77q9l6O1J25K4l05K25m4o2J64r5r2pj04M9Q7r1
4610i5L2M7J43k12j23L25n4k5m9M4L2j35M3j1J21J68l54j43K52L92k78l70L75
4633A25J98l98l3K02O4j05j09l8J13j49q2q0L70n6k8k0J4J37k18K15j14o8K23
4656A63k9j01L4pL1J4k03m6J45Q5M4k69K35n7j44RK7J59M3l12J54J28J3l3m9%
4682C4l8p9o2J32mO4M4j05Rmj28K27j80M0J78j44J2k1K73k52N9k06K16J44l50
4707a41q3K32J50j01k39L02j11j5j09K09Pj30k9M0J28k08R4l4KK68m06J37J13
$$ plain form
4538 34 -152 49 265 -22 -119 3 18 -102 80 -148 198 80 -23 -10 -39 29 -43 26 77 -91 83 60 -44
4561 -44 -10 -1 34 -41 -205 49 4 37 -231 -164 -10 -8 -45 -72 55 212 -93 -217 76 204 19 -157 -28 77
4585 77 213 -182 -118 257 71 -153 -82 95 6 -30 31 156 180 -125 100 56 -6 158 63 -29 -36 -140 -91 -4 -95
4610 -95 -63 -16 127 -85 -208 117 63 38 -11 33 65 -70 -27 -38 83 251 -103 -246 6 398 120 -250 125
4633 125 323 -75 -108 94 158 53 -56 -94 19 -130 -212 -292 78 22 -6 -26 -12 125 -93 122 8 -60 163
4656 163 134 33 67 60 91 105 -98 -144 1 86 130 -139 96 39 -105 -96 -69 90 133 -179 -25 103 116 83 34 34
4682 34 -4 -83 -145 -13 -17 47 91 -14 -5 -9 -137 90 -90 -50 128 -16 -4 -25 248 -4 55 -151 65 209 -141
4707 -141 -224 8 158 57 -182 120 9 -6 -115 94 101 -29 -58 -18 110 -98 -4 -38 -36 232 -174 -37 76
4730G6J9l4MN3j34r6J98j4r2m9M3J99k35m4J17J45j22j49j9J59l7l7LJ96om55
4756c11M22J3l6o8q2J46O6j69m6J13o6j26J92om9k6L5l7j28J01O3Ln5r2J36M0
4782C3m5p1J87N4j43l0J6L5J9j30K33j51R8k03J09R5j17k23K05Mm7R0j83K50j28
4807d3L8j20J72J96l85J96k4M4j98O0J62j05q1rJ88m6l0J37M6k47m8k8L28k54
4831e1L6P7J42l03l5J83J18j29k94K51J00k3j38K3K47j96j85J72L2P1j84m0J50
4854B4R0o6k74L12j92L9k5P2P5j36P8O2J20k29P8R6K8j57K0J25j10N0j57J70o5
4879B8k04N8J75m6R0PM2p6k53J44L5N4m1j89K45n3j16l1K17K5j84m2J60Q1j30
4904dj21K22L9j05j41N1J22J50l20J49k2q8o5P4J28j01j4O1n1O4r5J06k8j12j7
$$ plain form
4730 76 95 61 65 118 -16 -112 86 72 -20 -69 -26 173 -62 -106 11 156 34 -115 -134 25 -12 -49 -46 150 144 -311
4756 -311 111 124 88 20 -62 84 150 -19 -65 48 -18 -144 48 42 -7 -33 2 -35 -163 -62 1 4 -51 -143 -7 33
4782 33 -12 -83 104 158 15 -15 1 36 55 -75 158 7 105 -98 11 106 -11 -234 -29 -25 -72 18 -165 85 -43
4807 -43 -5 -125 47 243 -142 54 30 74 -124 -64 98 -7 -88 -97 91 45 15 152 198 -49 -97 -125 203 -51
4831 -51 -15 62 204 -99 -134 49 167 38 -256 -5 95 72 -66 -43 204 8 -177 -5 27 98 -86 -126 24
4854 24 114 48 -226 86 -106 -67 -92 -20 55 -81 -3 59 179 -50 28 124 152 -5 15 140 30 80 -77 93 28
4879 28 -176 -118 57 11 101 108 150 74 -179 -35 0 54 13 -176 69 16 -100 -131 86 111 -73 -115 45 126 -4
4904 -4 -125 97 136 31 -110 -59 63 213 -107 42 20 -68 -133 -59 69 -32 -46 15 -36 28 -67 39 11 -101 -118
4929a18J44l0j94N9L39k66L9P1n4K23l83O3J70J64j59l8K3J54k40O5o9K12q3r3
4953an8N7nL2j30J22j31J02R0j25j41K69J03j89q5K1L44l03q5N1K52o7j67k21
4977b65L07R8j02j63J9K64J9l30J54J44Kl25L3K69p5j22M0J74q9m5K6R5k09J76
5001I5K8j5j38o2J60j47J61o4N1n0K5k53L45K7m1j63j0J46j39Po6J22R3k09J62
5026F5O9q6j4r3Mj00N8J62n4l5j0j34Q0J13j51K02l6j08n3Q4N3j31K9M7l4L1J9
5053b3J05L7j22k5Q6mO1j7o8mO9m9j64J59L5j46K36q8j36q5p8M25j03j62O7P9
5079H5M1r4J3l9nm5j34K26L8j69n1J35K11k23%r6J48j44n9K20M3j83n9K41J57
5104B57m39M3O4J51j38q6J07J30j69j6J85k19J13N1n4mq9o0J39p6J38j33Q7O1
$$ plain form
4929 -118 26 -4 -198 -139 200 -66 -27 44 -10 213 -170 -107 63 227 68 30 53 207 -33 32 -37 175 92 -1
4953 -1 -59 -2 -7 25 -105 17 -114 -12 78 -47 -188 81 184 -5 -90 -69 275 -28 -113 -62 190 123 -44 -265
4977 -265 42 140 38 -125 -106 158 177 -153 1 145 147 -178 -145 124 49 -73 -33 141 52 7 33 128 -81 95
5001 95 123 108 -30 -92 68 -79 82 18 69 19 44 -209 136 163 122 -41 -51 95 -44 -37 -103 19 112 -97 65
5026 65 134 48 34 -59 -55 -155 -97 65 11 -24 -34 -168 -88 25 -126 76 40 -68 -121 -37 16 -115 -86 -39 -73 -42 -23
5053 -23 82 119 -3 -28 58 54 115 98 30 26 95 46 -118 41 76 -70 166 78 -58 -143 -221 204 101 -61 6 85
5079 85 126 32 45 6 1 -44 -178 48 86 -83 -134 1 212 -11 -11 -107 41 -103 -162 58 101 -82 -141 100 257
5104 257 -182 -139 -75 76 -62 -148 -41 89 -80 -96 89 -130 -17 34 -20 -24 -113 -173 -34 -110 28 -105 -18 43
5128D3K5j40l9L54j76j25j0J61j68j25J35J08J6j14K48j80q0pJ91k4J08j56j62
5151a17K15k49l6K06P1j69m6J53P1j70j25J58Q7j98Q0N9J81k34k8J27Q5j36j48
5174a63K27J25K3l48R5K06j2j99L2j1R8j31O5j33pJ41q6L7M6j4K8j9L8r1J04Q0
5200A31l65R8N3J01q6m0m0K51j82j16J65j9j14J03q8K13l1j97J56kJ13m5j28J65
5224I6P6k97J30NK48k92j62J48J13j21P6J6p6q3J30N5o8j33Q1P2N3j28l6J13k1
5249ej37J06J17kj75o9J57J41j69q6J68Q4j94K25j28J00j95jK74k58k4NJ44K8
5273A06j97P2J58j07%n4j4J30k18K56j26J1k14J58K05j57k04J05J81j91Q8k24
5295b36L43k29Q7j43K90k06m0ql0R1R2j15J29J31j34m2L7Mj18J06o1M4k2j4L8
$$ plain form
5128 43 68 -72 -111 243 67 -58 -68 93 -75 -200 -65 43 59 -55 193 13 -67 -74 117 93 201 45 -117
5151 -117 98 -151 -187 19 90 -79 -125 28 99 -71 -196 -38 49 -149 -69 -10 171 -63 -91 36 121 -15 -163
5174 -163 64 189 212 -136 -41 165 153 -46 -14 -25 73 -58 7 -126 -133 8 -78 -41 5 -9 19 0 38 -53 51 131
5200 131 -234 -136 -83 18 -68 -108 -148 103 -79 -195 -30 -49 -163 -60 -148 65 34 -163 -7 -9 104 59 -69 96
5224 96 172 -125 5 10 258 -34 -196 -48 65 -56 20 36 -40 -123 7 62 -6 -139 -58 14 67 -61 -97 16 -5
5249 -5 -142 -36 81 79 -96 -165 -8 133 -36 -122 46 130 -64 161 33 133 -62 -63 211 -47 -71 -66 78 106
5273 106 -91 -19 139 32 32 -22 -36 94 -124 132 6 17 -197 -39 166 9 -195 -90 91 -100 -12 -236
5295 -236 107 -122 -35 -178 112 -94 -134 -142 -172 -81 11 -104 25 156 22 -20 17 21 -97 9 -52 -8 -30 -44 -6
5320fJ05n9j24J27j32L4MK92l27J12p3J34J29l58o2J76N4j22K7K17l45O4p9J61
5344e1J44k66R8M8K19k18n4K25k17k5O5q0J84j9j77P6Rr6PK77n0m8R6l15j4J04
5370g8J02P3K0j24r7L07j03k05j92L57Jj04l8J40J34j97j58K32K58m01K1K21j28
5393D1O4j84L0J86k08j14J93j5R4k56J50o2J44j28J09O7n6k47P1L31k95J64q8
5416ij1q3L00k09J12J52l12R7K33k71o8J65J16r4k20J52m8L5l0j14K28q5k27L57
5440A66%j95q5pk1J81k6k6J62r8j88L5K49j38J07j34L7m1j22K00L6M3j01r2K15
5465A57k38J19M6q4m6J07j1Q2j26q2J20K09k63j19N6R4j9l8j1M4O3r4k14J97L47
5490B96m45k2L05j34m0P2j08K27j23L6j15K59l96J20J51j96J00R0p1mj06J77Q
$$ plain form
5320 -6 99 40 -84 43 -89 -55 -51 241 -86 26 -47 87 216 -142 -204 -28 26 -96 -69 148 -197 -133 -212 -51
5344 -51 93 -173 -75 -27 192 -26 -80 145 -72 -97 -32 -112 72 53 -124 -48 -39 -135 -128 149 99 51 147 -168 -182 -78
5370 -78 24 97 117 -7 -104 203 100 -105 -297 60 61 -43 -81 59 193 -4 -162 70 328 -73 -52 169 41
5393 41 105 -79 -49 137 -71 -185 8 -7 87 -169 -19 -81 63 -65 44 111 55 -192 -121 210 -85 79 -9
5416 -9 -20 -103 197 -12 100 252 -60 37 270 -1 -69 96 212 118 -102 50 2 37 7 -107 121 36 -191 166
5440 166 166 -29 -114 -121 -142 39 13 -13 149 51 -137 -102 147 9 116 -18 19 -22 -144 56 92 135 34 -58 157
5465 157 -81 38 84 0 -46 61 50 132 6 -76 44 253 -10 -129 -73 21 2 -36 -47 -3 60 -34 -248 -51 296
5490 296 -149 -171 134 0 -40 32 -76 151 28 64 -51 208 -188 -68 83 -113 -13 77 6 2 -104 73 81
5513H1k5q0L3K62j22l04K14j0p7p3m0J17K84k62l16M72Ol29K13j3l3J37k55j46
5537b66M69n2l20J48J81j32m7J2n8J9K72j92J10rj83J41Oj40P1R6q8j03R9K0o6
5562a2l0j3J83J88n28j8K68L0k54R4K14l0M7k33RK27l6l89K33J22j11OO4P1j54
5587e2M2o4J88Q8l10J58O8k71J43N4o1K9Q9j69k3MO8P6pk37N3J76j02P3l8j07
5613a32K45K7m16J64L47j95j45J98J5o2k0l9l2J31ok76L96k4l40K19J51m20K29
5636A5j61Q8L0K9l16M57o3j69n3J46J0j23J95n8j65K5k6K54R8k79p1J15P2r6J82
5661A36j93P2Kp5J09L4q4j29M86l19j05Q6m6J87j77k38J96J59j24MQ5J05l59K08
5685B0J4o4J77j01j75K59m7j34K2J49k41M2J15J3k39L05M2j86Km1R6J88k38J4
$$ plain form
5513 81 56 -24 9 271 149 -155 59 49 -28 -101 -141 -24 260 -2 -318 154 160 -169 44 31 -2 135 -120 -266
5537 -266 203 151 -169 -21 160 28 -19 -7 -65 -46 226 34 144 135 -48 93 99 -41 30 126 38 -65 34 54 -12
5562 -12 -42 -55 128 316 -212 -230 38 68 -186 -92 122 92 139 -94 -85 142 106 -283 -50 72 -39 -33 31 102 -52
5587 -52 -10 -74 114 202 -108 50 118 -153 -10 44 -17 12 101 -68 -91 -87 -19 57 50 -187 -134 42 -60 13 -25 -132
5613 -132 113 140 -276 -112 235 40 -105 93 108 46 26 -13 -45 86 80 -196 200 176 -164 55 206 -214 15
5636 15 -146 -58 -28 1 -315 142 79 -90 -143 3 13 -110 85 27 -138 -113 -139 115 213 -66 -137 -22 50 -46 136
5661 136 -57 15 17 -58 51 85 1 -128 358 39 -66 20 -26 161 -16 -254 -58 101 -23 -19 66 171 -188 20
5685 20 34 -30 147 46 -129 130 83 -51 -29 120 -121 -79 36 49 -190 115 157 -29 -27 -68 28 216 -22 -8
5709hJ0J41j81j3J56J2Ok13K50j06p9j62K37k5k12K77j19l0j79J83l2L12j98j31
5733a04J61L2q5j85J54Q3rj15J11N7j26r0L09j37k23J53K12m30J73N4R1K8nk39
5757a30J60J21j62l0Q5l6n9P9l8PR8k89J57J08q5j21N8J89k69K53k14J18KO7k12
5782a43K65j88O7L0K0M4m2J8l5o6P9r5N4J1j34J52m7M3k56L44R2k30p4K6K42j06
5808G1k27K37N2k04J55j85K06p5oq7K01jm0nJ49j32j59J86r0r0R3j39R5K9m5J30
5834A19O6k00j52K57k5m8p6K22j93Pj74J46K21j10l60K01J54nj71J5O7J13k23
5857a49L4J46R8m7k82K24M0j47QJ13o3O2J12j47R8j50kO3j2k4K13j61p1M7j92
5882a89L35k27J1o3K38j06j63J09K10l7p0j90J34J64k83o0K92J17k04j20J47L1
$$ plain form
5709 -8 2 143 -38 -51 105 117 123 -90 160 54 -25 -187 50 25 -187 90 -29 -59 -238 -55 -87 225 27 -104
5733 -104 57 89 4 -181 -27 56 47 -68 43 100 -26 -116 193 56 -167 -14 198 -232 -59 -5 86 114 109 -130
5757 -130 30 151 -11 -41 44 8 -51 28 -10 -3 95 -194 -37 71 -14 -135 -77 112 -157 96 -118 0 2 69 -143
5782 -143 122 -66 1 31 51 95 53 71 36 -30 49 -46 8 19 -115 37 -10 33 -223 121 213 -17 -91 -65 177 71
5808 71 -156 81 133 -71 84 -101 105 30 24 -63 138 137 97 92 241 109 -50 136 46 -44 49 -90 5 34 -11 119
5834 119 185 -15 -167 90 65 17 -59 163 -30 -23 -197 -51 170 60 -300 -99 55 50 -121 -106 -39 74 -149
5857 -149 -115 31 129 82 -200 24 64 -83 -75 38 -25 37 149 2 100 -50 -52 11 -1 -25 188 27 -44 3 -189
5882 -189 146 -81 -70 -133 105 -1 -164 -55 155 118 48 -142 -8 156 -127 -187 105 222 18 -102 45 76
5904G6q7J07l1j20R0j3ll5L2J01o2Q2j09l0o2P8j1KmP6j70pK46j38O4j58J38n1
5932Aj83J19J91n1j20K7Q6R9k91N7J71L3j83m1K47m6J9j13r4PR6p4K27k11L2m
5958AJ75r1k7k17K13J76l98O4K22j71l1j40L04O8j99j47J57Q3n9K13k87J01j0
5981@j16K37j39om2J32J24k19M8j01K47j6k24J23k3r1J19j9L2j31p2R1J52k82
6005a76J33p5J77pk02K24J12k58j03L69j84J6M7P3j00Mj46J64n8L2j97J99P1k55
6029a40P8J8O2l6M2k2J46j03j87J19J33n6j57O7R6r9n1QJ66j8j20o3J86J4k09
6054a26rK42j29L5M7m1q3J8k2K32j65L5o4P8N6j78O4K16k77M0J95j76%k3j53L06
6080A18o9p5J03M8q0j81R7p3J49j13J63j28JJ91j92k3M5J23l9q7L8n3Lj1MJ8Q0
$$ plain form
5904 76 -11 96 65 -55 35 22 19 -16 16 117 55 137 28 -2 -64 14 3 5 1 77 -93 -100 146 8 72 -86 52 1
5932 1 -182 -63 128 77 -43 -16 70 169 -122 -65 106 139 -44 -85 162 116 135 22 -72 -65 31 -43 184 -27 5 1
5958 1 176 85 58 -159 54 230 -168 -104 118 -53 -84 -224 80 148 -51 -198 -41 42 -17 196 -91 10 0
5981 0 -116 121 -18 -24 -66 66 190 -29 19 -82 165 149 -75 48 25 -66 53 34 66 -65 -137 -46 106 -176
6005 -176 -43 -118 59 52 -150 74 186 -72 -175 194 10 26 73 146 46 50 -96 68 10 42 -155 44 115 -140
6029 -140 -62 -44 18 -18 24 2 148 45 -142 -23 110 54 -103 -36 60 -39 -90 -82 84 66 -54 -117 69 83 -126
6054 -126 -135 107 -22 13 60 19 -64 -46 -68 164 -1 34 -30 48 104 -74 -10 206 -71 -31 164 -12 -12 -35 -188 118
6080 118 49 -26 77 125 45 -136 -39 -112 37 -76 87 -41 -40 151 -41 -64 -19 104 65 -22 16 -37 -34 -45 -41 -23 57
6107E7Q4p6j65J05M6N3j42J78k7j30j13J27J59p5k57R6L49j62k91n6M85j11j36
6130bo8J33k9j60k9K26k1p3j09K28m7j35o7K16p0n9J38M8j80M6k3O1P9k58J27
6155b8J63J4k83J8J30R4k04kK38n3k74j5K57L5q4k51K12J38o5j23O7J01Nj85Q6
6180iJ47k0j82N0Q4n2M0j74K02n9J53k71J37j17J56K2r5k28J82Q5k0j27J3J35
6204E2P9k42N4J55j4o7j16K19O1j19j73L9J10p8j0l1K18J4j1k45j1O0R2O8j08
6229dk0N0l4N7K6l9L6K1l01J74Q7Nr7l6J9J80j28j5Q4l2k43J99M9j79J36n8l8
6256a01J71O7j84M0J88n0l31J67K0K19j14j73R4P0j13j07J36o4R1m2J0mj8J0M0
6281B2j1j20J51L3Q0j35Q1n8k8L9q6J05J3p0j53J58J42k16J49j7P4k49N4K20k87
$$ plain form
6107 57 141 65 -100 5 51 104 -38 140 113 -17 -130 -3 156 81 -176 -80 269 107 -184 -240 245 134 -2
6130 -2 -70 63 34 -126 -155 71 50 -23 -132 96 49 -86 -153 63 -7 -66 72 120 -60 -14 -37 24 103 -155 -28
6155 -28 135 149 -134 -116 14 108 -96 -98 140 87 -187 -202 55 90 6 -245 -33 105 40 -83 -16 85 90 -95 -9
6180 -9 138 118 -64 -14 70 18 58 -116 86 27 180 -91 46 -71 85 107 12 -216 -34 51 31 -96 -83 52
6204 52 131 -111 -57 98 84 17 -99 120 181 62 -111 -72 38 -40 -50 -81 137 151 140 -105 -116 -56 36 104 -4
6229 -4 -24 26 -8 49 75 36 72 93 -208 -34 53 58 -39 -75 -56 124 -4 -19 65 33 -210 -11 38 -141 -5 -63 -101
6256 -101 70 137 -47 -7 181 131 -200 -33 -13 206 92 -81 13 83 -30 -137 -1 -65 26 -16 -6 -10 -28 -18 22
6281 22 11 -109 42 75 155 20 101 43 15 54 -32 73 86 16 -137 21 163 -53 96 79 153 -96 -42 178 -109
6306a09J39o3P8J36j46j67J46J17k38P9p5K12j16j06R6r9mK3P5O7j86Q9J26j25
6330e1P4P9n4j17n4M6R6M2m6l8rj04J00OJ91n4j88J91j7j02k2p7J71K25k44j37
6356i3mJ27J9j92J75R5j53j45J58N3j18N8K4Q8j81q3K99j30J5j29R3%J62l08K59
6381H9M3k78J18J42m9j04L3J57j28l5l0J46P5k38m7K01J0j19r6K5R3L0l44L80
6405G4k2m7j86J95Q0k41J19J03k5P0k20P3p6J98p2l1j34J41k1p7M3O4j21j8L36
6430B05k82j13L33J33m50j6J15N7L9j75P2K85l00m5o4K76K3m08J81P3J82k64J11
6453c2J8k4O4p4K6J33k23J63m4k9p4P2p6k4n3K41J20k76Q4M6P9l5r5Q0J09j55
6479B1j16j5J55J12j33j77P4K59j53j62K09j37m5M1J41m8m8o5R0k2J49m1j85J85
$$ plain form
6306 -109 30 -33 45 181 35 -132 14 131 -107 -28 -103 109 -7 -113 -17 -116 -120 -97 -22 45 -141 -52 74 -51
6330 -51 23 102 48 -69 -123 -77 19 61 15 -23 -32 -136 -36 -30 161 107 -81 110 93 -9 -31 -108 63 288 44 -93
6356 -93 -97 30 49 -143 32 127 -26 -171 -13 40 -78 -20 4 92 -89 -172 127 -3 12 -117 -24 -24 138 -170 89
6381 89 132 -146 -28 114 65 -39 -6 151 23 -12 -42 104 179 -59 -106 95 105 -14 -110 -85 8 38 -306 74
6405 74 52 5 -181 14 94 -147 -28 75 50 120 -100 -27 -103 95 23 -8 -142 -1 -22 -99 -56 8 -113 -131 205
6430 205 -77 -190 143 276 -174 -190 -75 -18 21 -154 -82 203 -97 -142 -206 70 93 -315 -134 -61 121 -143 -32
6453 -32 -14 -38 26 -48 -22 111 -112 51 7 -22 -96 -24 -100 -124 -177 64 184 -92 -8 38 117 82 -13 67 176 21
6479 21 -95 -110 45 157 24 -153 -79 180 27 -135 74 -63 -108 -67 74 26 -22 -87 3 -19 130 89 -96 89
6503H9J7j11Q0k4j81K95j57j97J8J07P2k5m0J35PLj86M7J46j88q6K64R3Ok96P8
6529c4K02rl43K6K16j2k42MK98r9N2j43P0j3K4j15J30K6j6o4P4k5L0m0L6J24k67
6556a10j2l3K49k69L9J80L6j34j82K61O3j09Nj15L16l67J15L1J08k8j66J5K98
6579A91j39j34J67j7j67M0k5q5K53j10Q3Q8j65j25K53j95L0J75O7r5j20r9J13
6602a6R7j03p8J41J51j68q0j0M4K1j32rK39j32K3QR5j37j07K04o9Pp8R0J22j75
6628e2J32k32L44j14n5j05K77k07l10M38m8j03JJ39k4m1j88mK14j70m1K88m1j82
6652h4J43rp6P0j94K46L9j11j24L0M6J02l28L66j18N6p3m2L42l57j16L28P3j74
6676C5j39L9L18k20j11OO1K36l40K8J20N0n1n6O2J49k34p2J81j3m5r5K37l01J82
$$ plain form
6503 89 106 -5 75 51 -130 165 8 -189 -171 -64 8 -17 -57 78 85 88 -98 -51 95 -93 -179 85 178 184 -112 -34
6529 -34 168 159 -184 -158 58 46 -196 -192 106 7 59 -84 -14 -27 -3 -118 12 38 22 -42 32 7 37 -3 33 157 -110
6556 -110 -122 -155 94 -175 -136 44 80 -54 -236 25 88 -21 -16 -131 185 -182 -67 -36 72 44 -122 -107 191
6579 191 52 -82 85 68 -99 -59 -84 -169 84 -26 57 145 -20 -145 108 -87 -57 118 185 90 -30 -129 -16
6602 -16 81 -22 -100 41 192 24 -56 -66 -22 -1 -133 -142 97 -35 -12 -4 91 -46 -153 51 -18 -11 -89 1 123 -52
6628 -52 80 -152 192 78 23 -82 195 -12 -322 116 68 -35 -34 105 81 40 -148 -152 62 -108 -149 139 98 -84
6652 -84 59 50 -26 44 -150 96 135 24 -100 -70 -24 78 -250 116 -2 54 -19 -61 281 -76 -192 136 209 35
6676 35 -104 -65 253 33 -78 -72 -11 225 -115 -87 33 83 32 -24 38 187 -47 -119 62 49 4 -91 146 -155 27
6701B7P4L4k5j96J26K28j28j48j01J62L7j18o8J97j90l0k7J90k7p9j77K54J61
6724A76k18j9qP1n1R6k11K85n8k03M8P6m9N6R2j60Q6R8j85O8k1J20j1j02p1P1
6750b4J24j6k25O9Q1J01j10j18J83Q9j58j41J53r0j2q3J53O2J6k5k98L66p9n5
6774c7J4J59J6j86Q4m2lR4Nj38oj10J12J93k16M6R9M6j36q1L9J45j36j30R9L40
6800B70m17j28L22J0k13%P5K43r5j97N2K82k70j16L5K37j1q0r4Q9L7l4j00J09
6824FJ04j36M4K5n0J27j34J14j54n2R3o2K01l15K32J86k66q6K34j48J16j27n7
6847a05K41M9k96Q8L9m2j09N2K95r9j28j17N0K12k13P9J7N3k33L89l5k44L0J8
6871in4L1J0M8l6J70l21J06J37j27k8J07rrP9j53J28j01J12l32L08o1k75L55K9
$$ plain form
6701 27 101 135 110 -86 40 268 140 -8 -109 53 90 -28 -96 101 -89 -119 -146 44 17 -62 -239 15 176
6724 176 -42 -61 -69 2 -49 47 -164 121 63 -140 -92 -16 -65 -9 83 -77 9 107 -78 -10 -31 89 78 -24 -95 -24
6750 -24 100 84 -141 -72 9 110 0 -118 65 154 -4 -145 8 -82 -94 -177 -24 38 54 29 -269 97 18 -37
6774 -37 -23 136 152 -34 50 8 5 99 104 -34 -40 -150 -38 155 -61 -15 84 130 -6 -87 -48 97 -39 -169 -70 270
6800 270 -147 -275 47 57 -156 -156 -81 162 67 -130 -78 204 -66 -182 -147 90 79 -1 -95 -6 31 -3 -103 6
6824 6 110 -26 18 43 -7 120 -14 100 -54 -106 -13 -75 126 -189 43 229 -37 -123 111 -37 79 -48 -105
6847 -105 136 185 -111 -23 16 -26 -135 -83 212 113 -15 -132 -82 130 -83 -4 13 66 -167 222 187 -57 -27 -9
6871 -9 -63 -32 -22 26 -10 160 -161 -55 82 -45 -73 34 25 16 95 -58 70 -31 81 -251 57 -4 -279 76 105
6896A05p5J35k42jJ10k0n2J33j03P4L0j24J49p6k1R3qo8l7OO3k09K18O1k70P9
6922e0J1r3K09p2J8j35P6j06p1J92Kn5J58P8k53J2m7J18J17j34o4J51L2p0M4k01
6948a33J44O9lj39J09p8j64K39J28k86J73n5j19Q9j23O9J00J02l75q2M23j73J69
6971H4j91P3q0J13m3QJ04j74R9K74k51o1K87l27p3L70j38M7j39r9J74O0j80J7
6995d6J22l7j55LL09j49N2o0j12J48k30J07Q0j01R0J40q5j53J4J77j61nO5o4J02
7020E1Q8j34j3J84j75N7j07K1J10R7l85K14l5N3k15O2K73k94Q8P0P7Q1k80q6M69
7045B71k56k10J88o3M3m8o0M9J1J8P2k5KM1J86j29j26J21O2j59J52k15K04ORr0
7071E4J6J34l99J60j04K86p1j58J9j0K73k87n7L25p8j33k1M7J3K1j59M2j0J9R1
$$ plain form
6896 105 30 165 -77 -78 32 12 -40 93 -10 64 94 -30 119 43 22 115 107 39 2 8 71 -138 80 141 -129 -50
6922 -50 -39 -132 77 5 23 -112 -36 -142 -213 -21 -19 -74 84 162 -91 -79 -126 -8 109 -25 -89 62 94 24 68 -133
6948 -133 11 80 77 -62 47 -31 -195 44 172 -114 59 4 -115 -26 -149 -80 20 122 -253 -335 88 -85 84
6971 84 -107 -34 -114 -1 -44 -36 68 -106 -7 267 16 -45 242 -85 -158 212 74 121 -18 -117 57 117 -63 -46
6995 -46 76 39 -116 -113 196 47 99 39 -73 75 -155 -48 32 -69 21 161 76 -77 -63 114 -47 -52 13 -51 51
7020 51 139 5 -8 176 1 58 -49 -28 82 179 -206 8 -27 26 -189 -127 146 -148 -60 10 87 168 -112 -198 271
7045 271 15 -195 -7 -70 -27 -75 -135 -86 -75 -57 15 -10 -8 33 219 90 -36 85 147 -12 140 -75 129 135 144 54
7071 54 70 204 -195 -35 -139 147 76 -82 -63 -73 200 -87 -144 181 103 -30 -51 -4 9 30 -129 -87 -97 -78 13
7096A3l2J00k60R9J16k93K83%K4o3n0Q6K0j07m0K77R1j32k90J03OJ56l30K74J1
7121F2J3j51J79L9j0j39j25K13k14j6l7J85Q9j50K4K27j31N5j08l5l0J26M7r0
7145B3Q6j22K32m6j10j44MK61j76l2j03R7P1m6r5J45J39k11r2J81Q2k68J91j36
7169f9J28m8j20NP5J1k09L60j6j01j1P8k1j50J21k0m1J6j32J33N3p2JJ31j02N
7195Ej17P6K18j38r8R4J7j34J85j18Pj19m1J23K43j64j53j6J50J78j31j52p1J75
7219A9j26K1K04r1J3j40K21j49r4%N7P5j20K17kj14m4J05j8J92k41j4j71K15j50
7244a35K5J37j41R3M0J0k9n0K0R6jj22L7l4J01J8q0J5q3O1J62j40n1O1J17o2j16
7271e1N2m0m0K12j53J8N4j51J12N2r4p4J18K9k6k30L07k04M9j14K28J7P0k43J67
$$ plain form
7096 13 -19 81 -179 -80 36 -257 26 26 50 -13 -63 23 43 -64 -104 173 264 132 -158 -55 -49 107 -223 51 62
7121 62 75 -76 103 142 132 -7 -132 81 -133 -149 -186 -1 88 -62 -38 189 58 113 5 -30 -60 66 113 23
7145 23 109 -13 219 173 63 -81 -77 184 8 -24 -127 -30 41 -5 -100 45 184 -27 -119 62 144 -124 67 -69
7169 -69 59 11 -109 -104 -29 -18 -227 133 117 16 5 83 62 -88 33 13 -28 -12 -144 -11 42 -30 -29 102 0 5
7195 5 -112 -36 182 44 -54 40 57 -77 108 -10 -3 -122 -163 -40 203 39 -114 -130 20 198 67 -85 -156 19
7219 19 -107 -86 118 27 40 -100 121 -28 -122 -122 -65 10 -110 107 105 -9 -53 52 34 226 -15 -29 -200 15 -135
7244 -135 -110 27 -114 -21 19 29 0 -50 -30 66 65 -57 -20 -54 47 65 -15 0 -83 -22 140 0 -51 10 127 65 -51
7271 -51 1 -39 -79 133 -20 -2 52 -99 13 65 -29 -103 15 44 18 -212 95 -109 -60 -174 54 71 141 -102 65
7296F5n2J64j10k07O6J73m3k16J05J11p6L8j3J46j15k9N8O3j77r4O2K12m1j6k50
7321a76L00LJ2j84L8J53k16J91k48P6oln4L2O9n2L9Rj70J37J20mk48K31j05J12
7347E6m2O5q2P1J7k17J41R7j5j61lN0k6K3Pk1nk0k9N9P2Q9n1j9p7J07j08j38k1
7376a81L32j09q4JJ10Kql0p5n0R2j2J13n1J00k01QR9k1N4k64K03Rn3k4RJ44j52
7404c9m5l5J33J54k62R8o3n2N2j9J64l2J1oQ4j56O9r8r4J53rK8k0n3Q9MO9n5l6
7433C4m3J6j40QJ30J68k12l7k2J68j56J11j25N8J07l38OK64P6j82l2l4J85n9q2
7458a31J47M4K8j70k3J90j09J97k08J69j97rM7J28k38J77K4j14p0L1J46j07j04
7481a52J76r7J71j87jnl6K56j61PJ08j37Qr1J67l1m0nNjQ8j07O5J48j12m5m1m0
$$ plain form
7296 65 13 177 67 -140 -74 99 56 -160 -55 56 -20 18 5 151 36 7 65 128 -49 -143 -81 131 90 74 -176
7321 -176 124 127 139 -45 -7 146 -70 121 -127 -51 -57 -60 -114 -82 -13 -65 -26 -17 -187 -50 70 66 -182 49 -56 56
7347 56 14 79 -3 68 85 -132 9 106 91 -70 -73 -23 -49 -26 -19 -40 -45 -65 -94 -35 37 126 75 56 -21 86 -22 -160 -181
7376 -181 151 42 -42 -41 69 71 63 33 -42 -92 0 -12 101 50 150 -51 -43 56 35 89 -175 28 37 -16 -40 -31 113 -39
7404 -39 -84 -119 14 168 -94 4 -59 -111 -59 -78 86 54 65 59 143 -13 56 -42 -136 17 8 36 16 -37 52 56 125 70 34
7433 34 -9 7 -133 -125 5 173 -39 -76 -98 70 -86 25 -100 -42 65 -273 -267 -3 73 -109 -141 -175 10 -49 -131
7458 -131 16 60 88 -82 -105 85 -24 173 -35 134 -63 -72 -25 103 -135 42 66 -48 -118 -87 59 -48 -152
7481 -152 24 -73 98 -89 -90 -95 -131 125 -36 -29 79 -58 -50 -141 26 -5 -45 -50 -45 -46 42 -65 0 148 36 -9 -50 -90
7509i0K25j76R8q7O2lj65J25j87K66n0j21J16J49j93r4J97r7K7J19j54p8K26j56
7533d1M6jQ6r5l0p6O3o6J78n6n4m0Q7l3O7j55Q6K12j80K1o0Q9M5l09J99j9l8Q1
7561Gp7p7K11j16m6L2R3n2J06q6j0M5m5J96j30m5k9K5j85K50j69J23J62k44J44
7586H3j55J64j31P7j41J01J08p6j17K04j57j31J77%j3k4Q1j71Q4K2m7n1P0L9l1
7611c5J70k2j09n2J03j39L2N2j43K13n7J2l7j3p1P1Q5j13k4j20J99M5m7o6J30
7636F4J6r2j3Q3o6l7L2L2Q5j35J0j1OLo4J29k33K68M7j11M5l4J45j34j24pJ37
7663D1p0P9p7J86p6r2j74J50JK5m7J27o4Q8l10K03Lq2P2K3J32q3k4n9m4J62j55
7690f5Q1JN5n6%L3n3J17j23m8J91j03nJ4j4J17k4Q1k81Q6m4N7j02M3J8J42J83
$$ plain form
7509 -90 135 -41 57 -30 32 29 -136 -11 -198 68 18 -103 13 162 -31 -125 72 -25 2 121 -33 -111 115 -41
7533 -41 5 4 90 -5 -35 -111 -48 -114 64 8 -46 -86 1 -32 35 -120 -34 178 -2 19 -41 48 93 -216 -17 -36 -74 7
7561 7 -70 -147 64 -52 -98 -66 27 -25 81 -5 -15 30 -15 181 51 6 -23 2 -183 67 -102 21 183 -61 83
7586 83 -72 92 -39 38 -103 -2 106 30 -87 117 -40 -171 6 6 -7 -31 50 -121 -37 -15 -62 -113 -43 -4 -35
7611 -35 135 113 4 -48 55 -84 -52 0 -143 70 13 25 -12 -25 -96 -25 60 -53 -77 -197 2 47 0 -66 64
7636 64 80 -12 -25 58 -8 -45 -13 19 104 -31 -21 -32 -26 -23 -87 42 -191 77 124 13 58 24 169 35 -89 -96 41
7663 41 -29 50 -27 159 83 -9 -183 -33 -32 -7 -54 73 9 97 -213 -10 -7 -89 -17 6 138 55 31 -28 -72 90 -65
7690 -65 16 17 72 16 16 49 -4 113 -10 -58 133 30 25 39 25 142 118 199 -82 4 -40 17 -85 -42 -24 118 301
7717C01j93l13K75Q3j50k53K53J73k69M9j0K17l12J54qK9l2J66k17N5K2m0Lj7
7741c4J34q2pp4J86m6n8j02%O4J00o5j7m0L5o8J61j25r4J27L5J0j30K09%k45K07
7768H1n7j5jKO2j32L7Kn5J05j74J97j65J03k4N2j64K10j59Q4K9l3J44r0M0n0k3
7795Fq0k9O5m7J05jj49O7Q3M6o2J28j85nN6Pr3o3Q7k0J00j1j1R1Rj60O7j11KJ64
7825E6JQo6J37J3k91L2J21qj9J6m7L5j16K30k8j18k8J47p5j43j49K62N8pk37J5
7852b01J62K3J7m0K6J13r2J31j36k0K7j28L52k35mm3J82k45J21No4P0l7L8j27
7877a05N6P5l5q6J32N1j29J4j63J17L5k6k8q8J50OP7j0r1J06Rj44R6M2j02J07
7903F6N5q6j2po9J87r5q5J25j50l2q6J72K01l49K42j96O5J32q4n9OO0l0j03P2
$$ plain form
7717 301 108 -205 70 153 3 -250 3 176 -93 -44 -54 163 -149 5 -3 26 -6 160 -57 -2 20 -20 -17 -34
7741 -34 100 18 11 -63 123 77 19 -83 -83 -19 81 16 -1 -41 -6 -74 87 -38 -132 -5 30 40 -90 119 119 -126 81
7768 81 24 9 8 10 72 -60 -23 -21 -76 29 -145 52 -113 -10 -34 18 -146 64 -95 -11 18 -15 129 39 79 29 6
7795 6 -74 -103 -38 -85 20 19 -130 -63 20 66 4 132 -53 -58 -2 5 -88 -151 -64 -84 16 5 -6 85 94 -66 1 -110 -108 56
7825 56 57 65 -1 136 149 -142 -110 11 3 -16 0 -47 -12 -128 102 74 -44 -72 75 0 -143 -292 -30 28 21 -216 -201
7852 -201 -39 -16 1 -39 -13 100 8 139 3 -17 10 -118 234 -1 -5 -48 134 -111 10 15 -49 21 -16 22 -105
7877 -105 -49 26 -9 -95 37 88 -41 -27 -190 -73 -38 -64 -92 -180 -30 -24 53 43 -48 58 67 -77 19 61 -41 66
7903 66 121 35 23 16 -53 134 39 -46 79 -71 -103 -189 -17 184 -165 77 -119 -54 78 -6 -65 -59 1 -29 -132 -60
7929f0O0rm9J91k72mL46q8n5mm8j12N2J25M3j3j00J84k95J67j06K5Q2p6J69k21
7955f8O9L6K8o0J09j65J14r8L0J7J5J50k51k8J29k45K81o3l9J03M2L7j48Q6k11
7980a30M4Q8k6kK2JJ24r3J0R7j83n1K48k44P7o2J19K2K0j60J55j78J51q2j28J55
8006fJ99k29j04K41r9N3r0j00K67j10k3j8L3J12o3l5j76J80M8j52J9J23k02J08
8030b4R1J2j40J42j17l8J40p2q1Q3M0j8q9J12J07l10l2K02R7j24J2L8%q8r3J63
8056A3j02J16P2j81J52q2j33J74n1J25Np7p7J35j00k3M3k49J42J36n1KJ72j90
8080b9L5J51k36L0j4K00r2r3O2kN8k9J9j2k16K07M4j41R6j55J64N0k19O2J35k5
8106E0j6lj70M9L3n2Q8mO2L2j05P5lr4q3J99Q9j34r6R2L5j5j37k0Q1J8pk9K06
$$ plain form
7929 -60 0 -9 -58 133 -139 -143 203 115 60 56 8 -104 -52 73 116 103 3 187 -108 59 -47 -22 60 -16 153 -68
7955 -68 1 37 65 5 114 -51 63 -35 -5 12 27 177 -74 -102 27 -218 63 0 -39 64 106 143 -5 81 -130
7980 -130 -86 2 -24 -26 -4 -3 121 28 38 135 -48 -99 149 -95 -18 -80 39 61 81 -79 76 -102 49 -33 -161 -6
8006 -6 193 -36 -140 101 2 55 -35 -135 132 22 -1 -19 14 126 63 28 -148 32 80 -72 -53 70 -132 -24
8030 -24 67 79 -61 81 -36 -74 66 -6 -87 -4 36 18 -71 41 148 -162 -194 8 105 -19 -7 31 31 -57 -150 13
8056 13 -89 27 99 -82 70 -12 -145 29 -22 103 108 31 -46 89 -11 -34 9 -240 -98 38 -13 -11 161 -29
8080 -29 6 157 -79 -49 -63 137 45 -48 14 12 70 41 60 48 -168 39 83 -58 38 -117 47 97 -122 -60 75 50
8106 50 34 31 -139 -90 -57 -109 -21 -25 37 69 -36 39 36 -58 -141 58 147 13 -83 9 44 29 -108 -128 -47 -29 -36 -65 141
8135A41j75kp2J86r2Ql7J10q2j78JJ10J2M6Q9J41k81L7l1P2o4P0p9J77j38n6L4
8162e3J10QM9k30N6O5l3J56k90J68j2l5J18j14L6m8J53k05O0J27j49J54m5n1J40
8187A35j79J54r0M4
$$ plain form
8135 141 -34 -36 -108 78 -14 -6 -43 67 -15 -193 -192 -82 -70 -24 65 206 -75 -38 -69 3 -61 9 -70 107 -31 -87 -53
8162 -53 57 65 114 -116 -60 5 -28 128 -162 6 -6 -41 77 -37 -1 -49 104 -101 -41 86 -63 91 46 -5 135
8187 135 -44 110 20 64
8191F4
$$ Imaginary data points
##PAGE= N=2
##DATA TABLE= (X++(I..I)), XYDATA
0@%%%%%%%%%%%JrJ6j6J6j6K4l2L8m6N6o5P4r0J06j22J40j64J90k16K47k82L21
34A71l63M08m60N18n80O46p20Q02q91R89j096J211j337J477j628J794j977K177
52A141k397K642k916L223l570L967m423M951n580O337p268Q448r999J2149j5340
67h635K0620l1387R1858k13233q5128L73143K2101k64836p2334K43909Q1457k02044
79d4509j07296J88000Q1835j44666n3941J08781j788m7663L2595k852l8740M4005
91A3761K0063m6290l3472L2689P0096k0428j04496L7721J07032n9314r3166O4186
103a1618O6782m3285l7482J2853J2685J8332n857l0323R057J4932k005Q388l3604
116b1145r445Q1377q238j05261K2948R0452k4702o3186J7907M9340l733m8260
$$ plain form
0 0 0 0 0 0 0 0 0 0 0 0 0 1 -8 8 -8 8 -8 16 -16 22 -24 32 -33 41 -49 57 -65 75 -89 101 -115 132 -150 171
34 171 -192 216 -244 274 -306 340 -380 422 -469 520 -576 635 -702 775 -853 941 -1036 1141
52 1141 -1256 1386 -1530 1693 -1877 2090 -2333 2618 -2962 3375 -3893 4555 -5444 6705 -8635
67 -8635 11985 -19402 72456 -140777 -225905 147238 169339 -95497 -167831 76078 157535 -44509
79 -44509 -151805 36195 118030 -26636 -80577 28204 26416 -21247 11348 8496 -30244 13761
91 13761 33824 -12466 -45938 -13249 56847 36419 -68077 -30356 76676 17362 -75804 -11618
103 -11618 55164 11879 -25603 -12750 -65 18267 12410 -17913 -8856 6076 4071 12459 -21145
116 -21145 -30590 50787 42549 -62712 -39764 50688 25986 -37200 -19293 30047 26314 -21946
128b1946j3281N1364J8654n2371k411L8937k5031o402L9580k6892k7361L9522
140A2362O587l4619o004K5407K8499k1236m8614K5603N2569l8459m5830M9217
152E482L1361m3382j1512J9157L82P067n623j6330J5903L415j2852J0953n429
165a408o675K8381j0036m2331K1645L7958k3988k0984K2721O718j4961p096J299
178h757J9243L576k8349Q681K0314k5128K633K8961k1768j7870K4944K702j9725
191a0543L733J5899M065j3897j7867J4837K4721k5001j9242L7913O255l7550N404
204a1273K0764o236l712l098N33J1980r509j1722J7396N382j4675L135K172j1039
218i902J1018R676j7114M171J6329j7903j1494J6411N908j976o719p764J4924
$$ plain form
128 -21946 -35227 16137 34791 -17580 -19991 18946 -6085 -12487 27093 201 -27160 12362
140 12362 18949 -15670 -21674 3733 32232 10996 -37618 -12015 40554 2095 -43735 5482
152 5482 36843 -6539 -18051 1106 1488 8555 2932 -13398 2505 5920 -6932 4021 -1408
165 -1408 -8083 20298 10262 -32069 -10424 27534 3546 -17438 5283 12001 -2960 -10056 -8757
178 -8757 10486 14062 -14287 -5606 14708 -10420 -7787 21174 -594 -18464 6480 9182 -10543
191 -10543 -6810 9089 13154 -743 -18610 -3773 20948 -4053 -23295 14618 20873 -16677 -11273
204 -11273 9491 3255 -457 -3555 -3022 8958 -551 -12273 5123 10505 -4170 -1035 1137 -9902
218 -9902 1116 10792 -6322 -2151 14178 -3725 -15219 1192 7100 5124 -1595 -9359 5565
231E565L515k3139Q695K4706j7791j8116J7311O415j0768M024M582m539k160l783
245e483L896Q620j0730j103J9261j3203j9759K1042J1657j9743k986J3450K038
258F957q104p882N874J4980o885j6603J0079Q854j2586K920R659q989J166O687
272F127j2570k742J3880K922n620o181j518J0648J96j4596O093J6663j2049j3440
286a2187J2190M927n481L644j561o832L613L592o94j582l335P861O357j9103p542
301a6133K6128N978k6229k091K2343R31j8492m869J6055J1667j6270j4871J7090
314A237J0651j5605k775J1174j024m981q57k433L978O328k839m136r30n58L768
329I98J560n750K949O775p746n305P536J312k148L506l977o476N267O769k946
$$ plain form
231 5565 9080 -14059 -5364 19342 1551 -16565 746 7161 -3607 417 4999 460 -1700 -5483
245 -5483 -1587 7033 -3697 -4800 14461 1258 -18501 2541 14198 -5545 -8531 4919 6957
258 6957 -1147 -9029 -3155 11825 4940 -11663 -1584 7270 -5316 -2396 7263 -1726 -560 6127
272 6127 -6443 -9185 4695 7617 1997 -4184 -5702 4946 5142 -9454 -3361 13302 1253 -12187
286 -12187 3 4930 -551 3093 1532 -5300 -1687 1905 1211 -371 -3706 4155 10512 -8591 -16133
301 -16133 9995 15973 -10256 -12347 9996 10927 -7565 -12434 3621 15288 -982 -15853 1237
314 1237 11888 -3717 -6492 4682 3658 -1323 -2180 -4613 -635 5693 2854 -1282 -2212 -2770 998
329 998 2558 -3192 -243 6532 -1214 -6519 1017 2329 181 3687 -290 -6766 -1499 5270 2324
344B324n906J327P891j184j4423J130K0421r97k1209K696J7477l818j4121J619
358f773J3618J763j3762l615J2813J938j0039K116O600n180l519M462K8k101L631
373A980K210l799n277N26Q061J134q303J117P307m134o044L908M714o56k337l224
389b817q57M669K886k943k899J150K712j348n822K608R707k401j0290J604P574
404C533j714m646J416L911p32l416j79K537j71o24K658k152n627M054O591n128
420C11n154O241N097p150p759O256R885m224r274L309P888m264p332M784P059
435E673l288n870K53L990J513j946j44Q80k056j265K073R50j0O06l80j529j289
452a839M31J691K025p57l698J25M285m23m336K02N403P90p337k523Q268M015p234
$$ plain form
344 2324 -3582 -2255 5636 4452 -9971 -8841 11580 10583 -10626 -7930 9547 5729 -8392 -6773
358 -6773 6845 8608 -5154 -8769 4044 5982 -4057 -1941 4659 -521 -4040 422 450 -1651 1980
373 1980 4190 391 -4886 -4360 3701 4835 -3468 -2351 4956 822 -5222 -1314 3400 2744 407 -2817
389 -2817 -3674 995 3881 938 -1961 -811 1901 553 -5269 -2661 7046 4645 -5645 -4041 3533
404 3533 1819 -2827 -1411 2500 1768 -1648 -1827 710 539 -85 2573 421 -5206 -1152 5439 311
420 311 -4843 1398 6495 -655 -8414 -2158 7727 3503 -5771 -2462 5426 1162 -6170 -1386 5673
435 5673 2385 -3485 -3232 758 2271 325 181 1061 -995 -2260 -187 763 753 1359 979 -550 -1839
452 -1839 -1408 283 2308 1551 -2147 -2022 2263 1840 -2496 -2294 3109 3899 -3438 -5961 2307 6322 -912
469i12m340O898M141q229n041Q413O718o496o773M213N605m229m296M606M144
484D422l640m561J616M174n1k779R00O85k188p86K243K519j204k164P20L29j565
501a330J64K120J732k222l120J460L304j419k621J486L386k284m591K526M556
516C147j780l272J148K394j776k962K562L794k042k754P45J922j735j659L458
531A190K342m009k037K237J609j477p98K165J35k814p16K175J488M5j422q39K29
548d97j41K67R96N07k44j382q77J066L77J07P62j12q97j859J101L213j637l194
566b444J991L576k833n378L741P200l567p310K930O825k517p671K536R121k085
581D115r430P21Q173M23o696j54N961n60n387q8M186J400k212j564N83l71N06
$$ plain form
469 -912 -5252 1646 5787 -2442 -7483 930 7648 1152 -5621 -1408 4197 -32 -4328 278 4422
484 4422 782 -3779 -2163 2011 1960 -819 81 766 -1422 -2208 35 2554 1350 -814 -94 235 -1330
501 -1330 -1166 954 2686 464 -2656 -1196 2108 689 -1932 -446 2940 656 -3935 -1409 3147
516 3147 1367 -1905 -757 1637 -139 -3101 -539 3255 1213 -1541 -796 1126 -609 -2268 1190
531 1190 3532 -477 -2514 -277 1332 -145 -943 1222 1357 -1457 -2173 2 1490 1535 113 -726 -497
548 -497 -638 -371 625 1132 888 -494 -1371 -305 72 179 941 829 -68 -1927 -826 2387 750 -2444
566 -2444 -453 3123 290 -5088 -1347 5853 2286 -5024 -2094 4731 2214 -5457 -2921 6200 4115
581 4115 -5315 -4594 3579 4002 -2694 -2848 3113 2553 -2834 -2922 1264 2664 452 -1112 -529 -900 -394
598c94J963o54j960N00J459q34j998R71L359J62l934j920L050L604k212m137J415
615a560M723m37o040j498P837L558q589m881P754N646o686o520O274P704n734
630A551q481L734Q309j765o780R57N022q32l547j83K313J988o76k434j592P07
646a709L949J239n191k215N467K395o059k515O233M216n579n867L232O855j090
661C361o781J58O142K96n114j946L835M433k342o253J002O265K59n387j266M520
677A182K647m088l788K718M754j177l999R3J633J185k1k554r19M020K117m944
693a141l857M138O439k556q434J176R324n18r988R9J0409J064r692l500Q550N317
709F830o434o523N486O208m749n424K811N070j75m503j782L435K908k901k448
$$ plain form
598 -394 1569 915 -1045 -545 914 80 -1918 -947 2412 2574 -1360 -3280 -230 3374 1162 -2975 -1560
615 -1560 3163 2726 -3314 -4812 3025 6583 -2006 -6887 867 6513 -173 -6693 -419 7285 1551
630 1551 -6930 -3196 5113 3348 -3432 -2475 2547 1715 -1832 -2015 298 2286 1610 -824 -2416 -1709
646 -1709 2240 3479 -1712 -3927 1540 3935 -2124 -4639 1594 5810 231 -5636 -2404 4451 3361
661 3361 -3420 -3262 2880 3176 -1938 -3884 -49 4384 2042 -4211 -3209 3056 3315 -2072 -3338 1182
677 1182 3829 -259 -4047 -1329 3425 2248 -1751 -1658 -25 1160 1139 -1415 -2334 1686 3803 -1141
693 -1141 -4998 -860 5579 3023 -5411 -4235 5089 4571 -5417 -5318 5091 6155 -3537 -7037 1513 6830
709 6830 396 -6127 -641 5567 818 -4606 -1795 3275 3100 -1403 -3185 250 3158 257 -2191
724b191J648J914l90j645q20J157K217o15k264p21R03K150O84l360j164M860R22
741C285n885j976N806L869m792n674L958O745l427p143L621O715l096o403J484
756b913N728P70m540k260L600K059l129j256K406R30k85j315j657J383K283j078
772G26j863L48J266L21p72j292Q13K257j172k141L03J518J105m43k414P8L373
789B011j047l864J329M242l73l748r02L313J534l527j354M022O43m150j58L606
805A577K1k383K05J101r14r99J186K089j293k419K052J561k965r69L321R91k691
822e29j312K112J372j529j621J587J390j792j478J934J138q79n49j72Q8O39r87
839e88m96J782Q26j853n94J285N64j548o94J901J361k871j622L631K107m180j952
$$ plain form
724 -2191 -543 1371 981 -664 -1484 -327 1890 1275 -989 -1710 -807 1343 2027 -1333 -2497 2363 3285
741 3285 -2600 -4576 1230 5099 307 -5367 -1409 5336 1909 -5234 -1613 5102 2006 -4397 -2913
756 -2913 2815 3585 -955 -3215 385 2444 -685 -1941 465 1395 1110 -205 -1862 -479 1804 726
772 726 -1137 -789 477 798 26 -1266 -453 1804 632 -1509 -1206 312 1417 974 -1440 -1362 2011
789 2011 964 -2900 -1571 2671 2298 -1450 -2352 961 2495 -1032 -2386 1636 2279 -1871 -2029 1577
805 1577 1598 -785 -580 521 -393 -1392 -206 1883 590 -1829 223 1784 -1181 -2150 1171 2162 -529
822 -529 -1841 271 1643 114 -1507 80 1470 -322 -1800 134 1272 393 -156 -328 -240 399 -588
839 -588 -1084 698 1524 -329 -923 362 926 -622 -1316 585 1946 -925 -2547 1084 3191 -989 -2941
856b941M259J349m290j332M471K345m467k868M008K449m128j797M071J231k819
871d59j528K491J012j935o16J389J44j262M07J765j146j654J805O15k022n07J873
888C72J121j188j305R71J037p13j397L47J354P33j313j424Q70K270m07l120P5
905a717L133Q7l121J31L220P38l729j592L320J303k183j088K109N99j415k19M08
922a6k19O7R55r00j391J182K477j025l153N89L613r02m062Q40M674J06m743o98
940b606M116P13l791q17L097J678k334j983J653J620n80j749l77J553P36j207
956b78o10R58J140p18j792J55J458L56o57OJ23R1j00M9n94o08J413J251k080j739
976b176K602K632k664l516K282L703k332l528K090M187j431m738P02M400m66l894
$$ plain form
856 -2941 1318 2667 -1623 -2955 1516 3861 -606 -3474 534 2983 -1145 -2942 1129 2360 -459
871 -459 -1987 504 1516 -419 -1035 354 498 -764 -357 1408 262 -1392 413 1028 -994 -1501 372
888 372 1493 305 -1000 -29 1008 295 -1102 -755 599 1332 19 -1405 -535 1735 1328 -1792 -1717
905 -1717 1416 1503 -1618 -1487 1733 2471 -1258 -2850 470 1773 -410 -1498 611 1210 -205 -424 -16
922 -16 -235 -168 787 -113 -1504 -322 2155 1130 -2023 -1434 2179 1277 -2785 -1945 2729 2835 -1908 -2606
940 -2606 1510 2223 -1568 -2385 712 2390 56 -1927 -274 1346 766 -983 -1360 193 929 -278
956 -278 -888 70 1210 492 -1300 -1145 313 669 12 18 141 232 132 181 -413 -1021 392 1643 -437 -2176
976 -2176 426 3058 394 -3122 -840 2863 531 -2997 -907 3280 1849 -2889 -2187 2213 1747 -2147
992b147K15L587N94l138q90K265P22j346r08N71J091j36o91N5K16J28k31m71J14
1011d00K63R46J91j197o76P79R00o61j182M92J889l09k275l5K625L35k837j205
1029b357L037J545k860j326K507J746k339k000J523K028j148j417O19J519l28
1044G49j233n2N31L14j18m51l89O88Q99m09r99k36J002J84j254k6J329O61r08
1063B82j234M07J028r1p00n76J225R85j574j069J326J213j065j678Q51J958n34
1080G54j730N05J772q07k066J074J438r27p55R33O20j036p46J200Q31j609o80
1097a229K115M87k337j64K204K38k353k59J797O38j669q72K279R74k577q97K005
1114C80P21j235o46Q34R06p23j382M20K114r00j858R88J150k53q96k31J277J18
$$ plain form
992 -2147 -1932 1655 2249 -889 -1779 486 1208 -138 -1046 -475 616 480 -211 -156 60 188 -43 -514 -400
1011 -400 -137 809 1000 -197 -873 -94 806 145 -1037 -545 1344 1035 -1240 -1275 1350 1685 -1152 -2357
1029 -2357 680 2225 -635 -1961 546 2292 -47 -2047 -524 1504 356 -1061 -442 1077 749
1044 749 -484 -536 -5 309 191 -260 -649 39 938 529 -470 -706 296 480 -774 -800 529 1190 282
1063 282 -952 -545 483 392 -308 -884 341 1326 -248 -1317 9 1222 157 -1521 -670 1288 754
1080 754 -976 -471 1301 494 -1572 -498 940 13 -742 191 811 -225 -971 229 1060 -549 -1229
1097 -1229 886 1373 -964 -1128 1076 1314 -1039 -1298 499 1137 -532 -1404 875 1849 -728 -1625 380
1114 380 1101 -134 -780 54 960 237 -1145 -725 1389 489 -1369 -381 769 516 -380 -611 666 784
1132G84j689l37K354O1k469P98J771j001j372M20J224L51j630l95K395k34k584
1149a553J005K012j400j167J002Q66m04o67j04J289k72k123R47J951j434j046
1165a098J900J10j211m16M45P20K68j401k09K202r41j401J297M68p97Nm20K10
1183b69J461q67j509J587M46j665N56P40p38M65j52n09O61j36q29J269J36k020
1201a373J178K031k099j052J874K21r16p04k54K218M65l379P69L507j949k808
1217b271J916J415n67p43q62J363J482k342r95K765l45k279J405N52p85R59m68
1234B00j139J477l91j411K083P6j979J212J166k201K95Q18j96M23m31j621K587
1251I68J114l804K84L430j315k028M92J001J177p68k660J915L021l712j817M059
$$ plain form
1132 784 -905 -1242 1112 1173 -1296 -498 1273 272 -1100 -680 544 895 -735 -1130 1265 1031 -1553
1149 -1553 -548 1464 64 -1103 -101 765 361 -306 -410 879 607 -1516 -569 1382 -52 -1098
1165 -1098 802 912 -299 -715 -270 450 718 -683 -892 1310 369 -1032 265 733 -64 -59 -479 -269
1183 -269 1192 325 -1184 403 849 -816 -260 480 -258 207 55 -454 207 71 -758 511 647 -1373
1201 -1373 -195 1836 -263 -1315 559 780 -136 -840 -1094 1124 1589 -1790 -1021 2486 537 -2271
1217 -2271 -355 1060 493 -250 -1112 251 1733 -609 -1604 1161 816 -1463 -58 494 -291 668 200
1234 200 -939 538 147 -1264 819 895 -1084 128 1294 -907 -612 206 10 433 2 -1619 968
1251 968 2082 -1722 -1438 1992 677 -1351 -859 142 1319 551 -2109 -194 2827 -885 -2702 1357
1267A357K45k284M97o3M70R32j974m19K801j198k077K486p9j654J615j54j766
1284a265J297L09r50J452o29j417K142J43k885J334K012j906j14P84r17J385K01
1301I76k914J649K321k712q41K443n76l43M06j502R15J597k503l27L310j621j352
1318a074K066j100j099K126p59j217J731o81o49J809j301j346L109p89l113K263
1334b4J558k134N62L53r87J773p82k620K864J658l448L46K168j581K01N49j695
1351a239J777J016l158N50L057j943j284J832q58k55J287j809P19K202k823r3
1367a022K754j856j644K802n7k127J559k88n33J540j762q76L292j331l156L279
1383E74J439l138Q60Q77j181J067l90j731K453O69l330J264K167k334L05J107
$$ plain form
1267 1357 1602 -682 -185 -248 222 1154 -820 -1239 1562 364 -1713 773 694 -960 655 501 -1265
1284 -1265 32 341 -609 843 214 -1203 939 1082 -1803 -469 1543 -363 -477 307 -610 775 976
1301 976 -1938 -289 2032 -680 -1521 922 346 3 409 -1093 -178 1419 -1084 -1411 1899 278 -1074
1318 -1074 992 -108 -1207 919 160 -1057 674 -7 -656 1153 -148 -1494 1615 826 -2287 -24
1334 -24 1534 -600 -38 315 -672 1101 319 -2301 563 2221 -1227 -881 1287 -294 -93 456 -1239
1351 -1239 538 1554 -1604 -1054 2003 60 -1224 608 -250 -505 782 -1027 -308 1894 -929 -1022
1367 -1022 1732 -124 -1768 1034 977 -1150 409 121 -412 1128 -634 -1510 1782 451 -2705 574
1383 574 2013 -1125 -265 612 -569 498 108 -1623 830 1499 -1831 -567 1600 -734 -429 678
1399F78j397R12Q88k302J014J963k537m00K458j663n39J742j064J2J674k348n2
1416i61K893k464j404L473q60k158J905N2j003J123j032n71K602j534k126L184
1432A119M13l191J600J384k315P01O79j038J312l03j794K043P41k967J352J979
1448A715k518j70K040j378N4J120j754P55J558k371K89K449k128n75J950j425
1464c89n71K181j680n80K596j373j592K554p84j437J620k05j241J628o83j250
1480a206K585o58k507K365N46k587J236J318j238K47m5j042J832r1k709K240J864
1497B150l351%K527j304n33J068j194N25J156k294P73K293k316m91K231j180j100
1514a040J808o98o52J512j250o53K241j199j576K521l31j716J159M8o51J426r38
$$ plain form
1399 678 -719 193 1081 -1221 -207 1756 -781 -1181 1277 -386 -925 817 -247 -235 1439 -909 -961
1416 -961 1932 -532 -1936 1537 677 -1481 424 476 -527 596 -436 -1007 1595 61 -2065 1119
1432 1119 1532 -1659 -59 1325 -990 -289 390 -648 664 361 -1433 610 1351 -1616 -264 1715
1448 1715 -803 -973 1067 -311 -257 863 -891 -136 1422 -949 -660 1789 -339 -914 1036 -389
1464 -389 -960 1221 -459 -1039 1557 184 -1408 1146 362 -1075 545 340 -901 727 44 -1206
1480 -1206 1379 721 -1786 579 1125 -1462 -226 1092 -146 101 56 -986 846 755 -1954 286 2150
1497 2150 -1201 -1201 1326 22 -511 557 -637 -112 1044 -1250 -477 1816 -500 -991 1240 60 -1040
1514 -1040 768 70 -582 930 -320 -973 1268 69 -1507 1014 683 -1033 126 174 -477 949 11
1531A1j391K397j76k544J680J501j880k6O14q68J236p4j525J569P82k638Q09J892
1549A369j612k78J343j182K8R47j118L00J073j550L07J478j638m26K049p46j258
1566i14J176l93k20Q70r60k30J891j009j600J796K35j231P91q7p55J256k78j503
1584a165J879K57j846O20P37r86O03M45j071N61L09j037O89Q72j461M92J105j584
1602e81j74J507n50l61K57n79P00O51j730J96J969j121j396J437K93p26M16m90
1620b82J17J093j038r58J533K60j313O51M20q19O25k53m75Q87L2j284J004M42
1638F42j255N02P93j050Q1M39m48N08J55j091J011N10j612J29J650m81j090M56
1656a51J26K62r5p55O44R99j345q24J794j15j022M52J86k13L44o49M9J043o51
$$ plain form
1531 11 -1380 1017 841 -1703 -23 1478 -402 -428 186 -682 554 480 -1045 524 1306 -1332 -523 1369
1549 1369 -243 -521 822 -360 -332 615 -503 -203 870 -680 -373 1105 -533 -959 1090 344 -914
1566 -914 262 -131 -351 519 -441 -671 1220 211 -1389 407 642 -589 202 115 -640 616 338 -1165
1584 -1165 714 971 -875 -255 482 -504 99 544 -527 34 343 -694 -5 867 -594 -102 1003 -581
1602 -581 -755 752 202 -159 98 -481 219 870 -860 -664 1305 184 -1212 225 518 -208 208 -282
1620 -282 -165 928 -110 -1068 465 725 -588 63 483 -336 289 36 -439 448 480 -804 200 642
1638 642 -613 -111 682 -368 -287 152 -296 212 367 -724 287 797 -815 -686 964 483 -607 -151
1656 -151 -25 237 142 -613 31 1030 -315 -1139 655 540 -482 -30 156 -57 287 -362 -313 730 79
1675G9q17R48K85r79M44L25l76K74q8n00N45N1m68M17M27r05J29M00k34J11J13
1696A81l95M12j7q45M47J112r42n38O07L34n16M9j17N30J05j136L09J065p25n36
1716f16R17P3n86n2K41K04l7k86M0O67n64p10J123K20q63j1M83j2k71KQ6L53l12
1739H9o05N84K85m10j10L28k02r1n2J1L94J72p16N5N18k68m10O08J02k89k73p6
1761c56L98M91q11j77R78k72r76M90P79l28o30O9O41M7o93j04J073j41r84J48
1781c58O20l6n44L09L02K5o36k1N56p2m30K10K59k98k89N21K86j72l48o3K76j24
1803b7l68M16M24j86n61p3M98J24m82kL85J45n85o0R11n7p16k37O67J45o20j62
1825d21O06M33o63l16K31M81m61j0L56O8n31K4J90K50m51o3N23j09n61K29N58
$$ plain form
1675 79 -738 210 495 -484 -40 285 -91 183 95 -405 140 191 -277 140 567 -338 -209 191 -43 68 181
1696 181 -214 198 181 -664 -217 895 -47 -585 22 356 -160 -111 -228 302 407 -729 -420 645 -80 -616
1716 -616 301 374 -212 -264 -23 181 144 -142 -102 565 1 -709 414 634 -229 -240 243 231 -40 -38 48 401 89
1739 89 -516 68 353 -57 -167 161 -41 -132 -184 -173 221 393 -323 -268 250 -18 -428 180 282 -7 -280 -356
1761 -356 42 533 -278 -455 523 251 -725 -235 544 216 -414 -345 296 343 -350 -454 619 478 -506 -358
1781 -358 262 226 -318 -9 293 318 -318 -339 217 145 -285 -75 184 -114 -403 118 404 232 -116 -179 97 -27
1803 -27 -395 21 445 259 -302 -375 123 247 -235 -237 148 293 -292 -352 559 502 -214 -451 216 361 -259 -421
1825 -421 185 618 -45 -361 -130 351 -110 -120 236 304 -227 -203 -13 237 -214 -277 246 137 -424 -195 363
1846C63j27k85j97N36j76n12J91Q11k69p01j41O51L28o15j22N28K1n85k42P22
1866A79M25n50n10N26J12k10l36O86K85o55l34L50M18n80m6L51K58n48k70N77
1886A28J79l49j35L82Q0p20L5P00M5m76k70N41o1m24kP56j1n94k02L49J99j40
1908A0j93M08Q4l55k88K54M42j42p14L44L98q2n37L49K40J00p63m8O39o4k34O8
1930h4N26l55n40K25N00k03k41J09L55m17k84L89M96o10k89M64K08l62k94N98
1950A91L61p43l28O21J98m32k75N77J59m92l80N96Q5Km23L17J92m1k92pL40K0
1972B46l79J7K28M4o7j95J74P0k50p5J83K9l9J33J4oj85J4L26j23l38J34L13j95
1996G3m00K93O52n14p55M32M98j07m35J59L98j40p71L44P66k99m23J92K53k37
$$ plain form
1846 363 236 -49 -246 290 114 -398 -207 604 335 -366 -507 144 472 -143 -265 263 284 -301 -543 179
1866 179 604 54 -456 70 182 -28 -364 322 607 -48 -382 -32 386 -194 -240 111 369 -179 -449 128
1886 128 307 -42 -177 205 285 -435 -400 300 345 -131 -401 140 79 -345 -347 409 398 -196 -398 -49 150 10
1908 10 -183 225 309 -46 -334 -80 362 220 -494 -150 248 166 -371 -22 218 318 -445 -493 146 82 -152 -84
1930 -84 442 87 -453 -228 272 69 -172 -63 292 -125 -409 -20 476 -134 -423 41 249 -113 -407 191
1950 191 552 -191 -519 102 300 -132 -407 170 329 -163 -543 53 138 140 -283 34 226 185 -107 -114 226 246
1972 246 -133 -116 112 156 89 -106 68 138 -112 -187 -4 25 -14 119 133 127 -58 -44 282 159 -179 -45 268 73
1996 73 -327 -34 618 104 -651 -219 279 172 -263 -104 294 154 -617 -273 493 194 -229 -37 216 -21
2016b1k62K95J89r9k50o8L01j73j3J63K23j80k86J66K28j57k3K14j69m3k24J55
2038c4K69k44jM0j36R4R4j66K17K59n76j6K85j6P5lQ6j75k22j26N98N0l83r9N79
2063D49j78n86K17L93Q7n37k60N45P5k63j27M19q1l87j53M21J15L6k31j1K98k77
2085c6j15K09J20k09o0Q2j01r0M15p1q2k64Q1J52N7l80L02L29k09o46K56M26K03
2108C69k14l84M58J70o78l02O94M62o07l51K62M52k4o63J33O17k77o09J66M89
2128A63J84k07m51J23L02r5l58K65K59k16J29j01k37K86K12j61l67L7L79J44l56
2149f6j71N29L9l77o78P07O89m75n42K57N60k91o66J79P88r8q45j76P50L47j70
2170B90m72N7O16m74k90J06N55J63n31k56j04N07o6l30M7J59J34n6n23K33P20
$$ plain form
2016 -21 -283 12 201 102 -148 -216 85 -88 -101 62 285 105 -181 -15 213 56 33 247 78 35 -189 -34
2038 -34 235 -9 -10 30 -106 -12 82 -84 133 392 -184 -200 85 69 144 141 227 52 -170 -296 302 352 -31 -130 449
2063 449 271 -315 -98 295 382 -155 -415 130 205 -58 -185 234 153 -234 -387 34 149 185 -46 -57 241 -36
2085 -36 -151 58 178 -31 -91 -9 -110 -200 215 144 62 -202 -121 31 88 -292 10 339 130 -516 -260 166 369
2108 369 155 -229 229 399 -279 -581 113 575 -32 -383 -121 331 307 -356 -223 394 117 -492 -326 163
2128 163 347 140 -311 -188 114 19 -339 -74 185 -31 98 -3 -240 46 258 97 -270 -233 146 290 -66
2149 -66 -237 292 331 -46 -724 -17 672 197 -345 -88 472 181 -485 -306 482 384 -461 -637 113 460 290
2170 290 -182 -125 491 17 -273 -167 388 551 20 -236 -340 167 101 -229 -182 -23 111 55 -468 -235 485
2191D85k0o99n3N38J23m10l76K78N29l81n44M3J030q8p19j13N86L83o79m27P20
2212B06N16o03m70J25O31j82l40k6J80J12o4r4n4K41Rj88k64J94M62Po09l8M23
2235A74J55n30k31L61O19n43n19J40R56l25n77K36L17J93o27l46N78M78k44o31
2255c66J55N41j03n62n3P96L7n54k41M49O2j44j24N7k2K9Q0j29j6K16O9j55m90
2278d68L28N52m0n90K7L05J47m64r7P86j39o24p9M24L48m08l64K13L95k57k16
2299b21J40K66m2k02l9J14p4k1J95R6j81m3j0j8K3L0K29k62j44L4K87N2l78J24
2323d5K34J18m47j82M59K17l96l11L18L9L8k09J71J93r4k59J77J43L2k89R5rj92
2346a99q2M75l4j04l61L41r4j64j65M52K87m29k22L61J69l70j46M44J40k30l56
$$ plain form
2191 485 465 -234 -287 251 374 -36 -412 -134 395 14 -530 -487 543 455 -264 -377 209 592 -87 -514 206
2212 206 722 119 -351 -226 405 223 -117 -143 37 149 85 -9 -63 178 187 -1 -265 -71 391 398 -211 -249 174
2235 174 329 -201 -432 -71 548 5 -514 -374 582 257 -320 -84 233 426 -201 -547 31 509 265 -366
2255 -366 -211 330 227 -335 -388 408 445 -109 -350 99 161 17 -107 -50 -72 -43 37 -92 -108 108 177 22 -468
2278 -468 -140 412 372 -218 -191 114 261 -203 -300 486 347 -277 -356 68 416 8 -356 -143 252 -5 -221
2299 -221 -81 185 143 -59 -98 16 -58 -79 116 212 31 -12 -22 -40 -17 13 242 -20 -164 -130 157 209 -169 -45
2323 -45 189 307 -140 -322 137 354 -42 -353 -35 4 42 -167 4 197 103 -156 21 164 196 -93 2 -7 -199
2346 -199 -281 194 160 56 -305 36 -58 -222 -387 65 352 -77 -299 62 231 -139 -285 159 299 69 -287
2367b87J88M06j23k81j10K96j03j13J04J49o2j57J09l7Q2p0J07k43J65j04Q6R8
2389A00l71J22J39K60l77j39L41J64k12l08K40L52l91P5L8J85Ll02k19L28J93
2410B21j79l00J92L39l01j40J32K51j5k73n2O8J85j72R6O7J13m68O0J02P1J08
2432A05j32Q5m24K32K38j18k12L04O9J6m98J73L24J27m86P4L41j55j48l9K80o2
2454I4j34k8o8J29J43N1nl27r8K45J77l92J64K09J0k89j04L78K08l85j23J97M0
2477I2k17P6p0J94j1l87J48L29k5k15j17M04j66j72M5RM06j86l88K69j9j67l2
2500b00L56j98j11J34kK12k01k19L63M1l91m9N73j35m67K69J79j12q6j65K36J03
2522A30k13j95M73p8k72J28Q4j25J68j62j38J98P8j70L0P5j42J34l9p7J15K17
$$ plain form
2367 -287 -99 307 184 -97 -207 89 -14 -127 -23 126 64 -93 16 -21 61 -9 98 -145 20 -84 2 100
2389 100 -271 -149 -10 250 -127 -266 75 239 27 -281 -41 311 -80 -5 33 218 221 -81 -300 28 221
2410 221 42 -258 -66 273 -28 -168 -36 215 200 -73 -125 -57 128 -44 52 119 232 -236 -176 -74 -3 105
2432 105 -27 58 -366 -134 104 -14 -226 78 147 163 -335 -162 162 289 -197 -123 218 63 -85 -124 156 94
2454 94 -40 -68 -136 -7 136 187 182 -145 -243 2 179 -213 -49 160 170 -119 -223 155 363 -22 -145 52 92
2477 92 -125 -49 -119 75 64 -323 -175 154 129 -86 -203 201 35 -137 -92 -83 323 137 -251 18 -1 -168 -200
2500 -200 156 -42 -153 -19 -21 191 -10 -229 134 175 -216 -265 308 173 -294 -25 154 42 -44 -209 27 130
2522 130 -83 -278 195 117 -155 -27 57 -68 100 -62 -200 -2 76 -94 -64 11 -131 3 -36 -113 2 219
2544B19k09Lp3J04R5jk39QJ44p3j6q0nM43j28n52J79O25k88l24J89J67j77j35
2568a24P7K75P0l90l53O10p9j40K31j04k46L86j81k11K70M0n4m7k43k8N31j41
2590A49m37L85O0k60o3M6J43O2k33j05J45M80m55j74N82k82j1n0j15K81J81n03
2612a74r6P01k23n76M31r6J45k0k43mM99l18j33K78k18k43K09J66l34L77J07j54
2634H1J0l52L16J83l20l91M57L04m64O5K28r9K15l13j59L27J39m70j1N43l87k01
2656b99L81j66P4J16m90L54M48n79k16O93j51k98K06l62K24J87j51j43M98k77
2676D9j96K15l4k16K94j63l05O25R6o01L47J33l50L58k97l23O71N3m81JL58n71
2698c37M25Q3l74L75J12n68K8P56m73k42K65l27L32K82o83K34N25m42k56J72K49
$$ plain form
2544 219 10 13 -60 44 139 138 -101 -93 51 -22 -38 -118 -123 320 192 -360 -181 444 156 -168 21 188 11 -124
2568 -124 -47 228 298 -92 -445 165 86 -54 177 73 -173 213 32 -179 91 131 77 30 -213 -241 290 149
2590 149 -288 97 157 -103 -166 -120 23 85 -148 -253 -108 372 -83 -257 325 43 32 -18 -133 148 329 -174
2612 -174 -270 431 208 -368 63 -33 112 92 -151 -155 344 26 -107 171 -47 -290 -81 85 -249 128 235 81
2634 81 91 -261 55 238 -82 -473 -16 288 -176 -111 117 18 233 -80 -239 88 227 -243 -254 289 -98 -299
2656 -299 82 -84 -10 106 -384 -30 418 -161 -377 316 165 -133 73 -289 -65 122 -29 -172 326 49
2676 49 -147 68 34 -182 112 -51 -356 269 365 -236 111 244 -106 252 -45 -368 303 356 -125 -124 234 -337
2698 -337 88 171 -203 172 284 -284 -256 500 27 -215 50 -277 55 337 -346 -112 413 -29 -285 -113 136
2719A36p7J34l85r0P13m24k71L29K6k83N13m61j96P77k08o60K79L45j21Om26j6
2741c60R06j18j086L27R90n15m33Q3K17N95m66r32Q16N14o35l08L98L6L25k18
2761A36n53L66O18o06n36O70L3o9k8k55LR36o40n94O79n1k77J84k66n9Q80k98
2783B73q31M37M52k90j94j47K37P78o38j025J101O62r76j66L75R7L08o01n90R64
2803B26O44j093l57O65P9n6j21m25M41O64r12k44R04j0m00j56k01M42M45q08l61
2824f34R47Rm48J24j97J96N53o07n28Q61K58p32N2P0J9N28m88q28J144L36j049
2845d14J56M87o5J05l56l03P19J24p39Q3M75j92k1r3l38M65L78p23k35P62j40
2866A35j20j10j32K92N16q74l36J007M1m93r6Q9L37J91p36k73R80O5q26R8N79
$$ plain form
2719 136 59 193 -192 -282 431 7 -264 65 91 -192 321 -140 -336 441 233 -427 -148 197 76 82 -344 -360
2741 -360 546 428 -658 -331 659 144 -289 -206 11 606 140 -792 24 538 -97 -405 -7 29 354 136
2761 136 -417 -51 567 -39 -575 95 128 59 31 -224 -221 715 75 -519 160 109 -168 16 -250 -309 571 273
2783 273 -558 -121 331 41 -153 -300 -63 715 77 -948 153 815 -161 -327 48 145 453 -148 -738 226
2803 226 870 -223 -580 85 164 108 -13 -438 3 667 -245 -489 415 405 5 -151 -352 90 535 -273 -634
2824 -634 313 322 -126 -2 -199 -3 550 -57 -585 276 534 -198 -146 -76 -57 471 -17 -845 299 635 -414
2845 -414 -258 229 164 269 -87 -390 329 453 -286 -203 272 80 59 -34 -372 93 471 -252 -487 275 135
2866 135 15 -95 -227 65 581 -293 -629 378 419 -74 -170 -81 256 447 -289 -562 418 483 -343 -245 334
2887C34j75j17k92j01P65k91o22M68L90n33JK66l97L98J31m36R7K93k82Q7J26
2908A10m01L46M19q01J10O16l15k30P2l03L38K68l94j63P12k23l90J04K07j10
2928b8K52l58l17R84k90n53L14K21l75J35j13p3L68o8l39K41K31o54N19P4m47
2949b76K63J66l55R6K79l22K55N3m96L22J64j16j44K68k15j16L84l05k0M29m10
2970i6qK34l58Q3K56j12l04P30k18l32L3J73k5J6l8j64M32l4m48j0K70r1J11k52
2994a52j05O85j19p29L01M79l45l07J73L7J24ll96L07L97l66j73L46m07J84K92
3015B23k28k55L20J13p9L6l29L73K79q99o6R05m0o27O0J20M69j06n84J48O82j59
3037C56p03L01J91l5j66p9P2M09k24n01K72M44l29j81j82K30L29o8l16O9N19l04
$$ plain form
2887 334 159 42 -250 -351 414 123 -499 -31 359 -174 -173 93 -304 94 225 -211 -114 179 -103 -16 110
2908 110 -291 55 474 -327 -217 399 84 -146 -74 -377 -39 229 -165 -328 384 161 -229 -125 82 -28
2928 -28 224 -134 -451 533 243 -310 4 225 -150 -15 -128 -201 167 99 -240 1 232 -422 97 171 -276
2949 -276 -13 153 -202 -106 173 -149 106 159 -337 -15 149 33 -111 157 -58 -174 210 -95 -115 314 -96
2970 -96 -104 130 -228 -145 111 -1 -305 425 207 -125 -92 81 56 72 34 -130 302 268 -180 -190 80 -11 100 -152
2994 -152 -257 428 309 -420 -119 360 15 -292 -119 -82 42 39 -357 -50 347 -19 -192 154 -253 -69 223
3015 223 -5 -260 60 173 94 130 -199 174 453 -446 -512 393 353 -274 -214 -94 375 269 -315 -167 515 356
3037 356 -347 -46 145 110 -56 -135 -63 346 122 -379 -107 337 8 -173 -355 -125 204 136 -180 -111 408 104
3059A04l22L20k31K06J70k87k30M03J40l77j98J36L79mn74l8Q83n4q87J90K79
3080HL46j82n95L16M53j31m52J66J64J86m15J34j21K81K04o23J7M82K3n21l0J36
3102a54M58n4m23q7N95k01m84L5K25L47j22m70J56N42k42k45j37L94o4j50j42
3123b23J97L68k95l47J68J83J06j71j4P4J12R7l50N5m0J22M6j17k83L75J55l92
3145a74j64L60L84o31k1K11L92k7n34p0M30m4m38j3M40J19j75k52L1M71k16m01
3167c22L16J62R5k19l35M46J38k88j46Q7K51j16R9k81K41O8k8j81j01J69j1J68
3189B12m24pM23K7m48Q8J15K01k18j99L44m2k0j62j29M98j00l44J38R7J71j32
3211H9l93K54N7J89k77j60M47N2k05l24L59M8j18q5M5L01j80J6j96n4J93M5j70
$$ plain form
3059 104 -218 102 -129 77 247 -40 -270 133 273 -104 -302 -166 213 209 -365 -403 480 426 -461 -271 8
3080 8 354 172 -423 -107 346 215 -237 -71 93 279 -136 -2 -123 158 362 -261 -244 238 261 -260 -290 -154
3102 -154 304 250 -173 -260 335 134 -350 -315 -90 257 135 -335 -179 363 121 -124 -261 133 69 -81 -223
3123 -223 -26 342 47 -300 -132 51 157 -14 -28 46 158 255 -95 -40 -80 42 88 -29 -312 63 218 -174
3145 -174 -338 22 406 -225 -246 -35 357 330 -204 -274 156 112 -326 -339 101 220 45 -207 -176 295 79 -322
3167 -322 -6 156 251 32 -303 143 281 -7 -153 -66 185 69 168 -113 128 196 168 -13 -114 55 44 212
3189 212 -212 -219 204 231 -217 -129 -14 187 -31 -230 114 72 52 -110 -239 259 159 -185 -47 50 221 89
3211 89 -304 -50 7 196 -81 -241 206 258 53 -271 88 136 18 -67 -22 279 99 115 -81 -135 58 103 -67
3234f7N7J81j04p2k84L66J80k90j78J10J58P0k05K03M1j33j03%R5k0l1j5K25k17
3258c3mJ72j30O5m2N8K4j9l5K6k0j68j41P7J64n0J2J63J8k83O0R8K03k59Q5p7
3284c6N9Q3l08J25K25o6j21j06K32J16j75k18L88J8m39j48L63K79l18j71K22P4
3306G8j15l12L82m8P7l97L08K10j16k98J59J27J37k41jJ21J1n9p2J1M2j04J8L3
3330d9PJ17l6L0j77Q3pR8j72L8P8M0N8p9r4K56j80l61M57K9M7k40j21L69j0l89
3356b08L0J71K00j64k45oL71p5k16n4J86K56k17k24J56L16K7m73j59M08J53m13
3378a80NK02L30l50m67K05L49J00m17RL95J49k97l09J81M07k35l93J33L08J78
3399C03m33k16L95J98r9n04J91M09j07j33n0J22P5J9k47j12J93L16l07k31%M33
$$ plain form
3234 -67 -10 171 67 -5 -289 77 257 -33 -211 -101 57 127 -78 125 166 33 -70 -70 25 5 -26 -41 184 -33
3258 -33 -37 135 5 70 28 86 110 91 56 82 62 -106 -247 -170 -6 -56 -44 119 137 -146 -86 12 215 -44 41 -36
3284 -36 23 106 -202 -77 148 82 -39 -145 87 203 28 -190 198 216 -223 -371 -8 271 -47 -218 4 78
3306 78 -37 -349 33 -15 62 -335 -27 183 67 -231 -72 55 192 -49 -50 71 82 23 -49 -38 4 -100 -82 -49
3330 -49 -42 75 39 69 -108 -25 -32 66 -106 -68 10 50 108 29 -65 191 11 -350 107 136 183 -57 -178 191 181 -208
3356 -208 -178 -7 193 29 -216 -222 149 74 -142 -196 -10 246 29 -195 -39 277 304 -169 -328 80 233 -180
3378 -180 -175 27 357 7 -460 -255 94 194 -223 -214 181 330 33 -276 -95 312 77 -316 -183 125 303
3399 303 -130 -346 49 247 148 -356 -165 244 137 4 -46 76 151 170 -77 -189 4 320 13 -218 -218 215
3421B15k8m29j11M90K77m04l76M58L93l39n57P7P47k10m42q0O37J79o86r0R9N82
3443D02l38l43J42M52m5m99p8M22N4j31k57K62K50j61l84Q7K15O3k3j99J4K73
3465A78q2l28l8P1N60j84m57J37M39j57l08J12K30mj98l57K40L98j97k14K6M13
3487B80n6m04J25N4K63j11l23N2K28N6l74j00M06M6k34j93K02L66r8l42o9L44
3509A18O1Kl46J18L33j19m16l4M42l0j86j82J98K95m37j8K73J64m29K9M9K17l8
$$ plain form
3421 215 187 -242 -353 137 414 10 -366 92 485 146 -411 -334 413 203 -239 -319 318 497 -189 -279 -180 402
3443 402 64 -279 -137 315 270 -229 -307 115 169 38 -219 43 293 132 -252 -165 50 113 90 -109 -95 178
3465 178 96 -232 -270 -199 361 177 -280 -143 296 139 -169 -57 173 169 -29 -386 -146 252 55 -159 -133 280
3487 280 224 -180 -55 -1 262 151 -172 -120 108 164 -210 -310 96 142 -92 -285 -83 283 185 -157 -226 118
3509 118 179 181 -165 -47 286 167 -249 -283 159 129 -57 -239 -41 254 -183 -201 72 236 -193 -164 -115 102 64
$$ [...]
8191A42
##END NTUPLES=NMR FID
##END=
