##TITLE=1H_LY-3Dix.HYD.1
 CD3CN,8 sc, 
 5.03.2021
##JCAMPDX= 6.0         $$ Bruker NMR JCAMP-DX V2.0
##DATA TYPE= NMR FID
##DATA CLASS= NTUPLES
##ORIGIN= UXNMR, Bruker Analytische Messtechnik GmbH
##OWNER= root
$$ XWIN-NMR		Version 3.5
$$ Fri Mar  5 12:12:18 2021 Russian Standard Time (UT+4h)  she@DPX200
##.OBSERVE FREQUENCY= 200.131506
##.OBSERVE NUCLEUS= ^1H
##.DELAY= (6, 6)
##.ACQUISITION MODE= SIMULTANEOUS
##.ACQUISITION SCHEME= undefined
##.AVERAGES= 8
##.DIGITISER RES= 18
##SPECTROMETER/DATA SYSTEM= spect
##.PULSE SEQUENCE= zg30
##.SOLVENT NAME= CD3CN
##.SHIFT REFERENCE= (INTERNAL, CD3CN, 0, 15.7039)
##AUDIT TRAIL= $$ (NUMBER, WHEN, WHO, WHERE, WHAT)
$$ ##TITLE= Audit trail, XWIN-NMR		Version 3.5
$$ ##JCAMPDX= 5.01
$$ ##ORIGIN= Bruker BioSpin GmbH
$$ ##OWNER= she
$$ F:/spectra/data/she/nmr/H-F/1/audita.txt
$$ ##AUDIT TRAIL=  $$ (NUMBER, WHEN, WHO, WHERE, WHAT)
(   1,<2021-03-05 12:11:01.90 +0400>,<she>,<DPX200>,
      <created by zg, POWCHK disabled, PULCHK disabled
       configuration hash MD5:
       00 E9 B6 7A A2 85 ED C7 34 08 36 98 17 FE 4E 26
       data hash MD5: 16K
       BD A6 4E 7A B8 29 ED 00 53 EE BD 32 69 53 A4 4B>)
$$ ##END=
$$ 
$$ hash MD5
$$ E8 2C 27 F9 E9 FA 62 10 FC 05 80 04 A5 E2 50 B7
##$RELAX= 
##$RELAX= 
##$RELAX= 
##$RELAX= 
##$RELAX= 
##$RELAX= 
$$ Bruker specific parameters
$$ --------------------------
##$DU= <F:/spectra>
##$EXPNO= 1
##$NAME= <H-F>
##$PROCNO= 1
##$TYPE= <nmr>
##$USER= <she>
##$AMP= (0..31)
100 100 100 100 100 100 100 100 100 100 100 100 100 100 100 100 100 100 
100 100 100 100 100 100 100 100 100 100 100 100 100 100 
##$AQSEQ= 0
##$AQ_mod= 1
##$AUNM= <au_zg>
##$AUTOPOS= <>
##$BF1= 200.13
##$BF2= 200.13
##$BF3= 200.13
##$BF4= 200.13
##$BF5= 200.13
##$BF6= 200.13
##$BF7= 200.13
##$BF8= 200.13
##$BYTORDA= 1
##$CFDGTYP= 0
##$CFRGTYP= 5
##$CHEMSTR= <none>
##$CNST= (0..31)
1 1 145 1 1 1 1 1 1 1 1 1 1 1 1 1 1 1 1 1 1 1 1 1 1 1 1 1 1 1 1 1 
##$CPDPRG= <>
##$CPDPRG1= <>
##$CPDPRG2= <>
##$CPDPRG3= <>
##$CPDPRG4= <mlev>
##$CPDPRG5= <mlev>
##$CPDPRG6= <mlev>
##$CPDPRG7= <mlev>
##$CPDPRG8= <mlev>
##$CPDPRGB= <>
##$CPDPRGT= <>
##$D= (0..31)
0 1.2 0 0 0 0 0 0 0 0.06 0 0.03 0 0 0 0 0.0002 0 0 0 0 0 0 0 0 0 0 0 0 
0 0 0 
##$DATE= 1614931861
##$DBL= (0..7)
120 120 120 120 120 120 120 120 
##$DBP= (0..7)
150 150 150 150 150 150 150 150 
##$DBP07= 0
##$DBPNAM0= <>
##$DBPNAM1= <>
##$DBPNAM2= <>
##$DBPNAM3= <>
##$DBPNAM4= <>
##$DBPNAM5= <>
##$DBPNAM6= <>
##$DBPNAM7= <>
##$DBPOAL= (0..7)
0.5 0.5 0.5 0.5 0.5 0.5 0.5 0.5 
##$DBPOFFS= (0..7)
0 0 0 0 0 0 0 0 
##$DE= 6
##$DECBNUC= <off>
##$DECIM= 32
##$DECNUC= <off>
##$DECSTAT= 4
##$DIGMOD= 1
##$DIGTYP= 9
##$DL= (0..7)
0 120 120 120 120 120 120 120 
##$DP= (0..7)
150 150 150 150 150 150 150 150 
##$DP07= 0
##$DPNAME0= <>
##$DPNAME1= <>
##$DPNAME2= <>
##$DPNAME3= <>
##$DPNAME4= <>
##$DPNAME5= <>
##$DPNAME6= <>
##$DPNAME7= <>
##$DPOAL= (0..7)
0.5 0.5 0.5 0.5 0.5 0.5 0.5 0.5 
##$DPOFFS= (0..7)
0 0 0 0 0 0 0 0 
##$DQDMODE= 0
##$DR= 18
##$DS= 0
##$DSLIST= <SSSSSSSSSSSSSSS>
$$ [...]
##$SUBNAM2= <"">
##$SUBNAM3= <"">
##$SUBNAM4= <"">
##$SUBNAM5= <"">
##$SUBNAM6= <"">
##$SUBNAM7= <"">
##$SUBNAM8= <"">
##$SUBNAM9= <"">
##$SW= 16.9725357007746
##$SWIBOX= (0..15)
0 0 2 0 0 0 0 0 0 0 0 0 0 0 0 0 
##$SW_h= 3396.73913043478
##$TD= 16384
##$TD0= 1
##$TE= 0
##$TE2= 300
##$TE3= 300
##$TEG= 300
##$TL= (0..7)
0 120 120 120 120 120 120 120 
##$TP= (0..7)
150 150 150 150 150 150 150 150 
##$TP07= 0
##$TPNAME0= <>
##$TPNAME1= <>
##$TPNAME2= <>
##$TPNAME3= <>
##$TPNAME4= <>
##$TPNAME5= <>
##$TPNAME6= <>
##$TPNAME7= <>
##$TPOAL= (0..7)
0.5 0.5 0.5 0.5 0.5 0.5 0.5 0.5 
##$TPOFFS= (0..7)
0 0 0 0 0 0 0 0 
##$TUNHIN= 0
##$TUNHOUT= 0
##$TUNXOUT= 0
##$USERA1= <user>
##$USERA2= <user>
##$USERA3= <user>
##$USERA4= <user>
##$USERA5= <user>
##$V9= 5
##$VALIST= <valist>
##$VCLIST= <CCCCCCCCCCCCCCC>
##$VD= 0
##$VDLIST= <DDDDDDDDDDDDDDD>
##$VPLIST= <PPPPPPPPPPPPPPP>
##$VTLIST= <TTTTTTTTTTTTTTT>
##$WBST= 1024
##$WBSW= 4
##$XGAIN= (0..3)
0 0 0 0 
##$XL= 0
##$YL= 0
##$YMAX_a= 306165
##$YMIN_a= -306524
##$ZGOPTNS= <>
##$ZL1= 120
##$ZL2= 120
##$ZL3= 120
##$ZL4= 120
##$ABSF1= 10
##$ABSF2= 0
##$ABSG= 5
##$ABSL= 3
##$ALPHA= 0
##$AQORDER= 0
##$ASSFAC= 0
##$ASSFACI= 0
##$ASSFACX= 0
##$ASSWID= 0
##$AUNMP= <proc_1d>
##$AZFE= 0.1
##$AZFW= 0.1
##$BCFW= 1
##$BC_mod= 2
##$BYTORDP= 1
##$COROFFS= 0
##$CY= 11.3945322036743
##$DATMOD= 1
##$DC= 2
##$DFILT= <>
##$DTYPP= 0
##$F1P= 15.9154993809931
##$F2P= -4.1035820241983
##$FCOR= 0.5
##$FTSIZE= 0
##$FT_mod= 4
##$GAMMA= 1
##$GB= 0.15
##$INTBC= 1
##$INTSCL= 1
##$ISEN= 128
##$LB= 0.24
##$LEV0= 0
##$LPBIN= 0
##$MAXI= 10000
##$MC2= 0
##$MEAN= 0
##$ME_mod= 0
##$MI= 1.114404
##$NCOEF= 0
##$NC_proc= 0
##$NLEV= 6
##$NOISF1= 3.799351
##$NOISF2= 2.8
##$NSP= 1
##$NTH_PI= 0
##$NZP= 0
##$OFFSET= 15.70392
##$PC= 1
##$PHC0= -11126.85
##$PHC1= 16.40094
##$PH_mod= 1
##$PKNL= yes
##$PPARMOD= 0
##$PSCAL= 0
##$PSIGN= 0
##$REVERSE= no
##$SF= 200.130013532006
##$SI= 16384
##$SIGF1= 3
##$SIGF2= 2
##$SINO= 400
##$SIOLD= 16384
##$SREGLST= <1H.CDCl3>
##$SSB= 0
##$STSI= 0
##$STSR= 0
##$SW_p= 3612.71676300578
##$SYMM= 0
##$S_DEV= 0
##$TDeff= 0
##$TDoff= 0
##$TI= <>
##$TILT= no
##$TM1= 0
##$TM2= 0
##$TOPLEV= 0
##$USERP1= <user>
##$USERP2= <user>
##$USERP3= <user>
##$USERP4= <user>
##$USERP5= <user>
##$WDW= 1
##$XDIM= 8192
##$YMAX_p= 0
##$YMIN_p= 0
$$ End of Bruker specific parameters
$$ ---------------------------------
##NTUPLES= NMR FID
##VAR_NAME=  TIME,          FID/REAL,        FID/IMAG
##SYMBOL=    X,             R,               I
##VAR_TYPE=  INDEPENDENT,   DEPENDENT,       DEPENDENT
##VAR_FORM=  AFFN,          ASDF,            ASDF
##VAR_DIM=   8192,          8192,            8192
##UNITS=     SECONDS,       ARBITRARY UNITS, ARBITRARY UNITS
##FACTOR=    0.0002944,     1,               1
##FIRST=     0,             0,               0
##LAST=      2.4114304,     0,               0
##MIN=       0,             -306524,         0
##MAX=       2.4114304,     306165,          0
$$ Real data points
##PAGE= N=1
##DATA TABLE= (X++(R..R)), XYDATA
$$ [...]
$$ plain form
1760 144 371 -16 -217 318 523 -338 -637 355 458 -295 -153 303 101 -346 -374 368 531 -301 -348 287 300
1781 300 -482 -147 467 428 -525 -403 -95 368 -168 -267 530 279 -574 -473 402 388 -82 -240 217 95 -332
1802 -332 -293 415 413 -452 -805 350 352 -316 -230 581 510 -582 -1098 273 847 -260 -699 282 755 -415 -1071
1823 -1071 36 847 -6 -950 -392 703 291 -821 -293 694 512 -573 -820 96 640 133 -348 89
1841 89 136 -160 -299 114 353 312 -137 -345 -200 215 356 134 -250 -220 49 83 -304 -175 546 343 -325 -641
1863 -641 -50 551 337 -302 -66 379 325 -134 -475 148 567 26 -475 -259 283 469 -192 -205 44 392 -249
1884 -249 -754 -176 744 741 -557 -885 387 617 -348 -583 406 1061 -30 -1179 -282 967 481 -734 -597
1903 -597 563 510 -599 -464 679 658 -458 -806 35 401 -134 -21 339 217 -411 -421 286 94 -471 -112
$$ packed form
1760A44K27l87k01N35K05q61k99R92J03p53J42M56k02m47k8P42J63q32m7O35J3
1781C00p82L35O14l9r53J22L08M63n36r9P97k51q53J01Q75j4m70j58M57j22m27
1802c32L9P08kq65l53J155Ko68Q6Q11p1j092n16J371N74j107m39R81M73j170o56
1823a071J107Q11q53r44N58J095m12j112N28R87j82j085k47R16N44n07m81M37
1841H9M7k96j39M13K39m1m49k08J45M15J41k22l84L0K69L4l87J29P21k03o68l16
1863f41N91O01k14o39K36M45n4m59l41O23M19n41n01K16N42J86o61j3K49L48o41
1884b49n05N78R20lj298l28J272K30r65k35R89O55j091j149Q97J249m86j215J37
1903e97J160n3j109J35J143k1j116l48Q41L66n35J13L60j22o28j0P07j92n65L59
$$ plain form
1923 -112 679 63 -863 -37 1229 274 -1203 -558 966 656 -1156 -895 1334 1478 -1023 -1664 613 1599
1941 1599 -602 -1535 529 1776 -228 -2188 -229 1863 738 -1515 -663 1411 667 -1190 -760 1246
1957 1246 925 -1155 -1144 598 960 -241 -496 449 347 -634 -561 361 601 -259 -325 421 38 -766 -132 984
1977 984 165 -920 -275 981 370 -927 -313 993 542 -1181 -953 942 997 -625 -810 748 985 -876
1995 -876 -1233 607 1449 -308 -1242 5 842 -188 -904 57 959 -83 -1124 -249 872 276 -552 -30
2013 -30 479 -37 -851 -178 823 387 -506 -275 512 42 -673 -174 733 171 -536 -323 544 274 -236 -253
2033 -253 372 259 -467 -435 500 499 -53 -95 1 -13 -97 -216 155 412 66 -219 -380 -95 -103 107 244 -228 -175
2056 -175 36 49 24 -5 292 107 -337 -369 -40 508 175 -180 -49 -170 -252 -257 6 374 108 -197 -44 121
$$ packed form
1923a12P91o16r26Q26J266r55j477O45J524l10j812K61K229J44k501o41K277R86
1941A599k201r33K064J247k004j960J959K092j125k253Q52K074p44j857M30K006
1957A246l21k080J1J742L62j201k55R45j02r81P3R22K40q60o6P46l83q04O34J116
1977I84q19j085O45J256o11j297O14J306m51j723K28J895N5j622j85J558K37j861
1995h76l57J840Q42j757r34J247Q37j030p16R61R02j042j041Q75J121n96q28N22
2013c0N09n16q14O73J001m36q93K31P87m70p15M99R07n62p07K13Q67k70n10j7
2033b53O25j13p26L2R35jn52m2R6j4q4j19L71K57l46k85j61K85qK10J37m72N3
2056a75K11J3k5k9K97j85m44l2L29N48l33l55J31j21q2nK63L68k66l05J53J65
$$ plain form
2078 121 -134 -124 118 153 -82 -330 -150 452 98 -310 201 222 -348 -543 60 604 204 -340 -177 263 -12
2099 -12 -570 -290 682 587 -273 -467 199 617 152 -152 -113 345 -22 -538 -82 593 478 -84 -534 -412 269
2120 269 343 -134 -132 364 181 -260 -433 22 660 346 -617 -507 478 448 -127 -448 352 595 -347 -802 -47
2141 -47 835 506 -489 -325 371 176 -404 -608 305 776 -123 -635 -115 306 358 -98 -272 -37 109 100 -273
2162 -273 -98 429 319 -273 -611 -341 424 386 -447 -212 418 282 -419 -733 199 621 56 -754 -128 1008
2182 1008 242 -605 -314 515 312 -545 -631 327 778 -150 -545 42 402 -310 -286 -89 293 276 -116 -367 82
2203 82 79 16 225 -105 -358 -96 322 40 -326 206 394 -194 -785 -341 875 448 -453 -574 495 414 -483
2224 -483 -662 368 967 -181 -924 -65 906 109 -752 -276 549 302 -458 -406 476 871 -161 -621 -9
$$ packed form
2078A21k55J0K42L5k35k48J80O02l54m08N11K1n70j95O03N44m00n44J63M40k75
2099a2n58K80R72r5q60j94O66M18m65l04L9M58l67n16M56O75j15n62m50J22O81
2120B69P4m77KM96j83m41j73M55O38l14r63J10R85l0n75l21Q00K43r42m55P55
2141d7Q82l29r95J64O96j95n80k04R13M71q99n12N20M21N2m56j74K35J46rl73
2162b73J75N27j10n92l38K70P65l8q33K35O30j36p01l14R32M22n65q10O26J136
2182A008p66q47K91Q29k03q57q6R58M51r28l95N87L60p12K4J97L82j7l92k51M49
2203H2lo3K09l30k53K62M18k82l66N32J88n88n91M44J216m27r01j21J069q1q97
2224d83j79J030N99j148p43Q59R71p97q61M76Q25k47p60N2Q82L95j032m60O12
$$ plain form
2243 -9 264 -2 -262 -101 369 388 -202 -532 127 273 235 -106 -548 -9 410 10 -586 -73 542 90 -640
2264 -640 -451 707 802 -160 -699 55 341 -440 -685 216 883 -58 -612 -52 453 208 -299 -63 421 73
2284 73 -583 -171 366 294 -358 -287 115 -240 -265 36 524 245 -410 -93 420 22 -419 -123 636 84 -500
2305 -500 -261 620 231 -442 -184 513 227 -559 -387 637 654 -332 -427 225 319 -221 -271 505 485 -385 -393 216
2327 216 336 -5 -166 241 140 -225 -146 314 385 -330 -242 245 140 -434 -230 440 369 -502 -532 109 467 -407
2349 -407 -409 330 588 -319 -633 47 683 -43 -436 72 522 -59 -571 70 583 269 -357 -136 231 -34 -183
2370 -183 -51 291 170 -390 -236 323 126 -186 -129 316 130 -335 -136 295 113 -268 -306 -28 22 -133 -71
2391 -71 315 137 -228 -184 -24 -34 -146 -91 -3 24 -241 68 100 16 -171 92 122 -202 -237 148 361 -115 -370
$$ packed form
2243iK73k66k60J61M70J9n90l30O59J46l8l41m42N39M19m00n96N13O15m52p30
2264f40J89J158R5r62n39P54K86p81k45R01O67r41n54N60N05k45n07K36M84l48
2284G3o56M12N37p2o52P1M02l55k5L01M88k79o55L17N13l98m41K96P59n52n84
2305e00K39Q81l89o73K58O97k86p86J72J024J7r86r5O52R4n40n0P76k0q70qO09
2327B16J20l41j61M07j01l65P9M60P1p15Q8M87j05n74K04O70p1q71l0O41L58q74
2349d07kP39K58r07l14O80O36p26l93N08M50n81n12O41N13l14o26K21L67k65j49
2370a83J32L42j21n60J54N59j97l12N7M45j86m65J99M31j82l81l8K78N0j55O2
2391g1L86j78l65M4J60j0j12N5Q8K7k65L09L2q4j87K63L0l24l5L85K13m76k55
$$ plain form
2414 -370 -84 264 -118 -358 144 550 -64 -461 -187 469 100 -181 -161 281 125 -429 -334 273 174 -199 -244
2435 -244 287 200 -98 85 195 4 -211 -257 -65 115 -63 48 302 64 -241 -4 298 -29 -311 116 325
2456 325 -31 -430 -98 365 432 -365 -337 299 133 -329 -233 278 295 -196 -397 40 202 122 -119 82 24 4
2478 4 53 -43 -61 32 18 -191 -26 -132 250 252 -224 -295 120 234 -140 -368 290 237 19 -363 -303 325 241 -500
2502 -500 -165 353 63 -256 -283 83 235 66 -469 -100 85 -49 4 -46 11 -35 86 -215 -168 224 91 112
2524 112 -272 -237 132 277 -365 -278 374 476 -476 -638 219 606 176 -711 -167 746 171 -688 -63 794 360
2545 360 -462 -453 398 467 -288 -670 411 754 -212 -393 211 258 -52 -153 -175 262 75 -251 -31 412 -224
2566 -224 -147 200 0 -162 53 324 69 -255 -486 245 407 -368 -500 585 422 -528 -326 266 429 -353
$$ packed form
2414c70K86L48l82k40N02M06o14l97K74O56l69k81K0M42j56n54R5O07r9l73m5
2435b44N31q7k98J83J10j91k15m6J92J80j78J11K54k38l05K37L02l27k82M27K09
2456C25l56l99L32M63O7p97K8O36j66m62R6N11J7m91k01M37J62q0k41K01n8k0
2478DM9r6j8R3j4k09J65j06L82Km76p1M15J14l74k28O58n3k18l82O0O28q4p41
2502e00L35N18k90l19k7L66J52j69n35L69J85j34N3n0N7m6J21l01M7L92j33K1
2524A12l84L5L69J45o42Q7O52J02r52j62Q57L87m30q87N44R13n75q59O25Q57m34
2545C60q22RQ51O9p55l82J081L43r66j81O04M7l10j01k2M37j87l26K20M43o36
2566b24P7L47k00j62K15K71k55l24k31P31J62p75j32J085j63r50K02N92J63p82
$$ plain form
2586 -353 -621 -91 818 94 -760 -3 665 -209 -410 -72 259 463 -111 -455 274 320 -412 -263 416 -44
2606 -44 -21 38 -249 -60 38 -114 -46 68 -179 -115 376 -291 -211 364 44 -305 -153 96 50 141 -330 -138 605
2629 605 43 -472 119 302 46 -302 -113 89 239 -223 -385 415 250 -643 118 427 -215 46 270 -7
2649 -7 171 43 -335 418 192 -441 104 347 -196 -317 286 205 -107 -24 -147 144 275 -323 -159 495 -219
2670 -219 -618 275 53 -107 -145 -82 53 162 -139 -206 666 136 -812 123 494 -273 -410 77 145 422 -456
2691 -456 -567 540 484 -730 -256 521 100 -249 -202 60 553 109 -681 -255 802 -203 -600 244 197 108
2711 108 46 -422 122 477 -262 -291 141 55 -167 349 103 -311 493 179 -363 -25 128 112 168 -263 -665 513
2733 513 375 -658 -347 472 125 30 -414 -390 896 254 -994 -219 733 -58 -466 55 232 507 123 -810
$$ packed form
2586c53k68N30R09p24q54P57O68q74k01L38L31K04n74l44P29M6p32J49O79m60
2606d4K3N9k87J89R8j52O8J14k47O4M91o67Q0N75l20l49J52K49m6R1m71J92P43
2629F05n62n15N91J83k56l48J89K02J50m62j62Q00j65q93P61L09o42K61K24k77
2649gJ78j28l78P53k26o33N45K43n43j21O03q1l12Q3j23K91J31n98J64O54p14
2670b19l99Q93k22j60l8O3J35J09l01o7Q72n30r48R35L71p67j37M87O8K77q78
2691d56j11J107n6j214M74P77m21l49M7K62M93m44p90M26J057j005l97Q44m7q9
2711A08o2m68N44L55p39k9M32q6k22N16k46m14Q04l14n42L38J53j6N6m31m02J178
2733E13j38j033L11Q19l47r5m44K4J286o42j248P75R52p91m08N21J77K75l84r33
$$ plain form
2753 -810 -119 824 -274 -643 180 108 89 79 -574 -62 507 -82 -526 -6 -60 -77 100 -361 -291 694 274 -746
2775 -746 7 525 49 -68 -411 -296 720 81 -1002 42 717 -82 -389 -302 96 592 -27 -754 -6
2794 -6 727 -51 -473 232 -133 97 72 -713 10 511 -190 -409 136 -6 245 -3 -620 -83 770 55 -645
2815 -645 6 274 140 -5 -477 -456 853 28 -778 111 730 -164 -244 -486 164 722 -201 -783 314 778
2835 778 -241 -441 -54 122 226 10 -620 146 547 -173 -457 433 0 -3 114 -596 -44 782 -177 -481
2855 -481 129 237 135 -42 -390 196 805 -35 -731 242 537 -127 -351 -102 47 608 -317 -512 444 385
2875 385 -620 -237 266 140 268 23 -125 200 276 -355 78 407 -73 210 412 -399 -8 461 -114 -181
2895 -181 -33 -11 262 228 -539 80 749 -217 -562 216 414 32 -86 -547 195 592 -449 -728 452 466
$$ packed form
2753h10O91R43j098l69Q23p2j9j0o53N12N69n89m44N20n4j7J77m61P0R85m20j020
2775g46P53N18m76j17l43J15J016o39j083J044O75p99l07Q7L98M96o19p27P48
2794fP33p78m22P05l65K30k5p85P23N01p01k19N45j42K51k48o17N37Q53p15p00
2815f45O51K68j34j45m72K1J309q25q06Q89O19q94q0k42O50N58r23n82J097M64
2835G78j019k00L87J76J04k16o30P66M01p20k84Q90m33lJ17p10N52Q26r59l04
2855d81O10J08j02j77l48N86O09q40o96R73K95o64k24K49J49N61r25j95R56n9
2875C85j005L83N03j26J28k45j48L25P6o31M33L29m80K83K02q11L91M69n75o7
2895a81J48K2K73l4p67O19O69r66l45P78J98l82j18m61P42L97j041k79J180J4
$$ plain form
2915 466 -534 -258 142 210 154 -331 -101 451 51 -559 214 449 -450 -270 124 20 -178 -116 10 289 23
2936 23 -602 270 706 -494 -477 478 270 -332 -79 -88 365 79 -666 -86 808 -195 -736 234 688 -54 -309
2957 -309 -102 267 382 -657 -456 380 278 -450 59 389 -56 -195 -134 76 407 -277 -447 562 321 -655
2977 -655 -174 402 -22 -443 -52 261 560 -256 -527 193 420 -522 -463 494 361 -354 -132 59 252 55
2997 55 -289 -82 413 -225 -566 409 356 -125 -86 -84 60 204 -59 -111 374 -76 -366 211 172 -331 -288 167 -69
3020 -69 69 0 123 447 -14 -467 -89 484 -100 -349 143 213 80 -11 -202 10 355 -249 -175 263 -58 -76
3042 -76 148 -159 -8 106 -49 -111 -116 -16 39 310 -114 7 102 -145 -441 89 285 163 -102 -28 21 293 -205
3065 -205 -452 130 146 -42 30 68 117 -7 62 -144 -80 -26 8 297 246 -128 93 134 -235 -249 43 232 -78 -230
$$ packed form
2915D66j000K76M00O8n6m85K30N52m00o10P73K35q99J80L94j04j98O2J26K79k66
2936B3o25Q72M36j200J7R55k08o02K53rM53k86p45N80Q94j003n41R70M54p42k55
2957c09K07L69J15j039K01Q36j02p28N09L30m45j39O1K10L31o84j70J009k41r76
2977f55M81N76m24m21L91L13K99q16k71P20K27r42N9R57j33p15K22J91J93j97
2997E5l44K07M95o38l41R75n3m81L9KJ44J44k63n2M85m50k90N77l9n03M3M55k36
3020f9J38o9J23L24m61m53L78N73n84k49M92P0j33r1j91K12L45o04P4M38l21j8
3042g6K24l07J51J14j55o2nJ00N5K71m24J21R5k47k96N30J96j22k65P4M9K72m98
3065b05k47N82J6j88P2L8M9j24O9k06O4N4L4K89n1l74K21M1l69j4K92J89l10j52
$$ plain form
3089 -230 -223 341 207 -475 -128 308 226 -524 -249 471 332 -208 -619 169 322 -28 -439 239 510 -58 -339
3110 -339 -153 353 154 -356 -208 247 348 -299 49 347 -13 -239 -45 -56 -87 85 199 556 32 -278 153
3131 153 259 -267 -433 40 463 -140 -321 60 548 -79 -665 -131 517 110 -573 -283 492 340 -260 -309
3151 -309 369 418 -310 -290 341 588 -94 -392 43 220 -10 -331 -93 232 195 -160 -227 29 -74 5 -120 -169
3173 -169 103 191 182 -69 -316 9 212 -102 -281 4 245 134 -507 -88 206 39 -193 -364 126 281 -285
3194 -285 -148 261 190 -188 -233 -16 -5 60 -101 115 135 53 -1 45 -81 -18 175 356 -9 -70 235 70 -165
3217 -165 -387 120 282 -57 -278 46 454 93 -344 -139 233 234 -301 -157 438 291 -341 -297 207 133 -236
3238 -236 -208 202 324 -42 -315 63 207 -209 -396 -51 303 -163 -175 128 122 -175 -113 60 178 -55 -215 172
$$ packed form
3089b30PN64j34o82L47M36q2p50K75P20j39n40m11P88J53l50m11O78K71n68k81
3110c39J86N06j99n10J48M55J01o47L48K98l60k26J94j1l1J72J14L57n24l10M31
3131A53J06n26j66M73M23o03j81L81M88o27n86N34O48m07o83K90P75j52o00m9
3151c09O78M9p28K0O31K47o82k98M35J77k30l21K38L25l7l55o7K56j03P9j25m9
3173a69K72Q8rk51k47L25K03l14j79K85K41j11o41M19K94j67k32j71M90J55n66
3194b85J37M09p1l78m5K17J1O5j61K16K0q2n4M6j26O3J93J81l65o1L05j65k35
3217a65k22N07J62l39k21L24M08l61m37K05L72Jn35J44N95j47o32M4N04p4l69
3238b36K8M10J22l66k73L78J44m16j87L45L54m66j2L03ok97O2J73J18k33j60L87
$$ plain form
3260 172 255 -26 -195 261 73 -62 -389 17 226 -172 -145 109 306 -70 -518 -91 385 -64 -187 68 399
3281 399 4 -284 -70 324 58 -201 98 432 -144 -378 -119 224 121 -300 -150 123 185 -202 -245 226 244
3302 244 -155 -180 121 -44 -14 -247 203 67 -11 -68 -150 -109 316 98 -200 -160 64 315 -112 -339 23 193
3324 193 172 -135 -88 286 170 -414 -436 143 334 -91 -428 120 435 67 -339 -224 334 286 -406 -258 382
3345 382 396 -205 -230 114 256 -130 -307 -175 199 160 42 -31 85 -94 86 5 -294 -17 204 159 -34 -67
3367 -67 267 202 -228 -405 76 367 -86 -575 -139 573 163 -571 -506 478 567 -207 -406 206 640 -182 -728
3388 -728 -44 560 -9 -363 -237 459 281 -309 -254 317 241 -246 -224 23 278 141 -191 -82 47 36 166
3409 166 -160 -186 232 307 116 -427 -125 213 159 -367 -312 228 391 -122 -509 40 655 -195 -622 -66 496
$$ packed form
3260A72Q3k81j69M56j88j35l27M06K09l98K7K54J97l76m48M27M76m49j23K55L31
3281C99l95k88K14L94k66k59K99L34n76k34K59L43j03m21J50K73O2l87m3M71J8
3302B44l99k5L01j65L0k33M50j36p8n7q2M1M25k18k98M0K24K51m27k27L62J70
3324A93k1l07M7L74j16n84k2N79J91m25l37N48L15l68m06J15N58m8o92J48O40
3345C82J4o01k5L44J42l86j77J32L74l9j18p3J16j79J80q1k99K77K21m5j93l3
3367f7L34o5m30j77M81K91m53m89M36P12m10p34O5R84Q9p74j99O12M34q22n46
3388g28O84O04n69l54J26O96j78n90N5N71p6m87K2K47K55j37l32J09J29j1J30
3409A66l26k6M18P5j91n43L02L38n4n26N5N40J63n13l87N49O15q50m27N56N62
$$ plain form
3430 496 280 -442 -311 488 355 -278 -301 -23 353 -58 -207 -85 310 265 -161 -428 -57 491 -4 -202 8
3451 8 287 220 -165 -472 -23 464 -196 -296 -165 427 68 -393 -402 299 335 -154 -349 151 528 -46 -416 -148
3473 -148 239 134 -382 -109 348 246 -200 -220 190 118 25 -116 70 151 5 121 104 -41 -126 124 233 -214
3495 -214 -97 381 266 -110 -328 111 202 -218 -416 86 446 73 -548 81 487 72 -247 -354 241 414
3515 414 -153 -254 316 281 -242 -282 148 154 85 -226 106 152 -11 -207 144 251 -157 -78 86 103 -236 76 244
3538 244 37 -306 -196 179 136 -69 -200 162 243 -239 -144 209 198 -132 -343 20 222 -59 -325 61 224
3559 224 -112 -361 -6 159 48 -155 123 72 -29 -115 -106 150 183 -98 -13 85 65 -104 -8 58 -129 -154 138 81
3583 81 0 -82 93 78 -95 -181 113 13 48 26 86 170 -65 -53 96 -34 -202 136 173 -38 -151 -72 205 50
$$ packed form
3430D96k16p22J31P99j33o33k3K78L76m11j49J22L95m5m26k67L71N48m95j98K10
3451HK79o7l85l07M49M87o60j00J31N92l59m61rP01L6m89j95N00L77n74l70K68
3473a48L87j05n16K73M57j02m46k0M10p2r3j41J86Q1j46J16j7j45q5K50J09m47
3495b14J17M78j15l76k18M39R1m20j98N02L60l73o21O29M06m15l19j07N95J73
3515D14n67j01N70l5n23m0M30Oo9l11L32M6j63j96L51J07m08P9J64J7l39L12J68
3538B44k07l43J10L75m3k05j31L62Q1m82R5L53j1l30k11L63K02k81k66L86J63
3559B24l36k49L55J65j11k03K78n1j01q6RK56L3k81Q5R8k0j69R6O6j87k5K92n7
3583H1q1q2J75j5j73q6K94j00L5k2O0Q4k35J2J49j30j68L38L7k11j13P9K77j55
$$ plain form
3607 50 -345 31 272 247 -141 -67 229 219 -256 -249 147 394 -165 -403 148 517 -156 -366 20 297 36 -325
3629 -325 -48 273 70 -345 -164 152 104 -241 -63 156 33 -111 -107 78 -71 -371 -19 178 51 -150 72
3650 72 231 -65 -375 28 355 -43 -297 51 294 85 -315 105 356 -5 -304 -245 260 327 -488 -308 294
3671 294 155 -288 -143 190 288 -32 -185 144 277 -133 -267 22 -12 -126 52 -9 -66 -152 -114 188 53 -184
3693 -184 -78 169 -48 -153 -114 230 190 -164 -163 209 199 -254 -283 142 396 -53 -265 49 184 -79 -297 25
3715 25 131 162 -102 -124 95 155 -16 58 -8 -64 87 -1 -267 -38 78 214 -168 -161 80 272 -126 -284 -5
3738 -5 239 77 -403 -137 374 154 -264 -246 390 179 -164 -96 229 341 -125 -180 10 188 80 -201 54 193
3760 193 -229 -163 -21 111 -88 -56 52 145 -209 -40 71 86 -324 -15 282 -6 -309 -43 235 195 -247 -242
$$ packed form
3607E0l95L76K41k5l88P4K96j0m75PL96K47n59k38N51L69o73k10L86K77k61l61
3629c25K77L21k03m15J81L16m8l45J78K19j23j44MJ85j49l00L52J97j27k01K22
3650G2J59k96l10M03L27l98k54L48K43k09m00M20K51l61k99N9N05O7q15J80O02
3671B94j39m43J45L33R8l20j53L29J33m10j34K89l4j14J78o1n7q6L8L02j35k37
3693a84J06K47k17j05L9L44m0l54JL72j0m53k9M25K54m49k12L14J35k63k18L22
3715B5J06L1k64k2K19O0j71P4o6n6J51q8k66K29J16J36l82PK41J92l98j58K79
3738eK44j62m80K66N11k20m18J8O36k11l43O8L25J12m66n5J90J78j08k81K55J39
3760A93m22O6J42J32j99L2J08R3l54J69J11J5m10L09K97k88l03K66K78m0m42N
$$ plain form
3782 -242 188 141 -106 -181 42 519 -94 -385 6 400 84 -391 -5 287 145 -256 27 313 53 -289 -42
3803 -42 96 94 23 23 36 -47 118 -116 49 -120 -177 46 8 -44 -140 -31 95 -253 -88 -21 261 -142 -97 69 227
3828 227 140 -134 -82 343 150 -195 -75 176 190 -163 -142 151 116 -359 15 -21 133 73 -52 -108 155 150 44
3851 44 35 -39 108 81 0 -65 22 176 130 -173 -12 178 194 -139 -270 130 95 -261 -282 169 233 -9 -118 66
3875 66 190 -68 -249 -28 351 16 -250 106 279 32 -433 -197 259 183 -413 -118 344 98 -235 -159 208
3896 208 76 -240 -99 214 245 -242 -139 289 1 -175 -46 52 0 42 -69 247 127 -179 -163 183 82 -217
3918 -217 -179 269 151 -182 -211 346 213 -205 -239 180 345 -91 -306 268 258 -228 -287 88 159 116 -254 25
3940 25 496 -30 -347 4 287 30 -213 -124 197 202 -208 -191 109 11 -326 -164 -129 49 93 66 -69 52 12
$$ packed form
3782b42M30m7k47p5K23M77o13k91L91L94l16m75L86K92j42m01K83K86k60l42K47
3803d2J38kp1%J3q3J65k34J65j69n7K23l8n2r6J09J26l48J65O7K82m03M5J66J58
3828B27q7k74N2M25j93l45J20K51J4l53K1K93l5m75L74l6J54o0j25n6K63nj06
3851D4rp4J47k7q1o5Q7J54m6l03J61J90J6l33j31M00l5l56k1M51O4k42j09J84
3875F6J24k58j81K21L79l35k66L56J73k47m65K36M56p6n96K95M62k46l33P6L67
3896B08j32l16J41L13L1m87J03M28k88j76J29R8n2M2j11L16j20l06J6L46j01k99
3918b17L8M48j18l33k9N57j33m18l4M19J65m36k15N74j0m86n9L75P1m3l70K79
3940B5M71n26l17L51K83k57k43Q9L21Nm10J7L00r8l37J62L5J78M4k7j35J21m0
$$ plain form
3963 12 -241 72 -90 -161 109 233 -243 -112 224 107 -45 -159 -147 187 126 -352 -198 153 -17 -310 -207
3984 -207 -4 168 59 -113 118 367 -30 -331 -78 177 137 46 -354 -48 318 -120 -310 -164 241 8 -93
4005 -93 -111 -20 381 23 -331 -49 451 36 -288 27 287 383 -52 -476 191 415 -302 -333 195 318 60 -248
4027 -248 -103 268 96 -278 -283 283 24 -125 59 128 28 -100 -215 -115 14 -49 162 168 -124 -137 239 107
4049 107 -103 -83 77 43 -108 -207 52 380 71 -544 21 432 60 -365 39 177 223 -216 -380 411 400 -408
4071 -408 -365 338 235 -155 -461 -95 310 212 -363 8 364 -116 -367 -1 -49 9 -152 -28 -135 128 -79
4092 -79 83 217 -8 -150 260 174 -174 -48 159 1 -172 -213 -220 220 -111 -481 122 284 -156 -108 188 34
4114 34 -73 -190 -203 181 290 -235 -201 261 -31 -171 119 -3 11 256 -179 -106 227 67 29 153 -186 -129
$$ packed form
3963A2k53L13j62p1K70J24m76J31L36j17j52j14J2L34o1m78J54L51j70k93J03
3984b07K03J72j09j72K31K49l97l01K53K55m0r1m00L06L66m38j90J46M05k33j01
4005i3j8R1M01l58l54K82N00m15l24L15K60R6m35m24O67K24p17l1N28J23k58l08
4027b48J45L71j72l74nN66k59j49J84O9j00j28j15J00J29o3K11Ok92j3L76j32
4049A07k10K0J60l4j51r9K59L28l09o15N65M11l72m25M04J38M6m39j64P91j1q08
4071d08M3P03j03l90l06L66M05r8n75L71L56m80k51L66m8N8j61J24j07K63k07
4092g9J62J34k25j42M10q6l48J26K07j58j73m1pM40l31l70O03J62m40M8K96j54
4114C4j07j17j3L84J09n25L4M62k92j40K90j22J4K45m35P3L33j60l8J24l39N7
$$ plain form
4136 -129 485 -111 -263 181 229 -197 23 -155 25 236 -81 -360 367 388 -302 -54 90 -149 -114 -233 -56
4157 -56 295 170 -419 164 438 -193 -94 217 142 -27 -96 -114 366 98 -491 -126 303 -25 -190 247 102 -24
4179 -24 -43 -187 161 145 -371 -154 374 9 -279 75 171 -159 23 -286 -183 185 -79 -266 284 310 -361 -100
4201 -100 110 -133 -158 -17 -132 166 16 -262 34 221 -290 -45 313 73 -119 25 81 3 -91 -195 42
4222 42 340 -18 -224 434 278 -191 52 -164 -63 16 -155 26 503 46 -211 178 0 -27 42 79 -138 183
4244 183 114 -84 48 70 -84 140 -57 -314 12 175 -61 -133 254 10 144 -237 -193 288 153 -290 -26
4265 -26 162 -140 -25 -100 -132 153 235 -158 -91 262 -100 -106 259 -172 -109 192 27 -148 21 113 83 -52 -313
4288 -313 -129 291 193 -409 101 414 -48 -283 -136 214 267 -353 -475 515 410 -400 -261 258 230 -198 -69
$$ packed form
4136a29O14n96j52M44M8m26K20j78J80K11l17k79P27K1o90K48J44k39L5j19J77
4157e6L51j25n89N83K74o31R9L11p5j69o9j8M80k68n89L65M29l28j65M37j45j26
4179b4j9j44L48j6n16K17N28l65k88L54R6l30J82l09J03L68k64j87N50K6o71K61
4201a00K10k43k5J41j15K98j50k78K96J87n11K45L58k40j92J44N6p8r4j04K37
4222D2K98l58k06O58j56m69K43k16J01P9j71J81M77m57k57L89j78k7O9L7k17L21
4244A83o9j98J32K2j54K24j97k57L26J63k36p2L87k44J34l81M4M81j35m43K64
4265b6J88l02J15p5l2K85Q2l93O7L53l62oL65m31O3L01j65j75J69R2l0j35k61
4288c13J84M20r8o02N10L13m62k35J47L50N3o20j22R90j05q10J39N19k8m28J29
$$ plain form
4309 -69 130 421 126 -339 -50 236 -83 -232 -67 61 -86 -64 -89 -2 74 -203 49 209 -14 -276 226 155
4331 155 -131 -45 -4 -24 88 -177 89 406 -24 -250 142 186 -37 -251 141 240 98 -166 -136 260 105 -256
4353 -256 -125 225 -99 0 -48 46 -63 -33 -255 37 114 25 23 225 -23 -2 51 -84 -45 -9 48 33 107 -51 36
4378 36 172 -30 1 107 208 -162 -23 -81 98 145 -20 -195 146 137 -228 82 184 30 -111 73 87 -49
4400 -49 80 -75 -35 115 -188 47 125 -95 -180 128 126 -250 27 48 229 3 -282 36 124 -137 -276 235 156
4423 156 -56 -67 -100 195 65 -202 -265 235 9 -274 97 244 194 -77 -39 6 178 -123 -280 283 220 -183
4445 -183 -33 118 -109 -119 10 100 159 -80 24 93 204 -335 -245 144 -47 101 -202 102 90 -179 -71 49
4467 49 15 -2 -252 208 132 -189 -233 84 219 -125 -121 0 168 7 -145 96 140 -135 -83 -5 102 163 91 -91
$$ packed form
4309f9J99K91k95m65K89K86l19j49J65J28j47K2k5Q7P6k77K52J60k23k62N02p1
4331A55k86Q6M1k0J12k65K66L17m30k26L92M4k23k14L92R9j42k64L0L96j55l61
4353b56J31L50l24R9m8R4j09L0k22K92P7q9kK02k48K1N3j35L9L6N7j5P4j58Q7
4378C6J36k02L1J06J01l70J39n8J79M7j65j75L41rl65L10J02j54j41J84J4j36
4400d9J29j55M0J50l03K35P8k20q5L08kl76K77K1J81k26k85L18Q8k61j39N11p9
4423A56k12j1l3K95j30k67o3N00k26k83L71J47n0k71L8M5J72l01j57N63o3m03
4445a83J50J51k27j0J29R0N9k39J04O9J11n39R0L89j91J48l03L04j2k69J08J20
4467D9l4j7k50M60p6l21m4L17J35l44MJ21J68j61j52K41M4k75N2P8J07O1p2j82
$$ plain form
4491 -91 167 -58 -237 -1 112 -11 -41 47 118 14 -190 -131 -23 -76 -27 32 177 57 -19 28 -49 -115 19 -25
4515 -25 -37 27 13 -49 205 -14 -26 73 -43 -107 2 -23 -75 -63 -24 160 148 -86 -22 -46 113 16 -80 -5 -52 60
4541 60 -114 5 87 43 80 119 -52 -37 -208 67 130 -58 -87 133 184 -17 11 44 108 -40 -182 -38 270 -45
4565 -45 -87 63 53 -56 -175 113 246 -56 -166 -97 151 32 -219 57 106 177 -42 -234 106 161 -134 -29
4587 -29 106 81 -77 27 -5 97 59 20 111 -23 -16 -93 -81 16 -44 62 233 -130 -55 38 164 -26 -112 29 32 -23
4613 -23 -367 -7 279 22 -303 -264 128 239 -25 -245 209 262 50 -149 -7 261 199 -65 -72 -1 37 -12 -146
4636 -146 -85 210 2 -13 52 -98 59 45 -138 -38 80 70 -4 -95 8 80 -20 -228 18 185 38 -151 -54
4659 -54 162 107 9 -122 97 106 -37 -29 21 72 -45 -141 46 78 -24 -19 -166 142 92 -90 -47 2 -40 31 -26 33 -179
$$ packed form
4491i1K58k25j79K36J13j23l0Q8P1j04k04N9J08n3M9N9J45j20p6M7p7o6J34m4
4515b5j2O4j4o2K54k19j2R9j16o4J09k5n2J2L9J84j2k34O4k4J59r7r6P5m7J12
4541F0j74J19Q2m4L7L9j71J5j71K75O3j88k9K20N1k01K8L3O4j48j42J44L08l15
4565d5m2J50j0j09j19K88J33l02j10O9K48j19k51K76M9P1k19j92L40N5k95J05
4587b9J35k5j58J04l2J02l8l9R1j34Pp7J2R7o0J06J71l63P5R3J26j90q6J41Ln5
4613b3l44L60K86k57l25L9L92J11k64k20M54N3k12j99J42K68o2k64pP1L8m9j34
4636a46O1K95k08j5O5j50J57j4j83J00J18j0p4r1J03P2j00k08K46J67j47j89R7
4659e4K16n5r8j31K19Rj43QN0N1j17r6J87L2j02Nj47L08n0j82M3M9m2P1n7N9k12
$$ plain form
4686 -179 -149 229 117 -166 -79 188 61 -301 -131 240 252 -269 -182 223 293 -94 -151 -33 249 -32 -183 -46
4708 -46 275 84 -168 106 80 106 -85 -166 191 44 -49 29 85 -16 -137 -135 -56 26 -138 146 -40 77 -91 3
4732 3 35 -49 -19 -72 79 133 -68 152 207 21 -193 -154 247 -4 -80 -125 282 27 -11 -190 -19 -12 -173 -38 -19
4757 -19 151 -54 -192 -9 54 22 -99 66 166 -147 5 116 -12 -32 -27 119 -21 -57 -11 69 40 28 51 127
4781 127 -47 -38 30 119 -115 -56 41 -21 98 55 138 15 -36 -123 -12 -44 -175 -110 -55 31 -13 22 -34 -3 -14 -181 80
4808 80 138 30 -98 -11 116 -24 -195 -90 162 30 -107 -61 194 14 -167 -132 137 83 -200 -124 84 228
4830 228 -257 -106 64 2 -223 37 163 -77 -146 23 -36 156 -136 -59 273 -11 -132 -141 102 47 -116 -232
4852 -232 117 197 -273 -121 74 190 -284 -269 42 212 -47 -199 -10 205 47 -219 -3 47 44 -144 87 50
$$ packed form
4686a79L0L78j12k83Q7K67j27l62J70L71J2n21Q7M05P0l87n7J18K82k81j51J37
4708d6L21j91k52K74k6K6j91q1L57j47r3P8N6j01j21KP9Q2j64K84j86J17j68R4
4732CL2q4L0n3J51N4k01K20N5j86k14L9M01k51p6m5M07k55l8j79J71Pj61J35J9
4757a9J70k05j38J83O3l2j21J65J00l13J52J11j28k0NJ46j40l6M6Q0k9j2K3P6
4781A27j74RO8Q9k34N9R7o2J19m3Q3j23n1q7J11l2j31O5N5Q6m4L5n6L1j1j67K61
4808H0N8j08j28Q7J27j40j71J05K52j32j37M6K55j80j81L5K69n4k83P6K08J44
4830B28m85J51J70o2k25K60J26k40o9J69n9J92k92P7L32k84j21rK43n5j63j16
4852b32L49Q0m70J52J95J16m74J5L11J70k59j52J89K15j58k66K16N0lj88K31l7
$$ plain form
4874 50 46 -92 30 133 -28 -246 -56 1 -57 -31 49 107 -24 -69 -69 48 -98 -75 134 286 -140 -129 142 129 65
4899 65 -293 -80 116 211 22 30 171 178 -189 -141 215 171 -109 -147 26 95 19 -164 31 84 -42 -2 -153 20
4923 20 -30 102 -47 -201 -63 47 34 -138 -56 49 131 -235 -78 207 150 -40 -221 101 42 -270 -159 -44
4945 -44 265 43 -212 -28 100 60 -57 -154 162 -105 -242 28 79 64 -25 206 -9 19 -99 139 106 -101 -60
4968 -60 -3 96 -155 -36 66 69 41 -189 76 213 87 -115 42 205 78 -193 72 150 22 -144 -49 152 210
4991 210 -97 -107 57 102 -20 -256 166 152 -146 -212 -45 148 29 -115 147 144 -103 72 209 -34 -14 -33 55
5014 55 48 38 -109 258 237 -170 -140 88 94 -30 -9 154 158 -135 -20 103 91 -135 -47 22 209 -44 -147 0 77
5039 77 17 58 62 79 138 -109 -29 95 -46 87 -34 -54 -85 -102 116 121 8 -99 183 126 -61 -77 23 53 -28 45
$$ packed form
4874E0mj38J22J03j61k18J90N7n8K6Q0N8j31m5%J17j46K3K09J52m26J1K71j3o4
4899F5l58K13J96R5j89QJ41Pl67M8L56m4k80l8J73O9p6j83J95N3j26M0j51J73
4923B0n0J32j49j54J38J10j3j72Q2J05Q2l66J57K85n7j90j81L22n9l12J11J15
4945d4L09k22k55J84J28m0j17r7L16k67j37K70N1j5q9K31k15K8j18K38l3k07M1
4968f0N7R9k51J19J02Lk8k30K65J37j26k02J57J63j27k71K65P8j28j66R5K01N8
4991B10l07j0J64M5j22k36M22j4k98o6J67J93j19j44K62lk47J75J37k43K0j9Q8
5014E5pj0j47L67k1m07L0K28Oj24K1J63Mk93J15J23j2k26Q8O9J87k53j03J47P7
5039G7o0M1MJ7N9k47Q0J24j41J33j21k0l1j7K18Nj13j07K82n7j87j6J00L0q1P3
$$ plain form
5065 45 141 -11 -113 -143 -4 -42 -124 66 -24 227 -82 -103 1 45 18 -47 88 -21 42 -163 108 -124 -102 -5
5089 -5 128 -9 -35 -14 74 155 -93 -178 39 81 29 11 104 183 -124 -157 64 98 60 -108 -24 69 -109 -85 125 154
5115 154 58 -70 -79 172 238 -48 -112 94 -25 -185 -22 55 -265 -78 -25 56 50 -134 -47 -85 127 78 -137 -21
5139 -21 91 -28 -119 16 -1 -81 -49 -9 70 -70 -59 95 85 35 30 175 -102 1 22 79 132 -17 31 93 -66 -106
5165 -106 -79 0 149 -153 42 25 61 -68 56 -30 -24 35 55 -4 90 48 -41 -16 -6 59 43 -6 127 3 182 12
5191 12 10 -44 181 -23 -91 -92 73 8 162 -183 15 70 12 5 87 108 -273 -34 -103 227 -56 -165 -150 -41 41 -200
5217 -200 -133 222 199 -119 -93 -24 109 -18 35 55 82 -2 101 2 69 -79 -35 111 97 55 -23 147 72 -178 -88
5242 -88 10 -19 -41 -21 244 90 -54 -226 1 171 -37 -164 241 148 -177 -205 -133 115 -105 -167 -35 218 71
$$ packed form
5065D5R6j52j02l0J39l8q2J90r0K51l09k1J04M4k7o5J35j09O3k05K71k32K2R7
5089eJ33j37k6K1Q8Q1k48q5K17M2n2j8R3P9l07l3K21L4l8j68Q4R3j78K4K10K9
5115A54r6j28rK51O6k86o4K06j19j60J63P7l20J87N3Q1oj84Q7l8K12m9k15J16
5139b1J12j19r1J35j7q0L2M0P9j40J1J54j0n0nJ45k77J03K1N7N3j49M8O2j59m0
5165a06K7P9J49l02J95j7L6j29J24q6ON9K0n9R4m2q9K5J0O5j6m9J33j24J79j70
5191A2kn4K25k04o8jJ65o5J54l45J98N5n8pQ2K1l81K39o9L30k83j09J5J09Q2k41
5217b00O7L55k3l18K6O9J33j27N3K0K7q4J03r9O7j48M4J46j4m2p8J70p5k50R0
5242h8R8k9k2K0K65j54j44j72K27J70k08j27M05r3l25k8P2K48k20o2J32K53j47
$$ plain form
5265 71 -217 9 155 16 -270 -27 94 58 -221 -61 -47 19 -72 -127 8 32 -50 3 -7 -58 -66 -19 100 -144 -229
5290 -229 182 260 -127 -68 236 121 -9 -160 170 113 61 22 26 107 68 18 -13 -92 30 -44 -67 71 74 -33 -4 15
5316 15 62 -227 122 18 -115 37 102 -71 35 -27 158 -4 31 -71 67 129 -35 -31 50 29 -37 10 58 106 159
5341 159 -87 -81 103 72 -57 36 166 -53 8 0 112 29 102 -92 146 29 -94 -68 -112 -109 -57 -31 -91 184 -114
5366 -114 -67 339 34 -139 -77 64 -84 -302 68 88 -1 32 -20 86 137 -168 -46 130 75 8 56 53 21 34 -62
5391 -62 -80 206 -216 -187 186 32 -234 156 88 114 52 -80 -13 109 -43 -311 198 75 -66 -129 130 57 192
5414 192 -62 -247 88 108 -46 21 66 16 -81 38 80 16 23 104 -145 43 -137 -123 54 -54 -91 272 26 -19
5438 -19 -16 -2 -106 20 -57 63 272 64 -156 4 178 -70 32 5 5 -58 -95 -47 321 40 -139 -17 178 -83
$$ packed form
5265G1k88K26J46j39k86K43J21l6k79J60J4O6r1n5J35K4q2N3j0n1qM7J19k44q5
5290b29M11P8l87N9L04j15j30j51L30n7n2l9MQ1l9n0l1p9J22p4k3J38Lj07K9J9
5316A5M7k89L49j04j33J52O5j73J06o2J85j62L5j02J38O2j64MQ1k1o6M7M8M8N3
5341A59k46OJ84l1j29R3J30k19O1qJ12q3P3j94K38j17j23K6m4LN2K6o0K75k98
5366a14M7M06l05j73O2J41j48k18L70K0q9L3n2J06N1l05J22J76n5o7M8ll2J3r6
5391f2j8K86m22K9L73j54k66L90o8K6o2j32O7J22j52k68N09j23j41o3K59p3J35
5414A92k54j85L35K0j54O7M5n0r7J19M2o4PQ1k49J88j80J4J77j08l7L63k46m5
5438a9LJ4j04J26p7J20K09k08k20J60J74k48J02k7%o3l7M8L68k81j79J22J95k61
$$ plain form
5462 -83 153 125 -183 11 99 -149 137 8 94 -62 -9 -46 -53 120 -301 -186 -40 2 -21 82 -10 7 176 27
5486 27 -173 234 250 -114 -317 2 39 73 -102 -109 262 97 -227 -87 197 -49 -37 81 -48 154 -58 -292
5508 -292 312 -13 18 -106 141 -179 -37 92 -140 -66 201 -140 -105 40 -121 109 41 -263 -223 81 37 19
5530 19 -27 70 150 163 -254 18 156 42 -299 -46 193 -26 -159 -24 30 210 -55 -293 67 92 -24 9 -84
5553 -84 -35 96 -42 -193 -91 271 40 -1 151 -102 -41 34 -122 -134 128 13 -18 123 17 54 170 -189 -70
5576 -70 183 73 -18 98 29 -23 -97 -118 27 236 -23 -284 246 154 -156 -5 132 -136 -24 -84 -59 -6 15 -198
5600 -198 140 24 -166 -4 289 -144 -22 21 162 -11 -181 -221 14 241 -230 -204 302 178 -169 -71 -5 13
5622 13 42 -126 8 155 -101 -146 121 155 -16 -96 57 238 88 14 -342 227 -87 -235 27 63 -159 -3
$$ packed form
5462h3K36k8l08J94Q8k48K86j29Q6j56N3l7pJ73m21J15J46M2k3J03r2J7J69j49
5486B7k00M07J6l64k03L19L7L4j75pL71j65l24J40K84k46J2J18j29K02k12k34
5508b92O04l25L1j24K47l20J42J29k32P4K67l41L5J45j61K30o8l04M0L04m4j8
5530A9m6R7Q0J3m17K72J38j14l41K53K39k19j33J35N4J80k65k38L60K5j16L3r3
5553h4M9J31j38j51J02L62k31m1J52k53O1P5j56j2K62j15l1J41j06L7J16l59J19
5576g0K53j10r1J16o9n2p4k1J45K09k59k61N30r2l10J51J37k68J12o0K5N3K1k13
5600a98L38j16j90J62K93m33J22M3J41j73j70m0K35K27m71K6N06j24l47R8O6J8
5622A3K9j68J34J47k56m5K67L4j71q0J53J81j50p4l56N69l14j48K62L6k22J56
$$ plain form
5644 -3 0 28 35 -201 -44 97 -19 -247 106 158 -137 -246 114 -68 -21 -142 -23 39 90 -75 0 173 111 15 45
5669 45 -15 -24 30 4 -40 185 -93 -24 17 22 47 -16 -59 27 -105 -25 104 84 -142 -201 53 -27 49 262 162 -126 101
5696 101 33 -71 98 -32 -162 73 305 -45 -73 65 -80 -20 42 81 69 -10 -61 -34 119 -57 -42 200 -61
5719 -61 46 83 -73 -71 102 -17 103 -12 -94 -1 130 143 19 48 128 -73 -4 80 -89 223 11 -16 105 64
5743 64 -146 -23 224 8 32 -54 -88 112 193 -254 202 191 -20 -159 81 -8 -244 -132 -31 86 -73 24 -15
5766 -15 204 21 -226 68 34 27 98 27 -55 54 83 -35 -27 -40 -126 19 -3 -75 52 124 -212 -16 1 96 71 -147
5792 -147 -60 149 -16 -223 -25 51 111 -155 48 -80 163 -12 -124 -2 47 53 -4 4 87 97 -49 -18 89 25
5816 25 2 -81 193 63 17 111 -144 -7 48 -192 -16 20 -7 17 47 -61 29 146 -69 38 48 66 17 -80 151
$$ packed form
5644cLK8Pk36J57J41j16k28L53N2k95j09L60j82M7j21J19O2N1j65P5J73o2r6L0
5669D5o0rN4k6m4K25k78O9M1NK5o3m3Q6j32Q0J29k0k26n9K54q0P6K13j00k88K27
5696A01o8j04J69j30j30K35K32l50k8J38j45O0O2L9j2p9n1K7J53j76J5K42k61
5719f1J07L7j56KJ73j19J20j15q2R3J31J3j24K9Q0k01O9Q4j69L12k12k7J21m1
5743F4k10J23K47k16K4q6l4K00Q1m47M56j1k11j39K40q9k36J12J01J17j59R7l9
5766a5K19j83k47K94l4pP1p1q2J09K9j18Qj3q6J45k2p2J27P2l36J96J7R5k5k18
5792a47Q7K09j65k07J98P6O0k66K03j28K43j75j12J22M9On7QQ3J0j46L1J07o4
5816B5k3q3K74j30m6R4k55J37N5k40J76L6k7K4L0j08R0J17k15J07J0J8m9r7K31
$$ plain form
5841 151 -43 183 74 19 -40 21 -22 -195 -17 123 143 4 -5 64 173 -186 14 -19 91 -134 -77 96 52 -82
5865 -82 -190 6 169 -56 130 -58 -66 64 -40 3 -100 -43 20 -87 -71 -129 -190 76 -165 -136 90 150 -280 -142
5889 -142 136 248 -26 -37 57 104 113 -118 -118 178 22 -165 -22 23 174 -28 -24 -113 -20 -330 26 -64 -36 50 -50
5914 -50 34 44 -24 -19 38 -123 -1 149 40 62 -162 19 102 -88 -48 27 -99 83 -63 -197 173 45 -139 28
5938 28 110 22 -112 -284 96 143 -57 -64 -77 81 8 -19 28 6 35 -78 -69 136 47 -87 -69 93 249 36 178
5963 178 -28 -203 -124 71 -31 -13 -82 197 81 -13 -173 89 -39 -91 -31 -1 85 -135 57 -159 117 -37 -204
5986 -204 78 -29 -124 -161 65 -1 44 -94 21 82 79 -101 -73 51 -10 -27 145 -9 48 -48 54 115 -24 -58 -73
6011 -73 -49 -42 44 -90 260 72 -26 54 271 6 58 48 -29 -142 -215 -73 -113 32 -94 66 -58 53 -110 -66
$$ packed form
5841A51j94K26j09n5n9O1m3j73J78J40K0j39rO9J09l59K00l3J10k25N7J73m4j34
5865h2j08J96J63k25J86j88qJ30j04M3j03N7O3j07J6n8o1K66k41K9K26O0m30J38
5889a42K78J12k74j1R4M7Rk31%K96j56j87J43M5J51k02Mq9R3l10L56r0K8Q6j00
5914e0Q4J0o8NN7j61J22J50j09K2k24J81Q3j90M0P5j26J82j46j34L70j28j84J67
5938B8Q2q8j34j72L80M7k00pj3J58p3k7M7k2K9j13RK05q9j34J8J62J56k13J42
5963A78k06j75P9J95j02J8o9K79j16r4j60K62j28n2O0L0Q6k20J92k16K76j54j67
5986b04K82j07r5l7K26o6M5j38J15O1lj80K8J24o1j7J72j54N7r6J02O1j39l4j5
6011g3K4PQ6j34L50j88r8Q0K17k65N2j0p7j13p3J42m0J45j26J60j24J11j63M4
$$ plain form
6035 -66 83 19 -53 -177 146 12 -45 -103 186 149 -214 -81 119 106 -142 -72 57 66 -2 -158 5 -2 76 86 37
6060 37 -28 -192 -72 -90 8 75 -60 16 -123 62 -33 -85 39 -98 31 -106 21 121 95 108 -18 -85 -129 58
6084 58 49 -79 156 67 -12 -61 -71 52 56 37 -212 34 90 28 -6 -10 6 -109 64 18 114 -7 -9 -14 -105 -4 33 -56
6112 -56 -98 -43 -54 35 -50 123 53 126 -31 -144 123 127 -146 -196 -24 180 69 -80 75 -70 155 -52 -22 -17 28
6137 28 3 -91 126 178 149 -151 -58 18 -86 -211 -59 40 55 -135 -24 7 -15 63 58 -100 50 -39 -55 -60 -129 -6
6163 -6 38 -58 -264 -89 101 32 -24 -68 -3 109 -111 -161 265 83 42 -101 45 193 71 -124 -120 150 -46 -148
6187 -148 -32 76 102 -41 11 -36 -58 46 24 -122 -15 101 -61 -67 2 7 126 91 3 -109 92 28 -59 -39 122
6212 122 69 -7 52 207 265 0 -89 19 48 166 -83 -61 84 64 -153 -43 -62 44 36 -156 37 29 -40 12 49
$$ packed form
6035f6J49o4p2j24L23j34n7n8K89l7l63J33K00j3k48P0J29Ro8j56J63pP8J0m9
6060C7o5j64J20j8R8O7j35P6j39J85r5n2J24j37J29j37J27J00k6J3j26o7m4J87
6084E8rj28K35q9p9m9j0J23Mj9k49K46N6o2l4mJ6j15J73m6R6j21knr1J01L7q9
6112e6m2N5j1Q9q5J73p0P3j57j13K67Mk73n0J72K04j11j49J55j45K25k07L0NM5
6137B8k5r4K17N2k9l00R3P6j04j25J52R9J5j90J11L1k2P8nj58J50q9j6no9J23
6163fM4r6k06J75J90o9n6m4O5J12k20n0M26j82m1j43J46J48j22j95MK70j96j02
6187a48J16J08K6j43N2m7k2J04k2j46J07J16j62oO9NJ19l5q8j12K01o4q7K0J61
6212A22n3p6N9J55N8k65q9J08K9J18k49K2J45k0k17J10j9J06qj92J93qo9N2L7
$$ plain form
6237 49 -35 50 0 -31 26 102 31 22 31 -146 86 174 -158 -27 169 126 -40 -244 -49 57 70 75 -119 149 -157 -16
6263 -16 46 6 28 -17 -83 120 60 -63 -15 49 56 -110 51 -24 -33 -43 22 45 26 -54 -24 -99 18 -139 107 101 58 57 2
6292 2 167 200 -26 -22 63 124 -88 -18 58 91 88 -139 -140 104 5 -87 -110 136 -11 -153 -52 270 82 3 -35 34 -17
6319 -17 -62 10 -12 62 -39 -58 248 186 91 88 96 75 7 24 -78 26 -56 -108 21 171 -71 59 -20 58 43 -35 -137
6346 -137 42 76 -89 -112 156 -81 28 10 109 34 -228 -85 -95 72 -30 30 124 135 125 120 -6 88 51 158 -52
6371 -52 11 -88 -96 -17 -1 43 71 5 109 109 74 38 -78 78 71 -139 -91 41 20 -13 -27 72 -11 -133 -46 -83 -25 27 -76
6400 -76 -147 76 37 -20 94 74 10 123 21 139 -22 -23 116 -9 21 47 -97 71 -36 25 -33 36 128 56 -159
6425 -159 67 -6 18 -18 -16 51 -62 -37 -66 -46 -23 31 -20 -27 -72 -26 87 53 -163 -189 164 -21 -83 -1 135 76 -10
$$ packed form
6237D9q4Q5n0l1N7P6p1rRj77K32Q8l32J31J96m3j66k04J95J06J3Nj94K68l06J41
6263a6O2m0K2m5o6K03o0j23M8O4Pj66J61p5rj0O5K3j9q0L0p5J17j57K46om3jn5
6292BJ65L3k26MQ5O1k12P0P6L3lk27jK44r9r2k3K46j47j42J01L22j88p9l8O9n1
6319a7m5P2k2P4j01j9L06o2r5lQk1o8J7j02J04q2n2J29J50k42J30p9P8j5p8j02
6346a37J79L4j65k3K68k37J09j8R9p5k62J43j0J67j02O0R4J1j0nj26R4l7J07k10
6371e2O3r9qP9J6M4K8o6J04%l5l6j16J56pk10M8J32k1l3j4R9q3j22Q7l7N8N2j03
6400g6p1K23l9n7J14k0o4J13j02J18j61jJ39j25L0K6j44J68j07O1n8O9R2p2k15
6425a59K26p3K4l6KO7j13K5k9K0K3N4n1pm5M6J13l4k16k6L53j85o2Q2J36n9q6
$$ plain form
6452 -10 73 155 132 -70 -51 119 56 153 -64 -102 84 6 -49 -152 -7 217 -67 -6 -67 123 22 -63 -101 32 78
6477 78 -138 134 38 -16 -28 -117 40 1 117 -48 -113 36 62 -87 -132 -117 -1 10 -46 -108 1 -53 53 117 -10
6502 -10 -43 88 -101 -50 21 13 3 101 -69 68 28 -82 90 -2 159 -223 134 93 106 61 -132 25 26 188 5
6527 5 -119 43 226 23 -104 25 86 118 -149 -79 88 55 -31 -81 68 52 -65 -93 -145 126 -58 -2 42 70 -103
6552 -103 -61 -50 231 -38 -122 -60 -73 -7 -70 181 -163 122 13 -2 59 103 112 -202 39 -4 -67 -73 151 -132 11
6577 11 -255 199 -68 -220 -75 70 42 -56 82 -36 51 -13 -135 -32 36 20 -65 24 73 -61 -29 78 100 117
6601 117 26 73 -4 78 -46 -26 94 23 -34 9 73 12 -140 108 -153 77 -4 58 -75 -148 48 49 -46 -162 -124 0
6627 0 -49 -102 -117 -83 137 -37 7 165 160 -142 196 -16 57 -17 -104 14 136 14 -38 97 -95 -32 -52 73 66 -48
$$ packed form
6452a0Q3Q2k3k02J9J70o3R7k17l8J86p8n5j03J45K24k84O1o1J90j01q5l8J33M6
6477G8k16K72r6n4j2q9J57l9J16j65o5J49K6j49m5J5J16J1n6o2J09n4J06O4j27
6502a0l3J31j89N1P1qj0R8j70J37m0j10J72r2J61l82L57m1J3m5j93J57JJ62j83
6527Ej24J62J83k03j27J29O1L2k67P0J67l3q6n0J49j6j17k8n2K71j84N6M4K8j73
6552a03M2J1K81k69q4O2j3O6o3K51l44K85j09j5O1M4Rl14K41m3o3oK24k83J43
6577A1k66M54k67j52J45J45k8r8J38j18Q7o4j22J03O8j6q5Q9M9j34L2J07K2J7
6601A17r1M7p7Q2j24K0J20p1n7M3O4o1j52K48k61K30q1O2j33p3J96Jr5j16L8J24
6627@m9n3j5L4K20j74M4J58nl02L38k12P3p4q7J18J22j22n2J35j92O3k0J25pj14
$$ plain form
6653 -48 -40 -38 -94 -11 -35 -22 93 30 -58 70 136 110 -299 -32 64 47 45 64 -48 27 -64 46 -127 71 -22 145 -19
6680 -19 -57 49 20 77 -47 23 49 75 52 -54 2 84 52 -53 5 78 -65 27 -62 -29 67 -115 -173 -53 72 -60
6706 -60 -55 22 77 26 -18 -74 57 38 33 -76 -51 55 58 62 -118 -164 95 87 -174 70 64 51 63 44 76 78 -13 -53 91 109
6736 109 80 -5 6 -43 86 -19 -18 60 131 -13 -78 -15 17 56 -20 -152 101 87 19 -89 57 -45 20 50 -130 -71
6762 -71 109 -93 -68 -103 63 206 4 -37 17 36 19 -24 43 136 -83 -22 -7 -53 76 39 -95 85 66 7 82 34
6788 34 -85 68 -20 -33 -10 -38 -15 152 32 0 93 159 -185 38 124 18 72 152 16 23 146 39 20 216 42
6813 42 20 -60 130 46 -165 -86 -122 21 38 -32 19 67 -44 -80 -18 44 54 34 -189 134 47 -173 29 68 66 111 39
6840 39 -275 70 176 -48 -66 68 26 53 -50 -126 7 -10 13 98 81 -131 -32 -93 -34 -2 68 -93 -9 -98 145
$$ packed form
6653d8QKn6Q3k4J3J15o3q8J28O6k6m09K67R6j7kJ9j12P5r1J10j73J98r3J67j64
6680a9l8J06k9N7j24P0K6K6k3j06N6Q2l2j05N8P3j43R2q9L3R6j82n8J20J25j32
6706f0NP7N5n1m4n6J31j9nj09K5J06LMj80m6K59qk61K44oj3J2j9L2Kr1m0J44J8
6736A09k9q5J1m9J29j05JP8P1j44o5O3L2L9p6j32K53j4o8j08J46j02O5L0j80N9
6762g1J80k02K5l5J66J43k02m1N4J9j7m3O7R3k19O1J5m6J29l7j34J80j9n9P5m8
6788C4j19J53q8j3K3k8K3J67j20l2R3O6l44K23Q6j06N4Q0j36PJ23j07j9J96j74
6813D2k2q0J90q4k11P9l6J43J7p0N1M8j11l6O2O2J0k0k23L23q7k20K02L9kM5p2
6840C9l14L45J06k24j8J34m2K7j03p6J33j7K3Q5j7k12R9o1N9L2P0j61Q4q9K43
$$ plain form
6865 145 -78 -75 54 48 105 75 76 -111 143 10 53 88 20 118 34 35 79 11 75 -108 77 -113 79 36 9 -4 -69
6892 -69 -99 -64 -21 -71 -63 45 -91 59 75 -68 -132 138 -13 108 -212 -18 115 -6 -34 28 66 76 -10 -51 -77
6917 -77 71 -47 -87 -58 -1 -180 78 79 -41 -80 34 77 46 93 1 6 65 -176 4 39 -122 -139 97 -62 -23 98
6943 98 -62 -25 21 -10 -21 -56 92 -65 -8 -20 153 -136 111 -65 -87 -32 -198 -55 -89 63 -26 106 112 13 -17
6968 -17 109 -118 -63 -194 215 29 84 -97 46 2 -128 43 -59 -98 26 -25 -25 31 36 -127 2 13 -147 37
6992 37 -95 -43 6 -85 84 -10 -146 -68 -26 -14 -142 37 131 -70 30 182 -36 -23 24 34 -106 45 141 74 150
7017 150 66 -76 32 -48 -51 -146 10 -92 -6 73 19 5 -56 -97 -95 59 -14 -17 147 -44 67 164 120 29 -47 72 -33
7044 -33 139 -40 -132 84 118 -42 -72 -70 -48 -46 -155 25 104 -204 77 -26 44 27 -9 -57 -39 -119 41 2 -26 9
$$ packed form
6865A45k23LJ29oN7l0Jj87K54j33M3L5o8R8q4JM4o8O4j83J85j90J92m3k7j3o5
6892f9l0L5M3n0QJ08j36J50J6j43o4K70j51J21l20J94J33j21k8O2L8J0q6m1k6
6917g7J48j18m0K9N7j79K58Jj20l9J14M3l1M7r2NN9k41J80L5j61j7K36j59L9J21
6943I8j60L7M6l1j1l5J48j57N7j2J73k89K47j76k2N5j66J43l4J52q9J32Or9l0
6968a7J26k27N5j31M09j86N5j81J43m4j30J71j02l9J24n1%N6Nj63J29J1j60J84
6992C7j32N2M9r1J69r4j36P8M2J2j28J79R4k01J00J52k18J3M7J0j40J51R6o7P6
7017A50q4j42J08q0lr5J56j02Q6P9n4j4o1m1KJ54p3lJ64j91J11R7m4r1p6J19j05
7044c3J72j79r2K16L4j60l0KK2Kj09J80P9l08K81j03P0j7l6m8J8q0J60l9k8L5
$$ plain form
7070 9 -31 118 -37 6 49 -108 134 -30 -102 77 68 32 -97 -32 -58 47 -5 -8 67 3 -157 -173 -89 68 91 -30
7096 -30 24 80 34 -102 95 220 -84 28 97 50 60 26 -59 86 -78 136 -24 144 210 -67 -115 -95 148 -158
7120 -158 77 -12 -18 45 -72 31 -38 -14 -11 -3 -39 144 53 -94 -118 -48 31 -2 67 130 23 -40 -148 83 -77 -127 -33
7147 -33 52 55 64 78 133 -120 -102 149 22 12 12 60 46 -58 -47 79 73 85 -50 -43 36 177 -80 18 28 78 50 -7 93
7176 93 -5 -27 -14 72 28 118 -156 -100 -202 8 1 -166 21 -86 78 103 -36 14 -9 -65 -45 159 -205 -110 101
7201 101 -44 -37 84 -43 16 44 95 -56 151 7 99 -49 106 115 42 -27 95 72 -26 -50 58 130 69 -44 43
7226 43 -89 86 -43 82 77 -220 39 13 66 -37 9 77 -9 174 -107 -7 -21 101 -29 -38 22 -26 -26 -126 -133 53
7252 53 102 40 182 88 -39 -26 -86 37 -17 -70 -214 30 -3 26 -86 -64 42 38 127 -59 94 -49 -14 -62 -58 -79
$$ packed form
7070Im0J49j55M3M3j57K42j64p2J79rl6j29O5k6J05n2lP5o4j60j6Q4J57K3j21
7096c0N4N6m6j36J97J25l04J12O9m7J0l4q5J45j64K14j60J68O6k77m8K0K43l06
7120a58K35q9oO3j17J03o9K4LQl6J83r1j47k4P0P9l3O9O3j07o3j08K31j60n0R4
7147c3Q5LRJ4N5k53J8K51j27j0%M8j4j04J1J26oJ2j35PP9J41k57R8J0N0k8n7J00
7176I3r8k2J3Q6m4R0k74N6j02K10pj67J87j07J64K5j39N0k3n6K0K04l64R5K11
7201A01j45PJ21j27N9K8N1j51K07j44R2j48J55Rp3o9J22k3r8k4J08P2o1j13Q7
7226D3j32J75j29J25nk97K59k6N3j03M6O8q6J83k81J00j4J22j30rO0m8%j00pJ86
7252E3M9o2J42r4j27J3o0J23n4n3j44K44l3K9j12K2J06mQ9j86J53j43L5m8Mk1
$$ plain form
7278 -79 -95 1 -62 -26 -117 -46 133 -18 -88 -173 -103 -86 -25 -137 -66 151 54 177 -64 -57 -3 92 5 30 116 -4 33
7305 33 70 -77 -120 39 -9 34 0 -5 -20 -165 -3 -71 57 76 -12 42 289 -36 -9 -1 127 43 52 -42 -35 -37 3 -39 -12
7334 -12 99 62 -143 -106 -9 82 48 -97 -94 11 82 -93 68 5 -16 -55 163 7 -129 70 -58 -1 -146 133
7358 133 -15 30 -22 -79 21 -20 57 67 188 148 108 99 -53 187 52 -57 -44 5 -39 -39 -39 55 20 119 160 15 56
7385 56 -191 -74 -9 25 69 -7 -6 35 -52 -129 -56 4 -34 -167 -29 -96 212 42 -46 131 36 99 -145 25 10 -87
7411 -87 28 51 60 -107 8 119 51 -30 -82 -16 23 -38 -137 -6 -130 -38 -19 -129 213 59 -9 2 17 -113 116
7436 116 93 120 -199 29 31 72 60 153 98 38 97 -79 66 61 90 85 51 -24 32 -10 160 35 -30 -35 40 -66 -8 64
7464 64 -34 -39 -2 89 -132 107 -104 18 75 119 -83 58 53 -71 96 193 -43 11 70 90 25 50 23 -124 140 -235
$$ packed form
7278g9j6R6o3L6r1P1J79j51p0q5P0J7O1j12P1K17r7J23k41PN4R5q7K5Q6j20L7
7305C3L7j47m3J59m8M3l4nj5j45J62o8J28J9q8N4K47l25K7QJ28q4Rr4PkM0m2K7
7334a2J11l7k05L7R7R1l4j45LJ05P1j75J61o3k1l9K18j56j36J99j28N7j45K79
7358A33j48M5n2n7J00m1P7J0J21m0m0rj52K40j35j09J3M9m4%%R4l5R9M1j45M1
7385E6k47J17O5L4M4p6JM1q7p7P3O0l8j33J38o7L08j70q8J77r5O3k44J70j5r7
7411h7J15K3Rj67J15J11o8q1n2O6L9o1r9J31j24R2J9j10L42j54o8J1J5j30K29
7436A16k3K7l19K28KM1j2R3n5o0N9j76J45nK9nl4p5N6m2J70j25o5nP5j06N8P2
7464F4r8nL7R1k21K39k11J22N7M4k02J41nj24J67R7k36N4N9K0o5K5k7j47K64l75
$$ plain form
7490 -235 -84 59 46 -148 -57 -53 -137 105 92 93 -74 10 39 104 -1 -64 2 15 -146 -8 195 -58 157 -36 -144
7515 -144 37 15 4 -132 -79 -105 -62 -79 68 88 -83 -92 -65 -160 -56 -34 -39 17 35 -54 -124 -67 -13 65 -61 -34 -100 -40
7543 -40 21 -39 130 -49 20 -26 -154 -89 -9 25 38 -156 -21 -19 -1 97 40 52 20 -122 45 62 32 112 60 173 -143
7570 -143 -60 70 -90 -89 -73 28 7 23 -27 -145 41 -89 3 -99 110 -19 -42 46 121 89 -58 -24 110 20 27
7595 27 122 -2 -57 -41 -5 12 -47 2 -80 26 -44 105 -11 42 47 124 -174 -71 -87 -32 -61 120 -56 33 77 111 17
7622 17 -70 -190 -54 129 -36 31 -61 62 -9 -60 -60 82 -86 -68 44 -35 36 -144 -6 14 81 85 -89 -135 6
7647 6 47 81 100 -40 -35 -90 14 18 48 -101 -2 81 -100 77 50 -16 -8 -33 -19 18 61 45 59 11 -73 45 -118 -7
7675 -7 -43 -98 57 -65 25 -51 -31 -78 63 11 -44 -15 61 53 153 -13 102 -157 -2 -10 -15 -92 -143 -71 -8 168 42
$$ packed form
7490b35J51J43j3j94R1Mq4K42j3Jj67Q4K9O5j05o3O6J3j61J38K03k53K15j93j08
7515a44J81k2j1j36N3k6M3j7J47K0j71rK7r5J04K2nN6J8q9p0N7N4P8j26K7o6O0
7543d0O1o0J69j79O9m6j28O5Q0L4J3j94J35KJ8R8n7J2l2j42J67J7l0Q0n2J13l16
7570a43Q3J30j60JJ6J01k1J6n0j18J86j30R2j02K09j29k3Q8P5l2j47L4J34r0P
7595B7R5j24n5J6L6J7n9M9q2J06p0J49j16N3NP7k98J03j6N5k9J81j76Q9M4L4r4
7622A7q7j20J36J83j65O7r2J23p1n1%J42j68J8J12p9P1j80J38K0O7Mj74m6J41
7647FM1L4J9j40Nn5J04ML0j49R9Q3j81J77k7o6Qk5J4L7M3j6J4m8q4J18j63J11
7675gl6n5J55j22R0p6K0m7J41n2n5K9P6qJ00j66J15k59J55qnp7n1P2O3J76j26
$$ plain form
7702 42 -130 30 39 -62 -48 44 -138 -29 -24 84 27 71 19 116 -98 -54 220 -25 107 22 66 -22 32 16 -25 -102
7728 -102 140 -94 -130 -83 -18 -30 -84 -46 -56 59 42 -130 18 24 5 -157 -53 -68 -96 164 -213 58 -17 52 -15
7753 -15 -66 64 -49 -73 103 -187 51 -15 -121 24 93 205 56 27 14 9 51 -9 -74 112 -46 -105 -140 -12 142
7778 142 109 75 143 -105 13 7 35 57 -62 65 52 188 64 -21 -78 -47 88 6 89 -89 40 58 -79 60 139
7803 139 38 2 -89 -186 -80 11 -22 47 6 -105 107 -7 45 45 -72 -57 187 164 70 -23 125 106 139 -85 -93 119
7829 119 -18 -67 -59 107 186 24 26 -96 37 -82 85 -118 59 -172 -26 -12 80 -103 91 -17 116 18 -113
7852 -113 88 -141 20 14 -126 -58 112 -151 -58 -14 18 38 -43 2 78 -23 18 37 74 100 -36 -23 -17 -34 16 50 93
7879 93 -40 -33 105 1 17 43 73 -63 -86 -120 -27 -4 -140 29 121 131 -122 43 -2 -93 2 -112 89 64 70 83
$$ packed form
7702D2j72J60Rj01J4R2j82J09NJ08n7M4n2R7k14M4K74k45J32q5M4q8N4j6m1p7
7728a02K42k34l6M7O5j2n4L8j0J15j7j72J48Oj9j62J04j5k8K60l77K71p5O9o7
7753a5n1J30j13k4J76k90K38o6j06J45O9J12j49k9j3nM2o0o5J86j58n9l5J28J54
7778A42l3l4O8k48J18oK8K2j19J27j3J36j24q5n7L1J35q2Q3j78J29J8j37J39P9
7803A39j01l6r1r7J06R1l3O9m1j11K12j14N2%j17J5K44k3r4r3J48j9L3k24qK12
7829A19j37m9QJ66P9j62Kj22J33j19J67k03J77k31J46J4R2j83J94j08J33r8j31
7852a13K01k29J61oj40O8J70k63R3M4L2K0q1M5P6j01M1J9L7K6j36J3Oj7N0L4M3
7879I3j33PJ38j04J6K6L0j36k3l4R3K3j36J69R2J0k53J65m5r1R5j14K01k5OJ3
$$ plain form
7905 83 -69 19 -56 -70 -31 -22 121 114 93 -135 135 88 -71 42 -12 -107 154 -78 -40 19 72 16 30 -26 -70 -5 54
7932 54 14 115 151 -3 -19 -149 23 130 -37 36 55 -99 23 -62 70 31 106 173 50 -11 45 -77 64 -15
7956 -15 77 -90 -113 -3 12 124 -62 20 197 54 154 -194 -69 9 -43 -35 31 19 98 -10 -99 2 -142 -113 48
7981 48 51 -82 -4 3 -48 -46 190 -128 138 110 -43 -28 115 -42 49 -12 -37 4 -69 56 -180 92 -60 -25 8 -47
8007 -47 28 -34 9 230 -135 1 -90 61 -67 -181 19 -63 172 -102 -37 -21 93 24 2 117 29 -74 96 -6
8031 -6 36 2 -1 99 140 101 84 17 63 -50 201 54 65 -7 -43 -43 -22 88 125 62 1 23 -131 89 -43 72 128
8058 128 -65 -11 -88 -177 -31 -57 36 49 163 58 -69 60 -51 -30 -9 40 117 -128 30 46 86 114 46 98 -15
8083 -15 57 -34 58 -85 55 -33 -82 24 49 -35 86 35 119 -2 -89 40 -90 19 -66 12 41 -41 -17 157 -22
$$ packed form
7905H3j52Q8p5j4L9RJ43pk1k28K70m7j59J13n4r5K61k32L8N9N3n6J4n6m4O5N9
7932E4m0J01L6j54j6j30J72J07j67P3J9j54J22q5J32l9P5O7j23o1N6j22J41p9
7956a5R2j67k3J10J5J12j86Q2J77j43J00l48J25P8n2QO6j2P9j08q9J01j44K9J61
7981D8Lj33P8Pn1KK36l18K66k8j53J5J43j57R1o1k5M1p3J25k36K72j52L5L3n5
8007d7P5o2M3K21l65J36r1J51j28j14K00q2K35k74O5J6J14o9k2J15q8j03J70j02
8031fM2l4lJ00M1l9j7o7M6j13K51j47J1p2l6%K1J10L7o3o1K2j54K20j32J15N6
8058A28j93N4p7q9J46k6R3J3J14j05j27J29j11K1K1M9P7k45J58J6M0K8o8N2j13
8083a5P2r1R2j43J40q8m9J06K5q4J21n1Q4j21q7J29j30J09q5P8K9q2K4J74j79
$$ plain form
8108 -22 56 75 116 160 -88 63 5 -83 82 -36 85 64 58 191 239 39 -12 -37 -59 8 -79 25 -138 -116 73 -53
8134 -53 -17 -5 -125 5 -13 142 -42 70 -29 -61 -130 70 81 -7 -46 99 -50 -29 -40 -53 -71 11 79 17 9 -2 -16
8161 -16 -70 62 -223 15 -4 -72 -73 34 17 -16 136 -92 40 105 2 -127 -105 104 26 -129 -74 158 151 -156 148
8186 148 90 -171 -41 133 -21
$$ packed form
8108b2P8J9M1M4k48J51n8q8J65j18J21k1oJ33M8k00n1k5k2O7q7J04j63K2J89j26
8134e3L6J2j20J30j8J55j84J12r9l2o9K00J1q8l9J45j49K1j1j3j8Q2O8o2qj1j4
8161a6n4J32k85K38j9o8jJ07j7l3J52k28J32O5j03j29K2K09p8j55N5K32pl07L04
8186A48n8k61J30J74j54
8191b1
$$ Imaginary data points
##PAGE= N=2
##DATA TABLE= (X++(I..I)), XYDATA
$$ plain form
0 0 0 0 0 0 0 0 0 0 0 0 0 8 -8 8 -8 8 -16 16 -21 24 -30 32 -40 48 -56 65 -80 90 -105 121 -137 158 -178 203
34 203 -230 257 -289 326 -364 405 -452 503 -559 617 -685 756 -834 922 -1015 1118 -1232 1358
52 1358 -1495 1649 -1820 2015 -2233 2485 -2775 3116 -3521 4015 -4628 5419 -6479 7977 -10271
67 -10271 14259 -23063 86058 -181528 -301831 168502 259312 -92992 -281645 57153 292121
78 292121 -2318 -306524 -27916 285045 59440 -257075 -75269 206284 95736 -171546
88 -171546 -117260 152564 148332 -143083 -151882 117356 125203 -93868 -98934 71407 104195 -47154
100 -47154 -113707 27773 110501 -28926 -100031 39885 90191 -46314 -76284 38921 68584
111 68584 -16454 -71291 -5631 78193 959 -85702 19850 92341 -20637 -85534 -1945 64447
$$ packed form
0@%%%%%%%%%%%Qj6J6j6J6k4L2l7M5n4O2p2Q8j04J21j45J70j95K26k58K95l36L81
34B03m33M87n46O15o90P69q57R55j062J176j302J441j590J756j937K133k350K590
52A358k853L144l469L835m248M718n260N891o637P536q643J0047j1898J4456j8248
67a0271K4530l7322J09121k67586j20303M70333R0810l52304j88653L38798K34968
78B92121k94439l04206K78608L12961k25605l16515J81806K81553j10548k67282
88a71546N4286K69824m232k91415q799K69238P847k19071n066J70341L2788j51349
100d7154o6553J41480Q2728j39427p1105J39916N0306j36505k9970J15205K9663
111F8584q5038n4837O5660Q3824p7234q6661J05552P2491j12978o4897Q3589O6392
$$ plain form
123 64447 19225 -51616 -25319 57345 32184 -67142 -37216 66109 33416 -51087 -28176 25741
135 25741 29077 -7475 -34032 11898 41265 -23674 -41511 20652 25619 -10303 -5598 7844 2217
148 2217 -6170 -13271 163 20913 -2814 -20895 18236 16759 -30424 -10174 27824 9585 -14149
161 -14149 -19828 396 30562 274 -34593 11759 38795 -15641 -42298 1259 33913 17008
173 17008 -20314 -25715 19768 29335 -30613 -31536 33141 29694 -19978 -28033 -756 30706 15885
186 15885 -33209 -16001 33236 8598 -33298 -9486 26204 19349 -9106 -25307 -3296 26099
198 26099 50 -28767 6958 28138 -4051 -18093 -6794 7185 16442 -5353 -19590 9757
210 9757 15593 -13475 -10942 11311 10520 87 -10141 -13249 6549 14364 -7871 -4668 15365 407
$$ packed form
123F4447m5222p0841K6297Q2664k5161r9326K9926J03325l2693q4503K2911N3917
135B5741L336l6552k6557M5930K9367o4939j7837O2163M967l5922M705J3442n627
148B217q387p101J3434K0750k3727j8081L9131j477m7183K0250L7998j8239k3734
161a4149n679K0224L0166l0288l4867M6352K7036n4436k6657M3557L2654j6905
173A7008l7322n401M5483R567n9948r23O4677l447m9672q055K7277L1462j4821
186A5885m9094J7208M9237k4638m1896K3812L5690o855k8455j6201K2011K9395
198B6099k6049k8817L5725K1180l2189j4042J1299J3979R257k1795j4237K9347
210I757N836k9068K533K2253p91j0433j0228l108J9798P815k2235L203K0033j4958
$$ plain form
224 407 -14474 -5639 1569 12458 9444 -15459 -8362 15592 1090 -14397 2459 13086 2359
237 2359 -11155 -13960 6971 23162 -4056 -22264 7881 17748 -12557 -17700 5572 19986 8542
250 8542 -20586 -15450 21783 13025 -24456 -10513 23424 12798 -16707 -17868 8127 22728 -2209
263 -2209 -24241 3354 23075 -8905 -21767 8649 20342 1697 -15008 -10596 9995 8576 -12341
276 -12341 -1883 18161 -140 -18081 -1331 11221 1464 -5296 -802 5715 610 -12661 -1697
289 -1697 20481 3440 -21038 -2614 15609 -531 -13949 -681 17482 8860 -19413 -16452 17788
302 17788 16562 -16993 -12956 17488 13192 -14016 -16303 7564 19679 -2584 -20544 2156 18004
315 18004 -5360 -15232 7140 14758 -2668 -13499 -3900 8957 3859 -7322 2575 11681 -6421
$$ packed form
224D07j4881Q835P208J0889l014k4903P097K3954j4502j5487J6856J0627j0727
237B359j3514k805K0931J6191k7218j8208L0145R867l0305n143K3272J4414j1444
250H542k9128N136L7233q758l7481J3943L3937j0626k9505j161K5995J4601k4937
263b209k2032K7595J9721l1980j2862L0416J1693j8645j6705M412K0591j419k0917
276a2341J0458K0044j8301j7941J6750J2552r757o760M494O517n105j3271J0964
289a697K2178j7041k4478J8424J8223j6140j3418J3268J8163q622k8273K961L4240
302A7788j226l3555M037L0444m296k7208k287K3867J2115k2263j7960K2700J5848
315A8004k3364r872K2372P618j7426j0831R599J2857n098j1181R897R106j8102
$$ plain form
328 -6421 -15593 5115 13041 -3574 -8615 3934 9109 -4877 -15005 4393 22000 -1563 -24281
341 -24281 -1651 21254 2686 -18389 -2738 20106 7935 -22431 -16286 19843 19940 -15716 -17765
354 -17765 13192 16827 -10584 -19496 5172 21781 1019 -21251 -4307 17650 5119 -13240
366 -13240 -4525 10584 6235 -8993 -10974 4614 13047 960 -8070 -2198 2186 147 -1352 -1597
380 -1597 2537 6082 -434 -8044 -3667 5382 6470 -715 -6943 -2562 5674 1582 -5828 884 8241
395 8241 519 -8802 -5156 5145 6424 -2099 -3822 3813 2598 -6488 -4138 5874 4143 -4069 -2722
410 -2722 4036 1828 -5439 -2959 7765 5425 -8838 -7216 7531 6721 -6816 -5711 8764 8517
424 8517 -9304 -13886 5525 15534 -1276 -13218 1085 12570 -1937 -14112 -388 15203
$$ packed form
328f421r172K0708P926j6615n041J2549N175j3986j0128J9398J7607k3563k2718
341b4281K2630K2905j8568k1075J5651K2844j2171l0366O145L6129R7l5656k049
354a7765L0957L635k7411q912K4668J6609k0762k2270J6944K1957j2531j8359
366a3240Q715J5109m349j5228j981J5588Q433j2087r030N872M384k039j499k45
380a597M134L545o516p610M377R049J088p185o228M381Q236m092p410O712P357
395H241p722r321L646J0301J279q523j723P635j215r086K350J0012j731q212J347
410b722O758k208p267K480J0724k340j4263J622J4747q10j3537J105J4475k47
424H517j7821m582J9411J0009j6810j1942J4303J1485j4507j2175J3724J5591
$$ plain form
436 15203 5084 -14270 -8829 10922 9462 -7399 -7302 6416 6322 -6668 -9055 4333 10331 376
450 376 -7408 -1784 3892 -464 -3235 1240 3375 -16 -1784 -959 -113 -365 1260 2894 -834 -4526
466 -4526 -794 4132 1548 -3338 -381 5260 677 -7816 -3907 6744 6786 -3308 -5818 2399 4238
481 4238 -3771 -5158 3328 7404 -831 -8167 -2018 6142 3127 -3446 -2038 2542 728 -4070 -1934
496 -1934 4121 4302 -793 -4145 -1700 1845 712 -523 689 1577 20 -2024 -1986 1005 2203 658
512 658 -1116 -1105 679 164 -1342 562 2679 597 -2437 -2593 863 1778 -110 -154 1651 901 -2873
529 -2873 -3718 1478 4678 342 -3140 -632 1967 -496 -2776 959 4626 555 -4650 -2942 2651
544 2651 3850 -677 -1929 886 744 -1947 -2016 1464 3303 891 -2038 -1869 -553 1014 1514 -244
$$ packed form
436A5203j0119j9354N441J9751j460j6861R7J3718r4j2990k387J3388N998r955
450C76p784N624N676m356k771M475K135l391j768Q25Q46k52J625J634l728l692
466d526L732M926k584m886K957N641m583q493L909J0651M2j0094k510Q217J839
481D238q009j387Q486M076q235p336O149Q160l015o573J408M580j814m798K136
496a934O055J81n095l352K445L545j133j235J212Q88j557k044L8K991J198j545
512F58j774J1J784n15j506J904K117k082l034j56L456R15j888m4J805p50l774
529b873q45N196L200m336l482K508K599k463k280L735L667m071n205J708N593
544B651J199m527j252K815j42k691o9L480J839k412k929J69J316J567N00j758
$$ plain form
560 -244 -1051 258 1047 -659 -2552 92 3860 1838 -3244 -3479 1916 3913 -1706 -3529 2446 4346
576 4346 -2288 -5883 -61 6141 2290 -4162 -2088 2566 1297 -2967 -1164 3862 2274 -2730 -2730 343
592 343 1417 752 903 466 -2230 -2506 2096 2699 -2131 -2053 3190 3082 -4589 -6145 4351 8819 -2211
609 -2211 -9870 166 10215 384 -11123 -1622 12547 4438 -11868 -8157 10210 10313 -8084 -11042
623 -11042 6816 12032 -5343 -13250 2462 13755 1312 -12124 -4168 9514 4950 -7727 -4785
636 -4785 7069 5768 -4796 -7086 1220 6530 1951 -3739 -2491 960 1546 434 -1424 -1812 2079
651 2079 3791 -2026 -6596 -107 7832 3544 -7133 -6337 5426 7752 -5059 -9071 4857 11006
665 11006 -2662 -12169 -1500 11837 4372 -10510 -6048 9347 7259 -7973 -8940 5701 10046
$$ packed form
560b44q07J309P89j706j893K644L768k022n082k35N395J997n619j823N975J900
576D346o634l595N822O202l851o452K074M654j269m264J803N026j588n004%L073
592C43J074o65J51m37k696k76M602O03m830P8N243j08p671j556J0496M468j1030
609b211p659J0036J0049r831j1507R501J4169q109j6306L711J8367J03j8397k958
623a1042J7858N216j7375p907J5712J1293j2443j3436P956J3682m564j2677K942
636d785J1854j301j0564k290Q306N310m579n690J248L451N86j112j858l88L891
651B079J712n817m570O489P939m288j0677P96J1763K326j2811m012J3928O149
665A1006j3668r507J0669J3337p465j4882M462J5395k088j5232r67J4641M345
$$ plain form
678 10046 -2071 -10082 -1459 8569 3341 -6787 -3636 5197 4198 -3751 -5939 528 6896 3213
692 3213 -4998 -4804 2497 5032 -553 -5185 -845 6016 2964 -6510 -5367 5918 7443 -3479 -8090
707 -8090 449 7520 1360 -7200 -2131 7667 3504 -6904 -5430 4245 5927 -1299 -5395 -113 4539
722 4539 1041 -4224 -1844 2743 2618 -425 -3221 -2218 2406 4145 -1107 -4643 -645 4440 2133
737 2133 -5080 -4023 5939 7021 -5461 -9273 2959 9625 -553 -9402 -703 9784 2594 -10713
751 -10713 -4913 10549 7102 -8871 -8377 6141 8956 -3823 -8895 2487 9265 -1981 -9772 -15
765 -15 8855 1844 -6229 -2481 4539 2402 -4190 -2859 3605 2865 -2567 -1735 1484 538 -1013 431
781 431 1063 -934 -1626 531 2158 -561 -2120 1708 3118 -2499 -4450 1572 4694 64 -3768 -368
$$ packed form
678A0046j2117q011Q623J0028n228j0128L151Q833r99p949k188O467O368l683
692C213q211J94P301K535n585m632M340O861l052r474J143J1285J525j0922m611
707h090Q539P071o160q560N069R798m163j0408J474R675J682p226m096N282M652
722D539l498n265K380M587j25l043k796J003M624J739n252l536L998N085k307
737B133p213J057R962J082j2482l812J2232O666j0178q849Q699J0487p190j3307
751a0713N800J5462l447j5973M94J4518K815j2779n072J1382O778j1246p791R757
765a5Q870p011q073L748P020k137o592J331O464p40n432Q32L219r46j551J444
781D31O32j997o92K157J627k719j559L828J410n617j951O022L122m630l832L400
$$ plain form
797 -368 3854 418 -4589 -1320 4941 2072 -4338 -2432 3169 2895 -1937 -2772 1367 2531 -1795 -3072
813 -3072 1783 3329 -382 -2042 -351 995 -227 -1469 106 1983 486 -1478 -466 978 -127
828 -127 -960 -94 339 19 -526 -611 766 1408 -296 -1177 -523 205 349 -443 -170 1694 1683 -1670 -2713
847 -2713 541 2718 -257 -2388 -58 2799 948 -3322 -1629 3710 2107 -3802 -3220 2730 4235
862 4235 -1329 -3731 1224 4236 -1403 -5044 219 4949 1322 -3920 -1301 3314 1530 -3358 -2278
877 -2278 2665 2564 -2418 -2316 2225 2146 -1130 -1583 543 862 -1319 -1339 1400 1710 -906 -705 1367 174
895 174 -2649 -916 2742 1649 -2086 -1843 2369 2476 -2308 -3090 1728 3432 -1660 -4060 855 4948
911 4948 1062 -4481 -2125 3479 2188 -3772 -3110 3731 4422 -1916 -4645 229 4608 717 -4915 -2051
$$ packed form
797c68M222l436n007L269O261k869o410J906N601k74m832q35M139J164m326j277
813c072M855J546l711j660J691J346j222j242J575J877j497j964J012J444j105
828a27q33Q66M33l20n45q5J377O42j704q81O54P28J44p92K73J864j1l353j043
847b713L254K177k975k131K330K857j851m270J693N339j603n909N82N950J505
862D235n564k402M955L012n639l641N263M730l627n242K619M615j784m888J080
877b278M943j01m982J02M541p9l276m53K126L19k181k0K739L10k616K01K072j193
895A74k823J733L658j093l735K43M212J07m784p82M818J704n092k400M915M093
911D948l886n543K356N604j291n960O62O841O91o338k729M874M379l891n632K864
$$ plain form
927 -2051 4465 3131 -3424 -3507 2669 4490 -1887 -5428 2 4754 1471 -3923 -1625 4336 2473 -4100
943 -4100 -4011 2187 4101 -939 -3271 1083 3234 -443 -3036 -563 2202 699 -2079 -658 1612 875
959 875 -129 136 116 -1469 -1129 1620 1353 -1476 -462 2496 1398 -3150 -3172 2727 4021 -2417 -4479
976 -4479 2404 5668 -1348 -6256 486 6491 -1 -7135 -1491 7061 3349 -5933 -3725 5437 4010
991 4010 -5429 -5364 4304 6190 -2824 -5547 2433 5270 -2076 -5295 1083 4786 -587 -4423 595 4110
1007 4110 -119 -3336 88 2930 -1205 -3334 1557 4151 -869 -3655 1045 3629 -1738 -4809 1598
1022 1598 5328 -798 -5391 464 5942 334 -6312 -1294 6054 1728 -5832 -2478 6058 3969 -5265
1037 -5265 -4389 3911 4109 -3706 -4588 3175 5424 -1763 -5016 882 3933 -596 -3869 365 3620 44
$$ packed form
927b051O516j334o555q3O176J821o377l541N430M752l283n394K298N961j863o573
943d100Q9O198J914n040k332M354K151l677k593K473K765j503k778J421K270p37
959H75j004K65k0j585L40K749k67k829J014K958j098m548k2N899J294o438k062
976d479O883L264p016m908O742O005o492p134N644Q552l712r282K208R162j427
991D010r439O5R668J886r014k723P980K837p346l219O378L703n373l836N018L515
1007D110m229l217L424K842m135k129M891K594n020k786M700K584n367l071O407
1022A598L730o126m593N855N478n608o646N018P348m326p560L354Q536k089r234
1037e265Q76Q300J98p815q82P763K249p187l253N898L051m529l273M234L255l576
$$ plain form
1053 44 -2752 -130 2397 167 -2292 -446 1437 -215 -1153 1073 1724 -723 -1677 356 1271 -1166
1069 -1166 -1608 1694 2502 -1233 -2413 1013 2444 -925 -2729 302 2490 262 -2550 -405 2710
1084 2710 341 -2843 -1130 1464 831 -1170 -739 1559 1129 -1200 -1355 607 572 -628 -195 733 346
1101 346 -416 68 296 45 -501 -150 673 -23 -1072 587 1386 -575 -1314 -73 444 -60 -423 230 1319
1120 1319 233 -1351 -545 1097 -7 -985 149 785 74 -285 -101 518 274 -1039 -331 968 -78
1137 -78 -724 861 981 -576 -737 -86 194 32 -551 150 1303 141 -1410 181 1031 -405 -712 247
1155 247 540 255 -401 -328 947 196 -1570 -433 1041 -573 -761 1099 850 -449 -1056 -556 790 582
1173 582 -1310 -205 2131 -51 -1977 51 1127 292 -948 -1168 555 1765 -636 -1565 1120 1146
$$ packed form
1053D4k796K622K527k230k459J846J883j652r38K226O51k447r54K033R15k437
1069a166m42L302Q08l735j180L426J431l369j804L031K188k228k812K145L115
1084B710k369l184J713K594o33k001M31K298m30k329j55J962l5j200M33R28l87
1101C46p62M84K28k51n46L51Q23o96j049J659P99j961p39J241N17n04l63O53J089
1120A319j086j584Q06J642j104r78J134O36p11l59J84O19k44j313P08J299j046
1137g8o46J585J20j557j61O51K80j62n83P01J153j162j551J591Q50j436l07R59
1155B47K93k85o56P3J275p51j766J137J474j614j88J860k49j299o07N00J346k08
1173E82j892J105K336k182j926K028J076q35j240k20J723J210k401r29K685K6
$$ plain form
1189 1146 -1093 -1080 -270 493 1189 -191 -1188 767 855 -1106 -813 18 310 1239 -241 -1729 554 1931
1207 1931 -848 -1669 220 833 444 -911 -1434 1642 2560 -1746 -2623 1175 1415 -693 -1036 -52 1801
1224 1801 1198 -2278 -1466 2298 723 -1738 -226 435 315 596 -460 -843 1108 333 -898 -94 -204
1241 -204 -141 1984 232 -2638 -98 2080 -406 -1846 -548 1666 2497 -1375 -3668 1912 3854 -2215
1257 -2215 -3694 1541 3234 104 -2855 -1323 3813 2466 -4678 -2831 3973 2316 -2843 -1614 1690
1272 1690 2501 -409 -3542 -523 3658 161 -2856 557 1709 -102 81 -670 -877 1172 413 -1278
1288 -1278 236 384 67 1842 -612 -3030 931 2734 -1621 -2125 1121 2140 1060 -2370 -2493 2939
1304 2939 2901 -3661 -2605 3546 2199 -2043 -2021 386 3073 634 -4409 -991 4133 625 -2893 255
$$ packed form
1189A146k239J3Q10P63O96j380r97J955Q8j961K93Q31K92R29j480j488K283J377
1207A931k779q21J889O13l89j355n23L076R18m306q77L798K40k108l43R84J853
1224A801o03l476Q12L764j575k461J512O61j20K81j056l83J951p75j231Q04j10
1241b04O3K125j752k870K540K178k486j440J298K214Q31l872k293N580J942o069
1257b215j479N235J693l130k959J532N136j347p144J847O804j657n159J229L304
1272A690Q11k910l133L019M181l497l017L413J152j811J83p51k07K049p59j691
1288a278J514J48l17J775k454k418L961J803m355n04L246J019j080l430j23N432
1304B939l8o562J056O151j347m242K2K407K687k439n043L418N124l508l518L148
$$ plain form
1320 255 1705 517 -520 -2086 -323 2665 2 -1985 653 431 -387 1066 -797 -1867 1612 1439
1336 1439 -1827 -560 1197 879 1012 -1846 -2434 2633 2271 -3203 -1322 2970 1117 -1381 -1803 -308
1352 -308 2649 796 -3628 -19 3714 -501 -2565 498 849 375 -359 -1860 509 2407 -830 -1042
1368 -1042 1514 -437 -1189 1047 -365 -1214 1357 861 -760 -58 -625 81 2204 -1086 -2808 2391
1384 2391 2321 -2403 -1301 1605 1144 -324 -2137 -1386 3288 1540 -3642 -152 3489 -268 -2643 -215
1400 -215 991 1406 -495 -2301 1379 2632 -2235 -2072 2146 653 -1324 -386 84 875 925 -1497 -60
1417 -60 2071 -1274 -2310 1905 981 -1674 471 755 -597 116 -1077 -474 2232 -136 -2608 1177
1433 1177 1672 -1762 -390 1038 -138 80 -522 -1130 1606 1078 -1949 148 1722 -1401 -928 1124
$$ packed form
1320B55J450j188j037j566J763K988k663j987K638k22q18J453j863j070L479j73
1336A439l266J267J757l18J33k858n88N067l62n474J881M292j853k498m22J495
1352c08K957j853m424L609L733m215k064L063L51m74p34j501K369J898l237k12
1368a042K556j951p52K236j412q49K571m96j621P02n67P06K123l290j722N199
1384B391p0m724J102K906m61j468j813P51M674j748n182L490L641l757k375K428
1400b15J206M15j901j806L680J253m867J63M218j493j977R38M70P91N0k422J437
1417f0K131l345j036M215r24k655K145K84j352P13j193O03K706k368k472L785
1433A177M95l434J372J428j176K18o02o08K736n28l027K097J574l123M73K052
$$ plain form
1449 1124 -119 40 547 -958 513 949 -1833 -200 2075 -761 -1411 1285 376 -412 301 -646 195
1466 195 1447 -1534 -1423 2321 933 -1733 281 497 -458 441 -868 -741 2139 502 -2270 317
1482 317 1391 -542 -129 -130 -684 844 348 -1925 438 1750 -745 -725 129 -566 654 789 -1604 66
1500 66 1713 -956 -875 885 -66 63 955 -1181 -569 1413 -368 -689 949 -281 -650 1039 -643
1517 -643 -1252 1537 905 -895 -193 -380 -125 1407 -786 -1511 2012 1486 -2190 -1089 1099 1093 87 -1509
1535 -1509 -982 2496 1098 -3004 -359 2854 192 -2032 -882 944 2083 -212 -2788 607 2789
1550 2789 -1202 -2504 1002 1352 51 -612 -963 670 1495 -1283 -1088 1473 179 -1019 299 -9
1566 -9 -581 972 110 -759 141 46 -87 961 -377 -1079 1466 896 -1993 -790 1522 865 -384 -1393
$$ packed form
1449A124j243J59N07j505J471M36k782J633K275k836o50K696r09p88P13r47Q41
1466A95J252k981J11L744j388k666K014K16r55Q99j309J27K880j637k772K587
1482C17J074j933M13jn54J528m96k273K363J312k495K0Q54o95J220J35k393J670
1500F6J647k669Q1J760r51J29Q92k136O12J982j781l21J638j230l69J689j682
1517f43o09K789o32j800P02j87K55J532k193p25L523n26l676J101K188oj006j596
1535a509N27L478j398m102K645L213k662k224J150J826J139k295k576L395K182
1550B789l991j302L506L50j301o63l51J633Q25k778J95K561j294j198J318l08
1566in72J553q62q69R00r5j33J048j338p02K545n70k889J203K312o57j249j009
$$ plain form
1584 -1393 -322 1927 318 -2516 85 2572 -236 -2098 -211 1162 1269 -681 -1972 798 1773
1599 1773 -1392 -1538 1335 927 -527 -590 -434 559 939 -713 -712 905 86 -687 495 -95 -480 827
1617 827 300 -927 -194 267 196 370 -495 -478 1034 319 -1842 -10 1569 151 -692 -500 17 908 -52
1636 -52 -1279 537 1224 -778 -935 345 506 415 170 -825 -199 584 -449 -195 586 -137 -192 531 -576
1655 -576 -705 1121 537 -543 -535 69 540 518 -1052 -424 1773 216 -1810 -422 1297 621 -558 -898
1673 -898 544 1207 -705 -1709 971 1730 -561 -1318 177 709 163 -590 -200 1011 349 -1452 -356
1690 -356 1104 135 -546 358 266 -431 -173 217 716 72 -778 -223 753 -405 -817 835 699 -629 -862
1709 -862 163 616 109 -832 -38 1142 -142 -1446 -81 1061 -60 -823 -125 618 172 -790 -778 1151
$$ packed form
1584a393J071K249j609k834K601K487k808j862J887J373J07j950j291K770R75
1599A773l165j46K873m08j454o3J56R93L80j652JJ617q19p73J182n90l85J307
1617H27n27j227P33M61p1J74q65J7J512p15k161J832J579j418q43J92N17Q91r60
1636e2j227J816O87k002j57J280J61r1k45r95O26P83j033K54P81p23n5P23j107
1655e76j29J826n84j080QO04M71k2j570O28K197j557k026J388J719o76j179l40
1673h98J442O63j912j004K680P59k291p57J495N32n46p53L90J211o62j801J096
1690c56J460r69o81R04r2o97K58L90M99o44q50N55R76j158m12J652j36j328k33
1709h62J025M53n07r41P94J180j284j304J365J142j121p63O98P43m46r62J2J929
$$ plain form
1727 1151 586 -1023 -374 778 243 -528 83 565 320 -555 -839 631 701 -640 -375 834 30 -825
1745 -825 -159 649 573 -401 -591 143 500 -435 -372 845 471 -633 -670 199 556 -43 -40 134 377 -472 -536
1766 -536 318 471 -238 -280 284 32 -308 -264 328 282 -225 -469 131 530 -274 -99 717 130 -559 -421 276
1787 276 619 84 -283 276 272 -607 -491 433 452 -67 -402 351 16 -270 -108 438 424 -427 -681 465 580
1808 580 -339 -291 409 302 -685 -799 494 920 -215 -719 209 638 -432 -1018 158 1108 51 -948 -322
1827 -322 987 552 -681 -352 692 222 -807 -552 301 848 51 -448 159 278 -182 -297 175 581 172
1846 172 -339 -281 -302 230 428 22 -270 -206 90 129 -70 -29 362 141 -449 -577 1 561 202 -256 -283 230
1868 230 139 -307 -456 190 409 13 -415 -223 538 423 -200 -362 140 414 -82 -535 -36 958 435 -705
$$ packed form
1727A151n65j609O49J152n35p71O11M82k45q75k84J470P0j341K65J209q04q55
1745h25O66Q08p6r74j90P34L57r35O3J217l74j104l7Q69L57n99LJ74K43q49o4
1766e36Q54J53p09m2N64k52l40M4N92m6n07k44O00L99q04J75Q16n87o89J38O97
1787B76L43n35l67N59mq79J16R24J9n19l35P53l35k86J62N46j4q51k54J146J15
1808E80r19M8P00j07r87j14J293M26j135n04R28M29j070n86J176R50j057r99O26
1827c22J309m35j233L29J044m70j029K55Q53N47p97m99O07J19m60j15M72M06m09
1846A72n11N8k1N32J98m06k92O4K96L9j99M1L91k21n90j28N78N60l59m58k7N13
1868B30r1m46j49O46K19l96m28J92P61j15o23j62N02K74m96m53M99R94n23j140
$$ plain form
1888 -705 -787 220 563 -132 -674 368 890 -154 -1015 -85 1083 378 -827 -393 489 493 -598 -263 704
1907 704 422 -859 -719 203 577 147 -309 284 109 -434 -311 309 314 -368 -185 641 -27 -890 -79 1090
1927 1090 234 -993 -636 1142 740 -961 -654 1336 927 -1239 -1504 792 1693 -569 -1428 613 1627
1944 1627 -490 -1947 -20 2028 527 -1735 -696 1474 703 -1279 -726 1194 805 -1228 -1120 865
1960 865 1099 -469 -796 306 466 -528 -484 397 577 -255 -413 283 26 -544 -4 592 169 -790 -232 862
1980 862 381 -936 -224 923 397 -1295 -906 1189 954 -645 -805 662 750 -877 -1176 748 1339 -364
1998 -364 -1077 129 975 -50 -803 139 759 -217 -1092 -153 952 284 -685 -259 367 5 -679 28 864
2017 864 436 -595 -378 506 42 -630 46 637 272 -753 -150 581 342 -416 -276 272 167 -500 -508 433
$$ packed form
1888g05q2J007L43o95n42J042N22j044q61R30J168p05j205M34Q82Mj091L35R67
1907G04k82j281J40R22L74m30m56N93j75n43J23O20No82J83Q26o68q63Q11J169
1927A090q56j227L57J778m02j701L07J990m09k166k65K296R01k262q59K041J014
1944A627k117j457J927K048j501k262J039K170p71j982N53J920l89k033J08J985
1960H65K34j568l27J102J60r94M4Q81J80q32j58O96k57n70N40N96m23r59N58J094
1980H62m81j317P12J147n26j692L89K095k35j599j60J467Q8j627k99J924N91j703
1998c64p13J206Q46j025p53R42O20r76q75R39J105o68r69M26O26l62o84P07Q36
2017H64m28j031K17Q84m64o72O76N91l65j025O03P31k39p58J40N48j05o67qR41
$$ plain form
2037 433 356 -268 -586 -105 167 -21 -12 293 277 -176 -256 -103 -47 -57 130 201 -54 -201 71 147 137 -150 -205 35
2061 35 -150 -315 176 363 20 -207 -123 -109 -149 -86 239 376 68 -397 -33 171 -6 -178 266 228 -89 -130
2083 -130 100 399 167 -350 -80 277 -174 -405 274 738 299 -492 -170 331 201 -405 -229 740 491 -518
2103 -518 -641 261 661 -44 -496 -307 144 85 -335 -20 617 376 -355 -636 -58 502 361 -209 -209 313 271
2124 271 -498 -546 -114 605 265 -534 -281 676 454 -369 -508 249 487 -271 -807 122 987 333 -675 -389
2144 -389 472 11 -316 -457 382 673 -29 -793 -69 352 297 -351 -212 -44 250 167 -255 42 379 99 -370
2165 -370 -429 57 662 496 -480 -356 436 78 -383 -592 384 880 -8 -1051 -27 873 149 -724 -234 484
2185 484 344 -487 -394 475 768 -340 -857 27 341 -239 -398 155 489 15 -353 -85 150 121 38 -47 -85
$$ packed form
2037D33p7o24l18M81K72j88RL05j6m53q0J53N6j0J87P1k55j47K72P6j0k87n5K40
2061C5j85j65M91J87l43k27Q4J4m0O3L25J37l08m65L64K04j77j72M44l8l17m1
2083a30K30K99k32n17K70L57m51k31O79M64m39p91L22N01j30o06J76R69k49j009
2103e18j23R02M00p05m52J89M51n9m20L15O37k41p31k81N78N60j41n70%N22m2
2124B71p69m8M32P19l40p99K53R57k22q23j39P57K38p58n36R29Q65o54j008K86
2144c89Q61m61l27j41Q39K91p02p64P24M21n5o48J39J68K94q3m22K97L37k80m69
2165c70n9M86O05j66r76J24P92l58m61k09R76M96q88j043J024R00p24q73M90P18
2185D84j40q31R3Q69K93j108n17Q84L14n80j59N53L34m74l68K68K35k9q3q5l8
$$ plain form
2206 -85 -404 55 362 15 -328 4 190 -182 -619 23 963 393 -661 -504 463 339 -346 -273 538 747
2226 747 -254 -1083 -84 952 -40 -828 -183 613 263 -623 -192 457 383 -368 -717 19 534 81 -155 159
2246 159 311 373 -308 -417 -162 562 295 -316 -263 48 424 59 -487 -16 333 91 -563 -238 619 639 -367
2267 -367 -832 52 447 -319 -626 360 728 -11 -640 -87 450 249 -501 -192 430 56 -372 -183 443 264
2287 264 -307 -99 74 45 -179 61 443 -52 -443 -110 345 29 -280 -78 600 -39 -562 -97 578 128
2307 128 -593 -264 487 209 -449 -167 632 503 -507 -593 67 254 -139 -185 392 424 -331 -506 39 300 -85
2328 -85 -303 133 112 -150 -265 309 249 -289 -258 257 251 -174 -159 510 154 -626 -458 202 316 -518 -288 262
2350 262 439 -347 -530 277 594 -186 -538 86 399 -6 -388 -6 666 71 -710 -207 386 295 -219 -80
$$ packed form
2206h5l19M59L07l47l43L32J86l72m37O42R40n70j054J57R67j24o85P3Q11K09
2226G47j001q29R99J036r92p88O45P96l50q86M31O49p4p51l49P36N15m53k36L14
2246A59J52O2o81j09K55P24k67o11N3L11L76l65n46M71L49k42o54L25Q57K0j006
2267c67m65Q84L95p66l07R86L68p39o29N53N37k01p50L09O22l74m28J89O26j79
2287B64n71K08J73k9k24K40L82m95l91L33M55l16l09K02O78o39n23M65O75m50
2307A28p21L29P51k78o58K82P99j29j010q6O60J87l93m6N77L2p55j75N45K61l85
2328h5k18M36k1k62j15N74o0n38L1N15om25J5O69l56p80J68O60J14q34K30N50
2350B62J77p86j83Q07L17p80l52O24L13m05l82L82O72n95p81N03N93r1n14J39
$$ plain form
2370 -80 313 79 -386 -111 362 242 -297 -215 240 51 -154 84 202 131 -200 -210 118 47 -209 -129 -44 -16 -376
2393 -376 -232 191 80 0 49 43 -168 -152 -38 157 -10 -197 68 59 -31 -234 36 348 -129 -586 -48 433 -130
2416 -130 -354 138 504 -160 -546 -56 374 193 -343 -56 205 27 -412 -101 258 316 -274 -344 98 155 -196
2437 -196 3 284 -91 -39 -120 24 193 115 20 227 3 -470 36 163 80 -254 83 351 19 -474 -111 359
2459 359 148 -304 -249 378 84 -156 -221 203 128 -133 -259 -125 430 118 -192 -62 213 -91 32 56 53 53 0
2482 0 -85 -51 132 70 14 -283 -425 40 342 -62 -88 318 275 -58 -314 -138 326 200 -261 -117 218 154 -377
2505 -377 -191 208 219 -88 -304 -116 89 -138 -101 -110 -144 39 -129 -53 -191 384 348 212 -247 -376 92 367
2527 367 -217 -442 304 444 -393 -459 305 457 80 -605 -247 761 123 -769 -263 769 207 -525 -412 526
$$ packed form
2370h0L93k34m65K75M73j20n39Q2M55j89k05K38J18p1l31j0L28p1k56Q0Q5K8l60
2393c76J44M23j11q0M9ok11J6J14J95j67j87K65rr0k03K70L12m77m57N38M81n63
2416a30k24M92L66o64l86M90M30j81n36K87K61j78m39L11L59N8n90p0M42N7l51
2437a96J99K81l75N2q1J44J69p8r5K07k24m73N06J27q3l34L37K68l32m93L63M70
2459C59k11m52N5O27k94k40o5M24p5k61j26J34N55l12l10J30K75l04J23K4l%n3
2482@q5L4J83o2n6k97j42M65L02m04k6M06m3l33k56J76M64j26m61J44L35o4n31
2505c77J86L99J1l07k16J88K05k27L7rl4J83j68P6j38N75l6j36m59j29M68K75
2527C67n84k25P46J40q37o6P64J52l77o85L58J008o38q92N06J032n62p32J13R38
$$ plain form
2547 526 689 -382 -606 205 619 -493 -458 350 350 -80 -264 -27 399 64 -171 -46 330 -24 -295 258
2567 258 77 -206 128 363 92 -196 -278 159 330 -293 -308 414 535 -490 -505 481 300 -188 -376 23 631
2588 631 43 -739 -42 738 -30 -562 57 292 422 -273 -434 201 553 -412 -225 421 109 -178 -34 -43 -9
2609 -9 202 -114 -55 -22 -101 91 302 -94 -304 266 247 -497 -85 236 65 200 -244 -28 365 -63 -565 241
2631 241 490 -88 -109 -160 97 115 -91 -244 146 286 -257 -153 491 -92 -157 259 -103 -152 -39 -121 181 394
2653 394 -326 -229 305 -54 -328 226 80 -234 26 8 87 203 -301 -199 486 69 -701 154 295 -273 -211
2674 -211 0 71 62 -62 -278 493 287 -677 6 665 -185 -224 150 249 351 -310 -476 756 832 -794 -388
2695 -388 551 156 -540 -331 223 395 109 -573 -279 840 -49 -541 180 273 -83 -59 -190 -33 572 -155
$$ packed form
2547E26J63j071k24Q11M14j112L5Q08%m30j84K37M26l35k35J25L76l54k71N53
2567B58j81k83L34K35k71k88q2M37J71o23j5P22J21j025j5R86j81m88j88L99O08
2588F31n88p82O97P80p68n32O19K35J30o95j61O35L52r65J87O46l12k87J44rL4
2609iK11l16N9L3p9J92K11l96k10N70j9p44M12L21j71J35m44K16L93m28n02Q06
2631B41K49n78k1n1K57J8k06j53L90J40n43J04O44n83o5M16l62m9J13q2L02K13
2653C94p20R7N34l59k74N54j46l14K60j8P9J16n04J02O85m17p70Q55J41n68O2
2674b11K11P1rj24k16P71k06r64O83O59q50l9L74R9J02o61j66J232P6j626M06
2695c88R39l95o96K09N54J72k86o82K94J119q89m92P21R3l56K4j31J57O05p27
$$ plain form
2715 -155 -369 250 73 -266 107 40 -264 139 201 -257 -72 158 -15 126 1 -456 409 580 -821 -358
2735 -358 450 135 -283 -296 -388 572 328 -650 -337 806 151 -557 4 414 208 -122 -789 -134 886 -39
2755 -39 -623 398 329 -157 102 -299 -262 521 182 -580 -45 275 81 65 -292 -254 590 469 -739 -172 657
2776 657 57 -233 -202 -111 692 61 -861 -36 821 -342 -703 154 215 109 -19 -603 76 826 -183 -571
2796 -571 269 125 -133 -164 -322 -119 678 -68 -574 137 205 97 85 -251 -301 734 257 -628 21 460 100
2817 100 -39 -232 -203 585 182 -925 83 890 -139 -432 -4 53 488 8 -804 301 792 -371 -621
2836 -621 155 439 65 -70 -442 184 858 -338 -596 293 230 -168 -5 -192 28 533 -94 -758 199 336
2856 336 -74 -109 -202 124 697 20 -705 373 479 -327 -361 48 150 230 -199 -634 359 582 -495 -289 376
$$ packed form
2715a55k14O19j77l39L73o7l04M03O2m58J85K30j73J41j25m57Q65J71j401M63
2735c58Q08l15m18j3r2R60k44r78L13J143o55p08N61M10k06l30o67O55J020r25
2755c9n84J021o9m86K59m01L7P83l39p62N35L20j94j6l57L8Q44j21j208N67Q29
2776F57o00k90L1R1Q03o31r22Q25Q57j163l61Q57O1j06j28n84O79P50j009l88
2796e71Q40j44k58l1j58K03P97p46n06P11O8j08j2l36n0J035m77q85O49M39l60
2817A00j39j93K9P88m03j107J008Q07j029k93M28N7M35m80q12J105M91j163k50
2836f21P76K84l74j35l72O26O74j196k58Q89o3l98J63j87K20N05o27o64R57J37
2856C36m10l5r3L26N73o77p25J078J06q06l4M09J02Q0m29m35R93K23j077K06O65
$$ plain form
2877 376 186 120 107 -226 194 415 -97 -137 395 -131 -143 404 -386 -316 574 26 -456 71 -32 -39 149 -325
2899 -325 -239 716 1 -699 173 590 -100 -318 -227 259 417 -224 -775 519 715 -617 -311 495 121 36
2919 36 -212 -65 419 214 -417 127 580 -357 -412 235 273 -230 15 -26 269 157 -311 95 342 -315 -462
2940 -462 582 254 -440 -106 355 366 108 -489 -141 639 24 -672 283 666 -230 -422 33 199 290 -364
2960 -364 -325 649 278 -632 -101 458 64 -504 -7 115 221 0 -219 486 319 -525 -240 555 64 -383
2980 -383 37 261 225 -223 -297 242 410 -314 -549 681 213 -337 -64 57 108 92 -383 -113 490 157 -367
3001 -367 268 315 -289 -327 87 61 18 -14 -51 143 -93 -431 182 201 -329 -140 197 58 -14 -47 -67 450 109
3024 109 -539 -39 516 -97 -304 225 246 -91 -241 -81 106 288 -199 -94 281 72 -165 98 64 -22 244
$$ packed form
2877C76j90o6j3l33M20K21n12m0N32n26j2N47p90P0Q90n48m82N27j03pJ88m74
2899c25Q6R55p15p00Q72M17o90k18R1M86J58o41n51J294J96j332L06Q06l74q5
2919C6k48J47M84k05o31N44M53r37n5O47L8n03K45m1K95j12m68M06K47o57j47
2940d62J044l28o94L34M61J1k58n97L48P80o15o96R55L83q96j92M55J66R1o54
2960c64L9R74l71r10N31N59l94n68M97J22J06k21k19P05j67q44K85P95m91m47
2980c83M20K24l6m48p4N39J68p24k35J230m68n50K73J21N1j6m75K70O03l33n24
3001c67O35M7o04l8M14k6m3l2l7J94k36l38O13J9n30J89L37j39p2l3k0N17l41
3024A09o48N00N55o13k07N29K1l37j50J60J87J82m87J05L75k09k37K63l4q6K66
$$ plain form
3045 244 -112 -101 7 300 -16 38 -162 -81 116 -29 -349 139 363 -68 -220 -82 -89 182 -2 -254 260 141
3067 141 -89 -132 159 97 -177 -27 -142 -15 272 -51 227 242 -193 -85 104 -97 -43 139 276 117 -111
3088 -111 108 352 3 -425 -310 488 307 -678 -263 567 243 -236 -413 93 425 -108 -518 190 665 -148
3108 -148 -451 -60 358 77 -368 -167 400 229 -210 -28 348 -19 -376 2 205 -87 5 11 54 5 -205 27
3130 27 190 -215 -331 248 490 -79 -438 71 491 1 -516 75 650 239 -432 -66 548 153 -398 -408 331
3151 331 518 -122 -288 150 537 -209 -592 5 213 23 -177 -41 287 241 4 -360 60 -18 -35 112 50
3172 50 47 171 187 -195 -257 -91 60 -188 -275 150 310 270 -315 -128 287 90 -169 -85 147 236 -297 -275 228
3195 228 186 -77 -425 -57 210 85 0 122 108 95 -112 102 22 46 64 151 -23 -366 187 200 -11 -200 41
$$ packed form
3045B44l56J1J08K93l16N4k00Q1J97j45l20M88K24m31j52J38pK71j84k52N14j19
3067A41k30m3K91o2k74J50j15J27K87l23K78J5m35J08J89k01N4J82J37j59k28
3088a11K19K44l49m28J15P98j81r85M15Q30l24m79j77N06L32n33m10P08M75q13
3108a48l03L91M18k81m45K01N67j71m39J82L76l67l57L78K03k92R2OM3m9k10K32
3130B7J63m05j16N79K42n69l59N09M20m90n17N91N75m11o71L66O14l95n51j0P39
3151C31J87o40j66M38L87p46l83N97K08j90k00J36L28m6k37l64M20p8j7J47o2
3172E0lJ24J6l82o2J66J51k48q7M25J60m0n85J87M15j97k59Q4K32Q9n33K2N03
3195B28m2k63l48L68K67j25q5J22j4j3k07K14q0K4J8Q7j74l43N53J3k11j89K41
$$ plain form
3218 41 252 -10 -227 30 367 78 -506 -257 280 160 -397 -53 302 279 -336 -406 228 251 -245 -221 213 330
3240 330 -137 -370 129 180 -186 -148 233 149 -172 -164 140 308 -191 -202 160 268 20 -173 8 113 -127 -246
3262 -246 224 191 -145 -241 93 299 -136 -227 112 330 -190 -262 -15 297 65 -310 190 319 -60 -242 -34
3283 -34 320 -54 -366 205 268 -140 -356 17 154 185 -263 -103 178 218 -212 -139 266 82 -199 -192 50 277
3305 277 105 -124 -100 236 -110 -137 -19 85 135 7 -113 -94 -12 177 -72 -314 82 40 44 -199 -265 523 206
3328 206 -288 -309 135 561 -2 -403 -104 503 -96 -399 -73 577 251 -373 -305 311 345 -340 -514 225 322
3349 322 -21 -253 79 336 158 -153 -265 36 -14 25 -49 48 102 172 18 -155 -176 219 308 -87 -193 192 540
3372 540 -52 -513 -114 421 291 -605 -282 380 511 -417 -549 301 617 -202 -563 51 680 -5 -510 45
$$ packed form
3218D1K11k62k17K57L37k89n84K49N37j20n57L44L55k3o15p0O34K3m96K4M34J17
3240C30m67k33M99N1l66L8L81q4l21QL04J68m99j1L62J08k48j93J81J05k40j19
3262b46M70l3l36r6L34K06m35r1L39K18n20p2K47L12k32l75N00J29l79j82K08
3283c4L54l74l12N71O3m08k16L73J37L1m48J60K81M0m30P3M05j84k81PK42K27
3305B77j72k29K4L36l46k7J18J04N0j28j20J9Q2J89k49k42L96m2Mk43o6P88l17
3328B06m94k1M44M26n63m01K99O07n99l03L26O50l26o24O8O16L4o85j74P39R7
3349C22l43k32L32K57j78l11j12L01n0L9p4R7N4P0j54j73k1L95Q9l95j06L85L48
3372E40n92m61L99N35j30q96L23O62J31r28j32Q50L16q19l61O14O29o85n05N55
$$ plain form
3392 45 518 297 -609 -310 372 252 -232 -185 -3 253 13 -216 -81 85 49 -48 -6 -46 257 119 -97 -202
3414 -202 -90 417 243 -334 -149 158 366 -244 -426 226 349 -94 -533 33 501 255 -450 -134 264 161
3434 161 -283 -223 197 457 -150 -516 -132 232 239 -304 -171 248 438 -72 -126 22 165 152 -311 -348 66 413
3456 413 -21 -498 -277 343 75 -482 -294 343 303 -277 -259 334 406 -183 -360 -43 352 10 -276 -157 498
3477 498 269 -212 -242 224 203 24 -135 124 104 86 -138 69 -66 -110 56 46 -73 -35 198 248 -204 -290 217
3500 217 278 0 -414 -64 388 19 -362 33 346 119 -406 -175 539 414 -257 -415 291 401 -161 -314
3520 -314 265 143 67 -279 45 335 -118 -252 21 164 -260 -163 347 81 59 32 112 59 -291 -99 177 220
3542 220 -192 -181 112 45 -272 -116 297 405 -258 -223 246 385 -149 -462 112 112 -72 -244 -119 362 164 -167
$$ packed form
3392D5M73k21r06K99O82j20m84M7J82K56k40k29J35J66l6r7M2m0L03j38k16j05
3414b02J12N07j74n77J85L07K08o10j82O52J23m43m39N66M68k46p05L16L98j03
3434A61m44O0M20K60o07l66L84L64Pn43J33M19J90n10n4J48J43j3m63l7M14L47
3456D13m34m77K21O20k68n57J88O37m0n80J8N93P2n89j77L17L95l42k86J19O55
3477D98k29m81l0M66k1j79j59K59k0j8k24K07j35m4J66j0j19L8K33N0m52q6N07
3500B17O1k78m14L50M52l69l81L95L13k27n25K31P14j25o71j58P06J10n62j53
3520c14N79j22p6l46L24K90m53j34K73J43m24R7N10k66k2k7Q0n3l50J92K76M3
3542B20m12J1K93o7l17J56M13J08o63L5M69J39n34l13N74%j84j72J25M81j98l31
$$ plain form
3564 -167 -52 304 -7 -216 4 62 129 -166 -64 2 144 -113 49 148 -96 82 307 80 -104 -17 46 184
3586 184 -149 -106 66 231 53 -94 62 181 -174 -44 33 125 64 -48 -27 -91 -131 -5 279 59 -251 -96
3608 -96 366 156 -207 -206 190 211 -181 -237 203 286 -169 -349 256 330 -153 -387 135 234 40 -412 54 409 24
3631 24 -464 -25 319 219 -343 -58 140 25 -196 -182 152 103 -70 33 104 -83 -96 9 -5 -151 -252 130
3653 130 354 -93 -289 -11 279 4 -505 -158 334 130 -352 -258 324 303 -391 -281 369 42 -357 -151 92
3674 92 139 -146 -313 89 110 -208 -99 39 198 -97 -107 86 129 -52 -23 186 -41 -201 -102 233 41 -257
3696 -257 115 185 113 -279 -14 180 221 -194 -297 79 410 -156 -315 142 298 -105 -276 0 239 -87 -11
3717 -11 -49 84 26 -123 38 41 27 5 -2 -6 -24 -26 102 -23 -280 129 208 -14 -424 -114 339 58 -419 35 411
$$ packed form
3564a67J15L56l11k09K20N8O7k95J02O6J42k57J62R9k44J78K25k27j84Q7O3J38
3586A84l33M3J72J65j78j47J56J19l55J30P7R2o1j12K1o4m0J26K84k20l10J55
3608i6M62k10l63JL96K1l92n6M40Q3m55j80O05P4m83k34N22R9j94m52M66L55l85
3631B4m88M39L44j00n62K85J98j15k21J4L34m9j73J03P1j87j3J05j4j46j01L82
3653A30K24m47j96K78K90k75n09L47M92k04m82R4N82k1o94J10O50l27l99K06K43
3674I2M7k85j67M02K1l18J09J38J59k95j0J93M3j81K9K09k27j60R9L35j92k98
3696b57L72P0p2l92K65J94M1m15j03L76L31n66j59M57J56m03j71K76K39l26P6
3717a1l8J33n8j49J61Lj4k2pmj8kJ28j25k57M09P9k22m10L10M53k81m77M54L76
$$ plain form
3742 411 227 -471 -150 274 259 -224 -220 216 313 -47 -313 199 192 -64 -244 143 227 -34 17 123 117 67 -39 17
3766 17 20 -70 82 56 76 -145 -229 206 266 -245 -226 335 148 -146 -142 236 333 -160 -209 81 192 -29 -366 85
3790 85 356 -129 -301 -50 316 9 -230 43 211 148 -144 -41 122 104 -15 -54 32 -28 -121 -93 238 -55 -18
3813 -18 3 -48 -52 -74 1 260 -132 -119 138 8 -3 -298 60 219 -112 -201 160 54 10 -51 -263 232 159 -141
3837 -141 -40 230 129 -167 4 215 0 -80 -400 -161 117 132 -136 100 20 117 164 8 -134 -91 48 53 -139
3860 -139 69 -60 115 -99 -232 142 73 -262 -161 178 170 -91 -223 23 200 -127 -234 115 150 -11 -298
3881 -298 1 294 33 -196 20 270 106 -251 -94 328 -58 -275 -228 307 114 -8 -139 166 371 -240
3901 -240 -202 182 197 -267 -151 225 -42 -159 -107 174 175 -131 -335 136 372 -223 -52 263 142 -124 -91 140
$$ packed form
3742D11j84o98L21M24j5m83MM36R7l60k66N12pk56j80L87Q4k61N1J06on0j06N6
3766A7Lr0J52k6K0k21q4M35O0n11J9N61j87k94ML78R7m93m9K90J11k21l37M51
3790H5K71m85j72K51L66l07k39K73J68o3k92J03J63j8j19l9Q6o0r3K8L31k93L7
3813a8K1n1mk2P5K59l92J3K57j30j1k95L58J59l31q9L61j06m4o1k12M95p3l00
3837a41J01K70j01k96J71K11k15q0l20K39K78J5k68K36q0R7M7j56j42M3J39Nj92
3860a39K08j29J75k14j33L74o9l35J01L39qk61j32K46J77l27j07L49L5j61k87
3881b98K99K93k61k29K16K50j64l57J57M22l86k17M7N35j93j22j31L05K05o11
3901b40L8L84J5m64J16L76k67j17N2K81Jl06k04M71K36n95J71L15j21k66L3K31
$$ plain form
3923 140 180 -153 -217 74 349 -255 -444 387 163 -149 -373 156 389 67 -317 86 468 -27 -640 -51 464
3944 464 103 -42 -139 213 234 -106 -262 203 148 -230 -130 10 147 -58 -233 -179 -83 -53 -148 -88 125 -22 76
3967 76 61 -110 -318 47 9 -294 54 126 106 116 -307 -78 247 0 -291 -182 228 160 -14 -298 -156 229
3989 229 -195 -431 -13 185 175 63 -64 -43 97 -32 -368 -66 88 56 25 -126 157 513 -28 -389 -100
4010 -100 527 20 -246 66 325 227 -401 -403 150 459 -263 -306 245 286 -66 -291 -147 232 336 -302 -211 336
4032 336 83 -312 -20 149 -50 2 -182 -91 446 123 -75 139 64 -137 160 107 -200 -75 199 98 83 -173
4054 -173 -68 282 -63 -633 19 642 53 -409 36 293 137 -218 -387 319 455 -357 -293 278 295 -125 -273
4075 -273 -13 323 128 -393 -78 339 63 -340 68 202 -108 82 -193 -91 107 74 -59 177 -109 -151 297
$$ packed form
3923A40M0l33o4K91K75o04j89Q31k24l12k24N29K33l22l84M03L82m95o13N89N15
3944D64l61j45r7L52K1l40j56M65n5l78J00J40J37k05j75N4R6L0r5O0K13j47R8
3967G6j5j71k08L65l8l03L48P2k0J0m23K29L25k47k91J09M10o8j74k84J42L85
3989B29m24k36M18J98j0j12j27K1J40j29l36L02J54l2l1j51K83L56n41l61K89
4010a00O27n07k66L12K59r8o28kN53L09p22m3N51M1l52k25J44L79J04o38R1N47
4032C36k53l95K92J69j99N2j84R1N37l23j98K14p5k01K97n3l07J25K74j01j5k56
4054a73J05L50l45n70O52O23n89m62M45K57j56l55j69P06J36q12O4N71J7m20j48
4075b73K60L36j95n21L15M17k76m03M08J34l10J90k75J02J98l3j33K36k86m2M48
$$ plain form
4096 297 87 -24 111 285 -139 -116 7 -39 206 16 -314 100 404 -110 -253 154 -9 -24 -88 -156 142 168
4118 168 -113 -117 220 -83 -33 58 42 -35 158 -55 -156 155 -48 -53 -17 195 -78 231 91 -291 59 283 -341
4141 -341 -136 5 136 204 28 -376 259 258 -311 -72 108 -21 -179 -68 82 350 113 -328 62 344 -141
4162 -141 -110 116 104 -27 -35 -10 116 63 -327 -175 369 -110 -315 10 267 -169 40 -289 16 218 -146 -249
4184 -249 484 116 -390 -30 141 75 -127 -74 -2 125 12 -244 239 61 -227 -268 199 -6 85 22 -48 60
4206 60 0 -165 151 234 -241 -254 381 100 -220 20 166 70 -42 -164 -72 323 -167 -378 183 148 -299 -130
4228 -130 158 -31 313 -92 -74 266 189 -251 111 165 -160 23 83 -113 190 166 -103 -42 70 -72 109 212
4250 212 -130 147 192 -330 -192 284 55 139 109 -255 198 247 -218 -29 271 -59 -101 121 -28 44 211 -61
$$ packed form
4096B97k10j11J35J74m24K3J23m6K45j90l30M14L04n14j43M07j63j5o4o8K98K6
4118A68k81mL37l03N0R1j6p7J93k13j01L11k03nL6K12k73L09j40l82L50K24o24
4141c41K05J41J31O8j76m04O35jn69K39J80j29j58J11J50K68k37m41L90K82m85
4162a41L1K26j2j31qK5J26n3l90J52N44m79k05L25K57m36K09l29L05K02l64j03
4184b49P33l68n06L60J71o6k02N3P2J27j13k56M83j78k88m1M67k05R1o3p0J08
4206F0o0j65L16Q3m75j3O35k81l20K40J46r6j12j22R2L95m90k11N61l5m47J69
4228a30K88j89L44m05J8L40p7m40L62N4l25J83O0j96L03k4k69O1J12j42J81J03
4250B12l42K77M5n22J38M76k29Q4l0l64M53M9m65J89L00l30m2K22j49P2J67k72
$$ plain form
4272 -61 -101 279 -95 -156 189 -47 -99 207 420 -162 -150 144 -13 94 -126 -9 376 132 -458 -72 407 15
4294 15 -291 -21 122 327 -113 -369 315 492 -364 -386 461 40 -158 -65 -85 332 -36 -456 -169 351 -45
4315 -45 -382 -13 251 -8 -154 8 -3 194 -273 -102 138 -70 -228 176 122 -329 -136 191 142 -88 -209
4336 -209 59 349 -39 -254 -51 143 -56 -365 120 328 -6 -87 -192 167 252 -285 -172 369 130 -162 -9
4357 -9 159 135 -69 -200 50 194 63 -17 123 69 -91 42 -80 -71 101 211 -80 67 83 -180 25 -44 -240
4380 -240 36 18 -55 -88 112 2 203 -179 -127 119 -69 -179 -36 240 -119 -87 59 -82 116 78 -126 -35
4402 -35 94 -43 44 78 -18 -66 124 30 -93 51 338 309 -80 -86 -16 227 -157 -150 154 287 -102 -216 -103 282
4426 282 -15 -133 -21 328 37 -231 -148 311 140 -185 -270 86 158 -45 -169 133 201 -288 -126 91 37 -81
$$ packed form
4272f1m0L80l74o1L45k36n2L06K13n82J2K94j57J07k20J17L85k44n90L86M79l92
4294A5l06K70J43K05m40k56O84J77q56k2Q47m21j98R3k0M17l68m20K87N20l96
4315d5l37L69K64k59j46J62j1J97m67J71K40k08j58M04n4m51J93L27m9k30j21
4336b09K68K90l88k15K03J94j99l09M85K08l34q1j05L59Q5n37J13N41k39k92J53
4357iJ68k4k04j31K50J44j31q0J40n4j60J33j22RJ72J10k91J47J6k63K05o9j96
4380b40K76j8p3l3K00j10K01l82N2K46j88j10J43K76l59L2J46j41J98l8k04R1
4402c5J29j37Q7L4r6m8J90r4j23J44K87k9l89oP0K43l84PL04J33l89j14J13L85
4426B82k97j18J12L49k91k68Q3M59j71l25q5L56P2k03j24L02O8m89J62K17n4j18
$$ plain form
4448 -81 26 58 42 -23 -148 131 118 -133 -275 99 186 -236 -68 143 134 -102 -150 75 59 -65 -179 185 302
4471 302 -227 -183 -66 40 -106 -156 94 133 -136 104 42 -3 164 -170 46 -12 17 -55 -45 89 -2 -140 -5
4494 -5 330 -2 -138 96 -33 78 -121 -38 135 -83 -225 -70 -4 -82 3 39 116 80 -97 24 41 22 47 -129
4518 -129 191 54 -54 -36 137 -115 -39 139 42 -85 -83 17 48 -104 -138 58 91 -13 -46 174 105 -110 -233
4541 -233 -119 28 -42 -191 -55 51 -126 -62 12 147 -7 -261 215 45 -5 -165 159 -33 -95 82 157 66
4563 66 -147 -268 213 260 -105 -142 -84 57 -65 -183 4 199 -58 -399 10 187 94 -220 -174 167 29 -30
4585 -30 -195 53 30 -112 -106 106 133 -111 -54 139 7 -144 -21 -79 55 -74 94 88 -149 -86 -66 160 24 -103
4609 -103 29 104 -59 -216 -35 149 -112 -178 -149 -7 120 -8 -156 86 35 -90 -206 44 139 30 -94 70
$$ packed form
4448h1J07L2j6o5j25K79j3k51j42L74Q7m22J68K11rk36m8K25j6j24j14L64J17
4471C02n29M4J17J06j46n0K50L9k69K40o2m5J67l34K16n8K9p2J0J34r1j38J35
4494eL35l32j36K34j29J11j99Q3J73k18j42J55O6p8Q5L6P7l6j77J21J7j9K5j76
4518a29L20j37j08J8J73k52P6J78r7j27KJ00L1j52l4J96L3j04l3K20o9k15j23
4541b33J14J47p0j49J36J06j77O4P4J35j54k54M76j70n0j60L24j92o2J77P5r1
4563F6k13j21M81M7l65l7N8J41j22j18J87J95k57l41M09J77r3l14M6L41j38n9
4585c0j65K48k3j42OK12K7k44N7J93j32j51J23n8J34j29J68ok37O3K0K26j36j27
4609a03J32P5j63j57J81J84k61o6K9J42J27j28j48K42n1j25j16K50R5j09j24J64
$$ plain form
4631 70 183 -1 -17 -74 42 -12 40 -196 -142 51 184 20 -123 -143 -59 16 -91 -84 -2 367 -5 -212 73 262
4655 262 -108 -152 -165 278 264 -109 -16 195 101 -88 -224 171 70 84 -18 45 239 -116 -147 8 111 -42 -189
4678 -189 -7 206 -11 24 216 -54 -21 -125 222 73 -128 -106 -12 177 -270 -121 114 237 -131 -151 303 298
4700 298 -141 -88 86 74 -91 -355 48 283 169 -177 5 207 101 -219 71 181 80 -251 -114 24 82
4721 82 23 -148 67 114 -95 -28 113 -199 -57 71 185 93 -225 48 75 185 -175 -201 -7 12 -240 -14 120
4744 120 -130 -181 -110 175 62 -52 -64 263 103 4 -157 63 128 -95 15 90 110 45 -145 -113 28 133 3
4767 3 51 116 57 15 142 45 -32 -32 -208 -3 -46 -1 -54 13 -124 66 71 20 -184 90 32 54 41 40 135 -161 -132 56
4795 56 104 -26 -83 142 107 -33 -100 -66 95 -86 -120 156 58 19 -163 22 192 -35 -92 25 201 62 -234
$$ packed form
4631G0J13j84j6n7J16n4N2k36N4J93J33j64j43k0Q4P5j07PQ2L69l72k07K85J89
4655B62l70m4j3M43j4l73R3K11r4j89j36L95j01J4j02O3J94l55l1J55J03j53j47
4678a89J82K13k17L5J92k70L3j04L47j49k01K2R4J89m47J49K35J23l68k0M54n
4700B98m39N3J74j2j65k64M03K35j14l46J82K02j06l20K90J10j01l31J37J38N8
4721H2n9j71K15M7k09O7J41l12J42J28J14r2l18K73K7J10l60k6J94J9k52K26J34
4744A20k50n1P1K85j13j14j2L27j60r9j61K20O5k23J10P5K0o5j90L2J41J05j30
4767CM8O5n9m2J27r7p7%j76K05m3M5n3O7j37J90Nn1k04K74n8K2j3jR5k96K9J88
4795E6M8j30n7K25l5j40o7L4J61j81l4K76r8l9j82J85J70k27n7J17J76j39k96
$$ plain form
4818 -234 20 134 74 -261 -44 192 -79 -40 73 124 74 -42 -109 155 -26 -108 -51 164 152 -65 -58 170 -12
4841 -12 -129 -36 189 227 -109 -54 285 97 -67 0 286 134 -180 -110 263 91 -153 -186 19 316 -192 -88
4863 -88 72 254 181 -135 -106 128 -14 -40 -56 143 14 -114 10 197 -115 -95 -12 56 -26 -98 221 103 -160
4886 -160 -21 54 59 -14 -169 1 192 17 -104 -14 112 123 -232 70 174 89 -123 -107 62 9 -130 -102 -63 112
4910 112 -97 -41 -21 155 -65 -132 -96 -5 11 -104 -15 -44 153 266 29 -114 62 230 -105 -211 6 90 62
4933 62 -6 -245 -16 101 -208 -232 -32 122 73 -179 -84 86 -52 -187 76 137 93 -153 77 129 33 -206 -8
4956 -8 30 -1 105 125 110 -19 -86 97 52 -73 -90 172 1 -164 -190 65 159 -60 -99 -118 200 -48 -225 -100
4980 -100 313 120 -98 -84 227 83 -91 -49 55 41 -194 -36 23 133 22 -87 5 113 -178 -99 -92 77 -130
$$ packed form
4818b34K54J14o0l35K17K36k71L9J13N1n0j16o7K64j81q2N7K15j2k17PK28j82
4841a2j17R3K25L8l36N5L39j88j64O7K86j52l14P0L73j72k44l3K05K97n08J04
4863h8J60J82p3l16K9K34j42k6j6J99j29j28J24J87l12K0Q3O8q2p2L19j18k63
4886a60J39P5Np3j55J70J91j75j21R0J26J1l55L02J04q5k12J6J69n3j39K8L9J75
4910A12k09N6K0J76k20o7L6R1J6j15Q9k9J97J13k37j43J76J68l35j06K17Q4k8
4933F2o8k39K29J17l09k4K00J54m9k52R5J70j38j35K63O1m4k46K30N2r6k39J98
4956hL8l1J06K0j5j29o7J83m5j25j7K62j71j65k6K55R4k19l9j9L18k48j77J25
4980a00M13j93k18J4L11j44j74M2J04j4k35J58N9J10j11j09R2J08k91P9PJ69k07
$$ plain form
5003 -130 43 42 -52 -58 -84 289 24 -309 -45 73 39 -75 165 127 -7 -118 -105 227 -107 -172 -133 147 139 -165
5027 -165 -236 -60 16 -191 -209 12 37 16 8 86 35 -9 -84 -81 27 -46 -99 76 164 -141 52 172 16 -103 -5 202
5053 202 -82 -67 54 -13 72 -109 3 9 -23 -18 -60 94 116 -191 -117 3 111 -26 -61 -138 180 -99 -48 103 159
5078 159 -80 -175 127 126 -96 -49 6 84 -66 -131 89 154 -69 -135 66 -84 24 -79 136 -17 -38 -30 44 88 -99
5103 -99 -182 119 200 -138 -92 93 102 -181 -7 -92 96 -93 -67 -77 92 85 -89 -60 73 -55 61 -120 30 45
5127 45 -76 107 6 34 -61 0 162 -8 29 -163 -23 -50 -234 7 -91 -52 -84 2 16 92 4 -82 96 -86 -156
5152 -156 -105 -3 -104 -130 -107 139 67 10 -153 99 76 -14 -101 134 3 -104 -12 22 68 -118 -102 124 124 5 10
5177 10 85 -27 79 -28 -38 -2 148 20 50 -20 -52 119 -4 -72 -78 -63 119 76 -38 210 -48 -29 -51 -4 285
$$ packed form
5003a30J73jr4ok6L73k65l33K64J18l4j14K40l8j34j11J3L32l34o5L9K80ql04
5027a65p1J76P6k07j8K21K5k1qP8n1m4p5LJ08p3n3J75Q8l05J93J20j56j19R8K07
5053B02k84J5J21o7Q5j81J12Ol2Nm2J54K2l07P4J20J08j37l5p7L18k79N1J51N6
5078A59k39r5L02jk22M7N5P8j50o5K20O5k23o6K01j50J08j03K15j53k1QP4M4j87
5103i9q3L01Q1l38M6J85Rk83J74q5J88j89K6j0J69pj74K9J33j28J16j81J50J5
5127D5j21J83j01K8r5O1J62j70L7j92J40k7j84K41r8L9l2Q6J4P6q8q6J78j82p0
5152a56N1J02j01k6K3K46p2n7j63K52k3r0q7K35j31j07R2L4M6j86J6K26%j19N
5177A0P5j12J06j07j0L6J50j28L0p0l2J71j23o8oJ5J82m3j14K48k58J9k2M7K89
$$ plain form
5202 285 -44 7 220 64 -89 -89 -110 219 -3 -304 -40 178 -40 -233 10 -17 180 -144 -113 102 155 -44
5224 -44 -46 29 103 -52 -118 82 8 88 -50 37 70 -28 29 87 -68 -48 57 101 -64 59 88 110 11 -350 -221 56
5250 56 86 -132 -42 208 243 -172 -141 -145 34 118 -103 -57 158 173 -235 -103 119 -116 -165 -59 219 63 -13 -12 58
5275 58 164 72 -98 -46 48 -145 10 -43 -140 -45 62 18 -107 87 23 -2 -143 -70 29 30 -62 -286 -41 112 -82
5300 -82 -88 38 251 217 -271 1 235 160 -73 -173 -77 -128 3 62 -5 122 -24 47 -5 -59 -100 25 -29 -171 -13
5325 -13 -118 -56 77 -26 102 60 -176 -185 111 74 -180 -101 141 64 -153 -213 23 101 54 -213 68 100 57 85 10
5350 10 -29 31 -67 -101 151 189 -197 -4 23 -186 -103 -26 -25 -72 -36 -98 34 69 -153 -27 241 -7 -155 86 -68
5375 -68 56 -38 -171 -9 139 -43 -46 95 166 -222 -52 72 25 182 -115 -53 120 11 -119 51 158 -142
$$ packed form
5202B85l29N1K13j56j53%k1L29k22l01K64K18k18j93K43k7J97l24L1K15N3j99
5224d4kP5P4j55o6K00p4Q0j38Q7L3r8N7N8j55K0J05M4j65J23K9K2r9l61J29K77
5250E6L0k18R0K50L5m15L1mJ79Q4k21M6K15J5m08J32K22k35m9J06K78j56p6JP0
5275E8J06r2j70N2R4j93J55n3r7R5J07m4j25J94o4k5j41P3R9Jr2k24K45J53j94
5300h2oJ26K13l4m88K72K34p5k33j00R6n1J31N9o7J27j46P1n2n4m1J25n4j42J58
5325a3j05O2J33j03J28m2k36rK96l7k54P9K42p7k17o0K36P8m7k67K81L2m3K8p5
5350A0l9O0r8l4K52L8l86J93K7k09Q3P7Jm7L6o2J32L5k22J26K68k48j48K41j54
5375f8J24r4j33J62J48j82lJ41P1l88J70J24m7J57k97O2J73j09j30J70J07l00
$$ plain form
5397 -142 82 -36 53 33 -72 -40 169 19 -91 44 122 50 17 21 -52 -28 -66 79 81 115 -193 -74 62 7 -115
5422 -115 120 76 -25 158 -40 -100 205 28 -133 27 155 -100 89 48 -150 -105 128 41 89 59 -86 12 3
5445 3 -149 -14 195 9 -43 120 4 66 -10 -12 82 55 -31 -77 242 -162 94 11 -62 6 -51 87 -139 43 17
5470 17 -184 128 -191 17 73 77 -14 53 201 -132 2 -37 -101 102 -142 -222 95 57 -356 -95 95 90 -127 -133 -14
5495 -14 158 66 -238 -105 217 78 -102 -69 80 110 51 -282 -2 167 -96 -69 152 -166 15 61 -11 -100 -56
5518 -56 -52 85 83 91 -11 -3 -125 -276 82 94 12 -91 52 39 -90 -45 -154 227 224 -353 -25 218 -11 -48 5 -108
5544 -108 70 14 -211 73 255 24 -24 182 -56 -30 11 11 57 185 142 -79 125 -25 -2 354 -111 -153 -78 35
5568 35 -17 0 2 134 73 -199 -10 179 172 -215 26 176 -110 -83 109 -45 320 9 -140 -18 15 -5 -66 51
$$ packed form
5397a42K24j18Q9k0j05L2K09j50j10J35P8p2l3Mp3K4l8J45KL4l08J19J36n5j22
5422a15K35m4j01J83j98o0L05j77j61J60J28k55J89m1j98M5K33q7M8l0j45R8r
5445Cj52J35K09j86n2J63j16O2p6kR4k7q6m6L19m04K56q3p3O8n7J38k26J82k6
5470A7k01L12l19K08N6Mr1O7J48l33J34l9o4K03k44q0L17l8m13K61J90nk17oJ19
5495a4J72r2l04J33L22j39j80L3J49L0n9l33K80J69k63K7K21l18J81M6p2q9M4
5518e6MJ37kQj02Qj22j51L58J2q2j03J43j3j29M5j09L81ln77L28K43k29l7N3j13
5544a08J78n6k25K84J82k31m8K06k38K6M1%M6J28m3k21K04j50K3L56m65m2P5J13
5568C5n2J7KJ32o1k72J89J89pl87K41J50k86K7J92j54L65l11j49J22L3k0o1J17
$$ plain form
5592 51 -103 32 76 -96 -11 66 -152 46 -63 -240 12 155 5 -103 93 99 -54 28 -110 137 261 -55
5614 -55 -141 108 76 -323 -90 90 91 -73 -59 87 178 -52 -163 39 214 -192 3 87 84 44 32 -70 108 174
$$ packed form
5592E1j54J35M4j72Q5P7k18J98j09j77K52J43j50j08J96Oj53Q2j38K47J24l16
5614e5q6K49l2l99K33J80Jj64J4J46R1k30j11K02J75m06J95Q4lm0j2j02J78O6
$$ [...]
8191a14
##END NTUPLES=NMR FID
##END=
