##TITLE=1H_LY-3Dix.HYD
 CD3CN,8 sc, 
 5.03.2021
##JCAMPDX= 6.0         $$ Bruker NMR JCAMP-DX V2.0
##DATA TYPE= NMR FID
##DATA CLASS= NTUPLES
##ORIGIN= UXNMR, Bruker Analytische Messtechnik GmbH
##OWNER= root
$$ XWIN-NMR		Version 3.5
$$ Fri Mar  5 10:16:35 2021 Russian Standard Time (UT+4h)  she@DPX200
##.OBSERVE FREQUENCY= 200.131
##.OBSERVE NUCLEUS= ^1H
##.DELAY= (6, 6)
##.ACQUISITION MODE= SIMULTANEOUS
##.ACQUISITION SCHEME= undefined
##.AVERAGES= 8
##.DIGITISER RES= 18
##SPECTROMETER/DATA SYSTEM= spect
##.PULSE SEQUENCE= zg30
##.SOLVENT NAME= CD3CN
##.SHIFT REFERENCE= (INTERNAL, CD3CN, 0, 15.7039)
##AUDIT TRAIL= $$ (NUMBER, WHEN, WHO, WHERE, WHAT)
$$ ##TITLE= Audit trail, XWIN-NMR		Version 3.5
$$ ##JCAMPDX= 5.01
$$ ##ORIGIN= Bruker BioSpin GmbH
$$ ##OWNER= she
$$ F:/spectra/data/she/nmr/H-F/1/audita.txt
$$ ##AUDIT TRAIL=  $$ (NUMBER, WHEN, WHO, WHERE, WHAT)
(   1,<2021-03-05 10:14:48.98 +0400>,<she>,<DPX200>,
      <created by zg, POWCHK disabled, PULCHK disabled
       configuration hash MD5:
       00 E9 B6 7A A2 85 ED C7 34 08 36 98 17 FE 4E 26
       data hash MD5: 16K
       E9 97 DF 74 9B C3 0D A4 1F 3A AB 76 29 5A F2 B4>)
$$ ##END=
$$ 
$$ hash MD5
$$ B4 13 B2 11 69 CB 4D 49 52 5D 9A 86 AC 01 0F 64
##$RELAX= 
##$RELAX= 
##$RELAX= 
##$RELAX= 
##$RELAX= 
##$RELAX= 
$$ Bruker specific parameters
$$ --------------------------
##$DU= <F:/spectra>
##$EXPNO= 1
##$NAME= <H-F>
##$PROCNO= 1
##$TYPE= <nmr>
##$USER= <she>
##$AMP= (0..31)
100 100 100 100 100 100 100 100 100 100 100 100 100 100 100 100 100 100 
100 100 100 100 100 100 100 100 100 100 100 100 100 100 
##$AQSEQ= 0
##$AQ_mod= 1
##$AUNM= <au_zg>
##$AUTOPOS= <>
##$BF1= 200.13
##$BF2= 200.13
##$BF3= 200.13
##$BF4= 200.13
##$BF5= 200.13
##$BF6= 200.13
##$BF7= 200.13
##$BF8= 200.13
##$BYTORDA= 1
##$CFDGTYP= 0
##$CFRGTYP= 5
##$CHEMSTR= <none>
##$CNST= (0..31)
1 1 145 1 1 1 1 1 1 1 1 1 1 1 1 1 1 1 1 1 1 1 1 1 1 1 1 1 1 1 1 1 
##$CPDPRG= <>
##$CPDPRG1= <>
##$CPDPRG2= <>
##$CPDPRG3= <>
##$CPDPRG4= <mlev>
##$CPDPRG5= <mlev>
##$CPDPRG6= <mlev>
##$CPDPRG7= <mlev>
##$CPDPRG8= <mlev>
##$CPDPRGB= <>
##$CPDPRGT= <>
##$D= (0..31)
0 1.2 0 0 0 0 0 0 0 0.06 0 0.03 0 0 0 0 0.0002 0 0 0 0 0 0 0 0 0 0 0 0 
0 0 0 
##$DATE= 1614924888
##$DBL= (0..7)
120 120 120 120 120 120 120 120 
##$DBP= (0..7)
150 150 150 150 150 150 150 150 
##$DBP07= 0
##$DBPNAM0= <>
##$DBPNAM1= <>
##$DBPNAM2= <>
##$DBPNAM3= <>
##$DBPNAM4= <>
##$DBPNAM5= <>
##$DBPNAM6= <>
##$DBPNAM7= <>
##$DBPOAL= (0..7)
0.5 0.5 0.5 0.5 0.5 0.5 0.5 0.5 
##$DBPOFFS= (0..7)
0 0 0 0 0 0 0 0 
##$DE= 6
##$DECBNUC= <off>
##$DECIM= 32
##$DECNUC= <off>
##$DECSTAT= 4
##$DIGMOD= 1
##$DIGTYP= 9
##$DL= (0..7)
0 120 120 120 120 120 120 120 
##$DP= (0..7)
150 150 150 150 150 150 150 150 
##$DP07= 0
##$DPNAME0= <>
##$DPNAME1= <>
##$DPNAME2= <>
##$DPNAME3= <>
##$DPNAME4= <>
##$DPNAME5= <>
##$DPNAME6= <>
##$DPNAME7= <>
##$DPOAL= (0..7)
0.5 0.5 0.5 0.5 0.5 0.5 0.5 0.5 
##$DPOFFS= (0..7)
0 0 0 0 0 0 0 0 
##$DQDMODE= 0
##$DR= 18
##$DS= 0
##$DSLIST= <SSSSSSSSSSSSSSS>
$$ [...]
##$SUBNAM2= <"">
##$SUBNAM3= <"">
##$SUBNAM4= <"">
##$SUBNAM5= <"">
##$SUBNAM6= <"">
##$SUBNAM7= <"">
##$SUBNAM8= <"">
##$SUBNAM9= <"">
##$SW= 16.9725786131823
##$SWIBOX= (0..15)
0 0 2 0 0 0 0 0 0 0 0 0 0 0 0 0 
##$SW_h= 3396.73913043478
##$TD= 16384
##$TD0= 1
##$TE= 0
##$TE2= 300
##$TE3= 300
##$TEG= 300
##$TL= (0..7)
0 120 120 120 120 120 120 120 
##$TP= (0..7)
150 150 150 150 150 150 150 150 
##$TP07= 0
##$TPNAME0= <>
##$TPNAME1= <>
##$TPNAME2= <>
##$TPNAME3= <>
##$TPNAME4= <>
##$TPNAME5= <>
##$TPNAME6= <>
##$TPNAME7= <>
##$TPOAL= (0..7)
0.5 0.5 0.5 0.5 0.5 0.5 0.5 0.5 
##$TPOFFS= (0..7)
0 0 0 0 0 0 0 0 
##$TUNHIN= 0
##$TUNHOUT= 0
##$TUNXOUT= 0
##$USERA1= <user>
##$USERA2= <user>
##$USERA3= <user>
##$USERA4= <user>
##$USERA5= <user>
##$V9= 5
##$VALIST= <valist>
##$VCLIST= <CCCCCCCCCCCCCCC>
##$VD= 0
##$VDLIST= <DDDDDDDDDDDDDDD>
##$VPLIST= <PPPPPPPPPPPPPPP>
##$VTLIST= <TTTTTTTTTTTTTTT>
##$WBST= 1024
##$WBSW= 4
##$XGAIN= (0..3)
0 0 0 0 
##$XL= 0
##$YL= 0
##$YMAX_a= 101325
##$YMIN_a= -117122
##$ZGOPTNS= <>
##$ZL1= 120
##$ZL2= 120
##$ZL3= 120
##$ZL4= 120
##$ABSF1= 10
##$ABSF2= 0
##$ABSG= 5
##$ABSL= 3
##$ALPHA= 0
##$AQORDER= 0
##$ASSFAC= 0
##$ASSFACI= 0
##$ASSFACX= 0
##$ASSWID= 0
##$AUNMP= <proc_1d>
##$AZFE= 0.1
##$AZFW= 0.1
##$BCFW= 1
##$BC_mod= 2
##$BYTORDP= 1
##$COROFFS= 0
##$CY= 11.3945322036743
##$DATMOD= 1
##$DC= 2
##$DFILT= <>
##$DTYPP= 0
##$F1P= 15.9154993809931
##$F2P= -4.1035820241983
##$FCOR= 0.5
##$FTSIZE= 0
##$FT_mod= 4
##$GAMMA= 1
##$GB= 0.15
##$INTBC= 1
##$INTSCL= 1
##$ISEN= 128
##$LB= 0.24
##$LEV0= 0
##$LPBIN= 0
##$MAXI= 10000
##$MC2= 0
##$MEAN= 0
##$ME_mod= 0
##$MI= 1.114404
##$NCOEF= 0
##$NC_proc= 0
##$NLEV= 6
##$NOISF1= 3.799351
##$NOISF2= 2.8
##$NSP= 1
##$NTH_PI= 0
##$NZP= 0
##$OFFSET= 15.70392
##$PC= 1
##$PHC0= -11202.62
##$PHC1= 7.80094
##$PH_mod= 1
##$PKNL= yes
##$PPARMOD= 0
##$PSCAL= 0
##$PSIGN= 0
##$REVERSE= no
##$SF= 200.130013532006
##$SI= 16384
##$SIGF1= 3
##$SIGF2= 2
##$SINO= 400
##$SIOLD= 16384
##$SREGLST= <1H.CDCl3>
##$SSB= 0
##$STSI= 0
##$STSR= 0
##$SW_p= 3612.71676300578
##$SYMM= 0
##$S_DEV= 0
##$TDeff= 0
##$TDoff= 0
##$TI= <>
##$TILT= no
##$TM1= 0
##$TM2= 0
##$TOPLEV= 0
##$USERP1= <user>
##$USERP2= <user>
##$USERP3= <user>
##$USERP4= <user>
##$USERP5= <user>
##$WDW= 1
##$XDIM= 8192
##$YMAX_p= 0
##$YMIN_p= 0
$$ End of Bruker specific parameters
$$ ---------------------------------
##NTUPLES= NMR FID
##VAR_NAME=  TIME,          FID/REAL,        FID/IMAG
##SYMBOL=    X,             R,               I
##VAR_TYPE=  INDEPENDENT,   DEPENDENT,       DEPENDENT
##VAR_FORM=  AFFN,          ASDF,            ASDF
##VAR_DIM=   8192,          8192,            8192
##UNITS=     SECONDS,       ARBITRARY UNITS, ARBITRARY UNITS
##FACTOR=    0.0002944,     1,               1
##FIRST=     0,             0,               0
##LAST=      2.4114304,     0,               0
##MIN=       0,             -117122,         0
##MAX=       2.4114304,     101325,          0
$$ Real data points
##PAGE= N=1
##DATA TABLE= (X++(R..R)), XYDATA
0@%%%%%%%%%%%%%%%%qJ6j6J6j6J7k5L2l2M0m8N6o4P2q8J03j12J22j42J65j84K05
38A09k29K56k88L20l53L92m32M74n26N82o42P07p78Q58r47J044j152J276j414
57g43J570j751J963k215K521k899L380m021M921o280Q610j3655M3811n0428r1348
72a06564O1915O2970M1679O081n7079j02346J1382J17807O2206o0432p1366k8509
84f2256J3626O0367P0942k2134j00474m9765N7534P7764K1625l7455o0644l9788
96g0658K9702Q1419M2715n4413q5152j4817N9127N7215J2900l2705o4017l7613
108g6297N1691Q7475O685p1720m9151N459L1540N0381L2131m9411q2921P27P4468
121A1057M1997j4747l3468m3154k1320N1087P2701q502p3353l8904K1499M2834
$$ plain form
0 0 0 0 0 0 0 0 0 0 0 0 0 0 0 0 0 0 -8 8 -8 8 -8 9 -16 16 -16 24 -24 32 -32 40 -48 55 -57 65 -77 88 -96 109
38 109 -120 136 -152 168 -185 207 -225 249 -277 305 -337 370 -408 450 -497 547 -605 671 -743
57 -743 827 -924 1039 -1176 1345 -1554 1826 -2195 2726 -3554 5056 -8599 35212 -15216 -106564
72 -106564 -44649 18321 60000 66081 9002 -93344 -81962 35845 98051 37619 -33747 -62256
84 -62256 -48630 11737 82679 60545 -39929 -89694 -32160 45604 67229 29774 -30870 -70658
96 -70658 -40956 40463 83178 28765 -56387 -71204 -12077 45138 58038 25333 -38684 -76297
108 -76297 -24606 62869 69554 -2166 -51317 -45858 -14318 36063 68194 18783 -64138 -63411 11057
121 11057 53054 38307 4839 -38315 -59635 -8548 64153 55651 -17702 -56606 -35107 7727
133G727L7848K965n3788n7392J5732P0175L7591k8738n4036k9690J6585N2016
145A6995M0859j8843o5374l7173L5318O2040J9363l1482m6074k7119J9633O1356
157B9499L4485m3112o4813o520M1978L8764J5025k3200n7471k4919N1476N9675
169E0867p259m7057l1850m323K9828N1462R747n5596m7736J6596M6057K7736l330
182C5142l6809m3568M720N3273L5269j8469m2765k7804R183M3397L4429j6442
194B9556m7331k4954J7531M0773K7495j6931m7214k2580K5311L9493J6435j7383
206B0201l9727k3621K5229M6016J0829k9324l2930j1416J9535L9955J6906l1825
218I828m1592l380K9826L1392R317k5552m0840p998L6343L6141m98l0432l3367
$$ plain form
133 7727 45575 48540 -5248 -62640 -46908 23267 60858 32120 -21916 -51606 -35021 16995
145 16995 57854 39011 -26363 -63536 -28218 33822 53185 21703 -24371 -51490 -31857 29499
157 29499 63984 20872 -43941 -50461 -8483 30281 45306 22106 -35365 -60284 -8808 50867
169 50867 43608 -3449 -35299 -39622 -9794 41668 51415 -4181 -51917 -35321 10736 38472 35142
182 35142 -1667 -45235 -40515 12758 48027 29558 -13207 -41011 -31828 11569 45998 29556
194 29556 -17775 -42729 -25198 15575 43070 26139 -21075 -43655 -18344 21149 37584 20201
206 20201 -19526 -43147 -17918 28098 38927 9603 -23327 -34743 -15208 24747 41653 9828
218 9828 -31764 -35144 -5318 26074 35391 9839 -31001 -38999 -2656 33485 32987 2555 -30812
231c0812n423L4462L8614l358l8102k9051L747L1458L3603j740m1106l1570J3830
244b5448L6444K1598p118l2407l0719R908M3720K3250k1047l4779j6069J2512
256b0155L4278K4422j8326m2875j5596K6138L4952J0662k0917l4401j3997K4199
268a1616L7660R555k8543l5050m326K8830K9962K635k4565k9883o611K8689L4597
281C1334k296l3982k2595O086K1272K3513N799k9292l3845Q985L7047J5399j2051
294A5374j8807j9560l281L1317L0782j5705l7570r547J5944J8439J6337j670l1952
307i899k4895J9310L5019P067j7399k0490j3425P887L0298J8177j9156l1920q064
320b7490J9209K4971Q889j5691k6656j0739J7962K9526Q898k3634k8932q23K3611
$$ plain form
231 -30812 -36235 -1773 36841 33483 -4619 -33670 -29923 1535 35138 33398 -7708 -39278 -25448
244 -25448 10996 32594 25476 -6931 -37650 -27742 15978 39228 18181 -16598 -32667 -20155
256 -20155 14123 38545 20219 -22656 -38252 -12114 22838 33500 12583 -21818 -35815 -11616
268 -11616 26044 35599 7056 -27994 -32320 -3490 26472 29107 4542 -25341 -31952 -3263 31334
281 31334 29038 -4944 -27539 -21453 -181 23332 29131 -161 -34006 -25021 12026 27425 15374
294 15374 -3433 -22993 -26274 5043 35825 20120 -17450 -26997 -11053 7386 23723 22053 -9899
307 -9899 -34794 -15484 19535 26602 9203 -11287 -24712 -16825 13473 31650 12494 -19426 -27490
320 -27490 -8281 16690 25579 9888 -16768 -27507 -9545 19981 28879 5245 -23687 -24510 -899
333h99K0469K729j6554k7064p702K8835K9854q441k8667j3421L612J5223K4517
346B2491N102l2325k8058J5216L0569Q649p878j5703k1656o13L3315K3870j8989
359A3990l0479o006J2248J7652J6099n824l0571j7088K0139K8476L796j6814j8639
372a3021q038J1326K4437J0526j8795k6171k399K1006J8737K56j4601j8222o556
385b1515J6860K5466J556k4942j8401N769J6290J4015M257j6381k5115N15K7545
398E919J6599r876j6817j1321j597J7082K2564l990k7181j3407J1527J6883J0017
411A6402j919j8375j8255P390K5065J1154j1902j8727r667P440K0374J2734j0884
424A0830k2964r717J3247K2076P867j4565k0824n883J3285K0131Q278j5119k4341
$$ plain form
333 -899 19570 22299 5745 -21319 -29021 -186 29668 21227 -7440 -20861 -17249 -2026 22491
346 22491 27593 -4732 -32790 -17574 12995 21644 13766 -1937 -23593 -24206 9109 32979 13990
359 13990 -16489 -22495 -10247 7405 23504 17680 -12891 -29979 -9840 18636 22432 5618 -13021
372 -13021 -21059 -9733 14704 25230 6435 -19736 -22135 -1129 17608 17864 3263 -14959 -21515
385 -21515 -4655 20811 22367 -2575 -20976 -15207 1083 15098 19355 2974 -22141 -21626 5919
398 5919 22518 12642 -4175 -15496 -17093 -11 22553 18563 -8618 -22025 -10498 6385 16402
411 16402 14483 -3892 -22147 -14757 10308 21462 9560 -9167 -18834 -11394 8980 21714 10830
424 10830 -12134 -21851 -8604 13472 21339 6774 -14050 -19933 -6648 13483 21761 6642 -17699
437a7699l842K0483J8110o48j3440j6960o699J7153K4287j521k3524j3610N138
450a2772J2815J4855M019j9766k1872P279K4179R302q051j3444j3237Q27K2019
463F153J6859j2106k2566n900R800J4610J0928o056k1725j0916J3809J9236M492
476A6618j0144j5774q469J0033J9517O186j3006j6554m751J0943J7235N308j3389
489C753j6615k535J2158J5336M248j3414j7586q36J5667J3518j38j2315j4990
502a3749j978J6323J5980l314j6107j1370J533J3573J4833j273j8189j3426N666
515a1498J5849J0871k915j6044j3836N467J8907J0314p444j6004j0295O074J8442
528G888J0279j0114j7681o515Q914J6069Q438j0196j8834n058J3065J4981L620
$$ plain form
437 -17699 -21541 -1058 17052 16404 2964 -13996 -20695 -3542 20745 19224 -4300 -17910 -12772
450 -12772 43 14898 18917 -849 -22721 -15442 8737 18039 9988 -3456 -16693 -15866 6153
463 6153 23012 10906 -11660 -17560 -7760 6850 17778 11722 -10003 -20919 -7110 12126 16618
476 16618 6474 -9300 -17769 -7736 11781 17967 4961 -11593 -16344 -5401 11834 17142 3753
489 3753 -12862 -15397 -3239 12097 16345 2931 -14655 -15491 176 13694 13556 1241 -13749
502 -13749 -15727 596 16576 13262 -2845 -14215 -12682 891 15724 14451 -3738 -17164 -11498
515 -11498 4351 15222 12307 -3737 -17573 -12106 6801 17115 9671 -6333 -16628 -10554 7888
528 7888 18167 8053 -9628 -16143 -7229 8840 17278 7082 -11752 -16810 -3745 11236 14856
541A4856r928j6288n689J4002J7324K90j3850j2697k099J1500J6464J832j6664
554i47j4257L134J3446J1433M19j3960j4977L094J7088J0007m901j2577j0594
567a3592K140J5951J1344p368j4939o235M788J1990J0303n009j7044p172R748
580e095J2063M545m033j2892j0188Q495J7577L235j1017j0034m023M553J4558
593G744Q454j2124j6497K59J1283Q944L405o486j5097n060J4093J4084k246j1170
607d14q947j959R209J3960J178j4329j1766K963J2021R674j098j2183j1223K546
621a0368J3619J0064l656j3955r644N615J4126P031n572j2075q456M759J5560
634G048P916r902j3792k680O903J0235P109o066j6128n177J2564J2147k60p411
$$ plain form
541 14856 4928 -11360 -17049 -3047 14277 14567 717 -11980 -14079 -2579 13885 15717 -947
554 -947 -15204 -12070 1376 12809 13228 -732 -15709 -12615 4473 14480 9579 -2998 -13592
567 -13592 -11452 4499 15843 8475 -6464 -12699 -7911 4079 14382 9373 -7671 -14843 -5095
580 -5095 6968 11513 7480 -5412 -15600 -7105 10472 13707 2690 -7344 -11367 -6814 7744
593 7744 16198 4074 -12423 -12164 -881 8063 11468 4982 -10115 -15175 -1082 13002 10756 -414
607 -414 -9361 -11320 -2111 11849 13027 -1302 -13068 -10105 1916 11590 10492 -1691 -12914 -10368
621 -10368 3251 13315 9659 -4296 -13940 -8325 5801 12832 7260 -4815 -13271 -8512 7048
634 7048 14964 5062 -8730 -11410 -4507 5728 12837 6771 -9357 -14534 -1970 10177 9917 2506
648B506r364n526Q005J5423K084j3583j0437J901Q424R012K706r733j2943M98
662a1027J2941R309k777j0096q191J054J0058R291j490j1277r318L270J2265O838
676A0850m805r121n962J011J0113J0375m392j4743m862Q105P822L612o27j0221
690b845j0851O815J6335J935j0526o360j929J137J0744R600r363j5935P89J1363
704I09N572R39k857j0979o737J0940J3992k184j1371o272K40O136J0205K468j1237
719b36j1192K465J1474P695k575r860p664K233R906Q063k103j1597q599N519J2353
734E882L994n657p551n627J548J1803Q499q214j3019o35P256N664M267j822j2031
749e643p146J0134J2275j543p938n046k903L461J1375M371j0765j0429K495Q246
$$ plain form
648 2506 -6858 -12384 -4379 11044 13128 -455 -10892 -8991 -567 8445 11151 1418 -11525 -11027
662 -11027 1914 11223 8446 -1650 -9841 -8787 1271 10562 9072 -2205 -11523 -8253 4012 10850
676 10850 6045 -3076 -9038 -8027 2086 12461 8069 -6674 -11536 -3431 4391 8003 7376 -2845
690 -2845 -13696 -6881 9454 11389 863 -5497 -7426 -6289 4455 14055 4692 -11243 -10454 909
704 909 6481 7420 4563 -6416 -13153 -2213 11779 9595 -1776 -8048 -7808 -1672 8533 11001 -236
719 -236 -11428 -8963 2511 10206 7631 -2229 -9893 -7660 2246 10309 8206 -3391 -11990 -6471 5882
734 5882 9876 4219 -3332 -8959 -7411 4392 12891 4677 -8342 -8977 -1721 3943 8210 6388 -5643
749 -5643 -12789 -2655 9620 8077 139 -4907 -7810 -4349 7026 11397 632 -9797 -7302 944
763I44N356R56n652r340j372R686Q607k077q753o242J417P518O663o80p965p800
779h734J343J0047O834m160q587m080J816O882P645j791j1524o019O740Q488K017
794F917k582o707p025L502J2046L799q209p486r23L278P368N575n907j1162j252
809h768Q256O610R35m658q573l004Q326R096j015p438o233j055O734R136n03r709
825a863o062K465O244O069M96q608q092L719R375L291k925n487n843Q36R580O009
841I204n614q162j887L018N927N238l001r509l584O076P084J873l686p226l673
856g922N444Q166J247n324o242k520M814Q427J307p226n797K99L854N938L186
871G651o255q917J120Q042L723j084l118o123k750P770Q476l221q407k580J956
$$ plain form
763 944 6300 7256 1604 -7736 -9108 578 9185 7108 -1645 -7887 -6470 1048 7711 7031 -934 -8734
779 -8734 -7391 2656 9490 5330 -3257 -7337 -5521 1361 9006 7215 -4309 -10328 -3588 4900 6917
794 6917 4335 -2372 -9397 -5895 6151 9950 1741 -5745 -6668 -3390 3978 9553 3646 -7516 -8768
809 -8768 -512 6098 7033 2375 -6198 -9202 -876 8220 7205 -233 -6466 -7521 -787 8349 7846 -1863
825 -1863 -7925 -5460 784 6853 7349 -1259 -9351 -5632 3743 7034 4109 -1378 -7221 -6385 3195 9204
841 9204 3590 -4572 -6459 -3441 2486 7724 4723 -4786 -8370 -2294 4790 6663 2977 -4249 -7922
856 -7922 -2478 5688 6935 1611 -4631 -7151 -2337 6090 7397 171 -5626 -5327 -1473 4465 7651
871 7651 1396 -7521 -6401 1641 5364 4280 1162 -4961 -7711 59 8535 5314 -3093 -5673 -3717
886c717L760N762J006q430p174M227Q601K461l344n092m250J088P589N711l911
901D287q762l043N143O432J827k905n657m464K905R202L511p368p227J140M236
916g43L485L416k349r650l039R616O999m040m920j678k391K438R454J737j0659
931b324n982N545N147R45J260l077q276m07J0126N156n478n684j166O05L850N945
947F185o50q256m835M530O935J548l431m322k567J209N793M895l600q560j471
962f597O599M145q65j219l611n327L156J0204Q77r202l556L254J045K480N607
977F990l480j1090M1J0686L091m621j504j985m593L995J0340r56j0667k929N256
992a426K763J409K203m034p984J237R527L358n456m712o45Q98L576N046j029q067
$$ plain form
886 -3717 43 5805 6811 -1619 -8793 -4566 4035 6496 3152 -1940 -6190 -5102 2487 8198 4287
901 4287 -4475 -7518 -2375 4057 5884 2979 -2678 -7142 -4237 4965 8476 1108 -6119 -4979 -743
916 -743 2742 6158 3809 -5841 -8880 736 7735 3695 -1225 -2903 -5294 -2856 6598 8335 -2324
931 -2324 -8306 -2761 2386 3331 4591 1514 -6762 -7169 2957 8113 2635 -3049 -4215 -3610 240 6185
947 6185 5535 -2721 -7556 -3026 3909 5457 2026 -2296 -4863 -3654 2139 7034 3434 -5126 -6597
962 -6597 2 4147 3282 2063 -1548 -6875 -3719 6485 7362 -1840 -5396 -2142 -1097 1383 6990
977 6990 3510 -7580 -7539 3147 6238 1617 113 -1872 -6465 -2470 7870 6914 -3753 -6682 -1426
992 -1426 1337 2746 4949 915 -7069 -5832 3695 7053 1597 -3115 -3760 -2862 714 5760 4731 -3336
1008c336m228N689O912l53m026k793k279O01O874M887o178q367J657O206J716
1023B982K38l17n846m684O510Q402k804o930q68R77N31M865L523o274p301L010
1039c986O829J056j854j827l693j544N527N767k587o606j985K931L664K203o84
1054C211m320m238J654O566L079m172n148n03K232K898L294p41o702l739N365
1069a264N865j095l044j788k768N22O993L360o535n620K351L443J401K127j471
1084B477o825j803P135M640l082l654j632j026K908N885j84o716l404K856L906
1099A481K293k98m319m300J734N629K600k283m400k777J863N110K429k704m356
1114b298k048J957M869K525l419m947o24L003L356J634k234n001j506M320M167
$$ plain form
1008 -3336 -7564 -1875 5037 4684 658 -2135 -4414 -3813 3061 7948 1770 -6597 -4940 1266 2982
1023 2982 3220 2903 -2943 -7627 -1117 7285 4481 -2449 -3317 -2340 -1809 3056 6579 305 -6996 -3986
1039 -3986 2843 3899 2045 218 -3475 -5019 508 6275 3688 -2918 -4903 -1972 1692 3895 3211
1054 3211 -1109 -5347 -3693 2873 5952 1780 -3368 -3871 -1639 1259 4553 3812 -2890 -6629 -1264
1069 -1264 4601 3506 462 -1326 -4094 -3572 3421 6781 246 -5374 -3023 420 1821 3948 2477
1084 2477 -4348 -6151 984 5624 2542 -1112 -2744 -3770 -862 5023 4839 -1877 -5281 -2425 1481
1099 1481 3774 3476 -843 -5143 -3409 2220 4820 2537 -1863 -4640 -2777 2333 4762 2058 -2298
1114 -2298 -4346 -2389 2480 5005 1586 -3361 -3985 -982 2374 4008 1774 -3227 -4733 -413 3754
1129C754m16l000l084j198L010M837K49m517l351N24L043L576O08m155m164R30
1145c354M128K764k46l359m063L95M973L050j883l436k271J50L748L947j588n150
1161b195j824K409L026J910o80m125l125K520M918J125k838l380j403J986M180
1176B504J818l005m451j040L345M239N07l548l525l10K649L845J371l888m892
1191d381P79M658K121q29j751l328j682M433N051k248n123o05J545J053L006J430
1207D129n058m548L562N148m61k053j068k607n27N308L597m219m768P48K391J564
1223A138K005n52m789k552L739M383k26k795k318r79J509L548J698k714m122n42
1239c569L528L038n70k382j971r42J753M171Q73m672l293K311K989N44L96j272
$$ plain form
1129 3754 3338 338 -2746 -3944 -934 3903 4152 -365 -3716 -3192 -149 3427 4035 -120 -4284 -3354
1145 -3354 774 3538 3292 -67 -4130 -3735 1238 4288 2405 -1031 -3302 -3152 596 4543 2955 -2195
1161 -2195 -4019 -1610 1416 3326 2646 -1479 -4604 -2084 2834 3959 1121 -2259 -3662 -1676 2504
1176 2504 4322 1317 -3134 -4174 -829 3410 3917 369 -3156 -3466 -817 3028 4399 511 -4381
1191 -4381 -3602 1056 3177 2348 597 -2731 -4413 20 5071 2823 -2300 -2905 -1360 -307 2699 4129
1207 4129 -929 -5477 -1915 3233 2772 719 -349 -2956 -3483 1825 5422 1203 -3565 -2817 -426 1138
1223 1138 3143 2591 -2198 -4750 -1011 3372 3146 351 -1967 -2946 -1437 2111 3809 1095 -3027 -3569
1239 -3569 -41 2997 2427 45 -1926 -2868 -1115 3056 3929 -743 -4036 -1725 1264 1808 2204 932
1255I32m268p46N625L219l548l264K21J7J211M178L59n870k991L913L501l67p06
1272A416j500l296J86N250K551l745l734L95J891J684J655p81l968k044L277M116
1288C353n22l340j699K73J138K621J832k913m614O89M654J529j711j180j702j871
1304c463K768M968j044n321j132K471J071J185J599k734m548J467N082O60k648
1319C81j105q53q10K690L399j811m286m07K474J632O90n01k673j980J946L442
1335B228O71k373k620m35J995K453O41j713k809j175K533L509j94l124j737L13
1351a837J151K446J518k909l805J112L565P76q07p18k299j362L392L519k039l570
1367a867j27J113Q65K200N65l816k747K673L403r4j415j428j896N32L789J777
$$ plain form
1255 932 -3336 -4082 1543 4762 1214 -2050 -1829 -1812 -601 3577 3936 -1934 -4925 -1012 2489 2122 1416
1272 1416 -84 -3380 -3194 2056 4607 862 -2872 -2477 -586 1098 2753 1972 -1996 -4040 -763 3353
1288 3353 2831 -509 -2208 -1935 -797 1824 3656 743 -3871 -3182 1472 3001 1290 110 -1592 -3463
1304 -3463 -695 4273 3229 -2092 -3224 -753 318 1503 3102 368 -4180 -2713 2369 3029 381
1319 381 -724 -1577 -2387 303 3702 1891 -2395 -2802 -328 1304 1994 1493 -1180 -3160 -1214 2228
1335 2228 2899 526 -2094 -2529 -534 1919 2560 847 -1962 -3137 -604 2905 2711 -413 -2150 -1837
1351 -1837 -686 1760 3278 369 -3436 -2324 1241 2017 1210 492 -1807 -3169 223 3742 1703 -1867
1367 -1867 -1994 -881 -16 2184 2749 -1067 -3814 -1141 2262 2168 753 -675 -2571 -2039 1750 3527
1383C527k777k997m6J633K039J242j438l118r23K304K644L27k040k359k70J967
1399b85K113L84j807k563l02K696K227q25k108j273j00J729K584k05l250j691
1415b676J576J973R00n0k015k457R00L310J080j687j728j040K39K443K074j498
1431A344k932o28J370J741J293p63k792j260J923K274L59j156j997j203J653K739
1447A965J61k050j610l21J245K439O47k554k211P00J809J360M58j742k758K56
1463b206L038J477j048j498j526m18K476K584j240k957p03R81J363J720q7k995
1479a039j787J996K302J41p58j429j700Q98L066O71k239j540NO15J813J425j796
1496F44k753K70K083J084J93q35k254q15K438K185p97j746j026l19J290K308O3
$$ plain form
1383 3527 750 -2247 -2293 -660 1379 2621 1183 -1935 -2858 -554 2090 2417 377 -1982 -2252 -285
1399 -285 1828 2212 405 -2158 -2460 236 2463 1638 -470 -1743 -1843 -114 2470 2265 -985 -2676
1415 -2676 -1100 873 1773 1723 -292 -2749 -1849 1461 2541 854 -874 -1914 -1675 768 2842 1344
1431 1344 -1588 -2216 -846 895 2188 1425 -1367 -2627 -704 1570 1929 773 -1224 -2427 -774 1965
1447 1965 2126 76 -1534 -1855 -610 1829 2476 -78 -2289 -1589 220 1580 2038 296 -2462 -2206
1463 -2206 832 2309 1261 -237 -1763 -2181 295 2879 1639 -1318 -2021 -1040 323 2043 1956 -1039
1479 -1039 -2826 -830 1472 1613 855 -574 -2274 -1376 1690 2361 122 -1418 -1413 -798 1015 2440 644
1496 644 -2109 -1839 244 1328 1521 686 -1568 -2383 55 2240 1443 -303 -1329 -1648 -358 1950 2013
1513B013k524j518Q32J489J163J28j726j875N47K125J077o26j549j294M61J974
1529F97J122q66j643j018N66K046J207j364k003l20R40J397J180q28k610p57K120
1546a34J689k18q37j366j261J281K787J34k388j234L59P64J500J017j759k447
1562b113M55K190R50l59j039j574k25K040J672q26j839r12M67J656J313p87j932
1579h63q01P98J563J169q05k257p30J583J404K08m02j495j517J251K635l8j908
1596b05p10o0j4J702J585j827k554Q03J855J36Q0P0j870j166K281K040j328j600
1614g82Q5r1K82J852M88k365j457J348J421K02q7q83j528J25K043J143r61j576
1632g41p04O03J429Q61n68j435j045N68J898R56j364j621K2P71Q02R76l90k197
$$ plain form
1513 2013 -511 -2029 -1197 292 1455 1583 -143 -2018 -1471 654 1731 1105 -444 -1738 -1277 697
1529 697 1819 953 -690 -1708 -1142 904 2111 747 -1256 -1576 -636 761 1941 1113 -1497 -2254 -134
1546 -134 1555 1337 500 -866 -2127 -846 1941 2075 -313 -1547 -1188 -424 1076 2093 334 -2113
1562 -2113 -1658 532 1482 1123 84 -1490 -1715 325 1997 1171 -668 -1580 -1113 543 1856 1069 -863
1579 -863 -1664 -866 697 1866 1061 -1196 -1926 -343 1061 1269 867 -628 -2145 -894 1741 1703 -205
1596 -205 -915 -975 -989 713 2298 471 -2083 -1280 575 711 791 861 -1009 -2175 106 2146 818 -782
1614 -782 -697 -788 -506 1346 1834 -531 -1988 -640 781 983 896 13 -1515 -1390 653 1796 835 -741
1632 -741 -1445 -842 587 1448 880 -555 -1600 -1032 866 1822 458 -1163 -1141 -370 432 1408 1018 -1179
1650a179p80K029J470p50q07m44q81N51K310L90k362j248J042R07N04N93r51k092
1668a698P3K296J035r87j165o63K0J243J389m19j742r32P55J498O47q06j168m76
1686a100L93J130J040o50j881m07J486R18k14k36q26j200Q30K207j6j904n83M87
1704e26J33R06J146j227k160M92J872L23m02k05j117q12J533J691p53j451k98
1721h55J34N49J264J47j617j005P46J035N69n6j186j155O87J523L41o20q45q86
1739a230L15J775P51j366j220Q1M62Q94J013p48j984k02J577Q78j90m35j041p98
1757a468J114J730k06j466o86J41O82J136K31j366j142M63J164P32j87j163r91
1774a282N74J299M58m61q78q81L23J597O47j131j030L0K57P24J024m95j759l45
$$ plain form
1650 -1179 -1959 70 1540 790 -17 -461 -1342 -791 1519 1909 -453 -1701 -659 248 752 1345 394 -1698
1668 -1698 -1625 671 1706 719 -446 -1109 -1089 154 1543 1124 -618 -1550 -795 703 1350 544 -624 -1100
1686 -1100 -707 423 1463 813 -1068 -1475 11 929 715 479 -347 -1547 -717 1490 1474 -430 -1013 -526
1704 -526 -393 513 1659 432 -1728 -1236 636 959 557 352 -765 -1577 -44 1647 894 -557 -855
1721 -855 -721 -172 1092 1239 -378 -1383 -637 398 967 911 -275 -1430 -743 780 1121 501 -344 -1230
1739 -1230 -915 860 1611 245 -975 -894 -432 462 1475 727 -1257 -1459 118 996 806 371 -670 -1468
1757 -1468 -354 1376 1170 -296 -982 -841 -159 977 1208 -158 -1300 -837 327 1059 872 -291 -1282
1774 -1282 -708 591 1049 588 -290 -1171 -848 749 1396 265 -765 -735 -478 246 1270 775 -984 -1329
1792a329J348P60j61k20p26r13O34J647J37j299p22J86M55P45M79p44j223r2J111
1811G3R32k25r64o26J86O07P23L02r30j331L40J561L66p81l23l86o18R45J773
1830A624o45k077k1J220J01J73P26j102j829J000K234l26j428j7m7m92J152J477
1848A723j207j994M76J439J63j15J8r96q83J135J592l31j418n48M08O13O25K13
1866I13q12j197NJ489R71q76j200K0L66K45Q75L41j579j219J352J451o33o53K59
1885A18o96n93J640J284j628j509R81P61m44N74N74j581j160J662J463r81r14
1902d49L18k73l24J268R36j429j431P46J193m2k35J7p23p36R41J512l85j564k94
1921i54Q32K52J27O27n16j640R9K001M95j391m59L49m33K68J649j01k239m35J763
$$ plain form
1792 -1329 19 779 618 398 -328 -1241 -607 1040 1177 -122 -844 -658 -203 542 1021 277 -946 -1038 73
1811 73 1005 780 -184 -810 -624 -17 706 1008 78 -1253 -913 648 1014 233 -90 -476 -1094 -149 1624
1830 1624 979 -1098 -1119 101 202 375 1101 -1 -1830 -830 1404 1078 -350 -367 -414 -906 246 1723
1848 1723 516 -1478 -1002 437 600 485 503 -493 -1376 -241 1351 1020 -398 -946 -538 75 700 913
1866 913 101 -1096 -1091 398 1369 493 -707 -687 -321 -76 799 1140 -439 -1658 -306 1145 512 -141 118
1885 118 -578 -1171 469 1753 125 -1384 -403 358 -86 488 1062 -519 -1679 -17 1446 465 -449
1902 -449 -131 -404 -728 540 1476 47 -1384 -638 555 513 278 295 -428 -1164 -223 1289 904 -660 -954
1921 -954 -122 130 257 884 368 -1272 -1173 828 1323 -68 -527 -178 -611 -343 1306 1205 -1034 -1469 294
1940B94N56o60J87k15j367K49K095K82j784o11P02J49K60Q75m16j647j81J516
1958B84P82o00o61l46j63N00J019J86j166j003N01J210K99n75m28l55k57Q19J207
1977A253n13j592p2J065K08p5L93o11j296N90J693j41j220m5J83m22O37J210p38
1996E07j607K91J149N2j20K00p36q84Q71J310l15j000k23P9J83P58M03q47r43
2015h72K28Q14N16r1o11o61M3P20O59m0q19p50K47R61M50l74o28n20P4R20P82
2036A048n87j089j76N70N79L93k44j028m93Q26R32m4n59n90l45N51J016R0q95
2055d5o28P1N04P29K29q67q73L04P99L53j9m89q36J1J074N81n87o41j70L6N22
2076E8P51k45j055k96O33M93J48j06o11n41L88Q56K15m68n89k64L56P11K22m17
$$ plain form
1940 294 850 190 377 162 -1205 -956 1139 1421 -363 -974 -272 -123 137 1012 596 -1051 -1232 284
1958 284 1066 466 -195 -541 -704 -204 815 1001 -165 -1168 -667 543 842 267 -161 -516 -773 46 1253
1977 1253 740 -852 -924 141 349 274 667 56 -1240 -650 1043 902 -318 -363 -180 -602 35 1245 507
1996 507 -1100 -809 340 392 272 472 -264 -1148 -277 1033 718 -282 -505 -426 -243 515 918 71 -872
2015 -872 -644 170 686 595 -16 -677 -634 86 745 705 -114 -864 -617 344 794 420 -208 -728 -654 266 1048
2036 1048 461 -628 -804 -234 345 738 494 -534 -1027 -201 731 687 128 -462 -807 -256 760 850 -45
2055 -45 -673 -602 -98 631 860 -7 -880 -576 223 576 557 68 -768 -757 317 898 311 -330 -500 -464 58
2076 58 809 564 -491 -787 -154 339 487 381 -230 -771 -383 473 688 220 -369 -633 -277 434 656 239
2096B39n69l28K95Q74L29p71o93K04L52K73M77k13j168k27J151N33n61k23q5o11
2116g22K79J344K6j415l53P55J82P3N74m63j338K16J489K58q49k81j16k72O15
2135BJ060m07j333k10Q35N15M3j41n76n84L62J023L00q05p85J46O00L21J12j76
2155C02p50m75Q50J013m04r50l4K27J1N83N72r57j113O69J120j91m15R5m86n09
2175h42R31J046p63j067K71M63p5L57L88p98q65O14R65j16n40j24j66j28N37O82
2195G70l53r83j54P29M65j67j83k19n15J14J058L92j067o92N61L81o3M28O7j172
2215f03m77J316P58q10m54K23m01n0J225L48j448o72R54N02k35K28j37j053n5
2234h41J345M88r51n58J61R8L34O34k24j038k91P65O58n3m55m60j41L35O24K87
$$ plain form
2096 239 -330 -658 -363 511 840 69 -624 -420 -68 205 682 469 -699 -926 225 758 197 -26 -111 -722
2116 -722 -443 901 927 -488 -841 -86 96 169 743 280 -1058 -842 647 905 56 -225 -341 -613 2
2135 2 1062 655 -678 -888 -53 462 505 364 -212 -796 -434 589 889 84 -701 -555 45 366 478 302
2155 302 -448 -923 -73 940 536 -414 -448 -221 -210 373 945 -12 -1125 -456 664 473 58 153 -333 -842
2175 -842 89 1135 372 -695 -424 39 -36 321 709 -89 -954 -340 625 509 -31 -155 -321 -449 88 770
2195 770 417 -566 -720 9 474 307 124 -95 -610 -496 562 954 -113 -805 -244 137 74 502 569 -603
2215 -603 -1080 236 994 184 -270 -47 -448 -498 727 1075 -373 -1045 -91 411 176 404 267 -786 -841
2234 -841 504 992 41 -517 -356 -258 76 710 486 -552 -843 -78 580 527 72 -388 -529 -194 430 717
2254G17n26q39j4Q07M62k70l03k96l54L91R81n3j052k89N40J81R5L78l95r63K26
2275e76J079Q3o25p5n5l33M36Q60l50r78j5N50J39J51J77n46o66L89Q38J03m57
2296A29l76j97J30N68M14l57p17k24M75O15P6m25m46j53K35O31L27o05p50J66
2316d84N94K37M3j90o78k94Q37P33m18o82r8K2K74P40O9j020n44O42O02N8o9m24
2338e0o70K26R91K56o36m61r8J34N60M78m70p75j8M66L69J90k77o58j64N92M82
2359D67q2l22m28j93N09O38j53o02k32M6K86N60Q2p28m59L61M33J45J01l37o92
2380f00R2Q04K59l69k52k39j98N07O99k86p75r9K91K06L83Q7p30n27N25O49j7
2401D10k62l19l74J86P98K51o44n08L4K93M80K99m74p41QO08M66J1m26o15r1O58
$$ plain form
2254 717 191 -648 -662 145 607 337 34 -262 -616 -225 756 703 -349 -638 -98 83 178 556 161 -802 -576
2275 -576 503 586 -39 -114 -169 -502 -66 794 444 -534 -549 1 140 291 468 -78 -744 -355 483 586 129
2296 129 -247 -444 -314 254 668 311 -406 -630 -155 460 536 111 -335 -488 -253 378 705 100 -650 -484
2316 -484 110 347 390 200 -478 -772 65 798 380 -302 -400 -378 -104 636 705 -315 -859 -217 385 443 374 -50
2338 -50 -720 -494 497 753 117 -344 -442 -308 252 730 260 -515 -533 -67 302 492 215 -443 -607 -15 467
2359 467 385 63 -365 -558 -49 589 436 -166 -398 -352 -66 494 576 -152 -611 -250 183 328 429 92 -600
2380 -600 -508 296 555 186 -66 -305 -503 4 703 417 -358 -457 -166 40 423 510 -220 -747 -222 427 410
2401 410 148 -171 -545 -359 439 690 46 -462 -428 -135 345 644 170 -571 -563 45 511 522 96 -519 -610 48
2423D8N48r9n47m81j0O28N63k20o32l27J52M83M81j57p58l07M61M66J28j34n04
2444b18m35L94P53K4n15k85j17J20O19L67o01o70J73M42K15J90j77p17k08O91
2464D5N17k51l16k29k20K83O75No36l02J58K57L18J21m43m84J56M68K50m8l52
2485b8m63R6O09K82k38l63l43LO39N21m19o67o6K29L28M48o0q78l95O68N51r9
2507C55j62k96n18K14R33J70p81l80J83J35L39M21m14q62R3P94K61k23k44m06
2527c88j76O06O67k97p04k38K63M27L67j20o04l82K74N88K94l01n62k11K94M21
2547B18K11j24n15l80L69O34Ml97k15j46K0N57L78n34o33K16M31R8J01l8o08k91
2569f44O79N56l00m29j00r8J67O09J45o44m89K22M05K73O0l52n27j0N34M46q8
$$ plain form
2423 48 596 497 -50 -531 -541 87 650 430 -202 -529 -377 106 587 430 -328 -635 -174 292 420 286 -218
2444 -218 -653 -259 494 518 3 -282 -399 -279 340 707 106 -564 -391 51 266 456 279 -438 -646 45
2464 45 562 311 -5 -234 -454 -171 504 509 -127 -429 -271 -14 304 425 -18 -502 -346 122 372 324 -28
2485 -28 -491 -395 214 496 258 -105 -448 -445 194 715 296 -371 -437 -208 120 568 508 -370 -765 -97 454 355
2507 355 193 -103 -621 -407 526 696 -85 -465 -282 -147 192 613 199 -663 -570 224 485 262 18 -388
2527 -388 -564 42 709 412 -292 -530 -267 160 527 407 -197 -579 -305 283 577 276 -286 -497 -203 218
2547 218 429 305 -210 -590 -221 413 417 20 -195 -341 -321 236 614 80 -553 -337 94 192 293 255 -353 -644
2569 -644 35 591 291 -138 -238 -336 -169 440 585 -59 -548 -326 79 352 412 60 -467 -477 57 503 415
2590D15n19m22J52N48K60j39l74m15L5O82M43m94n94M3K46K30L83m4q36l42P47
2611EN48k39k56j89l98J77R07J98q67m64L09K72K34L05l47q10K4P86L36k88l07
2632f4k80j01M74N15j98n71k15J75L84L16j55m90k24K31L63K56j12n32k89L71
2652a46M73L6k10k67l30J38O63K29n22m13N4J69K69L49k29o67j12N11L47n4j76
2673A12l41k55L27N61J9m33l41k7L12M22N0m38l80L5L85M37%n52m36K43M88K20
2695D08q7l70m76J00P23L36m63m60p7J15L59M54k07p52j98N26M04Lj55m01l20
2716e38L29O29O8m87l72k2L35M10O2m23l79J3L78M21mn29l71K60L95J19J6k46
2738F4n19J3P20K77m66k81L8j28J75O19k7q42k07N61K17r4J51k01o14J20Q06J40
$$ plain form
2590 415 -104 -526 -374 174 434 295 -79 -494 -459 223 666 172 -422 -379 -133 97 480 436 -400 -742 5
2611 5 553 314 58 -131 -529 -352 555 753 -114 -578 -269 3 237 542 195 -615 -591 195 531 243 -64
2632 -64 -344 -445 29 544 346 -225 -440 -265 119 435 280 -210 -434 -203 160 416 304 -228 -517 -146
2652 -146 327 363 153 -114 -444 -306 357 586 64 -349 -295 -126 143 492 263 -404 -516 -5 342 288 112
2673 112 -229 -484 -157 404 423 -10 -351 -378 -66 356 406 -32 -412 -377 8 445 445 -107 -543 -300 188 408
2695 408 321 -49 -525 -425 298 634 171 -289 -366 -251 108 562 355 -397 -595 -69 335 338 183 -218 -538
2716 -538 -209 420 488 1 -371 -393 -58 352 414 -9 -388 -375 3 424 420 -109 -480 -220 175 294 310 64
2738 64 -455 -442 278 555 89 -192 -154 -282 -107 512 485 -357 -564 -3 214 120 271 70 -544 -424 382 522
2760E22n77k03R1m5K26M75j87o94q8N02K97n4j58k74k27K18N28J73m68n04Q0M35
2782F8K76k9j96l95k64M50O86j49p12j71K70J29K58K82m57p32K84P98L0m22q1
2803g7j23k21M46O39l65p85O5N10J14J2O3l88m59L67P07l5n46k48J04J36K80K57
2825D53k63o28p0N99L72k53l05p0j11O8N18K20o27m65M07L89j31J6J09m84l02
2846e58O69N40n22m67K30M5j07M72K69p38m96N79N02k25j27J7m07j28O73M16n20
2867A17n13J07K20J52K41k4n22l02L54N31L9l84l12lJ94K80K33k29n82j10O15
2888A02L87k77l31n2j16J51N97Q6p62l62N14L23p2O2j52n64nP93K72n60l05R6
2910a75k6J81M69r7o83j72M73L01o3q5k29k82J68N08J13l81l21L0K48K54O3k28
$$ plain form
2760 522 -55 -258 -167 -212 14 489 302 -392 -480 22 319 265 107 -167 -394 -176 352 525 57 -447 -367 68
2782 68 344 315 119 -276 -540 -90 596 447 -265 -436 -166 -37 221 503 46 -686 -402 396 426 4 -77
2803 -77 -200 -421 25 664 299 -486 -421 89 203 215 278 -110 -569 -202 505 470 -76 -324 -220 -84 196 453
2825 453 190 -438 -508 91 463 210 -95 -165 -276 -208 310 530 -97 -562 -155 234 103 119 228 -256 -558
2846 -558 111 651 129 -338 -108 -63 -170 302 571 -167 -663 -84 418 193 66 83 -324 -452 221 637 117
2867 117 -396 -289 -69 83 324 300 -222 -524 -170 361 400 16 -296 -299 -105 175 408 179 -403 -513 102
2888 102 489 212 -119 -171 -287 -136 461 547 -215 -577 -63 260 188 250 98 -466 -471 322 594 34 -271 -175
2910 -175 -201 -20 449 352 -331 -503 -30 271 208 123 -106 -388 -220 288 401 20 -301 -271 -23 231 294 66
2932F6l07q7K87L81ql83k44Q6K13K10J36k64m59K2M79K10j51j98k18j37L35M72
2954D41j41m86j58J52K11K63M9m35l46K50M10Q6j11k67l01J39N08J50l16k92j13
2975c07J06M04L04l58n26M5L40K15J28j45n28j79N22M24j73l11j90j10K32M97
2995C90Kn17k96K09K81K10J7l46l38J36L92J89j01l30k69J60M45J15k23k28j78
3016b80K6M45L05l61m67J01K35N6K05N6n36l14N15M17k48j98K0k44n4N67K75n68
3038d7l54K63J81qK25on48j90N35L67k28k76q6n8J35L86J21m34l90J60M26J60
3060C34j77k04j69r4L03M77j39o14j47M01J87j0R6k20n33J60P41P6n66j54J42
3081a10q4K07M89k43p42M6O34J10k11Pj84l43K78O40j11n63j34K14J26J55J21
$$ plain form
2932 66 -241 -328 -41 340 332 -51 -295 -209 4 214 350 86 -373 -351 128 338 187 -11 -229 -366 -31 441
2954 441 300 -186 -344 -192 19 282 331 -104 -450 -200 210 296 185 -82 -383 -244 264 414 98 -194 -307
2975 -307 -201 203 507 149 -377 -332 8 223 351 206 -322 -501 21 445 272 -39 -229 -339 -107 390
2995 390 392 -125 -421 -212 69 279 296 -50 -388 -252 140 329 228 -102 -371 -211 234 349 126 -102 -280
3016 -280 -254 191 496 135 -332 -231 4 60 265 321 -215 -529 -14 403 155 -43 -23 -267 -321 246 521 -47
3038 -47 -401 -138 43 35 260 254 -294 -484 51 418 190 -86 -172 -230 -95 291 412 -22 -412 -252 174 334
3060 334 157 -47 -216 -310 -7 470 331 -283 -430 -29 158 148 244 24 -509 -349 392 468 -98 -252 -110
3081 -110 -194 13 502 259 -483 -437 197 307 96 103 -81 -424 -146 494 383 -180 -314 -100 26 181 302
3102C02k33m35K6M70K61k36l20o9Q1J32K66R7m11m34L07N10q0k65L4j45k44M28
3124D2N39m22o14K35L60j50R9L07m50n49M88O29l10l58J58r8k46M78M62n33n68
3145e01K94L74n1L6N8m28k65M62M74k01m21q8P9J63K43Q6l06l97Q0M83K28k75
3167A27l00k0K7J46L77J6n90k78M53L66j52r0o2l35qO24K16n71l21K63J08K4K89
3190C09p2n69j17N55K37k35j48p0j71J40M58Rm30k17J70K03J37K7j94k82%L18
3212E8K78j14l51j40J60J96J31L0k52l49J25M74O9l01j22l8q1K48L87j97n36J2
3234c13L50N6M7J02l45l70L43M93j05l30m9p9NM03K40m41l90J90K79Q3Q2j27m20
3257b96l3M38K33j70k29j70j2K68L16j31l61j39J16K44K24q8l88j50K10K50J10
$$ plain form
3102 302 69 -366 -340 130 391 155 -165 -234 -153 -21 245 342 -69 -503 -196 314 234 -31 3 -142 -386 42
3124 42 581 159 -455 -220 140 -10 89 396 -54 -603 -115 514 204 -154 4 -94 -340 138 600 67 -501
3145 -501 -207 167 116 152 210 -218 -483 -21 453 252 -169 -257 -178 -15 228 314 8 -389 -309 174 402 127
3167 127 -173 -193 -166 -20 357 373 -217 -495 -42 324 172 82 20 -315 -323 301 517 -54 -375 -112 -4 20 309
3190 309 237 -332 -449 106 343 108 -40 -110 -281 -141 317 326 -104 -321 -151 52 189 216 22 -260 -260 58
3212 58 336 222 -129 -269 -109 87 218 248 -4 -353 -228 246 315 14 -108 -146 -227 21 408 211 -325 -313
3234 -313 37 93 140 242 -103 -473 -130 363 258 -72 -121 -200 -195 208 448 7 -383 -193 86 169 251 124 -296
3257 -296 -329 109 342 172 -57 -227 -239 29 345 214 -147 -286 -170 74 298 210 -178 -328 -118 132 242
3278B42q0l14k26K64L66kk26j52j16P2L92J56l72k64J13J40J16J68j29m19k9L91
3300I1J69j38p4j62j82K24L90p2l66j05Q9J01K07J00k97l16J45L12R7o3j73k40
3322b63M3L24J86j30k59j50R0K88J69j45k73j37R9K89K16j90l73m9K24J67J29
3343B55p5l70j95L50L48r7k42j06j12R9M12Q4m36k57K08J90O1J35j67m24K6M82
3365A69J51k42j22j18r2K70L63j60m22m7J94J23J66Ol35k36K34L01J9j32j78j59
3387b47J15L02P2j87k01p6J09K60J15k38k28L1J18J65J48j63l68nL42J31o5o1
3409F9j86j90K56M00j09l71l5P9K0K41J71l42l71K16L18ln7n4k59q1L64K84k53
3432A07k89pQ3J37K15n4l43j67K15K91M6j80k23o9J51K45J17j80l09n9K83K43
$$ plain form
3278 242 162 -152 -378 -114 252 250 24 -128 -244 -172 220 376 4 -260 -147 -7 109 277 148 -271 -300 91
3300 91 260 122 48 -114 -296 -72 318 246 -120 -225 -136 -35 172 272 -25 -341 -196 116 213 150 -23 -263
3322 -263 -220 104 290 160 -99 -249 -159 129 298 153 -120 -257 -158 131 347 157 -216 -265 -41 126 255
3343 255 180 -190 -385 -35 313 216 -26 -132 -244 -145 267 351 -85 -342 -134 56 117 252 85 -339 -313 169
3365 169 320 78 -44 -162 -254 16 379 219 -203 -250 -56 67 233 239 -96 -332 -98 203 222 90 -88 -247
3387 -247 -132 170 242 55 -146 -222 -113 147 262 24 -204 -173 -55 110 258 95 -273 -278 64 195 130 69
3409 69 -117 -307 -51 349 240 -131 -166 -87 -67 174 345 3 -368 -152 166 163 106 52 -207 -288 76 360 107
3432 107 -182 -189 -106 31 246 192 -151 -318 -103 188 234 54 -169 -238 -87 158 275 95 -214 -273 10 253
3454B53n9j78j27r8J28L49M1l71k10J90J17M9J28j25l74QM31J24k51r9k4j05J78
3477b5L32j00m15l0K38P3M7O1k22k47J64L27J8j70j28r1M5K41J40j45k38q5J31
3500g9K43P8j93j84l4Q7J74J69j59l47oL10J17q5l2j53k03K23L93j18l68nJ19
3523e3kJ58K13k99l97K15L95l9j48Kj93j22L39L17k59l34L5J35R0J52rl10j84
3546b98K25K66J1j79j58n4J25J86P9j52k23n0K07K22m9k08p7oP9K12J00k76k56
3569b74J65K30Pqn4k38q0L31K28k19j98%J6O7K30Lk86j61J66J58N6k7j48j65O0
3594a41K19J06r5k02j00J15K28N7j39j64o3O4K46J44k46k57P1J94O6P3m0l06j24
3617b94L33K46j58j75m5o5P6L07N4l49j94J74J47N4M8j55k44M6K99J08j44j71
$$ plain form
3454 253 194 16 -111 -209 -81 268 309 -62 -272 -82 35 84 212 87 -287 -279 152 276 25 -74 -98 -203 -25
3477 -25 307 207 -208 -238 0 73 120 181 -41 -288 -124 203 221 51 -77 -168 -123 118 258 113 -125 -210 -79
3500 -79 164 242 49 -135 -169 -82 92 261 102 -245 -251 59 176 91 59 -94 -297 -74 319 201 -167 -172 -53
3523 -53 -55 103 316 17 -380 -165 230 191 43 45 -148 -270 69 386 127 -207 -172 -37 53 205 196 -114 -298
3546 -298 -73 193 204 25 -133 -187 -62 124 203 51 -172 -222 -15 207 158 -50 -127 -133 -54 158 258 -18 -274
3569 -274 -109 121 128 120 66 -172 -252 79 307 88 -110 -110 -94 -27 203 206 -80 -241 -75 83 139 112 -36 -201 -141
3594 -141 78 184 89 -113 -213 -98 130 187 48 -116 -179 -115 131 275 29 -228 -157 37 103 176 136 -170 -294
3617 -294 39 285 127 -48 -93 -158 -82 225 279 -70 -264 -90 57 111 159 4 -240 -194 105 213 69 -102
3639a02q3N6K30J08j63j60n4O9K06J52j79k89N5J96N2N0J9k76j82K75K93j50j81
3662e8K6q3n3L06J74l35k52J96J47n0O9K4k71j03L09J85j83j47J4KM9J76L9k31
3686e0j71J16K20P3j05j52o1QJ52K00m7l22j32K49J80n3k8n7k52L3L91J26l67
3709d9j58J58RPK28l0l94o4L83J28k06m9J1j63P9L31J7l50j45J89J52L5K5j32
3733A2k13K2K66J90j56k66k5J38Q8O2K6j52k53J03L62qk76oP2j32R0L13j19m21
3757b83P5L49o3j44J85q6l22J58M38j18l69O9J40j13R1K74j97l66J17L39l3j09
3779C2K2j05j55J67K67p1k45r4J02J09O5K0j09j60l1K07K19j57k55L1J39J1Q8
3802I7Q4k33k60K36L44j26k34N6j9j12K45K48k79l35J73K39n3MP8k48j95K77K85
$$ plain form
3639 -102 -185 -129 101 209 46 -114 -168 -99 107 259 80 -209 -154 42 94 144 163 -113 -295 -20 273 123 -58
3662 -58 -32 -115 -168 138 312 -23 -275 -79 68 18 87 111 -160 -263 46 231 48 -99 -85 -83 -34 142 181 -50
3686 -50 -221 -105 115 188 83 -69 -130 -122 30 230 183 -139 -271 -22 158 105 77 20 -232 -199 192 318 -49
3709 -49 -207 -49 -40 -33 195 165 -229 -293 90 218 12 -37 -26 -189 -110 221 238 -112 -257 -68 84 119 144 12
3733 12 -201 -179 87 277 121 -145 -170 -32 56 118 144 -8 -261 -158 204 196 -80 -86 -14 -146 -56 257 138 -283
3757 -283 -208 141 78 -66 119 33 -289 -131 307 189 -180 -111 29 -84 7 281 84 -282 -165 174 141 32
3779 32 54 -51 -206 -39 228 157 -88 -182 -80 29 94 114 5 -155 -186 21 240 83 -172 -141 -2 9 97
3802 97 181 -52 -312 -76 268 142 -92 -36 -55 -167 78 326 47 -288 -115 124 71 75 153 -95 -290 -13 272
3825B72j52k24QJ2L1J77P2k24j88R5J93P2r3j20n7M1J14J14k7k01j22J68J85n3
3849I3p1k8j11l5K65J44k41j84J09N9J2J33J0l02q1K51J23q0m7n0j36P4K57jk26
3874f3p0N2K7J26Q5j72j54P5J32M5K5q5j92J6K48Q6j25q0o9n6J82K18j32k65k
3899a48J35N0Q3M6k45j80K12K20n9j04n9j02L1K39N7j77j47L0Q4J15O5j49j49
3922a52L2J24R2M1j26j87L0K47N9j27l7o6q1J74K29j44k69N6J36l5O7J21k10k39
3946b65J95K48r6j18N2q1j09K07J88j77k17Q3R8K2M6K1j40j34J25K00Nj79r5O2
3970e9P3L7P3k0k21r1K62J75j74j15O5q8m2K73J25l45k07K61J39j37Q1P2l16j04
3994b83L87J64l08j18J44m8l3K52L8l42r5K78J26j27k4qj37L5K34P3k11j59O9
$$ plain form
3825 272 120 -104 -96 -84 -53 124 196 -28 -216 -121 72 144 51 -69 -126 -85 29 143 116 -85 -207 -39 146 93
3849 93 22 -6 -117 -152 113 257 16 -168 -59 0 12 145 155 -147 -228 23 146 66 19 -31 -167 -93 164 163 -63
3874 -63 -133 -81 -54 72 157 -15 -169 -94 38 83 108 23 -169 -153 95 181 56 -24 -93 -149 33 251 119 -146 -148
3899 -148 -13 37 120 166 -79 -259 -47 173 114 10 -49 -151 -120 119 176 -1 -148 -118 -34 81 146 -3 -152
3922 -152 -120 4 96 137 11 -176 -146 101 160 33 -4 -70 -151 23 252 108 -161 -105 31 -4 63 184 -26 -265
3946 -265 -70 178 82 -36 16 -65 -174 33 221 44 -173 -90 8 30 76 97 -43 -177 -52 148 153 -26 -121 -59
3970 -59 14 51 124 104 -117 -208 54 229 55 -60 5 -83 -125 148 273 -72 -279 -18 121 -16 65 137 -179 -283
3994 -283 104 268 -40 -158 -14 -62 -95 157 195 -147 -242 36 162 35 11 3 -134 -99 135 208 -3 -162 -93
4017i3J45N7j2m6j16r6J03K56k3k79m9J43J6nJ57o6l21L0L52J1k71O9R0j90K3
4042a15L40o2l75N8K88q1j01J77m1l13R2L59o6k57L5Q6j13O3K41q9k97j4K33O2
4066A10o9j1n1j07K2K15Q1k00j70R9J19jMM1j43j60K19K37j68k03J00M5o4J33
4090G8J48k36k61K25K47j18r6O9j32j12K66J91k39k23J18J10k3P8L9k10j28J93
4112a6J65o0j20m0k1M3J09O7j09j42OJ57R5q7q0k5nL0J64K2k22j01J77R2o2K6
4138F3Nj89l0K72P5k14p0R6p7oK20J0k80l8J98K2o1Q1n4k01O7K40qj65nJ9l7J04
4166C7J17j17j63M6J15M8Mm0j22l8J27J08j8j00r3j4J18J05k3j10q0j3R2J32j3
4191A05j74o4P4O5O4K7j40j28J09J56j2o7l0o9j2J73Q1j50j23O6N9L5P9m5j92
$$ plain form
4017 -93 52 109 97 51 -65 -161 -58 198 175 -104 -153 -10 6 1 158 92 -229 -199 153 164 -107 -38 52 -138 -115
4042 -115 225 163 -212 -154 134 53 -48 129 88 -225 -133 226 160 -97 -62 24 -89 -26 215 126 -171 -185 48 110
4066 110 41 30 -21 -128 -106 109 190 -10 -180 -81 38 37 41 82 -61 -221 -2 235 67 -136 -36 9 -55 78
4090 78 226 -10 -271 -46 201 83 -13 56 -76 -188 78 269 30 -193 -75 35 12 90 129 -81 -209 -16
4112 -16 149 89 -31 -71 -92 -49 60 127 18 -124 -118 39 134 47 -33 -58 -63 -33 131 153 -69 -170 7 99 37 63
4138 63 68 -121 -151 121 196 -18 -88 8 -69 -75 145 155 -125 -163 35 57 -4 77 23 -178 -111 129 121 -44 -49 -30 -67 37
4166 37 154 37 -126 -80 35 83 87 47 -75 -113 14 122 104 4 -89 -103 15 120 97 -13 -93 -106 -14 118 105
4191 105 -69 -133 -59 6 70 97 -43 -171 -62 94 82 15 -15 -84 -96 77 158 8 -115 -49 10 45 124 79 -113
4216a13k1J68R2p5l8l6q7P7J69j7j63n1M6M6O2L7j14j05M1J11N2k6q3o7L3R0M7
4243G5np8q8J5J44N2q9m1k5k8P7J46o8j87qJ40OMO0j12j70J25J93m9j31J5k4o2
4271a13J47J50j75j76Q9J15k0M0J8j65p8J85J26q6j04j9nN2J49Jj71q0O6J06N5
4296A07j8j13r2O5J19L9m1j18o8Q0J35j5p0m5o7J6J56O5j41j11O0N7J7P8k5j88
4322a18l3J93P5j01j5or2N0J94k4j88l2J08PJ7O7p1j56M1J62J9p2m4m0k1P3J05
4349I8k6j27p2O9R1L3m3m7o9KJ23R8p9j44QQ3K8L8L1j25j24J31J67n3j24J6k0
4376c7m8J40J32j66j86J10J26l3J3L1j63r5J97J50j34j22L2j0J3J58J6j88q8J15
4400c7J00Qk5o6r2N6J18N2o6r8l5N3J10J5n8p3m7K8J36N9j34j21Q0M3OP4jj91
$$ plain form
4216 -113 -134 34 126 51 13 -23 -110 -33 136 119 -44 -95 -49 -3 59 96 -18 -123 -82 29 81 55 -28 -95 -62 28 75
4243 75 70 -8 -96 -81 63 115 26 -15 -40 -68 9 155 87 -100 -108 32 38 42 102 -10 -180 -55 138 89 -42 -27 -51 -113
4271 -113 34 184 9 -167 -78 37 17 57 75 -90 -168 17 143 57 -47 -66 -71 -19 130 131 -40 -120 -54 52 107
4296 107 89 -24 -116 -51 68 107 66 -52 -120 -40 95 80 10 -35 -102 -86 70 135 -6 -117 -57 0 17 95 70 -118
4322 -118 -151 42 117 16 1 -5 -97 -47 147 123 -65 -97 11 18 35 102 31 -125 -84 78 97 25 -19 -59 -80 -7 98
4349 98 72 -55 -127 -58 33 66 23 -24 -93 -91 32 130 51 -93 -85 -2 26 64 95 -30 -154 -23 144 91 -33 -17 -37
4376 -37 -85 55 187 21 -165 -55 71 38 51 82 -81 -176 21 171 37 -85 -53 -63 -50 108 124 -64 -152 -37
4400 -37 63 71 46 -20 -112 -56 62 114 48 -50 -85 -32 78 93 35 -38 -85 -57 79 138 4 -117 -37 6 12 86 85 -106
4428a06n6J95Q6j24k6K2r2J6J98J9k09m6J27Lj4J02l8j78MJ95L8r8k9j9m4N7J58
4455A41l0j73n8Q8R5J8k3q9o9L2J16Q2p9j49qJ02M9Nkr0j13Q3J94j0j60k0K0k
4483e0Q9J31j38k00P4J68Om0oq4p8J48J50r5j44j2N8K6Q8Oj42p5P4J07K9l8j01
4510d9o2O4Q4M6l6r5q0P1J46J4j16l6kj2J04J04j11j54N6J19j2KM1j20j06J35
4536eJ54q1j03J4qk0J27O9j66j10R2O6PL4m6j29KJ33O6m7p3p0NJ17R4q2q5k5O
4565f4Q4J19n2j68j7R7N4J9J8j18j17J09J78l8j08k0l8j0J26J00j36j50M6J26
4589D0J2Ql9j06m2J31J03m8r5p2L6R7O0k8q2o2oJ17J12p0j43LO9J6N9N5j51j28
4617a54J27J56n8p6J8o2o1J47J34j69j19P8O3k9N5L4j58o8J43J09n9o2k9l9L8
$$ plain form
4428 -106 -162 33 119 -5 -31 -9 -101 -85 113 132 -77 -123 4 7 -7 95 57 -121 -117 78 116 18 -11 -30 -74 -17 141
4455 141 111 -62 -120 -32 63 81 58 -31 -100 -68 48 130 51 -98 -106 -4 45 50 48 -42 -155 -72 122 112 -48 -68 -48 -50
4483 -50 39 170 32 -168 -94 74 80 40 34 -50 -128 20 170 75 -69 -81 -23 3 91 97 -45 -120 -46 61 90 52 -49
4510 -49 -111 -47 37 83 47 -48 -128 -57 89 103 -13 -49 -51 -63 41 145 34 -120 -64 55 43 45 86 -34 -140 -5
4536 -5 149 68 -35 -21 -29 -49 78 147 -19 -129 -37 29 36 70 24 -105 -103 30 96 49 -24 -94 -89 28 122 40 -45 -70 -64
4565 -64 20 139 87 -81 -98 -1 53 72 90 -28 -145 -36 142 104 -4 -24 -62 -72 54 154 18 -132 -86 40
4589 40 52 60 21 -85 -127 4 107 59 -36 -108 -72 25 85 57 -25 -87 -93 24 136 66 -77 -74 -5 11 70 125 -26 -154
4617 -154 -27 129 71 -5 13 -49 -110 37 171 2 -117 -39 24 -5 50 84 -74 -142 1 110 51 -11 -40 -79 -41
4642d1J14L7r4j03J9P3R3j4p7n8j1L8J19N6j59j28R8J19k5j7J2j41o1K05J35j82
4668Gj13P8Pm5J64L9k41p7K03Q3r7qJ0j29OK30M9k06o4O6N5J9O9m3j57j6J35J12
4696A36p5q2m5J4N2O9K1q4j10J3J50M5r4m1lm4M3J63k7k03l3J54K1l4N6l0j73
4723a41L8K26j6j41j0L5o1O9J44p1j78LJ36K8j1on9q7N0J31K5j03q4NN8Q8lm9
4751A6q4m4P6J53l0j60l0N5M5M2P9j03j75P2J91nr4lm9o6J30J71j14j77K3R2J2
4778B3N9K2j51r9J10J41k9p1n2m6L3J37J8j07p3J4N4P8L1j13q5M2O9M6L1n9j26
4805a03OJ44N3p1l4k4n5O1J48k6j57j9N0L1M9M8r6j22O1J09K0n1l6o3kJ07M5m2
4833C1q0l0K4R8N3q1p9qM4N0P6k9j53l4J43P2m3k5n5r8P1J92k0j60m1N4L1M9P1
$$ plain form
4642 -41 73 110 16 -87 -68 5 98 84 7 -51 -62 -24 95 151 -8 -136 -38 81 56 39 51 -90 -151 54 189 7
4668 7 -106 -28 -21 -66 98 137 -104 -181 22 105 8 0 10 -119 -113 117 166 -40 -104 -38 17 36 105 62 -95 -111 24 136
4696 136 61 -21 -66 -52 0 69 90 6 -104 -91 59 104 10 -31 -34 -78 -35 128 101 -102 -135 19 40 6 62 32 -141
4723 -141 -103 123 107 -34 -44 -9 -70 -1 143 72 -106 -103 33 61 50 44 -15 -102 -52 79 104 1 -83 -78 -20 68 65 16
4751 16 -68 -112 -36 117 87 -73 -103 -48 -3 39 118 15 -160 -88 103 98 4 1 -48 -114 16 187 73 -104 -81 11 23
4778 23 82 104 -47 -146 -36 105 76 5 -47 -93 -60 77 95 -12 -85 -71 -17 61 92 -21 -106 -64 5 51 82 23 -103
4805 -103 -97 47 100 29 -5 -29 -84 -23 125 99 -58 -77 -27 4 53 101 5 -117 -56 53 73 22 -14 -77 -79 28 73 31
4833 31 -49 -79 -55 43 96 15 -64 -72 -28 22 98 69 -84 -118 25 97 54 29 -26 -124 -53 139 119 -41 -82 -28 3 52 123
4862A23r3j61L2J52M0o3m3m1l9R4J02l1j33n1P3Q8K8n4o1m3J5J00J06r0j62K9
4888h3J24J3j2L8r0j37J16J88o6j58L6L6p4Q8J48j33j94J00J36n5k2O3r1j15J24
4913b0J70j03j19K5L5k2P2N9j08j19O8J26J2n0m9j8nO1R7k2j36o8R6R6j4l1rr4
4941g0m2J64J18j55j36Q3M4k4O3N5j85r4K00J20j27o9N8o3k5J71O3k01j05J39
4965a8O9j4PJ0j34m0J65J12j08j21J4L8L1O4K1j07j14P2J46or8j6%k6M7J17m9
4992F2j72J1J51Lo9M9k6j21M2J94k3j83J2Q9m6K5J23n0k03L6J77Lp5J7m4q7O1
5019d4J72l3j42k9M7K8L8L7o0j02OJ01O2m2q7l1L9L7O0Qr1r7P1J50k6q5k4j6j3
5048f6J06J08j09j64N7J16nJK6j03j03J27J44q3j04J9rj2J08N8j30j10Q9P8j1
$$ plain form
4862 123 30 -131 -99 53 93 30 -13 -54 -93 1 103 72 -61 -112 -39 49 77 23 -38 -81 -66 34 140 50 -112 -83
4888 -83 41 54 42 80 -10 -147 -31 157 91 -67 -31 5 -69 19 167 34 -160 -60 76 21 -1 62 -29 -144 -20
4913 -20 150 47 -72 -47 -12 -34 38 97 -11 -130 -62 64 76 26 -23 -41 -46 15 112 90 -46 -114 -18 78 64 33 24 -70
4941 -70 -112 52 170 15 -121 -38 6 -18 45 100 -85 -179 21 141 14 -55 3 -60 -85 86 149 -52 -157 -18
4965 -18 51 37 44 54 -80 -120 45 157 49 -72 -58 -20 11 75 96 -11 -125 -53 93 87 -11 -27 -27 -53 -6 111 62
4992 62 -110 -99 52 55 -14 35 9 -112 -70 124 101 -82 -70 19 -27 -2 121 71 -132 -96 81 84 9 26 -18 -105 -44
5019 -44 128 95 -47 -76 -29 -1 37 74 14 -88 -82 19 81 39 -48 -79 -40 -3 57 65 -26 -123 -52 98 72 -13 -37 -53 -66
5048 -66 40 148 39 -125 -68 48 43 44 70 -33 -136 -9 135 52 -52 -33 -42 -54 54 112 -18 -128 -39 39 28
5073B8Mk4r6j1J30O7q0p1nK3N4O2m1q4l6O0O7L4m1p4l0M9O2L7k5j08m0P4P8lm0
5104B0m0n2L4J10J6r9m5J2J2N7N9n8j18J7J06K7k8j0p3n0J00J14m0j05j1J1L6
5131BR1kj13p7O9Q7J3mp0q8K6J15N9p5q5l0L6Q6N1o0r9j3N3P7L2o7q9J0O6M5K1
5162F7l4j07j6J02Q3n8o0jl4K5J30J2j59n5J01L5oN1m6j46K7J72J4j13nJo2O0
5190b2J17l2j48lQ9K1LM0p6q8N1R9J7o0m8j5K1O8N3l2r7m2O7R3Mp2o1kK9Q3N4
5221A11r2j28K8J12L1k1j8p5p4J19J29o4j32PL6j6R4N6j26j14R8J15l5j8j5q4
5247g6qJ50O1r3j09J9N4L8N7m0j15l9Q1R5Jo7o9j1N2O3M4n3j10k6J01Q4o2m7l
5276b8m1LJ43L3j61n5J10K3j9N4pj53NJ75K5j12j0K4p7L5J63j5j94j7J13P%O0
$$ plain form
5073 28 32 8 -88 -99 31 98 18 -53 -58 -35 19 81 40 -44 -80 -20 47 81 40 -34 -64 -15 47 84 59 -49 -89 -15 63 60 20
5104 20 -20 -72 -38 72 88 -11 -56 -44 -32 25 84 26 -92 -75 31 58 30 20 -53 -103 -3 111 71 -34 -45 -34 2
5131 2 93 91 -22 -99 -30 57 70 66 -4 -92 -66 49 108 33 -52 -82 -46 40 91 31 -68 -81 -28 49 81 14 -75 -65 1 46 67
5162 67 33 -74 -90 12 95 37 -23 -24 -58 -33 97 109 -50 -105 -4 31 25 76 30 -116 -89 83 97 -16 -21 -20 -82 -22
5190 -22 95 63 -85 -88 1 22 25 65 -11 -99 -48 51 68 8 -40 -55 -34 34 87 55 -42 -84 -17 76 80 8 -53 -55 -26 57 111
5221 111 19 -109 -81 31 62 41 23 -52 -126 -7 122 58 -74 -67 -31 -47 47 103 -23 -137 -39 76 41 23 8 -76
5247 -76 -84 66 127 34 -75 -56 -2 36 93 53 -62 -101 -20 75 76 9 -60 -71 -19 44 88 35 -75 -101 0 84 22 -25 -28
5276 -28 -69 -66 77 110 -51 -106 4 27 8 62 55 -98 -93 82 107 -5 -15 9 -68 -33 130 115 -79 -96 17 24 24 84
5304H4o7j39N3J53jp4m5k2mO8Q6o0r2m1P7P8J2n1p3%M4O4N2p9j27L7J06L3m2k
5334B8o2q2J02J59o7j51J6N5k3O9P3j26j44Q7J41l8n4J7n6m8J23R6r3j11L7M9
5360cOM3Lr8n1Q0R1j4n7m2lK9O0K7l9q8k0R8O4l7n6j4l7kJ26M6j52p0Q5M2j9N3
5392E1mj43l2J57O7r7k8K0n7J5J40J8j81l1J14K5qL1m7j10M2J32K2q1n1k5J8Q0
5420C7O0o7r0k8N3Q2M3r2p8K2L8M2L1j7j28j9J34N0o2k6ro0M0J48k3j42j3Q4J5
5449B5qO3o2j22N3J36j9o2ok7l6P2R6o2j07J1L4L4L2j6p2m2N1N7K3j3p8m7P2O1
5479D1j0k1l3n2L7J06Rr8l1K9J4K7O4o0j11K3J02K5k0k3o9l6Q4R6l6q5l9J1L9
5508a7Q4j8r5l5M5M7M8%j07n5P9P0kk7k5p6K7J29L0j07n4M2pL0R0m3j57K3J21
$$ plain form
5304 84 17 -122 -69 84 83 9 -36 -58 -62 6 92 32 -60 -101 -24 54 66 15 -58 -58 -14 50 102 23 -104 -67 39 72 30 28
5334 28 -34 -116 -14 145 78 -73 -57 -2 -25 44 117 -9 -153 -66 75 37 -17 0 -56 -104 19 115 22 -89 -52 -3
5360 -3 3 46 49 -49 -100 -20 71 57 0 -42 -45 -16 44 71 32 -56 -76 22 86 49 -7 -21 -58 -60 66 112 -40 -110 -25 17 -2 51
5392 51 47 -96 -128 29 96 -1 -29 -9 -66 -51 89 107 -74 -105 9 34 26 57 10 -100 -58 74 96 15 -36 -61 -43 37
5420 37 97 30 -60 -88 -35 47 90 -2 -80 -58 -20 22 53 36 -92 -111 23 73 11 -15 -24 -84 -44 104 81 -61 -74 10 25
5449 25 17 80 18 -104 -51 85 66 4 -2 -29 -65 7 103 41 -66 -55 -21 13 45 29 -43 -85 -34 23 46 33 -45 -92 -20 41
5479 41 31 10 -23 -75 -38 68 77 -21 -52 -23 -9 18 82 22 -89 -66 36 61 41 18 -51 -87 -3 93 57 -28 -67 -56 -17
5508 -17 67 49 -46 -81 -36 11 59 59 -48 -103 -24 46 44 17 -8 -84 -57 72 102 -5 -59 -17 -24 6 96 53 -104 -81 40
5537D0K8n3J7l3j01P3J25l4j17j0L4QN1M2q5p9L3O5M7j7o0m7L0N4K9jl2q3MJ16
5567D4M5q8l1K6n0L0J30k8j62LJ19nj5N7n7j37O0J60l2j16J2J7n7P5J09q4j36
5594a11K7J08J3pqo3n7P1J04k2q5m7L9N2M8j0l8p0j1Q1R1o4r8PM1J1L6M1j05j04
5624a30J05J06m9o0K6m2n0J18R7j21j08P2M3k0M7L1j27m6J08Q2n2m8Jk2J3P2K9
5651G5p0o6K0M9M2mm3l3qK9O9K7j00q5N7P6l1JK4q9n3J35Q7j03p6N2pj7R3L9j41
5682e1q3J29N8l9KQr2JJ34L4j06n7L6KM1N4l4j10PN7N2J5n9o4rP3L8Jl7n5l6R1
5714AP0m8p9J4J3kP8L2j15n6P8M8j0Rj9p3j0J07M8q1m9J6J3L4N7m0q1j4M6N3L
5745D3k6n8j6L3M1J8j2o7m0O4P2j8n2%k7j4R2N4q7q0N1M8j3M5mr9l8J28N3o7m5
$$ plain form
5537 40 68 15 32 -1 -102 -29 96 62 -55 -65 -31 -23 28 70 -15 -94 -61 4 51 34 -26 -73 -43 11 40 39 7 -76 -72 44
5567 44 89 1 -30 -4 -54 -24 106 78 -84 -81 38 33 18 75 18 -119 -59 101 69 -47 -35 -18 -75 0 109 25 -111
5594 -111 -84 24 37 30 22 -41 -98 -27 77 55 -30 -77 -38 14 62 52 14 -56 -67 14 105 41 -57 -50 -9 2 38 79 -26 -130
5624 -130 -25 81 32 -28 -2 -44 -94 24 121 0 -108 -36 7 -13 34 65 -62 -108 0 82 30 -18 -17 -39 -26 46 75
5651 75 5 -61 -41 8 50 46 3 -30 -38 -9 60 87 -13 -98 -41 35 4 5 29 -60 -113 22 109 6 -70 -18 -25 -42 51 90 -51
5682 -51 -134 -5 53 14 16 24 -68 -67 67 101 -5 -62 -26 -24 17 71 37 -73 -66 -9 43 58 -1 -65 -74 -1 37 38 1 -54 -90 1
5714 1 71 23 -56 -42 -29 -31 47 79 -36 -92 -14 34 24 33 14 -59 -69 38 86 5 -44 -28 -15 19 76 36 -45 -59 -13 40 43
5745 43 17 -41 -57 -24 17 35 23 -44 -84 -20 52 34 -18 -18 -45 -59 33 87 0 -80 -29 19 6 51 47 -52 -90 38 91 24 -21
5776b1Kl2K7R6lr8n3O2N0J8j5n2m9K0O4L3j3q8l0O1P4k1l0j3n2jJ21M7j16o6O4
5807a4K9k6P2J4j28n5J49O0r8k9M7o5j3J25L7j53n3J07J7m3N3kj02j7J10M4o8
5834bm0K6j1PN7K0o9o5L8Q2mm0j7J2k3J9Q7nj28j4R8Ql5L2nj12J2J49K0j40j0
5865e3O1l2JR5j5j52JJ28J9o5J1lp4L6J22Kj30k4O7K8RJ0k5q2%R9N8o3p3J3L2
5896AKK6M0q0r1P9J05n2o8M2j4n7O6R4r0j15O8Q0l8j6P5p2r8R6J18p8o5L5Jm2
5926d8N7Q5r7q8O2P4k0nJ3o0m0O3P5l4n1l3J4L4K6Jj7n4j5O7N6n1o8K3NjM9L9
5958F1r5o8R1P9m0l5J5n5j8R6Q1j21p0P8J9j0M1J4j17l4J17M4o0k1j4l4K6Q3K
5987E5q7l1M1L5J1Rm9m4J5O1L0k2n3l0M8L1J5k4k9k8J9O9J2n2l2MOK7N9k6q9N
$$ plain form
5776 -21 -19 -51 -24 72 69 -29 -82 -20 30 48 33 -19 -68 -48 16 49 36 -52 -82 -21 53 32 2 -11 -63 -64 57 104 -12 -78 -14
5807 -14 15 -11 61 75 -53 -108 41 101 3 -26 21 -44 -57 68 105 -48 -101 6 23 -20 33 31 -71 -88 22 66 -2
5834 -2 -42 -16 -27 -20 37 57 -12 -77 -39 43 39 -1 -18 -6 -29 -10 77 72 -56 -70 28 36 1 33 28 -84 -72 77 97 -43 -53
5865 -53 8 -24 -23 72 57 -95 -94 34 53 -12 -1 -4 -78 -42 80 82 -48 -72 -5 23 32 42 17 -65 -65 34 92 29 -44 -31 1
5896 1 3 29 69 -11 -102 -23 82 30 -38 4 -10 -67 -1 93 3 -112 -44 36 -2 -18 57 -15 -113 -17 101 23 -42 -7 -6 -48
5926 -48 9 94 -3 -91 -29 45 25 20 33 -27 -67 -4 71 37 -14 -47 -33 1 27 28 11 -43 -58 9 65 14 -54 -31 -26 -27 22 61
5958 61 -34 -102 -11 68 28 -7 8 -47 -65 31 112 -9 -79 -1 18 8 49 63 -54 -88 29 73 13 -8 -22 -56 -30 53 55
5987 55 -32 -63 -22 13 24 33 -16 -60 -45 16 46 24 -29 -59 -11 20 35 11 -18 -46 -27 42 54 2 -30 -26 -20 7 66 40 -49 -44
6019d4N1NMPm2o1O9O3l0m4Mj3k6Q2M0q6m1L2L8%L2qr1j4J00K8n0j0l0j6N0P5k8
6052D6q0j2L5K8L1Pp4m6M2N5J5j3o5l7M5O1Ll9k5k9L1O6J1q0k6L0RK3M9m5r2J7
6084e9J08nm9K3l4o3N9J12n4r7L8L3l0L5P3r5r0P4P0l7k4K5m6k5O1N2m3o5J6K2
6114a5PL0ol6l9L0P1Om8l8J0K0K0L2ro9l4Q0N3l6m0K5m2k6J01M2j08n4O7J1j3
6145hM1Rj04l3J17L8p5j4J8l4J2R0lj13lO7K6k3J1k5n7L8N8K5n2l8j4L1M7Kj2
6176B2l9m1L2P6ko3k0K4j0J5N5k2r9K0R4j5o4M9rp5M7J06m2j07N4M4n7K1Q2o1
6206A5j07P4Q7l3m6L9l5o3P1Q5n7o8J3K3KK6K6o7n0K9N9J2l1k7k5L4J3K5Qp2l7
6237g7P1N9l8m2J9pk8O9P3j13n9O9M0l4K3K0r8l5J19N7r0l2L7k6%P9J1j12k1P9
$$ plain form
6019 -44 7 12 16 23 -19 -80 -11 52 22 -22 -18 -31 -57 25 65 -21 -62 -30 8 8 40 32 -59 -73 27 55 5 -5 -35 -51 -1 74 46
6052 46 -34 -46 -11 17 48 55 -19 -65 -23 32 47 34 -31 -68 -23 38 41 2 -23 -52 -21 45 56 -24 -50 -20 -11 12 61 16 -76 -59
6084 -59 49 44 -5 18 -16 -79 -20 92 38 -59 -21 12 -18 17 90 -5 -95 -21 49 12 -12 13 -33 -58 3 55 12 -53 -37 -15
6114 -15 -8 22 16 -20 -59 -29 42 48 0 -38 -28 -8 12 44 35 -34 -68 12 65 29 -11 14 -28 -54 47 89 -19 -73 -6 5 -8
6145 -8 33 42 -62 -95 22 60 -15 -29 -11 -45 -33 57 54 -59 -62 5 31 8 19 -6 -63 -25 33 58 6 -32 -46 -15 32 34 22
6176 22 -17 -58 -26 50 48 -15 -35 -11 -21 -6 49 27 -72 -52 42 27 -37 12 3 -72 -25 81 39 -68 -14 30 -27 -6 76 15
6206 15 -92 -18 69 36 -10 29 -6 -69 2 87 30 -38 -25 -2 0 26 52 -15 -65 -36 23 35 4 -23 -48 -14 -1 24 32 -40 -77
6237 -77 -6 53 15 -27 -8 -15 -43 26 99 -14 -73 -4 36 2 25 45 -53 -88 31 88 -2 -34 3 -23 -23 56 67 -45 -66 13
6267A3Rk0K1k2n9K0P1J3m9l5J0K3J8K6l1k9l0L6O3Np2lJ5J4pM7j4r3JR5Pn8L7
6300B2qq3K6J17k1j07K6N4n8PR0m2j05K8R7k5l6N1n0n1N7Q2l7p5J3K4kM2Mm7l1
6331c8K1M9K4k7n3qK1M1Qj5m1n0N5O7po6Lll0N8O5o9q1M2O3k5j5L6m8m0O2O4n1
6364A2o3N1Kj4M6K3p6l5N1L3j3jrm1%N0L6l6j8k5J2L1J2j6l0j9J1L2K6j9m7QL0
6397Dj5L4Nn5k6M9M0k3j1J6m9LO3K0p2k5L3J8MM1l4p6QP3J3j3mm9k7N6O7n5k1
6430hj4j0J7N7j2o0j4N0ROJ1l5n3L7P3k2l1Lj0j4N3L4n5o5K7L8jJ4rn6kM6K5j4
6464A5j7j4j6L1K1qj7k1j0K9M1nn7ML2j8J0L2l0m9K6O3l5k2L2j8m1N0O5n3n7K6
6496a1L1k9K5L6o4m1M1N4j2l5Rk5k3N1L3k7m9%K2L5j0j2j2j6ON2J2n7l7M5K8r
$$ plain form
6267 13 22 2 23 1 -58 -38 33 46 -3 -38 -28 -5 13 39 8 -21 -51 -15 48 53 -19 -22 -7 7 0 47 33 -60 -59 36 43 -15 22
6300 22 14 -69 -43 74 53 -54 -28 26 -32 -25 65 23 -82 -54 43 18 -18 33 -17 -68 -11 71 34 -41 -28 -4 -6 36 40 -7 -38
6331 -38 -17 32 56 29 -24 -32 -11 30 38 23 -18 -68 -13 54 47 -19 -16 -19 -49 9 74 5 -76 -34 29 4 -11 25 -23 -63 -1 63 12
6364 12 -51 0 2 -12 34 57 -19 -54 -3 30 17 16 7 -34 -34 16 52 16 -2 -27 -15 16 28 12 -18 -37 -26 6 32 13 -34 -26 4
6397 4 -11 23 28 -27 -53 -4 36 13 2 18 -31 -28 35 55 -17 -42 -9 9 13 54 20 -56 -48 25 38 25 21 -28 -55 1 68 13 -8
6430 -8 -22 -32 -15 42 30 -30 -44 6 15 21 32 -3 -56 -19 54 32 1 4 -6 -20 33 67 12 -53 -26 12 11 25 16 -40 -42 4 29 15
6464 15 -2 -16 -32 -1 20 12 -5 -26 -36 -7 34 29 -28 -24 8 -10 0 32 2 -47 -21 42 7 -15 17 -1 -42 8 73 20 -37 -11
6496 -11 20 -9 16 52 -12 -53 -12 42 30 -5 4 -21 -44 7 40 13 -36 -36 -14 21 11 -1 -13 -29 -23 29 41 -16 -53 -8 20 11
6528A1JJ0n2k4P7N0o5m4M7j6j5N9L0r9l5P6J9k7kK1o0j7Q8J4o7l2M4jmK8ll8r
6561c5L2K6j2k0j0OPJ7R%m5lM6K3l6j3Qk9kO7K0q1%L7nl0M2J9r4PP9No4J1L8n1
6597c1JP1np1kN7oj6L2j7m5QN9%j6l6ONK4J3j3k7l3L6M4Jn6KKRKK9j0p5J6O1N
6634B4m2RPl2J4N0Jo4KL5j6RK6k3m1K2M9qj7mrKJ5J5nm1nKL4Qj2k8OJ2j2L8rn6
6672d4PM0Nj8K0Nn1J4M5km4LL4l0J9K7j5n5K1M3oj8J2j6k5K0M2j0k6k8RJ3L4p
6706A8k7j7JJ4M0j1m7j3L3K8j8Rj2m3J4O4lm8JJ9k1J0M2j2o7QO0jk9K2pn6L2N7
6740D0qn7mK3PkJ9kn1KL5J5k1k6PJ3j1J4K7k4l4K9M0j8l5L5om4L6M0k1n9K0M4
6774B3k9NL5k4p0M8N8l8l5L0Jl4K9L9l7n2K5L4j5NOk4k7K9M1J1m5j1J2J2PkOl1
$$ plain form
6528 11 12 22 -30 -54 23 73 8 -36 11 -5 -20 39 69 -30 -65 11 30 3 1 22 -38 -55 33 47 -20 -52 -8 -9 -13 15 12 -26 -35
6561 -35 -3 23 11 -9 -19 -13 -6 11 20 20 -25 -28 18 41 5 -8 0 -29 -31 36 56 -25 -25 12 7 -23 19 38 -56 -49 30 35 -29 -18 20 -31
6597 -31 -30 41 36 -35 -37 20 14 -2 30 13 -32 -24 35 35 19 -17 -11 -6 18 31 18 -9 -42 -6 38 39 -17 -15 -13 -4 -2 27 17 -58 -42 19 24
6634 24 -18 -9 -2 -34 -20 30 31 -33 -31 4 -12 -3 23 0 -41 -19 30 22 5 1 -8 -6 9 24 19 -22 -27 -25 9 17 5 -23 -17 -5 -17 21 12 -44
6672 -44 -37 3 8 -10 10 15 -36 -22 23 21 -23 -20 14 -16 3 30 15 -40 -19 24 18 0 12 -4 -29 -9 33 23 -3 -31 -22 -9 25 18
6706 18 -9 -26 -25 -11 29 18 -29 -42 -9 19 1 10 -2 -45 -31 33 30 -18 -17 2 -19 -9 33 21 -46 -38 22 21 -8 14 7 -49 -17 40
6740 40 32 -25 -29 -6 1 -1 18 16 -35 -33 2 17 -4 -30 -23 -10 -21 -7 20 -4 -38 -9 31 13 -22 13 7 -37 -1 39 18 -41 -21 23
6774 23 -6 -1 34 10 -60 -12 46 8 -27 3 4 -30 -1 38 1 -51 -26 8 -7 -2 4 -20 -47 -18 23 34 -11 -22 -10 2 9 7 13 -18
6808a8k2N1M4n2l3L6pj6L7J9n8l0M8M3m7j3L3k6l6M5N4o6l5N0Pl3K2L3n4l7O4
6839CK4l7JJ5k5pM1J5l4k0J2J7Omlj5oJ1K7mk1k9L9%k0J6Qm3lM4K6m0j8K7k2p
6875b6M7J3o0oL5Rl1K8J6n1PM9j0k9PPj1OK4ql7jL0J1j6Nk7oK1J9nj5k9OL6Oj0
6912Dk1JoJ0L9j4l0j0L2pNJ8k8l1K5M4j7k4Pkj8K7L1m1k3K8jRJ0lm7QL6qj1JM
6949cl1J9M0j5l1OKj0K5K4l9k0K0J7qJ4Kl3qM3Rk0j1Oj1QK6lk7pJ2KJ3lk6j0K7
6986ajKOj3l0J9K3Ol1J3j3j9M6K2m9k3L7Qj2J3J4m0rN0K2m1j2K3j1rL6j6k3j0
7020b3L2Oojj3k0JL2Pj2k7KJ2J2l%Jk2jL3Ml6mL2j2rM2Jn4KN2rl6J8J6l6kN2q
7059B3m2PK0l0J3K9j4n1K3L1lj6J3j8j0J2K6j1k3NOKJ9oj3j4JK7J9Ln0lK9j1J5
$$ plain form
6808 -18 -40 11 55 3 -30 6 -1 -17 20 39 -19 -49 -1 42 -5 -18 15 -11 -47 -2 52 -14 -49 1 8 -25 -3 30 -24 -61 3
6839 3 27 -10 -9 6 -19 -26 15 30 -4 -24 -12 5 11 7 4 -11 -17 -6 21 17 -4 -33 6 6 -14 2 10 -33 -36 8 34 -6 -24 3 -19 -26
6875 -26 21 34 -26 -32 3 12 -19 9 25 -26 -19 30 20 -9 -2 5 -6 0 24 16 -21 -22 8 19 3 8 -19 -25 -4 15 10 -5 -34 -28 8 14 4
6912 4 -17 -16 -22 -12 27 13 -17 -27 5 -2 3 21 -7 -38 -13 31 14 -10 -3 -5 -23 4 35 -6 -29 -1 -2 7 17 14 -33 -25 11 3 -8 -7 -3
6949 -3 -34 -15 25 10 -21 -15 -13 -23 2 26 -13 -33 -13 4 -4 10 12 -21 -29 14 23 3 -8 -2 -13 -5 21 18 -9 -16 -4 -2 11 8 -18 -28 -1
6986 -1 -2 0 6 -7 -37 -18 5 11 -20 -7 -20 -39 7 29 -20 -43 -6 2 -10 3 17 -23 -32 18 40 -1 -13 10 -1 -10 26 10 -13 -23
7020 -23 9 15 9 8 -5 -25 -24 8 15 3 -24 -22 -10 2 -1 -1 0 -22 -23 10 14 -22 -26 6 -6 -15 27 28 -26 -24 28 19 -17 1 17 -19 -21 31 23
7059 23 -19 -12 8 -22 -9 20 6 -45 -22 9 6 -10 3 -15 -25 -13 13 2 -21 -16 -10 -8 11 5 -8 -22 -21 6 25 28 -22 -25 4 -7 8
7094HJ8k8l5K8M0k4k7K5Pm4L7K7m5m0L7K9l9RL9m5k3M8L1n0j3K5%k2L8J9l3l3
7126c6L7QlqNj3nK1J3j7j9LJ3Np%Ll0J9K2Ml1mJ8qj5L7lm2KN3qk2PPl7nO2jn2
7166b7NL9k5oN8k8m3JM5nj8Mj0oJ1K4j3k6%J4J1Orpk4J2J4J0j1k8J2J5nQNj7m4
7203e8M4L8k4l1K6Ok4J9L5k5m9L4K6j9KK9l7l0N1K7m3j4K9k1k2K5L5l9k2K2J7
7234Gj8OLpk0M1Oj8j7J4nNJjjk1J4J7Rk4pJ8pj2K0J0l8jK7J2k3J2Jl6KM5Pm3o
7273b8L4j4oL7j9l0jL7jj9JQj7J2L0qk4j0J7J4qJ3l0nnK0K9j7l2Q%K0qk%k1J1
7310a4J8Ml1ROj2J2J6j3l1K4K0j3Njnk2K7K9k8j7K6k2RJ4J4k0l5K8KjOpj8jK4
7346BJ1rj0qlJ0J8qj7RQl%Nk4%J3lJ8jk1njL3jk1MmoK3Nk1rNnJ1K0qk5lQJ2kl
$$ plain form
7094 8 26 -2 -37 -9 31 7 -20 5 12 -32 5 32 -13 -53 -16 13 -26 -17 22 -23 -46 2 33 -17 -30 -5 -5 -27 11 30 -3 -36
7126 -36 1 9 6 -2 3 -10 -15 6 19 2 -17 -14 -1 4 -3 -3 0 -30 -11 11 15 -16 -20 -2 -10 -25 12 9 -33 -31 22 14 -8 -1 6 -31 -36 26 25 -27
7166 -27 -22 17 -8 -14 44 16 -27 -26 19 14 -4 0 -10 -16 -5 19 6 -20 -20 -6 5 11 2 -5 -29 -17 -3 7 -4 -32 -20 -5 -10 -2 3 -14 -58
7203 -58 -14 24 0 -31 -5 1 -23 -4 31 6 -43 -9 17 -2 0 29 -8 -38 13 40 -3 -17 12 -9 -31 -6 29 -10 -32 -10 7
7234 7 -11 -5 -2 -9 -29 12 18 0 -17 -3 -8 -3 -2 -3 -4 -25 -11 6 15 -9 -16 2 -5 -17 3 13 -25 -26 1 13 -10 2 3 -33 -31 14 21 -22 -28
7273 -28 6 -8 -14 23 4 -26 -27 10 9 -10 -9 -1 -18 -6 24 16 -8 -18 -1 13 5 18 -12 -17 -22 -2 27 10 -22 -14 -14 6 -2 -4 -4 -25 -14
7310 -14 4 8 -23 -14 -8 -20 -8 8 -5 -36 -12 8 -5 0 -1 -6 -28 -1 28 0 -17 9 -13 -4 10 24 4 -31 -3 -1 -2 4 -3 -21 -22 2
7346 2 13 4 -6 -14 -17 -7 11 3 -14 -5 3 0 0 5 -19 -19 -6 -9 9 8 -13 -18 -19 14 13 -8 -4 -8 -14 9 14 -7 -16 -11 -16 -5 15 7 -18 -21 -13 -1 -3 -6
7390fj4j3K5J5k7oK2Lj8J8Rk0j4K6Mj7OKj7j4M8Lk2j7J8MJJ5j2j4jMJ8j0nk%K
7428fKJ3%k5jJ9Nk0ROj9rL5Lm3KM2j2j9K1Ml7NM0%l4MK3k4j6N4Km6%K3j3jK1j1
7467cj7rK8Qk1nJ0j8PJ0Mj4j0J1K3oj4MJ2j2RJ7j5k6NL5mk0J0Nk7K0L2k9l9K9
7503a0J6l0KL6j5l6K4L0k1j7RNk2J9K7l6qJ4QnkLMj2LK0Pj7j6J4OnOOj8k4L0J8
7541A3j8j7J3j0qJ5J9j8j7K1J1k2NK0k9j7M0J2j9j0J4Jj0J8J3l2j1K4KLj0lqR
7575fJ0J1qjj3RJ0pj6RopOK0k5k4L0J5k2MJ9l6kK0J2j5jK1j5rL1Jk7oK2%Lkjj5
7615a1jK0oroPlPMj0Pmj3J6J4j8j8J9jj0jK9k4k2K8J3k7QK8k0j1J5K0l5mK0Pj2
7653dKJk0KJ8J1rjqkJ0Mpkj8oK1Kj0KPMj1J4Ol7mK8Rk9NJ6rj5K8J9m0mL3Ql1J3
$$ plain form
7390 -6 -20 -33 -8 7 -20 -26 -4 -1 -19 -1 8 -12 -26 0 4 -13 -7 -5 -22 -36 12 15 -7 -24 -6 -2 -1 14 2 -12 -13 -9 9 -1 -6 -8 -8 -6
7428 -6 -4 9 9 -16 -17 2 7 -13 -4 2 -17 -26 9 12 -31 -29 13 1 -18 3 7 -30 -25 15 15 -19 -15 8 -16 -32 22 24 -22 -22 1 -12 -13 8 -3
7467 -3 -20 -29 -1 7 -14 -19 -9 -27 -20 -10 -6 -20 -30 -19 4 -2 -16 -12 0 -12 -3 14 -1 -27 -22 13 9 -11 -1 4 -23 -3 29 0 -39 -10
7503 -10 6 -24 -22 14 -1 -37 -13 17 -4 -21 -12 -7 -29 -10 17 -19 -27 -13 -5 -10 -12 -9 -5 -17 -14 6 13 -4 -20 -6 0 -5 1 7 -11 -35 -5 13
7541 13 -5 -22 -9 -19 -27 -12 7 -11 -28 -7 4 -18 -13 7 -22 -39 1 13 -6 -16 -2 -1 -11 7 20 -12 -23 1 3 6 -4 -7 -15 -6
7575 -6 4 15 7 6 -7 2 12 5 -11 -2 -8 -15 -9 11 -14 -38 -8 7 -15 -11 8 -28 -30 -10 2 -13 -14 7 -8 -17 14 15 -12 -18 4 4 7 5 4 -11
7615 -11 -12 8 2 -7 -13 -6 -9 -2 2 -8 -1 -5 -18 -2 12 -6 -24 -5 -6 -16 -17 12 -12 -34 -6 7 -20 -12 16 -4 -15 0 20 -15 -19 1 8 -4
7653 -4 -2 -1 -21 -19 -1 10 1 0 -8 -10 0 4 -3 -5 -23 -29 -8 -6 -16 -14 -7 -3 -14 0 6 -31 -35 -7 2 -27 -22 -6 -15 -30 -2 17 -23 -27 6 14 -17 -4
7695dJ4l3PK6Jk9J0Lj5OJ2nk0OLJ0Rj7OJ0j9kOQk5NK5j4mJ5J5l4lM1nl8J2K1j7
7734a3kM4j0l8LK4kj8K4pl6MM0j2k7QQk1J7K4j4j9QK3j9koLJ3nRkjj8K2kNk0J0
7773elj0jK2qj1NK5oj3J7j9k0J3K6j7j4J3Ok9J6J7k6mJ6J1j6J9pnj5K0Mj2KNn
7810iQKpj3jQJ3Pqk9J5J4rkRok0J8K5k1j1J5pj7K2J5l6J0RpNJJ6k9MK5j0j4PL
7850ej1NJ9j5mnRMlJ3k2pJ9mpJ0j1j3PJ6qj3PLkRJ3k3qJ0RqMJ3k2RQJlkPj4J8
7893CMj7lKQrKRj4LJ2Lj1JJrmJ5nqJ1J0j6OK5k4j3J2opJ2P%j9J8J1j9jjpQJ6j0
7936dpkJ3j%PpqpNONj6j4RJ0o%NKj3J2K2k4j5K5Ok8J2K1l2OK1mj6J4J0j8mJ6R
7977A0k8RJmlK4pk3JJ9Lj6mJnJ0%kJ6k2MNKmQ%j8JK4Mk8KK4j2j7K3kj3NJ5Kk6
$$ plain form
7695 -4 10 -23 -16 10 11 -18 -8 -5 -20 -14 -2 -7 -27 -21 -18 -8 1 -16 -10 0 -19 -21 -15 -7 -32 -27 -2 -16 -20 -5 10 -24 -27 14 9 -29 -17 4 -13
7734 -13 -15 29 19 -19 -16 8 6 -12 12 5 -31 -27 13 1 -26 -18 -10 -31 -14 10 -4 -23 -15 8 -11 -13 -19 -16 -3 -8 1 -1 -2 -20 2 0 5 -15 -5
7773 -5 -8 -18 -19 3 -5 -16 -11 14 8 -5 12 -7 -27 -14 12 -5 -19 -6 0 -29 -13 4 -22 -26 -10 1 -15 4 -3 -8 -23 -3 1 -11 -9 -4 -9
7810 -9 -1 1 -6 -19 -20 -12 1 8 0 -29 -14 0 -9 -11 -2 -8 -28 -10 15 -6 -17 -2 -9 -26 -4 11 -25 -15 -6 -13 -8 -7 9 -20 -16 9 -1 -15 -8 -5
7850 -5 -16 -11 8 -7 -11 -16 -7 -3 -6 7 -15 -22 -3 -7 -14 -4 -15 -28 -21 -5 -13 -26 -19 -16 -18 -9 4 -19 -27 -17 -8 -16 -12 1 -21 -12 -4 -3 -6 -8 -1 -15 3
7893 3 7 -10 -13 -11 -3 -12 -10 -1 -15 -12 0 3 -8 -7 -6 -15 -19 -4 -9 -17 -6 4 -12 -6 19 -5 -18 -6 -12 -19 -7 0 0 -19 -1 10 -9 -10 -11 -18 -10 6 -4
7936 -4 -11 -13 0 -1 -1 6 -1 -9 -16 -11 -5 0 -16 -30 -21 -11 -17 -17 -12 -10 -23 -11 11 -13 -28 -3 3 -25 -13 8 -24 -18 3 -1 -17 -3 7 -11 -15 1 10
7977 10 -18 -9 -8 -12 -15 9 2 -21 -20 -1 2 -14 -18 -17 -22 -12 -12 -14 2 -20 -16 -11 -9 -13 -5 -5 -23 -22 2 6 -22 -20 4 -8 -25 -2 -4 -17 -12 3 5 -21
8019b1J2Nj4OJ9j5j0MJ0mqJ3mk1J6J4qpKJqJ4jkj3mJ2J2mjlMLPjrj3J8J1j5j4
8060a7J1Ok0K6Lk5nJ7nnOJ3j9j8K5Qk0%K9k4j1K1J4l3lK9j1qLQlj2J8Rj7nOoJ
8099a4K0nllnQqMj3MLmOOj9kK2kj3LJ6k3oL2kk0QQqmJ6qj8KL5j2k3K1j3QJJ0p
8142bk5J8lnJ0Nj1mNPolmPrOJLpLjKRj1OLj1J0K6k4j9K1J8j9MOpk3K5Oj4j0J1
8185fqjJ2J7m1J1
$$ plain form
8019 -21 -9 -4 -18 -12 7 -8 -18 -14 -4 -8 -16 -3 -7 -28 -12 2 -6 -13 -11 -10 -18 -4 -5 -7 -20 -24 -12 0 -4 -5 -8 -4 -1 6 5 -4 -17 1 12 -3 -17
8060 -17 -6 0 -20 6 9 -16 -21 -4 -9 -14 -8 5 -14 -32 -7 1 -19 -19 10 -14 -25 -4 10 -23 -26 3 -8 -16 -13 -5 -8 -20 -2 7 -10 -15 -9 -15 -14
8099 -14 6 1 -2 -5 -10 -2 -10 -6 -19 -15 -12 -16 -10 -4 -23 -25 -3 -5 -18 -15 1 -22 -28 4 2 -18 -10 -2 -10 -14 2 -6 -24 -22 13 1 -22 -1 -14 -6 -5 5 -2
8142 -2 -27 -9 -12 -17 -7 -2 -13 -17 -12 -5 -11 -14 -18 -11 -20 -14 -13 -10 -17 -14 -15 -13 -4 -15 -9 -6 -17 -7 19 -5 -24 -3 15 -4 0 6 -1 -24 1 7 -7 -17 -6
8185 -6 -14 -15 -3 14 -27 -16
8191a6
$$ Imaginary data points
##PAGE= N=2
##DATA TABLE= (X++(I..I)), XYDATA
0@%%%%%%%%%%%%%%%%%oJ4j6J6j6J6k2L0l2L2m0M8n6O4p2Q0q8J04j20J36j52J68
39H8j84K05k29K54k80L07l41L78m15M57n04N57o13O75p46Q23r11J011j127J263
59F68j422J611j843K138k524L048l812N033p284J2790n0898p4627J04237P8395
73F5510O1l9317n6691o1524M3621J19471L0194r8569p5379J2559N0800N3096L1761
86G5593m9935r4582j5374Q7807P1778j7081o6076m9085j488N4003O8198N949p6604
99f897p1218K0738Q1030M3033k4813n3694m4848o42O6345O9017k4684q8489l3729
112f8851M1504M8513K7676k205n7925o2979K8149Q7075K5061m8250m5213j8237
124d5682R367N4773N1090l3952q0820j8194N1917M8001J0950k4431n3208l2645
$$ plain form
0 0 0 0 0 0 0 0 0 0 0 0 0 0 0 0 0 0 0 -6 8 -8 8 -8 8 -14 16 -16 16 -24 24 -32 32 -40 40 -48 56 -64 72 -80 88
39 88 -96 109 -120 134 -146 161 -180 198 -217 240 -264 293 -320 355 -391 432 -479 532 -595 668
59 668 -754 857 -986 1152 -1372 1676 -2136 2897 -4387 8403 -42495 -117122 -12885 65510
73 65510 65571 26254 -30437 -91961 -48340 71131 101325 2756 -72623 -60064 -9264 43832 75593
86 75593 25658 -68924 -84298 3509 75287 58206 -7870 -56955 -58443 -4440 63758 69707 -6897
99 -6897 -78115 -57377 23653 66686 41873 -11821 -56669 -57311 9034 78051 53367 -35122 -68851
112 -68851 -27347 21166 48842 46637 -11288 -74267 -46118 40957 66018 17768 -27445 -45682
124 -45682 -36315 18458 69548 35596 -45224 -63418 -11501 36500 47450 23019 -30189 -62834
136f2834M0013P1044J2591n4855n2759j930M0964M7831J3137m1413n9801r818
148e7830N6384N6224p689n3093l8942K415L9029N0113P141n8607n5491J9300N9976
161A8930K7671j4931l7102m1060O24O1023M6856l1789n9883j5869K3984L6831
173A5285L1466j2774o0032l1876L9709N3043P917k8149l8114k2642K4528N4606
185C2967J7185m0080m4671o214K9915M1212J4200l4234m6481n169L6824L7870
197C3324N794l3062m2465l378M0898L5752m490l2847l2381l109L6994L9182p752
210C2460m2431k5685R839L0714K9405k203m0725l2903J5723M0560K0553j1790
222B3517l3181k8391J0505M3716K5047k0634l8180j9124J4643L8874K4775k1463
$$ plain form
136 -62834 -22821 48223 60814 5959 -46800 -48730 -7766 40065 53202 11789 -48012 -57830
148 -57830 -1446 54778 47089 -6004 -44946 -42531 -3502 46611 53752 -4855 -60346 -41046 18930
161 18930 46601 31670 -5432 -46492 -45868 15155 62011 30222 -29661 -45530 -21546 15285
173 15285 46751 33977 -26055 -57931 -18222 34821 42738 14589 -23525 -46167 -21639 32967
185 32967 50152 10072 -34599 -40813 -10898 30314 44514 10280 -36201 -41370 -4546 33324
197 33324 39118 6056 -36409 -39787 1111 36863 32373 -474 -32855 -35964 1030 40212 32460
210 32460 -9971 -35656 -25817 4897 34302 32099 -8626 -41529 -25806 14754 35307 23517
222 23517 -9664 -38055 -27550 16166 41213 20579 -17601 -36725 -22082 16792 41567 20104
234B0104m3479j5066K3710L5014J6986j9338m2262j6801L0689L8774N180k5020
246H491l1425j3054K4511M1791P505l6147l3240K139K7335K9202O225l0260l7694
259c4621J615L8678K8943q270l2049k6117M180L3662K9189q459l7404k5368J3354
272b2667L6285K0059j4668l1576j8795J0691L3376K3033j7278l8530j2270K2190
284a0150K5890J0453r793l0196k1648K1427L9457M508k7138k0667m797J0144K9019
297A6509J8184k6319l7895K555K9698J7229O84j2822k7550j2098K8816L3321o162
310B4150k9305j6809J950J7226K5042N058k8070k8017N951K8772J9318n553k3624
323c911k0586L200K5699K2585n374k9881k1359J2465K9769J2805j1867k1848j6764
$$ plain form
234 20104 -23375 -38441 -14731 20283 37269 17931 -24331 -41132 -10443 28331 33511 8491
246 8491 -22934 -35988 -11477 30314 37819 1672 -31568 -29429 -2094 27108 33333 3073 -34621
259 -34621 -33006 5672 34615 26345 -5704 -31821 -27641 6021 35210 26751 -10653 -36021 -22667
272 -22667 13618 33677 19009 -12567 -31362 -20671 12705 35738 18460 -20070 -32340 -10150
284 -10150 15740 26193 16400 -13796 -35444 -14017 25440 29948 2810 -17857 -22654 -12510 16509
297 16509 34693 8374 -29521 -26966 2732 19961 20645 7823 -19727 -31825 -3009 30312 24150
310 24150 -5155 -21964 -20014 -2788 22254 27312 -758 -28775 -22824 5948 25266 19713 -3911
323 -3911 -24497 -21297 4402 26987 21613 -8268 -29627 -17162 12607 25412 13545 -8303 -25067
336b5067N815L1351K0671k0415l2824l921J8192J7531J1767o980l1847j7891K6159
349g459L2775k490k1658j5258p745R881L0815J2958k8896l0336O251K4007J4666
362A7511K214j4389k6250n687K8241K5424q469k5390j3613M740J7767J8545j029
375A9615k4456k0384Q982K6398J2496j1359j9497j0981N151K0330J7649q844k8095
388a2995j1538J6815K0204N433p477j7925j6064R947K9249R240k0488j9435j667
401a6701R250J6833J3133j2318k7639n460K1312J7643j71j1222j6682q793J4933
414e882K4185K145k0616j7214R24J5215J7375K712j8018k0104P93K0503J8032
427B0050k950k0824j6516M872J9667J4957l150k0172j8231O356K5104J2797j1596
$$ plain form
336 -25067 -19252 12099 32770 12355 -20469 -24390 -6198 11333 23100 16120 -15727 -33618 -7459
349 -7459 25316 22826 1168 -14090 -21835 -11954 18861 31819 2923 -27413 -21162 2845 17511
362 17511 19725 5336 -20914 -26601 1640 27064 18595 -6795 -20408 -15668 2099 20644 19615
375 19615 -4841 -25225 -16243 10155 22651 11292 -8205 -19186 -14035 6295 23944 15100 -12995
388 -12995 -24533 -7718 12486 17919 10442 -7483 -23547 -13600 15649 24889 4401 -15034 -16701
401 -16701 -7451 9382 22515 10197 -17442 -22902 -1590 16053 15882 4660 -12022 -20815 -5882
414 -5882 18303 20448 -168 -17382 -16458 -1243 16132 18844 826 -19278 -18485 2018 20050
427 20050 17100 -3724 -20240 -15368 4299 19256 16106 -4066 -22297 -15941 9163 21960 10364
440A0364j8394r678M363J9593J7065j0493k6627p294J5756J5640N920n714j9772
453i271j4023J5123K5596J651j7869j3612l158Q828J9975Q522j9091k2009K994
466a6344J8176J2297P21j2297j8508k445J9970J7085m906j6750j1993R93J5011
479A010J5909k269j8437j3069M570J5793J2644l252j7467j2545O100J6492J0303
492A5782m635j6435j2302P113J8804Q359q902j4975q499O147J7801J0037j1012
505G283j8224m868J0089J4536P502q731j8712o824J3440J6745L166j0838j5530
518a0966o079J2372J8502K812j4892j5137j692J2739J6341K291j6144j5886J884
531a3855J5162J3008l57j5009j5400K876J7999J1564n235j4389j1412K625J7204
$$ plain form
440 10364 -8030 -17708 -13345 6248 23313 12820 -13807 -21101 -5345 10295 16215 10501 -9271
453 -9271 -23294 -8171 17425 19076 1207 -12405 -15563 -6735 13240 21762 2671 -19338 -16344
466 -16344 1832 14129 14850 2553 -15955 -18400 1570 18655 13749 -3001 -14994 -14001 1010
479 1010 16919 14650 -3787 -16856 -12286 3507 16151 12899 -4568 -17113 -11013 5479 15782
492 15782 11147 -5288 -17590 -10477 8327 16686 7784 -7191 -15690 -9543 8258 18295 7283
505 7283 -10941 -15809 -5720 8816 16318 7587 -11125 -17949 -4509 12236 15402 4564 -10966
518 -10966 -17045 -4673 13829 16641 1749 -13388 -15080 -2341 14000 16291 147 -15739 -13855
531 -13855 1307 14315 13958 -1051 -16451 -13575 4424 15988 10753 -3636 -15048 -12423 4781
544D781J2950p608j7693p683O699J4063J0488n710j8671r117J0996J5855N008
557A4358p561j4628q591R705J8051M102j2307j3092l400Q594J5104N134j3097
570B372j4944L33J1276J0700L011r867j5362j265J4995J1174k677r503j0152l133
584a3042J2244J5452k814j5986p965L780Q830J0639J723j5047j3848O684J5626
597F276N465m461r274j0452J214J6381J0663q921j4318m261N327J0739Q905m855
611H428j5908p245R648J3527M026p515j2626n711Q528J4100M197r833j3594l415
625a3393J1048J3544R46j1238j1071j581R783J3508J663j4193j2349L732J1871
638B270P743o0r596j2944O56J5962R875o868j1272n619J344J0185J1596l501j6129
$$ plain form
544 4781 17731 10123 -7570 -15253 -8554 5509 15997 10287 -8384 -17501 -6505 9350 14358
557 14358 6797 -7831 -16422 -6717 11334 15436 3129 -9963 -13363 -4769 10335 15469 2372
570 2372 -12572 -12239 -963 9737 12748 2881 -12481 -13746 1249 12423 9746 243 -9909 -13042
584 -13042 -798 14654 11840 -4146 -12111 -8331 499 11138 12861 -2186 -16034 -9350 6276
597 6276 11741 7280 -1994 -12446 -11232 5149 15812 6891 -7427 -11688 -6361 4378 13283 8428
611 8428 -7480 -14725 -5077 8450 12476 4961 -7665 -13376 -4848 9252 13449 3616 -9978 -13393
625 -13393 -2345 11199 12145 907 -10164 -11745 -1962 11546 13209 -984 -13333 -9601 2270
638 2270 10013 9953 357 -12587 -11931 4031 13906 7038 -4234 -9853 -8509 1676 13272 9771 -6358
653f358p181Q413J0921M397l493j0882q675N890J4505N054q680j1142l360O440
667d151J0610M640o734j1658m372Q208J2180K213r560r365q67O123R312M958q277
682C260j3932m48J2648P584k230n337q067n237R692J4907k516j4766n252M518
696e176M938P385M123j1372j3911N440J5053L279n629n448o886j582J2387J1278
710A3879p191j4071k747O422P498N750k497j2167p468P693J2682L098p805j0129
724g053l066P008J0157L218o976j1083l562R562J1788n80j0132o938n6N593R867
739G747L562j1149j1954L898J1345M136j656m817r162k551J2322J0721o192j1303
753e053k561K828N379Q005R6j2329q161P168J0495K048m115o636n829K705J0745
$$ plain form
653 -6358 -13539 -5126 5795 10192 6699 -4183 -12858 -6968 7537 12591 3911 -7231 -10591 -4151
667 -4151 6459 11099 4365 -7293 -11665 -3457 8723 10936 1376 -7989 -8856 -2733 6579 11537 3260
682 3260 -10672 -11120 1528 9112 6882 1545 -6522 -11759 -2067 12840 10324 -4442 -9694 -5176
696 -5176 -238 7147 11270 -102 -14013 -8573 6480 9759 4130 -1318 -8204 -9786 2601 13879
710 13879 6688 -7383 -10130 -3708 3790 9540 7043 -5124 -12592 -4899 7783 10881 3076 -7053
724 -7053 -10119 -3111 7046 10264 3288 -7795 -11357 -1795 9993 9413 -719 -7657 -7713 -2120 7747
739 7747 11309 160 -11794 -7896 3449 7585 5929 1112 -8050 -10601 1721 12442 6250 -5053
753 -5053 -7614 -4786 593 8598 8694 -3635 -11796 -4628 5867 7915 3800 -2836 -8665 -5960 4785
768D785N505o537r783k581N716Q042L083m848q440l923N399J0025L104p895q836
783g184k29O074O506L120n140j0661k333J0114Q296k351o460n273k295O022J0557
798H763R4j1180o527L822O368M950J013p664r242K612J0829M626m015o614n494
813g659J143R606O732n184r353l159L682P528N677m155j0567l257O772P167K168
828G141l457q359m731O899R808j3o893n289j687L868Q691K753q429p995J830O408
844E45M719J138n256q255k67Q737O072k237o200n295P8P267O696k333p675m395
860f661J647O379O168j998q784m193M142N733L324o43o953o656M071R445J742
875F763n030m248k930N81P839O053o058r344L7N772L996K160j940p994m348P050
$$ plain form
768 4785 10290 3753 -6030 -8611 -2895 5147 8230 3382 -5058 -8981 -3582 6443 9547 1652 -7184
783 -7184 -7413 -1339 5167 8287 3147 -7514 -9847 267 8563 6212 -248 -5521 -7816 -1794 8763
798 8763 8857 -2323 -8850 -5028 1340 6290 7303 -361 -9603 -6991 3838 8464 4449 -2165 -7659
813 -7659 -6516 3090 9822 4638 -4715 -7874 -4192 3336 9013 4858 -5709 -8966 -2194 4973 7141
828 7141 3684 -4675 -9406 -2507 7301 7288 395 -4894 -6581 -2713 5978 8731 302 -7693 -5863 545
844 545 5264 6402 1146 -7109 -7376 1361 7433 5196 -1004 -6299 -6221 1046 7742 5409 -2266 -6661
860 -6661 -5014 1365 7533 5535 -3249 -7442 -3300 2433 5757 5114 -1839 -8495 -4424 5021 6763
875 6763 1733 -2515 -5445 -4864 2975 9028 2970 -6374 -6337 -565 3431 5591 3651 -4343 -8691 -1641
891a641Q761p72o652m586o02L820O765K375o517q044L96P748N516j676n464m491
907e064p08N088P539K19r118o095M467O616J696o45l665p126j19J0531N553p226
923A943o817Q09J618K835O400p63j0965m253Q702O350k063k388k779n129J874
938d626J0091K996q426o182J971L701L296K845k868p862k206P041O579j414n790
953h54l646L82L460M808J781n319p336J100Q302L383l892l396j855j892M032Q350
969G408j342j0491k723O592L046j6K000l669q875K069J1769J911q106l011R83
984b455j214L743P884k923j1328j266Q517L507j712o83l449n353L178R504J166
999G116q066m672K295L383K791K089k903p187j615P534O176l074o134j809R77
$$ plain form
891 -1641 7120 6348 -304 -4890 -5492 -1672 5093 7468 951 -7093 -6697 1051 6567 4891 -573 -5064
907 -5064 -5772 -684 6855 7074 -2044 -8139 -3672 2944 4640 3995 330 -6796 -6915 3616 9169 1943
923 1943 -4874 -4065 -2447 388 6788 6025 -4940 -9193 -491 5859 3796 1408 -1371 -6500 -4626
938 -4626 5465 8461 35 -6147 -4176 -475 2821 5666 2798 -5064 -7270 -229 6350 4936 -854
953 -854 -4500 -4118 -658 4150 5931 612 -6724 -5624 2678 6061 2169 -1227 -3082 -4974 -942 7408
969 7408 6066 -4425 -7148 -556 2490 2474 4474 805 -8070 -6001 5768 7679 -427 -3438 -2455
984 -2455 -3669 74 7958 5035 -6293 -7559 958 4465 2753 2070 -1379 -6732 -3554 5950 7116
999 7116 -950 -5622 -3327 56 2847 4936 2033 -5154 -6769 765 6941 3867 -2267 -4076 -3099
1014c099K375N134K016p202p211M107Q056M55l205j656l505k004O895P023m972
1029C207q389O28M287J310K287J213o224n780N045P722p84m727k015j152N23N286
1045B437L827m548o774J85N256L391k76k643l861j857L530N979P39n883m698J801
1061c395M296K252M43k333n511j522O646N342l338n063p82K21J684N384J324p379
1077a731m977M701N147j67q54j945m901M5P644L516n447m713M95J591K861L733
1093D998j926o919j819N259M216j68k473l891k186L509N588M73m434m012l46L609
1109e22M527K99m420l914L33L664L951K51m635m228J456M558K371q08l271l746
1125d134M78N233L192k567m098j648J069L593L349j633n210k091K802L733J780
$$ plain form
1014 -3099 -724 4410 6426 -776 -7987 -3880 4176 4631 1426 -230 -3735 -5739 1156 8179 3207
1029 3207 -5182 -4554 -267 1043 3330 4543 -1681 -7461 -2416 5306 4522 -205 -2220 -3372 -2849 2437
1045 2437 6264 1716 -5058 -4873 383 3774 3498 855 -3006 -4863 -1333 4646 5385 -498 -5196 -3395
1061 -3395 901 3153 3596 1263 -4248 -5770 876 6218 2880 -2183 -2965 -2744 -1060 4324 5648 -1731
1077 -1731 -6708 -2007 3140 2973 2119 174 -4727 -4682 2962 6478 1031 -3682 -3187 -1596 1265 4998
1093 4998 3072 -3847 -5666 -407 3809 3641 1168 -2723 -4909 -1400 4188 4661 227 -3785 -4131 -522
1109 -522 4005 4304 -116 -4030 -3697 -33 3918 4169 -466 -4694 -3238 1320 3691 2883 -388 -4134
1125 -4134 -3656 1577 4769 2202 -1896 -3544 -2475 1118 4467 2834 -2376 -4467 -1665 2068 3848
1140C848j470m407k707K884M731J088k489l577k140K191N085J512l802l760l28
1155c341K133L509K041l029n044k41M218K879k11k249l454j268L777M449p48m331
1171i10k623P51L142L215k05m074l504J108M409K996j576m427k370J825L630K397
1187C784q79m353l476K572N345R04l021k417j482K75M374L627l648n587O67L667
1203C52J250Q65r0m488l160M712N311k025l986o68k92O04M417K070n217m585K553
1220b377M033P53k31j473l790r70M749L825k104m001j398R80K374K603k2l562
1236f11l203J187M256K059k194l139r42R04K265K774o25m814k320L741L592p66
1252B164j567j288k484N11N402K127m939l666J815J967Q92K204p69n469j780N306
$$ plain form
1140 3848 2378 -2029 -4736 -1852 2879 3967 1478 -2099 -4239 -2048 3037 4549 747 -3013 -3341
1155 -3341 -1208 2301 4342 1313 -3731 -3972 246 3125 2914 665 -2789 -4057 -280 4169 3421 -910
1171 -910 -3533 -2782 360 3575 3370 -704 -4208 -3100 1309 4305 2729 -1698 -4068 -2243 1387 3784
1187 3784 2905 -1448 -4924 -2352 2993 3897 876 -1541 -3023 -2748 1626 5253 1605 -3982 -3315 352
1203 352 1602 2467 2377 -2111 -5271 -559 4752 2727 -1259 -1927 -2219 -1615 2802 4872 -345 -4930 -2377
1220 -2377 1656 2409 2178 705 -3085 -4055 694 4519 2415 -1586 -2984 -2004 370 2973 2951 -611
1236 -611 -3814 -2627 1629 3688 1494 -1645 -2587 -1683 582 3356 2731 -2083 -4403 -662 2930 2164
1252 2164 597 -691 -3175 -2664 2738 4865 -74 -3740 -1925 42 934 3138 2369 -3100 -4880 426
1268D26L648k146k414r54j367J192M703J194m885l491K090L172R81j64j604l123
1284b742n50M003L355k027m105q45J973J811J389J81l151l456J993N073N85l420
1300F7j762j31j27K633L605k153n570k08M194J486n41N6k351l232K379N213l49
1317C209m164j185Q47L93K107K169k561m148O95L688J290r19j343j971p14K660
1333E3K985p33l247j868J035K646J719p92k459j951L77L043K574j482l698j000
1349b798J897J787J253N2l015k878K172M074k8k402j052q64j78L184K571k946
1365H29l872Q85K613P61O19l75l337j720L561L391j430k684r46k52J283L165N85
1382C076l631k661J432K637J314k41k066k487L54L055K010j085k641j579R78K488
$$ plain form
1268 426 4074 1928 -486 -1440 -2807 -1615 3088 4282 -603 -4094 -2004 1168 2149 1985 381 -2742
1284 -2742 -3292 711 4066 2039 -2066 -2911 -938 873 2262 2443 -708 -4164 -2171 2902 3487 67
1300 67 -1695 -1826 -1953 680 4285 2132 -3438 -3646 548 2034 1493 1549 -802 -4034 -1655 3558 3209
1317 3209 -955 -2140 -1293 -900 1207 3376 815 -3333 -2638 1050 2340 1421 78 -1893 -2607 53
1333 53 3038 2305 -942 -2810 -1775 871 2590 1798 -661 -2612 -2235 808 3382 1900 -1798 -2798
1349 -2798 -901 886 2139 2191 -824 -3702 -1530 2544 2516 114 -938 -1802 -1980 1204 3775 829
1365 829 -3043 -2158 455 1216 1835 1460 -1877 -3597 -36 3355 1925 -759 -1705 -1957 -674 2491 3076
1382 3076 -555 -3216 -1784 853 2167 1926 -140 -2627 -2273 782 2792 1707 -934 -2513 -1535 953
1398I53J404r35k259j641Q72K937J436j929k479l40J193J781J465j165l226q35
1414b768K655K126l01j229j742j272J694L214J13k766j691L13J219K032R62k252
1430C07k784M43K425J411l7j476k323k54K651K008q38j963j394jK101K197q23
1447A650k686j067R75J694J544l91k792j595J777K318M29q16j810j772J162L223
1463A843P20k252j774l21P23K285J600k057l080K01K198J296M30r20k651r03K741
1480G9K314r37j774r83m90J389K637j47k927j287J197J294J081L57k040k290J122
1497a405K692N48j052j192j378J01K629J643j761k225k27Q28J404J471p50k710
1513a384q92J847J732K58q09j704j086J295K243L14j528j527l94J165J862L60
$$ plain form
1398 953 2357 1422 -837 -2478 -1606 1331 2767 838 -1641 -1981 -788 993 2458 1293 -1933 -2768
1414 -2768 -113 2013 1712 483 -1259 -2531 -837 2377 2490 -276 -1967 -1654 -435 1597 2559 307
1430 307 -2477 -2034 391 1802 1765 289 -2034 -2288 363 2371 1533 -430 -1824 -1825 276 2473 1650
1447 1650 -1036 -2103 -1128 566 2110 1719 -1073 -2668 -891 1427 1856 1040 -770 -2542 -1380 1843
1463 1843 2563 311 -1463 -1784 -1061 1224 2824 767 -2313 -2112 86 1382 1812 892 -1759 -2662 79
1480 79 2393 1456 -318 -1301 -1791 -402 2235 2088 -839 -2126 -929 365 1446 1803 -237 -2527 -1405
1497 -1405 1287 1835 783 -409 -1787 -1686 943 2586 825 -1400 -1627 -799 605 2076 1326 -1384
1513 -1384 -2276 -429 1303 1561 752 -952 -2038 -743 1500 1814 286 -1241 -1635 -470 1392 1752
1529A752j614j578q0J274J742L40j922j816N47J695J043Q4j318k085O3K621J413
1546B161j264j488p35j56J553K220o62k853q23J471J226P05N7j876j875J223K564
1563A448L51j401j198p19N15K050J033j587j966r8J297J500M73j401j840qJ558
1580GJ350K00j362j914L1K150J249p29j096j020n55J584K261o83k489m91R79N24
1598dJ029P73j960k235J391K415k35r71j78j102n66K281J718j917k011O47Q60
1615f5K63J048jk312j032K002J623n32q87p24p87O66J998N24j664j532J04J238
1633g0J247J61j171j326k55J157J660K06j817j454P17J371N28O9p55j725j81K306
1651F68J262j460j320O2K7O65J718j63k529r14J809J263j99k49r14j439O34K394
$$ plain form
1529 1752 138 -1440 -1520 -246 1496 1836 -86 -1902 -1355 340 1383 1467 149 -1936 -1873 748 2161
1546 2161 897 -591 -1326 -1482 71 2291 1629 -1224 -2047 -576 650 1355 1412 -464 -2339 -1116 1448
1563 1448 1799 398 -800 -1519 -1004 1046 2079 492 -1474 -1572 -275 1225 1698 297 -1543 -1551 7
1580 7 1357 1557 195 -1719 -1688 462 1711 982 -114 -1134 -1689 -105 2156 1473 -1016 -1507 -528 -4
1598 -4 1025 1798 -162 -2397 -1006 1409 1174 203 25 -1077 -1643 638 2356 439 -1572 -925 -65
1615 -65 198 1246 1245 -1067 -2099 -97 1526 994 107 -617 -1404 -738 1260 1784 120 -1412 -1308 -70
1633 -70 1177 1338 167 -1159 -1414 -257 1403 1609 -208 -1662 -945 426 954 1023 268 -1457 -1638 668
1651 668 1930 470 -850 -788 -761 -96 1622 1459 -1070 -1984 -175 1088 889 640 -274 -1713 -1079 1315
1669A315N40j776j270J06O99J146P38r55j757k89J386J375l6j272j076J59R33
1686c4R29L13j005j610J22J851P90q98p09m08m62R63J850m70k249l85J294M98
1704C80K87M69j228j776R37K213j8j233m00m37k60J511J333j236j742J82Q91N46
1722D19O39k88j608o21J307J146o8o30j017n87J054J486j57j213p16j47P20J477
1740A196K05j716j129P51R96N25K57r74j633L07J956O56r51q01n21j61J254J378
1758A595p43j765l07Q70Q35N66k74j439p60J036J313J59p65j092m56R86J299l7
1776A021j009p84k28P13J371J72j510r51N94P66M64L75p29j520Q5J705O48p86
1794C97o08l74l58Q29J395l08j599n21P94P09L73l0q90r26L87J298N59p22j062
$$ plain form
1669 1315 1855 79 -1191 -1085 -386 760 1498 543 -1214 -1503 -117 1258 1222 -50 -1126 -967 -34
1686 -34 895 1208 203 -1407 -1285 566 1356 458 -251 -659 -1121 -158 1692 1222 -1027 -1412 -118 380
1704 380 667 1136 -92 -1868 -931 1282 1264 31 -369 -806 -1066 445 1778 542 -1200 -1018 -127 419
1722 419 1058 770 -838 -1459 -152 994 926 296 -721 -1308 -254 1232 1075 -138 -854 -1001 -281 1196
1740 1196 1401 -315 -1444 -693 303 828 1085 111 -1522 -1215 741 1397 446 -355 -876 -1037 217 1595
1758 1595 852 -913 -1220 -350 485 1051 777 -662 -1422 -386 927 1086 321 -771 -1227 -241 1058 1021
1776 1021 12 -772 -1000 -287 1084 1256 -254 -1205 -611 155 619 994 265 -1255 -1170 535 1183 397
1794 397 -211 -585 -943 -114 1281 973 -626 -1147 -353 356 729 699 -191 -1117 -730 568 1127 405 -657
1813f57k74O57P40L23k22r47q78P18J584O1j276m77J83p5P93J246q85k079K87
1832a178J776J75n25K28p61j306J163K175o78j967N3P24j31O90R90j312j847Q91
1850h40J849r2q11j85n30m05J208J323q15j643j75R86P11J78k96q47p44N05J474
1869H51N11j278j233M42Q90K27K57m0j338q14J587J468j016j166L47Jl39J265
1887F22R56j762j509J339J257o31j24M25j174q55J746J411j384j317O01L65k22
1904b56Q54N89j482j244J149J423l42p62q5l18l01R49J160p23j662J2J273L91
1922F25l09R7m31j164L78J951K32j817n87Q63J09O0J063k68k060j88K123O07j232
1941E2k85J35p91L34J865k1k071n35J282N05j52L34m63j341J56J713N27j102q30
$$ plain form
1813 -657 -931 -274 466 789 567 -380 -1258 -540 1044 1105 -171 -648 -465 -540 253 1499 614 -1465 -1178
1832 -1178 598 773 248 476 -285 -1591 -428 1747 1069 -898 -845 -121 -252 438 1428 116 -1731 -840
1850 -840 1009 917 106 -79 -609 -1014 194 1517 702 -941 -1116 -130 581 759 463 -384 -1128 -623 851
1869 851 1362 84 -1149 -707 183 410 667 627 -711 -1525 62 1530 514 -652 -305 -304 -643 622
1887 622 1578 -184 -1693 -354 903 272 148 573 -601 -1456 290 1701 317 -1000 -399 -34 -256
1904 -256 598 1187 -295 -1539 -390 1033 691 -71 -156 -474 -775 174 1334 611 -1051 -1039 234 625
1922 625 316 413 -18 -1182 -804 1147 1379 -438 -1025 -162 -53 7 1070 802 -1258 -1446 677 1284 52
1941 52 -233 -98 -889 -555 1310 1289 -782 -1317 -35 470 318 652 189 -1152 -996 717 1244 142 -688
1960f88P6K97N51O34k41j201o21R05J229o6r82m83J00J63O83P63p47j501J99J439
1980E09K30n77K3l59q63O79J601l74j572k6P32j18L04Q24p83j497N35J492o2o74
2000B4j3l76n24R22J163o54j243%N63L09M12O3r18p13N77R75J93n00o61l36M02
2021c35P97L41m50q42l95O04R70J23p50o36q7M28Q09L80q49j022J90R40M52r5
2041E73n00q04j23J045P96m67q52l57J55O78P53k54j084m14N24O75L88j85r01
2060c54o18O52R43P1m87n10m47L06J060L17r03p07J94L89M39L91m71r98k6R26
2080A67M77k40l82m49k32N86P80r8p36m69J02N50N67p8o46m71P5N10O66Pr16n87
2102h17N31O04P1M3l12q86KJ271M45r17m65K17j73K43J043j65j480k30J162L48
$$ plain form
1960 -688 -612 -315 236 870 629 -572 -1193 -288 941 875 -107 -590 -490 -327 356 1119 372 -1129 -930 509
1980 509 739 162 185 -174 -1037 -358 1243 869 -703 -729 3 -115 189 1013 230 -1267 -732 760 698 24
2000 24 11 -365 -889 33 1196 542 -701 -701 -138 171 583 646 -272 -985 -408 567 760 260 -401 -737 -335
2021 -335 462 803 353 -489 -884 -280 690 813 63 -573 -660 -232 577 957 108 -914 -724 216 668 573
2041 573 73 -731 -854 191 987 520 -332 -689 -534 144 897 643 -441 -855 -331 344 732 547 -354
2060 -354 -972 -320 623 694 207 -303 -750 -444 616 933 30 -677 -483 -94 345 736 265 -733 -759 167
2080 167 644 404 22 -427 -659 -73 707 609 -127 -596 -494 56 623 545 -101 -572 -497 13 679 686 -230 -817
2102 -817 -286 318 389 432 120 -766 -764 507 952 35 -430 -213 -386 -143 900 735 -745 -975 187 535
2122E35l31J52l56r90L97J525K9j251l42L50Q0M60O93o08j297J00J181M53m20
2141C60m10l86k08N48Q88n8r86o26M97P76J49k58l39m95j13Q79Q04o62j094J56
2161e78O41J10J98K41q60q79Q85J209m16q40P1m7k50P90Q07r12j145N17Q23j03
2181B62m3J75o56o34P64R93l60q21o6J75O2M09M20n21q90J02R28L83m76l97p7
2202b68j55K40Q45J24j134o10Q35O36k68rpq60k46J345O76j133o97M92O3n2Q69
2223F86J54j427n53J258O69n70j83l5o65R5J280K80j229n78N59L84J71K63l58
2242B01r01j7R79N38m39o41k56J78M85M40o5o44o05K73Q97L12n96m59n1J6M18
2263F3P05k64j091j64Q54L09k00M8l00p04L49J107o0r17j31K79r7L12O18m44r95
$$ plain form
2122 535 204 356 0 -990 -593 932 961 -290 -632 -282 -202 258 951 343 -954 -854 327 780 360
2141 360 -50 -436 -644 -96 792 734 -252 -878 -381 395 544 286 -53 -548 -661 218 1022 360 -734 -578
2161 -578 63 173 371 612 -248 -1127 -242 967 551 -289 -218 -265 -515 275 1082 170 -975 -458 365 262
2181 262 219 394 -262 -896 -132 861 501 -320 -386 -211 -149 260 680 159 -731 -629 299 682 206 -191 -268
2202 -268 -423 -183 662 786 -348 -958 -123 513 245 236 229 -631 -877 468 1144 11 -686 -194 -131 -183 686
2223 686 840 -587 -1140 118 787 217 34 -1 -666 -571 709 989 -240 -818 -259 125 296 559 201
2242 201 -700 -717 262 800 361 -280 -536 -358 127 567 502 -142 -747 -474 423 735 139 -320 -371 -355 63
2263 63 768 504 -587 -751 103 412 212 260 -40 -744 -395 712 652 -265 -396 -117 -214 98 716 272 -723
2284g23J66Q27J29j87l8m19m29N32Q32j43p37k85J30L09M64J27n30o20O4O71M78
2305F18j99o01l25J56M08M61K6p09n85M15P52P8l12k79m06l1Q50N55o87p87J39
2326d63L99K74L72j48r59l38Q98O67k95l93l14l26L94R17J7q87m29K84L43L97
2346D10J85o01o84K43O93K36j63l70m79N6P07L78l73m64k11Q8N31M75l86o85p3
2367d87L68L17K95j34p20l08O10N16j05j95k98m28K46Q26J10o49l15M5O3M47M89
2388F93m62q22Q7N94K15M4j08o03l34O87O70k96n16j93o3L12O59Pp89m34L67M76
2410A91K69k6n38n78K77P47K85l38n27l51K02P35L45m23o24k30L11O29L30m67
2430B19o93p8M58M64J67l69o81q0O67M48j66l64l52j62N11O57k08o98j94K10K64
$$ plain form
2284 -723 -557 270 399 212 174 -245 -674 -142 690 547 -190 -475 -345 -36 428 555 25 -595 -531 140 618
2305 618 419 -182 -507 -351 57 518 544 -165 -750 -335 417 495 183 -96 -502 -533 317 872 185 -602 -463
2326 -463 -64 210 582 434 -525 -863 35 702 407 14 -300 -626 -232 685 702 -185 -614 -330 13 410
2346 410 595 -6 -690 -447 246 482 319 -51 -530 -474 233 611 238 -226 -437 -349 182 657 271 -414 -487
2367 -487 -119 198 493 359 -361 -669 -59 457 352 157 -141 -569 -323 503 613 -36 -351 -306 -243 204 693
2388 693 231 -591 -504 90 305 349 241 -362 -696 -9 661 365 -151 -344 -407 -95 564 571 -218 -652 -285 191
2410 191 460 434 -104 -682 -405 342 627 289 -238 -589 -387 348 693 270 -354 -584 -273 356 686 219
2430 219 -474 -552 -94 370 537 168 -513 -593 74 522 356 -8 -360 -522 -11 646 438 -260 -454 -244 20
2451B0M07J29o83n76M14O20P4j49k54n14oP97L92n05m63l4O7L18M88j56p36j90
2473e40M48L23J10q8m42l40L41N36O1k92l48k34K62O07R7m73l81n9K34N57K75
2494F54n94o70J83N18K53J05k38p41j71Q39N55m02m30j49j79L15P94k8r24l34
2514f44N05L22J08J30m35o97K93Q86J22n48l11j12P1N76M36m94p53J2N41M00O4
2535D72l17n67j39M86N65J8m94m92K8M90L86o0l17m28j45N05N72j96n71j50J30
2556b24J70L88J80o01n63M02N96l3j81j23l86r9P01M48n11n57Q7J77J96L84l1
2577D20o97l49M77N14N7k15l82l18K13N88K42l33n39k15L81N53O8l82l87j31K23
2598b12O15K16o39n87K79M77J27R0k03o60j43Q56N19n27m77rm9K38P05j2r61l74
$$ plain form
2451 20 427 556 -127 -703 -289 331 405 256 2 -512 -518 279 671 166 -297 -331 -264 54 542 386 -350 -540
2473 -540 -92 231 341 253 -189 -529 -188 348 409 117 -231 -465 -203 404 501 28 -353 -412 -178 379 654
2494 654 60 -610 -427 91 344 449 211 -530 -701 138 693 291 -139 -288 -467 -152 642 614 -310 -644
2514 -644 -139 183 291 421 -14 -711 -418 468 590 42 -269 -381 -310 266 702 208 -545 -533 8 408 472
2535 472 155 -412 -551 -65 500 518 24 -468 -440 50 436 376 59 -369 -514 -9 563 367 -204 -354 -224
2556 -224 -54 334 514 -87 -650 -248 348 315 134 11 -375 -474 227 675 164 -393 -306 -129 67 451 420
2577 420 -277 -626 -149 365 422 207 -175 -493 -280 308 550 217 -322 -537 -156 397 465 83 -304 -435 -212
2598 -212 403 619 -20 -607 -328 149 276 366 163 -497 -640 216 735 208 -269 -278 -327 -89 616 604 -357 -731
2620g31O18M36Ok1l43o08K24Q72J72n74l63m5J44M27L51l75o09l2M24L56N9k94
2642I4m53m4L99L44J1k85m17r6M90M47j78m02j99m7K59N37M2o42l83K99L54J47
2664B77Q2l09n48O6O46K73k95l12j80k9L74M52j75n48k09K19L83K61j60m93k38
2685d63K65M41K19k20n51k28M15N28Ol31l44k15K76O76J25o38m71J85L37K75J79
2706D66l42o52jP03L39k55l37k52o5M07N20j39o10k67K50M06K54j58m82k36K41
2727b10M35K22k13n29k16M33M44m6k32k28k92J64O70J60o44l31K43J16J25L79
2747D50j34p99q2P32K50k98p9r7m10K00P77J1p45k13L39J19J16K49k50o15N4O48
2769B23K30l05k69j36k6K96M20m8n46l62K86N14J50k68k91k17%M81M94l22p57
$$ plain form
2620 -731 -113 323 329 308 -35 -643 -419 453 625 51 -312 -357 -213 214 565 190 -419 -451 -27 329 388 94
2642 94 -359 -403 -4 340 351 66 -351 -447 43 490 312 -90 -289 -336 -77 460 502 -140 -523 -224 130 277
2664 277 359 50 -498 -432 214 487 192 -120 -300 -329 45 497 322 -226 -435 -216 167 428 268 -225 -463
2685 -463 -198 243 462 242 -309 -537 -122 406 412 81 -263 -478 -202 474 599 -39 -510 -325 12 287 466
2706 466 124 -528 -529 174 513 258 -79 -331 -396 11 531 392 -218 -485 -235 171 425 267 -215 -451 -210
2727 -210 225 447 234 -295 -511 -78 366 320 88 -140 -432 -268 402 562 -82 -413 -170 -54 71 450
2747 450 316 -483 -565 167 417 119 40 -57 -467 -267 510 521 -224 -437 -98 21 137 386 136 -479 -425 223
2769 223 453 148 -121 -257 -283 13 433 385 -161 -523 -237 277 427 159 -132 -349 -349 132 626 304 -453
2790d53m9N22K17J3L3m11n18L99Q38j38o49r4J45l2L29M39m58p59K33O83P1k55
2812A06n8k55k54M27O40k28o93j32L39K48J27M8l35m77J28O64K32m41l81N9J16
2833a20J26L40N2o18l84N44M90k61k17Q7k61j98O28M50o33n51L68L07j51K20J57
2854C75o29l97O98N53m06l71Q4j38l2N81K87o64m98L06M20N9K1j49m18j36M91
2875C7M59j65n17k15K08L03J78jk94m37Q3O35K82m85l99J10J12J54L76n1p46k39
2897f12O78M07k91j87n6l28R7P34J45p24l38L25J90P3K61j79o20o1O37K84k75
2918A60k35j22r7K54M29n1m86k35K07L27J44j05k81k06R3L34K57j66m21j55K65
2939i0K74R0n8l01l18J53N26J36l62k45n7N2L23L26k64n32j9L53K13P6j10l97
$$ plain form
2790 -453 -502 20 237 250 283 -128 -646 -247 591 453 -196 -290 -145 -177 152 591 133 -626 -393 290 361 106
2812 106 48 -207 -461 -34 606 378 -315 -447 -108 140 267 315 -20 -497 -369 295 527 86 -295 -236 -120
2833 -120 6 346 398 -220 -604 -60 430 169 -48 39 -222 -420 208 658 25 -526 -158 149 -2 218 375
2854 375 -254 -651 47 600 194 -177 -93 -231 -263 318 605 -59 -557 -251 169 228 249 100 -318 -454 37
2875 37 496 331 -186 -401 -193 110 288 287 -7 -444 -361 274 556 71 -328 -218 -106 48 424 373 -373 -612
2897 -612 66 473 182 -5 -61 -389 -292 442 587 -137 -475 -150 40 113 374 195 -425 -486 151 435 160
2918 160 -75 -197 -294 -40 389 338 -148 -383 -176 151 295 190 -91 -297 -204 130 387 221 -200 -355 -90
2939 -90 184 274 216 -85 -403 -250 276 412 50 -195 -252 -200 123 449 185 -347 -366 -13 200 276 166 -231
2961b31j95L70M12p5k88k25j02K56M47J6m70k46J07K34K92R5m35m49K25M70J29
2982C37j31k31l47j5N71L51l72m34k2J26K53L26j42n50j76L89L35K4j71l15j96
3003c90K84M05L3k90k89q0K55M20j9l76k14L9J51L39J51m37m36K42M04ok7l0m00
3026b71j76N66L97l96l61J12pj3M36J59o04l54M34L24j16Pn3m09o4N67L16l98
3048I6l54N0J09J57K61m6m49k65L25M49K2l49k22jQ5K76K90k54n80j5N37K18k06
3071A34q2j54l09K20O84n3o89j47L53O9N9L02k55o57J42P34O5m34q5j4j70K75
3093a2N21k15o33m4M14J70j7kk53l09J78M78J23l62l39O2K41J46P9l4l77k72L81
3116g6N23j93m36L2O4j04L13L96m53o11L27N21j61j30J95l11m18N00O39m10n35
$$ plain form
2961 -231 -426 -56 356 281 -7 -232 -334 -78 369 385 -85 -331 -224 10 302 397 -38 -487 -262 208 337
2982 337 206 -25 -372 -387 184 535 163 -271 -293 -167 86 412 270 -280 -456 -67 268 292 121 -194 -390
3003 -390 -106 299 332 42 -247 -327 -72 348 329 -47 -261 -222 -71 268 419 -18 -454 -212 192 186 159 129 -271
3026 -271 -447 119 516 120 -241 -129 -136 -149 287 446 -158 -512 -78 246 130 137 84 -325 -389 178 494 96
3048 96 -258 -208 -99 58 319 273 -176 -441 -116 333 355 6 -216 -217 -132 144 434 180 -400 -415 122 340 134
3071 134 52 -102 -411 -191 493 440 -249 -396 -43 26 85 387 132 -525 -383 351 416 -18 -103 -117 -287 -12
3093 -12 509 294 -339 -383 31 201 184 182 -71 -380 -202 276 399 37 -302 -240 1 147 226 192 -185 -457 -76
3116 -76 447 254 -182 -150 -86 -190 123 519 66 -545 -218 303 142 12 207 -104 -522 -22 617 207 -328
3137c28J86J58j69L22L34n45n44M31N19j47j91J2k63j33M82M01l73m76K0K79J71
3158A46J02o7l21k44K10M83R3m09l12J26J90J22J81j00n12j52N60L60l10k61J8
3179i7j21N5N21J02o42l01M29K46q7P6p2m68j4O17J92m17k26P0j5J39L51p2m90
3202b24j43L31K49Kj09j94j77J21L38J42k33l50k3K65K19rj10k13j98K08M36k1
3224C07m11j36J31L9J73K63k66n01J14M72M7j61jk14k45L69M80k32m64J4J42M8
3246c2K72J16m66l43L40L70k7j20j48k48O6M54J60l34k74pJ24K54J85k39l73j
3268b71K60K14P4j97l36l6L35K20n3j88k44p5L16L36j40l36r3N9J42K80L4m18
3290a17k31K53K44K5oj46l27O6M37J22k79j57l3l1K17L14j77m12k0K33J29Q5p
$$ plain form
3137 -328 -142 16 -153 169 503 -42 -586 -155 364 217 26 38 -225 -358 124 525 152 -324 -304 -25 146
3158 146 248 181 -140 -384 -174 309 402 -7 -319 -193 -3 119 300 200 -312 -464 96 456 146 -115 -97
3179 -97 -218 -163 358 460 -182 -483 -54 192 105 181 109 -359 -373 244 436 19 -207 -137 -152 -13 338 266 -224
3202 -224 -367 -36 213 215 106 -88 -265 -144 194 336 103 -247 -270 -5 214 205 95 -118 -316 -108 328 307
3224 307 -104 -240 -109 -70 103 366 100 -401 -287 185 232 71 70 -144 -389 -20 460 228 -236 -222 -80 -32
3246 -32 240 356 -110 -453 -113 257 230 110 -38 -286 -220 234 394 60 -214 -221 -97 157 342 103 -270 -271
3268 -271 -11 203 277 80 -256 -292 43 263 210 22 -222 -297 19 355 215 -121 -214 -155 -13 267 301 -117
3290 -117 -348 -95 149 174 168 22 -305 -239 198 320 41 -116 -149 -180 37 351 174 -238 -258 -25 104 189 182
3313A82l07k31K57L54k8k07j57r5J14L13R6k51k57qK04K48M0k35k55nK06K40Q5
3336C03k74l28N6L44J44o6j46k70p7L96L15k44l34nN9J26K90rm64k03L43K56n3
3359A59m5j53k94J21M97O4l75j81O1L8K24K52k51m21N2L25J15Jq8k81j28L07L01
3382C00r5k52j27j5J69K71l2k89j53P1J77J83Qk79j90J30K10P4K8j93k85Q8L81
3405A80R5k31j06q3p2K62L34k06m38M1K32N9R1O8l28k77K91L80j00k11m8j07j9
3428a93L64J94l45l10J15K05R5P9j21l06o2L11K59q7k68j56M8K32J80l3k37k31
3450b67N5L30J79j72k46n1L9J61K37l5l94j45K85K05m3l3j14k61P9M23P2l46j31
3473a73R2OJ19K44j70l99L7L48P2j00j4j57j56K07L31p8k89r6O0J10J74N4k19
$$ plain form
3313 182 -125 -356 -99 255 227 20 -137 -232 -118 195 291 40 -217 -225 -21 227 267 32 -223 -228 -22 218 303
3336 303 29 -299 -243 101 245 179 33 -237 -314 82 397 153 -181 -186 -127 -1 289 280 -184 -387 -44 212 159
3359 159 114 -39 -333 -212 285 349 -26 -207 -146 -108 116 368 117 -304 -252 73 188 189 101 -180 -308 -1 300
3382 300 205 -47 -174 -189 -20 251 219 -70 -223 -152 25 208 216 -63 -253 -123 87 161 189 -4 -289 -201 180
3405 180 275 44 -62 -145 -217 45 379 173 -265 -224 8 67 158 226 -102 -379 -88 292 192 -19 -67 -174 -193
3428 -193 171 365 20 -290 -175 30 125 204 83 -223 -285 26 285 198 -70 -226 -178 54 234 201 -36 -267
3450 -267 -212 118 297 125 -121 -172 -133 28 265 230 -164 -309 -24 181 138 105 -9 -270 -191 232 304 -42 -173
3473 -173 -81 -75 44 288 118 -281 -244 104 176 76 62 -95 -251 -44 287 209 -80 -176 -116 -6 168 222 3
$$ [...]
8191D
##END NTUPLES=NMR FID
##END=
