##TITLE=1H_LY-387.24
 CCl4, 8 sc, 
 7.6.2019
##JCAMPDX= 6.0         $$ Bruker NMR JCAMP-DX V2.0
##DATA TYPE= NMR FID
##DATA CLASS= NTUPLES
##ORIGIN= UXNMR, Bruker Analytische Messtechnik GmbH
##OWNER= root
$$ XWIN-NMR		Version 3.5
$$ Fri Jun  7 13:48:11 2019 Russian Standard Time (UT+4h)  she@DPX200
##.OBSERVE FREQUENCY= 200.13155
##.OBSERVE NUCLEUS= ^1H
##.DELAY= (6, 6)
##.ACQUISITION MODE= SIMULTANEOUS
##.ACQUISITION SCHEME= undefined
##.AVERAGES= 8
##.DIGITISER RES= 18
##SPECTROMETER/DATA SYSTEM= spect
##.PULSE SEQUENCE= zg30
##.SOLVENT NAME= CDCl3
##.SHIFT REFERENCE= (INTERNAL, CDCl3, 0, 15.7039)
##AUDIT TRAIL= $$ (NUMBER, WHEN, WHO, WHERE, WHAT)
$$ ##TITLE= Audit trail, XWIN-NMR		Version 3.5
$$ ##JCAMPDX= 5.01
$$ ##ORIGIN= Bruker BioSpin GmbH
$$ ##OWNER= she
$$ F:/spectra/data/she/nmr/H-F/1/audita.txt
$$ ##AUDIT TRAIL=  $$ (NUMBER, WHEN, WHO, WHERE, WHAT)
(   1,<2019-06-07 13:47:00.51 +0400>,<she>,<DPX200>,
      <created by zg, POWCHK disabled, PULCHK disabled
       configuration hash MD5:
       00 E9 B6 7A A2 85 ED C7 34 08 36 98 17 FE 4E 26
       data hash MD5: 16K
       34 7F F8 61 EB 86 D4 F7 8E 64 31 CB B9 64 FA 9F>)
$$ ##END=
$$ 
$$ hash MD5
$$ B1 79 D5 5E 3B 87 0B C6 E9 AF DC 0B D8 C0 F5 FA
##$RELAX= 
##$RELAX= 
##$RELAX= 
##$RELAX= 
##$RELAX= 
##$RELAX= 
$$ Bruker specific parameters
$$ --------------------------
##$DU= <F:/spectra>
##$EXPNO= 1
##$NAME= <H-F>
##$PROCNO= 1
##$TYPE= <nmr>
##$USER= <she>
##$AMP= (0..31)
100 100 100 100 100 100 100 100 100 100 100 100 100 100 100 100 100 100 
100 100 100 100 100 100 100 100 100 100 100 100 100 100 
##$AQSEQ= 0
##$AQ_mod= 1
##$AUNM= <au_zg>
##$AUTOPOS= <>
##$BF1= 200.13
##$BF2= 200.13
##$BF3= 200.13
##$BF4= 200.13
##$BF5= 200.13
##$BF6= 200.13
##$BF7= 200.13
##$BF8= 200.13
##$BYTORDA= 1
##$CFDGTYP= 0
##$CFRGTYP= 5
##$CHEMSTR= <none>
##$CNST= (0..31)
1 1 145 1 1 1 1 1 1 1 1 1 1 1 1 1 1 1 1 1 1 1 1 1 1 1 1 1 1 1 1 1 
##$CPDPRG= <>
##$CPDPRG1= <>
##$CPDPRG2= <>
##$CPDPRG3= <>
##$CPDPRG4= <mlev>
##$CPDPRG5= <mlev>
##$CPDPRG6= <mlev>
##$CPDPRG7= <mlev>
##$CPDPRG8= <mlev>
##$CPDPRGB= <>
##$CPDPRGT= <>
##$D= (0..31)
0 1.2 0 0 0 0 0 0 0 0 0 0.03 0 0 0 0 0 0 0 0 0 0 0 0 0 0 0 0 0 0 0 0 
##$DATE= 1559900819
##$DBL= (0..7)
120 120 120 120 120 120 120 120 
##$DBP= (0..7)
150 150 150 150 150 150 150 150 
##$DBP07= 0
##$DBPNAM0= <>
##$DBPNAM1= <>
##$DBPNAM2= <>
##$DBPNAM3= <>
##$DBPNAM4= <>
##$DBPNAM5= <>
##$DBPNAM6= <>
##$DBPNAM7= <>
##$DBPOAL= (0..7)
0.5 0.5 0.5 0.5 0.5 0.5 0.5 0.5 
##$DBPOFFS= (0..7)
0 0 0 0 0 0 0 0 
##$DE= 6
##$DECBNUC= <off>
##$DECIM= 24
##$DECNUC= <off>
##$DECSTAT= 4
##$DIGMOD= 1
##$DIGTYP= 9
##$DL= (0..7)
0 120 120 120 120 120 120 120 
##$DP= (0..7)
150 150 150 150 150 150 150 150 
##$DP07= 0
##$DPNAME0= <>
##$DPNAME1= <>
##$DPNAME2= <>
##$DPNAME3= <>
##$DPNAME4= <>
##$DPNAME5= <>
##$DPNAME6= <>
##$DPNAME7= <>
##$DPOAL= (0..7)
0.5 0.5 0.5 0.5 0.5 0.5 0.5 0.5 
##$DPOFFS= (0..7)
0 0 0 0 0 0 0 0 
##$DQDMODE= 0
##$DR= 18
##$DS= 0
##$DSLIST= <SSSSSSSSSSSSSSS>
##$DSPFIRM= 0
$$ [...]
##$SUBNAM2= <"">
##$SUBNAM3= <"">
##$SUBNAM4= <"">
##$SUBNAM5= <"">
##$SUBNAM6= <"">
##$SUBNAM7= <"">
##$SUBNAM8= <"">
##$SUBNAM9= <"">
##$SW= 24.9336996594482
##$SWIBOX= (0..15)
0 0 2 0 0 0 0 0 0 0 0 0 0 0 0 0 
##$SW_h= 4990.01996007984
##$TD= 16384
##$TD0= 1
##$TE= 0
##$TE2= 300
##$TE3= 300
##$TEG= 300
##$TL= (0..7)
0 120 120 120 120 120 120 120 
##$TP= (0..7)
150 150 150 150 150 150 150 150 
##$TP07= 0
##$TPNAME0= <>
##$TPNAME1= <>
##$TPNAME2= <>
##$TPNAME3= <>
##$TPNAME4= <>
##$TPNAME5= <>
##$TPNAME6= <>
##$TPNAME7= <>
##$TPOAL= (0..7)
0.5 0.5 0.5 0.5 0.5 0.5 0.5 0.5 
##$TPOFFS= (0..7)
0 0 0 0 0 0 0 0 
##$TUNHIN= 0
##$TUNHOUT= 0
##$TUNXOUT= 0
##$USERA1= <user>
##$USERA2= <user>
##$USERA3= <user>
##$USERA4= <user>
##$USERA5= <user>
##$V9= 5
##$VALIST= <valist>
##$VCLIST= <CCCCCCCCCCCCCCC>
##$VD= 0
##$VDLIST= <DDDDDDDDDDDDDDD>
##$VPLIST= <PPPPPPPPPPPPPPP>
##$VTLIST= <TTTTTTTTTTTTTTT>
##$WBST= 1024
##$WBSW= 4
##$XGAIN= (0..3)
0 0 0 0 
##$XL= 0
##$YL= 0
##$YMAX_a= 22262
##$YMIN_a= -28265
##$ZGOPTNS= <>
##$ZL1= 120
##$ZL2= 120
##$ZL3= 120
##$ZL4= 120
##$ABSF1= 10
##$ABSF2= 0
##$ABSG= 5
##$ABSL= 3
##$ALPHA= 0
##$AQORDER= 0
##$ASSFAC= 0
##$ASSFACI= 0
##$ASSFACX= 0
##$ASSWID= 0
##$AUNMP= <proc_1d>
##$AZFE= 0.1
##$AZFW= 0.1
##$BCFW= 1
##$BC_mod= 2
##$BYTORDP= 1
##$COROFFS= 0
##$CY= 11.3945322036743
##$DATMOD= 1
##$DC= 2
##$DFILT= <>
##$DTYPP= 0
##$F1P= 18.9103706918063
##$F2P= -1.10871071338519
##$FCOR= 0.5
##$FTSIZE= 0
##$FT_mod= 4
##$GAMMA= 1
##$GB= 0.15
##$INTBC= 1
##$INTSCL= 1
##$ISEN= 128
##$LB= 0.24
##$LEV0= 0
##$LPBIN= 0
##$MAXI= 10000
##$MC2= 0
##$MEAN= 0
##$ME_mod= 0
##$MI= 1.114404
##$NCOEF= 0
##$NC_proc= 0
##$NLEV= 6
##$NOISF1= 3.799351
##$NOISF2= 2.8
##$NSP= 1
##$NTH_PI= 0
##$NZP= 0
##$OFFSET= 15.70392
##$PC= 1
##$PHC0= -8575.355
##$PHC1= 12.80019
##$PH_mod= 1
##$PKNL= yes
##$PPARMOD= 0
##$PSCAL= 0
##$PSIGN= 0
##$REVERSE= no
##$SF= 200.130013532006
##$SI= 16384
##$SIGF1= 3
##$SIGF2= 2
##$SINO= 400
##$SIOLD= 16384
##$SREGLST= <1H.CDCl3>
##$SSB= 0
##$STSI= 0
##$STSR= 0
##$SW_p= 3612.71676300578
##$SYMM= 0
##$S_DEV= 0
##$TDeff= 0
##$TDoff= 0
##$TI= <>
##$TILT= no
##$TM1= 0
##$TM2= 0
##$TOPLEV= 0
##$USERP1= <user>
##$USERP2= <user>
##$USERP3= <user>
##$USERP4= <user>
##$USERP5= <user>
##$WDW= 1
##$XDIM= 8192
##$YMAX_p= 0
##$YMIN_p= 0
$$ End of Bruker specific parameters
$$ ---------------------------------
##NTUPLES= NMR FID
##VAR_NAME=  TIME,          FID/REAL,        FID/IMAG
##SYMBOL=    X,             R,               I
##VAR_TYPE=  INDEPENDENT,   DEPENDENT,       DEPENDENT
##VAR_FORM=  AFFN,          ASDF,            ASDF
##VAR_DIM=   8192,          8192,            8192
##UNITS=     SECONDS,       ARBITRARY UNITS, ARBITRARY UNITS
##FACTOR=    0.0002004,     1,               1
##FIRST=     0,             0,               0
##LAST=      1.6414764,     0,               0
##MIN=       0,             -28265,          0
##MAX=       1.6414764,     22262,           0
$$ Real data points
##PAGE= N=1
##DATA TABLE= (X++(R..R)), XYDATA
0@%%%%%%%%%%%%%%%%%%%%%Kj0J6j6J6j6J6j6J6k0K8l2L2l2L9m7M8n1N9o6P3q1
43d2Q9r8J09j22J36j53J72j96K26k66L15l79M71o11Q51j317K528j0444j9534M2158
63A3893n429k7827L2353N558l8717J2679K0754k0509L652J7599j6227o076J1804
76C507m995q5P512q316j045Q045o155j108P751o505m073Q172J72l558Q30j082
92i33R58r27k292Q406n55j3649Q302R776j6056L294J6664j8177p638K4344o308
107E209j5993J7223j620j8780J4949R148j4331O373K940j6076Q199J0139j1287
120c907P907O183k2164M158J9105j5491j415K1283j6359j5281K2745q30j7203
133a1269J6019O031j9825M422J2164r701j897Q471l367l671L062P13j045k190
$$ plain form
0 0 0 0 0 0 0 0 0 0 0 0 0 0 0 0 0 0 0 0 0 0 0 2 -8 8 -8 8 -8 8 -8 8 -12 16 -16 16 -16 23 -24 24 -27 32 -34 39 -42
43 -42 47 -51 58 -64 72 -81 91 -105 121 -145 170 -209 262 -349 502 -815 1713 -8731 -28265 13893
63 13893 8464 -19363 12990 18548 -20169 -7490 13264 -7245 -3593 14006 -2221 -8297 3507
76 3507 -1488 -1573 5939 -2377 -3422 4623 -1532 -2640 5111 -1394 -5467 2705 2877 -681 149 -933
92 -933 25 -902 -3194 5212 4657 -8992 -690 9086 -6970 -3676 12988 -5189 -12827 11517 5209
107 5209 -10784 6439 4819 -13961 988 10136 -4195 2178 5118 -10958 -2759 7380 -3907
120 -3907 4000 10183 -11981 -7823 11282 -4209 -5624 15659 -700 -15981 6764 5934 -11269
133 -11269 4750 10781 -9044 -4622 7542 -2159 -4056 4415 1048 -2623 439 1152 107 -2083
147b083P93M836l053l464N786k597n633Q337P85q035O447Q16j0440Q383O579j2594
163e137M112Q279j4653K130J6662j2204p255J6161p623j2092J7469K089j5786
176g848Q637N474j4077M877J0884q824j806O234n730j027O093k790o39L133m359
191a768m7M145l936K39N195m343k074N014k818k439M810j184j960L338k631k456
207b915M146j060j093M430l441m184N384m19l479N746m32o596L571J635m316M939
223A916K089p052K042K954n537L854N011p880R4O737o524j571R204m335n954P823
239B871p27p108O042K927p224J924M696m283r20L318j787r67K282j22j048o26
255g52k60J521R0r32J616q95k936K244J820k036J693N37m552J091L720k257O21
$$ plain form
147 -2083 -1290 3546 493 -2971 2815 218 -5415 2922 3707 -4328 2119 2935 -7505 878 7457 -5137
163 -5137 -1025 7254 -7399 -5269 11393 -811 -8066 8095 472 -11620 5849 7938 -7848
176 -7848 789 6263 -7814 -2937 7947 -877 -2683 3551 -2179 -3206 2887 97 -542 2591 -1768
191 -1768 -1815 2330 -1606 -1367 3828 -515 -2589 2425 -393 -2832 1978 794 -1166 2172 -459 -2915
207 -2915 1231 171 -922 3508 67 -4117 1267 848 -2631 3115 2683 -3913 -342 1293 -3023 1916
223 1916 4005 -3047 -1005 1949 -3588 266 5277 -2603 -2509 4228 -2296 -3867 5337 1002 -4952 2871
239 2871 2144 -4964 1078 4005 -3219 -1295 3401 -882 -1802 1516 -271 -1238 1044 922 -126 -752
255 -752 -1012 509 599 -333 1283 388 -2548 -304 1516 -520 1173 1710 -2842 -1751 1969 -288 333
272C33K542m740j306N062j539j731M567k272m972L986J794l216K811J279n064
287b466N81L364j755K30J849k473o40J921j068K43J741j930p00K003j189o00K290
304A401j280j816K386M79k025P25N07j319Q23J307q33p64j22N8M97K27M53L03
322A007j744r26J796M14l67J318j218k585J682J746j276R40P34l011k07K484p33
339E4j3J935k092k221K252Q20r85J450k99k640P92J781q37K35Q28j501p14J124
357c1K45R1M25q28p18N09M43L00O0q47k46P02O8p9K28m85m07N88K77q3J14m61
379a35n46L11O49M83j24j105n13O89M70M50L81j182j045Q49N13o4J018k94j945
398a140N5J196k1O74N62j915j078J559O58k90O25n74j584N25J245j30L6K21j093
$$ plain form
272 333 2875 -1865 -3171 1891 352 -1379 3188 916 -4056 -70 1724 -1492 1319 2598 -2466
287 -2466 -1885 1479 -276 -46 1803 -670 -1310 611 -457 -214 1527 -403 -1103 900 -289 -889 1401
304 1401 121 -1695 691 1170 -855 -130 377 -942 -119 1188 355 -409 -531 -473 24 251 704 1007
322 1007 -737 -1663 133 547 180 1498 280 -2305 -623 1123 -153 787 1521 -1490 -1697 787 54
339 54 41 1976 -116 -2337 -85 735 -250 1200 901 -1739 -947 834 -3 232 1060 -441 -1155 -31
357 -31 214 305 730 -98 -816 -307 136 436 496 -351 -597 105 173 94 322 -163 -570 18 295 212 326 -135
379 -135 -681 -370 279 762 638 -467 -980 -291 179 629 1010 -172 -1217 -368 145 81 1099 805 -1140
398 -1140 -1085 111 90 764 1326 -589 -1667 -108 550 260 885 311 -1273 -748 497 367 403 624 -469
417d69p46J064R80k47m83l43m88K10J156K99j110m15M86j23J66R16m47j180L38
436d36N04j67P06K46j461m96J143M46j6J00q70p57P47Q56N2j98n24n54Q4N74P53
457G32J39r64p26K65L84O73O27j008j179N88O25p2N89p8j264p6Q30J7K15L72q60
478a71p28N86O51J75j60o13l31L45M35L22k05p35L9M72j85K79M90q76n61Q36Q2
499A47j64P24n84j229Q71R17o07J18J10j062K36J170l61l83L96n38m49Q02L71
518D85k52r5m63k48O04L68j6k20o99L2Q30j01k57M39n21n82Q82J53o52O43L5j144
540g79N81Q98q29q9N12p51J94J126p69p40P27j35k82R39j86r58M23J49m59O86
560B58M05p59j92Q7r5O27K05p70j4K24j77N63J70j043O7P13m01J99P51q61p53
$$ plain form
417 -469 -1215 -151 829 582 99 -244 -732 -522 634 933 -177 -592 -106 -229 -63 853 406 -774 -436
436 -436 68 -99 607 853 -608 -1104 39 485 469 569 -301 -1058 -311 545 597 399 -125 -679 -595 -21 732
457 732 871 -93 -819 -554 -170 503 1130 122 -1057 -469 156 84 673 595 -669 -745 85 102 317 689 -171
478 -171 -899 -313 338 513 353 -260 -591 -246 189 511 306 -429 -390 82 -103 176 666 -210 -771 65 147
499 147 -17 707 123 -1106 -235 682 75 193 303 -759 -523 647 286 -97 299 -239 -688 114 485
518 485 233 138 -325 -573 31 399 383 163 -536 -504 326 225 -32 407 -114 -696 186 339 -313 330 365 -779
540 -779 -198 700 -129 -218 294 -457 -263 863 94 -646 81 -54 -336 603 417 -541 -118 31 -428 258
560 258 663 -96 -288 -201 -296 331 536 -234 -248 -24 -201 362 532 -511 -444 269 -132 67 818 -43 -796
581g96O22J00J27Q08m65j047J49K65L20O84n11p42N18j16m29R82K7j162O36N90
601E60r75M16P32j349k89J412l4l11L42r92o34J158M12p8L73r30q72R67K05l28
621b15J115k51j716N83J048p33K25N78j190j30J346j12o77ol90R9Q35Q1k1j35
641C34j212j84J347J85p8N57j154j284J196R49m92K20m9q74K01M27j15L26k66
660C4n70Q57J12r37Q10J22j846R78K097j427q40J258j314r44K491M72j763M92
678H2J75j388O53J256l94j46k09p46N85N25n19L78j4j078Q40J070j265l84Q66
697B87o56q5J236k62o31J5o28K73J098l68l5M09j583k11K195n91j334J652k11
716E70k009J462J121j844L01J310j218k53J188m21n16J11k14P57L63j120L73M71
$$ plain form
581 -796 -174 -74 53 861 396 -651 -502 -237 83 767 256 -486 32 -84 -513 469 496 -666 -30 560
601 560 -415 1 733 -616 -905 507 473 162 504 -488 -1122 36 448 370 743 -187 -1059 -92 113 -215
621 -215 900 649 -1067 -484 564 -169 56 634 -556 -686 660 548 -129 -135 -525 -426 409 490 469 334
641 334 -878 -1062 285 470 392 949 -205 -1489 -293 656 164 384 335 -539 -338 89 -26 300 34
660 34 -536 321 433 -504 306 428 -1418 -440 1657 230 -610 648 -666 -1610 881 1353 -410 82
678 82 257 -1131 -478 778 384 238 29 -717 -132 393 -126 252 238 -840 0 1070 -195 -579 287
697 287 -369 -454 782 520 -111 -96 -724 -451 647 279 244 653 -930 -1141 1054 463 -871 781 570
716 570 -1439 23 1144 -700 -399 911 -307 -560 628 207 -309 -198 -412 345 708 -412 -39 432
734D32j512P24J884j711p74J982j063j472K179L84j819P71M95j263O49Q09q49
751a54Q6J13m78Q12rj088R60L83j513P79J103j459Q1J146j164j58J293o74l78
770c19O43p27K79R31j371P3J681j578p04K392j129j765K614l7k730J874J453k634
788a054L57J942j545m47J512p04o18Q04j95p4J42n66O67M27j443N14J281j469
806d69j34J646j255p38J809o36j151J494j60j125J051j97q28J403l27j411J475
823D47J41j656J471O07k191R84J450k008J74J811j439n91J414p53k76J213q64
840f6m56R73q35j1J434j277o14J919j036j408K199j01j953J644N41k091J017J168
858A047j773K31J325r36l3N80r96K37P93p67M15O51j342J50J007j200K28J602
$$ plain form
734 432 -1080 -356 1528 -183 -957 1025 -38 -1510 669 1053 -766 5 500 -763 -114 695 -154
751 -154 -68 45 -433 379 370 -718 242 625 -888 -109 994 -465 -384 762 -402 -560 733 59 -319
770 -319 324 -403 -124 807 -564 -491 1190 -388 -1092 1300 171 -1594 1020 983 -1747 127 1580 -1054
788 -1054 -697 1245 -300 -747 765 61 -557 247 52 -22 120 -446 221 648 -795 -281 1000 -469
806 -469 -603 1043 -212 -950 859 223 -928 566 406 -719 332 135 -693 710 383 -1028 447
823 447 588 -1068 403 1010 -1181 -197 1253 -755 -581 1230 -209 -800 614 -139 -415 798 -66
840 -66 -522 451 -384 -395 1039 -238 -852 1067 31 -1377 822 721 -1232 412 953 -1138 -121 1047
858 1047 -726 -495 830 -106 -139 441 -555 -318 475 -292 123 774 -568 -418 589 -611 -383 1219
876A219j226p30J293q07m98J574o59q69J490n70j236J484k04j274J706J74j917
893a050J229P29k082P68J560j505J04J322j563n07J590n12m66J064n76n65P44
910B84n73k56J150m43n37R66o51p21J230l19r48J368J56j282P02J18j163R43P21
929G45j120N19N73j336J57Q38q02M26J027j181l78R27p31k58J172l65l90Q06p08
948g9p53R12kk53Q86m16q77P40k14p55J185L63j033M87J27j243O90R72j001J15
968a49R02r70l44Q62n02j90R87l37o31N29j11m72N03M0k60M54j17n11K40N5j32
989a54L97j40l32M84j00n68M64O6m82O01K48q38K95M65r01J10R31m67j78N88o87
1010a98n49R44J35m87M38K2o88J61K82k02L08K34m26j68O8J6K08N2j91J34Nk93
$$ plain form
876 1219 -7 -737 556 -251 -749 825 166 -703 787 217 -1019 465 261 -1013 693 867 -1050
893 -1050 179 908 -1174 -406 1154 -351 -247 1075 -488 -995 595 83 -383 681 105 -460 284
910 284 -289 -545 605 162 -375 591 -60 -781 449 130 -818 550 706 -576 126 244 -919 24 745
929 745 -375 144 717 -619 -462 376 -426 0 1027 -154 -532 395 -336 -594 578 213 -177 629 -79
948 -79 -832 80 78 -175 711 295 -582 158 -56 -811 374 737 -296 191 318 -925 -235 737 -264 -149
968 -149 753 -217 -561 301 -201 -391 596 259 -372 157 46 -426 77 117 -143 311 194 -317 -77 -22 -154
989 -154 243 103 -229 255 155 -413 51 117 -365 236 484 -354 -59 406 -495 -385 546 79 -99 489 -198
1010 -198 -747 197 332 -155 283 305 -383 -222 60 -142 166 400 -26 -194 -126 -110 98 150 -41 93 98 -195
1032a95J60O8k19L29J64n21M8L95l86m3M78k44j95L92k51l85N52J98m72M0J72
1053H5k69J65K87k40j42J56q7m3J14J00M9j99k33K00J66o4J37n9m42J73M18l22
1075e0o2M55l06m04M37M3k99L76J06n80O6M66k12j63K63q2j98J67N4k17P1K41
1097A72o3k78R5K15k00q1L09p2k97K99jm73L62M84n38j69M25k95j79O20j12n23
1119c00L90J23n94K42N30l48j72K48k18j46M34P1l54oJ74p5j44J91J31j89q0J67
1141G5j53j10M08Km80J83L07l63RL57k77j15L87k52k70L84Q9k83J18K6j62J45
1163B5Lj29J82%j52J11j26j14M26k6m58K82J37m34K66L29m93O4M36n13j56O35
1185B95j27l57L04q0l22L69J38l13N8J41j19p4K1J46O4k13M0J05k67J46M07m95
$$ plain form
1032 -195 -35 33 -186 143 307 -214 -166 229 -157 -200 278 34 -161 231 -20 -405 147 345 -127 -87 85
1053 85 -184 -19 268 28 -114 42 -45 -88 26 126 175 -24 -257 -57 109 45 182 123 -319 -146 272 -50
1075 -50 -112 343 37 -367 70 113 -186 190 296 -284 -218 248 36 -127 136 54 -144 23 77 -140 -69 172
1097 172 109 -169 -74 141 -59 -140 169 97 -200 99 98 -375 -13 471 -67 -236 189 -106 -285 335 223 -300
1119 -300 90 213 -381 -139 391 43 -129 119 -99 -245 189 260 -94 -100 74 -1 -145 46 177 -12 -92 75
1141 75 -78 -188 220 222 -258 -75 232 -131 -122 235 -42 -157 230 -22 -292 92 181 -102 16 42 -120 25
1163 25 28 -101 81 81 -71 40 -86 -200 226 200 -258 24 161 -273 -7 322 -171 -107 329 -184 -340 295
1185 295 168 -189 115 35 -287 82 220 -93 -35 106 -13 -87 -66 80 144 -69 -29 76 -191 -45 362 -133
1207a33j78O79l12n41P56k6p29O76K27j025M88P49r53lQ80o93l24Q89m06n10Q60
1228C71q9p45M68K10m56L31J32m14J69J42k71J71Q0j59K05j19l56M22J17l83L02
1249A28J2m82L93K31n99L39L74o39J23L98n58K19N44p06m3O61n66r9P47o08k39
1270c70R17o01n46J061k44p81R48j17j007R95K89j246P19O74j225K78Q76j013
1288c93M7J066q59m51J030l69n33P87j55n55N66l9m77M00Q9k20J65k24m5M23l18
1309f5j00N25m79k45Q30m98n34J134k82j060J046J71j197R84N05j516O19J036
1327H74j441J65J312j204k62J347r74n99J539n41r83J257k10j068J129R0j139
1344g08R07L93j218N07O19r09L41O02q94J11O83o39k8O00m73j8M25n48M0N57m39
$$ plain form
1207 -133 -311 368 56 -485 271 245 -484 192 419 -606 -118 631 -322 -325 555 -138 -462 427 21 -489 371
1228 371 282 -463 5 215 -241 90 222 -192 -23 119 -152 19 99 -60 145 26 -330 92 209 -174 128
1249 128 140 -342 51 282 -317 22 396 -243 -120 278 -280 -61 483 -223 -266 395 -171 -270 477 -131 -370
1270 -370 547 -54 -600 461 217 -564 384 267 -740 255 544 -702 17 691 -534 -256 620 -393
1288 -393 -346 720 -139 -590 440 71 -462 325 170 -385 181 142 -335 65 154 -66 99 -125 -170 253 -65
1309 -65 -165 360 -119 -364 466 -32 -566 568 286 -774 272 443 -754 230 735 -781 -162 874
1327 874 -567 -402 910 -294 -556 791 -183 -782 757 216 -767 490 280 -788 341 431 -708
1344 -708 199 592 -626 -119 500 -409 -68 534 -360 -249 434 -205 -233 367 -106 -124 301 -247 -207 350 -89
1365h9%L72n43J12N50o45M0P38p46j49R01p59k56J257p70q46J441l14j189J415
1385E20O7j583J194O77j802P15J281j635M4J484j275m19J609q55q93J447k57j040
1403g21J046K2r75P76K61r02M73M31o52J65K50m14K16K12l43K46K5l28L19j10
1423cm06P21O5q15N70J83r84O87O56j132L43R26j276j56J305p95l49J287p63q68
1443h04J283k73j008J221J28j184Q70K71j347P26Q74j212K75R88j106k30J027
1460D99p02l25J157l43p54O24o8n67N41J64l35K80Ml88R0jJ0L65j60j43L12l68
1482a08l01N20j31j79P60k85q20O05O3p48Q39M66j030L75N11j253J79J274p54
1501a7k93J077p69q32J121j23q31J069L02j098K79L51p71L22P47n28n4M24n50
$$ plain form
1365 -89 -89 283 -260 -148 402 -243 -203 535 -211 -360 541 -218 -474 783 13 -833 608 294 -895 520
1385 520 587 -996 198 875 -927 -212 1069 -566 -522 962 -313 -732 877 22 -871 576 319 -721
1403 -721 325 347 -628 148 409 -493 -20 411 -241 -76 174 -240 -24 188 -155 91 116 -212 107 -3
1423 -3 -409 312 377 -438 132 315 -669 18 674 -458 -115 811 -465 -621 684 -111 -460 827 64 -804
1443 -804 479 206 -802 419 547 -637 233 504 -843 -117 757 -455 -180 808 -298 -528 499
1460 499 -203 -528 629 286 -468 156 88 -479 62 226 -109 171 175 -213 -123 -124 -114 251 91 -52 260 -108
1482 -108 -409 111 -20 -199 561 276 -544 61 124 -624 215 681 -349 26 537 -716 -537 737 -17
1501 -17 -310 767 -2 -834 287 164 -667 402 704 -394 -115 236 -535 -213 534 6 -48 376 -174
1520a74k87M51j8O9L38k59k98Q9j02K1L09l5K9J13l99j26K50j28J41L94l15j73
1542a10L21m16l11O85N3k97M62k23p07M38K66m72M63M38p25l5L20n78J63Q02m15
1563A22k82N10m06m47N96nl15O07J0p42J92K34l74K84M18l67p5J86l80r3M19M4
1585A36n1P3k12j17Q9KO4J25p1O5m3l01J10K63k18N8L09l12j28L23l14j91O02
1608B61j9m43L30kn04L48K81m44K05L71n08j37M02k03o9M01k12k41L26j07k85
1629b49K72P2j44J94p0k82J71J10j82J66O1j96Q4J3k26J83K02k12J7N9j88J08
1651c7J83k35K4K20k13n3K00j47j1K24j92j39K62m8j45J92p5j34K49r1k29K66
1673G1N9k41J73L4k99K37J33l29J12K71l19k6K74k38k8L31j86k32L01j9k10J87
$$ plain form
1520 -174 -461 -10 -28 41 379 120 -178 -89 -191 -170 139 104 133 246 -153 -279 -29 -157 -16 378 63 -110
1542 -110 211 -205 -516 169 222 -75 387 164 -543 -105 161 -311 152 590 -135 -170 150 -428 -265 537 122
1563 122 -160 350 -56 -503 93 88 -227 380 390 -352 -160 74 -300 -16 402 35 -40 146 -234 -327 92 136
1585 136 85 158 -54 -171 -82 -80 -16 109 38 103 60 -241 -131 132 -86 -28 281 -31 -159 164 -150 -341 261
1608 261 242 -201 129 127 -377 -29 252 -192 13 384 -124 -261 141 -62 -131 270 58 -183 143 36 -249
1629 -249 23 95 -49 145 75 -207 -36 74 -108 58 119 -77 7 20 -206 -23 179 -33 -16 43 -145 -37
1651 -37 146 -89 -65 155 -58 -111 89 -58 -69 155 -37 -176 86 38 -107 85 10 -124 125 34 -195 71
1673 71 130 -111 62 96 -203 34 167 -162 -50 221 -98 -124 150 -88 -116 215 29 -203 98 79 -131 56
1695E6Qj75J68K1j84R3Q0j33O7Mq6J62j2j88Q7O6j19J39L6k22J43J11k76N5K39
1720A40j66OJ56k53n6L15j11j48K56o9k01J59m0j39K64M8k43O5N7j63J54O7j84
1743h6J28Q4k52M5J77j20M8J30k66nK61j55r1K29j11j21J79q7j31K47Jk18R4M1
1767B1j01J27K7j66P6N8j13M6N5n2Q7m3j80J42R7j28R2J9k15J23J56k55P5K84
1791B32k67j01K31j44p8L25j20k81K60K3k36K00R7k25R9P0k35J05J91j17k6L9
1813D2j43O2J20j31N4J11j67pP2j09J03J70k05q2J36q8jJ93j14j01K03j56j68
1836b06K77J9j45J51p9k34K47R6k23J39P7k42P4J03j63J34J48k42k6J49j35O8
1858a3J72k20k5K15j89o7K62q7j24J99j47j80K97L5k10J49j6j92J61L7j45J68
$$ plain form
1695 56 64 -111 57 78 -106 -13 67 -66 1 5 -81 81 69 -119 -32 34 -85 54 90 -132 11 122 -154 -99 140
1720 140 -26 -20 136 -117 -173 142 31 -117 139 70 -131 28 -12 -151 113 161 -82 -17 40 -123 31 98 -86
1743 -86 42 126 -126 -81 96 -24 24 154 -112 -117 144 -11 -102 127 16 -105 74 -13 -144 103 104 -114 -20 21
1767 21 -80 47 74 -92 -16 42 -71 -25 30 -22 65 22 -158 -16 81 -47 45 64 -151 -28 128 -127 -52 232
1791 232 -35 -136 95 -49 -127 198 78 -203 57 80 -156 44 141 -84 15 85 -150 -45 146 29 3 42
1813 42 -101 -39 81 -50 4 115 -52 -59 13 -96 7 177 -28 -110 26 -62 -63 130 16 -85 118 -38 -206
1836 -206 71 90 -55 96 17 -217 30 126 -97 42 119 -123 -49 54 -109 25 173 -69 -95 54 -81 -13
1858 -13 159 -61 -86 129 -60 -127 135 48 -76 123 -24 -204 93 128 -82 67 51 -141 20 57 -88 80
1880H0L8k30R1L4j30K24N7l14J16J55l02J16K77k71JK30l24o5M12j50j69K57j63
1903c0j89L25m0k29K86k0k96J71O8j76K44N9l32J08J31j81J21J23k15J02N8k74
1925a86J53K04k28J00J01l56J16L39l26j6L75l35j75M22k07j87M84j50m50L82
1945F0N9l56L50R1m26K28J47m08K00L03l47N9J95l86J10L61k97n2L02k98p8L22
1967A39j95o2L52k31k18K92j08j00L51j79k47L24j13k55M14k0l19L21q6m02M16
1988G4J88m42K55J32n21K68L04m59J85L82n79j4M78l77mN32m52l04N99k23l51
2009c29N92j17m46M36om94M38K10m90K07J66m15K19K48l86J51K23l76O5K35k77
2030a46J48K39m08L0L24l16Q8L22l98l2M03m06r5N84k98k65M81l27l36O97q2n05
$$ plain form
1880 80 118 -112 -21 13 -117 107 164 -150 -34 121 -181 -65 212 -59 -58 172 -152 -217 195 45 -124 133 -30
1903 -30 -219 106 66 -163 123 103 -193 -22 46 -130 114 173 -159 -51 80 -101 20 143 -72 30 88 -186
1925 -186 -33 171 -57 43 144 -212 -96 243 -83 -99 276 -59 -234 188 -19 -206 278 128 -322 60
1945 60 119 -237 113 204 -222 6 153 -255 -55 248 -99 -40 155 -231 -121 240 -57 -109 193 -105 -183 139
1967 139 -56 -118 234 3 -215 77 -31 -131 220 41 -206 118 5 -250 164 144 -175 146 60 -342 74
1988 74 262 -180 75 207 -314 -46 258 -201 -16 366 -213 -227 251 -126 -130 402 -50 -354 245 22 -329
2009 -329 263 146 -300 136 130 -364 74 284 -206 1 167 -248 -29 219 -167 -16 207 -169 -104 131 -146
2030 -146 2 241 -167 -137 187 -129 -41 281 -117 -149 254 -152 -247 337 39 -226 255 -72 -408 289 207 -298
2052b98N15m4o45N27K38n75M17K51p68J84N01n00J41M92n94j04N24l99j29O11
2072C45k88k85M27k51k60N27r9l66L98o4l24L29j5l15L60J4l58K87M5l15L11L5
2094A38m16L33J62m78K94K33n39K37L06n66K15N40n99q3N40n22j04P63l89l75
2114c10O51l29n25P16M0n13N38j6p61M41L56n17K98L25o16N8L61m16J06M68l85
2135c0j07K85l12K3L58k65n3L19k93r0L15k59l1M18l23j81M53k41k48M95j94l41
2157c02N50j20m96N35N5n61M20J66o01M09L47o90J63M73n96O0O05n04j32N51m40
2178a08k98O90j48l42M50j84m64M87Q2l74L57O6m45K03J19k86K97J33l89J21J30
2199I7k98K17J62l34J69J62l97J35K70l32J21K79m44J8M36l80o1M83l44k02M97
$$ plain form
2052 -298 217 173 -472 55 293 -282 135 386 -382 -198 303 -197 -56 436 -158 -262 262 -137 -266 345
2072 345 57 -228 199 -52 -312 215 116 -250 148 84 -240 89 74 -241 119 133 -225 62 107 -208 103 138
2094 138 -278 55 217 -261 33 266 -273 -36 270 -296 -81 459 -140 -223 317 -205 -309 454 65 -310
2114 -310 341 12 -513 203 243 -270 268 252 -509 -68 288 -229 69 394 -222 -164 197 -219 -113 355 -30
2135 -30 -137 148 -164 -141 217 -48 -101 218 -75 -165 150 -109 -140 278 -45 -226 227 -14 -262 233 39 -302
2157 -302 248 128 -368 167 222 -339 81 247 -354 55 402 -288 -125 348 -248 -188 417 -87 -219 332 -108
2178 -108 -406 284 136 -206 244 60 -404 83 165 -209 148 214 -231 -28 91 -195 102 235 -154 -33 97
2199 97 -201 16 178 -156 13 175 -222 -87 183 -149 -28 251 -193 -175 261 -119 -180 303 -41 -243 254
2220B54k78k87N69j14m50M34J6m59M46J32n40K93K42n07J77L70m32O9L21m28j1
2241a83M51k80j26L56k56j61L59j43j83L45j05k70K39j6j70K84m8k67K20mk14
2262a72K53L1k39K10kl36K62J72l17J60J40m00J71K81l46M7L24l35r2L79k40j11
2284a60M16k26k94L79m4k60L18J0l62K71J02l33J95J71k92Q5J59k67Q9K21k61
2305h3K4J99j94l1J85j69PK51j99j09J85j23n7K44q9j43J81j01j78K58L1j55J58
2328I2p8k34K46R0k07J41M5k41J12J45k35J07J83k55j8K38j71k5J89j96q1L05
2350A52q3j63J79p8j71K35K4j64J57J1k39Q8J24j28R7P1j95M6J12j30J3R7q0L9
2374A4J05j68k1R4j13M5J76j13n3Q0j77l7K69J2j23P3j02j50J98P1j19J06K1k16
$$ plain form
2220 254 -24 -311 258 144 -306 128 144 -315 131 263 -277 16 258 -249 -72 298 -134 -65 256 -172 -183
2241 -183 268 -12 -138 218 -38 -199 160 17 -166 179 74 -196 43 27 -143 141 93 -174 46 42 -172
2262 -172 81 112 -127 83 81 -255 7 179 -138 22 162 -238 -67 214 -132 -85 239 -96 -188 191 -49 -160
2284 -160 256 30 -264 115 71 -189 129 139 -223 48 150 -183 12 183 -109 -24 135 -132 -43 178 -83
2305 -83 -59 140 -54 -85 100 -69 -62 189 -10 -119 66 -57 -114 130 41 -102 79 -22 -200 58 89 -66 92
2328 92 14 -220 26 116 -91 50 95 -146 -34 111 -124 -17 166 -89 -107 131 -40 -65 124 -72 -153 152
2350 152 69 -94 85 7 -164 71 95 -69 88 99 -140 -52 72 -56 41 112 -83 -37 75 -55 -42 55 -25 14
2374 14 119 -49 -70 24 -89 -44 132 19 -34 46 -131 -168 101 113 -10 63 -39 -189 9 80 -39 67 88 -128
2398a28O9J03j05R2O8j79L9J33j21k6R9j03K3J70j06r1Q4p0m9J74Qp4N9r7j18
2423a46J43Q2n3M6m3j25Q8M9q9N3O0q1K9L4j08L7O7r9M7J24r7n9K8j05N7J90o6
2450F3r2N8r8n0J60K3q1P3l9j48R6P5m8L1J1q6L3P3q5jM0k1M1L3p1mL0o0J2R2
2480F0k6j0K1j22KJ39k3m2M3m6m1R3l9n4R1lq7M9Rn9O7Rp9O4L8p4nK3l5L3O8p5
2512a1l1O7m8oO5l2k1M6m3l6O3J9l7J1rj2L5k3j0J3PLRl5KN6l4l9O2j8m1P6k4
2545B4p2P7J3r4K2R3o8pM6o1j5J01m5n1N7ko4O3J1p0K8K7n9K0N9Jn0j7OJ7K2J8
2577C0l0m0J0N2l3oM5l1n2O0K5n8O5j4r5M4Q2m6rKm5K8P4m3l1L9n0k4R0Jl5M0
2609D5p4n0R0O7p4j2Kn2N1Q6o8m2M6m2j4P4J0l6k5j7oM8M9k8o5j6M0M0mOk7p5
$$ plain form
2398 -128 -59 44 -61 31 99 -80 -41 92 -29 -55 44 -59 -36 134 28 -63 21 -49 -98 76 84 10 69 -28 -146
2423 -146 -3 79 26 72 29 -96 -8 41 -48 5 65 -16 13 47 -61 -24 43 -56 -9 115 18 -41 -13 -118 -61 129 63
2450 63 -29 29 -69 -119 41 64 -17 56 17 -131 -35 40 -8 23 34 -52 -19 54 -31 -32 8 -13 28 61 -10 -14 16 -44 -32 60
2480 60 34 24 45 -77 -75 64 41 -1 42 -4 -45 48 9 -45 46 43 -44 5 14 -45 22 31 -48 16 54 -20 -25 -2 -37 -4 64 -11
2512 -11 -42 25 -23 -29 36 4 -17 29 -14 -50 13 32 -5 6 -3 -15 20 -3 -13 0 7 10 19 -16 -14 42 8 -31 31 13 -28 48 24
2545 24 -48 29 42 -52 -30 63 -5 -12 34 -27 -42 59 14 -37 20 18 -46 17 28 -42 -14 13 -46 -26 33 34 -16 -33 -27 -10 12 30
2577 30 0 -40 -30 22 -11 -17 28 -3 -55 5 30 -28 37 23 -72 -28 54 8 -1 1 -44 -16 58 15 -16 23 -27 -51 39 40 5 45
2609 45 -29 -79 11 78 4 -8 -6 -58 -7 79 11 -31 15 -27 -41 33 43 7 -18 -35 -41 7 56 28 -37 -53 -13 27 23 29 2 -73
2641g3K9O5l4J6M2r2l7J20%m9N2n2q4J11Q5j09j0M3p8L0J08o3n3O9n9n1R9O4p5
2670A4k4lj7M7N5n3m3rRM0J6k1ql3l1N5M8rj5m3n3O2O8m1j4rn0M3N6l1j4J8n7
2703d7oQ3ok2K4o5l3J08J4o4L6l7m3R1M3j06K1L9q8M7P9l9l8L6o7qJ15pq6J5K
2734il2P6L5q1LLm1K9N5j7j8l8pL7K7mj4l5k0P0J7p0M1on7L0N8n6LO4q5l5J24
2767D7j3q5O0j3n4R2J6r3K9M1o2M8M5p1lM6o1jJ09p3k8M4m3j7J03k0q7M5J4o2
2797d7O2L9p4L1Jn7L1L9k2j3Pm8M8K5m8J7K2m8J1L5m1K4L5n5kM9m1JN3o7KP9o2
2830a4n2J11k5p4J05j5j31J21M2j12L7P3j10J3Q2o5pQ3n1n3O7k9j0P0m5m2O3k5
2858Gn1P2Ln6N6k4m4L7K6m4L7pn1M1j3m2Q0J8q5K7J6o9P7O1j22J9O7q1mR6m6l8
$$ plain form
2641 -73 -44 21 -13 3 45 -47 -84 36 36 -13 39 -13 -97 14 99 -10 -20 23 -55 -25 83 20 -33 36 -23 -74 25 89 14
2670 14 -10 -13 -30 17 72 19 -24 -33 -24 16 32 11 3 -30 -61 -6 42 33 18 -25 -78 -16 52 11 -3 -12 -62 -19 37 6 -8 10 -47
2703 -47 -53 30 24 2 26 -39 -72 36 50 -14 22 -15 -58 33 76 -30 -9 30 -58 -11 68 29 -9 27 -40 -48 67 60 -26 -11 -9
2734 -9 -41 35 70 -11 -8 -5 -46 -17 38 21 3 -35 -42 -5 22 18 4 -31 -51 19 36 -34 7 1 -56 -26 32 -24 -21 43 -42 -77 47
2767 47 34 -51 9 -4 -58 34 50 -43 -14 27 -35 13 58 -13 -16 30 -31 -32 77 4 -24 20 -23 -40 63 43 -44 1 15 -47
2797 -47 15 54 -20 11 12 -45 -14 25 3 -10 -3 -51 -3 22 -26 -9 13 -35 -24 11 -30 -6 29 -26 -28 21 -20 -19 34 -33 -31 48 -14
2830 -14 -66 45 20 -54 51 36 -95 26 68 -44 -7 66 -44 -31 51 -14 -21 62 11 -42 25 -4 -14 56 11 -31 32 7
2858 7 -44 28 31 -25 31 7 -37 0 26 -18 19 12 -39 2 -11 -53 27 45 -40 -13 3 -66 11 72 -50 -31 36 -45 -49 47 1 -37
2890c7P7o7m0J23k7r0R2k2p4J28nj33P7M2j09O8R3j09j1N9q3oJ22k9n4K7k6NM3
2919C4l3j6M7k8KM0p6j6O4k0k1J00n2q1M0k2jJ24k1j26L8mn9J13P0j38M5J7j20
2948a00O1J26j01k2Q7p9j6J11n4o2O2pj8Q1l6r9O4Jk7R6K6j21oK3n0R1P4q6k7
2977hJk9M1M6l4qK8o0J2M6q0J9O3p0M8O6r4p9O3MJ8J09p0j20M8kj9J24Rj02L3
3008Ck0q4J10P9j12J6M0r3M6P9r2k8J03k9j5N6o7m4O0rJ5P0m8p2K5k2PJ12j8j01
3038c3K8Ol3O2J6o0M1j0n7N3K3p8M0L1m8N5J7j21J3P8m5K0Q2r6o4Q8j8l6R5j1
3068C8q8K5jk6Q4Ko1K4Ol4L5K9p2L6M0p1L7L1n3JN1m2K4L1m8k2L6j7J5N0p1k3
3100c4O3k7l4P1l2l9N1om8N4kn7N1J1m6L7%o7M1M4p2L7M3q7K2O8p1%P8o6k5P1
$$ plain form
2890 -37 40 -27 -67 56 29 -61 31 9 -65 63 58 -75 2 44 -65 3 96 -13 -24 35 -48 -54 68 39 -15 12 -14 -9 34
2919 34 1 -15 32 4 6 46 -30 -46 18 -2 -23 77 25 -56 -16 -38 -39 85 64 -62 -24 -28 -87 26 96 -42 3 20 -100
2948 -100 -39 87 -14 -36 51 -28 -44 67 13 -49 13 6 -12 69 33 -66 -2 -1 -28 68 94 -27 -33 -10 -60 31 105 19 -8
2977 -8 -7 -36 5 51 17 9 37 -23 -11 35 -45 -26 37 -33 15 81 -13 -92 -29 -25 -7 102 32 -88 -40 -42 -61 63 72 -30 3
3008 3 -17 -101 9 88 -24 -8 32 -61 -15 64 -28 -56 47 18 3 59 -8 -52 8 -1 14 84 36 -36 -11 -33 -26 86 68 -33
3038 -33 -5 1 -32 30 46 -14 27 17 -40 13 36 -42 -2 29 -19 36 53 -68 -55 23 -22 -2 80 -16 -80 8 -10 -46 49 38
3068 38 -50 -25 -26 -52 32 34 -27 -3 3 -31 4 33 -39 -3 37 -34 3 34 -19 -18 33 -9 15 46 -2 -24 12 -5 10 60 -11 -34
3100 -34 29 2 -32 39 7 -32 19 13 -35 19 17 -40 11 22 -24 13 13 -54 -13 31 -41 -4 39 -48 -26 42 -29 -29 49 -17 -42 29
3132B9k3l3O5l4m9M6K7m9K3Pk3L3mm7M8lk6L5ll3L2ol3L9L8p5K0J4n3N1M0o1j7
3165b5N8m6KN3l9k2N7l7n3P1Rp1M5J1m6M3Kn8K3J9k8J9J6m3J8K4l9L9L3n9OL8
3197B0n4J1O4l3l9N7l0j9L7k3k5M0Kj4K0qk7L1qj7N4j1o3L4Ok1N5rp2L8M0n5L1
3230A2K5o6QO3o1jP5o4l5M7jj5M2m0m1K8L1l1K1K0m8K4PqK7rl7J8J6l3L8J4o0
3263c4J8L2l6K8K0n8RM4k7mM4k9l1M0k1pM8l1l9L5J2k6L4j0l5J8K1l1L5ol9K2
3295dKj3L1Jo0L1K1m6K2K5l9j0N6m1j2M3k0j8K5Kk4M1j4l5L2j3LK9j9k1L7Ml1
3328a5K1J4m0L1K0m9K1L7m4j0M5k6j2M7l5j9N0j9l2M6k3k1J6Kj5K7ol7J8J2k5
3359b1K9%l1K1ok2L4Ll4K4J7n1L1K7m0KK6k6rM8k9l3N0qk2K4Kk2K7j1j9K8Mj2
$$ plain form
3132 29 6 -27 38 4 -45 1 28 -21 2 9 -14 19 15 -32 16 13 -13 22 19 -14 18 12 -21 18 56 -19 1 15 -38 13 53 -8 -25
3165 -25 33 -13 -11 42 3 -19 38 1 -52 19 28 -43 2 13 -33 10 12 -46 -23 -4 -32 -13 3 -40 -22 2 -37 2 35 -24 -18 20
3197 20 -34 -23 41 8 -31 26 -4 -23 14 -9 -34 6 8 -6 14 6 -21 10 2 -15 39 28 -35 -1 5 -16 39 30 -42 -4 36 -19 12
3230 12 37 -29 -21 42 -19 -20 55 -9 -44 3 2 -13 29 -11 -52 -24 7 -24 -3 17 -31 -7 0 -8 19 10 -27 -9 7 -26 12 26 -34
3263 -34 -16 16 -20 8 28 -30 -21 23 -4 -8 36 7 -24 16 -5 -12 36 5 -34 1 13 -13 21 11 -24 -6 15 -16 19 13 -26 -4
3295 -4 -2 -15 16 17 -43 -12 9 -37 -15 10 -29 -39 17 -24 -36 7 -13 -31 -6 -4 -28 13 -1 -36 -4 -17 -14 15 -4 -25 12 16 -15
3328 -15 6 20 -20 11 31 -18 3 40 -4 -14 31 5 -7 40 5 -14 36 17 -15 31 8 -13 3 5 -10 17 11 -26 -8 4 -21
3359 -21 8 8 -23 -2 -8 -30 4 7 -27 -3 14 -37 -6 21 -19 -17 9 -17 -26 22 -7 -40 10 2 -20 4 6 -16 11 0 -19 9 13 1
3393AOQk5M0ml8J6J6k8J4Lj2J7j0mJ0J9l0j0K4j8PPkj2J0j2LJ6j3j7J8oj5K7p
3429arJ1j5j6M5j9j8K9rj5J1Pk4J7K2k5lK1j0qK5j3j9L1qj1kJ2kJ1j3%RojJ7j7
3466DoJ7j5jNJ8l2J6nqJ1J1j6MJ1k4J2KqKPk3j2L3j4QJ0k8NL2j6k9K7pmNJk4K2
3505iJ4k1J1K7l1J4J6k9NJ1j2oK2j8J0Nj0LJ3j3%K2roPk5J6K2k3j1J7j0pJ7ok5
3541a9K4%k8K4J0j9KRk1PK8j8nJ7j3j5J6oj6K1JmJ4j1oKJ1pK0rk4J2MlJ1qqJ6
3579IjrQJj1PKMj2L0k9NMnNJ2l8QK6j8JK7l0j1J8j3mJ6J4k6KRj8J1J4l7J2K2j7
3618a2mPnJJ3j2lJ9oj4J6RqJj2OK2j4LKj7qK7j2kJ2Qk0LJ0j9J8K4m0JJ6j0KJ2
3657A4j9qK3j3kJ8j0j4J1lj5L0j0j1%J1j5%OjJJ4k6%J6j1KJ3j7PJ7j9kJ4Jk2J8
$$ plain form
3393 1 7 15 -10 30 26 -12 4 20 -8 6 9 -3 14 4 0 10 29 -1 -11 13 -5 2 9 7 -5 5 -7 -4 12 -1 -18 0 -6 -21 6 -1
3429 -1 -10 1 -14 -30 15 -4 -22 7 -2 -17 -6 1 -23 -6 16 -9 -12 9 -1 -9 16 3 -16 15 7 -4 -6 6 4 15 2 2 11 5 4 21 4
3466 4 -2 15 0 -1 4 22 -10 6 1 -7 4 15 -1 3 14 -10 2 4 -4 -2 5 -18 -30 3 -11 -3 7 -21 -16 16 0 -29 -2 -9 -13 -8 -7 -31 -9
3505 -9 5 -16 -5 22 -9 5 21 -8 -3 8 -4 -10 12 -6 4 9 -1 2 15 2 2 24 15 9 16 -9 7 29 6 -5 12 2 -5 12 6 -19
3541 -19 5 5 -23 1 11 -8 -6 3 -18 -11 17 -1 -6 11 -2 -17 -1 -7 -23 -2 -1 -5 9 -2 -8 -6 5 -2 18 9 -15 -3 1 -2 9 1 -7 9
3579 9 8 -1 7 8 -3 4 6 10 -2 28 -1 4 8 3 8 20 -18 -10 16 -2 -1 26 -4 -15 3 -10 -14 2 16 -10 -8 1 -17 -6 8 -29 -17 5 -12
3618 -12 -16 -9 -14 -13 0 -12 -15 4 -2 -16 0 9 1 2 -10 -4 18 4 7 9 -8 -16 11 -1 -3 9 17 -3 0 10 -9 9 33 -7 -6 10 0 2 14
3657 14 -5 -13 10 -3 -5 13 3 -11 0 -3 -18 12 2 -9 -9 2 -13 -13 -7 -8 -7 7 -19 -19 -3 -14 -12 1 -16 -9 8 -11 -13 1 2 -20 -2
3694bpj1J4Rj6PJ3nj%QJ0j7oJ4mj6K9Kl5K0J8l1J1K7l1JLj6NK0j4rJ6j6POj4r
3733b0K6j7qLJ1rJ3Pj8kL%rK0j0Oj1LkJ4j4LkNmL0k2lJ8qj7J3j1QMRj3Pmj0J9
3774HMj8J3Nk9K5Jj9J1J4l0J1J8k3kJ9qplKLOj8KRllMk2KJ4J4j6J8nk0PJ5%oJ6
3815Ij5MOj5OJ4k0K1Rk5LJ5plJ8j3jJ0j3qJ5J7k1JJ6l0J5Qj2j1K4k8OjMMQj7j0
3854a7J6jlLjqJ4Qj3lj6OJ6k2J7Oj1j2J2oRJ0Jj3MJjRJ7k9J6Ol3J8J1KJNJj6K0
3895B4k8NJ3Rj0poj1K6j5MK0j5k3KrJ2J1J7m5J7J3j3qJ8j2lK0p%QpoMLMJ1l0r
3934b3K0LJ1Lk7jK7qoJ6kj6N%nJ4KrQJ5j1qOk2J4K5j7pJ5k3nJ7%lKpj6J7%mJ5
3975A5k2nnJ1mJ2j7nROkJ4j6k%Mj0K8k4mlK2rLNk1J7J3j3KK5k7kJ0NoJ6j0j7J7
$$ plain form
3694 -2 -9 -20 -6 3 -13 -6 7 2 1 1 9 19 2 -4 10 6 -10 19 21 -14 6 24 -7 4 31 0 1 4 -12 -7 13 -1 -10 6 -10 -3 3 -11 -20
3733 -20 6 -11 -19 -16 -5 -14 -1 6 -12 -14 -11 -11 -20 0 -10 -4 -15 -12 -14 0 -14 -11 -13 -8 -12 18 -4 -7 11 3 -14 -1 -12 -4 0 9 -4 3 -1 -11 8
3774 8 12 -6 7 12 -17 8 9 -10 1 15 -15 -4 14 -9 -11 8 0 -7 -10 -8 -5 1 -17 -15 -6 -9 -12 -8 -30 -28 -14 0 -16 2 -3 -23 -16 -1 -1 -7 9
3815 9 -6 -2 4 -11 -5 9 -11 10 19 -6 -3 12 5 2 20 7 6 16 3 -5 10 27 6 7 23 -7 8 16 4 -7 17 -11 -5 -6 -2 2 10 -7 -17
3854 -17 -1 -2 -5 -2 -3 -11 3 11 -2 -5 -21 -15 1 -21 -4 2 -9 -21 -9 -15 -6 4 5 -8 -4 -3 -4 5 22 -7 9 15 -18 0 11 13 14 19 20 4 24
3895 24 -4 1 14 23 13 6 0 -11 15 0 4 24 9 -14 -12 -21 -9 2 19 -26 -9 4 -9 -17 1 -11 -14 6 -1 -1 7 0 -6 -2 1 5 16 -14 -23
3934 -23 -3 0 11 14 -13 -14 13 5 -1 15 13 -3 2 2 -3 11 13 4 12 27 16 8 14 -8 6 31 14 7 22 -1 -6 11 11 8 10 3 -13 4 4 0 15
3975 15 -7 -12 -17 -6 -10 2 -15 -20 -11 -5 -7 7 -9 -11 -11 -7 -17 11 -13 -17 -20 2 -7 -4 1 -20 -3 10 -3 -1 24 -3 -5 5 10 4 20 10 -7 10
4015A0J5j5lPj6MJ8j3j0kLkJOJ2j0j3MNOj5Ok4J7L0k9JQk2MJ2l%J2j3oLRj6J6
4055cojNPk0RMnNJ7k2j2K6j3JK2j4Nj1%jL4k4j0K7k2rK8Kj9oPLlJ3k1%J3pJLn
4097bj5PjJ8nk5K6nj6J7Pl5OK8k2jL1j7m6L8J9k3J9kl5J4M6m4K4jj1rK9j1QjL
4134A3k6QK2olj8%J2nK8%l6J5K0k7JK5j6j9K9j0j3J2Nm7L3K3k7Qj0j3J1K5l0k
4169a8J3j5J5J3k7J7lk2J4K1j2j7L6l0k1M0J1k8K1ok7L0K1l0K0Rl3NK9jl5J6o
4202@KK0pjlj6K1kk0J7J1l8mM9k9j0L5k6k9M9lm1M2jm7K8J9l9OK1k5nL0kj5Or
4239a6lJ8Oj3Pj6LK0j3KK6j5j8K5j2qL4j4j8K3J1k7J2J0k1kJ7j7PJ7l3J3%ljQ
4275Ij7MK5k0JOj7j0L3k9j2L7j1j6J7j4k6M6%m1K2K9m1J6J7l1OK5qlLj3PnJ0J3
$$ plain form
4015 10 25 10 7 14 -2 2 20 7 -3 -5 -2 -4 -3 3 15 5 -8 -4 1 7 -8 -2 -26 -9 21 -8 -7 1 -21 -17 -5 -8 -8 4 -9 -15 -12 -3 -19 -3
4055 -3 -9 -10 -5 2 -18 -9 -5 -10 -5 12 -10 -22 4 -9 -8 14 0 5 -6 -6 -7 27 3 -7 20 -2 -11 17 19 0 -6 1 4 1 14 -7 -7 6 -1 0 3 -2
4097 -2 -17 -10 -11 7 2 -23 3 -2 -18 -1 6 -29 -23 5 -17 -18 13 -4 -50 -12 7 -16 3 1 -34 -20 26 -18 6 5 -6 -15 14 3 11 10 13
4134 13 -13 -5 17 11 8 -10 -10 2 -3 25 25 -11 4 24 -3 -2 23 7 -12 17 7 -6 6 11 -36 -3 20 -7 1 -9 -22 -11 14 -16 -18
4169 -18 -5 -20 -5 8 -19 -2 -5 -27 -13 8 -4 -21 15 -15 -36 4 15 -13 8 2 -25 5 26 -4 16 25 -8 -3 26 25 -10 6 0
4202 0 2 22 15 14 11 -5 16 14 -6 11 22 -16 -20 29 0 -10 25 -1 -30 19 16 -25 17 16 -31 -3 16 -23 -17 4 -21 -26 4 2 -13 -7 -16
4239 -16 -19 -1 5 -8 -1 -17 -14 6 -7 -5 21 6 -12 13 1 -7 27 13 -5 18 29 2 14 24 3 1 18 1 8 25 -8 5 5 2 1 9
4275 9 -8 -4 21 1 2 8 -9 -19 14 -15 -27 10 -1 -17 0 -14 -40 6 6 -35 -13 16 -25 -9 8 -23 -17 8 0 -3 0 -13 -6 -11 -1 12
4311A2komMmJ0Kk2J1J8k2RL4j5l8K0Nj6K4Jk4MK1k4J7mk3JJ2Mj0J6j0pjJPJ0k4
4350a3rK3pLQk8jK3Mj5J2j1rJ9Rk9K1Nj3OJjololK7kJ5j2j3PQmJ5Nj7j8K3j8J4
4391A0J2k6rK5J6l1Qnk1K3J9k7jJ0j6LJ1NrLk3rL0Pj1oj3J4kj3J5JqMJ2njJ5l6
4430b9ML8Jk1Mml1M0J7rjpj4J5RqNJ0k0LJ6j6jJ1qkK6j2k5J5pnK1J1l2norL2Q
4470A4j6j3lJmK0pooNQpljJ6j1J3J2k4rJ6j2PL5j9l0K2pOK8k1k0J7Qj6J5J7k3
4508BPRj4mJ9k4NpJ8Lj0j5nJ1LJ2lj7j8K2pNK9k5j0MpKJ6kj8jK0kjKj4QkMQmj8
4551a9LQj8L7Ql5rL8k3ML4k9k4L5oqJ7J0l3J9J1k4K1j1j9J3K4kj8pJKJ0qNj4n
4588a2J4Nj8J0%j7mJ6j4J1J5k1k0K6Qk0K1Nl7K2J1k0NJ9nj5J4%pOnJK9k2rK0j5
$$ plain form
4311 12 10 4 0 4 0 10 12 -10 1 19 -3 6 40 25 -13 7 12 -4 20 21 -3 1 22 -2 15 11 -12 -11 1 5 -5 11 1 -6 -7 -6 1 11 -13
4350 -13 -22 1 -6 -3 5 -23 -24 -1 3 -12 0 -11 -20 -1 8 -21 0 5 -8 -2 -1 -2 -8 -11 -17 -20 7 5 20 8 -5 2 10 6 21 26 9 -9 14 -4 10
4391 10 22 -4 -13 12 28 -3 5 0 -21 2 21 -6 -7 3 -13 -10 1 6 -3 0 -23 -32 -2 5 -6 -12 -25 -11 -13 -26 -11 -10 -18 -14 -2 -7 -8 7 -29
4430 -29 -25 13 14 -7 -3 -7 -38 2 19 10 9 2 -12 3 12 4 9 19 -1 2 18 2 1 12 4 2 28 16 -9 6 -1 -6 15 26 -6 -11 -17 -26 6 14
4470 14 -2 -15 -18 -17 -21 -1 -8 -14 -20 -15 -7 -14 -17 -18 -2 -13 0 12 -12 -21 -5 -17 -10 25 6 -24 -2 -9 -3 25 4 -16 1 9 -7 8 25 2
4508 2 9 18 4 0 19 -5 0 -7 11 14 4 -11 -16 -5 -2 10 7 -10 -28 -6 -13 -8 21 -4 -14 -10 -17 -15 1 -1 -19 -20 0 -2 -3 -1 -15 -7 -9 -5 3 -1 -19
4551 -19 -16 -8 -26 11 19 -16 -25 13 -10 -6 28 -1 -25 10 4 -4 13 23 -10 9 20 -4 17 6 -13 0 24 22 4 -3 -2 0 10 2 7 -7 -12
4588 -12 2 7 -11 -1 -1 -18 -22 -6 -20 -9 6 -15 -35 -9 -1 -21 0 5 -32 -10 1 -19 -14 5 0 -15 -1 -1 -8 -2 -7 -6 23 1 -8 12 -3
4625cJJ8%j6J9j8j1K0Mj1J9j6l4K7K4j4oKj5POj7J4QroRjj1qlJK1Lmj3kMJ5np
4666hJ3j5jJ2Jl6L9Kj3RK1m5J2Rj8J0K7k1j8L1MKm%k1K4lpMMlkrJL0k5mJ6j6j0
4706hJ4Kj7J9j0j0J4Lk0QJ6k6PK0k5%J4%j7K2k1jQK2k8MJ2j3J9lj4J1Pj5NJ6j2
4743CORk2J1J9j9JJ4j5jJ7j5j2L3j8pRj9J8Pj2PLlk7J8Lj7J5Rk2kJ3%mNj1nRj1
4783a3QOJ3j8j1PJK0j7rJ0Pj4kJ%J2Rj0mJ2j5RJ5jkroJ4jJnnnPJ5nj1JnPK0j1
4826A6k0K4j9rK7Kk0Jkk1L3mj7J2%j5QkrPMlkJ4rOj7ROkMnj4J4J7Ok5KPljL1k3
4869Hj1NNlK2Nk5j0J6mLJ2k8jOJ0j2J4jNlj4R%pnkNkJ5j2j6J3kj2K5mk0mJ8qN
4911eRj7k4K9PQnlj0JJ5O%j5J0mNJ0J0j7oNj0J9J4l1j0J9J0pPj5k5K7Pj2K3mj7
$$ plain form
4625 -3 -2 16 16 0 19 1 -10 10 14 3 22 6 -28 -1 23 9 3 5 -10 -3 3 -14 0 8 -1 -7 2 1 -10 -18 -21 -20 1 4 0 -13 -15 -11 4 -1 -8
4666 -8 5 -10 -11 1 2 -34 5 7 -6 3 24 -21 -9 0 -18 -8 19 -2 -20 11 15 17 13 13 -8 16 13 6 10 14 11 9 0 1 31 6 2 18 2 -8
4706 -8 6 8 -9 10 0 -10 4 7 -13 -5 11 -15 -8 12 -13 -13 1 1 -16 6 -15 -16 -8 14 -14 -10 2 -11 8 5 -9 2 9 -6 -1 15 3
4743 3 9 18 -4 7 26 7 8 22 7 6 23 8 -4 29 11 4 13 -6 12 19 7 14 17 14 -13 5 8 -9 6 15 -7 -9 4 4 0 5 -6 -11 -2 -13
4783 -13 -5 1 14 -4 -15 -8 -7 13 -4 -13 -3 4 -10 -12 -11 -11 1 10 0 -4 8 -7 2 17 16 14 5 -1 13 12 13 8 3 -2 5 20 15 4 5 0 7 27 16
4826 16 -4 20 1 -8 19 21 1 2 0 -21 12 8 -9 3 3 -12 -4 -6 -15 -8 -4 -7 -9 5 -4 2 -15 -6 0 -2 2 -3 -17 -3 14 20 -5 -3 4 1 0 31 8
4869 8 -3 2 7 4 26 31 6 -4 12 8 11 23 -5 -6 0 10 -2 12 11 16 13 -1 8 8 1 -4 -6 -1 -3 12 0 -16 -3 -5 -17 8 4 -16 -20 -2 -10 -5
4911 -5 4 -13 -37 -8 -1 7 2 -1 -11 -10 5 11 11 -4 6 2 7 17 27 10 4 9 -1 18 32 1 -9 10 20 13 20 5 -20 7 14 2 25 21 4
4950Dj7J9onPRj8RQjj7rNNJ1mj6NMQol%j3lJ7J5oMj4j6J9J6ommKj4L0j1P%j4Q
4994EoJ1Kjk0J1J2j2J1Nl5J2K1rjOJ1m1K9Mj8lJ7k5%K6j0j4KMLQj1onNNJNqKj3
5036b0kJ2RJj2%jJ6lj3J9j2LJ0J6l3J1J2j9J0K8j9j3K2pj4J3Rk0OQqKjk2J7J7
5073B2j5qK%Rj0rK8j3l3J9opK7Nl6NJ5qROj2nRjkQjj0JlRJ1jj5PN%K1k1qJ0lp
5117fJ9Ok1QJ0j5J2J6k3j0L3ok8PQk2L1kk5PJ5l0J4RkLj6j2lK4rMj2MPJj2R%r
5157a6J0Nj3PK5l4j3L5pj8J6NoRJ0l2K2J8j5mJ0j3J1ok6J7JQj0%K%K2k3KJ8k3
5194fPJ3j9PJ3l0lJ5Nj0NJ0k4J2J2k2JJ5j1pJ0oJJ9mrj0J7LppJ4Pj7RJ3k8J5O
5233IKk0K1J3l1J5Rk5K4oqJ2Oj7qJ5MqQkj6RJoNkoOpj0J5rjJ0j3lP%j8K4J2m8
$$ plain form
4950 4 -13 6 0 -5 2 11 -7 2 10 9 -8 -17 -12 -7 4 0 -16 -11 -7 1 -5 -8 -8 -21 -24 -7 8 2 6 -8 -24 -5 11 5 1 -3 -1 -15 15 4 11 11 -3 5
4994 5 -1 10 12 11 -9 2 14 2 13 18 -17 -5 16 7 6 12 23 -18 11 15 -3 -6 11 -14 -14 12 2 -12 -10 -6 -3 5 -6 -12 -17 -12 -7 -6 -1 -9 -7 -20
5036 -20 -22 -10 -1 0 -12 -12 -13 3 0 -13 6 -6 -3 7 23 -10 1 13 -6 4 32 13 0 22 15 1 14 23 3 9 17 9 11 10 -12 5 22
5073 22 7 -1 1 1 10 0 -9 19 6 -27 -8 -14 -21 6 11 -25 -20 -5 -13 -4 2 -10 -15 -6 -7 -9 -1 -2 -12 -11 -14 -5 6 5 -10 -3 2 2 23 2 -6 4 1 -6
5117 -6 13 19 -2 6 16 1 13 29 6 -4 29 23 -5 2 10 -12 19 17 -8 -1 14 -16 -2 7 5 8 -8 -20 -23 1 -8 -4 -16 -12 -5 -4 -16 -7 -7 -16
5157 -16 -6 -1 -14 -7 18 -16 -29 6 -1 -19 -3 2 -4 5 15 -17 5 23 8 4 14 1 12 6 -20 -3 -2 6 -4 -4 -2 -2 20 -3 -1 17 -6
5194 -6 1 14 -5 2 15 -15 -18 -3 2 -8 -3 7 -17 -5 7 -15 -14 1 -10 -17 -7 -13 -12 7 3 -6 -16 1 4 -3 -10 4 11 -6 3 16 -12 3 9
5233 9 11 -9 12 25 -6 9 18 -7 17 11 3 15 21 4 -4 11 15 7 15 13 -3 6 7 1 6 4 -2 4 -3 -13 2 -7 -8 2 -11 -14 -7 -7 -25 -1 11 -37
5275c7L2Jj5K2J7m5OL8l3kJ9mj4K2oj9L2qnj2J9mQokj%kJ6rj9L1kj2J0J7k4J0
5313A9Ol4RJ4k0NK4nj9Rj4mJ2J2j4mjoK%J3jj5nPj0J6Kj2nJ3J5k6J9K0m4J8K6
5351B2l9JK1qk4M5%k2J0oLJ7Ok5J1%j1qK9mNrkjj5NJ6j7j2J7Rj7kLj3J2K0k7j1
5390b1L6k6j0K1njLj6jK0qkOjlLLk4QJ5LlJ4l1J4J1j2J1J5j5qJ6rmK6qk0QK1k0
5430FJ4rML%j8PnJ5mk0ML1j1k8K5k4QlMj5K5kk1J1J3k4LJ3k7QL5l1j5L4qj6J8
5468@lnlJ9j8oK7k1J9Qj9mQOmlJ2Ppk2K3Jk1K0p%QPj5j2L1k9j5L1mj1K9k0l1L9
5508A5lk6J9j3l0M0J0l2QK0k8RJ1Jj0K5m2LK3j5J3opKJ3Kj0J2kJ0jj5mJ8j3mK3
5545A6j0KJ2j6j0J9Lk1J6%k2J1J2mRKk5lL8k4NJ2l4j5M7j5k4K6k2qK1%j0lNk0
$$ plain form
5275 -37 -5 -4 -19 3 20 -25 -19 19 -14 -16 3 -1 -15 7 1 -18 14 6 1 -11 8 4 12 6 4 3 3 1 17 8 -11 20 18 6 16 33 9 19
5313 19 25 -9 0 14 -6 -1 23 18 -1 8 -6 -10 2 14 0 -4 -5 -11 -9 -9 4 3 -12 -17 -10 -20 -4 -2 -14 -19 -6 9 -17 2 22 -22 -4 22
5351 22 -17 -16 5 -3 -27 18 18 -4 6 0 3 20 26 1 12 12 1 -7 22 18 23 14 12 11 -4 1 17 0 -12 5 14 -3 -5 -2 -15 -3 17 -10 -21
5390 -21 15 -11 -21 0 -5 -6 -3 -19 -20 0 -8 -10 -4 -5 -8 -5 -2 -26 -18 -3 0 -3 11 -20 -6 5 -7 4 19 4 -4 12 3 -1 25 17 -3 5 26 6
5430 6 20 11 15 18 18 0 7 2 17 13 -7 -3 28 17 -11 14 -10 -2 -5 -1 -16 9 7 -14 -3 10 -14 -11 2 -25 -17 18 -13 -28 6 -2 -18 0
5468 0 -3 -8 -11 8 -10 -16 11 -10 9 17 -2 -6 2 8 4 1 13 20 13 -9 14 15 -6 14 7 7 15 22 7 -5 26 -3 -18 13 9 -2 27 7 -24 15
5508 15 12 -14 5 -8 -38 2 12 -20 -12 8 -20 -11 0 1 -9 16 -26 -23 0 -15 -2 -8 -15 -13 0 2 -8 4 2 12 11 -4 -8 10 -3 -7 16
5545 16 6 8 20 4 -6 13 16 -5 11 11 -11 0 12 8 17 19 -6 -9 29 5 10 22 -12 -27 20 5 -19 7 -15 -23 -2 -2 -12 -15 -10 -30
5581c0J2J6lnPj9J8nmJ4Mj7PjoKOjJ2jmLjj7MJ9nrJ5nj7L1j7rJ8Nj4kJ7l2L3L
5623B2k8oL5j5j9K2k3OJ8j1j6J0Mk4K6k1joQjJ1Nkj2RjJ3j4j5J1KpJ0J1j3J7n
5660@k4J7J8j5J0mm%K3k2j1K0pnK5j8mJ4rk0K7J0k8KJ4k1J1J3k8J6J8j7qJ1j2
5695hmRkj7J9mmMj5QKJMNj2Klj2J1K7k0rRPpJ2j3rJ4J2qRjrQJ1k4QJ7j9OJ3j4
5738DNQj7j2K4J1k1J6k0pJ2J2j5j0K9j8rPnMJlj2ORpnnKJ%QQj4j0J8k1J6J2j1
5778ijlJ4oJLqJ8oj3J8%rJ5plmJ8k8J1J9j5j1K1j0jJ5j0j7K6nk5K2Nl3K7Kk4R
5817dJ3k5K2rj8J0Pj9J2kRMj1qJ7%kj9J5j4J8Qk7J3K2k3LJ0mlJ7j1j0K1K2l1J0
5854A3nj0mK8k3lJ3nNKj7RJ1n%Mojmj1QLj5j3L1lj4LRj7K0Ml5RJ6k1QRJJj1%K
$$ plain form
5581 -30 -18 -2 -5 -10 -3 -22 -4 -9 -13 1 5 -12 -5 -6 -12 -10 -4 -5 7 6 2 5 4 -13 -9 10 5 -4 11 6 -11 20 3 -6 12 17 3 1 18 -14 19 22
5623 22 -6 -12 23 8 -11 11 -12 -6 12 1 -15 -5 -1 -25 1 -20 -21 -27 -19 -20 -9 -4 -6 -18 -9 -10 3 -11 -26 -15 -13 -20 -10 1 -12 5 0
5660 0 -24 -7 11 -4 6 2 -2 -2 21 -1 -12 8 1 -4 21 3 -1 13 4 -16 11 21 -7 -5 9 -12 -1 12 -16 0 18 1 -7 4 -8
5695 -8 -12 -3 -5 -22 -3 -7 -11 -7 -22 -14 -12 -11 -7 -2 -14 -12 -15 -27 -16 11 -9 -18 -9 -2 -9 3 -10 -19 -5 7 -1 8 7 -2 6 17 -7 1 18 -1 5 18 4
5738 4 9 17 0 -12 12 23 2 18 -2 -9 3 15 0 -10 19 1 -8 -1 -6 -2 -1 -4 -16 -10 -1 -8 -13 -18 -16 -15 -15 -7 1 -13 -23 -5 -26 -10 2 -9
5778 -9 -10 -13 1 -5 -4 -1 -9 9 3 -10 8 8 -1 14 7 4 0 18 -10 1 20 5 -6 15 5 4 19 9 -8 18 13 -12 10 15 -18 9 11 -13 -4
5817 -4 9 -16 6 -3 -21 -11 -4 -23 -11 -13 -4 0 -11 -19 -2 -2 -4 -23 -8 -22 -4 4 -23 -10 12 -11 -8 2 -2 -5 12 1 -9 12 34 3 13
5854 13 8 -2 -6 22 -1 -4 9 4 9 11 -6 3 14 9 9 13 7 6 2 -9 -1 2 -13 -26 5 2 -12 -9 0 -17 3 7 -28 -19 -3 -24 -16 -7 -6 -5 -16 -16 -14
5897a4OOjlMj1Nj2J2K7k7%MrJ1K6k2j0K4rj1J0Ok4K7K4l4lJ7k7%J6LkJ2k3pJ8
5935InKNk5RQqj3K0j6J2Pj2j4OJ9k7J6Qk1J1J4l3K3J3j2oJ2j3KQnmJ9j2j4J5j1
5973a3K6qkNPqkNk1J4J2j2qJ1J0k1K6lj8J0nk1lL3j2j4J6j5KJ2Jj7J8pj9QkNJ5
6012Ek3lJ7lj4J1JLJ1j1j6L0Lk2J6jrJ1J4k0j9K9jj6OJ4j3J5nj8J0J7j5MnOOj0
6050ErJ6j0MPk0mJ7J3l2J7Nj7LPk6QL0l0j9K7j1JK4lk8J3J5k9QK4j0j3OKmJ7j1
6088gLkLJ1%j4J2Nj3qJ6rQK0l0PJ8j4j2QQj0J1J3l5PJ8j9QRpqQj0Q%Oj6%j0K4
6129Goj5%J5j7JOpj0K7pk2K5J4k1j1K0j8J6J9l5NJ4j0J9Olqj2OpK1%Kqj7J9J0
6167A8k5MJ2rKK3k9mK8k4j9L5kk9J2J0j9J0L1m4JJ7j1%OOj8J9jj8MJ3j9kjK0M
$$ plain form
5897 -14 -8 -2 -3 -6 -2 -13 -8 -20 -8 19 -8 -8 -4 -13 -2 24 2 -8 16 7 -4 6 12 -12 15 39 5 2 19 -8 -8 8 11 9 21 -2 -9 9
5935 9 4 6 11 -14 -5 3 -5 -18 2 -14 -2 5 -7 -21 -15 4 -23 -7 1 -20 -9 5 -28 -5 8 -4 -10 2 -11 -9 -1 -6 -10 9 -3 -17 -2 -13
5973 -13 13 5 3 8 15 7 5 10 -11 3 15 3 -5 6 16 -5 21 18 0 10 5 -16 -19 14 2 -12 4 -11 -9 3 4 -13 5 -2 -21 -13 -15 -10 5
6012 5 -18 -21 -4 -7 -21 -10 -9 -6 5 -6 -22 8 11 -11 5 4 -5 6 20 0 -19 10 9 -7 -1 13 0 15 10 -8 2 19 4 8 3 9 15 5
6050 5 -4 12 2 6 13 -7 -11 6 19 -13 4 9 -8 -5 2 -24 -16 14 -16 -35 -8 -19 -18 6 3 -25 -12 3 -26 -18 6 -4 -17 -11 -9 -13 4 -7
6088 -7 -4 -6 -3 8 8 -6 6 11 -2 -10 6 -3 5 25 -5 2 20 6 -6 2 10 0 11 24 -11 -4 14 -5 3 12 5 -3 5 -5 3 3 9 -7 -7 -17 7
6129 7 1 -14 -14 1 -16 -15 -9 -16 -26 1 -6 -28 -3 11 -10 -21 -1 -19 -3 16 -19 -14 0 -10 9 15 12 4 -8 -2 -9 12 12 14 6 -11 8 18
6167 18 -7 -3 9 0 2 25 -4 -8 20 -4 -23 12 10 -19 -7 3 -16 -6 25 -19 -18 -1 -12 -12 -6 0 -18 1 0 -18 -14 -1 -20 -22 -23 -3 1
6204Aj9J1%j6K4J5k4j3J9Lk0K9Nj4jnnJ9J4j3kQk6K7knj4J5qMJ2k5J2%j6J0J0
6241A0j9JJ8j3kK5j1j9NMj9J2J2k3Rkj2QJ4pppPJ9Jj4J4j1pPLkJ7j5m%J0%oK2
6281A8k7%K9j1k0K1KpJ6rj3K7ql0J0J7j9MNj2QJ6k5MqJ1pPnjQnj5J4nKLo%Lkn
6323a5J1ok3K4Mj9K3kj3KK0j1jjLnJ1MnJ6j6RKjNJ1k4jJ7k2J5J4j8j4J8%j7NK2
6362B2l6K4Ql9J3K0k1qPKnQKj1NMlj5J0JpmJ7j3OJ2pj2QJ8j7qJ1moK2Pk2nK5k3
6403a4PL2k1j7L1j9J0K0j3k5J9Nj5J4Oj4oJ3j6J7ljj4mJ1J0Oj9j1pMJ3K2k7Nj3
6439a4JjK3rj7jR%K4Nl4j0J8j4K3jj0QoLQQj9jQj7L7J9l5j3K5j8NL1k8j3K8lk7
6478hM5kl7QpqJ2K5m2lK1lJ0J2k1j7QmPMj3j3J7k8L1J7k6qJ5pkL6l6k5L6Rl2L4
$$ plain form
6204 1 -18 -7 -7 -23 1 16 -8 -21 -2 1 -19 10 15 1 0 -5 -10 9 23 10 8 16 -10 17 15 10 -4 11 3 7 19 -6 6 6 -10 0 10
6241 10 -9 -8 10 -3 -5 20 9 -10 -5 -1 -20 -8 4 -19 -10 -12 -24 -16 -2 -9 -16 -23 -16 3 4 -10 4 -7 -14 -7 -4 -6 11 -4 -8 -8 2 2 -4 18
6281 18 -9 -9 20 9 -11 10 12 5 21 12 -1 26 18 -12 -2 15 -4 0 5 -7 1 17 -8 -4 -12 -1 -8 -1 -6 -7 1 -4 -19 -5 -10 -8 -5 -11 -11 -8 -10 -15
6323 -15 -4 -10 -33 -9 -5 -24 -1 -3 -16 -14 6 -5 -6 -7 -4 -9 2 6 1 17 1 10 12 11 16 27 3 2 19 -3 12 26 8 -6 12 12 -5 0 22
6362 22 -14 10 18 -21 -8 12 -9 -17 -10 -8 -13 -5 -3 -14 -9 -5 -8 -23 -13 -12 -19 -23 -6 -19 -13 -1 -8 -20 -12 6 -11 -19 -8 -12 -18 4 11 -11 -16 9 -14
6403 -14 -7 25 4 -13 18 -1 9 29 16 -9 10 15 0 14 20 6 0 13 -3 14 11 10 -4 -8 3 13 19 0 -11 -18 -14 -1 21 -6 -1 -14
6439 -14 -13 -14 9 0 -17 -18 -9 -9 15 20 -14 -24 -6 -20 3 2 -8 0 -6 -3 5 13 -6 -7 1 -16 21 40 5 -8 17 -1 4 35 7 -6 22 19 -8
6478 -8 37 35 -2 6 -1 -9 3 28 -14 -17 4 1 11 23 2 -15 -7 -11 -4 0 -13 -26 -9 -37 -6 11 -15 -23 -8 -15 -17 19 -17 -42 -6 3 -29 5
6516EJ1m2K1Kj9L2K0l6rK3j0J4J3k9nK2lJ1mpj2J2oLJ1qj8J8j8JN2l0k4J8nk1
6552a7K4ok4J6K5l1JK1k3j1Qj3J1K7l3nOJ0MK7m6%L7l4J7K3k2j1KNlL2j4j7OR
6588AqJ8Rl4K1J8l2RK4j5oOj5J9J4k6lKkmK8k0j8K3j3j3K9j7j9K7k0pK6mk4J4
6624a2K0l0J0K2l2J5J7j5j8J9jmRj5oK6LLpkMQj7mK1Kk2J4qlL3k1j5PNjJ1oj7
6663gQJ7l0J0J7j7LNk0J6K3l4qJ6j9J1J3j2j9L1j6j2L6j5l4L0j6RJ1%l3QJ7JQ
6698bRl1OJ8oNJ6k0JPj9L5%k2%MpJ6Qj0k4K9rPJ5k6%LkkK3kj6jPKNj0k6J6KMR
6741A2lk4nJ5nJ4K1l3k6J6JJ4K1j7k9KK0NMj1k2J1LJ1J0Kk2J1kJ7J4j0k2mJ8q
6777aK6j5j8J7Mk2J7K4l0pPj1J4K6j8k1J0J6k5K0j7j3J5Qo%j0rpJ0J3LJ0l1pJ4
$$ plain form
6516 5 16 -26 -5 -3 -22 10 30 -6 -15 8 -2 12 25 -4 -9 13 10 21 17 10 -2 10 4 7 18 10 -8 10 -8 -7 45 15 -9 9 4 -17
6552 -17 7 1 -23 -7 18 -13 -12 9 -14 -25 -17 -30 -19 8 -25 -30 -24 -14 -10 17 -29 -29 8 -26 -9 14 -8 -19 -17 -12 -15 17 3 -14 -8 1
6588 1 -7 11 20 -14 7 25 -7 2 26 11 5 11 -4 15 29 3 0 2 0 -4 24 4 -14 9 -4 -17 12 -5 -24 3 -17 -24 2 -2 -26 -12
6624 -12 8 -22 -12 10 -22 -7 10 -5 -23 -4 -5 -9 0 -15 -21 5 8 11 4 2 6 14 -3 -7 14 16 -6 8 0 -3 30 9 -6 1 6 5 16 10 -7
6663 -7 1 18 -12 -2 15 -2 1 6 -14 2 25 -9 -17 -1 -20 -9 4 -8 -27 4 -12 -24 12 -3 -37 -7 -23 -14 -3 -3 -36 -28 -11 -10 -2
6698 -2 7 -24 -18 0 -6 -1 15 -5 -4 3 -16 19 19 -3 -3 1 -6 10 18 8 -16 13 4 11 26 0 0 3 1 -1 22 20 4 3 10 12 17 7 -19 -3 -1 3 12
6741 12 9 -15 -20 -5 -10 4 25 -8 -34 -18 -17 -3 18 1 -28 -26 -6 -1 3 -8 -30 -19 -16 -5 5 7 -15 -4 -6 11 25 15 -7 -11 7 -1
6777 -1 25 10 -8 9 13 -9 8 32 2 -5 2 -9 5 31 13 -8 2 18 -7 13 -4 -17 -2 6 0 0 -10 -19 -26 -16 -3 0 10 -21 -28 -14
6813a4NJ4Lm0K1oMRK1j9j4J7kMK2j5k2LKK7J2j7j7J2n%K5j8nQj4nJ8J4k0rNj2
6851hLK4j4j3J4jk2K1jk3K7mk1K2Lk4J0nmJ4kk1PJ2rRj7J2Jj1j0K8J5k4J2j4j2
6888b6K9J6l2NJ8j7nK7jj3JNj8K1J1j6lMrJ4J3k5QlJ1rJkKjpj6K3oRj6KNJ4j9
6928ejmkmJ7k3nK0Ok6K3mnNMj8J3K3lk1J0j2J7JmjJ2k2ML0oKj2nj2L8j2j7K1k6
6968djK6nqj1K0k5JJ1Rqjlj2J7Mj1noKOk3K7Ok0qK2l4K5K1l1JJ4J3j2Rk3lL6o
7008A0l1K3JpoJ8j5NK2l2OK2Rpkj9qK2PlJOl0OMJ4J2rl0%NJ6Lj7j2MK0k5J4J5
7048A2mk9J3OmK2k5j7J2mJ4Lj8JOnRJ1j4RkrmL3pl0J4J0pJ4Ol3J2J5KqJ6j0j3
7087cK0Lj5J8Ll9RL2j6Qj1j0jJ1MLj6Llj4K0Ppj8Olj1K4kl3RK5ojNk5qL2lrK2
$$ plain form
6813 -14 -9 5 8 -32 -11 -17 -13 -4 17 -2 -16 1 -1 3 25 10 -12 -9 -7 20 32 15 -2 10 5 5 30 12 7 15 1 -4 14 28 8 -1 4 -8
6851 -8 -5 19 5 -8 6 5 -17 4 3 -20 7 3 -18 4 7 -17 -7 -12 -16 -2 -4 -25 -18 -6 -15 -6 -23 -11 -10 -21 -31 -3 12 -12 0 -14 -26
6888 -26 3 19 -13 -8 10 -7 -12 15 14 1 2 7 -11 10 21 5 2 6 -3 11 24 -1 7 4 15 6 7 5 7 6 -1 -17 6 0 9 -7 -5 0 14 -5
6928 -5 -6 -10 -12 -16 1 -22 -27 -7 -1 -27 -4 -8 -13 -8 -4 -22 -9 14 11 -10 0 -12 5 6 2 1 13 -9 -5 25 19 21 9 4 -8 30 18 1 22 -4
6968 -4 -5 21 16 8 -3 17 -8 -7 4 13 5 4 1 -11 6 10 -1 -6 -12 -10 -4 -27 0 6 -14 -22 0 -34 -9 12 -19 -18 -4 9 -3 6 -17 -20 16 10
7008 10 -21 2 3 -4 -10 8 -7 -2 20 -12 -6 16 25 18 16 -3 -11 11 18 15 16 22 -8 -2 2 16 28 19 -11 -11 -6 10 13 -4 -16 -12 8 -17 -3 12
7048 12 8 -21 -8 -2 -6 16 -9 -26 -14 -18 -4 -1 -19 -18 -12 -17 -8 3 -11 -2 -4 -13 -17 16 9 -21 -7 3 -4 10 16 -17 -5 10 12 4 20 10 -3
7087 -3 17 20 5 23 26 -13 -4 28 12 20 9 -1 -2 9 13 16 0 3 0 -14 6 13 6 -12 -6 -9 -20 4 2 -31 -22 3 -3 -4 1 -24 -32 0 -3 -12 10
7128A0ooj5J2J4Lj2JnMLOj5MJ6nMOj4lKrK0J4kk0j7L4omj1Mj6K4rLrJ0k2jLOR
7171Ej0j0JrK5qj7JK2nk0J9Mj8PMj3J2K1k2KK0oj8J3lrJ9J3k3j2K6ojNkJ1j%j5
7211BJ4mjoJQ%j3QkoJ3j3kmK1kk6J2nm%J0k7K6jj7J1J1j4Oj3PlJ1J3j9j1MJ2n
7252hj3K8rrnK2j0J0Pj4j7K6K9l4Rjj0%L1l4mJ1kmJ1krJ0j7J0OJ1nj5lJRj1N%
7292@j3qL0j5j1J4mj1J0K1l0MPk5K3J6j5j0J6oj5K4rMOj0lJ3LnKj6J0K0Kj9kJ9
7330A7l3K6Pj5nJ8mj6K2pj2Qj0OJ1Kj0ooJ9kppj2j1J0J8pjNl0ML4Jk7J4j1j0L0
7369Cjm0K7Pk0K0kj4LPoOJ7jk3J5lkJ7rllKJ5LrpJ3rkK2ll9J5NPJ6rl2J0J2Om
7412Gmj0nJ5k2J7Mk0J1mj7J7K1l0jJ8j2%J0k0MK1ooRK3l3J0Pj1PJ7j5qJ8Jlmj3
$$ plain form
7128 10 4 -2 -17 -5 9 12 0 1 -4 0 3 9 -6 -2 14 9 13 19 5 2 4 -5 15 29 27 7 -10 24 18 14 3 7 -9 15 6 9 0 10 -12 -13 -10 -4 5
7171 5 -5 -15 -14 -23 2 -6 -23 -22 0 -5 -25 -6 -2 -20 -13 -9 -22 -10 11 -11 -9 11 5 -13 0 -3 -12 7 20 -3 -15 11 5 4 9 7 18 17 17 2
7211 2 16 12 11 5 6 14 14 1 9 7 1 14 1 -1 -5 16 14 -12 0 -5 -9 -9 1 -26 0 -1 -18 -7 4 -10 -4 -17 -10 -13 -2 11 -8 -19 -15 -3 -8
7252 -8 -21 7 -2 -11 -16 6 -4 6 13 -1 -18 8 37 3 12 11 1 1 32 -2 -6 5 3 -1 10 8 -1 9 -8 2 8 19 14 -1 -4 -3 6 -5 0 0
7292 0 -13 -21 9 -6 -17 -3 -7 -18 -8 13 -17 -13 -6 -31 -8 8 -7 -17 -1 -7 -22 2 -7 -3 3 -7 -10 3 6 1 3 -13 -3 17 19 0 -2 17
7330 17 -16 10 17 2 -3 15 11 -5 17 10 -2 6 -4 2 13 15 5 -1 -7 12 10 3 -4 -16 -27 -17 1 -6 -7 -2 -32 -28 6 7 -20 -6 -17 -27 3
7369 3 2 -38 -11 -4 -24 -4 -6 -20 -17 -10 -16 -10 7 6 -17 -2 -5 -7 10 1 -2 -5 -3 12 15 6 -1 12 3 1 23 20 -19 -4 1 8 24 15 -17 -7 5 11 7
7412 7 3 -7 -12 3 -19 -2 2 -18 -7 -11 -28 -11 10 -20 -21 -3 -15 -15 -5 -25 -21 0 -6 -12 -3 20 -13 -3 4 -7 0 17 2 -6 12 13 10 6 -7
7451gJ4J3j6J6k1oJ0J6j4kJ6k5kK8nj3Lj9nL0lpJMk0K5rj7J0lkj9L2oj0J0rPJ2
7490Goj9qJ2J3J0k2MJ6k0JL1j5j9K1j2mJ6J4pj1j3J2QJ2j4l%kJ5Jj0PnrjK1j1
7528A0kj5j1L3J2j9k1J3nj1L1k1j5K8j2kMJ7k0rJlJ5kmOj6RQj1k0L7nj1K0j5j
7565gJ6kk7K3K4j8j8K6j1%MloRRj3J0j0Plj3PMkJ1j8KmK1qk2QPj0K1j1j7%J2j
7605clJ8j6j2PoRJ0j8NPnmLnKJ0jrK2j7ORmpJ0Ql4J8J3JmjqpK9j0j0RQj7R%%J6
7650B8j7%jMj%qp%nnJRpKlmJ5j5nKJ7j8J9lj4LJ1j5mJ9j0J3%j3qL0mj0J7nj1R
7693Fnj5K0J2j4joOJ0Kq%J8j1j4J5JrNj0oJ4Nj6J7j3q%%kJ5qJklrJ2lk5J8Jmj
7736a5J3j3oK8k2j7L9qj6J1Jj1K2j2j2K1J5k8J3J6k1QRpj5J2LKPk4J5J7k1qJK1
$$ plain form
7451 -7 7 20 4 20 -1 -7 3 19 5 3 19 -6 -8 20 15 2 5 -14 -19 11 8 1 2 6 -14 11 2 -15 -5 -8 -10 -29 3 -3 -13 -3 -12 -5 7
7490 7 1 -18 -26 -14 -1 9 -13 -9 7 -13 -12 19 4 -15 6 -6 -10 6 20 13 2 -11 1 9 21 7 4 4 2 17 18 8 15 10 1 0 21 10
7528 10 8 -7 -18 15 27 8 -13 0 -5 -16 15 -6 -21 7 -5 -7 -3 14 -6 -15 -14 -17 -2 -4 -8 -2 -18 -9 -1 -12 -32 5 0 -11 9 -6 -7
7565 -7 9 7 -20 3 27 9 -9 17 6 6 10 7 1 10 19 6 16 6 13 10 -3 4 8 6 17 -1 1 -3 18 10 -12 -4 3 -7 14 3 -14 -14 -2 -3
7605 -3 -6 12 -4 -16 -9 -15 -6 4 -14 -9 -2 -7 -11 -8 -13 -11 -1 -2 -11 11 -6 0 9 5 -2 8 16 -18 0 13 14 10 9 1 -6 23 13 3 12 20 3 12 12 12 28
7650 28 11 11 10 14 13 13 5 -2 -2 -7 -12 -11 -2 -9 -7 -10 -14 1 -14 -19 -17 0 -18 1 -2 -16 -13 -2 -17 -21 -2 -12 1 1 -12 -20 10 6 -4 13 8 -3 6
7693 6 1 -14 6 18 4 3 -3 3 13 15 7 7 25 14 0 15 16 7 12 2 -4 10 15 -1 16 3 -5 -5 -5 -7 8 0 1 -1 -4 -13 -1 -4 -29 -11 -10 -14 -15
7736 -15 -2 -15 -21 7 -15 -32 7 -1 -17 -6 -5 -16 6 -6 -18 3 18 -10 3 19 -2 6 15 8 -7 5 8 10 17 -7 8 25 4 -4 -3 18
7772A8j3Pj9pK8k4RMLj8K2k7LJ9ok0J1J5k2J4rj8K3oj0J3Nk9J4K3j8kK9k4JK0
7808Ij2j1K5j6oK1mj7J4K0k8J6Nk3K0J3j3OKrLmp%J0j1qJ0j7QJ6j7j0L5j9j0J5
7845FrnK2k1k2K3Rj8J2lk6L3Ll3K6Nk0QJ1rNMk1LL0k8%J7j1j1L8k6QK1k0jJ4r
7883EpJ8j0j9L5opJ0pj9K7Jk6kJ4j0QJ7l8J1K6l8J1K3k2j0K4l2LJ7Mj9J3lj2J4
7919fMj4J5Pk5ROj4J5j3oK2Kj3oK3nONk2J2J3j4J1Rk3lL0k7KJ9qqoPj0J7Ll6L1
7959Ioj7K0Jj9J1J4k8JJ3opJ5rj2J5lk0K4j3j6K8j1lJ5Mj1QOj4J0JnRrj0J1JP
7998DlRk3J3J5j5%J3j0kJ3o%J3j0j0J6lkMk0lJ5jqJ9mj2jJqJ3j0qmJ2P%j1rkJ9
8040Aj2j%RokKOOj1j2J3KLmmJ8KlplNj6J7Nj4K5nj1KJ1omJj7J4J2j6QJ6k1lOp
$$ plain form
7772 18 5 12 -7 -14 14 -10 -1 3 6 -12 10 -17 -14 5 -1 -21 -10 5 -17 -3 -12 -30 -7 -13 -23 -10 -5 -34 -20 3 -15 -17 12 -12 -11 9
7808 9 -3 -14 11 -5 -11 10 6 -11 3 23 -5 11 16 -7 13 26 13 19 21 12 15 11 4 4 14 3 -5 5 -12 -4 12 -5 -15 20 1 -9 6
7845 6 -3 -8 14 -7 -29 -6 3 -15 -3 -6 -32 1 4 -29 -3 2 -18 -10 1 -8 -3 1 -20 -17 13 -15 -15 2 -9 -20 18 -8 0 21 1 0 14 5
7883 5 -2 16 6 -13 22 16 9 19 12 -7 20 21 -5 -7 7 -3 5 22 -16 -5 21 -17 -6 17 -5 -15 9 -23 -20 -3 1 -18 -5 -8 -20 -6
7919 -6 -2 -16 -1 6 -19 -10 -4 -18 -3 -16 -22 0 2 -11 -17 6 1 7 12 -10 2 15 1 12 21 -2 -5 25 -2 0 19 11 3 -3 4 -6 11 14 -22 9
7959 9 3 -14 6 7 -12 -1 13 -15 -14 -1 -7 -14 1 -8 -20 -5 -8 -28 -4 -17 -33 -5 -16 -19 -4 0 -11 -3 3 -11 -1 0 -5 4 -5 -15 -4 -3 4
7998 4 1 10 -13 0 15 0 0 13 3 1 14 8 8 21 11 1 17 14 12 16 -4 -7 8 7 -1 18 14 2 1 2 -6 7 -3 -11 -15 -3 4 4 -7 -16 -18 1
8040 1 -11 -12 -12 -3 -9 -11 -9 -3 3 -8 -20 -7 -5 -2 -6 -10 8 10 7 0 -3 2 -14 3 8 -6 19 14 3 5 16 10 6 7 -10 4 16 0 8 24 3 0 6 -1
8084ajlLRj1Rj1LoNKpPqnPRj9QnK4k2lJ9pj4K6j5oJ2J3k1J6lj0J0lOPLjPk2K2
8128B3%j1jRj1lJNj3J5Kj5OJJ0j5jPmkjk1K1Npj6PLMj1KlKJ7rmMJqmjJ4jJ3rn
8174dlJ6j3nJ0NoJ5mj0lJ5kJMnJ1
$$ plain form
8084 -1 -2 -5 -2 7 -4 5 -6 -3 -9 -4 -2 -9 -2 -10 -15 -8 1 -18 -10 -15 9 -13 -16 3 -4 -18 8 -7 -13 -1 12 -9 7 4 -6 4 1 7 14 17 16 23 1 23
8128 23 23 12 11 20 9 6 7 12 -1 14 16 1 7 8 18 3 2 9 5 3 2 -19 2 7 0 -16 -9 -6 -2 -13 -11 -14 -12 5 -4 -8 -4 -3 -11 -15 -16 -2 -3 10 1 -4
8174 -4 -7 9 -4 -9 1 6 0 15 11 1 -2 13 11 12 16 11 22
8191B2
$$ Imaginary data points
##PAGE= N=2
##DATA TABLE= (X++(I..I)), XYDATA
0@%%%%%%%%%%%%%%qJ6j6J6j6J6k4L2l2L3m1M8n6O4p2Q1q9J04j18J31j46J62j80
37i5K00k22K46k72L02l34L68m09M55n03N59o24O98p83Q85j011J166j362J621j983
57a098K528l448N393j5857J8954J5790m0893K3204J4626l7199L208L3172j9009
70f29p097J9576j1464j3075J6295o43n646P188m675n303R590l296m859P596k919
85F39o448Q445J745o255O46Q09k31J147k008M440J499j1784L944J3084j2691m026
101g045J7535j1127j3237K2950P84k1945J2628P576j9437R666J5230j6486j486
114d394R333j2760L330J5239j0906j809R606j6632j440K3055j0071j1264J9556
127A0843q394j9932K1274P925k1128R373J1876j9643l93J6972p882o741R826j560
$$ plain form
0 0 0 0 0 0 0 0 0 0 0 0 0 0 0 0 -8 8 -8 8 -8 8 -16 16 -16 17 -24 24 -32 32 -40 41 -48 56 -62 69 -77 85 -95
37 -95 105 -117 129 -143 159 -175 193 -216 239 -264 295 -329 369 -414 471 -540 626 -736 885 -1098
57 -1098 1430 -2018 3375 -12482 6472 22262 -18631 4573 19199 -18000 -14792 18380 -629
70 -629 -7726 11850 386 -12689 3606 2963 -2683 4505 -170 -5473 4117 821 -4038 3558 639
85 639 -5809 2636 4381 -1874 -1228 -419 -650 497 -1511 2929 4428 -7356 -3412 9672 -3019 -7045
101 -7045 10490 -637 -13874 9076 9860 -12085 543 8119 -11318 -1652 13578 -2908 -4394
114 -4394 4939 -7821 -4491 10748 -158 -1967 7639 -8993 -10433 12622 2551 -8713 10843
127 10843 2449 -17483 3791 11716 -9412 -39 11837 -7806 -8199 8773 891 -5850 3976 2416
141B416o192L714J665j990r71N65L732j684m857M593P83o253N925L751r147K837
157a113N098r223L989R611j1479j752J1468r973l478J7107p630j3208J5158j39
171D436j5068J3768P567j8105L574J1200j2341K45J3534p800o655Q152k634l688
185c815O904j232l740L453k335j922M978k071k210N098k591m122N165m65m009
200b914M412N95l883K559m34l307L959R17l086L007j279m900M890K304m858L357
216A339J582o954K227M691m303J875L538o793j57N653m085M69N912o469k917P977
232C585l496m463Q597j527q242O520K760q014L805N323p189l66O287l530k816
247b766M135o52k133K321J66j795r9K88J188M12j458O59R1k497J741K742k335
$$ plain form
141 2416 -3776 -62 1603 -387 -1358 -793 2939 1255 -3602 991 1774 -4479 1446 5197 -3950 -1113
157 -1113 3985 -5238 -1249 8362 -3117 -4869 6599 -3374 -6852 10255 2625 -10583 4575 4436
171 4436 -10632 3136 10703 -7402 -3828 7372 -4969 -4724 8810 1010 -5645 2507 -127 -3815
185 -3815 3089 1857 -1883 1570 -765 -2687 2291 220 -1990 3108 517 -3605 1560 1095 -2914
200 -2914 1498 2093 -1790 769 335 -2972 987 1904 -1182 1825 546 -4354 536 2840 -2018 1339
216 1339 2921 -4033 -1806 2885 -1418 457 3995 -2798 -2955 2698 -1387 -918 4994 -1475 -4392 3585
232 3585 89 -4374 4223 2696 -5546 974 3734 -4280 -475 4848 -2341 -2707 3580 50 -2766
247 -2766 1369 717 -1416 905 1071 -724 -823 -535 653 1065 -393 266 357 -2140 -399 2343 8
264Hk25J385l452L16M671j742j820K552k982k158N467M7l718L205m23n217L483
281f03L791l847N59K285m404k95M649j273j585J972j692j374K519k41r13J626
297A174j253j426K186k32j432J908l56k244K005J202k399J67J346j106K86J377
313A203j000j084L70L99M68K02j75l8j177o80J972Q56j180L70n20k144J609K473
331A924j551m84R73k205n13L100j88j356J366j247k267K431J722j710L13K78k303
348a717O64K464q47q04Q38j058q18J519N35n52R6n56o55P77O40j06j87o46k11
367f24Q61J97m21R0k40l57O17L76l81j14k30l46M96O70M0m40q97k43J045O20j66
388E53j09r10q34J136R55m65K17j91j656K16J784J8l03K38j475q81J944J002r75
$$ plain form
264 8 -217 1168 -2284 -1968 2703 961 -859 1693 -1289 -3447 2020 2067 -1651 1554 1131 -4086 -603
281 -603 3188 -659 -100 2185 -2219 -2514 2135 862 -723 1249 -443 -1817 702 461 -452 1174
297 1174 -79 -1505 681 449 -983 925 569 -1675 330 1532 -867 -700 646 -460 -174 1203
313 1203 203 -881 -511 -112 356 558 383 345 -832 -1512 460 1316 136 506 -14 -2158 -549 1924
331 1924 373 -111 862 -1343 -1856 1244 1056 -300 1066 -181 -2448 -17 1705 -5 308 586 -1717
348 -1717 -1053 1411 564 -240 598 -460 -1278 241 776 224 320 -236 -891 -114 526 420 233 -413 -624
367 -624 237 434 13 103 -137 -494 123 499 118 4 -226 -572 -76 594 634 194 -703 -946 99 719 553
388 553 444 -466 -1300 -164 791 326 543 352 -1304 -1088 696 714 411 649 -826 -1707 237 1239 264
407B64n0k65j229O58J597l05o71R6o75m61J211R71o94q37j14J6L55Q97M8j236
427d24m42Q60K08j28N48l74j160M31R42k27R8J69j194l69J426N28o13k17n44m58
447i40R51R06l67n95l76k51M03O81L55k65r93n16P15O79K30J14r52j025Q56J032
467F42k77m0o2j055pJ193R2l21J61o53n65P97P79k10m29m91j21N85M10ql44n97
489e21J02O86q1j11L42o43n75R55L80n36K90k42j047Q02J197p99m38L46o52Q7
509d58J246l18q67L86j25m23P93M25n94k64j46o4O19L33l58l25l82R6Q74j7o15
530a84K62j47n72P79M48q38K39L56r59L11J104p73n19P35l80j63J031n44j018
549h32Q30L44n47O06K4j063L27N96m35L33M64q65l14M94K5L24J87q02j30N62r2
$$ plain form
407 264 214 -51 -1280 -622 975 670 -1 95 -580 -1041 170 1141 447 -390 -504 -488 -133 764 812 -424
427 -424 -866 -6 202 74 622 248 -912 -481 461 234 332 501 -693 -1062 364 892 279 62 -482 -940
447 -940 11 917 550 -45 -421 -672 -269 412 767 502 -491 -1007 -292 387 617 731 -221 -1246 -390 642
467 642 365 325 263 -792 -799 394 486 165 326 -327 -892 -95 684 474 45 -446 -567 18 428 420 76 -521
489 -521 -419 267 186 75 417 -226 -801 154 534 -2 288 46 -1001 -199 998 199 -239 107 -545 -458
509 -458 788 470 -397 -11 -136 -559 234 659 65 -199 -345 -409 210 543 185 -140 -522 -426 448 431 -184
530 -184 78 -69 -641 138 586 -252 -13 343 -616 -305 799 26 -493 242 -138 -301 730 186 -832
549 -832 -2 342 -205 401 425 -638 -311 285 -150 183 647 -218 -532 -38 -13 311 498 -304 -434 128 36
570C6J75J96q86q1J001k35k82N85o28q19Q50N14k52L69l97j054L77P27J30K72
590E98m68q60N36L88n02O09K72j185L15R54q71j25R26r58m87J552R1r74J72m13
610d30m97J262O26p28m5n16p47J069O87o66M59J5j588M40J516o76m10O89p88l72
630g00J375l5j108R2J35P4P56j3n71j53o61qJ487K63q22J16o30j023J331J289
650A194q96l60J50o82J64P70j90k4l6n43N96M01j013L05O27j352M59K137j290
669D17j665J379k32j100K129P47k329n0R73j021M09J483o41p50Q2m18M53P81o17
688C0j16L24p92M11J168j149p87J150j36m56J061k05j063J85J5J47J019l25p29
707b48M01q09l87K097j13j920J141N81j990R22J697j773m05J687q71q00J322j85
$$ plain form
570 36 211 407 -479 -560 441 206 -76 509 -119 -938 -88 426 174 543 146 -908 -531 196 326 598
590 598 130 -730 -194 194 -308 301 573 -612 -297 657 -214 -339 587 -371 -858 694 785 -189 -17 -430
610 -430 -927 335 961 233 188 -328 -1075 -6 681 15 474 489 -1099 -659 857 181 -229 460 -328 -700
630 -700 675 640 -468 -376 -241 -167 589 576 5 -148 -809 -817 670 933 111 227 -403 -1426 -95 1194
650 1194 298 -62 88 -594 -430 340 150 126 90 -453 143 544 -469 -164 463 -889 -430 1707 417
669 417 -1248 131 -101 -1201 928 1675 -654 -704 269 -752 -343 1140 499 -251 -169 -587 -134 647 30
688 30 -86 238 -554 -143 1025 -124 -911 239 103 -353 708 503 -560 -375 -360 -213 806 481 -248
707 -248 153 -656 -1043 1054 941 -979 162 743 -1247 -325 1372 -401 -806 881 10 -790 532 347
725C47r01L83J13L31L92j061q5R03r68J20J868j300j484J937j32j810J769R93
743A415k180K41J204j137J61J126q80l40N44l83L95L21j072M88Q37j346K01J425
761A020j219n64J425p01o97J389l34r20P80k28k72R88q73n43J675q54j339K158
779H91j76k289J993R57k855J018K244k446n50K454j076j220J691k48j130R01J31
796B90m78L01l15J93O19j136J0J501j055q01J691o00j323J705M6j629J203N07
814G29j480P26N23j092R00L21j598R78Q89j714O99J246k004K04J992j627o86K073
832A079r23j290J604j39r10J124l67r71J071j90n85J278o56j204J750j67j843
849a339J772P33k264R33J351k065K92J763j518m43J690p21p13Q53n75j83J065
$$ plain form
725 347 -554 -171 -58 273 665 -396 -481 422 -546 -426 1442 142 -1342 595 463 -1347 422 1415
743 1415 -765 -524 680 -457 -296 830 -50 -390 154 -229 166 487 -585 -97 740 -606 -405 1020
761 1020 -199 -763 662 -39 -736 653 319 -601 179 -49 -321 667 -206 -749 926 72 -1267 891
779 891 715 -1574 419 1376 -1479 -461 1783 -663 -1213 1241 165 -1055 636 388 -742 159 290
796 290 -188 113 -202 -9 610 -526 -516 985 -70 -871 820 220 -1103 602 648 -981 222 729
814 729 -751 -25 498 -594 306 627 -971 7 896 -818 -119 1127 -877 -673 1319 -308 -994 1079
832 1079 156 -1134 470 331 -579 545 178 -793 278 88 -497 781 125 -1079 671 504 -1339
849 -1339 433 1166 -1098 -165 1186 -879 -587 1176 -342 -785 905 184 -529 324 -251 -434 631
866F31n67k60Q08r78l41J334o98m24J538q40j306J382m7r77J379q5j383J152J66
885D84j525J151O07j517J040Q09k021N54J439j777M1K007j242q03J513r69r60
902a169J771j1j095Q83j23r60P70J1n63J024q8r82P41n3r46J040K76j179R33N82
922H62j492K75P90j029M87J094j140j53Q79j039k23J267n23k16J004r20q25J149
940B47j83n99J109p1q95O03k16q64R51M62o65N07j28j023O02M10p72P90O34j270
960c71L0O25r46L32J259r14m64R99o46o69J023p7n42Q29r1r21M71K61n29L82K87
981C28m19K08O5n56K09L16k00K23Lm30L33J33n90L17L66n11K87M03q14J1O84o16
1003b50j67J023l10o36N20k76o12R15L98p66J55K31o55J01N53j72K6K30m38k41
$$ plain form
866 631 64 -196 612 -366 -707 627 -71 -495 1043 203 -1103 279 232 -745 634 549 -834 318 484
885 484 -1041 110 717 -800 240 1049 -972 -418 1021 -756 -715 1292 50 -753 760 -209 -1169
902 -1169 602 591 -504 379 256 -704 66 77 -486 538 450 -532 209 156 -790 250 526 -653 280 862
922 862 -630 -355 435 -594 -107 987 -153 -306 573 -466 -689 578 55 -161 843 -77 -902 247
940 247 64 -535 574 503 -392 211 -5 -869 82 544 -121 386 258 -765 -163 247 -525 265 899 -371
960 -371 -341 284 -662 -330 929 15 -449 550 -96 -765 258 181 -361 468 377 -544 -73 188 -341 41 328
981 328 -91 117 182 -374 -165 151 -49 174 177 -253 80 213 -377 -60 306 -205 82 485 -329 -318 366 -250
1003 -250 -417 606 296 -340 180 -96 -708 207 605 -161 -6 225 -430 -329 224 52 78 308 -130 -371
1023c71K91R3J09M3k30K7Q7k49Q5K35j89J25K14m75o9N00k24k20M72j14l93L48
1045I5j1m09M42L08n67o9L32j91K7L02k35k25K13J7q1J17N9n5j74j44K19K47j44
1068G3m6Rl37J22M83k49k51L99j51m49L94K42l84J90J85n00j9N56j55l09K57K1
1090H1k60J58J22j80J5K37r1k74Q6K52j22j53K69rl25J79J61l76J85N00m61l73
1112c79N14n7l30N15M6o44K57L33n15R9N86l14l86K87j6j78L43R2m10m6K76m3
1134C0j49J56J34j96j45J94k2j45K92O0m76Q9M36l00j62M11j89k48L61o1l59L54
1156F5J82l69N9J51j80Q2J12j69R9R4k05M1M4j32K96O7m80J27L44l77O1M12m01
1179g7j45M87l16l10O32J5n41K24J40l49K78K34l62n6K43j09r7Q6J03J6j88l5
$$ plain form
1023 -371 -80 13 122 165 -65 -38 49 -200 -115 120 -69 56 270 -205 -274 226 2 -218 254 140 -253 95
1045 95 84 -325 117 425 -142 -211 121 -70 -43 259 24 -201 12 29 -52 65 124 69 -105 -249 -30 217 73
1068 73 27 36 -301 -179 304 55 -196 203 52 -397 -3 239 -145 45 230 -270 -289 267 112 -197 60 81
1090 81 -179 -21 101 -79 -64 173 82 -192 -106 146 24 -129 140 131 -194 -15 146 -230 -45 455 -6 -379
1112 -379 135 78 -252 263 309 -335 -78 255 -260 -161 425 111 -275 12 -4 -182 161 253 -157 -203 73 30
1134 30 -119 37 171 -25 -170 24 2 -143 149 209 -267 -178 258 -42 -204 207 18 -230 131 70 -289 65
1156 65 247 -122 -63 88 -92 -10 102 -67 32 126 -79 -38 6 -126 170 237 -243 -116 228 -149 -88 324 -77
1179 -77 -222 265 -51 -361 271 286 -255 -31 109 -240 38 272 -90 -146 97 -12 -109 -23 80 96 -92 -127
1201a27K00j66NL90l32l51O23o8o39N77K61p82L59N22r10J25R82p84l98R81l75
1222I3o49Q61m1p59O87K30q73L15N16n12Q7L09m40M3L18k66M9K01k28P4M4l36
1244b77L18K63m35Q1K31m44J96L99n32N5N16n34j32N74l73j03O03n09l30P62k93
1265C6m25P41k68n70Q42j81q20R20J65j005O66L54j089O23P17j218K31J043j070
1284c08k08J157p06m58J142n14q20J051J1q24O48J70p31M14K59n63K62K99l74
1303i3O6Mj59L85j15l42M66j75m57P10q4p64Q47J77j199O98O98j236M45R26j379
1324e81M8J402j098m73J489p34q85J418m04j057J404j1j360R88M13j278P52O33
1342F66j258M68Q32j173Q3J007q01j24Q56p15k72Q79m29l85P08k73l48N24l08
$$ plain form
1201 -127 73 -93 -88 302 -30 -381 242 174 -465 112 373 -409 -50 472 -438 -313 669 -115 -513 468 93
1222 93 -556 305 264 -495 192 422 -451 -136 380 -132 -45 264 -176 -133 185 -81 -32 169 -59 15 59 -277
1244 -277 41 304 -131 -50 181 -263 -67 332 -200 -145 371 -163 -295 279 -94 -197 406 -103 -433 329 36
1265 36 -389 352 84 -486 356 175 -645 275 440 -565 101 455 -634 -11 706 -512 -281 762 -308
1284 -308 -516 641 -65 -523 619 105 -715 336 347 -477 171 341 -390 24 283 -280 -18 281 -93
1303 -93 -27 -23 -182 203 88 -254 212 37 -420 290 206 -558 289 466 -733 -35 663 -573 -128 798 -581
1324 -581 -533 869 -229 -702 787 53 -832 586 182 -875 529 518 -842 146 559 -719 33 666
1342 666 -592 -124 708 -465 -382 625 -176 -300 556 -159 -431 448 19 -366 342 69 -279 245 -63
1361f3k16O28k65l34M61l07j53O32m09l13P56m21n14R28l09o79J103k47j171J179
1381B86L26j442R26P08j641O02J229j636L2J686j290o58J705p42j019J580k70
1398C82j348J286L01j338P35N63j130M49O74r45J58P20o57j16N18l57J4L57l51
1417h5L9K04l49J75J61m33M59K91q78K56N64q34K49R44j001k02J107q77n95J415
1437F10l13r10J122k24j211J118L48j242Q53O20j371L85Q03j214K68J227j040
1454a71l28J189p94o60J175k35p05J013n2j049N39L37o21L72L96m91P6J59m02
1473b52O8K31m5K45q7l29K35j16l46N25J30l92M58n6r08M67N24p03M33O83j046
1494b81j12Q25q80j55J418m91q70R70l04j052J040M28j015O48N73j214j8P84n73
$$ plain form
1361 -63 -279 349 84 -250 211 -96 -249 383 -26 -339 417 -4 -518 410 101 -578 525 278 -893 286
1381 286 612 -830 96 804 -837 -235 994 -642 -610 1076 -214 -872 833 91 -928 652 382
1398 382 -966 320 621 -717 18 581 -549 -100 574 -371 -213 507 -150 -266 252 -105 -91 266 -85
1417 -85 -46 158 -191 -16 145 -288 171 462 -416 -160 404 -430 -181 763 -238 -440 667 -210 -805 610
1437 610 297 -613 509 285 -926 192 540 -702 151 771 -600 -215 588 -626 -358 869 -171
1454 -171 -499 690 -104 -764 411 176 -529 484 432 -617 -78 259 -362 10 406 -85 -9 150 -252
1473 -252 -184 47 2 247 160 -169 66 -50 -396 129 259 -133 325 269 -639 -172 352 -351 82 765 -281
1494 -281 -393 432 -448 -603 815 324 -546 424 120 -932 108 536 -479 169 742 -472 -490 294 -279
1513b79M1Q73n04m42N00l15l70N89J58j87J86k20l86K19R7oK63k9j65M7k61j30
1535c21L80L3n4L15k81l55L20j22l04O23K29n45J80J8o67L71N79m81J26M55o82
1556a83k66N60k57q1P79l14o07M65r3n16N81K69m88L30J41p50Q7N41k96P4M28
1577D04l69k95K88j89j13M64Q5k54Nj27j10J75O8J8Q0p0q0J7j97Q6L22j57j01
1600e0K63k18k46L45r0k56N04R0n79J66K29m43K04M38m20o0M31m00k77N06m0k47
1622a50L49r0l69K84Q3l39K29J87k35N6M0k69J33K26j94M9J39k24J6J14j71J11
1644b5K35k17j13J58j19K9K05j89p7K45j22j59K36k6j42K12r2k16K41N1k16J50
1666D9K6j78J57M0k62J91J62k79P0J48k75J07K61l19j3L29k41j72L27j14j52K91
$$ plain form
1513 -279 -238 635 131 -311 189 -126 -496 93 251 64 250 30 -356 -137 -40 -46 217 188 23 70 -191 -321
1535 -321 59 92 38 353 72 -283 37 -85 -389 234 463 -82 98 116 -551 -180 399 -82 44 499 -183
1556 -183 -449 111 -146 -227 552 238 -369 96 3 -513 68 337 -151 179 320 -430 -343 198 -98 -24 404
1577 404 35 -260 28 -161 -274 190 275 21 26 -101 -211 -36 32 50 130 60 -20 -3 -200 -114 208 51 -50
1600 -50 213 -5 -251 94 4 -252 252 342 -237 -71 158 -285 -81 357 -63 -123 308 -92 -369 137 97 -150
1622 -150 199 109 -260 24 107 -232 -3 184 -51 5 45 -224 -91 135 -59 -10 129 -95 -79 35 -136 -25
1644 -25 210 -7 -120 38 -81 -52 153 -36 -113 132 10 -149 87 61 -81 131 39 -177 64 115 -101 49
1666 49 75 -103 54 94 -168 23 185 -94 -24 124 -151 -44 217 -102 -115 214 -27 -199 128 14 -138 153
1688A53p5l18K63J12k73J18J05j91J03J04k00L1J71j52j5J03p7O8L2j86O2J41
1710G9j18N1R6k06L9J86k14k7K93j21j55J89j35j29L30l4k71K14M0k63J34R8j69
1733i3J64J02k83J6J77j49N3J51k02K3J57k21j4K38j07n4J43j81q6K87p7j82K02
1756F4rk09J73L8j83J89N5k52M7J63j17N0P2j68L1J14j01J2J12r2J9J5j42J03
1780a6J60j49j5R2j69M0K11k02l5K70j88j95K83l2j74K72m7l36K21J45k39R6J63
1803A56k25OJ44j89L1K33j32j27J03p5J4J49r9m1J10j10p4J52m0lJ44j52j46J93
1827B2pp9J96q5j74J74l7j96K53J08k41O6J8k03J84J79k26J1J55k05j4K09j28
1850b0J1J77k14j08K26n2n4J74j65j15K34r5j40K58j7k22J53j3k02K42J15k71
$$ plain form
1688 153 78 -240 23 135 -138 -20 85 -106 -3 101 -99 -68 103 -49 -64 39 -38 30 62 -124 -62 79
1710 79 -39 12 108 -98 -59 127 -87 -114 179 58 -97 92 -43 -172 158 124 -147 67 107 -156 -22 76 -93
1733 -93 71 173 -110 -94 83 -66 -13 138 -64 -41 116 -105 -119 119 12 -42 101 -80 -166 121 44 -138 64
1756 64 55 -154 19 57 -126 63 118 -134 -87 76 -41 9 81 -87 -56 58 -43 -31 81 -11 8 23 -119 -16
1780 -16 144 -5 -20 72 -97 -57 154 -48 -83 187 -1 -196 87 55 -119 153 106 -230 -9 136 -103 -7 156
1803 156 -69 -63 81 -108 -77 156 24 -103 0 -75 -61 88 -11 -52 58 -52 -126 26 -14 -17 127 -25 -171 22
1827 22 15 -64 132 47 -127 47 10 -186 67 175 -66 0 18 -185 -1 178 -48 -37 118 -87 -101 108 -20
1850 -20 -9 168 -46 -154 72 20 -34 140 -25 -140 94 -1 -141 117 100 -122 31 18 -184 58 173 -98
1872i8O8R6j95Q2J31j52P8J13k62L9J68j27R4J24l10J3K67k17j5L07k00j62K69
1895A11j72j57L98k6l21K18%k51K85P9l01J88R0l36J15K22k03R5J29l14K8K58
1917A35j79J7J78k00k3J47j87L3K82k00q1J78k50kL93k32k10L84j86l03M21pl31
1940b23L85Pn21K87K96l97J67K47m46O3L36l37J5M17l33j40L15k40n8M28k19k28
1962a79L16j38k18L68n4k34L20j10l20L01P3k31K69m8l47K64R3l19K95J26m09
1983a82J66J53m02K63L54m90L0L10m20P2M56l90p8M50m20k16N80j92k63N01k36
2004D6m75N67M6m94M47J27o12L22K49n17K66L89n29LL61l38L1L87l35p1L27k93
2026i6p0L49j96o0K95l18j19M25k02j37L71k74k19M34j74k69N44j18m84M17j2
$$ plain form
1872 -98 -30 66 -129 -47 84 -68 10 123 -139 -100 68 -59 35 159 -151 -138 129 -88 -103 204 4 -158 111
1895 111 -61 -218 180 154 -167 51 51 -200 85 164 -137 51 141 -195 -80 142 -61 34 163 -151 -123 135
1917 135 -44 -27 151 -49 -72 75 -112 -79 203 3 -78 100 -150 -152 241 9 -201 183 -3 -306 115 108 -223
1940 -223 162 169 -352 -65 231 -166 1 248 -198 -135 201 -136 -121 296 -37 -177 138 -102 -160 268 49 -179
1962 -179 137 -1 -219 149 95 -139 181 71 -249 52 125 -106 163 115 -232 32 125 -194 101 227 -182
1983 -182 -16 137 -265 -2 352 -138 -108 202 -218 -146 310 -80 -158 292 -128 -344 236 44 -219 282 46
2004 46 -429 138 184 -310 137 264 -348 -26 223 -294 -28 361 -168 -165 196 -142 -111 276 -59 -130 197 -96
2026 -96 -166 183 -13 -73 222 -96 -215 210 8 -129 242 -32 -251 183 9 -260 284 166 -318 99 87
2047H7m47N62J44o69L24K45o53L21N01n75O5M48o53m3P00l68j68N29m21l29O16
2068B16j65l53N70r5n18M16Ml83M56R5n00K78J64m26K50J79l71K05J85l96J40
2089d9K50l52J50K00l99J60L37m71O8M06m84%N02m49o5O26m51l68O38k35l52O96
2111C58j49o24N52K2o53N87L27o73K66K48p16K68O13n20k7M58n19j47N41k70j17
2132a75M97k86l21L82j26j50L94j52k40L27j29k41L49r0k09M05j62l45M20l0l88
2153b70M16M0m68M07J23n69L41L03n86J97M03n72J27N24n99j17O40m16k04O59
2173C79l22m17N74j86m43O47O5n66L27P7n12L89K88m80J68K31m59R0L21k59R1
2194CK48m16qK96k24L5K93l20rK86l23k0L91k55j04L50l11j60N03k26k66M63j44
$$ plain form
2047 87 -360 202 346 -323 1 246 -407 -86 415 -160 -95 353 -300 -343 357 -11 -179 350 -71 -400 216
2068 216 51 -302 268 173 -345 71 75 -308 148 243 -257 21 185 -241 9 188 -183 22 207 -189 -49
2089 -49 201 -151 -1 199 -200 -40 297 -174 -106 300 -184 -184 318 -131 -196 430 -21 -389 249 14 -338 358
2111 358 209 -415 137 159 -494 93 420 -253 13 261 -455 -187 426 -94 -121 337 -182 -329 212 -58 -175
2132 -175 322 36 -285 97 -29 -179 215 63 -177 150 21 -220 129 39 -170 235 73 -272 148 118 -270
2153 -270 146 186 -282 125 248 -321 20 323 -263 -66 337 -235 -108 416 -183 -300 340 -76 -280 379
2173 379 57 -360 214 28 -415 232 297 -269 58 135 -377 12 300 -180 -12 219 -240 -150 171 -88 3
2194 3 251 -165 -173 123 -101 -66 227 -93 -102 184 -139 -159 232 -23 -127 223 -88 -248 255 29 -237 226 82
2217H2l78M65k1m61M67J08n78L12K67n12K30L37n32O1M54m61k5M82l35j65M13
2238B10k76j83M83j43l22L54p6k88L45Mk94K64N1l53K00J45k43J82P8l18J52J32
2260A04k29J49J34k77R4J54l04J34K79l12QK29k98OL76k68j33L71k16k34M11q9
2282H9k50L37o4l94L35J33l57K11J41l77J62K29l40P6K77k75o0K58k05k5K66j98
2304c1j09K49j34j22K28q3j04K37j17k10K31Qj57K17k3k14J32M0j98K15J16k44
2326g3O6L8k00J63J99k45L2J34k32L5K36j89pK05k14q9K67o8j68J90q8j44K72
2349A20Kk51J22N3j86J71J11k14P0Q4k15N5K01j16k2R6j54k0J56q8n1J38p2j5
2373b5R9j27p5J61l5l5J59q8j46J07o0o7K63M1k47M3Lj34K02J31j79K4M9j94N4
$$ plain form
2217 82 -296 169 148 -313 154 262 -316 -4 263 -249 -19 318 -214 -153 301 -160 -185 297 -38 -203 210
2238 210 -66 -249 234 91 -231 123 47 -241 104 108 -186 78 129 -224 -24 121 -122 60 138 -180 -28 104
2260 104 -125 24 158 -119 -25 129 -175 -41 238 -74 -66 163 -135 -129 247 -21 -154 217 1 -233 178 89
2282 89 -161 176 112 -282 53 186 -171 40 181 -196 -34 195 -145 -69 208 -67 -127 131 -74 -99 167 -31
2304 -31 -140 109 -25 -147 81 -2 -106 131 14 -196 35 43 -114 103 80 -134 -2 38 -160 55 171 -73
2326 -73 -7 31 -169 -6 193 -52 -20 114 -118 -83 153 -36 -43 162 -52 -141 126 58 -110 80 -8 -152 120
2349 120 122 -129 -7 46 -140 31 142 -72 -2 82 -133 -78 123 7 -15 81 -73 -93 63 -25 -76 62 -10 -25
2373 -25 74 -53 -128 33 -2 -37 122 34 -112 -5 -65 -132 131 172 -75 -32 -29 -163 39 170 -9 15 64 -130 -76
2398g6J75j07J1J04j57j8J63q7r5J25l5l2J45q0j60J03J0n1J23M0j35J8j9r2J38
2423A1J17j10l9Lr3O9R5r2J9P5q5j1O3q2kJ05n7rJ04p8j03O6k1K8J65o1j58N2
2451b9om0J41M0j28L5Lj21Q1J22q2j8L6p5J1R0o4l8P8j5pL9o4l7O1m2J0Q7m3o8
2481d3L0n2MJ23j7q7K5No6R5J3r2O1L6r2K3M4n1K1N0p5L2O1p8l4N7kJ5N4p8m5
2512f3P7Nm2M4Lm4L0j5m8P0L7o6LJ3rK5ok3J4J7k2Lj7ML9j5n0L4J1m5N8J7q6N4
2546GL7r7J5R5n2m6O8n6l2J09k0j11P0L8p2M1L8p2NK9k6PO4no2rK1K8K2j6l7j4
2578c3J3N0k0k2M7l1l6M2L1m5QK0p7K3R0m6m8L0l0L0O9m7o4K7J2l9O4K9o1K0j7
2609a1p4Q6P3r0l4K9l4L0R6o1p9M7J0l5P3%n1j3NRM2L8l4p5rO9O4n3j8j1l7L6
$$ plain form
2398 -76 99 -8 3 107 -50 -68 95 8 -87 38 3 -29 116 36 -124 -21 -11 -62 61 101 -34 -16 -35 -127 11
2423 11 128 18 -21 -18 -111 -42 53 -39 -20 55 -30 -41 22 -60 -62 43 -14 -23 81 3 -100 -34 -55 -27 138 77 -81 -29
2451 -29 -35 -75 66 106 -22 13 16 -105 -24 98 16 -2 34 -41 -30 60 -4 -42 36 21 14 53 -11 -48 13 -29 -19 68 25 -43
2481 -43 -13 -65 -61 62 45 -42 -17 -12 -78 17 30 -62 -1 35 -57 -34 10 -41 -20 30 -45 -13 48 -30 -64 -7 -9 6 60 -18 -63
2512 -63 14 19 -23 21 24 -20 10 -5 -53 17 54 -12 -9 4 -5 20 14 -9 5 22 0 3 -14 -10 29 14 -36 -2 9 -36 22 39 -47 7
2546 7 44 -53 -38 57 5 -41 27 -29 -61 48 28 -83 -13 25 -47 -6 32 -40 -35 -6 -32 -25 39 34 -28 -37 -16 12 34 18 -19 -33
2578 -33 -20 30 10 -12 35 4 -32 10 41 -4 4 24 -53 -30 60 14 -34 -4 -34 -4 65 18 -46 -19 -7 -46 18 47 -14 6 -11
2609 -11 -85 1 74 -16 -50 -21 -55 -25 71 10 -69 -22 -12 -47 26 26 -25 -38 -33 -24 18 56 22 -53 -62 7 71 18 0 -11 -48 -12
2641a2O7l2l3N7q4k6J17J5r5K7Oq7J10R4j38l8R3o2nR9l9r0M9J5o8R1M6j14k3
2670f0M6j1M6L7q0n5K5L5M6j1k7k4qkM5M2m3k7j2l0N4P7m4m9J3j5K9P0m0m9K9
2701Gl0QO8j0o2L0k1k8R1J0r3mL7m5O0N4j06pO1m7%J06o1p7M8j3k3R3Pj15PN1
2733dk6M3L0o8k7L7ooP5m4m8PKL1L5k6j8j5rM2M7o7ML1m0QO6n2l3O9m4m1J05k
2767E6r6L5L4o9N9L8j03LR0o9K4N9o9k8O4n0j3J04n3q6P4rl8R1j1j17L3N7n9M7
2797bM2p4lM7m1KP2n0k2J2k7L5M4n9j7N0l1j3N2l3rO1o0qM7k3oN6m9m2J05m5q7
2830g6J12Nr7P9M3j42O3J06j25nJ06q5m3J04l5n3Q9l1p9Q1mn3N9k2o8Q2J2p0M1
2859fM8q9L0K1o4M4L7n1J8K7m6J1K4l5M3L2r7PO7o6N4P4r7n1R1l4l0J01k9p4Q0
$$ plain form
2641 -12 55 23 -10 47 -37 -63 54 69 -26 1 7 -80 30 124 -14 -52 41 -21 -26 73 34 -56 -7 8 -60 31 77 -37 -60
2670 -60 -14 -25 21 58 -22 -77 -52 -17 29 18 -9 -33 -41 -43 2 44 1 -26 -38 -68 -14 63 19 -30 -17 -32 -3 67 27 -22 7
2701 7 -23 -15 53 43 -19 11 -10 -38 53 63 -30 -34 3 -42 18 72 -34 -41 20 -27 -27 79 18 -59 -11 -24 -47 46 53 -62 -55 -4
2733 -4 -30 13 43 -25 -52 -15 -21 -27 48 4 -44 -37 -35 -4 31 5 -13 -28 -37 5 52 -15 -11 20 -20 -12 54 2 -31 38 -6 -47 58 56
2767 56 -40 -5 29 -40 19 57 -46 -43 47 -22 2 61 -8 -36 28 -22 -35 69 16 -70 4 -5 -43 48 37 -80 -47 10 -49 -2
2797 -2 40 -34 -37 10 -31 -29 43 -7 -29 -17 -44 -9 35 -24 -41 9 -22 -35 17 -16 -25 36 -24 -32 15 -8 -14 42 -7 -49 56 11 -76
2830 -76 36 41 -56 23 66 -76 -13 93 -32 -37 69 -16 -59 45 10 -43 46 15 -64 17 13 -40 19 -3 -71 11 23 -47 -6
2859 -6 42 -47 -17 4 -60 -16 21 -30 -12 15 -31 -20 4 -31 12 44 -53 -46 21 -45 9 83 -14 -65 26 -8 -38 63 34 -40 40
2890D0k6o3J08nj05N1L0p0R3K4j42L3Q9q7J4J02j00n3R1m7k4J04j8q9M3Lj1K7
2918A2j0l7M2pm1O0m4m8R0qn4P6k3q5L9M5k2P8rj29J5P3o0J04M3j33j7Q8r1L1
2948b2J25p4q4Q8l1m5J15m1r0P5L3n6N4k8j05P9M9m9O2J7j28pO5l1O2N8j02o7
2976g8N9LoP0n5k1M8n5LM5m7rP8k9k0P2q9q9J05O2l7O3n5j36O2P1l1P7J2j23p
3007e7N4m8P5Q8j27l8Q4n2%J02q5n3J05ko0M5l2o5O5K8k3M3l4r5M9L6j4P8k2j19
3037g4L2M6l9M3N3r3JM0m5J5M9n8J5M5m3ML1p6j6J00pl1M3o1p1J05K8m6O0j0r6
3068e6K6M7k4M3K3r3J7L2k9K2K1n9K8N0o8JN7m9j5O3l6k3O4m1o6P5Nj9K5l9l1
3099d9P4j9m2N5mo7N3Nn7M5K4o8L1N8o7J0L8p4L0O0o6jO2o6mP2m0l2P1k9n4O3
$$ plain form
2890 40 14 -49 59 54 -51 0 30 -40 53 77 -65 -32 57 -30 -16 86 -14 -67 24 -23 -47 57 39 -50 -7 -4 -15 12
2918 12 2 -35 7 0 -41 19 -25 -73 17 9 -45 31 8 -77 -38 7 -15 63 54 -75 -60 13 -47 57 100 -33 -50 38 -53 -22
2948 -22 103 29 -55 33 2 -43 72 31 -59 16 49 -7 47 19 -86 -7 42 -7 55 72 -56 -63 2 -29 33 91 -11 -78
2976 -78 -19 -16 -22 48 -7 -28 20 -35 -32 13 -34 -43 35 6 -14 58 -31 -120 -15 47 10 73 18 -118 -56 15 -16 61 73 -50 -57
3007 -57 -3 -51 24 112 -15 -53 31 -21 -21 81 -4 -57 48 46 -14 31 -1 -66 -1 27 4 47 13 -82 -33 3 -11 67 45 -74
3037 -74 -42 4 -35 8 61 -32 -31 9 -36 -21 28 -30 -15 30 -13 -9 22 -54 -70 30 23 -8 35 -26 -97 8 36 -10 50 40 -56
3068 -56 -30 17 -7 36 59 -34 -17 15 -14 8 29 -30 -2 48 -20 -19 38 -11 -26 37 1 -22 42 1 -65 10 15 -4 21 -18 -49
3099 -49 25 6 -36 19 15 -52 1 6 -51 -6 18 -50 -19 39 -28 -18 20 -54 -24 36 -30 -31 31 -35 -39 33 -7 -39 32 3 -51 12
3131A2J2n5M9Jn4M5K9m6NJ6k1J4J4l6K3K6m7L4Jn6J8K5k8NN3n4k0M7k8KO3o7l7
3164e5P3l0k6N8j7o8P6Mp3M6L1o9L1L0m2K2L6o2RM6k0lJ0l6QM0m1K0N0o5j0N9
3196C2l9oN1k5n0N1J0l2J2Qm0M2jk4L0j4k3K1J8l8L4mm9J2M5m2K8Ro3J1O4m7J0
3229iL7n1k0N4k5k2N9k9o0N6K2m0K6Nm4J7O1m1POl1J7K3j3R%l0K0J0j6K6Rp1J8
3263b0N7l6nM2n0j2N4k2k2L5j5m0L3K2l0K0Qn5L3K1l8MK3l8J0L3m1J7Ok0%K6k8
3296b8J5K7n7qO3k7j4N6m6k0M9jl6M3jn2M0Pk1J6Oj5JK6k9J1Qk1J9J8m0J7Kl4
3330b6K5K9m2QL0l3k3M3nk1K8k4l3N4%l3K6ll9L2K4m1J8Ok4MK4j7J2kj9J8J2l9
3364c1K2J9k9RK2l3QM5l3j9L5j3nL2k0l8M7kj9JK3k2J0J5m3K0J1j7jQj2RJ3k0
$$ plain form
3131 12 24 -31 18 19 -35 10 39 -7 -2 14 -7 7 21 -15 8 34 -13 21 22 -34 -16 9 -19 -14 39 -15 -35 12 -16 -14 49 -18 -55
3164 -55 18 -12 -38 20 3 -65 11 15 -58 -12 19 -50 -19 11 -31 -9 27 -35 -26 20 0 -3 7 -29 -21 19 -22 -2 48 -17 -27 32
3196 32 -7 -13 38 13 -37 14 24 -8 4 12 -28 14 13 -11 19 5 -18 3 21 -17 17 13 -36 -24 21 -21 7 16 -47 -36 28 -19 -9
3229 -9 28 -23 -43 11 -14 -36 23 -6 -66 -10 12 -28 -2 3 -41 -24 37 -4 3 9 -22 -5 18 5 14 14 -16 4 14 -2 24 33 -38 -20
3263 -20 37 1 -4 38 -12 -24 30 8 -14 21 6 -34 -1 21 -9 11 19 -36 -3 18 -20 -16 7 -31 -21 12 -29 -12 -6 -26 -26 0 -28
3296 -28 -13 14 -43 -51 12 -15 -29 27 -19 -39 10 9 -27 16 15 -37 3 10 -11 5 11 -4 -3 23 -6 5 13 -8 11 29 -11 6 8 -26
3330 -26 -1 28 -14 -6 24 -9 -32 11 6 -15 13 -11 -44 10 10 -23 3 0 -39 -7 17 -24 -6 0 -24 -20 4 -13 -1 -3 -22 -4 8 -31
3364 -31 -9 10 -19 -10 12 -21 -13 32 -1 -20 15 2 -3 29 9 -29 18 16 -3 -2 21 -1 9 24 -19 1 12 -5 -6 2 -10 -1 12 -8
3398hrK1k3OK6l7JL3k9oJ9lk0K1%j3J1qk0K6Kk2K8rnJ6rj5J9%pqJ6k4K8J7m0J3
3436a2J7k2NK4j9JK4j2k2L0lj4J8j4j6L2lk3NJ9k1NJ2k0ORk0mJ2k2J4Jj0RK8m0
3472b6kK6k3QJ7k6Rj0J8rK0j6oJ6k3lK6Lj6J1jrK8k6rK8Nj8K0Lk5J7Lk2PK6k5
3509dKJ9j1KJ5k0j7K4Mj9NlJ%KoRpj9J0Rj3K2k0k8L3Jj7K4ok3J9Kj9QK3k2MJ3
3548ck0J0J0Oj8J9mj7K4nlK0jl1K3%j4P%qJ5kk3J3J8j8QJ4k3NJ2k0J3Nj5j7J1
3585iJ3qLqJQpqJ9j9lJ5ok0K1Ol0J6J4j0LOj3j1K5j1pK7j7kK5j0j6J8JOjpqJ2
3625HMj6mK0j4J4lj1J6LrOq%n%k7K4J4j9KK4k3lK3l8nJ8oJ2kk1K2J0j3j4PRj4
3664a9OJ3ojJ3l1J3K8k5pL3j4pPj3LK1k2PJ4k1J3J6k4lK1Jj9J8qj0J2Oko%mM%
$$ plain form
3398 -8 -17 4 -19 -13 13 -24 -23 10 -19 -25 -6 -9 -29 -8 -8 -21 -10 -18 -38 -12 -10 -32 -4 -13 -18 -2 -11 -26 -7 -7 -14 -22 -6 -30 -2 15 -25 -12
3436 -12 5 -17 -12 12 -7 -6 18 6 -16 14 11 -3 15 1 -15 17 14 -9 -4 15 -6 -1 11 -9 -3 6 -14 -18 -6 -28 -14 -13 -23 -14 14 -26
3472 -26 -28 -2 -25 -17 0 -26 -17 -27 -9 -18 2 -14 -20 -4 -27 -30 -4 -1 -17 -6 -7 -16 12 -14 -23 5 10 -8 12 15 -10 7 10 -12 -5 21 -4
3509 -4 -2 17 6 8 23 3 -14 10 14 -5 0 -3 -2 -2 0 -6 3 -4 -23 -13 -4 -17 5 -15 -43 -10 -9 -26 -2 -8 -31 -12 -10 -29 -21 2 -20 -16 -3
3548 -3 -23 -13 -3 3 -15 4 0 -17 7 2 -1 19 18 -13 10 10 -4 3 3 -5 10 8 -15 -2 16 -2 6 20 -3 2 14 -6 7 12 -3 -20 -9
3585 -9 4 -4 -1 -9 -8 0 -7 -15 4 -15 -18 -3 -9 -29 -8 -2 -32 -16 -2 -12 -9 -3 -16 -27 -2 -13 -20 7 -10 -12 13 3 -13 5 6 12 11 4 -4 8
3625 8 12 -4 -8 12 -2 12 9 -2 14 17 8 14 6 6 1 1 -26 -2 12 -7 -5 19 -4 -7 16 -22 -27 -9 -15 -3 -5 -26 -4 6 -7 -21 -14 -5 -19
3664 -19 -13 0 -6 -7 6 -25 -12 16 -9 -16 17 3 -4 3 -10 -7 14 -8 -1 13 -8 5 21 -3 -6 15 16 -3 15 7 -3 9 15 13 7 7 3 7 7
3703Gj%oj7K0j0pMJ1l0PK8k1j3L6k6mJ6j4kJ9nl0L0Lk1J8jJOjj6J0J9j7jMrJ6
3742CJ7k0J6Jk0jRJjK%j1J5k3RK4k5kQOj6L0qk5J7pk0K2Mk2J5J1l1J1J4l0J4J4
3780Ak1mJ6j1JK0j0j2J0J4l2QJ6j6J7Lj3J1Mj1PLk3K9MqJJmlJ6lj1K0k0NOqKJ8
3820B3Lk7J9k8%JJKK0j5j6J9pj0mK5j4JJ0j6LJ2j6nK6k2NOj5J1J3j6oJ3knLoM
3859a0J1OqnKj1ROlJ9rj6KOJ8J0j6k4J6J1j3J6pqj4RpkK3Lk4Rlj4J5j7NNJ5k3
3899a8Nkj2J5J7j4Qlk8K0J0j3NLk3RJ7j0%Rj1MJ4j2JNJ0j5P%jkmmL0J0j7Mj3j4
3939a3J3J3j5J8pj6LJ3j9PJ5k2pK4rnmpOK3k1mMrNJJ1lrNk6K7QqjonJ3J7j5%o
3981a1j2K4rKNOk0J3NNqpmJ0J5j5J6j1mmJ6rlRj6j3L0kk2K2j3o%K5k0j9J4kPQ
$$ plain form
3703 7 6 6 0 -17 3 -7 -14 -10 1 -29 -22 6 -15 -28 8 -18 -22 -6 -20 -22 -3 -8 -38 -8 -5 -26 -8 -9 -8 -2 -3 -19 -9 10 -7 -8 -4 -13 3
3742 3 20 0 16 17 -3 -4 5 6 5 7 7 -4 11 -12 -3 21 -4 -6 2 8 -8 22 14 -11 6 -1 -21 1 5 -17 -2 9 -22 -11 3 -27 -13 1
3780 1 -20 -24 -8 -19 -18 2 -8 -20 -10 4 -28 -20 -4 -20 -3 0 -13 -2 2 -9 -2 1 -22 7 11 3 4 5 1 -2 14 11 0 20 0 5 11 3 5 23
3820 23 26 -1 18 -10 -10 -9 -8 -6 14 -1 -17 2 -5 -15 -19 6 -8 -7 3 -13 -10 2 -14 -19 7 -15 -10 -4 -19 -8 5 -11 -17 -4 -6 -11 -8 -14 -10
3859 -10 1 7 -1 -6 -4 -15 -6 0 -3 16 7 -9 -7 -1 17 27 11 -13 3 14 1 17 10 2 -12 -3 -10 -12 11 14 -10 -1 -4 -18 -3 -20 -15 -10 5 -18
3899 -18 -13 -15 -27 -12 5 -9 -1 -4 -32 -12 -2 -15 -10 -7 -30 -21 -4 -14 -14 -5 -16 -12 2 -10 -9 -4 6 -9 -2 -2 -3 -5 -9 -13 17 27 10 14 1 -13
3939 -13 0 13 -2 16 9 -7 -4 9 -10 -3 12 -10 -17 7 -2 -7 -11 -18 -12 11 -10 -14 -10 -19 -14 -13 -2 -5 -14 -9 -35 -8 0 -8 -9 -15 -20 -7 10 -5 -5 -11
3981 -11 -23 1 -8 -6 -1 5 -15 -2 3 8 0 -7 -11 -1 14 -1 15 4 0 -4 12 3 0 9 -7 -20 10 8 -14 8 -5 -11 -11 14 -6 -25 -11 -13 -6 2
4021Bj2j8K0qoJ1JnKj8K5Knmj3OMK3j8KJlRJ0lklmj2K0J8j9jK3k2MJ9l0OJ9j9
4062BpJ8j5j9K1JmQqmNNj9L5k0l3K4Qj8K0qk7J6J4j0%Nj4%MJ1J2j5rjQRJ0mk4
4102b3LJ2j6PJ9k3MK5j2k1L8rl4K8K4l1J7Kk7J5L8l5j2K8l4ML4nj8mKj5J6Jjo
4138iqrK4j3MLj5J3J8j0k4K7qk7L5Ol5K8%l1RM3l4kJ3j3NK3j5lNj8K9Qj9oK2k7
4176a1NK9qk2K4j4k2M8ml9KL1m2K0K5l2%L2l0nRJ4k2KJ3ppjJj4NOMqPJ7l8mM4
4215Hk2j7K6kl4N2%m7L0J6l3OM3m0%K3k8MK9Jk1J2qmK1j0j4J7klK2jl5K7j5pK6
4252B0j8j9K5oj8J0J7j4nJ0Jk0L0k7lK3j4%%n%Rj1%RjqJ5k3J1Rok1M2j2k6L3o
4290Aj7K9%m2K5K4k2j0L2j4k1K4nj1J1Mj4J1J4j3nk2J5J0JJJ3k2rK7j3qK7k5j4
$$ plain form
4021 2 -10 -28 -8 -16 -22 -11 -10 -15 -13 -31 -6 -4 -9 -13 -26 -20 -16 7 -11 -9 -8 -11 -2 8 5 3 0 -4 -16 4 22 3 2 25 3 7 26 -4 2 21 2
4062 2 -5 13 -2 -21 0 1 -3 5 -3 -7 -2 3 -16 19 -1 -34 -10 -2 -20 0 -8 -35 -19 -5 -15 -15 -10 -24 -24 -20 -9 3 -12 -21 -22 -14 -5 5 1 -23
4102 -23 -20 -8 -24 -17 2 -21 -17 8 -4 -25 13 4 -30 -2 22 -9 8 10 -17 -2 36 1 -11 17 -17 -13 21 16 -2 -6 -4 -19 -3 -2 -3 -9
4138 -9 -17 -26 -2 -15 -11 -8 -23 -10 8 -2 -26 1 -7 -34 1 7 -28 0 0 -31 -22 21 -13 -15 -2 -15 -10 13 -2 -5 0 -18 11 19 0 -6 16 -11
4176 -11 -6 23 15 -7 17 3 -19 29 25 -14 -12 19 -23 -3 22 -10 -10 22 -8 -13 -4 10 -12 -10 3 -4 -11 -12 -11 -25 -20 -14 -10 -18 -11 6 -32 -36 8
4215 8 -14 -31 -5 -7 -41 11 11 -36 -6 10 -23 -17 26 -14 -14 9 -19 -15 14 15 -6 6 -2 -6 15 5 -9 8 6 3 25 24 -11 16 1 -6 20
4252 20 2 -17 8 2 -16 -6 11 -3 -8 2 3 -17 13 -14 -17 6 -8 -8 -8 -13 -13 -4 -15 -15 -6 -7 -15 0 -23 -12 -3 -9 -30 12 0 -26 7 1
4290 1 -16 13 13 -29 -4 20 -2 -12 20 6 -15 9 4 -7 4 8 -6 5 19 6 1 -21 -6 4 5 6 19 -3 -12 15 2 -6 21 -4 -18
4325a8J6nj0J9Rl9%L7j8LOk5mK4Rk9K2q%J1mLJ0j8j0J4J8rMj7jK4mk7K5kj8J8
4363FPj8J4J8k5MJ9nk2%j0PK1Rk3Kj4J0KqOQl1KJ0J2k0L0j2k6K6Ql4OJ3j6J9K0
4401A5j9j3K2j6%J7J0j9Pj6lJ2Plm%jJ8rlJ7j7QLmj2J4Kj8L3Kk8Kj0jK5Pj3j6
4440dPmmJ2pnJ5j7j0J9kj4J7lk1L6k4k8K0J5jK7k2k8PJ4j0QK8k6j4NLJ1J9j6l
4477@mlJ7jopJ4j0KRk4QPLKK3j7l3J9RQL%l3JK3k6J2Nj0j9M1k3JK%j8K0J0pkj6
4519b0oJ9KMJ5k8j4J6J1k0K2On1L0RoK8j4k1nL1Pj5J1k1J9J5qLj6pRJ3Pj1Nk8
4556ij7M1Mj9K5l6%K3kj3J0Nk8QK1j5rRppJ8J0k7rKKJ6nLj0rJ6J3n%lj2%K7Jk2
4597a0J4k5pL1K5l8PJ7l5J8K9k1%QpnJ7pk0K6k2J4J9k1j7RJ1nJ2j7j4JKnJ9Pk0
$$ plain form
4325 -18 -2 -7 -17 2 11 -28 -28 9 -9 -6 0 -25 -29 -5 4 -25 -3 -11 -11 0 -4 -1 9 -9 -19 -5 13 4 8 -9 -10 14 10 -17 8 6 -12 6
4363 6 13 -5 9 27 2 6 25 20 -2 -2 -12 -5 16 25 2 4 -10 0 2 -6 0 8 -23 -21 -11 1 -19 11 -1 -27 -1 7 -27 -21 -8 -24 -5 15
4401 15 -4 -17 5 -11 -11 6 16 -3 4 -12 -15 -3 4 1 -3 -3 -4 14 5 2 19 2 10 13 9 -3 11 13 -5 28 30 2 4 -6 -7 18 25 12 -4
4440 -4 3 -1 -5 7 0 -5 10 -7 -17 2 0 -14 3 0 -21 15 -9 -37 -17 -2 -3 24 2 -26 -19 -5 -15 -7 21 -5 -19 -14 -11 0 19 3 0
4477 0 -4 -7 10 9 3 -4 10 0 2 11 -13 -5 2 5 7 30 13 -20 -1 8 16 19 19 -14 -13 10 -16 -4 1 -9 -28 13 -10 -9 -7 -7 -25 -5 5 -2 -4 -20
4519 -20 -26 -7 -5 -1 14 -14 -28 -12 -1 -21 1 7 -44 -14 -5 -11 17 3 -18 -23 8 15 0 11 -10 9 24 16 19 3 -4 5 18 25 14 19 -9
4556 -9 -26 15 19 0 25 -11 -11 12 10 -3 7 12 -16 -8 13 -2 -11 -2 -9 -16 2 12 -15 -24 -22 -20 -4 -9 -6 -16 -25 -9 4 -1 -1 -4 -16 -16 11 12 -10
4597 -10 4 -21 -28 3 28 -10 -3 14 -21 -3 26 5 5 13 6 1 18 11 -9 17 -5 9 28 7 -10 -1 10 5 17 0 -14 -13 -11 -16 3 10 -10
4634a0qLj6J7K7k8kJQkK5l7J2JJkK0j7nQkLJ7j1kj0mNK5lk2K2nj5J6Lj9J5Ok7
4674a2RL8l7jK2qpJ2k0j0K0J8j2rmPj0j5J5Qmk2J3j6J2K6mj7jMj6K8ll1RJ8j3
4711a3j1K9j3oPJj2L6j0j4K0Ql7J2J6k3K0mk2K1Kj3J4JnPLrpJ0qQjomK7l3QJ0
4750Ij7JJOlJ2j3jLj3MLJj2kJ2jQKqkNk5J4J0J5j6%mJ2%nKK7k4pJ0Mj2J7pOqJ6
4794B0j5OKqOJ2k7NRJoQj0nKj1K0ljj5Qj4K3mk2lJ6qJJ6kj7K2k0%J1J0j1pmkJ4
4836cJ8k0j1J4RrQjj3J3OOj9K8j5jPJLk1PqJ9Qj0pj6K5rj2J9j2onJ2oJ2Kk2lJ4
4877BjoPj4j6K1kKJ5j7Oj4QJ0jJ0k9J1QpK6l0j0K9rRj0krK2Oj0%K3k2j2K6J1o
4916B5j5pKJ2QNl0lpL3j9J6nj4qK0rOK0l0k0K4Lj3J8j2k4J5J4k6PJ7pj4J8%Lq
$$ plain form
4634 -10 -18 -15 -31 -14 13 -15 -17 -16 -8 -10 15 -22 -10 -9 -8 -10 10 -7 -12 -4 -6 -3 14 3 1 -9 -13 -8 17 14 -8 14 9 -6 10 13 -6 9 15 -12
4674 -12 -3 35 -2 -3 19 11 4 16 -4 -14 6 24 12 3 -1 6 -4 -19 -4 4 0 -22 -9 -25 -13 13 9 -8 -9 -5 -21 7 4 -27 -18 0 -13
4711 -13 -24 5 -8 -14 -7 -6 -18 18 8 -6 14 22 -15 -3 13 -10 10 6 -16 5 7 -6 8 9 4 11 14 5 -2 8 0 8 7 1 -3 24 -9 -1 9
4750 9 -8 -7 -6 0 -3 9 -4 -5 -2 -15 -11 -8 -7 -19 -21 -9 -10 -2 0 -8 -10 -5 -30 -16 -6 9 -7 -7 -11 1 1 -4 -2 25 1 -6 4 8 -4 13 6 12 4 20
4794 20 5 11 13 5 11 23 -4 1 10 11 5 13 3 -2 0 -11 9 6 5 -10 -2 -16 7 3 -19 -22 -6 -14 -13 3 1 -16 6 -14 -14 -3 7 -4 -11 -15 -17 -3
4836 -3 15 -5 -16 -2 7 -2 6 5 -8 5 11 17 -2 26 11 10 17 18 21 0 7 -1 18 26 16 9 -7 18 9 -3 16 4 -2 -7 5 -1 11 13 -9 -12 2
4877 2 1 -5 2 -12 -28 -7 -9 -7 8 -9 -3 -17 -9 1 0 10 -19 -8 0 -7 19 -11 -21 8 -1 8 -2 -4 -13 9 15 5 5 28 6 -6 20 31 25
4916 25 10 3 5 17 25 30 0 -3 -10 23 4 20 15 1 -7 13 4 10 30 0 -20 4 7 -6 12 0 -24 -9 5 -21 -14 3 -4 -18 0 0 3 -5
4954eNk4K2Pq%j2OJ9qOk2LJ0J6jk4J4Pj3J1Rj4j1Rj1RJ7qj0LRj4K3rj3kNk1K7
4994GMkj7kJ1J0Jk5Kk1PK9ll0K1Jj9J7J5l2kK7j4PK1j7k4K5knK3lj1mOJ1j4%J0
5033Hmj4J8K1k6OJk7J6K0qj3mJ4pLJ9k7J4Nk4%K8Jl0J0nj0K6Lk7J3Okk5J9rOj
5072foJ1Lj1JnOPOl6J4RjLJ5nk5L5k6J2J7j4j6K3qJkJ4j4R%OQkk4J5qK%Lj3QP
5115A3pJ2Jk7lL3l0LJ2j3j9L3rk9J4RnJ3J4k8pJ1Jj1K3Mj7J0j3J5%jQoqmK2j9
5153eJ0K0k3PJ3j3j0K3j3j7L0Jl1J1J4j8K8lj9jK6k8JJ1j1lNj5LRmoJ0kmJNj3
5191a1J%j2K2qj4K0oj1J3Pj5kJ2k0J6J3kk8L5pplPqJ4LqPJ0j6Nj1JJ8j2%J5j4
5230DpK6k3j6K1J9m3J9Rk3K1Kj7j0L3k1j3J4koKLj5QKjJ4JJmj2nK4Pj4Oj4NJP
$$ plain form
4954 -5 0 -24 -2 5 -3 -3 -15 -9 10 2 8 -14 -11 -1 15 14 -10 4 11 -2 9 18 4 -7 2 -9 0 17 9 -1 2 11 -3 20 11 -2 -4 1 -20 7
4994 7 11 9 -8 -10 1 11 12 -13 -11 -32 -25 4 1 -29 -8 -7 -26 -9 6 -26 -28 -1 -15 -8 13 -4 -28 -3 -5 -10 13 10 -1 -5 1 12 -2 -2 8
5033 8 4 -10 8 29 3 9 10 -17 -1 19 11 -2 -6 8 1 4 23 -4 10 15 -9 -9 19 20 -10 0 -5 -15 11 14 -13 0 6 4 -21 -2 -11 -5 -6
5072 -6 -12 -1 2 -9 -8 -13 -7 0 6 -30 -16 -7 -8 -5 10 5 -20 15 -11 1 18 4 -12 11 3 4 2 16 2 11 11 17 25 23 -1 14 6 8 8 11 -2 6 13
5115 13 6 18 19 -8 -11 22 -8 -5 7 -6 -25 8 -1 -30 -16 -7 -12 1 15 -13 -20 -9 -8 -19 4 8 -9 1 -12 3 3 2 10 4 -4 -8 14 -5
5153 -5 5 25 2 9 22 9 -1 22 9 -8 22 23 -8 3 17 -1 27 24 5 4 30 2 3 14 3 0 5 -10 -7 2 -2 -8 2 0 -4 -3 2 -11
5191 -11 -10 -10 -22 0 -8 -22 -2 -8 -19 -6 1 -14 -16 -4 -24 -8 5 3 -25 10 3 -4 -7 0 -8 6 9 1 8 18 2 7 -4 -3 15 3 3 18 4
5230 4 -3 23 0 -16 5 24 -19 0 9 -14 7 9 -8 -18 15 -6 -19 -5 -7 -13 -11 -8 -23 -15 -13 -14 0 1 2 -2 -14 -19 5 12 -2 4 -10 -5 -4 3
5270Ck7J6K3k8PJ9j9J4Rk7kJ8nj5K4J3l2K8Ok8KJ9j1pMJ6qj0jJMj6J2Ol0J0K7
5307A5l1RJ6j4lQj8jJ9pj9K2J0k8lJ0LJJ9k5j2J2J1L%OOrj8OK0j1K2j2k0J3K4
5344B4m1J2K2k0oM2l5rL5j8k8M7Rm4JJ4j8J6K3k0j6J2j1J2Nj5%LrNJ2j9J3qj9
5379b9L0Nk3LJoOK5j5k9L3oj5K1KqPmj3K9Lk6J2rLJ0nrNK0j2lJ3j9kJ6k0J1K7
5418B9j7k0J0Mj1J9pk0%K6k3%O%mmqNj%Rp%J5j9jK0nk0K6oj8K1J0l1J7L0l2%J2
5458ErmJ1J5n6M3J3k5J6nj6J2K2k5LK3j1j7J5Pk6RRj3KpK0j2p%J0k1J5Pl6K0K4
5495A1l5pM2j6k2J7kj2K3j4k0M0Jl8J6J7j7K4mk8J3J5k4J6Rj7J6J3k2qK5Nk2M
5529aRj9K4j3jJ5j6ROoj3J5j1MJ5%k0Rkj2J8%j7jK3k6J3Nl8K3J7l7K4K0l2nK3
$$ plain form
5270 3 -24 -8 15 -13 -6 13 -6 8 17 -10 -12 6 1 -14 10 23 -9 19 25 -3 -1 18 7 0 4 20 12 2 1 2 6 -10 2 8 -22 -12 15
5307 15 -16 -7 9 -5 -8 0 -18 -19 0 -7 -26 -4 6 -22 -25 -15 -12 -11 8 -17 -29 -17 -6 -3 -3 3 9 0 -18 -12 8 -3 19 7 -13 0 24
5344 24 -17 -5 17 -3 -9 33 -2 -11 24 6 -22 25 34 -10 -9 5 -13 3 26 6 -10 2 -9 3 8 -7 -7 -4 -13 -8 4 -15 -2 -10 -29
5379 -29 1 6 -17 -14 -13 -19 -13 12 -3 -32 1 -5 -20 1 3 -5 2 -2 -15 14 17 -9 3 -6 -3 7 2 -7 -2 18 6 3 16 -3 -5 11 -9 2 29
5418 29 12 -8 2 6 -5 14 7 -13 -13 13 -10 -10 -4 -4 -8 -12 -20 -15 -16 -16 -7 -14 -14 1 -18 -19 1 -4 -24 2 -4 -22 -1 9 -22 -5 25 -7 -7 5
5458 5 -4 -8 3 18 -38 5 18 -7 9 4 -12 0 22 -3 0 23 12 -5 10 17 -9 0 9 -4 -2 -9 11 -1 -8 -8 2 -19 -4 3 -33 -13 11
5495 11 -24 -31 11 -5 -27 -10 -12 -24 -1 -15 -35 5 6 -32 -16 1 -16 8 4 -24 -11 4 -20 -4 5 -12 4 17 -5 -13 12 17 -5 -1
5529 -1 8 -11 13 0 -1 14 -2 7 13 7 -6 9 -2 2 17 17 -3 6 4 -8 10 10 -7 -8 15 -11 2 7 -31 -8 9 -28 -4 16 -16 -21 2
5566Bj8qK1kk4K5J1k6MJ2qpK3j8pL2j9jPmLJ6j7MnNlQj0J9rjllj0J1J0j3j6L5
5606A6qk5K0Jj3J2kl0K9J4k9J5Qk3jJ7k7LM0k9k2K9j7J2J6qk3K3Jj7J0J3j1kk
5641a0kK1j1lOmKR%k1K5MpnKMKQk5lK9j0j5K1j3LJ7k6j6K7oj1J4nk0OJ7k3J9Q
5681Hk2OOk1J8J4k7jJ8j5J2j0PnMlkKJ7j9kNjJJ2j4J5OqOrONjj2J2Mj1KJqNK1
5724B2j4j1J8k6RJ0k6J0K4k2j3J9p%J8mk6RKnkK8k7J1Jj2kJ0npJ1nNJ0k1mL1k
5762GpjLrJ4j1LJ4j1pJ6mqJ7j6mJ0knJ4jj9NL0l5J0J1k3LJ1k1J1J1roJ1mj3J5
5801@j3%KmlKJ9k7MJ3k4J4J8j4rK6npRj4jK1mj8J2ljKnJ6%j1mK0j2Mjj0JJ4Kj4
5843eNJ3k2J3oqJ2K9l1j0K5k0Nkj1lK9j2j5J2j6J5Pj2j8J1MmQNpPrqJ1Pj3J3M
$$ plain form
5566 2 -16 -24 -3 -5 -29 -4 7 -19 -15 -3 -11 -18 5 -13 -20 12 -7 -8 -1 -5 -2 14 -3 1 -4 1 -2 6 -4 15 6 5 2 -1 -11 0 10 -3 -19 16
5606 16 8 -17 3 4 -9 3 1 -29 0 14 -15 0 8 -15 -16 1 -26 -23 17 -12 -34 -5 -22 -10 6 -2 -25 -2 -1 -18 -8 5 -6 -8 -10
5641 -10 -12 9 -2 -5 1 -3 -1 8 8 -13 12 16 9 4 6 10 12 20 -5 -8 21 11 -4 17 4 7 24 -2 -18 9 3 -8 6 1 -19 -13 4 -19 0 8
5681 8 -14 -8 -2 -23 -5 9 -18 -19 -1 -16 -4 -14 -7 -12 -8 -11 -13 -11 6 -13 -15 -10 -11 -10 2 -12 3 9 1 7 -2 4 9 8 -4 8 12 1 3 4 -4 1 22
5724 22 8 -3 15 -11 -2 8 -18 -8 16 -6 -19 0 -7 -7 11 7 -19 -10 -8 -13 -15 13 -14 -3 -2 -14 -16 -6 -11 -18 -7 -12 -7 3 -18 -22 9 7
5762 7 0 -1 2 -7 7 -4 -1 13 2 -5 11 7 -1 16 0 -4 6 4 -1 13 12 -7 -2 28 -7 3 14 -9 -6 5 -16 -5 6 -3 -9 2 -2 -15 0
5801 0 -13 -13 -11 -15 -18 -16 3 -24 -20 -7 -31 -17 1 -13 -22 4 -1 -8 1 -13 -14 7 3 -15 -3 -6 -7 -5 -10 6 6 -5 -9 11 -1 3 2 -8 -7 7 9 -5
5843 -5 0 13 -9 4 -2 -10 2 31 0 -10 15 -5 0 -2 -13 -16 13 1 -14 -2 -18 -3 4 -8 -26 -15 -11 -15 -7 -2 -9 -2 -11 -19 -8 -1 -14 -1 3
5882Cj0RjlqK0rj5J9Mj1%RoOJ9j8KqJ0lmmJ1mj1J2j5j4M3j6j9J0J0k0OJ1k4J2
5921gK3l4oJ6Kj6J9Rl3K2j7QJ0OnolLpPoK1qpJ1j7J0J7nj9J7Kj2kJ9j9J3J2ok3
5961a1J8J0k5K8j1mJ8j1j6NKJ6j0j1kOpj3J4J0nKlk4OJ6j9PK1l3J1Pk5J9K0j1
5997ej7NJ3k2K1Qk5J5oKJJ1KqkRQjj8K0jj8K4%l4J4J9k0%K0j4nL3l3j5L1J2m8
6035b4K5Qk0K0Kk0nK6j7Nj3N%lNrJmK2j3j2K7j0k2QJ9j6%J3nqK3pl0K6Rj1LJ7
6074A5k9J6J2k2KJ7qjOj0kJ2jj0OmJ3kj2RPk7J6lOpJj0rK2Nl1RK0k0J8Nl6J7O
6114doj6J6J0j9jqJ9MPj9J2%LK6l2nK1nkOnj4K7rqK0Pl8JK5j7J2J1j0j2J7mqJ7
6154A9rn%nlJ6%lnj7K3Nk1j0K5j6PK3l1j1L1j3l0M4Mn0J7K2k9J1K5j9j8K6Jj1
$$ plain form
5882 3 -7 2 1 -2 -10 10 1 -14 5 9 -2 -2 7 1 7 26 8 10 2 12 9 5 1 12 8 -3 9 -6 -20 23 7 -12 -2 8 -12 -6 5 -19 -7
5921 -7 16 -18 -24 -8 -6 -22 -3 6 -27 -5 -22 -14 -4 2 -3 -9 -12 -9 -16 -9 -15 6 -2 -9 2 -15 -5 12 7 -12 5 7 -5 -7 12 -7 6 18 12 -11
5961 -11 7 17 -8 20 9 5 23 12 -4 1 3 19 9 -2 -4 2 -5 -18 -4 6 1 3 0 -24 -18 -2 -21 -14 7 -26 -15 -8 -33 -14 6 -5
5997 -5 -22 -17 -4 -26 -5 3 -22 -7 -13 -11 -10 1 3 -5 -7 2 10 9 -9 11 10 -8 16 16 -18 -4 15 -5 -5 15 1 -4 29 -4 -19 12 24 -24
6035 -24 1 9 -11 9 11 -9 -14 12 -5 0 -13 -8 -8 -11 -6 -15 -14 -18 4 -9 -21 6 -4 -26 -18 1 -15 -15 -2 -7 -15 8 1 -29 -3 6 -5 -2 15
6074 15 -14 2 14 -8 -6 11 3 2 8 -2 -4 8 7 -3 3 -1 12 10 -2 7 14 -13 3 0 6 -1 0 -10 -19 3 8 -23 -14 6 -14 4 9 -27 -10 -4
6114 -4 -10 -26 -10 0 -19 -20 -28 -9 -5 2 -17 -5 -5 -2 24 -8 -13 8 3 1 7 2 -12 15 6 -2 18 25 -13 -12 13 -4 8 19 9 -3 14 10 2 19
6154 19 10 5 5 0 -3 13 13 10 5 -12 11 16 -5 -15 10 -6 1 24 -7 -18 13 0 -30 14 18 -32 -15 7 -22 -11 14 -5 -23 3 4 -7
6190gK1j7rOJ2rM%loJ2NRk1ONlJ4Mj9j0J1%oJ4Nk9J1J4j6J1J7j8k1NkMK1j7j3
6230a5RjmJ6k3NJMoK2%j7LKkJ8nk3J6OnrK5rk0J9mqL1j3j2JJ0L%mrMJMlJQpk0
6275a0K4J2k0qnlJK9j9k3J9J5j8R%k0QJ2k7J5K2k3j2J0Oj9K8nl2K0J0j6J4rpJ7
6311eqNRMpPj5kL0j1j3jJ1JPpNrK3k3JJ9opnMKmMpNpJJ0k4J6kllJ7j6nK3Ll8J8
6357cKj6J4Qk5KJ4nrK2j1j6J5J1Jmjj5J4J6j3pOLJlNRPk2J0nnK7j3k4J9Nk6L3
6397B1%k1MK5k4nK0j7j6J1K0k0K9j7m0K2J6j2JJ6l0%OkMPj7lROJ1Oj8j2J3JjJ5
6435Hj3qK2j7mK9rl5J9KJ2J1Ol7pL8qlRk1lJ6mJ8j4rrJ3jJ3Jj7k2K4jkL0k8l3
6474c4K9LlJ3Jl6KJ1QJ8ml0jK2KMj3rpJ8J0mj0pj0K2nJ0J6k5j7K9ooL5k0k6K4
$$ plain form
6190 -7 14 -3 -12 -6 6 -3 1 1 -2 -8 4 9 18 -3 3 8 5 19 23 4 -6 5 5 -1 13 18 -11 0 14 -2 9 26 8 -13 -8 -10 -6 15 -2 -15
6230 -15 -6 -7 -11 5 -18 -13 -12 -8 -14 8 8 -9 -6 -4 -6 12 7 -16 0 6 1 -8 17 8 -12 7 3 -5 26 13 1 2 12 15 15 11 2 6 7 11 8 9 17 10 -10
6275 -10 14 26 6 -2 -7 -10 -9 20 1 -22 -3 12 -6 3 3 -17 -9 3 -24 -9 13 -10 -22 -12 -6 -25 3 -2 -34 -14 -4 -20 -6 -15 -22 -5
6311 -5 -13 -8 1 5 -2 5 -10 -12 18 7 -6 -7 4 5 12 5 10 1 24 1 2 21 15 8 3 7 9 5 9 2 7 0 1 11 -13 3 1 -2 -5 12 -4 -9 14 17 -21 -3
6357 -3 -1 -17 -3 5 -20 -18 -4 -9 -18 4 -7 -23 -8 3 4 0 -1 -16 -2 14 1 -6 0 3 4 1 6 15 22 0 10 5 0 27 14 -10 9 14 -12 21
6397 21 21 0 4 29 5 0 20 3 -13 -2 18 -2 27 10 -30 -8 8 -4 -3 13 -17 -17 -11 -13 -9 -2 -19 -22 -13 -7 4 10 -8 -20 -7 -6 -7 8
6435 8 -5 -13 9 -8 -12 17 8 -27 -8 -6 6 17 23 -14 -21 17 9 6 15 -6 -9 7 3 21 7 -2 -11 2 1 14 15 -2 -24 0 -1 -3 27 -1 -34
6474 -34 -5 -2 -5 8 9 -27 -25 -14 -6 12 8 -22 -23 -1 1 5 -8 -17 -24 -6 4 0 -10 -17 -27 -5 -10 0 16 -9 -26 3 -3 -9 26 6 -20 4
6512DJ1j5J2J0k0lJ9j8mL4l7lJ1J2kPk7j1J9MJ0j3j0jJ6jkPj2l0J6J5lJ1jk9J6
6549hJj0J8Ol3J5J4j1mK8j5j8J9%mK0j9j6K0J0j3J2j4lJ2Rj9L1j4k0J3Nj4J9N
6584B2m0NK0pKJ2k4NJ8j3MJ0k5QJ0j1jJ4k2j5K0nJ7%j1k3K7Nj2MJ1k3J1Nk3K7
6620BJ2k6lK9k6JL3j9j0L0k4j2K8kj2J7j4kJ9oj3J2j2lJ5qqPJ2j2JnJpJ3k3PJ7
6658Ij2Pmj5JK0j4kJ2j7jOmRJ8k4j9L4%k0K5j3j7RK1j2Prk5K0K9j9K0j5k3J4J9
6695A5nqJ2l0J0K6j4%Nk4NJ0jNPk9pL1j5LJ4k2j7L0krK0j1l0J7Qk1K8Ml7J0K7
6732Ej3J1qj4RJ4joOk2OJ0NRJ5l4k6K6OJ2J0j2k2K7Kj0Rqk1J2J5nRj0j1j6J8J0
6770GJ7j9k8KK8j2J5nk8QK8j8J2Oj7k3K3p%K1k3k4K0J6j4J4j6j2K0J3j4JJ0jk1
$$ plain form
6512 4 15 0 12 22 2 -1 18 0 -4 30 -7 -10 1 13 11 18 -9 -20 -1 3 13 0 -10 -11 5 4 2 9 -3 -33 -17 -2 -5 6 5 -24 -8
6549 -8 -7 -17 1 7 -26 -11 3 -8 -12 16 1 -17 2 2 -2 18 -1 -17 3 13 0 12 -2 -5 7 16 -3 28 14 -6 7 12 -2 17 22
6584 22 -18 -13 7 0 2 14 -10 -5 13 0 4 14 -11 -3 7 -4 -5 9 -13 -28 -8 -13 4 4 -7 -30 -3 2 -10 -6 5 -18 -7 -2 -25 2
6620 2 14 -12 -15 14 -12 -11 22 3 -7 23 -1 -13 15 13 1 18 4 2 21 15 2 14 2 -1 14 6 -2 5 17 5 6 1 2 -5 8 -15 -8 9
6658 9 -3 4 0 -15 -14 6 -8 -10 2 -15 -16 -10 -14 -5 13 -11 -30 4 4 -16 9 -4 -21 -12 9 -3 4 -5 -30 -10 19 0 20 5 -18 -4 15
6695 15 10 2 14 -16 -6 20 6 6 11 -13 -8 2 1 6 13 -16 -23 8 -7 -4 10 -12 -29 1 -1 -10 10 -1 -31 -14 -6 -27 1 5 -32 -22 5
6732 5 -8 3 -5 -19 -10 4 3 -3 3 -19 -13 -3 2 11 26 -8 -34 -8 -2 10 20 8 -14 13 15 5 14 6 -15 -3 12 7 16 6 -5 -21 -3 7
6770 7 24 5 -23 -21 7 -5 10 5 -23 -15 13 -5 7 13 -4 -27 -4 -11 -11 10 -13 -37 -17 -1 -15 -1 -17 -29 -9 4 -10 -9 1 0 -21
6805b1J2QK2ml5J0MJ7qJ2l2J2J8ojJ0j9L%j3%L8k5j7QJ6%Lkk1LOjJ9j8pjPk7L5
6845EPj7nJ0pKJ5k1pK2jk2J3Qj2J7opJ0pnKNJ2lmj2nJ9kkrj1K1rpL1Qk2lNk0J9
6888EL0l9j6K9rrJ9Ml4K8lj9J6J7k8rJ6rJ9lj0j1J0j0j1M1j8JqolJ6Lj2k%PJ0
6926BopJ4oj4K5moJ4nj7J3K0k5OMkKRj0j5K1qJ0J2j9qRj1JK0pj2%j0JJ7J1k9m
6966a4Pj4K5Ok0PJ0k6OJ4Rk4Qnj6L4rlj0KKRKLj0JJ3kj8J4J8k5j6K3nJ0J0j9o
7005iJ1Qk1RK5k8qK1ljNooK2Kj6j1qJRJ3rj2J1j1mK9j8J1k0nJ7%MJ8k9j3J5Oj6
7045a7K7kk6OKJ1J1Nk4j0J3K0j2Nrj2K2kpJ3Kk5K0n%J8j3l2L0Mj4QJ1l0pL5j8
7082bKLnk6L3%j8K0j4k2K0K0mj8%oKJ6Lj8j0LJ1J2j1J5j1k3OJ4jJ8Ok8j0K9j4
$$ plain form
6805 -21 -9 -1 21 17 -18 -8 -4 13 5 17 -15 -3 15 9 8 18 -1 2 2 -11 -11 27 2 -15 -7 9 9 12 10 -11 -8 -2 -3 16 -2 -9 -10 -3 -30 5
6845 5 12 -5 -10 0 -7 -5 10 -11 -18 4 3 -19 -6 2 -10 7 1 -6 4 -3 -8 -6 -1 11 8 4 -8 -13 6 4 2 -7 -18 3 -6 -13 18 26 4 1 6 -14 5
6888 5 35 -4 -20 9 0 -9 10 14 -20 8 5 -14 2 19 -9 -18 -2 -11 8 5 -5 -16 -6 -16 -27 14 -4 -3 -11 -17 -20 -4 -1 -13 -15 -15 -8 2
6926 2 -4 -11 3 -3 -17 8 4 -2 12 7 -10 3 23 -2 4 8 6 8 17 7 -8 13 5 15 27 8 0 9 -2 -1 19 12 0 0 -10 -9 8 19 -10 -14
6966 -14 -7 -21 4 10 -10 -3 7 -19 -13 1 10 -14 -6 -11 -27 7 -2 -5 -15 -13 -11 -2 0 3 -7 -6 7 5 -13 1 19 -6 -22 1 -4 6 16 -3 -9
7005 -9 2 10 -11 -2 23 -5 -13 8 5 4 9 3 -3 19 21 5 -6 -14 -13 -4 9 0 -12 -1 -12 -16 13 -5 6 -14 -19 -2 -2 2 20 -9 -22 -7 -1 -17
7045 -17 10 8 -18 -12 -10 1 12 17 -7 -17 -4 16 4 9 0 -12 10 8 1 14 16 -9 11 6 6 24 11 -21 9 13 -1 7 18 -12 -19 16 -2
7082 -2 0 3 -2 -28 5 5 -13 7 -7 -29 -9 11 7 -11 -11 -17 -15 1 4 -14 -24 -21 -10 2 -9 6 -5 -28 -22 -8 -9 9 15 -13 -23 6 -8
7119h%K5k4j7L0krJ6%k1KK7j0Nqj1nK5lqj2LJ0noJ3%k3J2lJ5rNj0k1K1J4j2Qn
7159aj9J9J0rnQj0rK0jMj0jnJ1Roj7oL1lj4J6Kj4ORk0KL7k7j5J3K6k3oMj2ML0
7199B8k0k1K5%lj8J6j3kQJj0J3M%j4OKj3LnJ4j2Rj7JL3j1j7QRnnOpNRpmJ6ppl
7242eJ1pJ6pMj0j4K5%p%Rj4JJ0jjKqj1J6J6k3qJ4k6K3K5k4j6RPr%J1j7KKLMjk1
7284b0J6j3J4J5j3j3LPpJ9j3j0J1pj1K0J9k7lJ0kPK0qqJ0nrJ5j1j0J2j3oL8rk1
7321cNnoM6k2l1RR%PPk2j4K8k0RK4k7j9J6NLOqj2jQJ3lqLJlmK8pk8J6pj1M1kl4
7364a3J1NJLJ2k6MK2j8oK4j3j1J8kqJ2mj1LKRMk8pL4j5qJ3pj2OQp%Nk6K3NjmJ5
$$ plain form
7119 -8 -8 17 -7 -24 6 4 -5 11 11 -10 -8 19 9 14 6 -5 -10 15 12 4 -8 -5 5 0 -6 7 7 -16 -4 -7 8 -1 4 -6 -27 -6 8 -4 4 -1
7159 -1 -20 -1 9 0 -5 3 -7 -16 4 3 7 -3 -4 -9 2 11 5 -12 -18 13 10 -4 12 14 0 6 15 -5 -3 34 7 -8 5 31 8 2 6 -6 -2 28
7199 28 8 -13 12 12 9 -9 7 -6 -8 0 1 -9 4 8 8 -6 0 2 -11 -8 -13 1 -11 -2 -19 -18 15 4 -13 -5 4 -1 -6 0 -7 -2 7 0 -4 12 5 -2 -5
7242 -5 6 -1 15 8 12 2 -12 13 13 6 6 15 1 2 12 11 10 12 4 -7 9 25 2 -6 8 -18 5 30 6 -10 -1 6 -3 -3 8 -9 -7 -5 -2 2 1 -20
7284 -20 -4 -17 -3 12 -1 -14 -11 -4 -11 8 -5 -15 -4 -11 -22 -2 17 -10 -13 -3 -5 2 22 14 6 16 11 2 17 6 -4 8 -5 -11 27 18 -3
7321 -3 2 -3 -9 37 15 -16 -7 2 2 9 16 -6 -20 8 -12 -3 21 -6 -25 -9 -4 -1 5 -3 -15 -16 -8 5 2 -6 -3 -2 -5 -9 19 12 -16 0 -7 -18 23 21 -13
7364 -13 -2 3 4 7 19 -7 -3 19 1 -5 19 6 -5 13 11 3 15 11 0 3 5 14 18 -10 -17 17 2 -6 7 0 -12 -6 2 -5 -5 0 -26 -3 2 1 -3 12
$$ [...]
8191A
##END NTUPLES=NMR FID
##END=
