##TITLE=1H_LY-387.1
 CCl4, 8 sc, 
 7.6.2019
##JCAMPDX= 6.0         $$ Bruker NMR JCAMP-DX V2.0
##DATA TYPE= NMR FID
##DATA CLASS= NTUPLES
##ORIGIN= UXNMR, Bruker Analytische Messtechnik GmbH
##OWNER= root
$$ XWIN-NMR		Version 3.5
$$ Fri Jun  7 13:57:52 2019 Russian Standard Time (UT+4h)  she@DPX200
##.OBSERVE FREQUENCY= 200.13155
##.OBSERVE NUCLEUS= ^1H
##.DELAY= (6, 6)
##.ACQUISITION MODE= SIMULTANEOUS
##.ACQUISITION SCHEME= undefined
##.AVERAGES= 8
##.DIGITISER RES= 18
##SPECTROMETER/DATA SYSTEM= spect
##.PULSE SEQUENCE= zg30
##.SOLVENT NAME= CDCl3
##.SHIFT REFERENCE= (INTERNAL, CDCl3, 0, 15.7039)
##AUDIT TRAIL= $$ (NUMBER, WHEN, WHO, WHERE, WHAT)
$$ ##TITLE= Audit trail, XWIN-NMR		Version 3.5
$$ ##JCAMPDX= 5.01
$$ ##ORIGIN= Bruker BioSpin GmbH
$$ ##OWNER= she
$$ F:/spectra/data/she/nmr/H-F/1/audita.txt
$$ ##AUDIT TRAIL=  $$ (NUMBER, WHEN, WHO, WHERE, WHAT)
(   1,<2019-06-07 13:56:54.20 +0400>,<she>,<DPX200>,
      <created by zg, POWCHK disabled, PULCHK disabled
       configuration hash MD5:
       00 E9 B6 7A A2 85 ED C7 34 08 36 98 17 FE 4E 26
       data hash MD5: 16K
       DE 36 B1 39 4A 56 48 B8 DD BA 2F F6 F9 FF C9 FF>)
$$ ##END=
$$ 
$$ hash MD5
$$ DA 1E EF 16 71 75 6B E0 A0 B2 5B 29 D0 EB 23 3F
##$RELAX= 
##$RELAX= 
##$RELAX= 
##$RELAX= 
##$RELAX= 
##$RELAX= 
$$ Bruker specific parameters
$$ --------------------------
##$DU= <F:/spectra>
##$EXPNO= 1
##$NAME= <H-F>
##$PROCNO= 1
##$TYPE= <nmr>
##$USER= <she>
##$AMP= (0..31)
100 100 100 100 100 100 100 100 100 100 100 100 100 100 100 100 100 100 
100 100 100 100 100 100 100 100 100 100 100 100 100 100 
##$AQSEQ= 0
##$AQ_mod= 1
##$AUNM= <au_zg>
##$AUTOPOS= <>
##$BF1= 200.13
##$BF2= 200.13
##$BF3= 200.13
##$BF4= 200.13
##$BF5= 200.13
##$BF6= 200.13
##$BF7= 200.13
##$BF8= 200.13
##$BYTORDA= 1
##$CFDGTYP= 0
##$CFRGTYP= 5
##$CHEMSTR= <none>
##$CNST= (0..31)
1 1 145 1 1 1 1 1 1 1 1 1 1 1 1 1 1 1 1 1 1 1 1 1 1 1 1 1 1 1 1 1 
##$CPDPRG= <>
##$CPDPRG1= <>
##$CPDPRG2= <>
##$CPDPRG3= <>
##$CPDPRG4= <mlev>
##$CPDPRG5= <mlev>
##$CPDPRG6= <mlev>
##$CPDPRG7= <mlev>
##$CPDPRG8= <mlev>
##$CPDPRGB= <>
##$CPDPRGT= <>
##$D= (0..31)
0 1.2 0 0 0 0 0 0 0 0 0 0.03 0 0 0 0 0 0 0 0 0 0 0 0 0 0 0 0 0 0 0 0 
##$DATE= 1559901413
##$DBL= (0..7)
120 120 120 120 120 120 120 120 
##$DBP= (0..7)
150 150 150 150 150 150 150 150 
##$DBP07= 0
##$DBPNAM0= <>
##$DBPNAM1= <>
##$DBPNAM2= <>
##$DBPNAM3= <>
##$DBPNAM4= <>
##$DBPNAM5= <>
##$DBPNAM6= <>
##$DBPNAM7= <>
##$DBPOAL= (0..7)
0.5 0.5 0.5 0.5 0.5 0.5 0.5 0.5 
##$DBPOFFS= (0..7)
0 0 0 0 0 0 0 0 
##$DE= 6
##$DECBNUC= <off>
##$DECIM= 24
##$DECNUC= <off>
##$DECSTAT= 4
##$DIGMOD= 1
##$DIGTYP= 9
##$DL= (0..7)
0 120 120 120 120 120 120 120 
##$DP= (0..7)
150 150 150 150 150 150 150 150 
##$DP07= 0
##$DPNAME0= <>
##$DPNAME1= <>
##$DPNAME2= <>
##$DPNAME3= <>
##$DPNAME4= <>
##$DPNAME5= <>
##$DPNAME6= <>
##$DPNAME7= <>
##$DPOAL= (0..7)
0.5 0.5 0.5 0.5 0.5 0.5 0.5 0.5 
##$DPOFFS= (0..7)
0 0 0 0 0 0 0 0 
##$DQDMODE= 0
##$DR= 18
##$DS= 0
##$DSLIST= <SSSSSSSSSSSSSSS>
##$DSPFIRM= 0
$$ [...]
##$SUBNAM2= <"">
##$SUBNAM3= <"">
##$SUBNAM4= <"">
##$SUBNAM5= <"">
##$SUBNAM6= <"">
##$SUBNAM7= <"">
##$SUBNAM8= <"">
##$SUBNAM9= <"">
##$SW= 24.9336996594482
##$SWIBOX= (0..15)
0 0 2 0 0 0 0 0 0 0 0 0 0 0 0 0 
##$SW_h= 4990.01996007984
##$TD= 16384
##$TD0= 1
##$TE= 0
##$TE2= 300
##$TE3= 300
##$TEG= 300
##$TL= (0..7)
0 120 120 120 120 120 120 120 
##$TP= (0..7)
150 150 150 150 150 150 150 150 
##$TP07= 0
##$TPNAME0= <>
##$TPNAME1= <>
##$TPNAME2= <>
##$TPNAME3= <>
##$TPNAME4= <>
##$TPNAME5= <>
##$TPNAME6= <>
##$TPNAME7= <>
##$TPOAL= (0..7)
0.5 0.5 0.5 0.5 0.5 0.5 0.5 0.5 
##$TPOFFS= (0..7)
0 0 0 0 0 0 0 0 
##$TUNHIN= 0
##$TUNHOUT= 0
##$TUNXOUT= 0
##$USERA1= <user>
##$USERA2= <user>
##$USERA3= <user>
##$USERA4= <user>
##$USERA5= <user>
##$V9= 5
##$VALIST= <valist>
##$VCLIST= <CCCCCCCCCCCCCCC>
##$VD= 0
##$VDLIST= <DDDDDDDDDDDDDDD>
##$VPLIST= <PPPPPPPPPPPPPPP>
##$VTLIST= <TTTTTTTTTTTTTTT>
##$WBST= 1024
##$WBSW= 4
##$XGAIN= (0..3)
0 0 0 0 
##$XL= 0
##$YL= 0
##$YMAX_a= 33997
##$YMIN_a= -43013
##$ZGOPTNS= <>
##$ZL1= 120
##$ZL2= 120
##$ZL3= 120
##$ZL4= 120
##$ABSF1= 10
##$ABSF2= 0
##$ABSG= 5
##$ABSL= 3
##$ALPHA= 0
##$AQORDER= 0
##$ASSFAC= 0
##$ASSFACI= 0
##$ASSFACX= 0
##$ASSWID= 0
##$AUNMP= <proc_1d>
##$AZFE= 0.1
##$AZFW= 0.1
##$BCFW= 1
##$BC_mod= 2
##$BYTORDP= 1
##$COROFFS= 0
##$CY= 11.3945322036743
##$DATMOD= 1
##$DC= 2
##$DFILT= <>
##$DTYPP= 0
##$F1P= 18.9103706918063
##$F2P= -1.10871071338519
##$FCOR= 0.5
##$FTSIZE= 0
##$FT_mod= 4
##$GAMMA= 1
##$GB= 0.15
##$INTBC= 1
##$INTSCL= 1
##$ISEN= 128
##$LB= 0.24
##$LEV0= 0
##$LPBIN= 0
##$MAXI= 10000
##$MC2= 0
##$MEAN= 0
##$ME_mod= 0
##$MI= 1.114404
##$NCOEF= 0
##$NC_proc= 0
##$NLEV= 6
##$NOISF1= 3.799351
##$NOISF2= 2.8
##$NSP= 1
##$NTH_PI= 0
##$NZP= 0
##$OFFSET= 15.70392
##$PC= 1
##$PHC0= -8574.003
##$PHC1= 12.20019
##$PH_mod= 1
##$PKNL= yes
##$PPARMOD= 0
##$PSCAL= 0
##$PSIGN= 0
##$REVERSE= no
##$SF= 200.130013532006
##$SI= 16384
##$SIGF1= 3
##$SIGF2= 2
##$SINO= 400
##$SIOLD= 16384
##$SREGLST= <1H.CDCl3>
##$SSB= 0
##$STSI= 0
##$STSR= 0
##$SW_p= 3612.71676300578
##$SYMM= 0
##$S_DEV= 0
##$TDeff= 0
##$TDoff= 0
##$TI= <>
##$TILT= no
##$TM1= 0
##$TM2= 0
##$TOPLEV= 0
##$USERP1= <user>
##$USERP2= <user>
##$USERP3= <user>
##$USERP4= <user>
##$USERP5= <user>
##$WDW= 1
##$XDIM= 8192
##$YMAX_p= 0
##$YMIN_p= 0
$$ End of Bruker specific parameters
$$ ---------------------------------
##NTUPLES= NMR FID
##VAR_NAME=  TIME,          FID/REAL,        FID/IMAG
##SYMBOL=    X,             R,               I
##VAR_TYPE=  INDEPENDENT,   DEPENDENT,       DEPENDENT
##VAR_FORM=  AFFN,          ASDF,            ASDF
##VAR_DIM=   8192,          8192,            8192
##UNITS=     SECONDS,       ARBITRARY UNITS, ARBITRARY UNITS
##FACTOR=    0.0002004,     1,               1
##FIRST=     0,             0,               0
##LAST=      1.6414764,     0,               0
##MIN=       0,             -43013,          0
##MAX=       1.6414764,     33997,           0
$$ Real data points
##PAGE= N=1
##DATA TABLE= (X++(R..R)), XYDATA
0 0 0 0 0 0 0 0 0 0 0 0 0 0 0 0 0 0 0 0 0 5 -8 8 -8 8 -8 8 -8 10 -16 16 -16 16 -21 24 -24 28 -32 34 -39 42 -47 50
42 50 -58 64 -71 79 -88 97 -111 125 -142 166 -193 231 -284 361 -482 694 -1141 2409 -12518
61 -12518 -43013 16679 13346 -26120 18300 28673 -28056 -14125 18752 -8260 -5809 19593 -3975
74 -3975 -13299 8086 109 -4035 10372 -4902 -14028 8563 8079 -4700 6045 2681 -15999 -7058
88 -7058 11604 8808 -814 -935 478 -9194 -11368 12228 16979 -11178 -6935 12847 -10753 -13839
102 -13839 23114 6496 -24518 7020 14938 -17165 2128 18580 -16456 -11476 16497 -2518
114 -2518 -3565 16700 -8672 -17982 11262 774 -7921 21023 3376 -26879 4812 13000 -16621
127 -16621 5868 22676 -16198 -14890 16941 -1023 -12538 12503 5866 -14107 65 9399 -1738
140 -1738 -3209 503 -948 -1335 426 5103 3648 -6941 -4932 4121 -466 28 7304 -1794 -6961
155 -6961 1754 -1230 -1071 9069 -1607 -8955 6674 729 -10188 10174 7454 -17157 1373 15424
169 15424 -11563 -5183 17418 -7358 -15184 14313 4939 -12941 7599 6515 -14000 336 10133
182 10133 -4803 -414 5553 -6704 -2266 6667 -2886 -1302 5959 -4439 -4479 6891 -22 -5225
196 -5225 4125 1466 -5418 1370 4287 -1325 -2385 -397 1341 795 -1631 1971 2329 -6083 -1521 7997
212 7997 -1684 -5365 6231 -341 -8724 5304 6129 -6618 805 4317 -7131 -298 7732 -3273
226 -3273 -2066 4652 -5227 -2698 8582 -1981 -5801 6580 -905 -7958 7000 4903 -8775 986
240 986 5710 -6457 -729 8428 -2542 -5736 2937 424 -2002 3429 1487 -3069 -1393 -80 994
255 994 2179 -252 -901 -78 -2127 -55 3637 277 -1795 -75 -1829 -384 3849 390 -1970 665
271 665 -2381 -1939 5314 1458 -4278 1805 444 -5719 3001 6450 -4099 -2248 3515 -3943 -2281
286 -2281 7129 637 -5105 1543 120 -3278 3554 3011 -3563 -482 918 -2651 1624 3752 -2111
301 -2111 -1748 1037 -1927 3 4175 -127 -3220 -56 196 -403 2035 1431 -1581 -1874 -444 1040
317 1040 1392 431 261 -954 -2774 253 3348 439 -907 333 -2300 -1820 3377 1980 -1688 264
333 264 -651 -2919 1579 3158 -1044 -270 458 -3191 -398 4037 254 -1652 783 -1793 -2113 3277
349 3277 2203 -2083 -322 -4 -2271 852 3121 -195 -1258 -351 -1557 -284 2537 1329 -948 -1236
365 -1236 -1279 -164 1760 1445 -244 -1195 -1365 -251 1148 1274 628 -748 -1934 -658 1269 1283 966 -177
383 -177 -2436 -1442 1694 1551 456 423 -1628 -2364 929 2068 406 537 -486 -2720 -632 2305 1247
400 1247 301 -157 -2346 -1635 1942 2017 120 -295 -1433 -1869 763 2176 715 -288 -1009 -1832 -344
417 -344 1897 1703 36 -1357 -1763 -488 1405 1873 553 -1386 -1855 -383 1037 1385 1048 -603 -2038
434 -2038 -933 853 1308 1327 102 -2122 -1682 834 1590 1150 304 -1690 -1978 468 1657 999 450 -942
452 -942 -1987 -354 1399 1277 784 -528 -2074 -996 1244 1553 853 -380 -1904 -1187 1000 1423 721
469 721 -54 -1359 -1387 386 1252 930 298 -1087 -1590 -48 1206 1169 491 -1082 -1730 -37 1201 877
487 877 485 -600 -1601 -316 1067 682 540 17 -1469 -926 915 924 531 193 -1350 -1275 919 1185 209
506 209 108 -807 -1291 569 1252 56 -6 -207 -1158 -156 1179 548 -20 -363 -1095 -239 1126 682 28
525 28 -423 -1191 -193 1253 392 -199 169 -848 -823 1024 636 -419 337 -299 -1175 644 1117 -519 -238
544 -238 -78 -909 693 1463 -735 -832 245 -730 134 1876 -103 -1333 235 -372 -826 1527 1193 -1091
562 -1091 -506 -46 -629 778 1133 -732 -639 162 -99 692 636 -1098 -676 474 -60 692 1319 -832 -1555
581 -1555 -104 -3 640 1837 76 -1616 -832 -452 475 1835 185 -1179 118 -462 -865 1556 706
598 706 -1815 226 1072 -1101 602 1650 -1974 -1762 1426 563 426 1733 -1178 -2742 161 775 595
615 595 2152 29 -2489 -440 142 -623 1992 1713 -2024 -1030 938 -592 174 1515 -973 -1419 1073
632 1073 959 112 51 -1246 -1145 537 789 1360 1332 -1724 -2372 197 249 724 2798 140 -3021 -765
650 -765 487 -248 1578 1275 -1508 -584 379 -769 758 974 -1675 -164 1599 -786 196 1873 -2252
667 -2252 -2578 2235 1277 -581 1903 -267 -3766 -232 2047 107 1112 1146 -1994 -1469 357 -32 1273
684 1273 1361 -1457 -778 875 -775 90 1621 -1271 -1459 1816 715 -868 652 -444 -1745 477
700 477 1172 561 970 -832 -1957 194 217 27 2396 391 -2991 -17 1337 -1466 655 2332 -1656
717 -1656 -1390 1691 -424 -995 1477 -245 -1331 968 282 -337 1101 -961 -1794 1518 710 -1100 1573
734 1573 392 -2934 317 2019 -1275 124 2022 -1429 -1570 1246 88 -299 1068 -452 -835 656
750 656 -301 -42 1192 -981 -991 1745 -178 -1472 1567 411 -2076 755 1256 -1321 382 1128 -1375
767 -1375 -311 988 -538 376 710 -1435 154 1374 -1466 -218 2088 -1280 -1313 2203 -421 -1978
783 -1978 1925 746 -2259 688 1272 -1397 150 992 -990 87 716 -908 282 702 -1101 443
799 443 1087 -1628 -170 1905 -1031 -1018 1707 -391 -1348 1342 276 -1203 812 337 -982 505 191
816 191 -587 970 -106 -1384 1127 695 -1609 746 1120 -1865 138 1919 -1286 -789 1681 -689
832 -689 -1154 1381 140 -726 853 -530 -1081 1115 155 -686 1239 -287 -1767 1154 756 -1663 831
849 831 1439 -1706 -345 1434 -962 -542 1353 -436 -678 1019 -109 -617 330 -619 -168 1365 -171
866 -171 -637 848 -717 -1319 1248 655 -821 983 374 -1777 -64 889 -434 543 758 -936 -16
883 -16 491 -1110 99 1124 -717 118 1401 -1137 -1108 1253 -462 -1047 1738 730 -1282 298 -49
900 -49 -1537 576 1371 -340 205 285 -1241 -280 557 -515 572 1275 -792 -624 543 -837 -552 1265
918 1265 148 -428 943 -120 -1286 -18 117 -90 1030 487 -637 -26 -415 -963 607 793 -182
935 -182 720 300 -1515 -391 720 -433 263 1246 -326 -554 299 -824 -665 1035 459 -24 688 -531
953 -531 -1176 357 82 -453 1165 788 -992 -208 52 -1042 239 1238 -233 -177 603 -614 -809 305
971 305 -19 54 910 105 -614 -49 -365 -471 543 459 23 455 -174 -999 -145 336 49 552 348 -516 -143
992 -143 29 -527 103 563 -73 205 348 -629 -337 424 -327 -185 886 174 -415 197 -396 -784 577 743
1012 743 -222 137 119 -740 -204 407 -60 225 518 -348 -468 130 -77 -6 380 -120 -211 327 -11 -364 22
1033 22 -36 -101 370 153 -257 28 -74 -348 133 293 33 171 -80 -558 4 415 -18 57 139 -354 -96 366
1055 366 -103 -146 325 -89 -285 271 90 -151 231 -65 -436 244 409 -155 -8 23 -375 89 453 -147 -125
1076 -125 234 -199 -249 282 108 -109 159 -95 -356 131 313 -21 -95 -105 -121 98 133 -18 -17 -68 -44 99 -37
1099 -37 -59 224 -45 -307 121 172 -130 130 51 -428 88 502 -160 -184 234 -233 -217 462 53 -318 312 68
1121 68 -529 140 440 -157 13 179 -366 -111 475 -3 -270 137 23 -148 140 104 -116 39 57 -121 -44
1142 -44 128 117 -45 -177 -36 122 30 63 12 -229 -16 248 -123 -145 253 -64 -247 227 11 -261 300 119
1164 119 -496 96 399 -260 -28 275 -376 -116 569 -145 -377 402 15 -419 290 206 -358 204 265 -478 -41
1185 -41 486 -99 -184 199 -113 -190 277 110 -247 3 191 -76 -145 97 155 -108 -81 129 -111 -124 363 29
1207 29 -482 173 375 -398 -11 447 -421 -216 645 -264 -540 662 123 -740 360 376 -662 231 577 -715
1227 -715 -148 818 -335 -462 595 -101 -492 540 137 -589 293 352 -492 -34 412 -150 -84 229 -184 -200
1247 -200 227 166 -133 -103 116 93 -189 -13 263 -132 -124 361 -179 -414 532 175 -661 276 439 -651 148
1268 148 644 -745 -206 962 -466 -650 926 -92 -874 782 223 -1041 580 697 -1088 20 944
1285 944 -702 -311 917 -468 -608 903 -9 -798 508 327 -626 200 377 -417 33 411 -250 -248 235
1304 235 134 -102 -79 86 96 -169 61 276 -353 -140 616 -279 -562 743 145 -853 518 435 -1015 363
1324 363 967 -1059 -300 1219 -669 -722 1225 -229 -1031 1086 186 -1344 732 792 -1208 226 950
1341 950 -1012 -150 1099 -739 -599 1105 -166 -817 702 107 -751 445 391 -593 115 461 -314 -195
1359 -195 198 58 23 -6 1 40 -196 67 404 -324 -223 616 -217 -592 677 125 -758 631 328 -1092 434
1380 434 907 -1084 -76 1158 -867 -485 1346 -596 -1034 1391 79 -1384 971 604 -1441 433
1396 433 976 -1191 42 1266 -885 -678 1017 -307 -611 916 -5 -770 505 154 -719 245 433
1413 433 -271 86 148 -303 -63 81 -6 127 -12 118 277 -487 -378 532 -98 -250 880 -53 -973 542
1433 542 228 -1111 647 1142 -951 -110 877 -1141 -501 1446 -333 -717 1327 -128 -1418 714 278
1450 278 -1126 948 1020 -1191 25 773 -1220 -353 1261 -230 -265 998 -513 -1201 451 279 -359
1467 -359 681 463 -547 -203 -137 -461 148 477 292 257 -283 -443 -27 -316 -117 820 303 -230 364 -496
1487 -496 -1103 508 645 -369 773 640 -1279 -354 563 -887 159 1728 -350 -862 754 -667 -1249
1504 -1249 1164 647 -789 915 587 -1608 -316 698 -650 327 1424 -424 -689 358 -735 -756
1520 -756 948 631 -72 442 -315 -1070 -101 269 59 593 454 -229 -292 -508 -464 311 408 305 531 -222 -731
1541 -731 -16 -250 -455 901 817 -437 69 -38 -1247 -24 1075 -167 173 1004 -766 -1050 511 -192
1559 -192 -361 1339 426 -1009 243 57 -1132 321 950 -363 303 726 -999 -744 549 -170 -62
1576 -62 1008 100 -631 64 -348 -621 519 626 25 159 -202 -626 -63 84 2 466 252 -216 -15 -325
1596 -325 -506 339 336 -154 406 198 -667 -82 170 -506 314 895 -341 -305 354 -569 -393 830 69 -375
1616 -375 672 -28 -902 274 338 -461 427 510 -639 -47 444 -539 -179 610 -132 -110 474 -321 -457 384
1636 384 0 -240 412 77 -330 146 -87 -347 333 237 -239 85 -10 -317 190 141 -311 175 220 -338 60
1657 60 214 -312 92 345 -375 -89 423 -245 -188 395 -190 -212 501 -128 -453 390 115 -357 342 133 -468
1678 -468 223 266 -462 140 459 -346 -99 291 -338 -70 495 -156 -260 335 -93 -302 266 -36 -213 357
1698 357 59 -350 137 82 -258 164 121 -213 198 145 -388 -23 182 -167 145 249 -307 -40 230 -271 -74
1719 -74 356 -91 -57 274 -261 -267 352 -7 -243 310 51 -285 214 4 -385 263 294 -301 90 198 -350 30
1741 30 297 -262 13 405 -207 -225 248 -127 -131 355 -60 -272 261 49 -297 156 102 -187 181 101 -300 68
1763 68 174 -197 19 117 -157 56 141 -223 -16 194 -121 -18 137 -174 10 234 -204 -123 262 -78 -128 250
1785 250 -133 -209 330 -7 -330 256 122 -310 169 147 -316 149 299 -337 -62 317 -184 -71 288 -181 -141
1806 -141 319 -87 -253 243 65 -156 165 -15 -208 177 85 -194 99 99 -131 81 0 -218 126 147 -170 39
1828 39 69 -205 78 140 -230 56 273 -224 -123 201 -172 -41 320 -157 -230 294 -39 -261 241 57 -244
1849 -244 235 95 -338 139 243 -248 50 187 -197 58 232 -238 -61 268 -100 -85 196 -101 -66 219 -107
1870 -107 -147 231 -11 -122 180 -77 -145 238 -21 -235 210 82 -223 178 32 -305 200 200 -330 48 261
1891 261 -283 -35 275 -244 -74 391 -178 -263 285 -33 -198 272 -14 -274 223 77 -280 117 142 -167 91
1912 91 79 -217 113 169 -175 42 105 -148 85 114 -219 89 220 -221 -8 210 -221 26 329 -277 -161 397
1934 397 -134 -266 371 -46 -307 365 33 -480 294 255 -430 105 278 -399 33 388 -353 -124 418 -204
1954 -204 -221 319 -114 -200 308 -53 -307 223 76 -231 135 33 -182 173 38 -236 128 100 -145 144 0
1975 0 -235 203 110 -276 173 191 -316 135 197 -388 123 443 -373 -128 420 -293 -182 535 -187 -351 525 -75
1997 -75 -531 433 204 -503 299 226 -595 173 469 -454 -53 448 -337 -159 428 -248 -253 435 -87 -315 316
2018 316 29 -258 181 -25 -238 251 87 -206 114 -22 -188 227 19 -238 254 51 -310 207 86 -365
2038 -365 291 243 -470 152 402 -468 -65 433 -402 -50 685 -320 -421 529 -170 -477 641 164 -531 402
2058 402 108 -756 266 536 -424 109 414 -566 -162 502 -295 -163 534 -145 -326 298 -146 -282 326 12
2078 12 -224 291 50 -290 73 -94 -186 364 145 -194 160 -129 -363 264 134 -233 396 169 -566 75 257
2099 257 -441 227 500 -484 -36 579 -486 -345 620 -191 -294 755 -60 -677 425 73 -667 506 549
2118 549 -498 135 256 -762 -46 707 -193 -71 462 -374 -411 351 -81 -173 483 37 -344 133 -59 -236
2138 -236 214 44 -135 281 26 -264 64 -147 -212 421 158 -265 264 -22 -551 214 298 -334 341 398 -667
2159 -667 -111 496 -403 -51 686 -325 -350 632 -224 -581 599 124 -542 505 278 -667 219 342 -648
2178 -648 112 679 -324 -139 382 -446 -276 563 -27 -225 374 -99 -406 184 33 -160 301 67 -295 77
2198 77 -5 -162 199 -16 -198 251 32 -306 181 47 -319 273 183 -399 203 272 -507 42 430 -358 14
2219 14 528 -441 -303 605 -156 -409 562 -4 -521 459 147 -592 341 378 -553 92 427 -406 -10 447 -365
2240 -365 -180 483 -176 -256 360 -82 -260 313 -6 -283 259 89 -248 109 42 -175 169 46 -220 125 43
2261 43 -191 154 49 -225 193 96 -368 124 266 -294 72 254 -383 -28 440 -253 -169 435 -198 -317 412
2282 412 -47 -336 429 48 -515 267 285 -389 175 291 -454 26 435 -281 -89 402 -202 -212 329 -87 -165
2303 -165 314 -46 -289 203 80 -174 120 -19 -221 197 146 -179 60 10 -245 105 165 -129 149 80 -359
2324 -359 -42 180 -88 179 216 -373 -145 264 -155 -39 378 -161 -223 303 -98 -292 340 43 -361 243 234
2345 234 -270 129 112 -458 51 447 -82 23 200 -380 -231 317 19 8 366 -122 -402 67 33 -63 314
2366 314 80 -283 58 53 -172 67 41 -149 165 178 -150 3 -26 -320 13 270 21 139 110 -465 -295 215
2388 215 77 176 344 -243 -397 85 -52 -79 404 127 -272 58 -25 -276 181 176 -259 81 289 -135 -40 65
2410 65 -345 -92 403 114 -9 145 -264 -360 122 164 111 331 -39 -418 -100 24 14 292 131 -224 -19 34
2432 34 -187 46 123 -131 67 166 -132 -17 69 -278 -115 251 91 89 137 -306 -357 156 126 68 294 -42 -347
2455 -347 -39 11 -103 261 214 -210 -87 25 -132 66 185 -148 -48 196 -28 -61 61 -148 -84 199 72
2476 72 19 129 -131 -245 54 66 61 249 -15 -278 -17 46 -45 177 98 -178 18 64 -180 30 183 -115 -29
2499 -29 139 -108 -46 164 -122 -166 163 58 -64 115 -52 -197 109 103 -100 79 70 -132 -16 62 -81 60 122
2522 122 -101 -60 63 -26 -1 66 -70 2 103 -56 -38 45 -42 35 105 -87 -59 125 -37 -54 135 -26 -109 120
2546 120 -9 -152 174 104 -184 21 86 -136 81 172 -187 -84 179 -72 -72 169 -67 -175 127 21 -116 149
2568 149 54 -209 -43 70 -12 124 81 -183 -109 53 22 60 70 -71 -67 -26 -25 83 96 -29 -53 -58 -47 139 151 -118
2594 -118 -96 34 -53 92 205 -118 -166 75 -42 -34 265 55 -233 -5 0 -99 242 213 -250 -140 70 -78 111
2617 111 259 -145 -216 81 -23 -49 227 24 -232 -51 18 -21 168 96 -217 -196 -5 71 151 91 -127 -159 -57
2640 -57 42 159 81 -72 -85 -119 -62 218 181 -106 -91 -67 -142 188 294 -124 -170 45 -114 14 334 11 -228 36
2664 36 -28 -129 280 216 -257 -107 27 -130 160 308 -158 -233 52 -36 21 262 -8 -232 -34 -20 -32 204 114
2687 114 -168 -143 -64 18 194 116 -125 -150 -95 22 194 76 -85 -58 -118 -106 185 168 -98 -36 -81 -207 159 297
2711 297 -104 -120 42 -180 1 357 -28 -219 109 -71 -195 288 197 -238 -17 33 -220 142 348 -147 -189
2732 -189 63 -108 -9 296 -11 -212 20 -37 -86 174 116 -127 -84 -52 -81 117 141 -58 -104 -111 -22 137 54 -51
2756 -51 -2 -114 -109 144 84 -105 77 -14 -271 82 238 -112 -43 118 -225 -52 325 -24 -191 148 -55 -201
2778 -201 242 121 -216 103 61 -275 105 288 -154 -72 129 -190 -61 304 -29 -190 120 -10 -155 139 91
2799 91 -106 7 6 -98 47 89 -5 -12 -87 -84 102 47 -80 26 -43 -116 101 51 -122 83 57 -175 42 114 -123
2824 -123 53 145 -216 -47 266 -117 -135 241 -80 -207 268 42 -296 173 180 -260 30 205 -177 -19 202
2845 202 -145 -71 206 -62 -104 139 -30 -69 152 -43 -142 137 50 -129 63 39 -85 83 54 -93 -10 9 -44
2868 -44 67 17 -48 90 -66 -197 124 138 -127 68 77 -281 -13 267 -120 -64 210 -119 -167 198 -7 -132 183
2891 183 -20 -219 182 128 -185 72 24 -280 140 321 -159 -70 126 -215 -87 317 83 -91 88 -115 -233
2912 -233 113 156 46 63 -107 -135 94 32 -57 100 -35 -132 148 82 -161 9 8 -201 106 252 -18 -30 -103 -322
2936 -322 15 310 53 62 56 -377 -224 271 43 -14 292 -102 -396 115 142 -141 133 108 -231 40 235 -121
2958 -121 -92 12 -160 95 331 7 -92 -21 -285 -138 350 223 35 66 -250 -363 103 268 106 107 -75 -237
2980 -237 -14 43 -4 150 20 -135 115 95 -173 15 25 -278 83 391 23 -113 -52 -341 -157 358 230 12
3002 12 43 -282 -345 124 165 57 251 -34 -384 0 141 -91 113 156 -204 -17 244 -83 -159 43 -83 4
3024 4 265 100 -75 -70 -238 -137 249 215 94 84 -244 -342 110 206 35 169 19 -264 -27 92 -68 78 109
3047 109 -139 14 127 -102 -14 37 -205 4 328 4 -117 39 -230 -199 281 199 -90 64 -51 -308 4
3068 4 191 25 110 49 -229 -42 138 -35 34 88 -119 -7 177 -66 -90 98 -47 -64 187 66 -76 47 -69
3091 -69 -124 137 127 -9 48 -94 -174 120 109 -95 90 57 -195 25 143 -126 10 165 -133 -84 180 -41 -86
3114 -86 103 -65 -86 173 13 -155 72 -9 -123 147 74 -182 50 89 -152 24 160 -94 -56 96 -88 -32
3136 -32 143 -20 -75 57 -11 -23 82 -35 -46 114 -2 -55 74 -23 -89 107 54 -70 108 43 -144 22 62 -33
3160 -33 122 80 -163 -22 91 -75 35 147 -120 -61 135 -92 -89 174 -24 -148 111 48 -105 87 24 -190
3182 -190 38 145 -28 25 6 -167 -24 118 -8 44 102 -92 -106 76 -5 21 127 -61 -133 40 52 1 62 -42
3206 -42 -77 96 53 -31 67 -32 -112 64 68 -35 131 44 -184 -20 118 -5 61 83 -167 -91 128 0 -2 122 -81
3231 -81 -121 87 -2 -61 127 -9 -177 49 99 -63 61 36 -183 -16 129 -8 -7 42 -105 -59 80 13 32 81
3255 81 -77 -87 67 27 22 95 -84 -132 79 47 -11 84 -4 -107 56 56 -34 84 38 -118 0 70 -31 57 80 -143
3281 -143 -59 113 -4 -12 100 -78 -98 103 28 -38 70 -1 -125 20 34 -19 77 10 -137 -12 65 -31 41 50 -111
3306 -111 -29 82 -38 -12 80 -32 -49 52 -19 3 99 -37 -79 54 15 -13 85 -29 -104 85 48 -62 75 57 -107
3331 -107 10 62 -60 54 109 -83 -48 70 -23 3 107 -46 -62 89 7 -56 84 12 -56 49 19 -61 61 64 -70
3356 -70 -17 23 -16 41 39 -74 4 26 -61 19 54 -54 -8 49 -75 -11 108 -18 -57 41 -41 -28 108 0 -86 60 20
3383 20 -68 68 41 -80 50 58 -104 34 112 -61 -25 76 -59 0 123 -20 -58 62 -8 -62 59 20 -61 51
3407 51 0 -58 53 66 -43 10 2 -70 46 69 -51 -15 10 -55 12 32 -46 6 23 -68 -2 67 -28 -2 47 -89 -50 109
3435 109 -14 -60 55 -26 -80 80 19 -93 48 28 -103 29 86 -64 6 56 -102 -26 128 -19 -51 66 -25 -51
3459 -51 85 5 -67 52 22 -63 50 47 -43 32 9 -73 32 65 -37 -13 -4 -53 16 46 -37 3 19 -68 0 43 -43 18 43
3488 43 -92 -34 99 -16 -51 57 -49 -75 107 15 -91 48 17 -85 34 54 -74 30 53 -103 4 116 -39
3511 -39 -21 78 -79 -57 115 15 -65 51 14 -71 34 41 -41 25 20 -47 17 37 -17 4 -38 -58 46 57 -53 -7 -7 -77
3539 -77 7 55 -51 -6 28 -75 -31 40 -19 0 51 -79 -66 82 -25 -88 65 -3 -100 70 30 -133 10 49 -100
3564 -100 4 106 -49 -37 29 -68 -39 106 30 -20 34 -54 -49 76 15 -33 73 29 -67 26 19 -43 36 39 -29 29 38 -17 -8
3593 -8 -27 -33 88 55 -52 9 11 -99 7 97 -41 -15 85 -78 -90 78 15 -37 62 -15 -74 60 12 -95 38 43 -61
3620 -61 43 48 -108 -10 81 -62 -19 124 -8 -66 28 -36 -48 70 62 -34 5 -17 -17 38 2 -9 63 5 -48 47 10 -56 47
3649 47 34 -64 27 67 -58 -27 17 -27 36 65 -58 -24 29 -62 -9 80 -44 -46 96 -55 -105 90 33 -98 35 36 -85
3676 -85 10 42 -73 -15 57 -36 -4 29 -50 11 46 -45 -20 77 -14 -43 52 -14 -52 67 19 -60 19 26 -22 31 -11 -14 44 0
3706 0 -38 57 20 -57 47 39 -75 43 77 -71 -34 90 -40 -35 71 -36 -46 73 9 -51 47 -15 -50 51 2 -63 60
3733 60 18 -88 8 52 -56 15 49 -66 -26 72 -24 -21 48 -14 -2 39 -20 5 47 -25 -25 54 -13 -13 66 -26 -70 71 41 -52
3763 -52 39 20 -53 19 57 -33 19 50 -51 -4 55 -38 22 58 -70 -36 82 2 -51 55 -9 -61 60 34 -69 32 33
3790 33 -47 8 26 -31 9 6 -55 12 43 -33 10 4 -88 -11 75 -17 -9 59 -39 -57 31 -6 -11 79 8 -68 38 3 -24 55 14 -38
3822 -38 68 44 -63 15 49 -61 19 81 -30 3 50 -45 -46 54 33 18 57 -28 -68 29 12 -6 73 36 -42 19 -8 -54
3850 -54 33 68 -43 0 25 -40 4 13 -44 -3 58 3 -2 14 -66 -28 54 -8 15 99 -20 -89 -1 -12 0 98 55 -76 -7 -4
3880 -4 -40 38 57 -9 29 22 -60 -4 62 -35 -8 65 -5 19 71 -45 -89 40 46 12 67 1 -78 -7 -6 8 76 61 -40 -27 -38
3911 -38 -43 59 74 -28 -6 19 -44 -2 42 -35 -27 30 -12 -6 38 -28 -44 10 -14 24 95 -5 -87 -11 -12 -5 96 50 -63 -9
3941 -9 -2 -39 37 82 -21 -3 10 -30 24 90 -11 -42 34 -7 12 79 -20 -90 8 23 -11 65 28 -64 -32 13 -9 56 60 -52
3971 -52 -50 -18 -7 54 50 -46 -31 -8 -23 18 47 -35 -44 10 -18 12 69 3 -50 3 -7 7 80 16 -84 3 -4 -21 63 40 -66
4002 -66 -17 32 -42 30 86 -31 -60 15 7 16 77 3 -60 5 11 5 52 8 -58 2 19 -17 30 34 -38 -16 7 2 35 21 -34 -35 2
4035 2 11 32 16 -48 -39 17 -10 11 50 -31 -39 25 -23 -14 54 19 -55 22 17 -15 36 11 -74 4 57 -14 0 14 -58 -22 55 -4 -1 55
4069 55 -20 -55 40 30 -6 28 -1 -52 19 38 -8 10 10 -25 32 39 3 6 22 -21 10 38 9 16 7 -54 -5 40 1 -10 0 -50 -17
4102 -17 49 -8 -22 30 -37 -40 54 14 -29 31 3 -71 40 66 -22 -14 18 -39 13 77 -14 -33 10 -23 -16 73 21 -22 26 -9 -38
4133 -38 42 39 -16 -12 -14 -22 44 50 -12 -26 -12 -17 29 40 -13 -2 -2 -37 20 43 2 -15 -20 -48 9 61 2 -43 8 -46 -25 63 11 -49
4167 -49 -1 -5 -43 41 38 -52 -8 -2 -61 22 57 -17 -39 11 -38 8 75 2 -44 11 -4 -15 45 27 -31 6 -8 -5 46 48 -16 -15 1
4200 1 -2 36 36 -24 -4 -13 -16 26 31 -16 7 18 -48 19 59 -11 -30 18 -39 -18 57 -4 -46 22 2 -29 40 26 -55 9 22 -40 3
4233 3 51 -21 -20 14 -29 0 53 -10 -40 22 6 -4 38 5 -19 21 9 -7 28 19 -5 23 7 -22 34 38 -18 9 17 -14 16 7 -24
4266 -24 14 32 -18 -12 30 -2 14 24 -24 -28 33 5 -24 34 -6 -30 29 14 -29 30 30 -32 -4 28 -23 9 26 -28 -20 33 -6 -9 23
4299 23 -8 -26 21 5 -7 28 15 -12 -3 -2 11 34 15 -11 4 17 17 45 10 -35 21 15 -7 44 43 -35 -4 24 -18 19 54 -14 -36
4332 -36 37 1 11 44 -4 -28 12 10 -8 25 22 -43 -7 21 -6 38 33 -42 -38 9 14 14 25 -36 -38 -4 9 2 23 -11 -16 9 0 4 36 -9
4368 -9 -37 26 34 33 24 -2 -52 0 41 20 47 0 -47 -6 35 6 46 37 -31 -18 40 -12 13 52 -20 -30 41 30 -12 15 -20 -44 19
4401 19 36 2 6 -15 -58 -14 43 34 20 2 -56 -32 43 22 21 14 -15 -40 8 1 -7 -12 -7 -4 41 18 7 6 -23 -26 37 51 23 19 -35 -58
4437 -58 20 61 12 14 8 -44 -3 34 12 24 44 -23 -16 27 10 -7 18 -9 -6 48 37 -40 -32 -14 -21 44 55 -13 -34 -24 -36 -5 47
4470 47 24 17 -17 -37 -15 16 28 2 4 -14 -8 14 2 -34 16 -15 23 46 7 -14 -24 -32 -14 78 65 6 -7 -13 -44 35 62 5 -2
4503 -2 9 -33 -7 42 14 -14 11 13 -1 50 15 -39 -5 -1 3 44 35 -40 -39 -8 -4 46 42 -11 -36 -23 -24 12 33 12 -21 -30 -21 7 27 2
4539 2 -38 -11 -1 23 34 -6 -28 -8 -8 8 53 22 -37 -14 -6 -10 61 55 -25 -15 2 -10 39 53 -3 -19 14 7 17 38 13 -25 5
4572 5 11 3 45 30 -32 -24 5 13 30 26 -29 -21 0 5 29 14 -17 -31 -1 0 16 36 -17 -35 -9 -5 17 31 -4 -36 -2 6 14 26 0 -17
4608 -17 13 4 1 31 29 -13 -1 9 2 29 23 -30 -19 30 21 24 29 -27 -35 14 9 19 36 20 -30 -2 8 1 24 18 -29 -19 15 1 4 12 -19
4645 -19 -5 22 28 -3 0 -13 -7 1 -9 -2 9 -26 -36 -3 8 7 7 0 -50 -8 12 -11 24 -6 -14 14 22 -12 7 16 -23 5 20 12 2 29
4681 29 -20 -16 28 12 10 19 8 -3 19 19 -4 9 19 -8 -4 7 1 6 8 -10 13 17 -2 -6 12 2 2 10 0 -6 21 8 8 18 -7 -2 21 -3
4719 -3 -20 11 12 -6 15 1 -20 9 23 -6 -1 20 1 6 12 -11 0 31 -3 -5 24 20 -3 32 15 -4 26 31 -5 25 32 4 28 11 -5
4754 -5 16 24 -1 1 4 7 1 21 -11 -6 9 -8 3 19 2 3 2 -9 0 18 7 -32 13 -3 -12 17 18 -23 14 -2 -28 14 19 -16 12 12 -13
4791 -13 -2 30 -10 -12 0 -3 -1 25 -5 -16 5 3 -11 32 12 -1 11 8 -1 19 25 8 11 16 -1 25 20 -16 -7 17 3 16 25 -3 -11 12 -6
4828 -6 -2 22 -1 -20 -20 -9 -8 24 10 -29 -5 -10 -19 3 -1 -28 -12 9 -5 3 0 -11 -9 -1 -17 8 22 -8 -27 9 3 5 20 -3 -35 6 16
4865 16 15 30 2 -10 6 8 5 30 12 -21 -15 11 6 19 14 -15 -11 14 6 9 15 -15 -16 5 3 11 12 -6 -24 12 -16 -8 17 -14 -37 -24 15 -12
4903 -12 14 3 -29 -21 3 3 12 16 -20 -23 25 9 2 11 -12 -21 7 26 2 11 3 -5 14 15 4 14 -3 -19 6 14 2 21 11 -19 -16 13 8 13
4941 13 12 -16 -7 12 14 13 15 -14 -21 14 -7 9 5 -17 -26 -6 5 6 0 -17 -33 -11 10 -7 6 -3 -25 -15 24 1 -5 5 -33 -22 17 15 1
4978 1 14 -17 -14 16 36 4 5 4 -6 17 18 14 6 4 -11 13 24 10 25 10 -22 2 31 3 10 3 -21 4 22 9 -1 18 -7 -12 25 16
5014 16 -4 4 -8 -27 8 25 1 -12 -10 -21 -7 23 6 1 -14 -16 5 17 9 -5 -4 -11 -15 10 13 -6 10 -15 -16 16 26 -9 6 2 -12 20
5050 20 31 0 -7 10 -8 4 28 16 12 1 -7 5 23 13 -2 -2 -2 6 15 11 -4 3 0 -4 7 8 5 -16 -5 -28 25 37 2 -8 -3 -11 3 18
5088 18 -1 1 14 -16 -12 7 -7 -16 15 4 -14 18 8 -7 -3 8 -3 15 13 -11 -11 11 -5 13 28 2 -1 18 -11 5 22 2 -6 1 6
5123 6 2 21 5 -9 0 -3 9 5 6 -3 3 1 -16 -2 4 -8 -15 -14 -6 1 15 -5 -15 5 -10 -14 16 -11 -14 0 -1 -7 0 1 -2 6 -3 -2 14 8 -17 -5 15
5166 15 9 4 14 -8 3 18 -3 2 9 -6 4 9 11 11 12 9 4 0 1 11 16 1 -1 6 9 14 4 3 -7 -2 4 -12 6 18 -9 -8 4 1 -1 4 -13 -13 8
5209 8 -2 -6 -3 -1 0 2 -13 -13 -6 -6 -10 0 0 -25 3 9 -14 16 9 1 13 10 -13 7 11 1 3 10 12 0 2 5 3 18 24 9 4 12 7 2 13 1 -2 10
5253 10 5 1 0 -7 4 -4 -6 -5 12 -9 -16 -10 -7 -3 6 2 -4 -2 -17 -26 3 9 -6 -2 -1 -15 7 8 -5 -11 20 -8 7 23 -4 -3 10 6 2 14 8 -12 -15
5296 -15 -7 -8 28 24 -8 13 9 1 17 21 10 3 13 -2 13 6 -3 6 6 -6 -3 9 1 -8 -6 -6 16 17 -4 -16 -10 -11 -11 20 -8 -19 7 4 -24 4 1
5337 1 -11 0 -2 -32 -12 12 -20 -8 21 0 -10 11 -15 -10 7 0 -14 18 8 -16 0 2 -8 11 14 -16 -13 10 6 5 17 19 -1 1 -7 -16 0
5374 0 2 5 -6 9 -3 12 -12 -18 5 -16 -3 9 -9 -24 7 0 -4 7 10 -18 -4 -7 -24 7 13 -8 -11 9 -15 6 13 -8 -8 11 9 -25 16
5411 16 9 -1 11 16 -8 4 10 -16 -7 7 -3 1 10 -9 -6 1 5 0 3 0 4 -1 4 -1 -2 -3 -4 6 -18 2 10 -13 -11 13 -1 -14 19 -4 -36 8 7
5452 7 -28 0 3 -27 -9 17 -19 -17 18 -18 -32 18 -7 -1 0 12 -8 6 12 -19 0 4 -3 2 12 8 9 12 -3 8 3 13 15 -13 -8 19 14 -2
5490 -2 13 -3 -24 9 12 -6 -3 11 -13 -7 7 -8 -10 25 -6 -29 13 8 -22 1 2 -12 1 21 -28 -12 6 -16 -21 3 -1 -11 5 -14 -9
5525 -9 5 7 -6 -2 -8 -15 -5 4 -4 -1 1 6 7 -7 0 18 -4 6 17 15 6 14 -1 -12 13 10 -2 4 20 -11 0 14 -11 -8 11 -7 -24 14 16 -10
5565 -10 7 -12 -27 -1 3 -16 -14 18 -16 -9 4 -5 -14 -3 -10 -19 -7 -2 -8 -14 -17 -19 -5 14 -2 -8 -22 11 5 -2 -2 6 -7 -2 5 -3 -5 9 -1 -19 14
5606 14 25 -17 10 6 -5 5 24 2 3 22 -11 -24 14 3 -16 9 -6 -16 2 6 -26 -8 0 -23 -2 11 -16 -13 6 -15 -14 -2 9
5639 9 -15 1 -10 -7 6 -4 -3 -10 -6 -4 6 4 -5 4 1 -5 5 -5 -5 7 2 -20 8 7 -2 20 1 -11 12 12 -9 2 12 -11 6 19 6 2 7
5678 7 12 -4 8 14 -9 17 11 -12 12 1 -2 -5 -2 -21 -6 7 -11 -5 2 -1 -13 1 0 -8 4 3 -8 1 4 -2 -10 -10 -2 17 -9 -6 1 -11 -3 9 0 -7
5720 -7 15 13 -12 13 7 -3 -6 12 -16 4 22 -15 1 16 -3 1 16 2 -9 5 -1 -3 12 -3 -6 1 -8 6 13 3 -22 -1 12 12 -10 -5 -12
5757 -12 0 -2 0 -11 -8 -11 -10 1 -8 -13 -3 -8 -8 6 -14 -7 4 -15 -8 2 0 -11 4 -4 -5 4 2 -9 13 19 -5 10 13 -6 12 16 0 -9 21 -3
5797 -3 -12 12 8 -11 5 14 3 8 10 -2 9 15 3 11 8 2 -12 6 1 1 -1 -6 -10 3 -10 -10 -6 -3 -6 -4 0 -8 -10 -11 -2 5 -1 -1 -4 -9 -8 6 17 -6 12 10
5843 10 -13 0 15 4 2 6 -2 0 14 0 -7 12 -7 7 10 5 -6 -3 17 0 8 14 5 -8 14 -11 -4 14 4 -18 -8 -7 5 -1 7 -1 -3 1 -18
5882 -18 4 -8 -11 -12 11 -5 2 -5 -4 -7 3 -9 -5 14 -9 -6 -4 -1 16 9 6 7 2 3 -2 10 -3 16 12 3 -4 1 4 1 12 9 -4 5 5 -10 5 23 12
5925 12 2 22 -5 -3 6 -6 -2 12 13 -1 -7 -10 -4 -2 6 -3 3 -1 4 5 1 0 -1 4 -6 -8 13 -10 3 -5 -1 1 14 0 -13 -4 -5 -1 16 5 2 9 -8 -15
5969 -15 9 20 10 16 3 -2 5 14 -2 14 19 4 -1 0 -4 8 19 4 1 22 -4 0 0 -3 6 7 10 -12 -9 8 -12 -2 9 -10 14 -7 1 -6 -4 -9
6009 -9 -5 12 -7 1 -5 -14 -3 -4 4 -2 17 2 -5 17 1 -7 1 16 0 6 5 -12 2 9 2 -4 13 -7 6 16 -4 26 28 13 10 12 17 4 5 7 -14
6050 -14 14 1 -2 8 -11 -5 8 7 -13 9 -1 2 -10 11 -6 6 4 -16 3 -6 -9 -17 -1 -11 1 13 -7 -3 7 2 -4 4 -8 -10 9 11 -17
6087 -17 -6 11 5 16 8 -13 7 -1 -9 10 8 -7 -1 11 4 9 14 8 -9 -6 17 13 20 11 0 0 1 0 -1 14 -1 -8 -15 -25 6 10 -8 -1 0 -13 -20 3
6129 3 -11 1 0 -5 -9 -1 -19 -19 -4 3 -13 1 -1 -11 -10 -6 -1 11 12 0 6 -2 2 16 5 -2 8 3 -5 12 19 3 -5 2 -5 14 19 -6 8 15 4 3 19
6172 19 -2 -12 -7 -4 0 4 10 -2 0 -13 -9 17 23 -9 -9 -1 -19 -19 4 3 -16 -9 -11 -15 -1 0 -13 -13 -3 -9 20 -2 1 -4 2 -3 17 16 4 4 14 7 8
6215 8 16 -5 5 2 6 -7 36 7 3 6 0 2 23 6 0 6 -5 2 -4 7 -12 -3 -1 -11 6 12 -1 -2 -1 -14 0 14 -8 -13 2 -13 -2 5 -5 -5
6255 -5 7 -4 -5 2 3 -3 -10 -19 -7 -3 16 6 2 -4 -10 9 12 0 11 6 1 9 7 5 9 10 2 3 19 4 14 19 10 5 9 10 0 14 1 -12 0 1 -4 10
6299 10 6 -10 11 17 7 -1 13 0 8 5 4 -5 -5 -4 -7 -10 -9 -1 -2 -9 -3 1 -6 3 4 10 -1 -1 5 14 15 3 -5 0 9 -5 6 5 -3 -2 9 16 -4 6 0 -22 4
6346 4 8 -2 15 12 -2 13 8 11 10 10 -7 -1 9 -11 5 0 -10 6 -4 3 3 9 -9 -13 2 -5 -9 0 2 -13 -1 -8 -2 11 0 10 5 -11 -1 0 1
6387 1 -8 -1 -1 -10 2 10 4 -7 0 -21 -3 19 1 13 1 3 4 7 12 -1 11 4 -3 26 20 7 -2 3 -5 7 10 -5 12 0 -16 1 9 9 18 -4 -9 -17
6429 -17 0 4 -2 -4 -15 -15 8 -4 -18 -5 -5 -11 -2 2 -2 5 -8 -18 6 15 3 7 -10 -15 6 15 3 15 7 -16 -15 4 7 9 13 -2 2 6 25 9 9
6470 9 -3 -11 2 17 6 12 -2 1 -8 12 9 11 7 -24 7 14 -2 2 -3 -16 -8 -10 17 -5 -7 0 -18 -7 12 -1 -7 -16 -2 -8 3 6 11 -3 -27 -8
6510 -8 20 7 -15 -2 -1 -4 1 4 -4 8 -2 -14 3 13 20 4 -9 -11 16 9 11 8 -3 -5 -3 4 -1 13 2 -13 -6 -4 11 5 5 -6 -7 11 10 -5 -7
6551 -7 -9 -7 0 -2 -1 -6 0 -20 2 1 1 -5 -6 -19 -7 4 9 -2 7 -10 -10 -5 3 1 2 4 -12 5 7 14 -1 4 7 5 10 2 15 4 -4 5 3 9 -3 15 1 -3
6597 -3 5 2 16 8 -2 -8 2 10 9 1 -7 -11 17 -7 -9 -7 -18 -10 -19 1 -11 -4 9 -13 -7 -13 -10 -14 3 -11 -8 -10 3 -9 -6 2 0 6 -11 -17 -8 5 -8 -2
6641 -2 -1 -3 -3 13 5 8 8 -7 -5 9 0 13 11 -8 -3 4 4 7 -10 -7 -13 11 -3 1 12 -2 -19 4 6 -3 6 9 -16 -10 13 10 11 -8 -6 -7 4 -8 -4 14
6685 14 -7 -13 -1 -6 -4 8 -7 -30 -4 6 9 6 -2 -16 -9 0 3 8 3 -15 -7 8 13 14 4 1 -9 12 6 6 12 -7 0 6 7 5 6 -1 3 0 -4 -6 4 -9
6729 -9 -14 -1 -8 -13 4 2 -28 -17 -2 2 5 4 -4 -19 7 18 -1 6 -21 -10 6 10 5 13 6 -23 -9 11 6 0 -4 1 -1 4 13 14 12 -11 -19 13 3 15
6771 15 14 -3 -8 0 13 18 10 -4 -4 2 12 10 20 23 -1 2 8 0 9 -1 -11 -7 -1 -6 2 11 -23 -10 11 9 0 19 -5 -9 1 4 6 15 7 -18 -15 4 3 8
6815 8 -8 -9 -6 -7 -11 6 11 2 -9 7 -2 0 7 5 -9 -3 9 14 17 -10 -12 1 1 15 16 -2 -8 9 -7 -5 20 2 -14 -5 -7 -6 4 12 -9 3 -7 -11
6857 -11 -2 6 3 -10 12 0 1 3 2 -5 -3 -13 -2 1 -1 -13 -6 3 -1 7 -1 7 12 -13 -3 15 6 11 17 1 -2 4 10 0 3 5 -11 2 14 11 -1 2 7 -3
6901 -3 13 17 5 -3 10 2 23 7 10 -7 8 -3 -11 11 -20 -8 -4 -5 -8 5 -7 -2 -10 0 9 8 0 -13 -3 -8 -7 -8 -8 -2 -1 -8 -16 10 -3 9 13 0
6943 0 -9 18 8 5 4 14 -18 4 13 5 2 10 -5 -12 -1 -1 -7 14 11 -1 11 15 2 17 6 -8 4 12 -12 -6 10 3 -4 -2 8 2 5 1 -10 11 12
6984 12 -5 -15 -11 -5 -4 -10 -1 -5 0 5 -11 -14 -16 -4 7 -13 -11 -6 -2 14 13 2 4 5 7 -4 26 -8 1 -1 -6 -2 7 3 -14 5 -5 4 23 15 -1 4 9 -1
7028 -1 5 1 1 4 1 -2 -7 10 -4 -8 -11 -5 2 12 15 -6 -1 -6 -4 -2 -21 -1 -6 -11 -17 7 1 -1 3 -17 -10 6 13 2 5 -2 -9 2 24 -3 -2 -1 -21 -13 6 13
7074 13 8 4 -2 0 15 17 1 0 12 6 4 10 2 -2 -7 -3 -16 13 5 5 -7 -21 2 11 0 1 -3 -9 -3 3 -1 -14 8 -9 -3 8 6 -7 -10 -12 -16 1 7 -8
7118 -8 -12 -5 -3 -3 13 2 1 -12 1 0 12 12 3 6 8 -21 -2 24 -3 3 2 -12 24 25 1 7 1 6 2 22 4 6 4 10 -8 15 2 -4 -8 -9 3 9 10
7161 10 -1 -7 -4 -1 6 9 1 -8 -5 -11 -10 3 -7 -5 -4 -10 -4 9 -6 0 -9 6 3 17 7 0 6 -9 -2 6 3 -12 -1 -4 -7 11 12 -7 3 6 4 -6 12 2
7205 2 11 6 11 -3 3 8 5 1 0 -8 1 -3 0 -7 -10 -3 0 3 -12 -8 -5 -2 -14 -11 -6 0 -13 -18 -1 0 -6 -9 13 -3 -1 0 -11 -14 1 11 -9 2 4 2 9 3 -5 -4 -2
7254 -2 -14 1 2 -1 -5 2 -9 1 9 5 -6 -9 -8 5 6 10 -3 -6 6 11 1 5 1 -6 -12 -4 6 17 5 2 -4 1 0 -3 -5 -11 -5 -20 -8 8 -19 -13 7 -16
7298 -16 -5 -1 -3 -7 -2 -15 -12 2 10 -14 0 -1 -6 6 6 9 -5 1 1 9 8 6 5 1 4 12 18 2 0 -9 -1 4 12 6 -4 2 -1 -3 2 10 8 -5 0 -8 10 7 2 -1 -15
7347 -15 -4 5 5 -4 -11 3 -4 7 6 -3 -8 -2 -14 -12 5 6 -3 4 -7 -10 10 2 0 -14 4 0 -6 5 -7 2 1 1 -4 5 5 3 6 0 -2 10 15 -2 3 2 10 12 -4
7394 -4 -3 9 2 0 5 9 -8 -9 2 -5 13 7 -13 -8 3 6 -7 -5 -7 -4 2 -9 4 1 -1 -5 4 -4 -3 0 0 -10 -7 -3 -3 -9 -7 -12 -4 -3 0 4 -4 0 5 11 -3 15 12
7443 12 2 5 4 1 9 4 0 3 12 14 2 10 7 -6 2 10 7 12 3 7 6 17 -4 2 5 -2 -10 6 7 0 -3 -7 -10 -4 4 2 -6 2 2 3 0 0 -10 -4 3 -2 7 -3 1 1 -2 6
7495 6 2 1 -6 12 5 -3 5 12 -3 9 10 -6 11 6 0 7 4 9 8 15 4 2 13 9 -6 0 -1 0 -7 -8 -12 -5 -5 -5 -1 -5 -7 -6 -4 -14 -5 3 -6 -4 -2 -7 -10 -2 -11 -6 12
7546 12 -1 -7 0 -11 1 5 -2 1 -9 1 4 13 -5 4 10 -2 2 7 3 1 18 1 -5 16 5 14 -1 6 0 18 10 -1 11 -8 3 8 6 2 -3 1 3 -5 4
7589 4 4 -6 -1 0 4 -7 -5 -4 -4 -9 0 0 -20 -5 -4 -13 -13 2 4 -2 -2 -17 -7 -6 -1 -2 -2 0 9 -1 2 7 -2 -2 -4 0 -1 3 -6 9 -1 3 8 2 4 5 1 2 11 8 5
7640 5 16 19 13 0 13 16 8 8 0 5 -3 2 1 -2 -11 7 5 -14 -10 -5 -7 -3 4 -2 -4 3 16 -20 -12 7 -7 2 11 1 3 9 5 -7 2 -10 2 -2 4 9 8 4 -5 13
7688 13 6 4 9 6 -15 4 -4 7 7 6 6 -9 6 2 5 1 11 -3 0 6 0 -5 -8 -7 1 -6 -11 -4 7 3 0 6 -9 -3 -8 1 -4 -9 -16 4 1 -25 3 -5 -15 -16 -15
7735 -15 -5 -6 -4 -13 -1 6 -5 7 -6 4 5 3 2 -5 6 16 -9 12 -2 -1 -8 7 -4 5 4 1 5 -1 11 2 7 7 -3 10 -7 -5 3 -12 -4 -11 6
7776 6 -14 13 -8 -8 5 5 -2 -8 -8 -12 -15 -11 -4 -9 -6 -31 -7 -17 -12 -9 -1 -14 -4 11 6 -3 9 -6 1 4 16 -4 10 -1 1 4 -1 -2 -3 3 4 11 -2 -8
7820 -8 1 2 1 -8 8 -2 0 -5 -13 5 1 1 -8 -13 -2 0 1 -15 -15 -4 2 -15 10 -5 -13 -1 -7 -16 -3 9 -4 -10 -10 -12 -14 1 -9 -4 -7 -6 -5 -1 5 -5 -7
7865 -7 0 -9 -1 7 -7 -6 8 -5 11 12 6 7 6 5 2 10 7 2 -7 0 5 12 4 -2 1 -8 -5 -14 -1 -20 -8 -7 -12 -2 -4 -8 -8 -5 -6 -9 -4 -16 -5 -5 -11 2 11 -12 -9
7914 -9 -6 -3 -7 14 5 8 -11 -1 -12 10 -4 -9 3 7 7 1 3 -14 17 -7 7 -3 8 -1 -5 4 6 -6 3 -4 8 -9 -11 -2 18 5 -3 5 -11 -7 5
7955 5 3 -27 -12 -2 3 -7 0 -9 -10 1 -11 -8 -5 1 -10 -9 -13 -8 6 -3 -18 -1 -1 0 -6 -6 -5 5 2 5 -8 1 -1 7 6 -1 -4 0 -4 -5 -5 9 3 2 6 6 6 15
8003 15 3 13 14 2 14 4 -6 2 14 -1 -6 8 12 -2 4 4 5 5 4 2 3 -11 -16 -9 -3 1 8 6 -20 5 3 6 -4 1 -6 5 4 3 9 14 7 -3 -3 -3
8047 -3 -7 -3 -2 -3 10 0 7 -1 -3 -5 2 3 1 0 8 10 18 9 -2 5 15 4 -5 -2 -2 9 1 7 1 3 -5 5 -6 -1 9 5 5 2 -1 -2 -4 -18 0 1 -4 -12 2 -17
8095 -17 -7 -14 -7 1 -3 4 -1 -3 2 10 14 -6 -2 3 4 11 2 4 -14 -6 -7 8 7 -10 9 5 -13 -2 6 -4 1 0 -2 7 13 0 -15 2 -4 -3 19 1 -6 0 19
8140 19 -3 1 0 4 5 -3 -11 -4 -9 -11 0 -11 -2 0 -4 -6 1 -8 5 5 -7 1 -7 -6 -6 -8 6 4 -4 -5 -3 8 4 -3 3 11 9 -8 8 2 9 9 19 -4 1 4 11 -2
8188 -2 7 1 4
8191D
$$ Imaginary data points
##PAGE= N=2
##DATA TABLE= (X++(I..I)), XYDATA
0 0 0 0 0 0 0 0 0 0 0 0 0 0 -8 8 -8 8 -8 9 -16 16 -16 24 -24 32 -32 40 -41 49 -56 64 -73 81 -89 101 -113
35 -113 127 -139 154 -171 191 -211 233 -257 287 -319 353 -392 435 -486 544 -615 697 -796 923
54 923 -1089 1309 -1627 2119 -3004 5044 -18870 6966 33997 -23767 6048 27784 -25201 -24438
68 -24438 25581 1975 -11437 15670 859 -18634 7311 6426 -6795 5509 -184 -13472 8099
81 8099 12207 -6945 -1619 2971 -12615 -4304 15482 9085 -5915 -5804 -1368 -4583 -5409 11752 15895
96 15895 -11619 -13781 11621 -1887 -13991 18136 11393 -25275 89 21009 -13031 -6889 19012
109 19012 -10511 -16016 18612 5107 -10938 10342 -3536 -19727 11163 11253 -9886 10987 5826
122 5826 -26760 38 21722 -10654 -3067 21119 -12446 -20504 17488 7132 -15157 7917 9345
135 9345 -14445 -2532 12210 -1501 -6250 1192 688 -432 1346 3119 1511 -6591 -5060 6005
149 6005 2950 -1904 4326 -1271 -8360 1864 3444 -1522 5806 77 -10200 3995 5588 -8977
163 -8977 4810 9743 -14524 -3579 17532 -6675 -11093 15325 -1346 -17434 11865 10828 -14569
176 -14569 1578 10038 -12032 -2916 13260 -2983 -5467 5703 -3907 -4360 7600 -306 -4361 4912
190 4912 -1815 -5784 6211 2394 -6518 2328 3429 -5146 262 5074 -1691 -3320 500 1682 929
205 929 -1346 222 2038 -4057 -2217 7532 209 -7249 3967 2677 -7970 3150 8115 -6493
219 -6493 -2968 5801 -4433 -2378 8333 -1653 -5477 4340 -1763 -4111 7640 574 -7905 4510
233 4510 2683 -7795 4309 6933 -8557 -2120 7720 -3989 -3201 8018 -1281 -7622 3026 3158
247 3158 -2512 1936 1644 -3803 -1438 1621 1249 1476 -626 -1951 5 -620 53 3255 213 -3116
263 -3116 -238 8 -164 3258 502 -3404 14 -129 -1385 4243 2007 -5301 -123 2534 -3948 1512
279 1512 6690 -3843 -4893 3941 -915 -2944 6143 1531 -6707 423 2735 -2596 2093 3454 -4019
294 -4019 -1971 2399 -1198 535 3614 -2137 -3104 1678 -78 -421 3408 -172 -4074 -7 1792 -64
310 -64 1191 911 -2140 -1806 611 1618 1213 -282 -847 -892 -1601 716 3448 213 -2417 -255 -819 -1110
328 -1110 3227 2190 -2776 -1098 432 -1739 1350 3474 -1401 -2004 681 -1611 -391 4052 409
343 409 -3170 153 -144 -1512 2873 2406 -2953 -1496 999 -1048 663 3035 -639 -2472 -202 -219
359 -219 182 2401 865 -1991 -1489 -252 644 1812 933 -1146 -1534 -714 521 1511 928 -368 -1207 -1471
377 -1471 45 1879 1176 -230 -921 -1939 -720 2340 1777 -666 -759 -1276 -1565 1474 2578 -183 -933
394 -933 -667 -1872 -21 2885 1133 -1122 -918 -1579 -788 2460 2111 -971 -1365 -992 -909 1327 2348 11
412 11 -1435 -1105 -917 473 2170 1147 -1073 -1782 -1108 514 1892 1377 -499 -1885 -1441 542 1721
429 1721 1090 -10 -1193 -1802 -203 1705 1366 258 -771 -1994 -1005 1689 1912 221 -781 -1680 -1310
446 -1310 1247 2099 365 -713 -1210 -1433 366 1983 980 -373 -1105 -1684 -261 1940 1480 -212 -1135
463 -1135 -1602 -475 1675 1556 -110 -879 -1253 -780 1019 1544 334 -564 -1205 -1091 620 1629 699 -437
481 -437 -1313 -1276 586 1688 570 -414 -883 -1239 131 1538 625 -293 -445 -1183 -509 1378 1087 -190
499 -190 -456 -1082 -820 1287 1422 -354 -617 -616 -824 780 1457 -239 -724 -213 -685 66 1335 395 -691
518 -691 -531 -630 78 1283 526 -632 -633 -684 116 1395 405 -815 -170 -397 -546 1074 858 -769 -192 41
538 41 -835 530 1267 -657 -737 265 -352 419 1312 -798 -1305 526 101 9 1472 -143 -1848 114
556 114 524 -498 1138 1124 -1475 -964 534 -73 510 1008 -830 -964 499 267 261 408 -1008 -730 922
575 922 424 129 706 -938 -1671 429 956 536 1058 -394 -2046 -566 676 791 1387 -92 -1739 -151
593 -151 378 -542 1119 943 -1797 -291 1575 -715 -322 1413 -1441 -1797 1969 1363 -507 568 -1052
610 -1052 -2585 791 2100 403 828 -413 -2754 -379 1513 56 1154 1331 -2247 -1616 1535 233
626 233 -356 1221 -606 -1553 1181 1258 -618 -534 -821 -678 1180 1245 445 187 -1858 -2181 1073 1668 503
645 503 1447 -439 -3373 -650 1905 420 796 925 -1790 -1139 964 -135 210 1056 -1257 -607 1834
662 1834 -305 -876 1309 -1367 -2371 2559 2256 -1463 228 -64 -3239 78 3317 353 -385 465
678 465 -1967 -1548 1349 879 610 882 -1526 -1303 1208 -9 -436 1339 -692 -1632 1700 1155 -1509
695 -1509 -91 131 -1320 683 1739 28 -160 -857 -1780 568 1411 50 1192 184 -3046 -381
711 -381 2346 -669 -250 2121 -1292 -2071 1771 469 -1432 1111 405 -1535 745 900 -799 419
727 419 -323 -1619 1384 1494 -1388 395 746 -2510 -63 2757 -754 -967 1738 -948 -1973 1496
743 1496 909 -796 633 -135 -1143 639 299 -437 855 -438 -1235 1454 497 -1747 917 999 -1987
760 -1987 217 1842 -1131 -451 1314 -1032 -759 1357 -149 -342 739 -1018 -388 1564 -826 -890 1919
777 1919 -553 -1879 1854 502 -2239 1281 1432 -2273 2 1894 -1177 -543 1314 -698 -491 994
793 994 -594 -260 955 -762 -206 1239 -1087 -704 1929 -449 -1576 1485 303 -1658 986 864
809 864 -1410 318 816 -1043 158 691 -663 419 323 -1312 636 1167 -1478 9 1495 -1400 -540
826 -540 2050 -762 -1476 1604 20 -1505 1214 675 -1203 425 104 -1087 940 755 -1016 553
842 553 227 -1675 747 1434 -1473 54 1658 -1422 -993 1684 -357 -1019 1315 29 -1101 821
858 821 234 -949 290 37 -273 1149 43 -1174 473 -49 -1171 1117 1162 -1107 132 554 -1584
875 -1584 -224 1509 -155 -122 697 -905 -524 769 -596 -186 1330 -386 -584 1114 -747 -1434 1287
892 1287 424 -1158 1266 945 -1737 -321 619 -1004 467 1707 -486 -655 260 -934 -343 1067 -34
909 -34 84 1005 -815 -1147 640 -125 -542 1265 449 -904 381 46 -1298 96 869 57 607 333
927 333 -1034 -400 65 -501 660 1101 -374 -83 181 -1322 -431 1272 99 -132 970 -383 -1112 259
945 259 -186 -470 1141 694 -578 70 -388 -1133 464 772 -323 680 668 -1258 -638 509 -439 195
963 195 1344 -200 -795 367 -346 -813 565 502 -73 570 -14 -934 -166 98 -205 619 611 -273 -48 -195
983 -195 -874 28 790 190 183 178 -654 -358 265 -204 101 683 -54 -219 209 -510 -420 588 50 -269 710 197
1005 197 -776 -61 -14 -520 592 905 -411 -357 107 -550 -176 692 128 -64 311 -370 -570 264 208 -57
1025 -57 300 -16 -327 216 95 -400 44 207 -40 250 133 -370 -102 83 -185 142 401 -56 -94 -77 -423
1046 -423 47 541 2 -192 76 -254 -150 396 -4 -268 241 18 -330 211 210 -237 71 51 -358 194 485
1067 485 -226 -232 92 -208 52 461 -113 -321 187 -61 -262 293 192 -220 18 -4 -280 144 369 -100 -221
1088 -221 -40 -23 113 138 -67 -79 -20 -21 103 29 -89 151 30 -276 82 271 -140 -29 109 -307 17 507
1110 507 -140 -392 212 -32 -245 384 158 -421 122 186 -457 53 527 -154 -222 187 -220 -155 456 55 -390
1131 -390 78 147 -161 79 139 -136 -32 100 -94 -39 131 72 -95 -177 -13 171 36 -30 -23 -157 -41 257 -37
1154 -37 -222 202 60 -282 144 156 -249 143 199 -416 -9 500 -185 -230 296 -196 -232 514 -16 -504 294 199
1176 199 -457 158 337 -361 -3 339 -367 -159 530 -42 -359 172 31 -221 224 161 -276 -41 210 -49
1196 -49 -154 111 153 -99 -145 125 -8 -146 245 103 -444 62 462 -300 -214 453 -213 -376 579 7 -644
1217 -644 496 361 -753 127 612 -544 -90 673 -495 -374 832 -103 -684 506 184 -594 359 352 -607
1236 -607 90 500 -430 -177 504 -77 -254 198 -69 -220 238 187 -198 -121 100 100 -125 -49 234 -45 -217 251
1258 251 1 -414 364 333 -622 40 599 -491 -162 700 -461 -469 919 -126 -868 747 299 -975 470
1277 470 596 -984 181 944 -897 -369 1103 -399 -670 876 -95 -827 744 317 -906 292 590
1294 590 -630 -41 542 -344 -166 441 -173 -315 274 171 -175 -93 76 83 -123 -39 240 -199 -231 497 -33
1315 -33 -626 528 406 -845 182 716 -798 -53 1082 -756 -690 1236 -193 -1045 1043 280 -1229
1332 -1229 697 648 -1319 313 1162 -1048 -306 1161 -691 -601 1154 -320 -898 999 208 -1032 492
1349 492 469 -801 204 614 -581 -109 574 -269 -327 291 123 -71 -13 -57 37 -84 -14 325 -167 -356 483
1370 483 26 -663 472 405 -778 256 593 -922 40 1087 -818 -556 1220 -427 -898 1209 -45
1387 -45 -1305 1061 604 -1511 464 1067 -1312 -79 1326 -878 -507 1323 -527 -1046 1039 193 -859
1404 -859 702 323 -935 269 472 -664 102 629 -298 -165 193 -249 -94 223 25 65 18 -46 130 -324
1424 -324 -375 565 220 -393 520 113 -1047 261 682 -838 262 1247 -872 -726 953 -560 -739 1457
1442 1457 140 -1165 890 263 -1553 437 945 -950 412 1167 -1199 -598 1006 -687 -552 1423
1458 1423 107 -824 623 -239 -1248 563 838 -369 311 421 -752 -419 168 -143 248 589 93 -131
1476 -131 -374 -494 109 125 -10 690 272 -637 -79 -197 -826 577 1056 -403 70 497 -1205 -632 1012
1495 1012 -187 -115 1487 -283 -1505 494 62 -1068 1094 1132 -1001 116 636 -1491 -515 1294 -97
1512 -97 -87 1174 -480 -1254 322 -69 -527 1050 838 -543 -135 -243 -927 125 817 200 291 209 -580
1531 -580 -514 -191 -98 540 607 42 55 -353 -810 31 306 -134 726 757 -779 -531 117 -743 51 1362 20
1552 20 -470 572 -617 -1196 687 538 -364 898 442 -1325 -196 508 -749 218 1236 -331 -373 518
1570 518 -797 -837 862 389 -250 698 40 -988 -97 112 -339 568 733 -250 -265 -201 -522 75 442 100
1590 100 244 158 -438 -216 -79 -272 400 553 -224 20 173 -647 -195 480 -188 124 801 -372 -720 338
1610 338 -164 -412 823 309 -640 308 142 -896 158 692 -362 85 540 -602 -319 566 -281 -306 662
1629 662 24 -387 304 -153 -527 387 264 -295 253 154 -437 22 122 -258 256 336 -326 -84 113 -273 105
1650 105 276 -277 7 284 -299 -101 330 -205 -63 372 -263 -250 435 -73 -340 353 3 -339 371 50
1670 50 -517 275 307 -406 125 273 -461 39 403 -352 -59 496 -270 -303 330 -140 -195 472 -50 -418 266
1691 266 63 -340 223 150 -261 221 147 -380 46 235 -221 54 220 -218 22 186 -321 -97 317 -62 -20
1712 -20 231 -244 -188 277 -125 -151 380 1 -233 193 -115 -308 336 158 -313 201 149 -357 78 160 -308 166
1734 166 379 -296 -118 274 -243 -93 364 -161 -156 373 -117 -354 233 58 -208 281 41 -347 174 162 -318
1755 -318 85 235 -181 47 156 -262 -4 272 -143 -75 186 -102 -38 159 -161 -90 231 -59 -108 154 -83
1776 -83 -83 233 -114 -205 263 21 -218 181 -2 -250 246 108 -354 142 249 -311 22 262 -257 9 350
1797 350 -270 -194 365 -70 -204 273 -48 -251 268 39 -303 197 161 -228 72 74 -210 107 164 -195 17 154
1819 154 -135 -13 89 -153 76 217 -165 -65 132 -158 -3 210 -170 -43 286 -167 -205 245 -23 -142
1839 -142 270 -62 -301 246 100 -310 158 176 -274 93 169 -315 21 311 -218 -97 242 -125 -71 244 -143
1860 -143 -157 280 -16 -189 172 -6 -142 192 -23 -213 187 76 -193 110 32 -178 165 82 -264 124 187
1881 187 -241 40 149 -270 81 286 -279 -95 316 -187 -165 311 -126 -183 345 -51 -352 264 133 -262 167
1902 167 98 -286 137 195 -276 43 231 -173 -25 138 -171 24 224 -150 -78 167 -105 -16 164 -161 -9
1923 -9 246 -171 -128 249 -105 -101 314 -144 -283 362 25 -348 291 123 -381 232 202 -456 142 409 -392 -87
1945 -87 384 -288 -126 417 -217 -269 407 -59 -359 287 63 -286 237 73 -335 156 194 -257 49 151 -176
1966 -176 64 111 -232 60 177 -145 36 85 -226 105 196 -267 49 263 -259 -35 302 -283 -43 452 -262
1987 -262 -323 439 -81 -334 451 -14 -491 384 159 -567 284 400 -509 63 391 -493 -33 583 -349 -280 503
2008 503 -162 -331 412 -66 -373 377 90 -396 216 182 -315 97 140 -234 169 195 -253 12 96 -174 135
2029 135 138 -250 137 177 -324 69 249 -291 108 339 -396 -56 475 -344 -254 514 -175 -262 580 -154 -631 450
2051 450 138 -526 474 363 -649 132 337 -640 105 728 -355 -227 448 -375 -321 596 -69 -349 479
2070 479 0 -488 238 78 -320 279 196 -293 159 141 -345 4 109 -131 268 207 -324 -20 40 -293 205
2091 205 303 -249 145 226 -544 -61 474 -266 -13 551 -376 -333 563 -252 -502 619 108 -488 511 116 -810
2112 -810 245 412 -578 285 681 -543 -244 393 -501 -134 842 -57 -410 355 -197 -501 420 188 -259
2131 -259 344 105 -485 45 135 -208 192 197 -181 143 72 -335 23 80 -134 326 229 -385 31 131 -464 141
2153 141 508 -281 33 392 -574 -290 641 -138 -278 621 -137 -583 502 61 -657 465 394 -612 233
2172 233 433 -671 -42 547 -452 -93 739 -257 -452 368 -183 -345 582 157 -411 226 45 -454 160 251
2192 251 -166 184 126 -357 23 154 -141 126 106 -223 135 123 -317 79 198 -270 135 293 -370 1 384
2213 384 -398 -139 534 -203 -238 496 -231 -455 581 75 -553 408 209 -599 258 371 -559 107 533 -490
2233 -490 -146 525 -268 -230 473 -198 -337 472 5 -397 293 92 -345 217 146 -329 133 200 -290 17 179
2254 179 -156 74 123 -223 37 146 -185 58 162 -219 71 182 -312 9 346 -232 -120 303 -253 -172 464
2275 464 -132 -326 383 -5 -412 337 147 -409 262 207 -522 121 430 -365 -55 349 -348 -137 488 -173
2295 -173 -275 375 -64 -343 301 76 -273 232 75 -326 151 190 -225 31 80 -201 133 199 -225 -35 87
2316 87 -186 62 248 -124 -8 108 -294 -67 321 -9 -7 177 -311 -227 341 2 -140 301 -60 -345 240
2337 240 66 -327 227 186 -375 120 319 -309 -67 186 -330 -13 530 -59 -242 135 -244 -254 411 179 -148
2358 -148 188 -93 -451 85 252 -43 191 87 -337 -37 165 -144 18 149 -107 70 169 -193 -124 58 -170
2379 -170 45 355 10 -90 13 -368 -216 397 239 -1 130 -262 -441 153 193 -47 280 118 -390 -55
2399 -55 120 -186 112 269 -220 -48 293 -138 -208 105 -161 -64 442 131 -231 -22 -181 -288 248 325 39
2420 39 107 -115 -438 -44 252 96 179 80 -287 -117 111 -102 36 200 -79 -19 163 -135 -133 79 -124 -85 313
2443 313 136 -111 0 -258 -285 269 293 -24 95 -88 -392 -11 214 -2 160 193 -261 -175 117 -32 27 196
2465 196 -83 -103 191 -8 -149 43 -65 -58 212 100 -111 25 -95 -224 103 182 31 107 -44 -300 -15 175
2487 175 -10 87 92 -200 -57 126 -105 -12 203 -63 -97 148 -61 -110 142 -41 -181 160 123 -144 15 -5 -183
2510 -183 90 172 -98 -21 91 -134 -65 117 -32 14 121 -78 -115 92 30 -33 59 -27 -43 97 -18 -83 56 3
2534 3 -14 88 -66 -77 113 13 -94 101 18 -137 92 49 -148 98 142 -193 -49 142 -97 7 175 -142
2556 -142 -138 218 9 -122 138 5 -183 113 105 -124 79 83 -206 -58 153 16 33 48 -166 -107 125 87 12 34
2580 34 -85 -84 23 39 72 87 -70 -94 0 -1 100 126 -139 -141 81 34 43 142 -105 -207 105 83 -51 185 48 -278
2606 -278 -43 120 -41 136 185 -268 -191 188 42 22 202 -132 -263 128 103 -56 150 34 -250 -40 154
2627 154 28 106 66 -227 -163 133 151 88 -8 -159 -139 42 120 142 39 -140 -97 -26 9 187 148 -187 -159 11 -11
2652 -11 133 252 -150 -250 79 24 -18 257 5 -301 8 115 -76 190 195 -286 -201 142 -10 70 245 -185
2674 -185 -325 127 124 14 165 -22 -276 -25 107 19 146 65 -220 -156 64 109 151 52 -180 -143 14 98 162 43
2698 43 -167 -80 -7 -23 165 150 -155 -121 6 -105 130 273 -146 -225 82 -49 -11 313 0 -313 64 88 -152
2721 -152 206 218 -284 -115 149 -105 66 325 -149 -301 114 58 -28 223 21 -278 7 93 -48 122 111 -171
2743 -171 -110 31 2 117 103 -115 -153 -33 52 132 46 -110 -45 -21 -60 143 117 -133 -10 41 -165 57 285 -100
2767 -100 -181 110 -102 -80 319 16 -286 91 67 -180 168 183 -246 -4 149 -207 31 324 -137 -193 160 -71
2789 -71 -87 291 29 -257 59 93 -125 86 140 -132 -43 55 -48 32 101 -32 -65 -40 -43 103 71 -99 -16 13 -92
2814 -92 59 97 -111 6 88 -132 -13 160 -79 -33 143 -143 -110 259 -27 -207 198 49 -242 187 143 -280
2836 -280 77 252 -234 -81 266 -118 -114 211 -63 -143 192 3 -169 109 53 -116 102 20 -153 109 97 -165
2858 -165 19 99 -65 23 78 -109 -27 60 -18 25 38 -80 26 -5 -157 117 202 -133 -49 100 -209 -50 300 -42
2882 -42 -173 173 -48 -216 177 91 -166 113 54 -221 127 189 -203 -25 146 -174 80 328 -158 -238 151 -76
2904 -76 -109 312 113 -229 -14 -42 -164 145 223 -31 -54 -96 -130 101 110 -73 45 30 -127 95 113 -184 -47 104
2928 104 -95 73 244 -75 -165 -52 -159 79 386 47 -155 -31 -255 -171 366 167 -152 125 -60 -397 102
2949 102 292 -121 11 143 -204 -46 249 -96 -178 76 -20 72 278 -54 -256 -46 -113 -41 393 218 -176 -112
2971 -112 -180 -248 214 377 29 -77 -115 -206 25 157 11 76 28 -154 44 115 -170 -52 109 -130 63 381
2993 381 -39 -303 -48 -123 -40 437 237 -197 -125 -192 -231 231 320 -9 53 -75 -373 6 299 -31 -4 155 -168
3016 -168 -97 228 -56 -227 76 53 2 224 48 -216 -104 -99 -15 311 235 -90 -88 -202 -233 218 322 -8 -8 -20
3040 -20 -260 -40 204 -5 17 104 -138 -75 135 -76 -93 78 -91 -15 317 -5 -265 -12 -56 -114 291 248 -199
3063 -199 -85 -15 -232 52 298 12 -42 3 -204 -71 203 9 -41 89 -93 -65 164 -37 -145 97 24 -76
3085 -76 147 77 -166 -26 -6 -84 131 149 -75 -30 -43 -123 119 167 -91 5 63 -157 -19 184 -80 -63 138 -90
3109 -90 -126 164 21 -140 83 21 -105 139 59 -168 45 73 -109 81 112 -168 -18 148 -110 -28 171 -63
3131 -63 -111 106 -21 -57 126 12 -116 53 14 -49 61 -3 -77 78 34 -95 37 5 -101 78 83 -95 40 42
3155 42 -146 -5 135 -7 38 69 -159 -63 137 -10 -26 120 -92 -126 135 -17 -131 143 39 -175 71 105
3177 105 -134 3 56 -149 13 191 -36 -77 26 -120 -28 160 11 -45 48 -92 -111 122 68 -29 81 -34 -133
3200 -133 62 102 -24 14 -25 -74 63 67 -53 21 -13 -99 66 117 -41 34 37 -173 -20 205 16 -27 51 -134 -86
3225 -86 167 67 -62 75 -36 -135 89 78 -78 74 24 -166 34 156 -56 -18 49 -136 -27 175 9 -89
3247 -89 22 -59 -63 104 39 -23 37 -72 -82 82 62 -5 59 -62 -120 105 110 -39 18 8 -120 38 92 -42 19 56
3273 56 -118 -25 116 -11 4 74 -105 -78 137 25 -58 68 -33 -101 102 71 -72 46 28 -106 24 94 -15
3296 -15 29 25 -124 -24 116 -3 -13 47 -97 -46 103 -4 -58 71 -36 -75 59 23 -29 60 -23 -81 68 65 -36
3321 -36 49 -6 -101 60 90 -72 15 68 -109 -17 93 -31 -3 106 -67 -78 79 14 -32 66 -42 -94 75 31 -75
3346 -75 42 35 -83 23 63 -59 20 62 -73 -29 50 7 13 40 -70 -29 56 -12 -4 54 -53 -54 39 -34 -33 93 -3 -96 33
3375 33 8 -47 72 25 -102 43 45 -75 31 58 -88 4 58 -84 -3 107 -49 -71 72 -18 -45 103 -6 -111
3399 -111 56 26 -57 49 37 -83 23 33 -62 37 61 -55 -34 31 -40 23 72 -51 -42 43 -4 5 51 -30 -8 41 -37 -25
3427 -25 83 -10 -42 33 -40 -51 96 21 -88 31 16 -80 61 55 -104 29 62 -91 -4 108 -46 -39 61 -69 -48
3452 -48 126 2 -101 55 8 -52 74 36 -82 26 52 -64 23 63 -36 -23 25 -59 20 80 -38 -46 13 -32 12 58
3478 58 -21 -33 32 -33 -13 53 -23 -16 47 -59 -60 94 15 -76 42 0 -72 78 62 -102 31 58 -74 15 87 -67 -19
3505 -19 71 -70 -40 121 -21 -71 56 -43 -63 103 45 -84 32 37 -63 24 49 -33 10 39 -36 12 45 -21 -13 1 -22
3532 -22 57 56 -49 -34 31 -33 13 77 -39 -42 32 -50 -43 68 5 -26 47 -48 -79 92 30 -90 47 44 -78 41 67 -108
3560 -108 -19 103 -44 -35 93 -30 -87 20 -26 -45 107 31 -78 2 -28 -47 78 43 -58 26 24 -81 4 55 -32 8
3586 8 42 -36 -9 20 -33 -15 9 -15 71 48 -79 -23 34 -59 0 122 -15 -60 58 -61 -103 85 51 -70 18 9 -97
3613 -97 37 39 -63 29 79 -56 4 54 -85 -40 104 -25 -47 111 -3 -109 22 15 -36 62 51 -64 -21 9 -15 30
3639 30 24 -20 44 10 -76 30 38 -52 21 50 -54 7 66 -48 -46 44 -3 10 48 -44 -48 52 -35 -19 88 -12 -75 48 -2
3668 -2 -103 74 58 -105 -5 63 -68 -13 63 -47 -35 66 -19 -40 23 -29 -37 57 -29 -37 70 -17 -70 41 16 -37 44
3695 44 27 -79 8 55 -20 3 12 -29 24 20 -45 32 36 -59 24 48 -68 4 79 -57 -55 101 -1 -60 53 -14 -59 62 31
3724 31 -57 31 20 -50 35 29 -44 35 34 -87 -11 69 -30 -25 58 -53 -34 73 -6 -60 20 1 -29 18 -5 -22 38 -6 -38 50
3754 50 17 -36 56 -11 -79 54 65 -58 -8 49 -54 7 56 -43 -29 45 -32 -26 60 -9 -27 46 -41 -51 93 16 -51 41 14
3783 14 -64 30 45 -74 -7 55 -39 -14 43 -21 -13 19 -37 12 72 -24 -25 7 -57 -6 87 1 -41 41 -15 -70 39 31 -20 52 13
3814 13 -78 18 23 -28 39 30 -49 31 52 -79 -21 74 -24 -1 86 -30 -46 50 -7 -44 86 68 -28 18 -36 -72 39 55 -13
3843 -13 49 20 -72 -16 10 -37 36 71 -36 -37 27 -19 -16 28 -18 -5 65 -13 -44 2 -51 -34 63 9 -8 49 -44 -108 16 39
3873 39 10 76 24 -107 -37 25 -20 51 71 -22 -31 18 -54 -16 76 3 -34 56 4 -22 46 -32 -72 50 82 -11 16 -12 -87 -12
3903 -12 50 10 57 40 -68 -68 3 -10 50 68 -40 -53 23 -12 -6 43 -15 -22 40 4 -20 17 -32 -40 33 34 22 64 -19 -99 -10 32
3935 32 15 71 29 -94 -40 27 -12 30 65 -31 -59 24 -7 3 64 -14 -66 37 46 -3 45 -22 -91 25 74 2 15 7 -78 -29
3965 -29 37 27 24 32 -60 -74 13 22 44 29 -54 -50 22 10 15 27 -23 -59 7 6 -7 50 -6 -62 0 15 12 56 0 -89 -10 51 -9 32
3999 32 31 -76 -28 55 -7 3 65 -40 -81 31 29 -2 41 -16 -78 6 39 6 23 5 -64 3 49 6 8 22 -31 -24 43 22 7
4030 7 17 -32 -38 37 30 17 9 -54 -39 41 6 -10 24 -46 -50 20 21 -21 32 18 -77 -8 42 -19 17 15 -58 0 58 -20 -42 23 -35 -14
4064 -14 63 5 -45 15 -14 -60 34 56 -15 1 -11 -52 8 39 -13 -11 -13 -25 24 37 -19 -19 7 -12 -1 38 -7 -12 6 -33 -3 62
4096 62 17 -35 -10 -38 -17 56 5 -29 13 -18 -51 39 32 -59 5 24 -55 24 92 -31 -34 23 -32 2 80 -5 -67 13 7 -22 52
4127 52 21 -58 -11 11 -12 36 40 -19 -25 9 -5 30 32 -29 -42 -10 -6 24 26 -26 -29 -8 -28 3 44 -11 -41 8 -17 13 69 7 -46
4160 -46 -14 3 -14 62 8 -71 -10 5 -23 22 32 -62 -24 21 -26 -1 55 -31 -69 15 7 -16 50 5 -70 2 19 -19 25 27 -53
4191 -53 -22 24 -10 20 29 -22 -38 -4 7 30 19 -25 -33 9 -4 23 23 -29 -15 25 -11 0 55 -15 -34 25 -10 -4 65 7 -53 9
4223 9 33 -28 27 37 -53 -2 37 -29 -15 48 -24 -37 19 -11 -15 35 1 -53 9 6 -19 3 2 -25 5 12 -17 5 11 -26 4 4 -16 19
4257 19 30 -21 -6 14 -3 6 29 -18 -1 31 -21 -20 23 -9 -9 34 -21 -34 44 -4 -31 22 4 -33 24 31 -27 17 25 -21 -11 32 -13
4290 -13 -2 29 -33 -20 42 19 -19 17 -11 -26 20 10 -11 1 4 -31 -1 20 8 7 -8 -44 -10 28 4 20 -9 -33 8 42 -3
4321 -3 26 22 -40 -20 35 5 7 34 -16 -44 26 35 -5 19 -10 -46 26 41 -21 7 -5 -57 3 27 -8 -2 7 -55 -45 44 23 -3 12
4354 12 -42 -53 26 25 -5 13 -17 -40 5 7 -15 -5 -16 -42 8 38 8 -2 -22 -51 -3 46 4 5 -11 -50 -7 35 3 11 14 -39 -38
4387 -38 30 15 11 27 -19 -40 39 43 -30 -21 2 -34 27 47 -7 -25 -10 -38 -8 52 13 -17 -18 -51 -41 39 29 -2 -9 -28 -26 21 19 -24
4421 -24 -6 4 -19 17 -4 -30 -13 -20 -24 42 42 -21 -20 -38 -49 38 67 0 -25 -13 -47 -24 50 15 -9 21 -26 -43 31 11 -22 7
4453 7 2 -23 31 23 -51 -33 17 0 35 54 -19 -65 -29 -14 9 63 8 -37 -38 -30 0 35 23 -18 -14 -11 -10 23 -11 -35 -7 6 6 39 2
4488 2 -50 -15 -11 -2 51 52 -27 -47 -20 -2 34 67 -20 -29 -10 -14 13 40 3 -27 14 17 -17 20 17 -36 -11 37 28 37 11 -39 -45 18 29 43
4524 43 35 -42 -45 14 1 21 49 4 -32 -20 1 6 29 -12 -34 -14 13 17 13 -11 -46 -8 12 4 18 3 -45 -9 14 18 32 27 -38 -31 8
4559 8 6 26 39 -26 -48 9 14 -10 34 3 -38 -4 27 11 6 10 -34 -18 19 20 23 8 -31 -20 27 9 15 7 -30 -13 6 25 9 9 -19
4594 -19 -37 -13 35 23 16 -22 -49 -4 22 5 12 -10 -34 -4 23 8 7 11 -20 -14 32 13 6 24 -14 -23 38 41 13 10 -28 -38 26 40 11
4629 11 10 0 -35 0 28 13 27 10 -25 -13 27 16 -2 2 -7 3 24 11 -18 1 -10 -4 23 18 -5 5 -10 -21 1 22 6 -4 -31
4662 -31 -21 3 9 -7 2 6 -23 4 7 -13 -7 19 -3 -17 27 7 -16 1 -2 -24 30 31 -24 -13 -16 -12 28 35 -4 -1 19 -15 -4 17 -2 0
4698 0 8 -9 -7 22 3 3 9 -3 -4 25 -7 -6 16 7 9 26 3 3 9 5 -28 14 18 -9 3 2 -19 8 34 -20 -15 10 -10 -20 20 -10 -9 18
4736 18 -9 -28 14 7 -6 12 -7 -13 7 15 -6 1 13 0 -7 14 -9 6 16 -8 -1 -1 3 2 15 -4 9 0 -6 -13 12 -5 -15 -1 -2 -12 19
4773 19 25 -19 0 -2 -7 0 10 -12 -8 9 -23 0 8 -17 -7 16 -14 -2 20 4 -22 12 3 9 14 -3 -17 4 6 -3 11 3 -14 1 18 -1
4809 -1 20 16 -17 -4 15 7 19 9 -5 4 13 10 2 12 -5 -4 22 10 0 21 13 -24 -13 -3 -6 11 4 -23 -16 15 8 13 3 -22 -7 16 -5
4846 -5 -10 17 -14 -16 8 -6 2 19 -19 -29 10 20 5 10 -10 -24 6 25 11 0 5 -27 4 18 5 14 10 -26 -18 19 16 11 10 -23 -10 29
4882 29 19 0 5 -5 -4 21 17 6 19 2 -18 3 20 15 12 4 -23 -3 31 -7 -12 5 -21 -4 27 3 -1 6 -15 -21 24 20 -5 6 -13 -20
4918 -20 2 16 -8 -5 -12 -28 16 26 3 8 -2 -23 6 26 8 0 3 -28 -23 20 6 -6 -2 -33 -10 23 24 -13 -3 -7 -21 12 14 -9 -5 -5
4954 -5 -19 -1 29 -4 -1 -4 -27 4 21 -8 -19 -12 -8 -9 20 -3 -17 -1 -15 -26 15 10 -5 -6 -18 -16 8 23 -22 -9 -10 -6 7 28 10 1
4990 1 2 -10 6 30 -5 -1 -13 -17 0 24 13 -6 4 -4 -9 20 1 -9 7 -2 -4 12 24 -8 -5 16 -6 21 23 10 -15 2 -12 16 38
5025 38 2 -22 4 -6 -1 32 7 -10 3 2 -5 20 2 -21 -9 -3 -10 18 20 -22 -7 4 2 12 16 -16 -14 -2 7 4 34 11 -10 10 -3 -13
5061 -13 26 2 -18 6 0 -5 4 8 -19 -5 10 -6 1 0 -12 0 0 -14 6 14 -5 -25 -1 -1 -1 18 2 -21 3 -3 -15 10 14 -17 13 3
5097 3 -10 3 8 -16 -14 1 2 2 4 -11 -11 13 6 8 12 -10 -7 6 5 8 17 1 -11 5 0 -8 15 14 -15 3 16 0 -3 7 -11 3 21 2 -1 13
5137 13 -4 -6 7 7 9 9 1 -17 0 -2 -2 5 -7 -11 18 6 -13 7 7 -9 8 -1 -14 -10 -3 -26 -5 2 2 -4 1 -12 -10 11 12 -12 3 0 -15 -3
5177 -3 5 0 6 13 -12 5 6 5 2 2 -1 16 30 0 8 10 -10 9 2 -13 0 11 3 -5 6 -3 -14 -5 -7 -18 6 15 -19 -7 3 0 4 10 9 7 10 2 -1 2
5221 2 0 -7 4 -13 -14 -7 -1 -7 1 2 4 15 6 -7 6 16 -11 4 11 3 7 12 -15 6 16 -3 0 7 -6 7 3 4 -6 8 2 -5 17 0 9 18 -5 -11
5263 -11 -6 3 3 1 -5 -23 -4 2 -9 -5 15 -5 -9 -7 -15 -6 3 -15 -15 14 -6 4 12 -5 -11 10 -1 -5 10 -7 -16 -13 9 9 14 6 -13 -13 9 -6 -1 17
5305 17 -7 -5 11 2 -6 8 10 9 8 10 6 15 9 -10 4 7 13 9 5 -36 -6 23 5 12 14 -20 -10 -3 -11 14 25 -9 -14 -5 -16 -11 15 -19 -25 5 4 -18
5347 -18 13 -10 -23 16 13 -14 3 0 -19 -2 16 -3 14 8 -19 -25 0 7 -6 6 -4 4 0 4 1 6 8 1 8 1 3 12 -12 -17 16 1 -6 23 1
5386 1 -25 12 14 -20 9 15 -4 -2 16 -5 -3 11 -9 -10 13 -8 -15 10 1 -15 13 10 -17 4 0 -12 2 12 -4 -3 18 -7 -15 14 -2 7 9
5423 9 -6 -14 11 2 3 8 7 8 1 2 5 18 -4 -8 9 -9 -11 16 -2 -24 11 -3 -9 3 9 -25 4 20 -14 3 12 -9 -19 17 -5 -9 5 -10
5461 -10 -29 2 9 -28 -1 -3 -22 0 15 -11 -7 9 1 0 9 1 -5 -2 -6 -6 -6 2 -11 -7 -10 12 13 9 6 -4 -13 9 20 -3 -3 23 -10 -16 11 8 -13
5502 -13 16 13 -18 18 29 5 -7 13 -15 14 19 -8 -13 13 -5 -20 10 11 -13 -11 -9 -23 8 8 -8 -16 4 -3 -6 -11 3 0 -1 -1 4 -2 -17 -4
5540 -4 8 -9 -6 7 -10 9 -8 -8 16 24 -5 -5 18 -6 6 32 14 -10 13 1 -19 17 20 -13 -2 13 -7 -2 9 -11 -15 4 -7 -14 8
5575 8 0 -25 6 6 -11 10 13 -13 -6 -6 -12 9 15 -9 -16 -1 3 2 8 -2 15 0 -6 8 1 1 11 -11 -25 4 5 -17 -2 10 -13 -1 19 -7
5613 -7 -22 17 0 -6 26 3 -2 4 12 -13 8 23 -4 -11 16 -9 6 22 -4 -4 16 4 -16 3 -4 -7 0 -11 -3 2 -4 -8 -10 -4 -15 -4 -8 -8 5
5652 5 -4 -14 0 -14 -20 16 0 -4 2 11 -5 10 4 -13 8 8 -20 -22 25 -4 -12 14 -13 -19 8 9 -24 4 7 -8 -4 6 -4 -5 33 -5 -10 13
5690 13 10 -7 4 0 -5 8 -2 -16 1 8 -8 -10 -8 -10 -9 3 -25 -13 3 -9 -4 -8 -7 4 -6 -10 2 4 -17 6 4 -26 -6 4 -22 -5 4 -8
5728 -8 -8 13 -7 -17 25 -2 -14 18 -8 -5 8 -4 -11 -5 18 -17 -15 4 -7 -3 12 -19 -8 13 0 -5 -2 -4 -1 -12 -4 -12 -13 -3 -9 -3 -10 -22 -3
5767 -3 -10 -13 -1 -11 -3 -9 -7 -4 -3 -4 -12 -7 -1 -11 -6 -5 -10 4 7 -10 -8 2 -2 1 14 -3 -4 11 1 -1 -9 5 -3 0 5 -22 -15 8 -9 -18 -2 -6 -3 4 -7
5812 -7 -3 6 6 -12 5 7 4 -10 -1 -10 3 0 -6 -7 3 -1 0 -3 -9 -13 -11 -13 0 -12 -1 -4 -10 -15 -12 3 -12 -2 -5 -4 1 11 5 1 -3 6 -11 7 3 -8 11
5857 11 3 -14 -11 5 2 -7 14 -1 -1 6 -11 -5 11 5 -1 -1 -6 -17 5 -5 -2 -9 1 -4 -1 -1 -1 -2 13 -4 -10 9 -12 -3 0 -3 5 -3 -20 -7 -2 -9 4
5900 4 6 -14 -14 -2 -24 -19 7 -3 -6 11 5 -5 12 10 -8 4 10 -2 -10 0 -11 -10 11 8 7 5 -3 -17 5 6 -1 18 12 -20 -4 -4 -14 -6 8 -20
5940 -20 -10 -7 -21 -15 -19 1 4 6 2 -10 -7 -14 -7 -4 -7 -1 3 -19 -16 -13 7 -5 -6 -3 -23 -16 -12 -11 -10 9 1 -21 -13 -20 -1 9 -8 -3 -5 -2 -4 -2 -14 -15 19
5985 19 15 3 9 0 0 13 10 -1 14 4 -6 -1 -11 -5 -4 -12 -22 -8 4 -14 -11 4 3 -8 -5 -15 -4 5 3 -3 -4 1 1 2 -10 -15 5 9 -6 3 -6 -10
6027 -10 7 -4 -4 5 6 -12 3 -2 -11 -2 -3 -3 -14 12 6 -1 0 0 -7 0 4 -3 8 6 7 13 9 -2 20 1 -1 3 12 -5 1 -3 -13 0 6 -20 -23 2 -9 -11
6071 -11 -4 -16 -16 1 8 -17 -1 -9 -7 -11 -10 -2 -9 0 -2 -7 2 -12 2 14 -3 2 5 5 -1 21 10 2 9 -10 6 13 -9 -6 10 10 1 -3 11 -19 24 14
6113 14 7 3 11 -6 0 7 -12 14 12 9 3 1 -5 1 3 4 -7 6 -10 -13 -1 -5 -16 -17 -6 -16 -1 -9 -17 -20 -11 -8 6 -11 -9 -12 0 4 1 4 -3 -14 -1 -16
6157 -16 -11 1 -1 -6 -6 -13 -13 9 -7 -13 3 6 -9 8 3 -9 0 1 -16 -1 17 3 -7 -5 -1 7 20 -6 4 6 6 1 11 -7 -13 9 2 1 2 6 -16
6198 -16 -1 -9 -15 -1 -4 -25 -11 -2 -6 5 14 2 -6 6 -4 17 16 0 -2 0 -6 -7 16 0 2 5 -5 -4 14 10 -1 -4 11 -1 8 5 -19 -5 -2 -7 14
6239 14 18 -3 -1 8 -7 -2 16 -13 -4 3 -4 -6 4 9 1 -3 -11 -6 1 -7 -16 -2 -9 -16 0 -5 -9 -4 -11 -16 -2 -7 -18 -13 -1 -20 -2 -13 -4 -6 1 -10 -9 18 -16
6284 -16 -7 3 -7 -2 11 0 0 2 1 -8 9 8 -7 -9 1 -13 -1 5 -22 -3 10 -3 -6 4 1 -14 -1 -4 1 3 5 5 1 -8 -9 2 -4 -8 -6 1 -1 2 -10
6327 -10 -12 -12 1 -17 -4 -1 -20 -2 -1 -15 -6 15 -6 1 -8 -9 -5 -5 9 -4 -4 12 -7 5 3 4 10 11 -1 -4 -2 -8 -4 1 0 7 -8 -7 -8 10 6 -11 -4
6370 -4 -9 -7 2 -10 -16 -15 -8 -4 -1 -14 -12 -6 -3 -7 0 7 -6 -18 -10 -13 0 -1 -11 -9 -10 -3 -12 -1 6 -13 -10 -13 -9 0 -3 -1 -16 -3 0 16 18 -11 -1 -3 -6 5 15
6417 15 -4 -12 -3 2 4 9 5 8 -5 -4 -5 12 9 -7 -5 -22 -6 -4 -8 -15 -18 -14 -17 -3 1 -9 -10 -16 -14 -3 4 2 -12 -26 -18 -1 1 -9 -23 -7 -9 -14 7 -8
6461 -8 6 -12 -11 -11 0 10 -4 1 -10 -14 5 10 7 -14 2 -14 -5 9 6 -16 -8 -11 -9 11 13 -9 -5 -13 -6 7 5 -5 -18 -18 -17 4 6 -5 -7 -10 -23
6502 -23 -8 4 3 -13 -15 -30 -10 4 20 -17 3 -15 -21 5 -9 1 -5 -2 -22 -8 8 -4 -7 -7 -15 -1 16 1 -3 -3 -9 2 -1 3 -9 1 -8
6539 -8 -17 18 5 -1 -7 -13 -7 5 20 -8 -7 6 -15 -4 -1 -10 -6 -1 -16 -9 0 -9 -9 -17 -6 -9 4 1 -6 -14 -19 -5 -1 -1 -27 -11 1 -19 -6 7 -14 -3
6581 -3 -14 -9 -10 13 1 -9 5 -6 1 24 -3 -6 -7 -4 0 -1 -2 -2 9 -8 -4 -3 -1 -4 3 -9 -3 5 8 3 4 -8 -6 -1 -1 -4 -2 -5 -6 -10 2 -8 2 -2 8
6626 8 -18 3 2 -1 2 0 -4 -8 -8 -13 -9 -6 -15 -23 -4 -4 -5 0 -3 -4 5 -4 -12 1 0 5 5 -11 -8 11 2 -6 -4 -15 -2 15 9 0 -2 -4 -5 -15 0 -1 7 1 -8 -15 16
6675 16 -2 -16 -6 -14 -11 5 0 -12 -3 -9 -11 5 9 1 -10 -7 -14 -10 1 -7 -13 -7 -13 -5 0 -7 -7 -6 -15 -12 11 -5 -6 -7 -7 -19 4 14 20 -4 -10 -12 1 11
6719 11 6 10 8 -17 14 10 10 10 5 -21 5 10 14 0 -9 -15 -21 7 1 -10 -15 -8 -16 5 1 0 -1 -11 -11 -5 8 -4 -7 -5 -21 -13 16 0 -9 -2 -21 -14 -2 3
6763 3 -5 -2 -14 -15 1 19 10 5 -22 -20 17 14 7 -3 -18 -19 2 7 -10 -4 -2 -6 -3 8 0 0 12 -10 0 15 12 1 2 -15 -10 24 7 -6 1 -17 -14
6804 -14 -8 12 8 -7 -4 -15 -11 8 15 6 -9 -26 -5 1 -7 5 2 -13 -7 -10 3 7 -1 -3 -14 -5 3 2 -6 -11 -21 -2 11 -1 21 -20 -29 -7 -15 -2 8
6845 8 5 -8 -9 9 -3 2 4 -8 -1 2 1 1 7 -7 -9 4 4 0 -2 -5 -11 -13 2 -2 6 0 -18 -5 -1 0 -7 -12 -8 -18 -13 -15 0 8 -3 -8 -3 -9 8 10 -8 -13 0
6892 0 -3 0 6 -10 -2 -16 2 -14 -2 0 -11 -7 -5 -14 -1 15 -2 -9 8 9 6 -1 6 1 3 -5 -8 5 15 5 2 -4 -10 -6 11 -2 -1 -10 -2 2 -2 -8 -9 -6 -17
6937 -17 -3 -12 -4 5 -10 -11 -5 4 -8 4 -2 -12 0 -2 -10 -21 -2 -5 -14 2 -4 -7 -1 9 -12 -8 -1 -14 -5 8 -5 -12 -10 -7 -9 -4 2 -7 6 -1 6 -1 -7 -16 -2
6982 -2 9 -12 -5 -4 -6 3 8 6 7 -2 -7 -9 -24 -15 2 1 -14 -15 -16 -7 -18 -18 -19 -16 0 -5 -13 0 -3 -15 -7 -5 -14 15 2 -10 -3 15 1 12 0 -12 -10 1
7026 1 -4 -3 -2 -1 -2 -4 -5 -12 27 -6 -10 -12 -8 -1 22 -4 -16 -4 -6 -2 8 0 -11 -23 -15 3 -3 4 -29 -21 -11 -4 13 5 -12 -12 -16 -12 -16 -1 -14 -14 -14 -10 -5
7071 -5 -3 -6 -13 -12 -5 -24 0 8 -9 -3 -7 2 9 20 -11 -19 5 -1 -7 16 11 -6 -2 -12 -12 -1 12 -3 -2 -5 6 -2 3 -4 -1 7 1 10 12 -1 3 -2 -13 4 9
7116 9 -1 -11 -15 -13 4 -5 1 -13 -17 -14 -8 7 3 -11 -10 -28 -9 -1 -4 -17 -28 -10 -9 -7 7 -9 -20 -11 0 -9 2 15 -13 4 -1 7 15 6 -1 -4 -5 -10
7158 -10 1 -3 0 -16 -6 -4 3 -4 -2 -3 -6 -10 1 -7 -8 -9 -9 -17 -7 3 8 -17 -20 -9 -2 -2 -5 -8 -2 -2 -1 -2 0 -17 -11 -10 -11 -7 -4 -15 -7 -10 2 -5 -12 -2 -3 8
7206 8 3 -6 -1 -3 -6 0 -4 0 15 5 -5 11 -1 -9 4 5 4 0 6 6 -5 3 5 7 -6 -6 -4 -6 -9 -6 -3 -6 -10 -7 -9 -23 8 -8 -4 -1 8 6 6 5 -8 1 5 -3 -5
7255 -5 13 6 -18 -6 -11 -6 5 11 -12 -10 2 -1 0 12 -8 -8 0 7 0 -7 3 -5 -5 3 7 22 11 -1 -1 6 8 2 -3 0 2 8 7 18 9 -5 -4 2 -3 -8 -2 -4 -6
7302 -6 -7 -4 5 4 -2 -7 -4 -6 -5 -2 4 -13 -6 4 -13 2 -10 -18 0 8 -4 8 15 -22 -4 6 14 2 2 -3 5 1 -2 6 -3 1 0 -1 3 1 3 -4 2 6 6 12 10 4 -1
7351 -1 -3 -5 -10 5 1 -13 -6 -13 -17 6 5 -11 -7 -2 -9 -2 5 -18 -16 7 -8 -11 -13 -14 -19 -14 2 3 2 2 -9 -4 8 5 6 -1 -5 7 10 -2 6 -9 -12 -2 5 -5
7397 -5 -4 6 -7 -9 -8 2 6 7 5 1 6 12 2 4 -7 0 6 4 8 -9 -2 3 -1 2 -5 -2 1 -9 -5 4 -3 -4 -6 -15 -23 8 -10 -8 -7 -8 -5 -5 16 3 -10 -5 -5 0 12
7446 12 -1 2 -5 -5 2 2 -2 1 -12 -1 13 11 -1 0 5 16 1 17 2 -6 0 -3 -9 12 9 -9 2 -1 -8 -6 17 0 9 5 1 6 2 -2 -2 2 -1 -1 -1 -5 -12 -15
7492 -15 0 -7 -3 -1 -2 -6 -13 -3 11 4 -21 -13 -5 -11 1 5 7 -4 -9 -11 10 10 -4 -14 11 -1 11 9 9 -4 10 -1 10 3 17 -9 -1 6 8 5 10 2
7534 2 -2 2 -4 7 -4 -4 -9 -13 4 1 -5 -8 -6 -8 0 6 -2 -1 0 -12 -2 1 -3 -16 -4 4 -17 -10 9 -14 -5 -18 4 -13 -2 6 1 0 -15 -1 7 4 -4 3 -3
7579 -3 1 -3 -9 10 3 13 2 11 14 8 4 1 -5 0 -1 0 -12 -13 3 10 -5 4 0 -19 -14 -10 5 4 -8 0 0 -6 10 -10 -8 -1 2 -11 -5 -1 -14 -4 6 1 3 9
7625 9 6 -13 4 -9 -10 12 0 -16 -17 -13 -2 -5 2 0 1 -10 -1 0 0 4 -4 7 9 11 9 4 2 3 1 -2 -3 7 -7 10 -16 -2 0 -2 -15 2 -11 -14 -3
7668 -3 -3 -10 -2 -3 -16 -17 -3 -11 -10 15 -3 -16 -5 -10 -10 1 -7 -4 -9 7 -2 -6 10 -12 -14 4 -2 -7 -5 -4 -2 -1 -7 -4 5 -11 -4 11 11 1 0 -13 1 5 -1
7713 -1 4 0 -5 -7 -4 -14 -7 6 9 -10 13 8 -2 11 -1 -23 -5 5 -10 -19 -11 -19 -10 -11 -13 -18 -15 -8 -12 -14 -18 -4 -19 -11 -16 -5 -4 -14 0 -4 -16 -9 -12 -6
7757 -6 1 1 -6 5 -10 2 -1 -5 5 -5 -3 7 -13 -7 1 -8 6 -7 -6 -6 -2 -5 -3 4 3 -3 -6 8 -1 -9 -10 -2 -4 -13 -6 -2 -2 -6 -1 -9 -14 -4 -10 -15 -13 -12 -5 -17 1
7806 1 -11 -19 1 -2 -9 -1 -1 -13 1 2 -6 -12 -9 -12 -7 -4 2 -7 9 -2 1 -23 9 20 2 -6 -16 -10 -12 2 -9 -22 -6 -7 -5 0 0 -11 -6 4 -6 -3 5
7849 5 -4 -11 -7 -10 -13 9 -13 -20 -11 -3 -19 -17 -11 -16 -25 -20 -14 -23 -11 -16 -16 -6 -12 -14 -2 -16 -18 -7 -28 -2 -14 -11 -11 0 1 -2 8 0 7 -7 -5 -7 10 -3 -13
7894 -13 -13 2 -7 -9 -1 -11 -10 -3 3 3 5 2 -2 0 -10 13 -4 5 -13 -11 -2 -5 9 2 -19 -8 -11 -12 -16 -2 0 -14 -3 -11 -12 -6 -6 -17 -13 2 -3 -4 -4 -12 -7 -6
7940 -6 -3 -4 -1 -9 -6 14 -3 3 3 0 -9 7 1 10 2 -14 -8 12 -7 -10 3 -2 -8 1 -5 0 -2 3 -8 -10 0 -8 1 -1 6 -4 -3 1 -11 -15 -14 1 7 1 -9 -2 5 -12
7988 -12 -6 0 -14 -7 -16 -10 4 -4 -9 -8 2 -6 -2 3 4 -9 2 -7 1 12 7 7 6 -5 -4 19 11 -1 4 -5 -4 11 -4 -5 2 -2 -9 11 -10 -12 -6 -8 -23 -4 0
8033 0 -15 -3 -9 -12 0 -6 -12 -14 -1 -1 -7 0 -15 -15 -10 -2 -8 -4 -7 -8 -14 -7 -8 -12 -10 0 -14 -11 -20 -14 -8 -11 -4 -5 3 0 5 7 -4 2 -12 -7 10 6 -16 3 -2 12
8081 12 10 11 7 0 0 -7 2 5 -2 -9 -3 3 -1 3 -2 -10 -7 -3 -1 -4 5 -11 -1 -7 -11 -4 4 -12 5 -12 -9 -6 -10 5 0 0 0 -5 -5 -5 -11 5 -8 -10 -6 -1 -6 13 -10 -8
8131 -8 14 10 3 -12 -3 -6 17 -3 4 -7 9 16 5 7 -10 -3 3 0 -11 -2 13 -9 -2 -16 -4 -3 -8 -13 -20 -10 -12 -12 -8 -7 -1 1 -14 -11 -8 -14 1 -12 -21 -2
8175 -2 -6 -18 -6 -9 -10 -1 -4 -12 -10 4 1 -7 5 -1 4 -7
8191g
##END NTUPLES=NMR FID
##END=
