##TITLE=1H_LY-2Dix.5.R.t
 CD3CN,8 sc, 
 3.03.2021
##JCAMPDX= 6.0         $$ Bruker NMR JCAMP-DX V2.0
##DATA TYPE= NMR FID
##DATA CLASS= NTUPLES
##ORIGIN= UXNMR, Bruker Analytische Messtechnik GmbH
##OWNER= root
$$ XWIN-NMR		Version 3.5
$$ Wed Mar  3 10:55:23 2021 Russian Standard Time (UT+4h)  she@DPX200
##.OBSERVE FREQUENCY= 200.1315066352
##.OBSERVE NUCLEUS= ^1H
##.DELAY= (6, 6)
##.ACQUISITION MODE= SIMULTANEOUS
##.ACQUISITION SCHEME= undefined
##.AVERAGES= 8
##.DIGITISER RES= 18
##SPECTROMETER/DATA SYSTEM= spect
##.PULSE SEQUENCE= zg30
##.SOLVENT NAME= CD3CN
##.SHIFT REFERENCE= (INTERNAL, CD3CN, 0, 15.7039)
##AUDIT TRAIL= $$ (NUMBER, WHEN, WHO, WHERE, WHAT)
$$ ##TITLE= Audit trail, XWIN-NMR		Version 3.5
$$ ##JCAMPDX= 5.01
$$ ##ORIGIN= Bruker BioSpin GmbH
$$ ##OWNER= she
$$ F:/spectra/data/she/nmr/H-F/1/audita.txt
$$ ##AUDIT TRAIL=  $$ (NUMBER, WHEN, WHO, WHERE, WHAT)
(   1,<2021-03-03 10:54:17.34 +0400>,<she>,<DPX200>,
      <created by zg, POWCHK disabled, PULCHK disabled
       configuration hash MD5:
       00 E9 B6 7A A2 85 ED C7 34 08 36 98 17 FE 4E 26
       data hash MD5: 16K
       69 4D 04 AF A5 0C 81 D3 50 35 5C CF 9B 2E 5A E9>)
$$ ##END=
$$ 
$$ hash MD5
$$ 15 F2 2C 02 E0 F9 71 9A A7 72 9E 40 32 DD D7 D1
##$RELAX= 
##$RELAX= 
##$RELAX= 
##$RELAX= 
##$RELAX= 
##$RELAX= 
$$ Bruker specific parameters
$$ --------------------------
##$DU= <F:/spectra>
##$EXPNO= 1
##$NAME= <H-F>
##$PROCNO= 1
##$TYPE= <nmr>
##$USER= <she>
##$AMP= (0..31)
100 100 100 100 100 100 100 100 100 100 100 100 100 100 100 100 100 100 
100 100 100 100 100 100 100 100 100 100 100 100 100 100 
##$AQSEQ= 0
##$AQ_mod= 1
##$AUNM= <au_zg>
##$AUTOPOS= <>
##$BF1= 200.13
##$BF2= 200.13
##$BF3= 200.13
##$BF4= 200.13
##$BF5= 200.13
##$BF6= 200.13
##$BF7= 200.13
##$BF8= 200.13
##$BYTORDA= 1
##$CFDGTYP= 0
##$CFRGTYP= 5
##$CHEMSTR= <none>
##$CNST= (0..31)
1 1 145 1 1 1 1 1 1 1 1 1 1 1 1 1 1 1 1 1 1 1 1 1 1 1 1 1 1 1 1 1 
##$CPDPRG= <>
##$CPDPRG1= <>
##$CPDPRG2= <>
##$CPDPRG3= <>
##$CPDPRG4= <mlev>
##$CPDPRG5= <mlev>
##$CPDPRG6= <mlev>
##$CPDPRG7= <mlev>
##$CPDPRG8= <mlev>
##$CPDPRGB= <>
##$CPDPRGT= <>
##$D= (0..31)
0 1.2 0 0 0 0 0 0 0 0.06 0 0.03 0 0 0 0 0.0002 0 0 0 0 0 0 0 0 0 0 0 0 
0 0 0 
##$DATE= 1614754456
##$DBL= (0..7)
120 120 120 120 120 120 120 120 
##$DBP= (0..7)
150 150 150 150 150 150 150 150 
##$DBP07= 0
##$DBPNAM0= <>
##$DBPNAM1= <>
##$DBPNAM2= <>
##$DBPNAM3= <>
##$DBPNAM4= <>
##$DBPNAM5= <>
##$DBPNAM6= <>
##$DBPNAM7= <>
##$DBPOAL= (0..7)
0.5 0.5 0.5 0.5 0.5 0.5 0.5 0.5 
##$DBPOFFS= (0..7)
0 0 0 0 0 0 0 0 
##$DE= 6
##$DECBNUC= <off>
##$DECIM= 32
##$DECNUC= <off>
##$DECSTAT= 4
##$DIGMOD= 1
##$DIGTYP= 9
##$DL= (0..7)
0 120 120 120 120 120 120 120 
##$DP= (0..7)
150 150 150 150 150 150 150 150 
##$DP07= 0
##$DPNAME0= <>
##$DPNAME1= <>
##$DPNAME2= <>
##$DPNAME3= <>
##$DPNAME4= <>
##$DPNAME5= <>
##$DPNAME6= <>
##$DPNAME7= <>
##$DPOAL= (0..7)
0.5 0.5 0.5 0.5 0.5 0.5 0.5 0.5 
##$DPOFFS= (0..7)
0 0 0 0 0 0 0 0 
##$DQDMODE= 0
##$DR= 18
##$DS= 0
##$DSLIST= <SSSSSSSSSSSSSSS>
$$ [...]
##$SUBNAM2= <"">
##$SUBNAM3= <"">
##$SUBNAM4= <"">
##$SUBNAM5= <"">
##$SUBNAM6= <"">
##$SUBNAM7= <"">
##$SUBNAM8= <"">
##$SUBNAM9= <"">
##$SW= 16.9725356469052
##$SWIBOX= (0..15)
0 0 2 0 0 0 0 0 0 0 0 0 0 0 0 0 
##$SW_h= 3396.73913043478
##$TD= 16384
##$TD0= 1
##$TE= 0
##$TE2= 300
##$TE3= 300
##$TEG= 300
##$TL= (0..7)
0 120 120 120 120 120 120 120 
##$TP= (0..7)
150 150 150 150 150 150 150 150 
##$TP07= 0
##$TPNAME0= <>
##$TPNAME1= <>
##$TPNAME2= <>
##$TPNAME3= <>
##$TPNAME4= <>
##$TPNAME5= <>
##$TPNAME6= <>
##$TPNAME7= <>
##$TPOAL= (0..7)
0.5 0.5 0.5 0.5 0.5 0.5 0.5 0.5 
##$TPOFFS= (0..7)
0 0 0 0 0 0 0 0 
##$TUNHIN= 0
##$TUNHOUT= 0
##$TUNXOUT= 0
##$USERA1= <user>
##$USERA2= <user>
##$USERA3= <user>
##$USERA4= <user>
##$USERA5= <user>
##$V9= 5
##$VALIST= <valist>
##$VCLIST= <CCCCCCCCCCCCCCC>
##$VD= 0
##$VDLIST= <DDDDDDDDDDDDDDD>
##$VPLIST= <PPPPPPPPPPPPPPP>
##$VTLIST= <TTTTTTTTTTTTTTT>
##$WBST= 1024
##$WBSW= 4
##$XGAIN= (0..3)
0 0 0 0 
##$XL= 0
##$YL= 0
##$YMAX_a= 776880
##$YMIN_a= -719714
##$ZGOPTNS= <>
##$ZL1= 120
##$ZL2= 120
##$ZL3= 120
##$ZL4= 120
##$ABSF1= 10
##$ABSF2= 0
##$ABSG= 5
##$ABSL= 3
##$ALPHA= 0
##$AQORDER= 0
##$ASSFAC= 0
##$ASSFACI= 0
##$ASSFACX= 0
##$ASSWID= 0
##$AUNMP= <proc_1d>
##$AZFE= 0.1
##$AZFW= 0.1
##$BCFW= 1
##$BC_mod= 2
##$BYTORDP= 1
##$COROFFS= 0
##$CY= 11.3945322036743
##$DATMOD= 1
##$DC= 2
##$DFILT= <>
##$DTYPP= 0
##$F1P= 15.9154993809931
##$F2P= -4.1035820241983
##$FCOR= 0.5
##$FTSIZE= 0
##$FT_mod= 4
##$GAMMA= 1
##$GB= 0.15
##$INTBC= 1
##$INTSCL= 1
##$ISEN= 128
##$LB= 0.24
##$LEV0= 0
##$LPBIN= 0
##$MAXI= 10000
##$MC2= 0
##$MEAN= 0
##$ME_mod= 0
##$MI= 1.114404
##$NCOEF= 0
##$NC_proc= 0
##$NLEV= 6
##$NOISF1= 3.799351
##$NOISF2= 2.8
##$NSP= 1
##$NTH_PI= 0
##$NZP= 0
##$OFFSET= 15.70392
##$PC= 1
##$PHC0= -10765.23
##$PHC1= 14.00094
##$PH_mod= 1
##$PKNL= yes
##$PPARMOD= 0
##$PSCAL= 0
##$PSIGN= 0
##$REVERSE= no
##$SF= 200.130013532006
##$SI= 16384
##$SIGF1= 3
##$SIGF2= 2
##$SINO= 400
##$SIOLD= 16384
##$SREGLST= <1H.CDCl3>
##$SSB= 0
##$STSI= 0
##$STSR= 0
##$SW_p= 3612.71676300578
##$SYMM= 0
##$S_DEV= 0
##$TDeff= 0
##$TDoff= 0
##$TI= <>
##$TILT= no
##$TM1= 0
##$TM2= 0
##$TOPLEV= 0
##$USERP1= <user>
##$USERP2= <user>
##$USERP3= <user>
##$USERP4= <user>
##$USERP5= <user>
##$WDW= 1
##$XDIM= 8192
##$YMAX_p= 0
##$YMIN_p= 0
$$ End of Bruker specific parameters
$$ ---------------------------------
##NTUPLES= NMR FID
##VAR_NAME=  TIME,          FID/REAL,        FID/IMAG
##SYMBOL=    X,             R,               I
##VAR_TYPE=  INDEPENDENT,   DEPENDENT,       DEPENDENT
##VAR_FORM=  AFFN,          ASDF,            ASDF
##VAR_DIM=   8192,          8192,            8192
##UNITS=     SECONDS,       ARBITRARY UNITS, ARBITRARY UNITS
##FACTOR=    0.0002944,     1,               1
##FIRST=     0,             0,               0
##LAST=      2.4114304,     0,               0
##MIN=       0,             -719714,         0
##MAX=       2.4114304,     776880,          0
$$ Real data points
##PAGE= N=1
##DATA TABLE= (X++(R..R)), XYDATA
$$ [...]
2465i87l917M092N647k324o182L02N722K285m431l762K000N024M82n276k768M299
2481B06M647k925n846J071N813R43n019k685K948L779o25m619j838M262L746l408
2497D50m762J676N254O9m752j723L755K785j549l875r9L806K575l069m081K184
2513a356M690m84m425j006L686K152j849l192J35L552J209k489l335K023L851
2528C162r45m300m29L636J206k512k450R27K741O48k557k153K053K951j143l528
2544b693J41L341J117k686j658J542K170j41j552j226J447K465q98k998M87L136
2560A994K86k547q78J839J322p33j568k25J182J059p55j933K55K342p8k460n62
2577a460J667L26p97p07M0M31M63l41j077L14J156j53r91k91J272M38j008O8Q21
$$ y = [-987, -4904, -812, 4835, 2511, -3671, -3369, 2353, 4638, 207, -3555, -1555, 3469, 3951, -1325, -4093, 206, 4853, 1928, -3918, -2847, 2966, 3909, -1110, -3795, -847, 2932, 2307, -2312, -4150, 112, 3858, 450, -4312, -2636, 2618, 2687, -2065, -3788, -33, 2752, 1203, -2672, -2771, 1035, 3610, 541, -3540, -1356, 3334, 2850, -1575, -2581, 1105, 3257, 1408, -1784, -1649, 1903, 3112, 623, -2712, -689, 3162, 2217, -2083, -2512, 1124, 2330, -182, -2632, -1705, 1036, 1684, -873, -3026, -973, 1978, 835, -2693, -2552, 789, 1906, -780, -2438, -896, 1274, 1133, -419, -1645, -198, 2267, 1369, -1629, -1142, 1994, 2280, -267, -1145, 694, 2016, 1283, -285, -510, 672, 1731, 976, -957, -702, 1640, 1562, -898, -1460, 207, 533, -264, -971, -931, -500, -37, -378, -1455, -1141, 15, -138, -1129, -1420, -148, 290, -718, -650, 171]
2596A71l80n6P48j68l72M40M51n18P7M11n32J94N57K90j107l81J080P13j427p35
2616e44J021N17o78p40k11L14R34j52j933k15K309K15k236r38J753J255p93j711
2634a833K24J607J079j197j707L30K879O22l329p67L021J751j865k367J073K500
2650B021M70j967k027J672K930q74l307p68L345J907l137l044K131L209p84l051
2666a274j524K213K974j168m425j37M691J237l995k841K888L773j035m243n67
2681c433L952K138k067l451M25M667J463m800k455L904L800k338m037M44L968
2696B180J956l323l797K285M331r0m826k051M040L786l310m807J415M796L75l947
2712i87l111K578M502p59n765j102N513K736l949m620K208N362K22n462j573L729
$$ y = [171, -209, -265, 483, 315, -57, 383, 834, 316, 393, 804, 272, 466, 1023, 1313, 206, -175, 905, 1618, 191, -544, 477, 994, 316, -424, -635, -321, 613, 461, -1472, -1687, 622, 837, -1399, -2337, -584, 671, -122, -1833, -1609, -2, 1077, -120, -1827, -1497, 1382, 2004, -1325, -2092, 929, 2680, 815, -1552, -479, 2021, 2491, 524, -1503, 169, 3099, 2225, -1082, -1850, 1495, 3402, 265, -2779, -648, 2561, 1777, -1274, -2798, -585, 2389, 1221, -3204, -3341, 1350, 2587, -1408, -4249, -1361, 2412, 1377, -2866, -3433, 519, 2657, 590, -2861, -2436, 2231, 3694, -1106, -3561, 343, 4143, 1805, -2232, -1788, 2180, 4136, 813, -2984, -699, 3632, 3542, -1284, -3335, 705, 4491, 1181, -3626, -2211, 2585, 2960, -987, -4098, -1520, 2982, 2223, -3542, -4644, 869, 3605, -344, -4964, -2756, 2606, 2828, -2634, -4207, -478]
2728d78L992j779m765k53N464K739n119m027L923M640j050n298r05M585L248l380
2744A537m763J361N105J117n094l439L620N184k452n841L85N070J537l817l877
2759d367J847N153K08n477k463M900L998l025n076J027N522J093m799k503L060
2774i02M064n16m694j472M784L480l819m421K507M532j29m131k236L538L446k117
2790A914l885l08M129J919l488l844K221M722j068m840m89L454J848j930l332
2805b977K17M003J224l771k562K668L505r47m049j86L821J468k683k134R96K978
2821A571P87k593k157K401L310j800l391P64K993O23k117j757J131K468l59k281
2837d07r08J606J666q44l161M37L052n6k461p34J222J314O0k283o60J764J505
$$ y = [-478, 3514, 1735, -3030, -3283, 2181, 4920, -199, -4226, -303, 4337, 3287, -2011, -2916, 1669, 4917, 1537, -3226, -1865, 3240, 4357, -737, -4176, -556, 4628, 2176, -3665, -3280, 1790, 3327, -490, -4367, -2520, 2633, 2841, -2636, -5099, -199, 3799, 774, -4302, -3275, 2247, 3340, -1459, -3962, -902, 3162, 2646, -2048, -3520, 1264, 4744, 925, -3496, -989, 3543, 3414, -717, -2953, 585, 4031, 1914, -1971, -2279, 1850, 3769, 281, -3563, -1342, 3380, 2312, -2528, -3017, 437, 2285, 355, -2977, -2760, 1243, 2467, -1304, -3866, -1198, 2307, 1360, -2689, -2875, 946, 2414, -269, -2403, -1407, 1571, 2358, -235, -2392, 9, 3319, 1519, -1872, -1108, 1885, 2508, 391, -1366, -235, 2233, 1874, -407, -1315, 291, 1957, 1113, -2048, -1611, 1441, 1385, -1076, -1810, -588, 726, 786, -1497, -2157, -393, 1112]
2854A112j289j966O94K053K51j798p91J756J117j165n68P0P56J185n33j896J028
2871A6J583m19j368r7J022K67j54j007K96O57L2m58n30j70R07J92j186k89J024
2890C18j72p06M19k41j77J11K37l26r3K51l0J86m7l17L63j43M66M05q39m06J429
2911F88J61j169j4Q02L88k51m70m32O49Q90n31j361L00J368L17j606r59J656J116
2930A542j081j541K77J107P76j179j465M70K489k81k592m43K111J335j588k047
2946b110Q36K479K76k264j270J653K281n07l094n25L426J530k661k339J704K704
2962B119l93k479j416K777K232j741l074M50L152J004l228k246K310L270j468
2977A269l325k39L010K010k064l583J066L922L63m024j527L194K798j696l985
$$ y = [1112, -177, -2143, -1449, 604, 855, -943, -1734, 22, 1139, -26, -594, -524, 232, 1417, 884, -1012, 16, 1599, 1180, -188, -285, 737, 1004, 850, -157, 139, 796, 828, 370, -160, -330, 577, 769, -417, -706, 318, 146, -560, -141, -382, -559, -448, -211, -537, -630, -379, -409, -223, -270, -587, -224, -367, 99, 504, -335, -741, 688, 849, -320, -334, 468, 856, 605, 135, -297, 352, 1242, 711, -650, -350, 1018, 1335, -271, -1230, 426, 1542, 461, -1080, -803, 304, 1080, -99, -1564, -1094, 1395, 1114, -1478, -1921, 190, 1525, -63, -2110, -1274, 1205, 1481, -783, -2053, -400, 1881, 1374, -1720, -2245, 1181, 2711, 50, -2289, -585, 2119, 1726, -753, -2169, 608, 2840, 1099, -1975, -1525, 1627, 2631, -597, -2843, -533, 2737, 1269, -2056, -2295, 715, 2725, 661, -2922, -1856, 2066, 2429, -1595, -3122, 72, 2870, 1174, -2811]
2992b811M76L867J308l333k375J650L613J35m188j630L953L028k984l649J119
3007a821L880R98l674k388K242L775j029m300m87M054K289l282l688J850M305
3022B724l36l943j306K788L254j671m265j03M756J652m082k963K572M200r52m484
3038b159j032M040K635k702l799Q05M390J269m562k648L501L795k048m136j07
3053b758M332J753l272l372J818M138J07m228k093L818L424k613m056O96M559
3068B253R25l984k327K456L426n34m121q96M072K145k872l885J830M013L5m101
3084a565j425L036K843j733l516j72L739J651l333k993K593L542p77l876o51L179
3100E42J983k231k887P67L392P22l113j858K410K898j390l158L49K768J140k382
$$ y = [-2811, -2335, 1532, 2840, -493, -2868, -1218, 2395, 2530, -1658, -3288, 665, 3693, 709, -2940, -1821, 2059, 3057, -617, -3005, -763, 3012, 1983, -2317, -2804, 1250, 3539, 257, -3431, -1581, 2724, 2388, -1555, -2861, -73, 3181, 1510, -2755, -2858, 1898, 3550, -532, -3495, -923, 3277, 2325, -2159, -3191, 849, 3484, 782, -3017, -2212, 2178, 3447, -1115, -3763, -262, 3533, 1485, -2651, -2758, 1574, 3327, 55, -3317, -1499, 2639, 2746, -1482, -3575, 243, 3667, 1054, -3002, -2306, 2253, 3178, -806, -3133, -677, 2749, 2215, -1906, -2802, 1270, 3415, 543, -3342, -1512, 2501, 2536, -1565, -2990, 46, 2889, 1156, -2360, -2532, 1207, 2858, -475, -3468, -875, 2667, 1890, -1986, -2637, 542, 2525, 294, -2593, -1826, 1566, 2288, -825, -2683, -273, 2625, 1235, -1923, -1574, 1194, 2334, -48]
3116d8j738J004K674O8k711j228K276K187j568k431J30K639O07k333j451J545
3132c78J679k48k050o52J774J435j475k043P15K187N5j862o98J308J246n72j459
3149a038k67J579R39r50j455P68J564j8j502l53J026O83l48q63j77R30P17q37
3167C98r91L82J046k6j187j24Q56J74m24n16L6L77J85k79p48L10M93J17n89k24
3187g34N78J15l72p6K14j16J65J98o5k65M27J73j46k0N9K4Q9J20M9l85J62O50
3209H44k12o08j35O46K77n11k62l84M65P07p19r18O4J118n2j111o61J238J004
3228G90r75j103J67J057P49j113j205J006J609j72j891m35K003J092j521j191
3244a133N66K070n3j546j131J508J738o50k337p1K415Q14k066j858J460K120l86
$$ y = [-48, -1786, -782, 1892, 1960, -751, -1979, 297, 2484, 916, -1515, -1385, 1254, 1861, -472, -1923, -378, 1301, 1053, -997, -1649, 125, 1560, 85, -1958, -1243, 944, 999, -863, -1561, -253, 993, 421, -1038, -1305, 274, 1213, 263, -1192, -424, 1140, 1122, -380, -733, 293, 976, 628, -235, -412, 518, 1235, 398, -593, -211, 835, 809, -378, -502, 354, 528, 104, -412, -376, 1, 186, -93, -841, -531, -38, 79, -510, -734, -156, -41, -413, -489, -275, -391, -226, -28, -93, -358, 69, 242, 96, 76, 135, 159, 248, 368, 417, 32, 194, 844, 632, 24, -111, 535, 812, 301, 39, -345, 120, 827, 108, -810, -746, 372, 320, -791, -1452, -214, 790, -185, -1288, -1121, -64, 685, -428, -1633, -627, 982, 810, -1081, -1516, 487, 1579, 58, -1133, -567, 1503, 1450, -96, -1227, 281, 2019, 1369, -968, -1039, 1376, 2190, 124, -1734, -274, 1846, 1460]
3261A460k450o99J923J933j690k870O67L023N61l061j428J917K455j159k977K79
3277b116K429J646k214k349J105L177J81l080j316K960K192j589k881M47L060
3292A652J112k705k017J668L056m85l589n25L030J852k382l043J309L331kl181
3308i19j647K299K508j166l587l5L431J378k882k600J823L113m67l182q96K833
3324DK341j914k994N19L538R99k983k247K565L110j162l386k89L204J730k204
3340H31k908J108L398K01l399j616K729K676j812l562P47L150Q85k882k281J822
3356i13K930l48l542q72L044K053k502k783J164L195M84l155j658K376K540q86
3372A127l063l58L361J660k667k290J655K896k40k834r51K442K125j562k667J24
$$ y = [1460, -990, -1689, 234, 2167, 477, -2393, -1726, 1297, 1858, -1203, -2631, -714, 1741, 582, -2395, -2116, 313, 1959, -255, -2604, -1499, 1678, 1859, -1221, -2537, 423, 2615, 1026, -1855, -1408, 1652, 2764, 59, -1958, -290, 2766, 2281, -1308, -1833, 1197, 3049, 667, -2376, -1067, 2264, 2262, -919, -2566, -267, 2241, 1075, -2512, -2547, 884, 2262, -620, -3220, -1397, 1716, 1249, -1933, -2829, 4, 2345, 431, -2563, -2044, 1494, 2493, -490, -2737, -172, 2938, 1776, -1610, -1899, 1305, 3035, 831, -2077, -969, 2429, 2630, -769, -2385, 344, 3020, 1208, -2354, -1607, 1543, 2428, -454, -2735, -913, 2017, 1669, -1873, -2745, 299, 2352, -150, -2933, -1769, 1426, 1910, -1245, -2903, -527, 2013, 1127, -1936, -2294, 1067, 2727, 60, -2230, -575, 2321, 2081, -753, -1704, 738, 2863, 1301, -1366, -1242]
3388a242L046Q52k791j881J754K670j168k658n59K716J159j888k163P45K558L47
3404A497k706j344K208J795j204k596P37K253N84j720j390J238K085m13j948m79
3420a403J828J513j429j792P92K044J8j808l78R78J184o20j336l67J529R58j482
3437B29j298P86J424j91j537n28J003P22o09q09k08J188L62j125p72P26J016k98
3455H1p76k34R32J67k54o00M52N21L07n16n19O18M95j80p39J71P63j37j72o5k42
3476G3K28R1j18k22M3K48l8m37j5M2J87l00J70j00m69K96K64k37j79O0J57K15
3498d1l88L0j9K40L11l31l56L29O22j66m75l3O74L19l65m30p6P32J60m23m60L89
3520B43M84q1j069M3J041L34q11p62J76Q86K22j118n89Q39Q59m78j167P5J257
$$ y = [-1242, 1804, 2656, -135, -2016, -262, 2408, 1240, -1418, -1977, 739, 1898, 10, -2153, -1408, 1150, 1497, -1209, -2553, -345, 1450, 246, -2350, -1613, 640, 1224, -496, -1886, -648, 1437, 1024, -924, -1403, 425, 1938, 509, -1283, -491, 1553, 1571, -237, -615, 363, 1547, 927, -409, -776, 753, 1711, 229, -1069, -283, 1141, 950, -587, -1115, -112, 610, 1, -808, -1016, 172, 534, -591, -1363, -637, 379, 81, -695, -929, 3, 170, -84, -684, -232, 289, 596, 80, -439, 179, 674, 494, -245, -74, 689, 552, 380, 315, 73, 301, 392, 274, 52, 95, 343, 305, -132, -147, -105, 82, -218, -48, -148, -617, -321, -57, -294, -473, -413, -256, -41, -429, -399, -418, -178, 133, -198, -554, -225, 397, 231, -244, -277, 397, 716, 351, -79, -155, 577, 737, 314, -146, 243, 727, 646, -423, -380, 661, 995, 184, -578, -402, 484, 706, -412, -1001, -162, 697, 219, -948, -873, 384]
3539C84M87j135j060Q54J234k94j212m77J002J191n02j558M2J969L57j570r63
3556a251J014J691o20j553j92J474J066r18k100Q15J925O7j933q77J562J495j065
3573F00k024L62J789P13j625j592R35K175j44k548o53K266J317j477j841O21K036
3590I10N65j982j482J628K238q38k473oK254J139j790k002J252K337j72k424q70
3607a716K013J618j122k163L2K441Q12k399j471J733K314r01k523l63K098J414
3623A817j642k085Q11K410K80k471j257K091J813r78k581L45K506O73j974j822
3639b064J257K542j59k513r01K374J484j686k062P16K395L15k228j213J458J976
3655A691m34k467k28K115J331j926j998J064K119J38k222r54J736J829j111k091
$$ y = [384, 871, -264, -1324, -470, 764, 470, -742, -1219, -217, 974, 472, -1086, -1044, 925, 1282, -288, -1251, -237, 1454, 834, -719, -911, 563, 1629, 711, -1389, -574, 1351, 1418, -515, -1392, 170, 1665, 600, -1424, -1062, 727, 1440, -185, -1777, -842, 1333, 1189, -1359, -2012, 254, 1571, 94, -1747, -1126, 910, 1475, -507, -1989, -361, 1877, 1039, -1434, -1440, 814, 1953, 163, -1839, -587, 1750, 1578, -846, -1716, 297, 1915, 793, -1370, -1338, 1103, 1915, -484, -1955, -222, 2092, 1191, -1332, -1695, 403, 1817, 175, -1910, -1099, 1311, 1591, -880, -2137, -46, 1767, 789, -1792, -1447, 1059, 1732, -242, -2064, -807, 1735, 1576, -937, -1838, 536, 2020, 334, -1728, -1012, 1383, 1698, -530, -1743, -285, 1691, 1257, -1210, -1438, 677, 2008, 82, -1916, -852, 1267, 1405, -817, -1771, -35, 1794, 683, -1408]
3671a408j64K302Q35j945j386J295J934l48k146n34K075J239j460j839O22J946
3687A018N50j909j495J707J762r73j794KJ878O00j332j364P67J747J80j998r00
3704a554J651J400j064j812N05J902J10j408r36R63J417l69j582k40J628N79j285
3721i5j040O73J546n26j259n7P66Q92m91j225R5J408K93j192r43J021P20j37q65
3740d16j84P26O00p24o53L31P80J21r36m11Q70M96k64q15J77M49K61l81k76J77
3760g2L69J63m59k30M77N0L4n40j8M70K1k91j54J23R4N3m8k91J29K37j05k21L8
3783a71K36p7%q6K1k37L04J19j93j07j21L06J05j52o0m4L34J74j22m46K58L82
3805D23j20l59j19N47J56m15n04M08N08q8n28l05N13L87k30p30j53Q96K73r04
$$ y = [-1408, -1572, 730, 1565, -380, -1766, -471, 1463, 1115, -1031, -1565, 510, 1749, 289, -1550, -928, 1018, 1568, -341, -1836, -129, 1633, 660, -1134, -1132, 746, 1346, 14, -1350, -583, 1164, 1344, -654, -1554, 97, 1497, 433, -1379, -874, 1028, 1138, -270, -1206, -243, 1174, 805, -777, -1017, 611, 1190, -95, -1135, -462, 1084, 558, -701, -758, 8, 900, 409, -816, -721, 687, 980, -212, -1155, -134, 586, 449, -416, -600, 126, 726, 2, -651, -320, 460, 581, -355, -766, 104, 600, 336, -479, -302, 147, 408, 27, -249, -72, 297, 460, 1, -229, 248, 298, 332, -208, -226, 244, 265, -26, -180, -57, 37, 90, 42, -249, -120, 117, 12, -209, -171, 65, -12, -12, -98, -77, -314, -10, 109, -84, -191, -312, -6, 99, -53, -113, -157, 177, 351, 229, -217, 41, 423, 303, -56, -175, 372, 528, 113, -391, 17, 525, 437, -91, -396, 117, 504, 274, -456, -609, 287, 560, -344]
3825c44l12L60O34J7q86k35P39M64l53j036L96J063N0q73m80N92J044l57q60j81
3845e58R54P15q16r18M65J221q4j212m46R11Q64m28j264j50J130P03j162j135
3863a210O76J483l53j223m55R93J078r32j226L15J479K31j358q52R27J510m25
3880F58j714l3J544P14j164j192O48J587K55j867n91J282J320p66j637J79J755
3897I78M54j446j129J220J343n87j654j04J151J141j166j495M40J775K3j651p50
3914a457J355J321r63j544j11J728O87j276j214P11J661Lj636n58J507J184r79
3931D19j555O05J464K71j378r68J172J363l40j697j61J563P20j245j236N20J732
3948A249j12j851p96J690J063q50j699J07J748M84j341j309J153J450l61j818
$$ y = [-344, -656, -296, 338, 355, -531, -766, -27, 437, 84, -952, -556, 507, 557, -316, -796, -204, 840, 483, -377, -558, 396, 1111, 295, -623, -158, 1063, 979, -233, -679, 232, 1096, 668, -596, -746, 384, 1087, -75, -1210, -534, 949, 596, -627, -1082, -89, 989, 57, -1169, -854, 625, 856, -502, -1354, -427, 1083, 658, -1056, -1089, 455, 1169, 5, -1187, -539, 1048, 1303, -564, -1155, 127, 1447, 681, -956, -777, 978, 1432, -14, -1143, 77, 1420, 833, -821, -925, 226, 1367, 201, -1294, -854, 921, 944, -707, -1457, -102, 1219, 256, -1288, -1399, 329, 1016, -260, -1474, -763, 898, 901, -735, -1293, 214, 1398, 419, -1136, -531, 933, 1204, -174, -1142, 30, 1393, 1053, -644, -805, 758, 1478, 233, -1003, -483, 1249, 1137, -714, -1510, 180, 1243, 393, -1306, -1199, 549, 1033, -308, -1617, -464, 986, 625, -1193]
3964a193m3J287R37q01j778Q44J541L24j580p65J226J462o32j709QJ605P93j272
3982B54j120M42J656k20j285o22J085R85p75j420L53J306L04j322q16Q37J173
3999H15k31j383k11J034Q57j157j023P90J142Q2j323m49P14Q63m11j067L12J138
4017D92L34r12p62N71J149k01r08j92Q94L23o39m58J85R47m5j018l04Q39L05k31
4037C69r28J89P26K35q12n08N36N47l20l99j19K75N44o20l39K08O02k36l73J88
4057b35J5L97Mn04K78K69J32k44k49L1M77l3m34L06j45J45N7j38j01J29l3r1j3
4080B0Q5j83j8J34J67m20j29J95J84j98j80n8L79O2l41l2n8K60K66m29k06M74
4102b6P6p7k23N5L77J61j59m19K44M71j85l29K0L53N44n61n12K22M45k4l83l56
$$ y = [-1193, -1236, 51, 988, 187, -1591, -747, 794, 1118, -462, -1227, -1, 1461, 829, -880, -872, 733, 1526, 254, -866, -424, 1232, 1012, -273, -895, 190, 1175, 400, -1020, -667, 639, 943, -379, -1195, -358, 815, 584, -799, -1010, 24, 881, -276, -1299, -509, 633, 715, -608, -1057, -343, 520, 109, -958, -646, 492, 826, -86, -848, -277, 872, 671, -237, -429, 465, 788, 149, -309, -124, 823, 778, -240, -544, 295, 600, 369, -559, -370, 356, 591, -221, -729, -193, 354, 34, -365, -484, -209, 335, -285, -624, -416, 186, -50, -423, -235, -220, 177, 181, -323, -45, 224, 356, 112, -137, -106, 371, 338, -96, 210, 65, 210, 267, 129, 28, 157, 124, 33, 20, 105, -78, -96, 38, 205, -215, -344, -149, 35, -163, -343, -401, -22, 40, -301, -333, -391, -131, 135, -294, -500, -26, 50, -27, -250, -195, 182, 343, 184, -235, 9, 480, 295, -34, -14, 339, 883, 322, -190, 32, 477, 453, 70, -286]
4124b86L37M37j49q06J60P30mo88j85L7P30j17o06k07N50M14k97m86j64O65M19
4145D84o76o17N19R11m15o92l4P21P20p75q13M09Q90l2p66n30Q33R20n10j075
4165e28P7J053K90q65o34K62J043L3j364k78R40Q27q14j034L68J097K09j045o85
4184a048R64R40o23j121K59O82R06q21j222N95J252Kj156m70R68R88n38j445L71
4203e17J117L68j123q17O62J411k18j636K2J096O68p62j211M10J118L33j278p20
4221a077Q47J304n65j476o3J441N19j072j012P70J187j01j254p25J407J037j055
4238A12r92J85J091N11j121q08Q98J344p06j279n1J137Q69q60j213K63J494J89
4256A063j690k28Q77Q62m98j064j00J275L17r34q19O79J076l37j297j05J052O40
$$ y = [-286, 51, 488, 339, -467, -307, 423, 419, -269, -454, -417, 313, 196, -410, -617, -67, 347, 50, -436, -600, 65, 484, -192, -809, -290, 621, 206, -486, -520, 201, 921, 146, -667, -258, 632, 600, -166, -696, 137, 1057, 547, -528, -451, 602, 892, 27, -607, -345, 698, 731, -633, -911, 29, 856, 42, -992, -624, 473, 682, -363, -1048, -84, 856, 233, -888, -629, 53, 959, 138, -1084, -489, 763, 765, -391, -861, 107, 1095, 557, -888, -517, 600, 968, -155, -972, -310, 1101, 883, -753, -731, 365, 1033, 271, -940, -530, 588, 921, -357, -1077, -230, 1074, 509, -967, -1030, 411, 930, -142, -1154, -384, 803, 702, -552, -1277, 130, 1167, 112, -880, -695, 396, 907, -214, -1022, -124, 1220, 514, -765, -816, 321, 1190, 330, -883, -620, 874, 1063, -627, -855, 22, 884, 386, -678, -778, 497, 814, -120, -939, -260, 816, 479, -818, -923, 129, 769]
4274G69o66j082M02Q86N19j213n94Q77J168n31j185M6Q66P59j056o94L79R85N8
4293F93r92n04J116N78p00q22%J268J19j054m39O74R14l21j167p1Q65M67o78o76
4313g30N54N93L4o57o11Q30O11n66o48n8R96L34n84q20O93O36j42p68l71R65J58
4334D49m95l88L13N78j43o03k40O02L17k51m91j23N89J56m64k30K35M18P5p21
4354d17l2P10K7m28k6J54Q0O3k11j92K94K93m17J5qL37k1l21o6M00k50r7M7Lm7
4379a10J23p0J18jp8k37M26o0k31j20M15k2m9J17l78Q6M05K3n33P8J89J78o2n46
4403c39K76L24P1m81r3K33K13q3k16j93L51L06l72l34J22N12j61m71m4N44O3j33
4425I5o61L33L97K42n75m36O49N76l97p81J64O95K72o11p05N27Q02j08r04p1O33
$$ y = [769, 103, -979, -577, 309, 828, -385, -979, -102, 1066, 535, -650, -604, 262, 1021, -35, -729, -350, 635, 693, -299, -803, 313, 891, 191, -631, -631, 637, 756, -298, -737, -63, 851, 530, -637, -708, 157, 624, -54, -730, -176, 417, 451, -206, -817, 13, 624, 58, -590, -648, 348, 682, 98, -722, -29, 607, 465, -303, -674, 291, 449, -46, -434, -121, 457, 314, -289, -529, 73, 390, 139, -352, -475, 114, 270, -194, -424, -189, 229, 304, -417, -449, 261, 288, -140, -166, -12, 68, 131, -80, -272, 22, 315, -102, -87, -95, 242, 221, -100, -166, 234, -16, -113, -66, -63, -110, 13, -57, 61, 60, -18, -255, 171, 111, -120, -240, 175, 153, 104, 221, -157, -71, 334, 357, -176, -98, 91, 269, 207, -339, -63, 261, 332, -149, -242, -9, 204, 121, -95, -288, 63, 369, -3, -337, -215, 297, 136, -335, -379, 165, 228, 95, -566, -233, 164, 406, -169, -605, 44, 620, 223, -558, -394, 301, 573, -38, -743, -216, 586, 478, -426, -497, 136]
4446A36O91p06r07M35O71L05p14m41L62O79r0q11k25P99M30m98p86N07O63%r37
4467d37m38P35Q26m02r94K39Q14K76p31p95M34J054j2r94k32Q48O91p62r71M98
4487c53R01L49j056n44N68J212m52j066j64Q18Q53j024p74K59J217j46r25n57
4505h84Q70J057p34j072j3J015N31r84q92R05R59l50r55l52Q91J163j072j176
4523a093M16J490k66q40p01J171P15k77j076l52J417M91j027r35M64J366l6j417
4541d90l10J029Q41o65j258L66J053M25j068p36M72J169k78j401k57J307N32r03
4559a72p88K39J226J23j168l09Q30Q84n39j030J32J008K91n92p74K35J223k00
4577F19r17j87P79N27n54q56K49J039J66q60p53Q83N65j18j210j27Q84P18o37
$$ y = [136, 827, 121, -786, -351, 320, 625, -89, -530, -168, 511, 421, -390, -615, 184, 614, 116, -670, -163, 500, 500, -437, -875, -140, 686, 284, -710, -471, 343, 619, -112, -907, -473, 581, 569, -425, -657, 191, 882, 120, -851, -353, 548, 897, -159, -703, -135, 1077, 625, -441, -605, 213, 1066, 42, -732, -473, 744, 598, -327, -884, -14, 1043, 309, -763, -776, 239, 770, -214, -1106, -201, 758, 408, -547, -899, -8, 1155, 83, -1093, -677, 813, 547, -293, -994, 177, 892, 615, -461, -813, 604, 1095, 68, -867, -403, 963, 927, -490, -800, 229, 1070, 405, -853, -487, 566, 991, -77, -813, -341, 828, 550, -851, -1108, 199, 731, -172, -960, -721, 505, 628, -540, -849, -19, 865, 326, -704, -572, 436, 727, 135, -639, -404, 819, 619, -298, -485, 294, 821, 267, -589, -340, 699, 865, 5, -748, 135, 700, 582, -628, -755, 129, 847, 210]
4596B10r02L35Q28K13r32n45O11O97m29p78p5J066K22q55m75N64O82K0q53k37
4616f33R14M68m49n80O8O29L12o85o14P78M08k69m97j34O55K35m57o91L19O39
4636D16j91n36l47N69O72o36m91O2P94l42l08k03L57L87k64j32o0K85K38l21k67
4657c18J24M87j44r9r8J38J43j50o6J08J22n0p0j25J80rn1j38J26k2R0p5j37J09
4681G5j06j16J63L4j63M1n3j1L2j29j68K72K86l12k50J54K98K36j74l56O8M12
4703B33n0l47J23L33J05k02m68J97N77j46l98p2L19L39k50m83Q9N40Q4l08o68
4724d53K15P37l05o49j88M81O29l80p50J28Q24O4q24j33L84N37p7p03k21P84N24
4745F24n36q16L88P40K86p95l51N28P05m10o84j25R06M54o88q32N89Q21j86r45
$$ y = [210, -692, -357, 471, 684, -248, -793, -182, 515, 86, -692, -767, 299, 521, -334, -809, -245, 437, 457, -396, -633, 281, 749, 300, -280, -212, 417, 729, 44, -570, 208, 616, 347, -150, -284, 371, 606, 149, -542, -223, 416, 225, -311, -658, -89, 583, -53, -544, -482, 312, -30, -338, -541, -184, 203, -61, -193, -253, 32, 270, -51, -318, -194, 293, 149, 50, -48, 90, 233, 83, 17, 125, 247, 197, 127, 2, 182, 173, 122, -16, 110, 88, 178, 103, -34, 75, -31, -147, 16, 50, -113, -72, -125, -136, -104, -233, -401, -129, 157, -155, -405, -251, 47, 283, 109, -247, -179, 233, 183, -164, -41, 292, 397, 195, -273, -76, 501, 355, -43, -115, 204, 543, 293, -190, -101, 439, 523, 215, -453, -238, 499, 194, -455, -643, -162, 467, 87, -663, -535, 289, 353, -471, -604, -220, 317, 240, -463, -684, 100, 624, 88, -728, -340, 400, 686, -109, -460, 68, 773, 363, -321, -446, 460, 914, 226, -606, -17, 804, 618, -327]
4765c27l50R04L31m57o84J09Q19J65r29m37O11P23r5j161q6R35O06q06o51L26
4785d54R68Q4j105l50Q72Q68m99r79J03R32L73p44q30P76Q12j87q68l39R26O08
4805I67p69p09K48Q28J41r43p67R13R07k94j172j84J049O29o72j074N67J068j27
4824F06j022o88R34P89n05r49J76J032M22j064n99O20J201n70p65k55J026O66
4842A055p64q52K84R71M2r07m18P27P21j41j329J82R45K52q60p61P65P77k43r87
4862e41m57R85P71p27r02J88J145J77q61n63N40R23k67q98m14J080L92m06n81
4881d16K90P83M4p93n03P42O66l99o66j48P32M00r51n36M59J129m64o32j60N53
4901A30O33p18n54J46O62kn15l60M73N33k12o69J11M97O7j55n50K1Q02m5o30k41
$$ y = [-327, -677, 227, 558, 101, -583, -474, 345, 510, -419, -856, -245, 478, 383, -778, -864, 71, 677, -129, -780, -454, 514, 598, -507, -857, 15, 883, 384, -595, -492, 440, 813, 69, -761, 15, 827, 640, -228, -567, 359, 967, 198, -511, -263, 565, 706, -237, -1004, -91, 816, 522, -650, -834, 215, 844, 172, -902, -335, 733, 606, -416, -1104, -170, 619, 114, -835, -659, 373, 795, -269, -868, -248, 953, 383, -382, -637, 389, 1055, 291, -561, -277, 694, 736, -171, -589, 138, 859, 718, -611, -429, 516, 768, -92, -853, -88, 689, 446, -541, -998, -13, 758, 31, -871, -683, 462, 639, -222, -785, -245, 678, 411, -487, -901, 179, 571, 165, -416, -126, 657, 701, -92, -595, 147, 813, 414, -252, -400, 332, 732, -219, -755, -296, 833, 369, -263, -423, 130, 763, 45, -509, -363, 299, 297, -218, -578, -105, 428, 216, -453, -342, 155, 222, 67, -483, -462, 340, 295, -335, -576]
4923e76M74N07k52k96j09N71R6l18k93N5M92K4m21l28N38L66n54k66K99K86J73
4944D68m52j59L04J01k47r7l3K85O0l20k28J49L30o7l12L9R9K61j18k86L95l8
4966A34l3k79O7J58P2N3l61J19J8J13MQ9j10k2P3L5J8n8j33J86N0q1K1k81J68
4991B0m1j5k18j00L36J04j27k61J40L49j35j81n7J76L35j21m84l5M28P6j53m66
5013d30K84O25k02m66P9M55j1k25n63K48O03J46r70mO33L66m89n94K62M75L19
5034E41n87n25N94M15r0p68P8O16K30l12n85K01O87N6q97l5M68M46k73o85o2Q22
5056C35L95j025m30M93O60k3j008J3Q60M54n16r80J31J054J02p97l94O26P55l36
5076C69j020R6P95N40q15o69K39J171k22r51k37O47Q78o50p33l5R81L36p07p32
$$ y = [-576, -102, 405, 153, -143, -252, 319, 415, 97, -196, -141, 351, 375, -46, -374, 164, 530, -24, -290, 9, 295, 468, 16, -143, 161, 262, 15, -82, -115, 170, 230, -90, -318, -169, 161, 94, -218, -179, -80, 181, 63, -223, 172, 134, 101, -178, -111, 47, 119, 172, -189, -70, -52, 61, 65, 154, 44, 22, 95, 130, 148, 90, -43, 143, 193, 112, 133, -148, 20, -21, -36, -254, -354, -18, 86, -41, -302, -162, 187, 52, -129, -186, -10, 325, 204, -280, -315, 113, 189, 36, -430, -146, 479, 277, -189, -110, 345, 334, 109, -454, -206, 397, 543, -427, -431, 202, 568, 79, -515, -253, 222, 541, -46, -571, 23, 438, 348, -420, -342, 274, 504, 192, -393, -192, 495, 551, -346, -381, 87, 533, 260, -425, -487, 335, 730, -295, -725, -232, 428, 405, -603, -590, 270, 724, 208, -772, -641, 413, 515, -282, -676, -50, 705, 369, -651, -555, 240, 780, -35, -704, -465, 706, 484, -467, -704, -57, 821, 171, -562, -597, 384, 720, 13, -719]
5096g19O66P43l15q14j45P61Q00r11r57L37J159j57q97l93O98R37m64j129K28
5115e72Q43M27q74q99O17J164k93r23l69R73P98m26j124J97R80L75q95p41P02
5134d0R87n68r55J03Q79O45q89r10M33Q98J47j041n98J068P68m81j283K21J070
5153D54M65j092p27N64R73k90p80k96O97O90n78q13J28R78L71p73o61L85R86k18
5173D63q60r1O71O99p53o27J69J117p2r77l86P22O89m14r79O1Q09N03q16n18K28
5194c62R67j76j055j49Q95L16l92o47K94O44j44l37m91M13O68r6p32j20P18L90
5214F04n20m40J85Q18j85o27k59N51M13l52m73K54L95N7m18l55K14M37m2m77q7
5235c07K58L84j72n34O2L67K13m53k70K59M13k94l64J97J61J86l88j87L25K74
$$ y = [-719, -53, 690, 375, -439, -584, 177, 977, 66, -891, -554, 605, 448, -449, -842, -144, 793, 329, -800, -572, 271, 698, -176, -1075, -458, 706, 413, -510, -879, 94, 892, 466, -658, -461, 519, 894, -1, -742, -40, 947, 379, -576, -473, 406, 1051, 162, -748, -315, 583, 730, -311, -909, 159, 927, 446, -837, -616, 454, 919, -173, -900, -336, 637, 347, -433, -729, -32, 658, 80, -733, -605, 373, 744, -29, -690, -305, 681, 463, -397, -488, 183, 882, 129, -498, -329, 788, 716, -261, -647, 75, 764, 350, -629, -568, 241, 744, -72, -590, -362, 605, 429, -626, -775, 120, 436, 44, -603, -309, 335, 191, -146, -637, -224, 444, 348, -384, -504, 214, 604, 84, -356, -171, 647, 462, -165, -424, 127, 540, 188, -285, -31, 364, 421, 3, -352, -138, 299, 257, -220, -307, -49, 335, 163, -371, -309, 58, 271, -182, -452, -193, 220, -74, -438, -241, -80, 106, -282, -469, -144, 130]
5255A30J25m10jL46K1j51j94K16J45J82l37q5L6J19j3Rj38K49j15k34K16J5m8
5278H3k28J72J89r8j00J3j50N9J24l48M0Q7J05j59n6K81J22k44o9n6M19K8l22
5301a08m5Q8M24j05l99J13K25K14m81j07K23M66j1p59J04N21L8l13m00J02M84
5322B74J22n82j08L91L62k67p52L56M62j13l50k65K01P33j46q44j74Q26L54m29
5342E1p20M42N57J20q58k50P99M11l55p12L02N66L54o31o92M27R57k16r99j06
5362e53P66P44p65o18qR70Q1r77k94N91P47m81q99K0Q95K65n91n95M21P50j18
5383C51q67l22R48O17o40q67L81Q94K15q10n88O28R30j21j095k75R69P09r20q15
5403f78M57P71L00j006o60P92P97l54q02k96J022L77q06o93K91J150k93r89j66
$$ y = [130, 255, -155, -156, 190, 211, 60, -134, 82, 227, 409, 72, -13, 23, 142, 129, 138, 0, 249, 134, -100, 116, 131, 83, -145, 27, 216, 118, 18, 31, -119, -60, 64, -284, -244, -157, -52, -211, -267, 14, 136, -108, -177, -233, 186, 214, -108, -153, -65, 359, 254, -145, -32, 193, 407, -74, -181, 42, 508, 497, -262, -158, 363, 401, 88, -312, -210, 274, 396, -186, -294, 97, 459, 192, -560, -204, 258, 145, -205, -470, -269, 464, 318, -526, -700, 126, 480, 51, -669, -227, 330, 450, -408, -658, 141, 552, 197, -515, -213, 353, 707, 76, -616, -189, 768, 552, -447, -553, 213, 957, 192, -426, -434, 536, 617, -360, -654, -63, 684, 203, -696, -676, 219, 484, -107, -702, -281, 469, 351, -516, -838, 110, 727, 87, -780, -399, 495, 710, -100, -688, -60, 870, 749, -346, -621, 348, 1057, 137, -678, -221, 550, 850, -156, -816, -24, 773, 419, -383, -679, 343, 720, -86, -779, -488, 662, 369, -620, -786]
5422g86P92N35m71r10L01J002J89q93q82P59J014j09j235j6J072N71q80p66M52
5441b61J082k6q67n23R51L76k58j036K3J094L98q91p96O16R67j62j254j02O79
5460A0O73n25q06Q0R29L41j093m15M21R20k32j119L4J016L01p17n94P08N83Q5
5480F00q51k47N23O44l85o82J96N13L97o10p06O68N00q1p28k91O96M16m57n30
5500d15K90N24J48p42k92M37M43o9o23k30P86R5n06k32J22L75J86n99j37M37J80
5521A78N2n78m9N05L17m96k65K06N46j15k06j87M23P7j53n04J96M03k22j96J08
5542D0p1L09n8k20j23J27Q3p4k02J28K27j9l26k12L48Q1O1j30Q8l8O6j2j87O9
5566d5O5J0j10M9j02J10Q6k04K2M1K69lP3k60J34r9K49l25J59j37MK9J7p5j12
$$ y = [-786, 6, 541, 70, -840, -539, 463, 652, -241, -1123, -364, 650, 541, -694, -710, 362, 933, 53, -713, -261, 821, 795, -72, -595, 356, 732, 474, -562, -539, 555, 953, 62, -734, -118, 849, 687, -567, -669, 10, 683, 158, -648, -568, 361, 702, -391, -806, -385, 535, 303, -816, -782, 234, 535, -182, -776, -68, 515, 600, -251, -498, 25, 669, 284, -398, -202, 311, 708, 98, -608, 60, 560, 479, -249, -540, 156, 572, 115, -415, -125, 399, 547, -195, -487, -50, 393, 324, -299, -529, 257, 352, -154, -386, -264, 111, 297, -302, -439, -2, 178, 230, -348, -397, 108, 425, -71, -336, -130, 416, 301, 95, -92, 331, 408, 255, -249, -53, 350, 128, -68, 40, -31, 278, 220, 0, -123, 4, 87, 13, -189, -61, 166, 147, -179, -391, -43, 38, 99, -31, 57, 19, 85, 73, -114, -45, 20, 30, -80, -31, -133, -23, 63, -141, -119, -78, 191, 188, 261, 1, 135, 36, 285, -40, 119, -18, -14, 15, 32, -43, -155]
5591a55J55K60j37l21K05Q6J09l18p1K91j1j91l48L4N61l9r3k86J28N37k07m80
5613b91N2M27O4j65m71J84M11L34p65n5M42K63l55k52j5M71J22p21j96N71M11
5634D66k13m48l25N12O62o28o50L07P37J31p83l35M84O76n46o36p2J050Q7o40
5654a64m74L12R16l83n43j48P63J56k32q34K08R53R6q31l69M60O47j81p90k92
5674g30J053M41p93o94N06P53rq44m82R46N37m78p57P5Q75L06q56n16M35Q82k08
5695D42q13k00P49O05m48r60K68R03J3r13l48O85O82l07r17L2P35M62o11q74N71
5716b44P70R1q45o82J018P92q14p40J18J013K41j063l81N48R90l47q63k07P19
5735A14P15o70p76K63P97K17r25n63R01N91k45r59o4R09M97r02o55M34Q13r5p52
$$ y = [-155, 0, 260, 123, -198, 7, 93, 202, -116, -187, 104, 93, -98, -446, -412, 149, 110, 17, -269, -141, 396, 189, -291, -239, 188, 252, 87, -384, -200, 211, 545, -220, -275, 167, 430, 75, -177, -192, 279, 401, -320, -516, 55, 466, 253, -195, -520, -8, 654, 26, -624, -317, 420, 551, -232, -567, -83, 593, 47, -589, -661, 389, 476, -164, -638, -326, 590, 207, -336, -484, 279, 435, 203, -631, -423, 530, 626, -205, -574, -114, 533, 352, -438, -730, 323, 764, -29, -723, -217, 536, 527, -317, -799, 147, 684, 206, -551, -476, 399, 705, -151, -667, -232, 650, 442, -371, -571, 178, 783, 335, -625, -357, 546, 559, -354, -702, -17, 665, 358, -559, -527, 208, 670, 59, -815, -244, 526, 617, -228, -910, 108, 900, 86, -654, -536, 477, 718, -345, -726, -178, 812, 465, -398, -605, 114, 829, 159, -617, -354, 443, 660, -265, -828, 73, 664, 419, -540, -604, 305, 802, -100, -755, -321, 492, 397, -355]
5756c55l33P81O01l30q96J33P66J30n38o01M76Q11k38p38l90P51N77n29o79L53
5776b48P76K07q30m77N37Q07l83r74K15N21L46n74n53O22K88J25m99k91O26K49
5796D90k86o61Q8O79J18m57k68K02M67k85l54r5K18L77o2p05M48K80J17l33l28
5817c50K05M85j48m33R8N45l6j31m25J09M63j0m87j16L29L78l18k08r0K16J01
5838A77P4m74K19J56k27m2j56J74K59k33j44J9J32Q8Q0n12K73k0K84k58lK04j66
5861i6J69J46l15J22J38j19J69Ol03M32l71J23j08N7O6J6nQk05K25r1j03j46K17
5885C2J18l8k06j37K61j38M5q9k8L52l56J77j24QK81j46j60j32L28J83j93j61
5907a23O8K50M6k35j79L14K74k32l67KN55P5m74j29J70N89k16n96Q0M47m2l10
$$ y = [-355, -688, 93, 694, 364, -532, -399, 367, 497, -41, -642, -166, 645, 407, -331, -721, 30, 607, 78, -601, -248, 528, 735, -95, -572, -35, 772, 389, -585, -370, 151, 497, -77, -630, -8, 280, 405, -94, -385, 241, 490, 204, -457, -369, 310, 428, -29, -297, -95, 372, 87, -267, -362, -144, 233, 171, -534, -86, 194, 311, -22, -350, -145, 340, 192, -241, -143, 402, 366, 235, -190, -81, 382, 372, -115, -231, 98, 476, 158, -50, -140, 76, 177, 251, -223, -4, 152, -75, -117, -273, -99, 160, -73, -217, -198, -66, 22, 102, -410, -137, -157, 127, -131, -134, 70, -96, 73, 219, -96, 26, 164, 45, 214, 220, -83, 349, -22, 101, -7, 50, 116, 132, 127, 135, -70, 155, 64, -39, -185, 32, 150, 112, -94, -231, 30, -108, -63, -152, -180, 172, -184, -7, -131, -123, 158, 12, -148, -280, 48, 231, 38, -123, -55, 195, 241, 6, -173, 141, 415, 183, -184, -182, 373, 448, -26, -155, 15, 604, 388, -208, -128, 319, 277, -33]
5929c3n88O01K81p1o53l0M66M18k86p63M68L60J51m69k18P4P39j72n68j79O65
5950A93L22m43m89L35M67J16r59J8M86N73k51o36K9P80K4m67n24J79O41j29p17
5971d52j55P13L46m27o22J66R13np02l84L92P09l87m82j83P48P5k62p56N41O93
5992D79l6o44m90P33N34k70p31M2O01N11q10l47L10P27k2r62N1M86L83n84m68
6013e07K68P82M9o71o08P53M52l10q17m4Q66J97o03m10L13O10p1p20k58P56M95
6034E22m48n79J34P80K44o64l19K89L70Q4p96R2M14K54j05n60R3P27J14o83m12
6055d49M43N32j84p17K43N87%n10l79J61M74o4m98j89M31N43m77k25j35O01Q2
6076B70m36l38M64L61j99l15j73O99K08m00o00N7Q84k78k57j76L79L05k53m06
$$ y = [-33, -621, -20, 261, 190, -463, -493, -27, 391, 105, -658, -190, 170, 321, -148, -366, -292, 447, 275, -293, -472, 193, 515, 72, -417, -82, 385, 501, -458, -440, 46, 619, 368, -268, -239, 541, 565, 98, -426, -247, 394, 265, -452, -607, 106, 452, 25, -597, -431, 482, 477, -225, -609, -217, 492, 105, -377, -560, 188, 263, 1, -755, -214, 479, 443, -201, -691, 42, 576, 306, -425, -383, 218, 729, -81, -428, -118, 609, 587, -375, -324, 162, 545, -39, -507, -239, 543, 592, -79, -687, 66, 518, 208, -609, -653, 213, 410, -193, -603, -290, 320, 249, -471, -729, 27, 522, 74, -505, -371, 409, 653, -11, -330, -41, 329, 413, -383, -291, 123, 377, 272, -288, -195, 532, 646, -37, -449, -6, 526, 342, -375, -132, 455, 455, -55, -434, -273, 201, 137, -361, -550, -119, 424, -53, -278, -413, 188, 270, -166, -504, -40, 321, 122, -193, -366, 333, 541, 141, -459, -402, 482, 204, -53, -229, 150, 455, 202, -204]
6096b04R2L75L53o68k41M03J15o8j45l77L54L44l50l21J33L48k9j57m35L96J31
6117D9J96n02QK93M5k08j96P7K30N2r2n0kM15l63%k0J53J64j08k32N0L57j52k33
6142f9j45K73J8o4k09O0K45K01j93j7k18Q1No9N2K0n6Q0q1m2J96r2N3R4j16j51
6168a44L7Q1O1j80k6L22p4j43J19l1p0K23k31N0J47R5q6j78k6M11l62k4j08Q6
6192e1K18n8j32j48J53p2j9j0O2J93j5k62l53K93K48j0k97m9J30L10pk92J24K86
6216B42p6k24k19L33K69l96J6j8Q4K90k65k74O8O50k06o38J91J26M92m38k30j34
6238c57M61K14k75l78J13M56J42n89%K38L08k48n08R3N76O3n34o6l4P03k91k81
6260a94r0L96M81n39l85L39L28j71k87k42M64K87k4q03J82P66m6n10l50L23O82
$$ y = [-204, -112, 263, 616, -52, -293, 110, 225, 157, 12, -365, -11, 333, -17, -338, -205, 143, 114, -43, -478, -82, 49, 245, -257, -249, 44, 89, -119, -315, -238, -8, 44, -48, -98, -100, 315, -48, -48, -68, 85, 249, 141, -91, -41, 316, 164, -69, -214, 59, 77, 13, -196, -136, 109, 310, 117, 100, -118, -37, -32, -101, -49, -29, -85, -5, -86, -128, 68, -24, 29, 123, 7, -144, -107, -26, 35, -145, -171, 151, 77, -66, 53, 22, -48, 175, -56, -6, 141, 236, 150, -28, -54, 357, -5, -29, -137, -51, 167, 109, -23, -171, -18, -90, -109, -119, -57, 136, 121, -141, -494, -201, 47, 37, -260, -309, -179, 131, 124, -168, -44, 242, 166, -58, -277, 56, 325, -71, -55, -73, 11, 301, 36, -238, -170, 480, 274, -364, -173, -47, 445, 7, -223, -357, 104, 318, 43, -335, -222, 234, 376, -213, -213, 25, 333, 85, -423, -330, 246, 309, -225, -291, -325, 378, 87, -194, -284, 112, 593, 54, -331, 8, 336, 165, -122, -364, 100, 387, 363, -440, -258, 508, 462, -48, -398, -75, 607]
6281F07l01n31j44O64J84n74m76K50P21j60n12n9L90L85j90n55k35P12J45k52
6301F9o15K84P05j0o61r6P01J18k45m87r2O73Nm07k50J95N36J01r74O0N77P6r8
6324A65n90K29M84K77q30j74O65L50m60m06M1N03K79o64k79J73Q19l41n75J48
6344a86L25L64m54m02J89M98R9o96l7J62N65k89m60j22N49K48k97m47N4P34l14
6365H3j51j33J68L66j12n78K42L17J63k00m12L1M48pk86l42M01L44p6l57N5J57
6387A21J29k22l40L87L40k38k81j01L23J10k34j46l2L32j6k03k62L76K50l29j25
6408a61m0K74j64m9M4J42J15J90o74J36J69J75j55l38M38P7O7k53k04K58K87l84
6430e0l6L2J42o7L31k96Q0k07J98j73m9J55L0N5j56j05Q7j51J38j38J83om5n0
$$ y = [607, 306, -225, -369, 295, 479, -95, -571, -321, 400, 240, -272, -331, 59, 444, 254, -301, -536, 176, 321, 69, -546, -262, 443, 433, -228, -324, 377, 495, 250, -237, -329, 344, 349, -58, -308, -113, 423, 524, -450, -390, 187, 263, 165, -425, -196, 288, 565, -265, -439, 226, 576, 116, -290, -249, 254, 533, -131, -410, -237, 582, 241, -334, -186, 139, 503, 49, -353, -164, 334, 433, -263, -300, -138, 427, 138, -322, -444, 105, 353, 56, -391, -337, 397, 83, -68, -201, -33, 333, 221, -357, -115, 202, 365, 165, -247, -216, 232, 225, -61, -403, -2, 342, 266, -91, -36, 121, 250, 28, -312, 75, 415, 177, -104, -205, 118, 228, -6, -152, -184, 148, 132, -71, -333, 43, 293, -36, -161, -201, 73, -91, -140, -96, 46, 161, 351, -323, -187, -18, 157, 2, -336, 102, 179, 246, -7, -211, 47, 334, -50, -86, -54, 88, 21, 352, 56, 136, -71, 127, -46, -95, 60, 90, 145, -11, -116, -29, -180, -42, -180, 3, -3, -48, -98]
6454i8P0J09o7o7j02n7K05o5J52M3o4Q5k56J15R9m0p6Q6l28K59q7R5m9M4n0m5
6480h9O9J52j85J02q3N2K8n4p9N6J25O9k47jk3J94m7k15K23l0K20m14j4J34L55
6505B98j46j09k39K51J08j63n1O0Q4L36l28k65K01K62j84l11K26J40K0K2l92O1
6527a19K57k3k00k82M39o5K22j95l75M51M1l53r5oN19j22n12R4L16K67j46k78
6549a65J82J26J24l35l25L81N43j02o34J34Q2L97k99k74J97L81p1m03k64L06M67
6570D48k13l07k84J86N08l42m66L51J93l2j26k20M13J11k84k36J04M56M2l99l50
6591d47N37J31n6n20m4N12L64l89l95L09K84K63n48j95K22L68k43m13J53K89K65
6612D47n43j67K32J82N9m92P6M33m0k98k05J06K47Q0k75LJ00J72l2n40J25M20
$$ y = [-98, -28, 81, 14, -53, -155, -212, -7, -72, 80, 123, 59, 144, -112, 3, 102, 62, -14, 72, -256, 3, -84, 11, -38, 6, -44, -89, -20, 132, -53, 49, -34, 18, 46, -8, -87, -31, 94, 163, -84, -85, -108, 86, 39, -176, 47, 17, 237, -177, -191, -57, 298, 152, 43, -196, 55, 163, 0, -51, 9, 93, 429, 101, -164, 37, 299, 115, -196, 30, 170, 190, 212, -180, -119, 138, 115, -85, -367, 72, 7, 229, 34, -341, 110, 151, -202, -297, -303, 216, 94, -418, -324, -8, 259, 113, -165, 17, 143, 267, -68, -393, -12, 531, 429, -205, -71, 11, 408, 109, -165, 32, 413, 342, -61, -325, -19, 448, 235, -72, -356, -170, 338, -4, -470, -119, 74, 42, -84, -304, 109, 220, -64, -300, -196, 260, 302, -97, -447, 90, 221, 165, -355, -399, 113, 477, 88, -307, 2, 286, 549, 1, -194, 28, 396, 153, -260, -107, 182, 447, -96, -263, -31, 151, 210, -282, -206, 227, 187, -111, -316, -210, 37, 117, -158, -155, -55, 117, 85, -455, -330, 90]
6634I0Mr4n26M96L97j74l33p2J77M66l13l19L37K55m7k45k47J75L21j30n39J53
6656a68L75J67l06j93j37M68R8m84O5J10K93j30m11rJ38M10l66j93K81M0J7l59
6678b94j60N70j52J07k56P7K16M6n3k51j5M08J14n17l4L67J30l05O9O8J11p6j52
6701A8k17K35P9J66m61L7Q5K42k30j80O2K5K17k25j15K60m9J33l08L0J84J98l22
6724a36j40K80K50m25L50l85J47K80j20j43P9J28J31l24k6J04J31L2k89P7J43
6745A44j77p8N7J07L51m16Q4J1j42m7K9m2ql0N2l2N0j39K98l02K19j3K16j44q3
6770c5P9J66m04J66J29k1m3J7m1K07j01k04L0R8M9j89K94j41K19j66m0k48K05
6793B6R3k12J18N1j61o1R9J47k18K57N5l73J47K7J18k04j06K80l7J21j48n1O5
$$ y = [90, 94, 0, -526, -30, 367, 193, -140, -212, -35, 431, 118, -201, 136, 391, 344, 99, -148, 27, 348, 218, -321, -168, 207, 374, 68, -125, -262, 206, 304, -180, -115, -5, 288, 158, -253, -262, -124, 286, -80, -273, 8, 48, 65, -294, -454, 116, -36, 71, -185, -108, 108, 154, 101, -150, -165, 243, 357, -160, -194, 173, 303, -2, 67, 135, 246, 170, 18, -199, 36, 115, 281, -180, -143, -58, 184, -46, -226, -164, -139, 78, -147, -262, -2, -51, 82, -226, -196, -12, 186, -136, -276, 4, 254, -171, 179, -206, -59, 221, 101, -42, 37, 165, 296, -28, -54, 50, 181, 213, -76, 1, 144, -33, -111, -54, 53, 404, -12, 72, 83, -59, -106, -77, -119, -127, -157, -105, -137, -87, -226, 72, -230, -11, -24, 192, 48, -35, 44, 210, -194, -28, 101, 80, 37, 54, 13, 220, 119, -85, -55, 43, 92, -97, 197, 56, 275, 109, 69, -179, 26, 119, -93, 25, 76, -85, -146, -47, 100, -118, 139, 194, -179, -32, -5, 113, -91, -197, 83, 46, 167, 19, -32, 33]
6816C3j37K36k93QJ30O6q9J31j05J42j99J02j00K08Q1j09j21p2J86NN9m71J68
6839a41L50J0k26k89K64J2J6k37j4K43K76l14k03J34J75j29rn2K8K62J28m67l8
6862b21L60J44k76j58K07K7%j64m7L13J29l74%j80M65p3j52k55L08P6Q1l41p5
6885b06L64j0j09k24K10K08j64k73n6L96M7p5k81Q2L73j10k98o6J33L24j89l32
6907b56J66J61J70l22k28M71K24l01j35j15R1M34k82k73r7N10Lk37l75M65K64
6928C38k28l39J5J87K19k07k10K38K99j70l55K19j11K63o1j39p8J23L25l02l77
6949c51L77L33l31j85QK70K78k49k53R0J92N7l30j62J71K33K2m58K55Q%J07j44
6972f2P0J20R9m48J78J51J04j35k35j9L30m6j86j1LK27r7L0%J41j38j99o8L67
$$ y = [33, -104, 132, -161, -153, -23, 43, -46, 85, -20, 122, -77, 25, -75, 133, 214, 105, -16, -88, 98, 103, 162, -309, -141, 209, 219, -7, -296, -32, -20, -4, -241, -255, -12, 264, -50, -253, -119, 56, -73, -82, -134, -106, 156, 284, -183, -221, 139, 283, 7, -151, 56, 83, 83, -81, -128, 185, 314, -60, -60, -240, 225, 152, 0, -255, 53, 129, 210, -131, -206, 158, 148, 39, -185, 25, 233, 69, -204, -260, 136, 183, 108, -173, -91, 282, 172, -126, -192, -59, 265, 76, -256, -90, 71, 241, -81, -309, 162, 386, 85, -50, -165, -74, 360, 78, -195, -292, 218, 221, -16, -391, 74, 338, 110, -229, -214, -27, 192, -15, -225, 13, 312, 142, -213, 6, -105, 158, 97, -42, -120, 3, 328, 26, -351, 26, 359, 28, -157, -149, 121, 399, 150, -103, -13, 179, 236, -94, -256, -85, 148, 170, -288, -33, -25, -25, 82, -62, 8, 128, 227, -221, -43, 108, 212, 77, -158, -177, 153, 107, -79, -90, -87, 140, 43, 73, 73, 214, 76, -123, -191, 176]
6996A76L4j58j83k7N2K90j78n3j02J48O3j26k3J20J12j72k10K68j13L1Nn2m8J67
7020B1J14j34l09K16Q4J18j29N4R6j05n3k8q9J82l1N4N2k10L1J83j98K23q1n0
7044A1Q0k90K85r2m7l9J80R0k63j2K3J01p2j26J34J78k12J57j51K4J43q1j19K53
7068A55j12m0QMJ20O2j28j2k39K38o8J04j86J95j03P6r6Q4O5M6l02R3J42j07J55
7093A54j57M5K3J75k78K3j09O4J59o9j22m4L49p3k65MJ0J91l0r9K0J46k01J26
7117D2N5k7K63k81ml8P8K3k47KJ24P0J16j74k28K36M3j51k7Q2K05q4j85j87J96
7142i8M15l52K1j48N9J61k14p3J40K34o5n2k38N03q1j10m4p4K89j5m24J56j12
7165a22K21p9r2q8K11L0o2Q1k45J95J1l8k43L07M5j56j64J04L5J06q5K2q2K45
$$ y = [176, 210, 52, -131, -158, -106, 184, 6, -47, -149, -1, 62, -64, -87, 33, 145, -27, -237, 31, -82, -51, -46, -98, -146, 21, 135, 1, -308, -92, -8, 110, -19, 35, 131, 26, -27, -55, -144, 38, 7, 61, 113, -97, -66, 117, -81, 142, 61, 11, 91, -199, 86, -6, -53, -92, 88, 178, -85, -97, -74, 27, -45, -171, -37, 141, -71, 86, -65, -41, 102, 21, -98, 155, 43, 3, 11, 15, 135, 197, 69, 57, -182, 56, -12, 92, -94, 101, -2, 74, -22, 62, 127, 173, -129, -36, 106, -1, 154, -3, 42, 65, 240, -38, -15, -124, -60, 99, 30, -92, -136, 213, 140, -125, -121, -111, 80, 50, -49, -29, 117, -84, 42, 97, 70, 333, 52, 48, 10, 88, 111, -136, -134, -10, 60, 176, 2, -226, 10, 53, -98, -125, -43, 162, 78, -107, -294, -98, 317, -35, -14, -162, -103, 58, -156, -229, -89, 145, 80, 28, -210, 293, 212, 102, 58, -16, 273, 258, -166, -10, -122, 99, 20, -72, -160, 51, 81, 19, 100, -145, 50, 61, 23, -220, 87, 132, -24, -188, -84, -49, 57, -28, -6, -88, 157]
7189A57L1k57J3J31M2j46j91K07J51O7l01o8J41J11r0j38Q5L66j87J35k88L5L7
7212D3J86j36l07L37N5n5j79j29L15q8p4r5m4L73n6m7m40N52o3q1k06J50J45o9
7236H7Jm09L55K58nm75oL35J37l48J42j71L42j76r8J4M04Rk84l58J23K37o7N6
7260A03o3k6M4K9k02j62N9K32j7j14r6L06p6k66J19K69m8j80N2q1K24N2o2r1q0
7285g5L41j62k54J35J96N2j26k00Q7j17L46k43j15R4K07k36L1l1J78o9j38J94
7307I5r6Q1r6K6j18j05M61j18j85r0J60J76j92j16J12J97k11o2j6J34k3o2j3J27
7331F6l5p3n6J58PnJ0L8j39J17K7q6k3m9P7P1j27J60k20J25N8j31oj19J14K3k2
7358d0Omn0K51j22j80J3M3N2J99m2q9q2J74j60L2Q8o5M1j24J58qn1Q5k12j6L60
$$ y = [157, 188, -69, -56, 75, 117, -29, -220, -13, 138, 205, -96, -164, -23, 88, -2, -140, -55, 311, 124, 259, -29, 6, 43, 229, 93, -214, 123, 178, 123, -56, -185, 130, 42, -32, -127, -171, 202, 146, 99, -341, 211, 148, 67, -139, 11, 156, 87, 88, -321, 34, 292, 287, -188, -194, 141, 278, -70, 72, -99, 243, 67, -31, -17, 387, 396, 112, -246, -123, 114, 47, 103, 40, 14, 58, 87, -115, -277, -218, 14, -3, -117, -213, 93, 17, -249, -130, 139, 91, -89, -37, -118, 106, 158, 96, 5, -75, 266, 104, -150, -15, 181, 233, 107, -93, -6, -123, 223, -20, -135, -41, 166, -70, -39, -70, 108, 39, -99, 95, -1, 80, -16, 10, -108, -213, 248, 130, -55, -145, 15, 191, -1, -117, -5, 192, -19, -81, -97, 37, 14, -48, -61, 66, 31, -42, -98, 60, 67, 62, 72, 110, -29, 88, 115, 29, 6, -43, 34, 105, -22, 138, -82, 43, 101, -30, -36, -155, -41, -18, -40, -34, -38, -88, 163, 41, -139, -126, -83, -31, 168, 126, 37, -45, 129, -31, 1, 89, 24, 65, -59, 99, 91, 40, 125, -87, -103, 257]
7385B57j89J13k97k3K74p5k11K51j34q4L7R5n6L20j55k59J71N7J93l31k46J47
7407a45L28j16j02q0J00J82q7j41M6Q6Mj60o5m3K42J87k95J31k9J49l60J0J5J94
7431E1J41j39j54J06K49j49r7j22K09J10j35r0k7K65Lm04K10k5J41j45r8r0L23
7454A33r4L8l19RL24L1k83J11N9K12o0l78O0J82L22j77l83K20K6K06j15kr0K15
7478B47N0m56R4J26J3J2m05L19K70k06j46j1K18j34J0l33L71K68j43m37r3K74
7500i2Q1N1j26M0K74j0j46k80J05K38J46l44k40M92K51m01k29j5L73o8j30j02
7522a32L18J8j32r8k39L63r6P0j98K42k5o3j01j89L64L2l04J85j57L84j74k69
7544b01Q9J12J69k1r7k31L01k5Qj76r2J81Q4k08J13P1J1J15k24n3J73N6k97R5
$$ y = [257, 68, 181, -116, -139, 135, 60, -151, 100, -34, -118, -81, 14, -42, 278, 123, -136, 35, 92, 285, -46, -292, -145, 183, 67, -35, -115, -15, 167, 80, -61, -15, 71, 75, -85, -150, -193, 49, 236, -59, 72, 43, 192, -168, -158, -143, 51, 192, 53, -101, 5, 254, 105, 8, -114, 95, 205, 70, -20, -47, 218, 221, -183, 27, 2, 143, -2, -100, -190, 133, 39, 77, -242, -233, 91, 122, -161, -50, 9, 221, 161, -217, -157, 25, 347, 170, -213, 7, 33, 239, 124, 122, 32, 247, 297, -159, -65, 61, 74, 86, -319, 0, 270, 64, -82, -93, 125, -9, 1, -332, 39, 307, 164, -273, -366, -92, -11, 40, -86, -46, 228, 218, 72, -208, -103, 135, 281, -63, -303, 189, 440, 39, -190, -205, 168, 100, -30, -132, 186, 204, 72, -26, -265, 98, 2, 72, -126, 116, 91, 28, -73, -262, 102, 134, -170, 15, -142, 242, 68, -201, -112, 0, 169, 148, 51, -180, 121, 96, 104, -72, -164, 17, 101, -107, 6, 77, 88, 203, -21, -74, 99, 155, -142, -47]
7568d7K00r5J28j72k20K53N7J0j74O7J28J52l10Q5m0J6J34l93Q1J73Q4j76k08
7591b67K32J87q2j30pLK23m1q4l6J34j8mj02P7k3NL2k42K40J91k31K7K7K8j02
7617C7K0j62P8r6P2o3J25ok7M9Lm0M3m7l3l3p5K34kp0q6K50n4j24L9r9k1l2k2
7646a42J05J79j76O3O3j6Mm1o4J47Jq1J83j23q5o3J65j21P6K8o6P8j04k5O6k40
7672a89L75k75J40p4j53J90O8Pk25N5l4J37J13j03j27K70M4j71j29J35j65K19
7694A08j23j34K48q5m7j18J61J88j33k15J52K7M6j54QL9Q7K9k30JK19Q0k20J37
7718G1J6n2J73k70l2Q2R2j06j13kK05K6j62J32m6J06J1j76q9lK84j01l73K21K44
7743A38L7k55j32j1M16n9j40k96K14K84j50k43J19J42J34k61o0J02R4K27l71J14
$$ y = [-47, 153, 58, 186, 14, -206, 47, 104, 114, -60, 7, 135, 287, -23, 62, 22, 38, 172, -221, -140, 33, 117, -59, -267, -35, 152, 70, -60, -67, -64, 159, 118, 34, -2, 132, 114, 110, 8, 85, 62, 67, 99, -143, 97, 288, 57, 84, 111, 139, 37, 57, -105, -27, -123, -51, -114, 11, 5, -22, 27, 30, -10, 33, -14, -47, -80, -155, 79, 77, 7, -79, 171, 117, -7, 32, -67, -88, -120, -142, -37, 142, -34, 29, 92, 76, 80, 39, -25, 122, 123, 42, 225, 102, 17, -46, 119, -2, 74, 102, 36, 114, 10, -15, 51, -189, 186, -89, 51, -23, -176, 14, 82, 89, -136, -81, -115, 22, 135, 32, -95, 175, 219, 48, -81, 54, -111, 108, -15, -149, 99, 14, -33, -151, 10, 198, 65, -150, 2, 29, 75, -79, -71, -32, 55, 84, -146, -145, 74, 154, -66, 71, 87, 35, 208, -62, -94, -12, 80, -26, -139, -141, 64, 90, -72, 60, 14, 120, 131, -45, -134, -137, 147, 46, -327, -106, 138, 175, -80, -212, -223, 193, 134, -6, -302, -88, 196, 46, -197, -78, 64, 198, -63, -123, -21, 73, 300, -71, 43]
7765D3KN3j62o2J46j09K24j10k04K71J27l19N9R7R7n6j85j04N6L92j90k32L5K72
7789A41p8O5j70r6K11J49l21KK24r3k4j7j67K09J79j98n1J73O9Ok01J9J78k58
7813d9K14l26P4J53%j68j29L32O3j36j98J94K35k06J41j90n0P2J75l38R9J30R0
7836A82j9l47Q5L56j8k14k49L73P3m9j59r6J75J32j71j75L2K77l3k61pJ79R3k75
7860a16Q2J0J47n8J6l16j8K35J62k02Q0n9N6p7m0j36L85k20J06j84K72J01k52
7883b6lK5M6P8o4o7M2Q9N6j92o2J20O2j64j64K74l1l1K67k72m6K93j94j99J9M0
7909a04K10j00K8j72K65k3j27K0j14J92j07L6j93J51N1%j21R9p0K27j71J4P2R6
7933A59k97J63K12j96M1J07r0j1J46k41J73j51R1N5k10l4jJ50j49q4K12j29q0
$$ y = [43, 45, 98, -64, -126, 20, -89, 135, 25, -179, 92, 219, -100, -41, 56, 153, 97, -88, -192, -136, 256, 66, -166, -131, 141, 63, 128, -42, -138, 73, 222, -99, -97, 127, 34, 10, -7, -174, 35, 214, 16, -35, 138, 207, 213, 12, 31, 209, -49, 165, -161, -87, 66, 66, -102, -231, 101, 164, 28, -170, 24, 259, 53, 194, 4, -46, 26, 201, -137, -38, 92, 182, 163, -184, -99, 257, 239, 25, -224, 149, 222, 173, 14, -82, 93, 225, 54, -121, -89, 188, 155, -106, -113, 66, 159, -116, -34, -24, 123, 65, 81, -235, -253, -18, 144, -58, 22, -37, 19, -58, -98, -234, 151, -69, 37, -147, 125, 226, -26, -29, -4, 42, 120, 56, -11, 31, 120, 176, -16, -78, 42, 104, -60, -224, 50, 19, -12, 255, -17, -63, 230, 36, -163, -144, -104, 106, 6, 34, -138, 127, 104, -23, -3, -117, 75, -32, 4, -189, -38, 13, 13, -108, -9, -79, 148, -23, -9, 63, 159, -138, 25, 237, 41, 82, 189, 99, 88, 234, -7, 166, 15, 106, 161, -49, -83, -84, 66, -83, -167, 45, -84, -164]
7956a64j27L30O3k55K02k46J49Jl6J66k8j17k3P0j06K30rm5j32RQ4j13L06j82
7980B7J07N9l05JJ25N3l4o4Q2Q8R3l3l74m7K21Q7n5r5k8J65o9j26k17L18J33k17
8006a05j9R8J15n2j0J7J08r3m1j10O1L10j59j26k48J80K61p4j56K5J20O0j88l8
8030f4K24J2n0k68J02J7L89m02j62J02K89n6j28o2Q2M0m2j10K4r9J6K68k57P6
8054e9J71J18l71J60N1K37l3l81k5N2L13j80j17J3K51j38q6QP1j25J16j92P7K72
8078B03J18m48N4J36J91l07J9L19l28J99j89N3J36L9k06J08q7o4K76j28k21P8
8100d9J31j7r0j03K01Q4%l67J14P5K25j10n2l66K49J85k25J13n0K67j58j2k51
8123b06K63J38j05j98%K44O8k58r0J96n7q3L3j04J39K07j41j32J36J72k90r7J17
$$ y = [-164, -291, 39, 102, -153, 49, -197, -48, -47, -83, 83, 55, -62, -85, -15, -121, 109, 100, 55, -77, -68, 16, -97, 209, 27, 134, 193, -112, -111, 14, 67, 33, -31, 51, 139, 232, 199, -175, -222, -1, 86, 31, -64, -92, 73, 4, -122, -339, -21, 112, -105, -124, -26, 89, 37, 27, 44, 152, 59, 18, -92, -31, 279, 120, -6, -254, -74, 187, 113, -43, -18, 102, 162, -26, -64, 160, 172, 122, -146, -44, -27, 362, -40, -202, -100, 189, 133, 5, -57, 25, 65, 23, -87, -63, -162, -146, 122, -135, -59, 112, 230, -141, 19, 70, 307, 274, -107, -132, -80, 233, 53, -64, -51, 200, 62, -24, -16, 55, -70, 46, -146, -69, 203, 321, -127, -73, 63, 254, -53, -34, 285, -43, 156, -33, 20, 156, 195, -11, 97, 10, -54, 222, 94, -127, -49, 82, 65, -25, -128, 73, 157, 157, -210, -96, -21, 204, 94, 42, -324, -75, 110, -115, -2, -52, 215, 57, 45, -206, 57, 195, 90, -108, -108, 136, 204, -54, -144, 52, -5, -88, -55, -159, -20, 187, 46, -86, 50, 222, -68, -165, -48]
8146d8J08l5r0m3O8P3N6pj10J91k0om2k3k58N34m94j30L44K44j93o9j44N7J67
8171A30K3l00J42N4Q5j53o2Q0J21Jk14OJ61l1N3j61JR4J64l15
$$ y = [-48, 60, 25, -65, -108, -40, 33, 89, 82, -28, 163, 143, 137, 95, 72, -186, 348, -146, -276, 68, 312, 119, 50, -94, -37, 130, 153, -147, -5, 49, 134, -19, -81, -1, 120, 121, -93, -87, 74, 43, 96, -65, -64, 30, 194, -121]
8191a21
$$ Imaginary data points
##PAGE= N=2
##DATA TABLE= (X++(I..I)), XYDATA
0@%%%%%%%Qj6RrJ6k4L2m0M9n8P9j00J17j39J70k04K37k78L32l88M47n17N94o81
31c64P80q87J005j139J289j452J625j819K037k272K525k804L112l446L810m209
47b209M642n117N644o217O843p540Q317r179J0142j1233J2478j3910J5578j7551
61i312J9924k2849K6563l1444L8190m8196O4738r8395K83722o49214k15106J134443
73D93064l2086o62845p1535K78910l4758K05387K8164n87920j39617R07043J56563
84E40370j040682k19402J050835J90724q71762j23974N77184K600j27772J03447
94H1568k93916j58262O72750K06355q60935k23263R42552K38201q44867j94657
104d34474O53952J26178l50353j1945K4891j24884L10348K52393o09857l33767
$$ y = [0, 0, 0, 0, 0, 0, 0, 0, 8, -8, 1, -8, 8, -16, 16, -24, 25, -33, 46, -54, 63, -76, 94, -110, 127, -151, 181, -207, 240, -277, 317, -364, 416, -471, 534, -605, 684, -768, 857, -962, 1075, -1197, 1328, -1476, 1636, -1810, 2000, -2209, 2433, -2684, 2960, -3257, 3586, -3954, 4363, -4816, 5326, -5907, 6571, -7339, 8239, -9312, 10612, -12237, 14326, -17118, 21072, -27124, 37614, -60781, 222941, -426273, -641379, 493064, 460978, -201867, -273402, 5508, -29250, 176137, 204301, -383619, -523236, 383807, 540370, -500312, -719714, 331121, 521845, -349917, -473891, 103293, 105893, -21879, 81568, -212348, -370610, 302140, 508495, -352440, -575703, 366849, 605050, -239817, -434474, 219478, 345656, -4697, -16642, 8249, -116635, 193713, 446106, -163751, -497518]
114d97518P96878L11733q42580k54094P02842J45551m81026n3125J82530p9939
124f8748R3899J85119l58887k89183N35099L39818o38915l46248O49216K74616
134C75786n59940j26108L78412l5671j08068J93271j44737k78734L68768L43461
144D06440m87009l37652N43976L05464m97719k07794M01001Q6162k47302P0151
154C5718O9385k29077J22871L45844l10372l97593M28632L49346m76679k60837
164c22762M16078J19887l15273R162J61830j51982j9762K56425j26059l38211
174c10667K37268L62539l24762l25443L73465K22660l58411o2284K88462r1914
184A0913j54696K31304K1148l01129J17186L35766k05912l02905K74422K43647
$$ y = [-497518, 299360, 611093, -231487, -485581, 217261, 362812, -118214, -171339, 11191, -68748, 25151, 210270, -148617, -437800, 97299, 437117, -201798, -548046, 101170, 375786, -184154, -310262, 68150, 32479, -75589, 117682, -27055, -305789, 62979, 406440, -80569, -418221, 125755, 431219, -66500, -274294, 126707, 212869, -34433, 35718, 105103, -123974, -1103, 344741, 34369, -363224, 65408, 414754, -61925, -322762, 93316, 213203, -102070, -92908, 68922, -83060, -102822, 153603, 27544, -310667, -73399, 289140, -35622, -361065, 12400, 235060, -123351, -185635, 102827, 10913, -143783, 87521, 108669, -192460, -75274, 260492, 54580, -248325, 26097, 269744]
194B69744k94400j37334K91816J4074k50155J22681J72998k44692o6737L13143
204A91138o3728l26552J68825K61742k53991j68347K78240M1526k77750O4764
214h4133K31741j67382j75033K33725Q8656k73221J1244K66281j20116k09992
224a98230K22100J14698k83201J0957L04739j18000k62659K05357J95329k33437
234d2347r3123K32725n190j85894J13423J25278k04608m1651K78870m6468l14633
245a83618J28708K97281j92969k31591K12817J15646j96774R765J31029j39500
255d9206n7796K31387k4199l00732Q2607L21356j31223l03365J53933K32815j57449
266a872j21443J35796j4759q8588J58209K9909k71137M1594L42568r1968l44901
$$ y = [269744, -24656, -161990, 129826, 143900, -106255, 16426, 189424, -55268, -122005, 191138, 127410, -199142, -30317, 231425, -22566, -190913, 87327, 128853, -148897, -84133, 147608, -19774, -194807, 38918, 127574, -145647, -134403, 131878, 11762, -198230, 23870, 138568, -144633, -133676, 171063, 53063, -209596, -4239, 191090, -42347, -135470, 97255, 92065, -93829, 19594, 144872, -59736, -101387, 177483, 131015, -183618, -54910, 242371, 49402, -182189, 30628, 146274, -50500, -40735, 90294, -49206, -107002, 124385, 100186, -200546, -117939, 203417, 72194, -231171, -77238, 155577, -1872, -123315, 12481, -2278, -90866, 67343, 97252, -173885, -132291, 210277, 118309, -226592]
277b26592J25487L02008j20865k07574J05333R0383p2698N0038L8242j84326J23
288a00441K95197l5835l60904O3429L63192q3720l04793Q2112J84645o8082m1578
299f778L4309j09719q843K33569j5394l26744K5382L63906l2211l46003L2630
310a55896K69265l0573j45577K9081m256k2882J59953J5845k82230k781L56812
321A86761J120l63174j184L16543Q471k16595p519Q4262M174O5364O059k04124
333a19842k0201L11167L3381l68664m2859L60445M1884k89829l9682J65409K8899
344F0108k0720j5328j27042j0433K49344L6487l31336o1316L57034P6572l24545
355a11175p8997K39418O5504j13808l5816l1603J243J72621L5395k78289o5382
$$ y = [-226592, -101105, 200903, 80038, -127536, -22203, 68180, -4518, 45520, 83762, -100564, -100441, 194756, 158921, -201983, -138554, 224638, 140918, -163875, -81763, 102882, 34800, -6778, 27531, -82188, -91031, 142538, 127144, -199600, -174218, 189688, 157477, -188526, -155896, 113369, 82796, -62781, -33700, -37956, -60838, 99115, 114960, -167270, -170051, 186761, 187881, -175293, -176477, 140066, 148537, -68058, -75577, 8685, 12859, 78223, 84282, -119842, -140043, 171124, 204505, -164159, -207018, 153427, 195311, -94518, -134200, 31209, 60108, 39388, 24060, -102982, -113415, 135929, 172416, -158920, -220236, 136798, 213370, -111175, -190172, 49246, 114750, 942, -34874, -66477, -65234, 107387, 142782, -135507, -200889]
366b00889L35912R0840l34662j01660K81521R6501j82390p2938N5438L4679P9030
377H1382J2338j99369o1111K86685R9618l26473j20648L08859J19505k39347j00472
388a39033J31376O3130o747j3409j16054l9574K16192Q6739k77410j19830K92799
399G8179J32801k61646j20716J89388Q4901q6381l4283k8518k0757J33817P2103
410A38888k12872j12027K54815J31796k54718j28842K11961J02848j38077o0144
420f6372M4810M836N1640N3496j38319j02024K00801J31442k26877j36749K15024
431C1708J19465j68823p9593R9810K6217j5874L3576o4375q4850J31392J23389
442A52042j72522j39645J86440J30734j70923r7209J28087M5655o8322J2293k16
$$ y = [-200889, 135023, 225863, -108799, -210459, 71062, 167563, -14827, -87765, -32327, 2352, 81382, 93720, -105649, -166760, 119925, 219543, -106930, -227578, 81281, 200786, -38561, -139033, -7657, 55473, 48726, 35317, -80737, -120311, 95881, 182620, -94790, -214620, 78179, 210980, -50666, -171382, 18006, 102907, 16526, -17757, -46275, -67032, 66785, 138888, -73984, -186011, 68804, 200600, -54118, -182960, 29001, 131849, -6228, -66372, -21562, -16726, 34914, 88410, -49909, -151933, 48868, 180310, -46567, -183316, 31708, 151173, -17650, -97243, 2567, 28784, 12910, 46486, -17889, -102739, 28653, 152042, -20480, -160125, 26315, 157049, -13874, -111083, 17004, 62659, -5663, 6630, 6414]
453F414o9414O1605J12971j13910j38451J43452J35681j51327j12560J32658O8869
464G5988r8466j4300N0905m4540K467R5402n3010j26666R3702J37476j14924j23033
476a18999J22481R0498j09786l7425Q4771j7762m4427P0642M490j07899L5737
487b7679J29085o9256j26113R3970R9546j04641n7670R8209N415q1950M2689N2664
499E4269q7114j9940J10974k0854j18052N3319R9813q1528o9557R5950K6368j01054
511e7406K0291R0551o1805o5387R0698L3559r9222N549R5456m1687p1188P9212
523A8621L9094j00428M124J11350l8482j02212O7424Q3418q1695m7763Q3088K984
535C9523o8024M2938L9428q4921r383J12150k3985j29001M7064J20165o6600r6685
$$ y = [6414, -63000, -1395, 111576, -2334, -140785, 2667, 138348, -12979, -125539, 7119, 75988, -22478, -36778, 14127, -30413, -27946, 67456, 14446, -112220, -18518, 118958, 4034, -118999, 3482, 93980, -15806, -53231, 31540, 13778, -30649, 39993, 44483, -63416, -27679, 101406, 32150, -93963, 7, 99553, -5088, -62758, 35451, 40866, -41084, 1605, 54269, -32845, -52785, 58189, 37335, -80717, -27398, 72415, -9113, -78670, 17280, 43648, -57406, -37115, 53436, -8369, -73756, 16942, 50501, -48721, -43172, 52284, 10597, -60591, 18621, 57715, -42713, -38589, 72761, 34279, -67933, -509, 82909, 1214, -46549, 36539, 39523, -28501, 14437, 53865, -31056, -40439, 71711, 47726, -81275, -34211, 85954, 19354, -77331]
547g7331O6601N1469n8684l241L7212n1221j5062R8267j1290j32809L4278J45968
559H4157m6634j33813N0730J04707m1599n2895L1742m471j0185O9232o082j16704
571g1815K4312J51720l0509j58481L4030J43594k9520j01066J9774M0606p848
582A4797K4736o682r0383J2405J38055k0525j69118J7545J65008j6758j39154
593g0074N561Q4448R16k1032r527n1207J2332J14012j3354j57950J0086J77272
605H1483k75j63828n819J27710J5988o2659j6683o689K0879Q0712j2415j34748
617g6344N301J71775R464j76523j9314J53164K7271j02350l1006L2945K5967L7699
629E8049j7482j07904p70J52884J3363j77917l1881J64914L9488j31411m6476
$$ y = [-77331, -10730, 40739, -17945, -21186, 16026, -35195, -50257, 48010, 36720, -96089, -61811, 84157, 37523, -96290, -45560, 59147, 17548, -35347, -3605, -8076, -18261, 50971, 44889, -71815, -47503, 104217, 73708, -84773, -50743, 92851, 63331, -37735, -17961, 22645, 14797, 39533, 32851, -57532, -45127, 92928, 72403, -96715, -79170, 85838, 69080, -70074, -64513, 19935, 20851, -181, -9708, -60915, -48583, 65429, 52075, -105875, -95789, 81483, 81208, -82620, -88439, 39271, 55259, -7400, -24083, -30772, -9893, 70819, 58404, -76344, -71043, 100732, 110196, -66327, -85641, 67523, 94794, -7556, -38562, -5617, 20350, 58049, 40567, -67337, -68107, 84777, 98140, -79777, -111658, 53256, 92744, -38667, -85143]
640h5143P0828L8942k597k6681o9287O905J28755J5954j64344l5898J75995N3975
652A07404j51772n7877J07697N8485l8961m1329k8746K2386R6882Q618j42531
663e9744l4580J67887N9156j61312p2224J29079P2651p6813o0524R556L2478N4905
675F0515m307j13901l1708J45372N6435j58259p9136J38409Q2087j02246p5270
686h2009M4377N2165J5684k1540p3327j4269J18413M9976j41833p3529J45103
697A9211Q8253j18132q2275P8321O9223k0136l7423l2013M904Q3740L3672j14793
709b7448o2044J29053Q2917j20819q8276R3814P5747n4724n2028L497J5435M1247
721C6371J6794q2299n2178J01679P1743j10875q4188R5994P5916p0749n9441L2609
$$ y = [-85143, -14315, 24627, 22030, -4651, -73938, -67033, 61722, 77676, -86668, -122566, 53429, 107404, -44368, -102245, 5452, 63937, 24976, -16353, -45099, -22713, 74169, 82787, -59744, -94324, 73563, 132719, -28593, -100817, 28262, 100913, 24100, -36424, -26868, 5610, 60515, 56208, -57693, -89401, 55971, 112406, -45853, -124989, 13420, 95507, -6739, -82009, -37632, 14533, 30217, 8677, -64650, -78919, 39494, 89470, -52363, -125892, 19211, 107464, -10668, -92943, -14622, 54601, 34465, -2958, -34971, -30067, 53673, 87345, -27448, -89492, 39561, 122478, 1659, -86617, 7197, 82944, 28220, -23808, -20311, -4876, 36371, 53165, -29134, -81312, 20367, 92110, -18765, -102953, -6959, 68957, -1792, -61233, -28624]
733b8624L0382O150L311m2091l5967P2860O3823q7871p4636R2709P6769p5474
745A341o0688N4603L9982k0494o476r682k1999M0779M9701n9368o6298O9997P2185
758H3583p0104o5028N8559M3223m1921j7488J5099j5028O363L8208l1063n9612
770e5209M3681O4414n4671o2577N2090M5703m5541k4846L2688j919j6468K8710
782F055J37m7982J9432O0870l1347n7777M2749N0328m3164k7984M3007P149l2148
795a0675J8421K2216l5570p127M9339o592n3202K0971M6566l3960l3352M0083
807A7118J1891m4714O221L9062k7473l2755L7764J5873m5428j057L9330j7693
819a861l1114L1623J6214m4520m54N1263j5032m9659K8102M2116l2371k4221L3409
$$ y = [-28624, 1758, 7908, 11219, -30872, -66839, 6021, 69844, -18027, -92663, 46, 76815, 1341, -59347, -4744, 35238, 14744, 8268, -1414, -23413, 17366, 67067, 7699, -58599, 11398, 83583, 13479, -51549, 7010, 50233, 8312, -9176, 5923, -9105, -2742, 35466, 4403, -55209, -11528, 52886, -1785, -64362, -12272, 33431, -12110, -36956, -4268, -6187, -22655, 6055, 6192, -41790, -22358, 38512, 7165, -50612, -7863, 42465, -699, -28683, 14324, 21473, -10675, 7746, 29962, -5608, -12735, 36604, 30012, -23190, -2219, 44347, 10387, -22965, 17118, 29009, -15705, -9484, 29578, 2105, -30650, 7114, 22987, -22441, -23498, 15832, -1861, -32975, -1352, 14862, -29658, -30112, 21151, 6119, -43540, -15438, 26678, -5693, -29914, 3495]
832C495O152k4675J8957J6410l7457r13N5038q992o0064J8895N9958k1778m8563
845b3537K2178K9396j8670l792R700k4713j918M7139p813o7076J1580P2193j6682
858B7985o9217J3436M9842j0279k6438K184m474K493L4481q062o0911J1624P7898
871D0562j0988q0710Q668P3209j774m9510k430K0800R962J6646j2297m7540J5054
884b0348P3966j0876q5667N124Q6260K437p1064r313M2547J4455p917j8596k9836
897b8828J5773O0549j1731q5101K668R0726M667q4666j4298O0486J9618k9493
909C70k2573q409J9271M5017j2587p4032L570R0980Q332r0923j7699P8460K6207
922D5984m9169k7418J4251K6308K6208j7868n8619P095Q3386P757r2664k0134
$$ y = [3495, 9647, -15028, 3929, 20339, -17118, -18031, 37007, 28015, -32049, -13154, 46804, 25026, -23537, -1359, 28037, 9367, 5575, 15275, -9438, -11356, 35783, 27970, -39106, -27526, 44667, 27985, -41232, -27796, 22046, 11767, -14671, -12487, -16961, -14468, 20013, 11951, -48960, -37336, 40562, 29574, -51136, -42468, 30741, 28967, -20543, -22973, -2173, 7789, 24435, 12138, -35402, -20348, 53618, 42742, -42925, -37801, 48459, 50896, -20168, -29481, 13066, 27521, 19604, 1008, -28828, -13055, 47494, 35763, -49338, -46670, 44056, 48723, -35943, -50241, 10245, 29863, 370, -22203, -30612, -11341, 33676, 21089, -52943, -49373, 41607, 49939, -40984, -58683, 19777, 45984, -3185, -30603, -16352, 9956, 36164, 18296, -40323, -33228, 50158, 57915, -34749, -54883]
934e4883Q6407K9571o4966l4351L1658L1851M612k3907m2050Q572P0261O053q7671
947c8843k2938Q7536L3722p4589m0661M7391L8679j3327l0017k3440J5413N5583
959C4509K522p7323k0178Q6965L6009q0594m3765O1461M6172l0325l8758l325
971b6630K5657L8099n810o4692j3683Q0730L2350q2347m5319O9673N0578m5932
983A2674m7170J4226L4155J8472j6288m8742n896O7995K6134p6856m3461P1720
995F963N1749n5884n1552K9656M2024J28k5738k8732M832N2073J7745o6157l5959
1008e8852P0071M8267o0670n1714M2607M7717j7765l4331q179J5115L3264O436
1020C1966n1796k5814O0903M0703n9280m8872M8652M7561l1111l8216R242K1268
$$ y = [-54883, 31524, 61095, -3871, -38222, -6564, 25287, 29899, 5992, -36058, -27486, 42775, 48828, -38843, -61781, 25755, 59477, -15112, -55773, -8382, 30297, 16970, -13047, -36487, -21074, 34509, 37031, -40292, -60470, 26495, 62504, -18090, -61855, -394, 45778, 15453, -23305, -26630, -973, 37126, 31316, -33376, -47059, 33671, 66021, -16326, -61645, 8028, 58606, 12674, -34496, -20270, 13885, 32357, 16069, -32673, -38569, 29426, 55560, -21296, -64757, 6963, 58712, 2828, -48724, -19068, 22956, 23084, -2654, -31386, -26554, 25519, 43264, -22893, -58852, 11219, 59486, -1184, -52898, -10291, 37426, 19661, -14670, -22849, -7734, 25530, 31966, -19830, -45644, 15259, 55962, -3318, -52190, -3538, 44023, 12912, -25304, -16062, 5206]
1032E206J3759k629l2942j6711M4776L2653m9355m3143M6339M4470l5856l8384
1044c1817K0157K5682k101r317j3742r127K7331K5382l6023l5895L8539L9916
1056C8985l4671l6922K6418K7459j5112j2617J563l237J0781J7823k0429k9080
1068b9039K5956L4529k7555l4207K5905K6913k0613j4812J2870Q81l620J2081
1080I289m012k3038J1416K9655j6857k9503J9964K4317j9508j5177J7398M397
1092H341j4131P377R164j7637k930K3631m152k5132J0116K1398j5837j4413J8701
1105D496N026k0310M611J7949j3086j4202J7649Q963j9963j334J8178o981j3033
1118a2037J5792N477k1827K966K5693q912k5361J4459K0979j4908j2513J3178
$$ y = [5206, 18965, 16336, -16606, -33317, 11459, 44112, -5243, -48386, -2047, 42423, 6567, -31817, -11660, 14022, 11921, 2604, -11138, -20265, 7066, 32448, -3575, -39470, -931, 38985, 4314, -32608, -6190, 21269, 6157, -6460, -4897, -8134, 2647, 20470, 41, -29039, -3083, 31446, 3891, -30316, -4411, 22502, 1889, -12923, -53, 828, -2792, 9289, 5277, -17761, -6345, 23310, 6453, -23050, -3086, 21231, 1723, -13454, 3944, 8341, -5790, 1587, 10751, -6886, -9816, 13815, 9663, -15469, -5353, 16045, 208, -14205, 4496, 9522, -10788, -6177, 11772, -1314, -15516, 2133, 11096, -8867, -10201, 7977, 996, -12037, 3755, 9232, -12595, -9629, 16064, 7152, -18209, -3750, 17229, 2321, -10192, 2986]
1130B986K723p962Q286K882j8260K176K7061o285l2601R219L2034j0611k6241
1143a4593Q046J5019n015j829l71j4029M477K6323q659l5361Q632L8448o625l6565
1157b2102K899K8426J178j4727m784k084Q096K0229q745l4348Q769M4362n412
1170B1757m4774J652L8911M882k4969r805Q448J3547J0282j3091k7668R829M1989
1183C0990n152m9903j493M8263O833l9570j2685K1618J5155j134j7468k1007J5152
1196a0401L7153j0458m8592J277N1774P285m6955j5354L4792K0460j5804k0614
1208a5437n954J8248K8851j1238m5005M474N4721N262n1781j3394M1924K1572
1220C2243k4109k4509M336K2982J6821j5994l5832N879M8494M727n4267j5395
$$ y = [2986, 5709, -2253, 6033, 8915, -9345, -7169, 19892, 13607, -18994, -9775, 22259, 11648, -14593, -6547, 8472, 3457, 1628, 1257, -12772, -8295, 18028, 9369, -25992, -17360, 21088, 14463, -22102, -19203, 9223, 10401, -4326, -9110, -11194, -3098, 17131, 8386, -25962, -17193, 27169, 21757, -23017, -21365, 17546, 22428, -2541, -12346, -3898, 9649, 19931, 6840, -20828, -10999, 30990, 25838, -24065, -25558, 22705, 29538, -10032, -22717, -1099, 14056, 12922, -4546, -25553, -10401, 26752, 16294, -32298, -31021, 20753, 28038, -18917, -34271, 521, 20981, 5177, -15437, -21391, -3143, 25708, 14470, -30535, -26061, 28660, 33922, -17859, -31253, 10671, 32243, 8134, -16375, -12039, 10943, 27764, 11770, -24062, -18183, 30311, 35038, -19229, -34624]
1232c4624M9174K1028l6802k5004J5443K3092O517k0260k8190J1580M2082r64
1244B3072n0038j1871M9325K2321m0938k8342K6454K9009o137k2347j4453J3387
1256a0558L4980q92m6590r027N0797J9888m3073k6278L0130L0291j1794k7347
1268i473o849J9282K4001o613l7217q574M4005K0770m5316k9929L6665L0603k2617
1281H738k8990J824K1125J6107j2337l1604r43L9426J3557m1425k5290L6350L3228
1294B9766k6376l3539J3185K8137L766j5425j9098K473L3989J1615l9338k0532
1306c1377L9014K8373k9126l0651J6700K9613j910k2446j1440J1083K1791K760
1318B2384k9616j7823L2419K6845l2364l1250K3653K7891j2767k2779k603J2758
$$ y = [-34624, 14550, 35578, -1224, -26228, -10785, 12307, 18824, -1436, -29626, -18046, 24036, 23072, -26966, -38837, 10488, 32809, -8129, -36471, -10017, 18992, 12855, -9492, -23945, -10558, 24422, 23530, -23060, -32087, 18710, 38598, -4475, -30753, -623, 29668, 17874, -9473, -16322, 2960, 26961, 20348, -16869, -25443, 18562, 39332, -5984, -35913, 752, 31355, 8738, -20252, -18428, 2697, 18804, 6467, -25137, -26080, 13346, 26903, -14522, -39812, -3462, 29766, 3390, -30149, -16964, 11173, 14939, -486, -19584, -17111, 16878, 28493, -10845, -31377, 7637, 36010, 6884, -23767, -7067, 22546, 20636, -1810, -13250, -2167, 19624, 22384, -7232, -25055, 7364, 34209, 1845, -29405, -5752, 22139, 9372, -13407, -16010, -3252]
1330c252J4509l742k3890p553K6867J7524k6080k5284K2271K9147j5680k5849
1342b1012Q637J8247K040n341j0942m715K0481J4361k2760j8697K2443K1935j6505
1355H172k0271R313J7429k177j1054l592J842P161P907j1702j7168J3979J9868
1368A9707j6794j9431J3089J3436r335q240K355J027K262L606o235q679P058J2588
1382F414o882j5075Q267J5253r034r913J0507L527p211M858M422q827J186J1842
1396I334l485j0200O419Q283o176n796P047L362q087l83R046m112r919P737N702
1411H772j0690j340Q042n339n518Q802n53j1827L183J1263n305j0946M159R788
1425B491l253p914K927M204k084K673K140r960J642J6925l608j8005O122J7601
$$ y = [-3252, 11257, 7515, -16375, -23928, 2939, 20463, -5617, -30901, -8630, 20517, 4837, -21012, -12375, 5872, 7912, 2571, -8371, -13086, 7395, 21756, -1004, -19701, 2742, 24677, 8172, -12099, -2786, 14643, 12466, 1412, -2180, -338, 6823, 14730, 3028, -14140, -161, 19707, 2913, -16518, -3429, 10007, 672, -7568, -5213, -4186, -1924, 1682, -4553, -13232, -6174, 6414, -468, -15543, -7276, 7977, -1057, -10970, -463, 3064, -4147, 711, 5133, -3694, -2508, 9334, 5849, -4351, 2068, 10351, 4175, -1621, 5426, 8788, 701, 318, 9364, 5252, -4667, 3070, 8772, -1918, -3258, 4784, -555, -6073, 2729, 2176, -9651, -6468, 4795, -510, -11456, -7297, 2491, -762, -8676, -5749, -1545, -3629, -956, 1184, -8776, -7134, 9791, 6183, -11822, -5700, 11901]
1439A1901m436j1803K394O439K146L87m592n996N118J2221l928j8128J300K1344
1453A4367p33k1675j006J5062J733o907m852m748O470J2754q234j9790O398K1778
1467A0617k447k2351l036J9965P404j4171r086N521R988O222p464j6680O216K6026
1481A6724k613k8269j40K6191N785j7791j0356Q412J4408J796j3931j1487R779
1494a492K0439m318k7304k763K9002P503k6730j1806J7363J2595n222j4282q952
1507a5967J2599J9383j0264k6348L430K8492M626k7286j1980K2181J7192j3516
1519B542j7080K179J5330J1197r701k2179M589L0662J857l0867p396K6190J3903
1532B1226j6183j7669N408J8688N501j4623j6331P536K3876O73k8745r293K8490
$$ y = [11901, 7465, -4338, -1944, 4495, 6641, 7028, 2436, -3560, 1558, 13779, 9851, -8277, -6977, 14367, 13634, -8041, -9047, 6015, 7748, 841, -4011, -8759, -2289, 10465, 2231, -17559, -11161, 10617, 8170, -14181, -17217, 2748, 10152, -4019, -13105, -7584, 2404, 8626, 1162, -15518, -9302, 16724, 14111, -14158, -14298, 11893, 17678, -113, -10469, -2057, 12351, 14147, 216, -11271, -1492, 18947, 14629, -12675, -15438, 13564, 21067, -5663, -17469, -106, 12489, 7267, -7015, -15967, -3368, 16015, 5751, -20597, -17167, 11325, 15951, -11335, -23315, -1134, 16058, 2542, -14538, -12359, 2971, 14168, 4467, -17712, -13123, 17539, 19396, -11471, -18867, 7323, 21226, 5043, -12626, -7218, 11470, 16971, 2348, -13983, -6447, 17429, 18102, -10643, -19936, 8554]
1545H554J3891k3505j7346J2560J6480j43j5143j2565J0146K1523m607k6030l606
1558a9791K6401J1724k2833j7474J6388J9907o828j7124l505J1954J4778l923
1570I674k2867k597K7214R301k4673j4211J8197J8075q811j7976j201J5009J0253
1583A5387q867j7663k5K1563Q535k3143j5541K0359J8088j4256j8022M197J4358
1596D970N844j0024j4514L163J9540M011k1250j0883J9129J6346j3943j9053Q008
1609h656J8118l15j2683p051N507J4564K595j8941q234J9574J3534j6050j5938
1622a3976J0250J6273k933j4075m071R038R694k467j3462n275J4928J1477j4904
1635D97j5729J2314J5324p513j3425J032R109N121m469r695j154J2215O435j2576
$$ y = [8554, 22445, -1060, -18406, -5846, 10634, 10491, -4652, -17217, -7071, 14452, 9845, -16185, -19791, 6610, 18334, -4499, -21973, -5585, 14322, 7494, -9630, -13135, -1181, 13597, 9674, -13193, -15790, 11424, 20725, -3948, -18159, 38, 18113, 9302, -8674, -9875, 5134, 15387, 6520, -11143, -11168, 10395, 18930, -4213, -19754, 605, 18693, 4437, -13585, -9388, 4970, 10814, 790, -13724, -10561, 8979, 12990, -8260, -19143, -14, 16332, 2389, -16664, -8656, 9462, 9147, -3536, -10587, -5080, 9484, 12079, -6862, -15096, 4478, 18012, 1962, -13976, -3726, 12547, 9614, -4461, -8532, 506, 10200, 7733, -5729, -11004, 3924, 15401, 497, -15232, -2918, 12406, 4893, -8532, -7500, 1609, 6730, 2261, -7434, -8588, 3627, 10062, -2514]
1649b514j0650J0982J3103p719j3023M375J0770n56n633l451M69P349M450r096
1663a144p670R474R430q172r405N514Q243k498n948k71K690K000J301l638n160
1678e254M862P121n594p920N653O288m677m402L650J131j571J074p9l042J421
1693a339M239k019m587K496M748l606l307M501J198m578Q05M424k764l344L917
1708G84J482l239K14K345k304o89L692n36n055J469O214k037o841K408O035k329
1724A613m007J428R14N22J972j942m909L070P363l420q417K639Q379j242p032
1739c069m37M701J904j018l230l237L905P107m079r976K976J1296j623j0479m53
1754e712P420K961l792m959p23N645N743n490r596L833J2591j992j2914o03J1208
$$ y = [-2514, -13164, -2182, 10921, 3202, -9821, -5446, 5324, 4768, -865, -4316, -3847, 3502, 7952, -1144, -8814, 660, 10090, 1918, -7487, -1973, 6270, 3772, -2176, -2447, 243, 2243, 3544, -94, -5254, -392, 6729, 1135, -6785, -1132, 5156, 479, -3923, -273, 858, -713, 361, 282, -2760, -1339, 2900, 881, -3706, -1210, 3538, -68, -3375, 1126, 2324, -2254, -1449, 2975, 211, -3133, 784, 2266, -973, -759, 1586, -718, -1407, 2285, 1749, -3306, -1837, 4377, 2340, -4501, -2093, 3942, 1613, -2394, -966, -52, 470, 2442, 500, -4409, -1339, 6024, 2604, -5813, -3174, 5205, 3963, -3069, -3506, 1195, 3099, 2081, -1149, -4386, -481, 6626, 2547, -7429, -4453, 6843, 5220, -5259, -5712, 1708, 4669, 877, -4082, -4805, 840, 6583, 1093, -8503, -4670, 7921, 5929, -6985, -7588, 3620]
1769C620L624p190n626K049O809M285p059r030N633J2794l068j4400j61J3678
1783E958L495j0724o385N755P899M63q657o682P467J1442m861j4947Q86J5843
1797F952K520j3863o130R134Q853l457r860l273R162R673o398j4316K883J6571
1811H451J466j5795n425J2836Q970p279j0137K74J0750O588q526j2222N155J5893
1825A0999j045j6321l987J4890P504j0464j0392M101J0908K432r925r165O753
1838c712J3604k932j6372j715J5890N796j2755r390P573J0823j069j0608n339
1851a0206Q260J1383m221j4788J14J5634M792j3845q150J0440J0284m056j0354
1864d713k211R003Q102n598j2316J481J4814K788j4686o526J1443Q758o765j0388
$$ y = [3620, 7244, 54, -5572, -3523, 3286, 7571, 512, -8518, -2885, 9909, 6841, -7559, -7720, 5958, 9453, -1271, -7656, -1901, 5998, 6461, -2196, -8878, -1411, 10031, 5170, -9777, -8891, 6952, 9472, -4391, -10521, -1387, 7466, 4009, -5851, -9124, 38, 9711, 3313, -11003, -8120, 8451, 9917, -5878, -11303, 1533, 10503, 3224, -6913, -6639, 4111, 10699, 2173, -10049, -4894, 10999, 9954, -6367, -10354, 4536, 12040, 1576, -8816, -4715, 6193, 8625, -1300, -10465, -3712, 9892, 6960, -9412, -11127, 4763, 10559, -2196, -11586, -4013, 6810, 5741, -4867, -10206, -1946, 9437, 5216, -9572, -9458, 6176, 10968, -2877, -11027, -587, 9697, 5641, -4713, -6924, 2079, 10181, 4583, -7733, -6252, 8562, 11350, -3336, -9862, 1581, 10339, 3574, -6814]
1878f814J003R233M364o925r668K840J2582R25j3777m817J1971P768q484r657
1892i456L794R265K002p201o835M194J0555L0j1957l675J1984P056r013q700N774
1907b183Q990l93p497m357N308P963j656j0179k454J0967N572j0046p537O662
1921h40Q053k965p806j725N399M982k867q246q13R597L537r396o238P531P396
1936E599m585p313J172N957K901l334n737Q11P810K455p879m323P427O268n300
1951A929o085K929N701J54l787k857J640M656R08n949l141O025M146n569m935
1966d235L605M136k046l361k83J359J857j38l485j851M074K453m296k937L647
1981a501L176k901k153J901J328j36K55n56j088J807K282k013j861K384J864k004
$$ y = [-6814, -5811, 3422, 7786, 861, -8807, -5967, 6615, 7540, -6237, -11054, 917, 8685, 201, -9456, -5662, 3603, 5605, -1596, -8431, -4237, 6318, 6348, -5609, -9284, 2700, 9756, 743, -7957, -2183, 6807, 6414, -1083, -5440, -132, 7831, 6175, -4004, -6458, 4509, 10081, 35, -7502, -840, 7213, 4248, -3558, -5283, 116, 5098, 2231, -6015, -6828, 2769, 6306, -3090, -9328, -1797, 5599, 1014, -6299, -5127, 830, 3731, 397, -5340, -4529, 3281, 5736, -2143, -6466, 961, 7229, 1929, -4156, -1227, 4474, 4628, 841, -2016, -376, 4280, 5188, -761, -3902, 2123, 6269, 700, -4235, -630, 3506, 1460, -1901, -2184, -825, 1032, 894, -2591, -4442, -368, 2085, -2211, -5148, -1501, 1675, -1226, -3379, -1478, -150, -286, -31, -587, -1675, 132, 2414, 401, -1460, 924, 2788, 784]
1997G84j101K573o3j896R73J201j239p42J133K04j362K09N97j513j9J791j363
2014A67k836J818K661k405l159J828K666j464j703J52N63J154J081k390j838K850
2030h55L663k910m129L093M461j421l735L69K835J650q37k625j053L699L168m085
2046A288m435L356N491k426n762M77M889R58l340l135J09M336K087n437m230M403
2062a371N922l609o882J381O456O51m778l214K652M891P07n471l570N733O316
2077E814m260p596K730Q198K72o891k368M422N280j315o097k353O622N433n497
2092B394q111L706Q847j025q753k178O625M270l917o556L5O783L830o779p284
2107h113M798R003k431r680n12Q467L531n726n921K366P436J708p019n482O291
$$ y = [784, -317, 2256, 2193, 297, 1270, 2471, 1232, 490, 1623, 1827, 465, 674, 1271, -242, -261, 1530, 167, -2669, -851, 1810, -595, -3754, -1926, 740, -724, -2427, -2275, -1712, -558, 523, -1867, -3705, -855, 2808, -102, -4231, -1138, 3323, 1902, -1833, -1464, 1371, 3021, 2184, -441, -1494, 2205, 5373, 1288, -3147, 209, 5700, 3274, -2488, -2011, 2878, 3836, 496, -2639, -2530, 1806, 3893, -1544, -5774, -1371, 4551, 942, -5940, -4559, 1897, 2548, -2230, -5444, -2792, 2099, 2806, -2665, -6235, -502, 5814, 1554, -6042, -3312, 4886, 5158, -1733, -4101, 321, 5601, 4286, -1811, -4164, 2458, 7891, 2394, -5717, -2011, 6836, 5811, -2942, -5120, 1505, 5775, 1858, -4698, -4663, 2120, 5950, -829, -8113, -3315, 5688, 3257, -6423, -6935, 1532, 5063, -663, -6584, -4218, 3218, 4926, -2093, -7575, -1284]
2122a284Q695l705r614P84J0049K375p993m760M558O938j26p704l838P007P381
2137H763n677r288K156J0103N73r035l963O262N836k970p525j060P070M976o214
2152Gq397M098R463q12r717j975P999M693m601o630J277P195L074o480o092M710
2168b188Q686j736r197q81Q668L546n991n439K716O590J007o248m592M862O888
2183F691k712q542J90Q153K246p066m461M072N382j009n707k539M536N528l319
2198A443p368J057P938J047o873k976M852M620k150m948n73M558L815l184n693
2213d435J544O888O85o643k124N536L588l055m457O78M051K283l413m743K159
2228a458N493k84o118j554N441K537l760l890J797L531K20k860k839K077M256
$$ y = [-1284, 7411, 3706, -5908, -5124, 4925, 7300, -693, -5453, -895, 6043, 5917, -1787, -5625, 1382, 8763, 3086, -6202, -4046, 6057, 6630, -2405, -6368, -106, 5730, 2760, -4765, -5825, 1245, 6221, 7, -8390, -4292, 5171, 4359, -5358, -7333, 666, 5359, 758, -5872, -4595, 2600, 5674, -806, -6898, -2188, 6498, 4762, -4435, -5316, 3352, 6898, 907, -4532, -1816, 4774, 5781, -467, -5059, -197, 6691, 3979, -4563, -4373, 3780, 6026, -1040, -5501, -1429, 3953, 2944, -2763, -5302, -766, 4762, 1443, -5925, -4868, 3070, 4117, -2756, -5732, -880, 3740, 1590, -3358, -3931, 627, 4442, 1258, -4435, -2891, 3997, 4682, -1961, -4085, 1451, 5039, 1984, -2473, -1795, 2256, 4539, 1126, -3617, -1458, 4035, 3751, -2367, -3921, 1520, 4057, 297, -3593, -1796, 1735, 1955, -905, -3744, -1667, 2589]
2243B589n73n288p19N039K186m157k711K670K843m09k593j257J896L142p41l868
2259a951l18M298J354l823j832K812K197j528j962K0J178J467n81k575J8K996
2275A770K01l055r52K566J096j946j146J045M52q8j17p27l31J420N29j777n19
2292a579J820L12j516J50J377j97j015P13N95r64q6J091n20k17O09M9o34N88O77
2311A253j247q60J593J115j926j205J378J316j109r19J11M71Q86k08j850n37K516
2328G78J108k640k021K573K313j707k187N44J798P44j212j922L61L062Q00l541
2344a149j881L640K713k836l307J549L315J00k566j884J681L054m2l942j691M236
2360I90K712l314l942K441L916n63l833j106K616K908r38m332p89M679K620m444
$$ y = [2589, 2016, -3272, -3991, 1048, 3234, -923, -3634, -964, 1879, 1470, -1123, -2380, -484, 2658, 1917, -1951, -2269, 2029, 3383, -440, -2272, 540, 2737, 1209, -753, -733, 445, 1912, 1331, -1244, -1226, 1770, 1971, -1084, -2036, 530, 1626, -320, -1466, -421, 31, -57, -174, -901, -1232, 188, 717, -1060, -1579, 241, 553, -963, -813, 564, 367, -648, 65, 660, -304, -390, 701, 181, -36, 573, 622, -12, 576, 1253, 6, -854, 739, 1854, -72, -1277, 101, 1417, 308, -611, -500, -29, 857, 649, -1201, -1738, 778, 1886, -754, -2775, -202, 2111, 404, -1783, -1239, 559, 1303, 91, -1831, -1470, 1592, 2392, -1149, -3030, 610, 3323, 487, -2820, -1271, 2044, 2144, -422, -2306, -625, 2429, 2387, -1555, -3246, 990, 3702, 388, -3554, -1113, 2803, 2240, -1593, -2699, -83, 2825, 1887, -2445, -3234, 1445, 4065, -379]
2376c79m040L535M551j555m699l76L810K619k458m232O12M822J957n163l659M092
2392e63M901k336n594K62N234J928l830l830J566N248P34n650k909N041M747l322
2408A627o127J459N960Q17m439l399K989N010p17n602k160N950M138m588n781
2423d863K542O308j18n983k315M422M337k022n396r20N710L417n165n525L597
2438a974O364j090o510j256N645L039l592m693N21N970K120n648m404M260O117
2453D869k218o595R5O103K205m271m391K472N282M04n457l108M850N202l467o204
2469d229J435O219P55n418k940L353M414q23n128k013N122L793l969n435K155
2484b709O012m13n243j720L825L667j934m610l53M529K789l778m347K611N223
$$ y = [-379, -4419, -884, 3667, 2112, -2587, -2963, 847, 3466, 1008, -3224, -2612, 2210, 4167, -996, -4655, -563, 4338, 2002, -3592, -3330, 1904, 3832, 2, -3828, -2262, 2986, 3720, -1930, -4839, 202, 4949, 1627, -4500, -3041, 2919, 3736, -703, -4102, -1113, 3897, 3180, -2422, -4582, 1368, 5506, 918, -4863, -2321, 3987, 3869, -2114, -4429, -7, 4330, 2308, -3088, -4008, 1702, 5119, -46, -5571, -1974, 4390, 3300, -3210, -4466, 1179, 4218, 626, -4067, -3546, 2424, 4544, -1104, -5508, -1248, 4869, 2651, -3944, -3849, 2254, 4459, 188, -4203, -1731, 3551, 3955, -1502, -4610, 240, 5442, 1975, -4229, -2794, 3425, 4180, -1238, -4178, -825, 3589, 2766, -2362, -4375, 747, 4540, 571, -4864, -2709, 3303, 2890, -2353, -4073, -248, 3419, 1485, -3125, -3478, 1051, 3840, 62, -4285, -1674, 3549]
2499C549p74n139p13M262K489k666l541Q44L862J485l453l533K604M631j364m942
2515b399LM106J617l193k896J400L127M35l121k126K107L655j407m431K13M208
2531A298P47k997j979J919K509j37k598j402K362K818j385l623P22L844L20k958
2547e40j544K283J892o95j813n73J745K034j544k917Q18L052o0l038o69K148J204
2564A783j395j663K20J250O92r97j830O25J976J55k386m72K051O47j538l74M91
2581g65P40L33n65p53N64J141P8j121JJ135J91q03k51J045l06k79N30N7p18L31
2601E85L41n34k93P78o32o26Q44n8r80n1P34M56j321o51R60Q60j134o97L65M44
2621f10O97k93j350P7K017M60k194o99K242J077j011j705O74J961K82j423j207
$$ y = [3549, 2775, -2364, -3077, 1185, 3674, 1008, -2533, -1689, 2173, 3658, 205, -3328, -724, 3907, 2543, -2399, -2396, 1710, 3327, 134, -2762, -1362, 1765, 2200, -921, -3047, -940, 2715, 1308, -3123, -2910, 1298, 2045, -952, -2931, -1012, 1497, 1360, -1238, -2640, -278, 2540, 1155, -2468, -1746, 2098, 2418, -540, -2084, 199, 2091, 1396, -417, -990, 755, 2789, 1245, -1672, -854, 2198, 2138, -900, -1569, 579, 1783, 388, -1275, -1055, 195, 887, -110, -1940, -1315, 661, 816, -1570, -2042, 9, 656, -882, -1256, -765, -25, 308, -257, -1010, -446, 695, 773, -348, -347, 788, 979, 176, -75, 970, 664, 385, 915, 972, 254, 585, 926, 392, 99, 877, 245, -381, 463, 405, -575, -626, 108, 564, -757, -1408, -448, 412, -722, -1419, -1054, -610, 87, -206, -1556, -1479, 538, 998, -1196, -1895, 347, 1424, 413, -1292, -618, 1343, 1625, 202, -1005]
2638a005J021K375k23k959p11L056J722k825k094J648K027k19k380j516J932K564
2654B413j646l116j01L446J282l375k790K815L045j303l107n43K686K353j822
2669B37l560O27M644P67m272j957L511L407j746l957K10M241J518l073l104J762
2685g45M292J42m780k035M486L159l257m123J308L955Q98l824l259K672M324j327
2701A886m650j171M434L044l810m704K747M870m37m568j793L319L771j305n362
2716c729n2N642K236m626l692L276N079j082n312q77M748K813k758m346N76N208
2732C104J762n407l542M368M593k717n120J03M525K413m250m034K086N111k87
2747B708n172k288M288M546l594n534J633N438P59m398k632K841M500m72n606
$$ y = [-1005, 16, 2391, 2168, -791, -1502, 1554, 3276, 451, -1643, 5, 2032, 1813, -567, -2083, -151, 2413, 767, -2349, -2450, 996, 2278, -1097, -3887, -1072, 1973, 670, -2437, -2980, -294, 2059, 237, -3323, -2696, 1948, 2715, -1557, -3514, -3, 3404, 1658, -2299, -2089, 2152, 3670, 597, -2507, -745, 3547, 3689, -1091, -3126, 1360, 4519, 1262, -2861, -1553, 2402, 3300, -524, -3783, -1111, 3213, 1886, -2764, -3935, 499, 3543, -267, -4971, -2224, 2646, 2209, -2359, -4152, -833, 2938, 1633, -3729, -3781, 1861, 4097, -529, -4221, -945, 4134, 3052, -2260, -3137, 1611, 4424, 1666, -2680, -2104, 3104, 4866, -541, -4083, 285, 4878, 2161, -2959, -2856, 1669, 4082, -168, -4202, -2116, 2995, 2708, -2464, -4752, -464, 4082, 488, -5046, -3413, 2025, 2784, -1614, -4246, -1405, 3095, 2623, -2983]
2762b983j190N473L146l863m531K056N505K96n015k122L933L629k177m163n70
2777b576M781K732m664m093K977M783j378m666q55L702K486k647m071R18M146
2792A575R46l899k984K896M327j530m908M20M105J512l033k492J206L859M54l714
2808a260j909L320L176j888l674M34M110R07l307j861K129K280l34k578j531K783
2824G97K458k298l115J060L025O4k669j533J793K254j036k433m52J971J498j312
2840G2k729R86K977j92k970l35K165Q82n27j627k00J870J449j881j406Q74K017
2857A425J07j969m86J646J136j073j049J02R62Q28r13j722O97J964m70j784r2
2874f91J034N23q14p96K47O86j7o86j30j11P29J83j226j67J249j12o21K11N35
$$ y = [-2983, -4173, 1300, 4446, 583, -3948, -1892, 3613, 3909, -1106, -3228, 705, 4334, 2157, -2006, -2576, 2205, 4937, 273, -3820, -843, 3940, 2562, -2104, -2959, 743, 3229, 582, -3489, -2571, 1575, 2521, -1378, -4362, -1466, 2861, 1331, -3577, -3157, 948, 2460, -573, -3065, -1859, 2000, 2454, -1260, -3169, 151, 3327, 1439, -2235, -1801, 2309, 3216, -91, -1952, 177, 2457, 2123, -455, -1986, 797, 3255, 957, -2158, -1098, 1927, 1991, -678, -2211, -418, 1836, 800, -1633, -2085, -114, 1384, 72, -2657, -1671, 1306, 1114, -1856, -2191, -26, 856, 329, -1298, -1498, 372, 1821, -60, -1466, -592, 1425, 1532, -437, -923, 723, 1859, 786, -263, -161, 801, 1629, 716, -1006, -309, 1655, 1185, -599, -691, 343, 866, 52, -744, -497, 189, 172, -514, -644, -755, -26, 157, -1069, -1236, 13, -99, -720, -509, 26]
2893B6l71K72K76m07k2M27m8Q1Nl14M86K7N7K31n83n18J319J52j391J65P64J22
2915G56o60l48p7N43O92r42j264P13J232r9j525p62J594J341j499j350J053J137
2933E35Q7r87j275R61K150l70k628j06K479R85j950j532Q78K657k49k552o20J807
2951B70J904r71k607k62L472P15l068j675K092K376j012k519o42K369K048k162
2967C28k772Q89L262L83l291j875L026K723k020l141O01L095J063k551k543J400
2983a423L930n06l984r28L541K495k523l502J220M036L05l422j825K302L184p95
2999B105m199p94M260K074l372l312K142L768l67l710j695L146L011j993l855
3014b791L05M036J773l788l376K923L935r28m353o48L495K715k499l999J009M463
$$ y = [26, -345, -73, 203, -204, -226, 201, 153, 234, 239, -75, 411, 438, 495, 726, 143, -375, 944, 1096, -295, -130, 634, 756, 96, -252, -329, 214, 906, -36, -1300, -587, 645, 546, -979, -1741, -147, 1194, -305, -1655, -602, 535, 622, -365, -1640, -679, 1471, 1101, -1527, -1633, 846, 1831, -119, -1651, -773, 1884, 1635, -917, -1537, 270, 2174, 1203, -1404, -1666, 1806, 2521, -547, -2222, -130, 2246, 1234, -1285, -1927, 442, 2490, 328, -2444, -1555, 1707, 2090, -1201, -3076, -50, 2673, 653, -2488, -1887, 1208, 2271, -280, -2823, -1423, 2507, 2001, -1983, -2911, 630, 3125, 602, -2900, -1680, 2356, 2661, -761, -2586, -284, 2900, 2105, -2094, -2888, 1372, 3446, 74, -3238, -1096, 2672, 2305, -1405, -3100, 46, 3057, 1064, -2791, -2486, 1550, 3323, -465, -3841, -918, 3017, 2089, -2264, -2912, 583, 3298, 799, -3200, -2191, 2272]
3030B272J061m505k539L358L963j942m380r9M474J599l553l020J735M171L44m668
3046a729j931L994L491k965l970R37M117J086l583k856K482M117j073m116j217
3061c216M346K507l110l824J654M597k32m185j530L051K965j481m098j03M363
3076A704J898m031l194K623L873r30m072p26L561K277k579l187R44L474J014l798
3092a149k121K882L376j671l581P3L372J499k681k310J372L240k06k985j626K991
3108D75K365j873l163P95L101N35k789j405J418K285k96k825p02K597J576j821
3124B73k510J001K476J95k561r97K003J598r04j987k95K126J284j740j878J244
3140f72K222m71k095l69J757R77n60j490K09J347O68j198j293Q93J478l38j716
$$ y = [2272, 3333, -1172, -3711, -353, 3610, 1668, -2712, -2811, 1663, 3262, -291, -3311, -1576, 2595, 2939, -1729, -3660, 334, 3825, 860, -3110, -2173, 1944, 3030, -553, -3409, -927, 3190, 2117, -1999, -3216, 1130, 3637, 527, -3297, -1643, 2954, 2722, -1463, -2993, 58, 3023, 1542, -2556, -2659, 1704, 3602, -429, -3623, -1000, 2873, 1943, -2129, -2855, 706, 2983, 404, -2783, -1839, 1635, 2649, -1149, -3270, -388, 2988, 1317, -2264, -2191, 1181, 2680, -1, -2311, -939, 2301, 2095, -890, -2516, 475, 2840, 967, -2196, -1401, 1700, 2235, -554, -1959, -541, 1744, 1448, -1377, -2079, 518, 2094, 273, -2237, -1236, 1240, 1435, -1126, -2123, -120, 1478, 574, -1413, -1708, 418, 1702, -38, -1916, -672, 1550, 1079, -1016, -1385, 372, 1349, 789, -701, -492, 855, 1523, 325, -968, -75, 1403, 1065, -651]
3157f51O6J121L88p45p99kJ166K23r90p35N10R90k84j031k27J007K62o79l40K02
3177e48O57kl13n86N40M60On23l9P05j20o0M2J88j19J87J8j60m21M31L89l62o5
3200C05o2j10K73M1j94n05J02Q68l94r05L7O87J32o12n70M65M86J62o74o28M25
3221f71J237m16j101k08J464N84r57j081P47J270p7j035n91Q71J359k20j846o4
3239g35J936P00j899j051R80J888m71j791o99J569J448j127k287R5K631M24k396
3256g85j378J696J763p70k518j53K360J238j730k038P48K802J86k840j196K688
3272G3K111j530k479L52K866Q72k518j739J797K702l43l275o59L066J714k355
3288F55k611J242L036Lk809j608K225K508j374l420j83L471J112k850k444J769
$$ y = [-651, -585, 536, 924, 179, -620, -622, 544, 767, -223, -958, -448, 542, 258, -773, -1000, 7, 269, -410, -750, -548, 109, 107, -206, -792, -252, 208, 214, -309, -348, 357, 237, 177, 219, 407, 288, 475, 493, 333, -88, 343, 732, 370, 305, 243, 133, 406, 447, 253, -252, -150, 718, 324, -581, -544, 143, 275, -337, -907, -442, 44, 206, -468, -1096, -671, 566, 150, -951, -1159, 305, 889, -68, -1149, -402, 868, 791, -244, -835, 36, 1395, 1175, -671, -735, 1201, 1901, 2, -1049, -69, 1819, 1348, -443, -1142, 427, 1875, 748, -1539, -1444, 1187, 1611, -785, -2163, -467, 1296, 526, -1992, -2145, 215, 1453, -277, -2315, -1567, 1235, 1421, -1419, -2615, 73, 2184, 654, -1825, -1473, 1393, 2265, -253, -1992, -195, 2507, 2164, -1111, -1770, 1296, 3010, 655, -1956, -714, 2322, 2325, -484, -2092, 133, 2641, 1267, -2153, -2336, 1135, 2247, -603, -3047, -1278]
3304a278L163n28l282q13K544K424j994l071N89L530R63l401j903K471L230j213
3320A431l324k4L167J760k371k697J199L486J50l454j641L025K622k019l248N94
3336a344L271P44k872k236J639K972k29l600j098L180K055k330l331J502L240
3351A563J07l030j612K411K497r83l188n18L609J840k803k667J984L112j94l192
3367a064q74K491K241j616k771L24L189J141l157k005J917K840j099k840k82K508
3383I43J487k016k570R69K682K37k996j467K331K369j557l057O90K770P05k196
3399f76j680J344K430k44k501r01K563J715j606k389R18K715n7j939q92J350J880
3416B030r23j695k46J804J184j672j578Q73J825k45k017n28J628Q60r41j513K19
$$ y = [-1278, 1885, 1357, -1925, -2738, -194, 2230, 236, -2835, -2246, 1284, 2247, -1154, -3057, -586, 2644, 1431, -1893, -1917, 1250, 3010, 639, -2058, -859, 2627, 2777, -677, -2318, 707, 3329, 1310, -1938, -1344, 1927, 2671, -201, -2437, -798, 2174, 1945, -1655, -2753, 427, 2482, 152, -3179, -1677, 1563, 1670, -1360, -2972, -561, 1936, 953, -2235, -2753, 856, 2696, -107, -2774, -790, 2322, 2128, -1064, -1938, 553, 2794, 1178, -1593, -1269, 1920, 3061, -96, -2101, -184, 2656, 1557, -1283, -1565, 943, 2430, 414, -2156, -1187, 1495, 1732, -1264, -2731, -400, 1969, 412, -2645, -1955, 815, 1520, -676, -2356, -1012, 1418, 1174, -1327, -2228, 335, 2050, 444, -1945, -1027, 1688, 1631, -308, -1200, 150, 2030, 1107, -588, -834, 970, 2154, 482, -1096, -223, 1602, 1357, -660, -1188, 440, 1300, 359, -1154, -935]
3433i35J585K18j421j016Q54J489m58j467j27J262M78p57q47M83P67M83q14o47
3451h70O77R44k19j240M71P12L54n86m67K10O46K27p95k33N09M72k19p47J50N83
3471E79j6l44k26k0q8K48l70k22k9L19O4k27k0m7J53J19k91l5P8M7J59J78m14
3494d05J73M17k99L1o7K83L11M1k72l26M31K80k45k48j98O29K22l57n27P9O51
3515F04o4n81m13L24P73l33j063O0Q77J49p29q71P99R40k71j109j62Q39J078o11
3535B36j391M35J314L27j464n27J042J182m90j256j54J242Q41j016j388O69J709
3552A311j65j501o86J558J039q30j735L25J392O55j432j261P22J674jk041o46
3569a622K019J016j437j785O60J878O35k184j246J808J748p00k302nK262J075
$$ y = [-935, 650, 868, -553, -1569, -715, 774, 316, -1151, -1278, -16, 462, -295, -1142, -659, 108, 591, -223, -870, -193, 751, 532, -708, -237, 475, 829, 243, -224, -14, 632, 859, 64, -169, 340, 812, 593, -154, -4, 579, 563, 219, -7, -27, -115, 133, -237, -459, -488, -169, -105, -332, -352, -399, -246, -127, -418, -453, -375, -328, -169, 9, -405, -232, 185, -114, -83, -150, 133, 444, 485, 213, -113, 318, 598, 353, 105, -93, 536, 758, 401, -126, -47, 604, 540, -41, -454, -130, 643, 310, -753, -693, 184, 333, -396, -1267, -468, 472, 201, -908, -1070, -231, 847, 236, -1155, -720, 594, 921, -543, -1070, -28, 1154, 664, -592, -746, 496, 1337, 321, -1067, -398, 1311, 1146, -355, -1041, 517, 1556, 726, -1009, -684, 708, 1363, -69, -1330, -608, 1066, 1065, -976, -1622, 397, 1413, -24, -1809, -1149, 729, 1364, -820, -2066, -258, 1490, 790, -1512, -1517, 745, 1820]
3585A820j940j546J136K132l12k001p71J874J724j302k058K40K412N04j967j818
3601a873J724J919n41k454m64K220J342j585k078O90K527J5k430j024J893J986
3617A867j289k210J29K346R04j879j990J460K175k17k513o33K374J334j381k254
3633a777P20K426K42k130j290J640K141o31k535l55K388J129j700j957Q89K247
3649A447O4k369q40K007J292r42k264K08K397P45k025j771J463K250o40k241n36
3666a755K149J533j676j938O93K364M75k599r76J590J983r45k150j33K082J328
3682B025j964j555P60K005J00k213q50J899J465j244j914M48K075K33j693j122
3698a545J288J555m33j867k26J705R56j285j553R33J727j32j861k41J046J223
$$ y = [1820, -120, -1666, -530, 1602, 1290, -711, -1482, 392, 2116, 814, -1244, -1004, 1408, 1912, -55, -1873, -149, 1770, 1229, -1225, -1689, 531, 1873, 288, -1790, -1100, 1427, 1442, -988, -2012, -119, 1867, 578, -1632, -1503, 843, 1747, -132, -2122, -662, 1513, 1296, -1217, -1850, 524, 1858, 477, -1777, -1057, 1369, 1611, -519, -1809, -169, 1972, 1341, -1194, -1549, 839, 1968, 268, -1689, -800, 1447, 1511, -858, -1698, 309, 1601, 659, -1605, -1397, 1000, 1745, -280, -2051, -588, 1662, 1022, -1219, -1755, 394, 1927, 251, -1687, -994, 1370, 1845, -754, -1730, -140, 1843, 898, -1252, -1385, 697, 2025, 61, -1494, -734, 1271, 1371, -842, -1692, 207, 1672, 428, -1486, -1038, 1037, 1270, -423, -1545, -257, 1298, 865, -1002, -1228, 477, 1433, 148, -1405, -472, 1255, 1123, -738, -979, 67, 1290]
3714A290p23j711K59J628M63j458r91Q56J269j74j567R2R26J012q84j244L86J156
3732E85K47j255p88J127R43m21j122r7J250J92p05l15J42R60k55p28l43O74M18
3751E09l54n74K91N43P8m68m58L80L09r6n01J43J43M86l86l69J74L74l33o9k24
3772d02J64O6J61q9qq9J67k1n4N0m8J29J37o8j01j71J56L41j76j83K71j12k0n1
3796D9j20R9L01p1l99j01L17L22l56l89K69K95J11m82l86N82M4l8m62qL94L53
3818C24m32n48J98Q98j58o80l15O26N63k70k89m67Q73M75q82m24L15R69k45o76
3838a45m17O75Q73o17r35K12Q71L08p04r82N74J213l13j302k64J149O92q45j039
3857i96L05J121K23r94q87Q84R88j55j292q8J147N60q95j027P07J241o6j379o21
$$ y = [1290, 567, -1144, -885, 743, 1206, -252, -1243, -387, 882, 708, -859, -767, 159, 1171, 287, -957, -571, 585, 832, -423, -1211, -84, 859, 438, -684, -781, 469, 661, -44, -359, -217, 743, 488, -240, -583, 91, 509, 155, -419, -128, 415, 493, 25, -433, -53, 256, 160, -341, -198, -55, 431, 45, -324, -150, 224, -109, -178, -402, -238, -172, -11, -100, -108, -197, -30, -51, -105, -55, -103, 26, 163, 95, -6, -177, -21, 320, 144, -39, 232, 120, 100, 49, -71, 28, 329, 258, -141, -242, 75, 397, 41, -348, -79, 216, 327, -155, -541, 41, 85, 47, -415, -423, -29, 324, -108, -656, -458, 440, 282, -398, -713, -87, 476, 206, -83, -550, 323, 798, -84, -508, -193, 776, 531, -145, -562, 113, 986, 369, -566, -354, 517, 825, 121, -861, -287, 926, 613, -689, -953, 196, 888, 43, -996, -691, 430, 653, -341, -1228, -344, 644, 489, -803, -891, 256, 816, -79, -1106, -399, 842, 776, -603, -1224]
3876a224J346J243p64j465M60J365L20j230j003R51J328m39j677j44J277R70r99
3893C15j596M46J949n8j577q79J262J261r49j490J82J275Q83j417j180Q44J782
3910A053k14j774m13J616J128j102j353J44J793L72j479j049J197J704n60j835
3926g72p4J424J094j651j205R36J591p6j773o31J255J398r72j833M34J566N03
3943A214j547j034P98J517k83j846k58J460R92j051j480N41J795J33j368j175
3959a592J475J395p33j481N7J518L91p71j200P68J368j75j522n44J362J013q35
3976D94j352L61J315L99j276j181J168J125m83j563rJ267P43j094j160O26J048
3993D28K67j387p22J139R76m65j181L00J077N76j255r34R93J032k51r72j91Q57
$$ y = [-1224, 122, 1365, 601, -864, -404, 961, 1281, 51, -952, -1, 1327, 888, -789, -933, 344, 1314, 315, -1281, -835, 1114, 1056, -521, -1400, -138, 1123, 174, -1316, -1134, 141, 1024, -393, -1573, -729, 1053, 839, -935, -1348, 268, 1396, 294, -1059, -915, 878, 1250, -229, -1278, -81, 1623, 1063, -772, -846, 578, 1672, 21, -1184, -248, 1343, 1267, -506, -1137, 118, 1516, 544, -1289, -855, 711, 1214, -333, -1367, -569, 948, 665, -1181, -1439, 21, 1013, -38, -1518, -977, 818, 951, -417, -1592, -117, 1278, 545, -936, -879, 639, 1030, 259, -941, -173, 1195, 1020, -502, -1046, 316, 1329, 494, -858, -497, 818, 1217, -59, -1240, -72, 1053, 570, -993, -1002, 265, 1008, -86, -1246, -620, 428, 695, -692, -1414, -275, 701, 236, -945, -645, 432, 1008, -247, -1181, -188, 844, 593, -379, -570, 287]
4011B87P17n47j102L92J045J49j121m11Q87O64j97j387J19J088J71q00n39K89
4029b96P68O3j162k53R58N68n73j007L77Q16J6o77n31O20P29k47o56r7P75L46
4049E37m23n57L52L46J6k86j10J50O49o02n5j8L10j4k91K6O0J87j68j47k5J94
4071A31j01l1j15o9Q4l25L02k58L79j80j47k3L78l44m6O5L97J26m10N3j77M45
4093A34k84p7M50k10M56m49j35M28J51k22l98K24N8K75k78l87L77M69l56m00K07
4114C3J85K29n88m05K66N13q3o30M6L77M41m42n97J53O48Q7m20m12M20K65m8n22
4136d84k66J040L24p63m59N58P96n8q26n71R39P41n27p06n9Q10M33q31q31P42
4156BO90k45o82n04R51O11o51r03JJ265J1j019n09O99Q39k88r92j74J084N54r10
$$ y = [287, 1004, 457, -645, -253, 792, 941, -180, -591, 296, 960, 763, -624, -505, 583, 754, -46, -585, -296, 472, 535, -627, -880, 78, 646, 73, -934, -557, 259, 275, -402, -933, -313, 416, 169, -487, -584, 191, 537, 114, -443, -91, 255, 271, -15, -125, 25, 674, 72, 17, -1, 309, 295, 4, 30, 90, 277, 109, -38, -63, 131, 30, -1, -116, -185, -101, -426, -124, -382, -3, -183, -330, -353, 25, -319, -365, -300, 97, 223, -187, -134, -311, 134, -150, -227, 223, 13, 469, 20, -115, 313, 464, 242, -156, 68, 126, 401, 123, -264, 113, 582, 226, -174, 33, 218, 447, -141, -546, -280, 233, 150, -480, -434, -57, 384, -58, -655, -502, 146, 233, -187, -599, -179, 86, 38, -484, -750, 290, 614, -149, -608, -50, 746, 688, -138, -709, 230, 971, 444, -262, -321, 489, 922, 91, -740, 2, 692, 447, -235, -739, 212, 823, 172, -731, -730, 535, 546, -473, -982, -283, 556, 268, -724, -898, 186, 740, -170]
4177a70p35K22J518n4j296j68P64Q43n91j152L40J072O51j114r93O29J305k63
4195H08j134m87J207Q07r48j186L61J217J92j195n77P11J220m39j677K59J325
4212D64K58p42j003M01J289R4j495n16J316R43q33j201L63J418K64j242q56R94
4230h4J082m05j108k76J055P49q45j216P87J297q1j296n11R94J016p07j301J81
4248f69J215M28j192q83P52J120k47j285l15J128Q12q63r86K23J284J85j193m13
4266h99P21R70l19j399J99J028O66r19j021O13J078j36r28m74R74Q44o96r83N6
4285f25J198L45j108p07Q99Q95m65j242J42J167M5m50p29M0J327k0j247k08Q37
4304I4N68k39j268K50R04L23q79n00N69P82k51o69l16P49O80r17m69L87O74O2
$$ y = [-170, -905, -683, 835, 781, -515, -683, 81, 924, 333, -819, -479, 593, 1244, 130, -863, -234, 1071, 808, -326, -813, 394, 1201, 253, -933, -572, 645, 837, -358, -935, -224, 996, 557, -1120, -861, 464, 722, -20, -1023, -622, 667, 761, -734, -1250, 66, 1009, 176, -1025, -662, 756, 1020, -222, -1078, -84, 998, 593, -515, -791, 264, 1013, 168, -1048, -261, 1036, 955, -341, -852, 142, 1158, 451, -850, -669, 546, 974, -218, -1101, -349, 771, 524, -761, -1076, 52, 864, 1, -985, -762, 522, 707, -486, -899, -178, 792, 473, -926, -727, 301, 967, 48, -973, -360, 718, 582, -346, -820, 154, 998, 302, -681, -625, 573, 918, -190, -897, 2, 897, 432, -810, -668, 499, 544, 94, -635, -595, 732, 712, -535, -743, 94, 662, 423, -845, -595, 309, 632, -247, -747, -178, 604, 353, -316, -632, 117, 797, -120, -589, -202, 472, 534]
4324E34p70l32N63N83k87p99J6P25M00p44k89J28P27q2p54j44N18L78m03l63Q5
$$ y = [534, -236, -568, -5, 578, 291, -508, -492, 233, 633, -111, -400, -272, 455, 373, -381, -525, -7, 371, -32, -395, -310]
$$ [...]
8191a38
##END NTUPLES=NMR FID
##END=
