##TITLE=1H_LY-2Dix-40.24
 CD3CN,8 sc, 
 4.03.2021
##JCAMPDX= 6.0         $$ Bruker NMR JCAMP-DX V2.0
##DATA TYPE= NMR FID
##DATA CLASS= NTUPLES
##ORIGIN= UXNMR, Bruker Analytische Messtechnik GmbH
##OWNER= root
$$ XWIN-NMR		Version 3.5
$$ Thu Mar  4 11:37:12 2021 Russian Standard Time (UT+4h)  she@DPX200
##.OBSERVE FREQUENCY= 200.1315066352
##.OBSERVE NUCLEUS= ^1H
##.DELAY= (6, 6)
##.ACQUISITION MODE= SIMULTANEOUS
##.ACQUISITION SCHEME= undefined
##.AVERAGES= 8
##.DIGITISER RES= 18
##SPECTROMETER/DATA SYSTEM= spect
##.PULSE SEQUENCE= zg30
##.SOLVENT NAME= CD3CN
##.SHIFT REFERENCE= (INTERNAL, CD3CN, 0, 15.7039)
##AUDIT TRAIL= $$ (NUMBER, WHEN, WHO, WHERE, WHAT)
$$ ##TITLE= Audit trail, XWIN-NMR		Version 3.5
$$ ##JCAMPDX= 5.01
$$ ##ORIGIN= Bruker BioSpin GmbH
$$ ##OWNER= she
$$ F:/spectra/data/she/nmr/H-F/1/audita.txt
$$ ##AUDIT TRAIL=  $$ (NUMBER, WHEN, WHO, WHERE, WHAT)
(   1,<2021-03-04 11:36:00.01 +0400>,<she>,<DPX200>,
      <created by zg, POWCHK disabled, PULCHK disabled
       configuration hash MD5:
       00 E9 B6 7A A2 85 ED C7 34 08 36 98 17 FE 4E 26
       data hash MD5: 16K
       FF 19 4C 8E 4A B5 44 57 7D 80 B3 CB 08 09 16 05>)
$$ ##END=
$$ 
$$ hash MD5
$$ 54 06 F6 30 E9 44 8A E8 68 BE A9 23 11 46 75 6C
##$RELAX= 
##$RELAX= 
##$RELAX= 
##$RELAX= 
##$RELAX= 
##$RELAX= 
$$ Bruker specific parameters
$$ --------------------------
##$DU= <F:/spectra>
##$EXPNO= 1
##$NAME= <H-F>
##$PROCNO= 1
##$TYPE= <nmr>
##$USER= <she>
##$AMP= (0..31)
100 100 100 100 100 100 100 100 100 100 100 100 100 100 100 100 100 100 
100 100 100 100 100 100 100 100 100 100 100 100 100 100 
##$AQSEQ= 0
##$AQ_mod= 1
##$AUNM= <au_zg>
##$AUTOPOS= <>
##$BF1= 200.13
##$BF2= 200.13
##$BF3= 200.13
##$BF4= 200.13
##$BF5= 200.13
##$BF6= 200.13
##$BF7= 200.13
##$BF8= 200.13
##$BYTORDA= 1
##$CFDGTYP= 0
##$CFRGTYP= 5
##$CHEMSTR= <none>
##$CNST= (0..31)
1 1 145 1 1 1 1 1 1 1 1 1 1 1 1 1 1 1 1 1 1 1 1 1 1 1 1 1 1 1 1 1 
##$CPDPRG= <>
##$CPDPRG1= <>
##$CPDPRG2= <>
##$CPDPRG3= <>
##$CPDPRG4= <mlev>
##$CPDPRG5= <mlev>
##$CPDPRG6= <mlev>
##$CPDPRG7= <mlev>
##$CPDPRG8= <mlev>
##$CPDPRGB= <>
##$CPDPRGT= <>
##$D= (0..31)
0 1.2 0 0 0 0 0 0 0 0.06 0 0.03 0 0 0 0 0.0002 0 0 0 0 0 0 0 0 0 0 0 0 
0 0 0 
##$DATE= 1614843359
##$DBL= (0..7)
120 120 120 120 120 120 120 120 
##$DBP= (0..7)
150 150 150 150 150 150 150 150 
##$DBP07= 0
##$DBPNAM0= <>
##$DBPNAM1= <>
##$DBPNAM2= <>
##$DBPNAM3= <>
##$DBPNAM4= <>
##$DBPNAM5= <>
##$DBPNAM6= <>
##$DBPNAM7= <>
##$DBPOAL= (0..7)
0.5 0.5 0.5 0.5 0.5 0.5 0.5 0.5 
##$DBPOFFS= (0..7)
0 0 0 0 0 0 0 0 
##$DE= 6
##$DECBNUC= <off>
##$DECIM= 32
##$DECNUC= <off>
##$DECSTAT= 4
##$DIGMOD= 1
##$DIGTYP= 9
##$DL= (0..7)
0 120 120 120 120 120 120 120 
##$DP= (0..7)
150 150 150 150 150 150 150 150 
##$DP07= 0
##$DPNAME0= <>
##$DPNAME1= <>
##$DPNAME2= <>
##$DPNAME3= <>
##$DPNAME4= <>
##$DPNAME5= <>
##$DPNAME6= <>
##$DPNAME7= <>
##$DPOAL= (0..7)
0.5 0.5 0.5 0.5 0.5 0.5 0.5 0.5 
##$DPOFFS= (0..7)
0 0 0 0 0 0 0 0 
##$DQDMODE= 0
##$DR= 18
##$DS= 0
##$DSLIST= <SSSSSSSSSSSSSSS>
$$ [...]
##$SUBNAM2= <"">
##$SUBNAM3= <"">
##$SUBNAM4= <"">
##$SUBNAM5= <"">
##$SUBNAM6= <"">
##$SUBNAM7= <"">
##$SUBNAM8= <"">
##$SUBNAM9= <"">
##$SW= 16.9725356469052
##$SWIBOX= (0..15)
0 0 2 0 0 0 0 0 0 0 0 0 0 0 0 0 
##$SW_h= 3396.73913043478
##$TD= 16384
##$TD0= 1
##$TE= 0
##$TE2= 300
##$TE3= 300
##$TEG= 300
##$TL= (0..7)
0 120 120 120 120 120 120 120 
##$TP= (0..7)
150 150 150 150 150 150 150 150 
##$TP07= 0
##$TPNAME0= <>
##$TPNAME1= <>
##$TPNAME2= <>
##$TPNAME3= <>
##$TPNAME4= <>
##$TPNAME5= <>
##$TPNAME6= <>
##$TPNAME7= <>
##$TPOAL= (0..7)
0.5 0.5 0.5 0.5 0.5 0.5 0.5 0.5 
##$TPOFFS= (0..7)
0 0 0 0 0 0 0 0 
##$TUNHIN= 0
##$TUNHOUT= 0
##$TUNXOUT= 0
##$USERA1= <user>
##$USERA2= <user>
##$USERA3= <user>
##$USERA4= <user>
##$USERA5= <user>
##$V9= 5
##$VALIST= <valist>
##$VCLIST= <CCCCCCCCCCCCCCC>
##$VD= 0
##$VDLIST= <DDDDDDDDDDDDDDD>
##$VPLIST= <PPPPPPPPPPPPPPP>
##$VTLIST= <TTTTTTTTTTTTTTT>
##$WBST= 1024
##$WBSW= 4
##$XGAIN= (0..3)
0 0 0 0 
##$XL= 0
##$YL= 0
##$YMAX_a= 358590
##$YMIN_a= -414588
##$ZGOPTNS= <>
##$ZL1= 120
##$ZL2= 120
##$ZL3= 120
##$ZL4= 120
##$ABSF1= 10
##$ABSF2= 0
##$ABSG= 5
##$ABSL= 3
##$ALPHA= 0
##$AQORDER= 0
##$ASSFAC= 0
##$ASSFACI= 0
##$ASSFACX= 0
##$ASSWID= 0
##$AUNMP= <proc_1d>
##$AZFE= 0.1
##$AZFW= 0.1
##$BCFW= 1
##$BC_mod= 2
##$BYTORDP= 1
##$COROFFS= 0
##$CY= 11.3945322036743
##$DATMOD= 1
##$DC= 2
##$DFILT= <>
##$DTYPP= 0
##$F1P= 15.9154993809931
##$F2P= -4.1035820241983
##$FCOR= 0.5
##$FTSIZE= 0
##$FT_mod= 4
##$GAMMA= 1
##$GB= 0.15
##$INTBC= 1
##$INTSCL= 1
##$ISEN= 128
##$LB= 0.24
##$LEV0= 0
##$LPBIN= 0
##$MAXI= 10000
##$MC2= 0
##$MEAN= 0
##$ME_mod= 0
##$MI= 1.114404
##$NCOEF= 0
##$NC_proc= 0
##$NLEV= 6
##$NOISF1= 3.799351
##$NOISF2= 2.8
##$NSP= 1
##$NTH_PI= 0
##$NZP= 0
##$OFFSET= 15.70392
##$PC= 1
##$PHC0= -10923.11
##$PHC1= 13.40094
##$PH_mod= 1
##$PKNL= yes
##$PPARMOD= 0
##$PSCAL= 0
##$PSIGN= 0
##$REVERSE= no
##$SF= 200.130013532006
##$SI= 16384
##$SIGF1= 3
##$SIGF2= 2
##$SINO= 400
##$SIOLD= 16384
##$SREGLST= <1H.CDCl3>
##$SSB= 0
##$STSI= 0
##$STSR= 0
##$SW_p= 3612.71676300578
##$SYMM= 0
##$S_DEV= 0
##$TDeff= 0
##$TDoff= 0
##$TI= <>
##$TILT= no
##$TM1= 0
##$TM2= 0
##$TOPLEV= 0
##$USERP1= <user>
##$USERP2= <user>
##$USERP3= <user>
##$USERP4= <user>
##$USERP5= <user>
##$WDW= 1
##$XDIM= 8192
##$YMAX_p= 0
##$YMIN_p= 0
$$ End of Bruker specific parameters
$$ ---------------------------------
##NTUPLES= NMR FID
##VAR_NAME=  TIME,          FID/REAL,        FID/IMAG
##SYMBOL=    X,             R,               I
##VAR_TYPE=  INDEPENDENT,   DEPENDENT,       DEPENDENT
##VAR_FORM=  AFFN,          ASDF,            ASDF
##VAR_DIM=   8192,          8192,            8192
##UNITS=     SECONDS,       ARBITRARY UNITS, ARBITRARY UNITS
##FACTOR=    0.0002944,     1,               1
##FIRST=     0,             0,               0
##LAST=      2.4114304,     0,               0
##MIN=       0,             -414588,         0
##MAX=       2.4114304,     358590,          0
$$ Real data points
##PAGE= N=1
##DATA TABLE= (X++(R..R)), XYDATA
$$ [...]
372A1605l0317j60L0313J2450k5363k2664J5527K9182l281l0822r701K6805K0525
$$ 11605 -18712 -18872 11441 23891 -1472 -24136 -8609 20573 17292 -13530 -23231 3574 24099
385B4099j7901k7622N690K9626P228k6139j8249J8193K5686p000k8071n064K5328
$$ 24099 6198 -21424 -15734 13892 21120 -5019 -23268 -5075 20611 13611 -14460 -19524 5804
398E804J5813j8278k3139Q446K5879K169k3930j1945J8232J9027j0004k2525N44
$$ 5804 21617 3339 -19800 -11354 14525 16694 -7236 -19181 -949 18078 8074 -14451 -13907
411a3907K1957Q261j7880j5401J1184J9632k864k0591n358J8321J2575j2907j7307
$$ -13907 8050 16311 -1569 -16970 -5786 13846 10982 -9609 -14967 3354 15929 3022 -14285
424a4285N527J9498K476j8010r615J3726J5050p128j7453k36J6847P343j3311
$$ -14285 -8758 10740 13216 -4794 -14409 -683 14367 7239 -10214 -10450 6397 13740 429
437D29j2849P564J5592j087j5404n604J2283J0408p719j3152J835J3060L467j0880
$$ 429 -12420 -4856 10736 9649 -5755 -11359 924 11332 3613 -9539 -7704 5356 8823 -2057
451b057p939O917J0209k272j0613k361R216N930o236q059K715R033J115q112l984
$$ -2057 -9996 -3079 7130 4858 -5755 -8116 1100 7030 794 -7265 -4550 4483 5598 -2514 -6498
466f498O309O395l386p136N37P170K285n594m237L419N703r90n719j492M727L366
$$ -6498 -189 6206 2820 -4316 -3779 3391 5676 82 -4155 -736 4967 3977 -1742 -3234 1493 4859
482D859l038m699Q33M645Q92m018k840K446L510j136l632p34K738J658j785k297
$$ 4859 1821 -2878 -2045 2600 3492 -526 -3366 -920 2590 1454 -2178 -2912 -174 1484 -301 -2598
498b598M21K186N51j683j140R88J414r7r89j86Q16O14j42o6N8Q2J44N26L72m99
$$ -2598 -2177 9 560 -1123 -2263 -1275 139 42 -947 -1133 -317 297 155 89 147 229 373 899 1271 772
518G72o23O29J060k15j289l04J272P94j069j518K26J608L25j906j460J286J906
$$ 772 149 778 1838 1623 334 30 1302 2096 1027 -491 -265 1343 1668 -238 -1698 -412 1494
535A494q18k639n07K675J281k448k509J456L249k98l505j030L189K671k159l602
$$ 1494 676 -1963 -2470 205 1486 -962 -3471 -2015 1234 936 -2569 -3599 -410 2261 102 -3500
551c500R71M266J199l862k653L097M385j205m862o90M983K895l754m522K097N462
$$ -3500 -2529 1737 2936 -926 -3579 -482 3903 2698 -2164 -2854 2129 5024 1270 -3252 -1155 4307
567D307J38n440k503M352M271k709n587Q6N585K043n028m355K997N482j017o075
$$ 4307 4445 -995 -3498 854 5125 2416 -3171 -3085 2500 4543 -485 -4840 -1843 3639 2622 -3453
583c453j664N325L756m017n240J589O077Q30n663l036M419N049k106n908j61O114
$$ -3453 -5117 208 3964 -53 -5293 -3704 2373 3203 -2460 -5496 -1077 3972 1866 -4042 -4203 1911
599A911K902m722m686K933O321l14o217k177N518M407l550n793J024O260J493
$$ 1911 4813 91 -4595 -1662 4659 4345 -1872 -4049 1469 5876 2326 -3467 -2443 3817 5310
614E310n615m016L874N351j617o097j284N364L420m153n324J752N810N20n589
$$ 5310 -305 -4321 -447 4904 3287 -2810 -4094 1270 4690 537 -4787 -3035 2775 3295 -2294
629b294l011M175M701k238n571p2N458K495m322m146K623N411k32n299j870M771
$$ -2294 -5305 -1130 3571 1333 -4238 -4310 1148 3643 -679 -4825 -2202 3209 2977 -2322 -4192 579
645E79L973k940m995R60N519J446m828l326L484M692j385n250r58M916K827l628
$$ 579 4552 1612 -3383 -2423 3096 4542 -286 -3612 -128 4564 3179 -2071 -3029 1887 4714 1086
661A086m587J587N097M09n003k653L623M178k196n073j04M850K037m076l608K324
$$ 1086 -3501 -1914 3183 3592 -1411 -4064 -441 3737 1541 -3532 -3636 1214 3251 -825 -4433 -2109
677b109M576m65m583j475L975L200k443m125Q22M566J223l948k641K964L954j179
$$ -2109 2467 2002 -2581 -4056 -81 3119 676 -3449 -2627 1939 3162 -786 -3427 -463 3491 2312
693B312m164n38M044K237l094l343J639M021k2l894j784L065K938j873l815K36
$$ 2312 -1852 -2390 1654 3891 797 -2546 -907 3114 3092 -802 -2586 479 3417 1544 -2271 -2035
709b035L615J187l201k612J963L237o94l546p92K962J982k091k720P34L050N56
$$ -2035 1580 2767 -434 -3046 -1083 2154 1460 -2086 -2878 84 2066 -25 -2745 -2011 1039 1595
725A595k699j578K034K465q57k639k68K766J349k083j927J338K344j08k344o70
$$ 1595 -1104 -2682 -648 1817 960 -1679 -1947 819 2168 85 -1842 -504 1840 1732 -612 -1282
741a282K028J470j276k002M32K018M74j774j310J139J638n89j868k94J588Q76
$$ -1282 746 2216 940 -1062 -630 1388 1862 88 -1222 -83 1555 966 -902 -1196 392 1268
757A268j220j460N46J497j3j440o01J015J039n96j175L0J175M91q98p25N90R63
$$ 1268 48 -1412 -866 631 618 -822 -1423 -408 631 35 -1140 -1110 65 556 -342 -1067 -477 486
775D86m7q70k14Q82N83n16o37K64O92J23n38l73M23M85k08m89m4L97J91k72m95
$$ 486 439 -431 -645 237 820 304 -333 -69 623 746 208 -165 258 743 535 46 2 399 590 318 -177
796a77J44L24j05l21o5J08R5j35j50QJ17p1p4K7m7k0M8J04n2J1j7N4J65k1p7K1
$$ -177 -33 291 186 -135 -200 -92 3 -132 -282 -274 -157 -228 -302 -275 -322 -342 -294 -190 -242 -231 -248 -194 -29 -50 -127 -106
822a06J65K05j00k31L4L92Q3l60j82L60L27j82m36k5M00K54m77l97K35M55p0o01
$$ -106 59 264 164 -67 -33 359 442 82 -100 260 587 405 -31 -56 344 598 121 -276 -41 414 344 -257
844b57j92M26N05m21o35P0O18K31o35m39L98O51j29p66j07O93M60m66o51J92P99
$$ -257 -449 -23 482 61 -574 -504 114 345 -290 -729 -331 320 191 -575 -682 11 471 5 -646 -454 345
865C45J62p16m26O26P39l18q37k6R43M01p39o91M10Q98p4r65l17P87O49n52q93
$$ 345 507 -209 -635 -9 730 412 -425 -451 492 893 154 -537 -127 771 697 -268 -585 202 851 299 -594
886e94J17R30K48q65o44N55Q82j81j039k19R42N64o93q49L20R63J03r33m13O96
$$ -594 -477 453 701 -164 -808 -253 629 448 -591 -810 132 696 3 -846 -526 437 540 -393 -806 -110
906a10Q22l98r92N5R57M40q48p22N41R68n2j092k22R16O26o72q75L06R35J98r88
$$ -110 712 314 -678 -623 334 774 -74 -796 -255 713 661 -431 -653 263 889 217 -658 -352 583 781 -207
927b07n07O61Q36l71r53j16R23M70p30p81L87R70n5r71l40P76O59m58q70J51Q47
$$ -207 -714 -53 783 412 -541 -657 266 736 6 -775 -388 582 527 -444 -784 -8 651 193 -677 -526 321
948C21K63p22o15N32P51j48p77k02P00N18n05o87K28Q30J00p33m69O36O18l42
$$ 321 584 -138 -753 -221 530 382 -395 -597 103 621 116 -571 -343 487 587 -146 -615 21 639 297
968B97p27L4O50L47n77n81K89P52J3q46k08O19M93l86o71Q1O97K17n74m43L68
$$ 297 -430 -396 254 601 24 -557 -268 484 497 -349 -557 62 555 169 -502 -421 276 493 -81 -524 -156
989a56N36j46n93q6M77M02l35n49J57O06R9n75k95M41M83k42m81j08N56K40l91
$$ -156 380 234 -359 -445 32 434 99 -450 -293 313 412 -163 -458 -17 466 224 -257 -365 191 431 40
1010D0m43K83M62j0m65j68L45L30k45m51O5N30J09m49l05L27L52q1m40p2L65K05
$$ 40 -403 -120 342 332 -133 -301 44 374 129 -322 -257 273 382 -67 -372 -45 307 226 -214 -286 79 284
1032B84k33l39O5L82P1l32j95K47L28j67l66jL56J40l44k10K37K74Ml30n2K09
$$ 284 51 -288 -223 159 230 -102 -297 -50 278 111 -255 -256 100 240 -104 -314 -77 197 201 -129 -181 28
1054B8J89j40k34NL12J6k29q6J02K40j17k46LK44lj11j42J15J27lj10p9J08J58
$$ 28 217 77 -157 -152 160 176 -53 -139 -37 203 86 -160 -157 87 84 -27 -169 -54 73 70 -40 -119 -11 147
1078A47j09j50P1R9N3j13j01J16R0j4j46J3O9K1n7m3O0M9l2q1MO8Pl4J9l3N1Q
$$ 147 38 -112 -41 58 111 -2 -103 13 103 89 -57 -44 25 46 -11 -54 6 55 23 -58 -54 14 21 -13 6 -27 24 32
1106C2o8K3j3K4k9O5m9P2q8l0P9M2p4PM1O5j11J7l3P9l0m1j0K4O6m0l9lPR3m8
$$ 32 -36 -13 -26 -2 -31 34 -15 57 -31 -61 18 60 -14 -7 34 99 -12 5 -28 51 21 -20 -30 -6 60 20 -19 -22 -15 78 30
1137C0j12O0R8l0p5o8J04J00j01o0K5O2O5j55qM9R2Nj62l9J19J05j02j30J22R7
$$ 30 -82 -22 76 46 -29 -97 7 107 6 -54 -29 33 98 -57 -65 -16 76 81 -81 -120 -1 104 2 -128 -6 91
1163I1m8r5m2J18J54j48q7n4K14n5n9r1O5J43j9j24o8J30J17j30j29lK10m5j44
$$ 91 43 -52 -94 24 178 30 -57 -111 103 48 -11 -102 -37 106 87 -37 -105 25 142 12 -117 -120 90 45 -99
1188i9k7J41Q1o1j09k7J52J8j17j18J01J57nj91PJ45Q1p2j59J9J81P1j82p4J03
$$ -99 -126 15 96 35 -74 -101 51 69 -48 -166 -65 92 87 -104 -97 48 129 57 -102 -83 98 169 -13 -87 16
1213A6J28l0k39K6J75N2j11q3N4R4L4j59p2J13R8k8j42o8K05J5r9r5L1J65l8j30
$$ 16 144 114 -125 -99 76 128 17 -66 -12 82 116 -43 -115 -2 96 68 -74 -142 63 78 -21 -116 -85 80 42 -88
1239h8k0J49P2n8j71O1J64J4j83k3M4J62n4j26J3J29K0j28o9P8J18o6j24nJ71
$$ -88 -108 41 113 55 -116 -55 109 123 -60 -83 -39 123 69 -57 -44 85 105 -23 -92 -14 104 38 -86 -91 80
1264H0lj3j58K7J48K3j24j41J66Q7q3l3q3J32M4j09j00L5K08m5j20lQ7Q2p2p7
$$ 80 77 64 -94 -67 81 104 -20 -161 5 92 9 -24 -107 25 69 -40 -140 -105 103 58 -62 -65 22 104 32 -45
1290d5l4R2N3nj02K3R7j8q0m5J01M1p9m8K6J02K4r3p5R3j4J6o1q6R3M7o7k0Q3
$$ -45 -79 13 66 61 -41 -18 79 61 -19 -64 37 78 -1 -49 -23 79 103 10 -65 28 14 30 -31 -117 -24 23 -44 -64 19
1319A9j5Qn4o1Q4P9k7p2k5J3P9n7K6L2J8pm4k8L8P8l3q3KO5Qrn1KP0m4J4m9N9
$$ 19 4 12 -42 -103 -19 60 33 -39 -64 -51 28 -29 -3 29 47 40 -4 -32 6 84 51 -32 -30 35 43 34 -17 -15 55 11 25 -24 35
1352C5m5j9J1j7O0j8j1n4J0Q0k3r5M6M8N8o9j8J6lL0l9J1J2K8l3l7j7O0Rk7N3
$$ 35 -10 -29 -18 -35 25 7 -4 -58 -48 32 9 -86 -40 8 66 -3 -21 -5 -8 22 -17 -6 6 34 1 -36 -53 7 16 -11 42
1383D2k0M9k7K9r0oL2l0K2lMl1M3m0M3j2o2K1mK0lk3mR3j6m4QRL3q0K2K7qL4j5
$$ 42 22 71 44 73 -17 -23 9 -21 1 -2 2 -29 14 -26 17 5 -57 -36 -40 -20 -23 -46 -50 43 27 -17 -9 0 33 -47 -25 2 -6 28 13
1418A3n1P2l7j5K4jJ6m4L0l1K1N7o7nO7j7p0K1nK2K0o8pL5J5korPM7o4N1k8L6
$$ 13 -38 34 -3 -18 6 5 21 -23 7 -24 -3 54 -13 -18 49 32 -38 -17 -22 0 20 -48 -55 -20 -5 -7 -13 -22 -15 32 -32 19 -9 27
1452B7l5k5K0k1Q5n0K9k2k8K4jrQP2p6J2K5j4oo2J7L5L2k5l6j8P7Kn8o1P1Pmj6
$$ 27 -8 -33 -13 -34 51 1 30 8 -20 4 3 -6 2 74 -2 10 35 21 15 -47 -30 5 37 12 -24 -42 35 37 -21 -82 -11 -4 -8 -24
1486b4kK7J1n2M4J1L9l8j6Kl7P5ll9%L0j8Rpk1K2l8rL4K9L0n0mj0M1nq5M6l8R0
$$ -24 -26 1 12 -40 4 15 54 16 0 2 -35 40 37 -2 -2 28 10 19 12 -9 13 -25 -34 0 29 59 9 5 -5 36 31 -54 -8 -46 44
1521D4o5J9j0nKJ7J3o7O6K8l7k1j8R1j7p7O4j6L2j6j00P8O6n1p9O6LjJ6o8j2R4
$$ 44 -21 -2 -12 -17 -15 2 15 -52 14 42 5 -16 -34 57 40 -37 27 11 43 27 -73 5 71 20 -59 7 10 9 25 -43 -55 39
1553C9n4j1KK9k7M%J9KJ6k8ML4j5lj0K5n8P9Lr0O7J9j9J8l3QQ6j41K7M6o8M5J6
$$ 39 -15 -26 -24 5 -22 -18 -18 1 3 19 -9 -5 29 14 11 1 26 -32 47 50 -40 27 46 27 45 12 20 106 -35 -8 38 -30 15 31
1587C1l5l7O4Nj4l8K9M6m4j2K3j4l5O6j04N8K5jK4m5klM1m0L7k8JnO0m6j1ll1
$$ 31 -4 -41 23 28 14 -24 5 51 7 -5 18 4 -31 35 -69 -11 14 13 37 -8 -10 -13 28 -12 25 -3 -2 -7 53 7 -4 -7 -38
1620c8J04n4m1K9L1n7L9k0m2Q9l9k7M7Jj00M1L7k8PK6k4M5l9rj2L9KlJ0l0L1l6
$$ -38 66 12 -29 0 31 -26 13 -7 -49 40 1 -26 21 22 -78 -37 0 -28 -21 5 -19 26 -13 -22 -34 5 7 4 14 -16 15 -21
1652b1j5N4k2RK6j2kN0n6j1R%j9L8j7N1p8L9j6Ql0ooK8n4Q1l3J3j5K0lJ5l1Mj8
$$ -21 -36 18 -4 5 31 19 17 67 11 0 9 9 -10 28 11 62 -16 23 7 15 -15 -21 -27 1 -53 28 -5 8 -7 13 10 25 -6 -2 -20
1687b0j5O7m3M5n0j2OJ2k3M7l8QK7mol1M8kJ3m2J3j6M2l9J0MJ5J3ln3P0o6nM7
$$ -20 -35 32 -11 34 -16 -28 -22 -10 -33 14 -24 -16 11 7 1 -30 18 16 29 -13 0 -16 26 -13 -3 1 16 29 26 -27 43 -23 -28 19
1721A9o0M4J3l9lL4j6L9m7L3%j4L8J8n9L1j8rL2j4JnJko2P2l4%L4nQm9L5n5L0
$$ 19 -41 3 16 -23 -26 8 -8 31 -16 17 17 3 41 59 0 31 13 4 36 22 23 18 19 17 -45 27 -7 -7 27 22 30 -19 16 -39 -9
1756iK8K8r1KM2j7J7J3J2j3l0K6J1j7k8K4K4l8K1j1kJ1j5K0Jk1MK4Mn1J2J4J0
$$ -9 19 47 -44 -42 0 -17 0 13 25 12 -18 8 19 2 -26 -2 22 -16 5 -6 -8 3 -12 8 9 -12 -8 16 20 -31 -19 -5 5
1789Ek9K1j3K8Ll0j9MK3nNRJJ3k8J4Lm0k0N0P6j15R5n1M1l6l2N2l5M2l5k3J9L8
$$ 5 -24 -3 -16 12 15 -15 -34 -30 -7 -12 -7 2 3 16 -12 2 5 -35 -55 -5 71 -44 51 0 41 5 -27 25 -10 32 -3 -26 -7 31
1823C1m5%J7L8j1PRp1l1O1J3jl4l3N6k7K9J0l6O2p7O0n2O2k1qk4L7m1mJ9l1L9
$$ 31 -14 -14 3 41 30 37 46 -25 -56 5 18 17 -17 -50 6 -21 8 18 -18 44 -33 27 -25 37 16 8 -16 21 -20 -24 -5 -36 3
1856Ck8rL0m2J32p0m9O2KQl1%MRJ8k7l8K3k7j5K9N8j03j4O8j3J5jJ5K4m1RK7p
$$ 3 -25 -34 -4 -46 86 16 -33 29 31 39 8 8 12 21 39 12 -26 -3 -30 -45 -16 42 -61 -75 -7 -20 -5 -6 9 33 -8 1 28 21
1890B1J3lm2%KM0m6P2j8k2N6o8J4j9k1J6l4K0J6lOmk2J6k4L8Pl2%m5J01m4rM3
$$ 21 34 31 -11 -11 -9 31 -15 57 39 17 73 5 19 0 -21 -5 -39 -19 -3 -6 0 -4 -26 -10 -34 4 11 -21 -21 -66 35 -9 -18 25
1924B5r2R8m1L1l4J2K1l2LK7j1m6K6L2O5o3j2n8O3j0Ml0j9J4lK3pK3l2L6m2K5
$$ 25 -67 31 -10 21 -13 -1 20 -12 -9 18 7 -39 -13 19 84 21 9 -49 14 4 8 -22 -41 -27 -30 -7 -14 9 -23 13 -29 -4
1956dL4n4L2k5M3l5N2l7j9P0r2N6n4l7N1K9j2L0m5k6N4K2m0omL6j2K2l5qK6k3
$$ -4 30 -24 8 -17 26 -9 43 6 -13 57 -35 21 -33 -70 -19 10 -2 28 -17 -43 11 33 -7 -13 -17 19 7 29 -6 -14 12 -11
1988a1m4O9m4P2m9K3kkk6j6J3Jj0M7n6R0j00K2L7l0K8n8PM4J0l3O1k6k8L2j6L
$$ -11 -55 14 -30 42 -7 16 14 12 -14 -30 -17 -16 -26 21 -35 55 -45 -23 14 -16 12 -46 -39 5 15 -18 43 17 -11 21 5 8
2020HLj7J4K0qo2J9N0jl5P0r7J4j9O9j3j7Ln7j8P0ll3L1K5q7K7L8%j2jJ1Kj0L9
$$ 8 11 -6 8 28 20 -42 -23 27 26 -9 61 -36 -22 -41 28 15 -2 1 -56 -74 -4 -7 -40 -9 16 -71 -44 -6 -6 -18 -19 -8 -6 -16 23
2055B3k7l3N1l4PK8J1o1Q2m5n6M9rJ3j0Nl1k6O4%J6m1k8K5NN2o5L3j8L3n0L3R
$$ 23 -4 -37 14 -20 -13 15 26 -35 47 2 -54 -5 -14 -1 -11 -6 -37 -63 1 1 17 -24 -52 -27 -22 30 -35 -2 -20 13 -37 -4 5
2088Ek5O2p4L5J6Pn2K8PO6k2j9n9L9l3%M5l3J0j7l4K8l8M8m6P6j0knqJ1m6K1N3
$$ 5 -20 42 -32 3 19 26 -26 2 9 75 53 34 -25 14 -19 -19 26 -7 3 -14 -48 -20 -58 -10 -56 20 10 8 3 -5 6 -40 -19 34
2122C4oJ8k7m4M4Rl3j4K8j1%Nj1K8Nj7j2kK0k4k1M1jK3K1o0l7R1p7N4rp6K6L3
$$ 34 28 46 19 -25 19 28 -5 -19 9 -2 -2 3 -8 20 25 8 -4 -6 14 -10 -31 10 9 32 53 -7 -44 47 -30 24 15 -61 -35 -2
2156bn1J04n3k6O5m1J2k0k6KP6m5l6K8k6L9m0L4KJ8j5Mm3l1N5NM8o7P6n7l3O1
$$ -2 -53 51 -2 -28 37 -4 8 -12 -38 -36 40 -5 -41 -13 -39 0 -40 -6 -4 14 -1 3 -40 -71 -16 -11 37 -30 46 -11 -44 17
2188A7p0k3P6qOM3m9J0k9NJl1M1J4n7l0R6Nn3P0k7j9k1K3j1k1O1j8l0K2J0k%J
$$ 17 -53 -76 0 -8 -2 41 -8 2 -27 -22 -21 -52 -11 3 -54 -84 12 17 -36 34 7 -12 -33 -10 -21 -42 19 1 -29 -7 3 1 1 2
2222BM7m3k1N7p0J2K5jJ6k5j1J9j2J4N0p1N4Rq1J1j5O0m1rj1L6lK5k9K6J6j0K4
$$ 2 49 6 -15 42 -28 -16 9 8 24 -1 -12 7 -5 9 59 -12 42 51 -30 -19 -34 26 -15 -24 -35 1 -2 23 -6 20 36 26 50
2255E0m9k1pL4l5nL4J8L3o0Oj3K9m7O4k4m4M5L5l5mJNl0J5N2q9LO2L3q9O2m0L2
$$ 50 1 -20 -27 7 -28 -33 1 19 52 -8 -2 -15 14 -33 31 7 -37 8 43 8 4 5 10 -20 -5 47 -42 -39 23 56 -33 29 -11 21
2289B1K8n7K0k8K7l2L6l1K0K3j5Kn0L1k7Q1o9K2l5N6l5K5k0o0M4Pm0lO1ol3NK9
$$ 21 49 -8 12 -16 11 -21 15 -16 4 27 12 14 -36 -5 -32 49 -20 2 -33 23 -12 13 -7 -67 -23 -16 -56 -59 2 -4 -37 -32 -3
2322cRol%RJ5Pmj8JlM0n6N5n4J9Nl2QjK3n9M9J5l4j5M6m1M0j2j4k3O8m4L5n1J2
$$ -3 6 0 -3 -3 6 21 28 24 6 7 4 44 -12 43 -11 8 13 -19 -11 -12 11 -48 1 16 -18 -33 13 -28 12 0 -14 -37 31 -13 22 -29 -17
2359a7m9L3N9l9K4l4L9jj1Nr%Q4j02L1m3O0Qk3l2L8k5nJ5l4J3j5LN7j1k7l3J5
$$ -17 -66 -33 26 -13 11 -23 16 15 4 9 0 0 84 -18 13 -30 30 38 15 -17 21 -4 -9 6 -28 -15 -30 -27 30 19 -8 -41 -26
2392b6N5n0N7m2J3k3J3qOj4L5m1MN5o8P1m8M0o5%O5mJ3l8K0j7k3j1O1Nk8J3o2
$$ -26 29 -21 36 -6 7 -16 -3 -11 -5 -19 16 -25 -21 34 -34 37 -11 29 -36 -36 29 25 38 0 20 3 -20 -31 30 35 7 20 -42
2425d2K3K6k1j3J4J6Oj1j1j2N1n1nL0Lj7L5j2J4m4L0L6p0K7k3K0N8n8J3Poo%%
$$ -42 -19 7 -14 -27 -13 3 9 -2 -13 -25 26 -25 -30 0 3 -14 21 9 23 -21 9 45 -25 2 -21 -1 57 -1 12 19 13 7 7 7
2459GpK7n1M3nj6l8L9K5n9J8J7j5J6n6P2q0N8j3LK8Q%k3k6l1J2P3J7j8L6o1p4
$$ 7 0 27 -24 19 14 -2 -40 -1 24 -35 -17 0 -15 1 -55 17 -63 -5 -18 -15 13 21 21 -2 -28 -59 -47 26 43 25 61 0 -74
2492g4N8Rk3M6qm1oK3L3q3N9J0K2j0n9P7k7l9K9j8J0k0nL2QrLj8L3J8j5rK7m2
$$ -74 -16 -7 -30 16 8 -33 -39 -16 17 -66 -7 3 25 15 -44 33 6 -33 -4 -22 -12 -32 -37 -5 3 -6 -3 -21 12 30 15 6 33 -9
2526iK%J1k8R4q4N8m2M0k7n7J4M7n3K7l1R7m8Mm4j7J6j2P5m7j4K1M2o1K5jj9J5
$$ -9 -7 -7 4 -24 70 -14 44 2 42 15 -42 -28 19 -34 -7 -38 59 11 15 -29 -46 -30 -42 33 -14 -28 -7 35 -26 -1 -2 -21 -6
2559f%NqK6l5L5%K3l6Po1L6M3m1QKlrKlL3j5kj0J9J3q6RM0j0KM3%m7J4L3p7N6
$$ -6 -6 -1 -9 17 -18 17 17 40 4 11 -50 -14 29 -12 -4 -2 -5 -14 -12 -15 18 3 1 -9 10 23 -63 -54 -14 -24 -22 21 21 -26 -12 21 -56 0
2597@No9O4Nl3L3J0M0p0M4k0l3K5j0K2MPl9K7j1j1RM0m0Kl3L5j3K5Lp4R6n5l9
$$ 0 5 -64 0 5 -28 5 15 55 -15 29 9 -24 1 -9 13 17 24 -15 12 1 -10 -1 39 -1 1 -32 3 -10 15 18 -56 40 -15 -54
2631e4M7J3k4J0Lj4M0n6PN6k0Nl4j4K7J8K5n4M0jj8%%lJ4l8K0K7q1M7L3oN2l9
$$ -54 -7 6 -18 -8 -5 -19 21 -35 -28 28 8 13 -21 -35 -8 10 35 -19 21 20 2 2 2 -1 13 -25 -5 22 -59 -12 21 15 67 28
2665B8q5N9k0k0%Q4k8m2L5J2o3KM8J2k5j7K6jqQm2Q3j7%Oo3Q1n3K6j1j5L8ll5
$$ 28 -57 2 -18 -38 -38 46 18 -24 11 23 -40 -38 10 22 -3 -20 6 5 -3 5 -37 46 29 29 35 -28 53 0 26 15 0 38 35 0
2699@L3p2J7J5k4L5k2O9n5nK9o2P3j4l5M1l4K9j1nm6J6Q7p9L5k0oM7n4M0rJ3K
$$ 0 33 -39 -22 -7 -31 4 -18 51 -4 -9 20 -42 31 17 -18 23 -11 18 7 2 -44 -28 59 -20 15 -5 -11 36 -18 22 13 26 28
2732B8mn0L1O%m6L8j3L2o1R1n7j0K8r2R4rm6J0O7m7J6j5Lj9Nl7M9nOj8O0m2l4
$$ 28 24 -26 5 11 11 -35 3 -10 22 -39 52 -5 -15 13 -79 15 6 -40 -30 37 -10 6 -9 -6 -25 -20 -57 -8 -13 -7 -25 35 -7 -41
2766d1N0J1k4n2O2OJ2n9nN8r3Q6J5j0l4K8J4o1K5L5qj5m3M3%o1M2k6L3P2k9j5
$$ -41 9 20 -4 -56 6 12 24 -35 -40 18 -75 11 26 16 -18 10 24 -37 -12 23 15 0 -43 0 0 -61 -19 -45 -12 60 31 16
2798A6jJ5k7m3j9Q7jNo2N5j5K7Kp4R4l1km2k2L8k5M3j5Km0L9L0m6ml9P7ol7K8
$$ 16 15 30 3 -40 -59 28 27 32 -30 25 10 37 39 -35 59 28 26 -16 -38 0 -25 18 3 5 -35 4 34 -12 -16 -55 22 16 -21 7
2832GLn0K9j3l2M8K5k9J2J7k7N8p0L8k8O3n3J4ql0K9J2m7J1K0N0l0l2M6l8K5m6
$$ 7 10 -40 -11 -24 -56 -8 17 -12 0 17 -10 48 -22 16 -12 51 -2 12 4 -26 3 15 -32 -21 -1 49 19 -13 33 -5 20 -26
2864b6M8k6m8K9K2j8pJ4rN4K0q8M2K3n1J0jj4j9J2K9N8q7M0K4o2P2j7j0K4l6k4
$$ -26 22 -4 -52 -23 -1 -19 -26 -12 -21 33 53 -35 7 30 -21 -11 -12 -26 -45 -33 -4 54 -33 7 31 -31 41 24 14 38 2 -22
2896b2K4L9n4Ql2K1K8j1L3j4j2j4l3J5J1JJ9O2p8Lk0J2Rk1M2o5M5j9J8j0LK3L
$$ -22 2 41 -13 -5 -37 -16 12 1 34 20 8 -6 -39 -24 -13 -12 7 69 -9 -6 -26 -14 -5 -26 16 -49 -4 -23 -5 -15 -12 11 14
2929A4j7Rj2PK0k1l6L6K4qm2qO8ol3j4Mk1lK3j9L4j5J2K5K6p0rO4m5onM1m8J2
$$ 14 -3 6 -6 1 21 0 -36 0 24 16 -26 -34 34 28 -5 -19 -15 -36 -39 -16 -35 -1 -16 -4 21 47 -23 -32 32 -13 -19 -24 17 -31 -19
2964a9k6J07r9N4n7O4l6%K2k5L5k9Qk7N0k4J1%R%L1j3kj1k3l0j4L0nM6J7o9L8
$$ -19 -45 62 -37 17 -40 24 -12 -12 10 -15 20 -9 -1 -28 22 -2 9 9 18 18 49 36 34 23 0 -30 -44 -14 -19 27 44 -25 13
2997A3L2Mp7M2Jo8J00p7L7k3J6jlK4j0k8O0l7m0K9L0l4K7L8o4J1Ok7K3k8J2L0
$$ 13 45 49 -28 14 15 -53 47 -30 7 -16 0 -1 -4 20 10 -18 42 5 -35 -6 24 -10 17 55 -9 2 8 -19 4 -24 -12 18
3029A8l1N2j21R5kk6J3l9K4K6o7Q2m2M0n8QO9ml5l4P8r0O1j5MjL1k0mj4L2m1J
$$ 18 -13 39 -82 13 11 -15 -2 -41 -17 9 -58 24 -18 22 -36 -28 41 37 2 -32 46 -44 17 2 6 5 36 16 12 -2 30 -11 -10
3062a0moN0o3M9o6M2k5Q8k3k4m4RM1k0L3m9L6n6Q1m0J5n5P7m2l6M4Lk8J8J9j3
$$ -10 -14 -20 30 -33 16 -50 -8 -33 55 32 8 -36 -27 14 -6 27 -22 14 -42 39 -1 14 -41 36 -6 -42 2 5 -23 -5 14 1
3094AM3l4L3m2K1lK4p5N8o1J5j5M9q3O3ko4M6J3OJ1l4N2qL6o8jL3rJ7j1m1L5R
$$ 1 44 10 43 1 22 19 43 -32 26 -35 -20 -35 14 -69 -6 -8 -72 -26 -13 -7 4 -30 22 14 50 -18 -19 14 5 22 11 -30 5 14
3128A4oL1jj4ol8J4N5o5J5L3o3P5j1j6jo6O5J0l9rN7l5QOj5K2%m9M2mN4n0Pj8
$$ 14 8 39 38 24 18 -20 -6 49 -16 -1 32 -31 44 33 17 16 -50 15 25 -14 -23 34 -1 7 13 -2 20 20 -29 13 9 63 13 20 2
3163Bkl1PN5l2K4Rj0j7j9M9k9J5l7L2m8O7k0m7J01j15R5l3j04J16j3L2lq0L2j0
$$ 2 0 -31 -24 31 -1 23 32 22 5 -14 35 6 21 -16 16 -32 35 15 -32 69 -46 49 16 -88 28 15 47 44 -36 -4 -14
3194a4K0k1Mj0ORL0L3m8m1L6l2M6j0jPn7N0k6M9PLp4P3o0J9RJ8k8j6QqN1J6n8
$$ -14 6 -15 -11 -21 -15 -6 24 57 9 -32 4 -28 18 8 7 14 -43 7 -19 30 37 40 -34 39 -21 -2 7 25 -3 -19 -11 -19 32 48 -10
3229a0LL6l0j2Pn9P0j0j7M4l8j1M1l0J1L7j05Q6J7m8k9N9L1K5k5q7N4Rl4j7M2
$$ -10 -7 29 -1 -13 -6 -65 5 -5 -22 22 -16 -27 14 -16 -5 32 -73 13 30 -18 -47 12 43 68 43 -44 10 19 -15 -32 10
3260A0Lm2M0j7kKL7o6J2O4J3o1P1j10L9j6K2rL3J0m9J2J4kP2q8L3j5l5N3k3L0
$$ 10 13 -29 11 -6 -8 -6 31 -35 -23 41 54 -7 64 -46 -7 -23 -1 -10 23 33 -16 -4 10 8 80 -8 25 10 -25 28 5 35
3292C5J7k5l2%J5RJ4j9l%L6lp5POK2j3npM5l3jjJ5Qj7M9j4j8M4l4k5lK6K1p8R9
$$ 35 52 27 -5 -5 10 19 33 14 11 11 47 44 -31 -24 -18 4 -9 -14 -21 24 -9 -10 -11 4 12 -5 44 30 12 56 22 -3 -6 20 41 -37 62
3329F2J4q5K0Kl8j2j1L6j7O3m5j5J2kmj7J9j5J4Q3r0K6k0L2J5rm3l0M8l4N4k7
$$ 62 76 -9 11 13 -25 -37 -48 -12 -29 34 -11 -26 -14 -16 -20 -37 -18 -33 -19 64 -26 0 -20 12 27 18 -25 -55 -7 -41 13 -14
3361a4JM6m8L4K0K4l6Kl2m4K4M7K2j1m2J2j8J8kJ6K8o7L7pl7K0j5O9k4k4l0%K0
$$ -14 -13 33 -15 19 39 63 27 29 -3 -47 -23 24 46 35 -7 5 -13 5 3 19 47 -20 17 10 -27 -7 -22 47 23 -1 -31 -31 -11
3394a1L0k0JJ0q6J18n3K3kj5j1K3j9L3J6p5J5N3qK1n1QJ8m0M5k7N4o3J0k5Mk1
$$ -11 19 -1 0 10 -76 42 -11 12 10 -5 -16 7 -12 21 37 -38 -23 30 22 43 -8 0 18 -22 23 -4 50 -13 -3 -28 -24 -45
3426d5qO8j7M3l4K1l0ll0O2J2m2qOj9K4m7N2J7J2j7q2J56j04K5j3L0l6lM1rOj0
$$ -45 -53 15 -2 41 7 28 -2 -5 -35 27 39 -3 -11 -5 -24 0 -47 5 22 34 17 -65 91 -13 12 -1 29 -7 -10 31 22 28 18
3459A8K1j2m5J6L3m9J7k2K8j2l8O7m0j4jRN5Oj3rm5K5L4l9M0j9m0L3k8kPL1k6
$$ 18 39 27 -18 -2 31 -18 -1 -23 5 -7 -45 22 -18 -32 -33 -24 31 37 24 15 -30 -5 29 -10 30 11 -29 4 -24 -26 -19 12 -14
3492a4J9K1mnM5k5QJ8o2j3k3P0o3lrL1K3lkLp0L4J0M5j7LJ2n4N1m8J3L0n4K8N5
$$ -14 5 26 22 17 62 37 45 63 1 -12 -35 35 -28 -31 -40 -9 14 11 9 12 -58 -24 -14 31 14 17 29 -25 26 -22 -9 21 -33 -5 50
3527E0rJ9l7lo4O0J9k0%p8M3L4jk1Kk4K8J2mm1M2k4J0J9j7j2L8l9j5M1J6m9N7
$$ 50 41 60 23 20 -44 16 35 15 15 -63 -20 14 13 -8 -6 -30 -2 10 6 -35 7 -17 -7 12 -5 -17 21 -18 -33 8 24 -25 32
3560C2rl8j5NK5k2M4lJ5n5M8m6L4l1K4M2n5jJ7n4N2m0K2K2Km2pk8O0k8J9J7n3
$$ 32 23 -15 -30 -25 0 -22 22 19 34 -21 27 -19 15 -16 8 50 -5 -6 11 -43 9 -31 -9 13 15 -27 -34 -62 -2 -30 -11 6 -47
3593d7M5j4M0o1KO8K2p8j4O3j5mM1o2J6J2J5J1Nl9J7n3O3j9J3K7l5r%m5j2L5L7
$$ -47 -2 -16 24 -37 -35 33 55 -23 -37 26 11 7 48 -14 2 14 29 40 45 6 23 -30 33 14 27 54 19 10 10 -35 -47 -12 25
3626B5k3k2j1j2P5k6rL7l7k1qM3N4p4K7M7p1jL4j7Mmj1Qj8J7%j4l3j3Q9l2K2k4
$$ 25 2 -20 -31 -43 32 6 -3 34 -3 -24 -32 11 65 -9 18 65 -6 -7 27 10 14 10 -1 7 -11 6 6 -8 -41 -54 35 3 25 1
3660Al3J8n8J00%k6l1N%L3kml4O1k6j1PMl8L1j3O9l2K6m7J7j6m9O2%K6m1kJ3K
$$ 1 -32 -14 -72 28 28 2 -29 -24 -24 9 7 3 -31 30 4 -7 0 4 -34 -3 -16 53 21 47 0 17 1 -48 14 14 40 -1 -3 10 12
3695A2J2q5O8mm1P6p8P0m4L9j4j7M0l8Rj0k6L0qLk2O2o1rK9R4m8k3mj0k7O0J2
$$ 12 24 -61 7 3 -38 38 -40 30 -14 25 11 -6 34 -4 5 -5 -31 -1 -9 -6 -28 34 -27 -36 -7 87 39 16 12 2 -25 35 47
3728D7l4J0j4M3q4K7J8N4%p1Pm4J2RJ2L7J4o6K4kj3O3n0j9RQK0l3K0L0n4j1K1
$$ 47 13 23 9 52 -32 -5 13 67 67 -4 3 -41 -29 -20 -8 29 43 -23 1 -1 -14 49 -1 -20 -11 -3 17 -16 4 34 -20 -31 -10
3761a0%K1m1J3M3l6LmL6l6Q5p9j7J2J0K1J0l6l0lK0M6o7%L3lk5K3k6L0J7j7l8
$$ -10 -10 11 -30 -17 26 -10 -7 -11 25 -11 74 -5 -22 -10 0 21 31 -5 -35 -38 -18 28 -39 -39 -6 -9 -34 -11 -37 -7 10 -7 -45
3794d5L1j1M4m4k3M2J5m0j2K5O4l3m0RK5RQo3R3o8K0j7L6m6ooK3l0O1k5k6L2n2
$$ -45 -14 -25 19 -25 -48 -6 9 -31 -43 -18 46 13 -27 -18 7 16 24 -39 54 -14 6 -11 25 -21 -27 -33 -10 -40 21 -4 -30 2 -50
3827e0L4m2K6onM2M2m3j1K7l2RL1m0k0Q0p1L2J4k6M7k0l2j2K6kKJ0N0o2Mql2Q6
$$ -50 -16 -58 -32 -38 -43 -1 41 -2 -13 14 -18 -9 22 -18 -38 42 -29 3 17 -9 38 18 -14 -26 0 -2 0 10 60 -2 2 -6 -38 48
3861D8m1m2O6nj3k0Rk0N3m9KM4j3o1j0O1RL4p4j0j3K3M3ol0J1k1O0Mm8J3k0J1
$$ 48 7 -35 31 26 13 -7 2 -18 35 -14 -12 32 19 -42 -52 9 18 52 -22 -32 -45 -22 21 15 -15 -4 -25 35 39 -9 4 -16 -5
3894ek2k6P8n5M3j8j0k1M1m6L0Q2j35QL4K8K2o9K5N8m5m2J05r5N7j8M0l2j4J0
$$ -5 -27 -53 25 -30 13 -5 -15 -36 5 -41 -11 71 -64 -56 -22 6 28 -41 -16 42 -3 -45 60 -35 22 4 44 12 -2 8
3924Hj2J2l0J0oN9k0Mm5J7K9O6j31rK9M5k5j8j1L6j0L0Nl5nl5L5Kk4PQj5%LL8
$$ 8 -4 8 -22 -12 -18 41 21 25 -20 -3 26 92 -39 -48 -19 26 1 -17 -28 8 -2 28 33 -2 -7 -42 -7 -5 -29 -22 -14 -29 -29 -26 12
3959A2jk0k%K8j6K0j9J3j9LJ3j0N6l5k6l0rN4m6J2L9m0j9O8o6K3L5m7K5m3M5%
$$ 12 11 -9 -11 -11 17 1 21 2 15 -4 -1 12 2 58 23 -3 -33 -42 12 -34 -22 17 -23 -42 26 -40 -17 18 -29 -4 -47 -2 -2
3992bJ8l9k3O4K2n9QL0J1k0J2j8J8kj6Nj8L1j8K5k8k8J2j6L4k2L3n2J0J5j7L0
$$ -2 16 -23 -46 18 40 -19 -11 19 30 10 22 4 22 20 4 9 -9 22 4 29 1 -27 -15 -31 3 -19 14 -38 -28 -13 -30 0
4024@l7L1j3j0J0K9j7L3m5KK5n0L2%K6j1K7L8J1r4M7q4Q5nk5L4l1K9n0J2Km2K4
$$ 0 -37 -6 -19 -29 -19 10 -7 26 -19 -17 8 -42 -10 -10 16 5 32 70 81 -13 34 -50 35 30 5 39 8 37 -13 -1 1 -41 -17
4057a7On5O4jkK5j8k1QK2j7L2m8K0JKk9k8N3KJ3kJ4k6K1j7M0o0mPK3lj8K3Mm9
$$ -17 -11 -66 -2 -3 -5 20 2 -19 -11 11 -6 26 -22 -2 -1 1 -28 -56 -3 -1 12 10 24 -2 19 2 42 -18 -22 -15 8 5 -13 10 14 -35
4093c5P0Nl4oo7K7M3j9J6m2qL7K7l3J7Qk2Q0q6jJ8Kl1L1l8L7k7P2l1k3j8R3l1
$$ -35 35 40 6 0 -67 -40 3 -16 0 -42 -50 -13 14 -19 -2 6 -16 64 -22 -23 -5 -3 -34 -3 -41 -4 -31 41 10 -13 -31 62 31
4126C1l0LoK5o1N4n7M1J5j8L2n0N7km2J3m4M9k7J4j8oK7Ok1L1jn5O2k3l7O0l4
$$ 31 1 4 -2 23 -38 16 -41 0 15 -3 29 -21 36 34 -8 5 -39 10 -17 -3 -21 -27 0 6 -15 16 15 -40 22 -1 -38 22 -12
4159a2K1K2Lm9L5j5l4O9n1K2l3L1Op0P1l8k5P8m0qn4L1L0J8k1l5O3J4l2j4jM5
$$ -12 9 31 34 -15 20 5 -29 40 -11 11 -22 9 15 -55 16 -22 -47 31 -9 -17 -71 -40 -10 8 -13 -48 15 29 -3 -17 -18 27
4191B7n6LO9nj21Q6J5J5k0m7L3K7m7M1l2K1P0k8l6oooM1k4N1j21J00m2l4O3j6
$$ 27 -29 -26 43 38 -83 3 18 33 13 -34 -1 26 -21 20 -12 9 79 51 15 9 3 -3 38 14 65 -56 44 2 -32 31 15
4222A5p1J20o5plN8q5L9l7J7N0j03J02l1L9n3Nm1M2M1n3K7J5l3J9J0l8J9j0M0
$$ 15 -56 64 -1 -8 -11 47 -38 1 -36 -19 31 -72 30 -1 38 -15 -10 -51 -9 32 -21 6 21 -12 7 17 -21 -2 -12 28
4252B8j0J6n5O4J0q9M2p6J8L6m4J3J7L8j2Rl5Jl0M9OJj8j3K0J5NK2k8p5O1Kkj2
$$ 28 18 34 -21 43 53 -36 6 -70 -52 -16 -60 -47 -30 8 -4 5 -30 -29 -59 -10 -4 -3 -21 -34 -14 1 6 28 0 -75 -14 -12 -14 -26
4286b6N5Qn7N1K5k9l7k1K4J1k6pmO3L6o6k4M1j8Oj5Ll0J0l6L9k7O2l8N2Rl1M7
$$ -26 29 37 -20 31 56 27 -10 -31 -7 4 -22 -29 -33 30 66 0 -24 17 -1 5 -10 -7 -37 -27 -63 -24 -51 11 -27 25 34 3 50
4319E0n3K3k0n3J06n3j7NJrk3L6rqM4p7L7J1%O4o7K1o2P4o8N0j3N2o6n0N6K5l8
$$ 50 -3 20 0 -53 53 0 -17 -12 -11 -20 -43 -7 -16 -24 20 -57 -20 -9 -9 55 -12 9 -53 21 -47 3 -10 42 -24 -74 -18 7 -31
4352c1P0l8K0o5O1k0KPK4K9m0k3K6l6L0k5N0r8N8M5r7L9l3RK1oj8L3K9rpml3N4
$$ -31 39 1 21 -44 17 -3 -1 6 30 59 19 -4 22 -14 16 -9 41 -57 1 46 -51 -12 -45 -36 -15 -21 -39 -6 23 14 7 3 -30 24
4386B4n2O4l2m2K1L3j8k7L7l2K7K0j3J1nj4PQRMm3J9l8P1j9k3J3k5J8j3kqm5M7
$$ 24 -28 36 4 -38 -17 16 -2 -29 8 -24 3 23 10 21 16 2 9 17 26 30 -13 6 -32 39 20 -3 10 -15 3 -10 -12 -20 -65 -18
4420a8l3J3K5j3OJ4m2R9k9o4N3K2l2k2nlNP4n0l1K1K8J6p2M4k4M1m1J6j1J7J6
$$ -18 -51 -38 -13 -26 -20 -6 -48 51 22 -42 11 33 1 -21 -26 -29 -24 50 0 -31 -10 18 34 -38 6 -18 23 -18 -2 -13 4 20
4452B0J0j4k9m4L5J1K7p8O4o7P0k7j9J6J5j0k5O5q9J00m3j0K4l8J5P3m0jJ3l1
$$ 20 30 16 -13 -57 -22 -11 16 -62 2 -65 5 -22 -41 -25 -10 -20 -45 20 -69 31 -12 -22 2 -36 -21 52 12 11 24 -7
4482gL5k9L2k7K6l3mL5l9j0L2M0p0O6o8K6l9M5%j9J6l0K3m2M8rl6P4m9K1l2mM
$$ -7 28 -1 31 4 30 -3 -7 28 -11 -21 11 51 -19 47 -21 5 -34 11 11 -8 8 -22 1 -41 7 -2 -38 36 -13 8 -24 -28 -24
4515b4M8l2j2pK7j0M1k2J4k0k2K6l0Q6r1lM4j1l9M1k0k0MM3m4M0n9N5nMm0O9M
$$ -24 24 -8 -20 -27 0 -10 31 9 23 3 -19 7 -23 63 -28 -31 13 2 -37 4 -16 -36 -32 11 -33 7 -52 3 -2 2 -38 31 35
4548C5n3jK6NpqK3orpJ2j7m3K2PM4m0K0%l0N6p5K1L6K2o1J1j1lN6jm6K5k2k4Q8
$$ 35 -18 -19 7 12 5 -3 20 14 5 -2 10 -7 -50 -28 -21 23 -17 3 3 -27 29 -46 -25 11 33 -28 -17 -28 -31 25 24 -22 3 -19 -43 45
4584D5r6N4lj1%qQL0j5j3J9N9q1J4J5k6K3K0k5k9mJ4j7M6L2m8Ll0M6j6rJ8j5K9
$$ 45 -51 3 0 -11 -11 -19 -11 19 4 -9 10 69 -12 2 17 -9 14 34 9 -20 -24 -10 -27 19 51 3 6 -24 22 6 -3 15 0 29
4618B9n6j1k4N5Jl9J6L0ml4P9p6K8k9J5kM4m3L3nJ0j5J3L4p1K9J4n0K0qK2j3K7
$$ 29 -27 -38 -62 -7 -6 -45 -29 1 -3 -37 42 -34 -6 -35 -20 -22 22 -21 12 7 17 2 15 49 -22 7 21 -29 -9 -17 5 -8 19
4651A9m8L3k6J8K4K2l1l4N3r8R7o3M6M3n0Rn6N8j6Ln4P9Lj9j3lj1L6J8m9L0n3
$$ 19 -29 4 -22 -4 20 42 11 -23 30 -68 29 -34 12 55 5 14 -42 16 0 3 -51 28 31 12 -1 -4 -15 21 39 -10 20 -33
4683c3N4l2K2l6L7n4Q0m3m4L9jJ3J4n8K8K8o3M1M7n1j0j7J5P9n7j8qlK7j4OrO5
$$ -33 21 -11 11 -25 12 -42 38 -5 -49 -10 -11 2 16 -42 -14 14 -49 -8 39 -12 -22 -39 -24 55 -2 -20 -28 -31 -4 -18 -12 -21 44
4716D4j9j9k1P0m7mJ8n9P2l7NJ7k0j3ok1M5kj8J1Nl2K3K4J1j5j7K3p3J8J7J4K6
$$ 44 25 6 -15 55 8 4 22 -37 35 -2 3 20 0 -13 -19 -40 5 3 -15 -4 1 -31 -8 16 27 12 -5 18 -55 -37 -20 -6 20
4749B0J9m0L7m6l9P7k7KJ4J4j6Pj7j9j3P0rk8m9L8O4l8j1k3j1J7KK3k9J2j4J0
$$ 20 39 -1 36 -10 -49 28 1 3 17 31 15 22 5 -14 -27 43 34 6 -43 -5 59 21 10 -13 -24 -7 -5 18 -11 1 -13 -3
4781cJj9M6q3N9J3M0q1jlj0L1rM1k4L1nk6N0l4Lk3Pk9J9K5l1k6N2n5K8J0k7L8
$$ -3 -2 -21 25 -58 1 14 54 -27 -28 -31 -41 -10 -19 22 -2 29 24 -2 48 14 17 -6 1 -28 -9 16 -15 -41 11 -44 -16 -6 -33 5
4815EK4l6N2np8Q9n2OL0k8m6K3L2r0L8P1n0K9j6k3M5Knj2%K7j0k3j9L4k9K7J2
$$ 5 29 -7 45 40 -38 51 -1 5 35 7 -39 -16 16 -74 -36 35 -15 14 -2 -25 20 22 17 5 5 32 22 -1 -20 14 -15 12 24
4848B4n8P4m2m3M2j5l8N5rJ4J5moj4K6o8L8j2K8j9oK7l5M2j8J7l6N5mj3j3K2M
$$ 24 -34 40 -2 -45 -3 -18 -56 -1 -10 4 19 15 9 -5 21 -47 -9 -21 7 -12 -18 9 -26 16 -2 15 -21 34 30 17 4 26 30
4881C0l1L2j7n6L7%M0jJ1k1n1O2j6k2kML0o2Q1p2J1NoK6pJ1Kk6J6J2l3M1l6QJ8
$$ 30 -1 31 14 -42 -5 -5 35 34 45 24 -27 35 19 -3 -5 -1 29 -33 48 -24 -13 -8 -14 12 5 16 18 -8 8 20 -13 28 -8 0 18
4916A8K4k1q3R0Nj7k1J7mOl0k0J18o6rk5OK6p7M9JjjpoK6k7K5J0J2l4nM2l4J3
$$ 18 42 21 -62 28 33 16 -5 12 8 14 -16 -36 82 16 7 -18 -12 14 -63 -14 -13 -14 -15 -22 -28 -2 -29 -4 6 18 -16 -21 21 -13 0
4951@J8L5k7l5J5J0j1pj8O0p5M1k6K1l1M2n5N9m8J7L3p6M0J8J8m3KJ1j2L4j0j1
$$ 0 18 53 26 -9 6 16 5 -2 -20 40 -35 6 -20 1 -30 12 -43 16 -32 -15 18 -58 -18 0 18 -25 -23 -12 -24 10 0 -11
4983a1L3j5J%n5N3k9K4l4N2l8J1M1l5M7p4M5m2J4O7r7K5j6O5o8P2p0M8nJ0l4O
$$ -11 22 7 8 8 -47 6 -23 1 -33 19 -19 -8 33 -2 45 -29 16 -26 -12 55 -42 -17 -33 32 -36 36 -34 14 9 19 -15 -9
5015iL2m8j3P8o2JjL5j4oN9r7M4K0l5K1kk8LM5k1K3Lj5J3m5M2j6p4Q7mNNl6K7
$$ -9 23 -25 -38 40 -22 -21 -22 13 -1 -7 52 -45 -1 19 -16 5 3 -25 -22 23 2 25 28 13 26 -19 23 7 -67 20 16 21 26 -10 17
5050A7k8M7n0K4q5K9N0KlL1j9m3OMK5m9K6J6n0M3j6lJ8j3N5l5RK5l2j6J3o4P6
$$ 17 -11 36 -14 10 -75 -46 4 6 3 34 15 -28 -22 -18 7 -42 -16 0 -50 -7 -23 -26 -8 -21 34 -1 8 33 1 -15 -2 -66 10
5083A0L7j0m1pOk0j2K1mJ3j4KJ0l5K9k7P0k8l7K0O1Mp3J5j0J7K1J3m6K1NM3o5
$$ 10 47 37 -4 -11 -5 -25 -37 -16 -20 -7 -21 -19 -9 -44 -15 -42 28 0 -37 -17 44 48 -25 -10 -20 -3 18 31 -15 6 11 54 -11
5116a1K1k1P8n2qp0K9N1n3L5K7Pj00J00l7L0l0rK1J2l3N1l7K3k4J1n4O0J3k4J0
$$ -11 10 -11 67 15 7 -63 -34 17 -36 -1 26 33 -67 33 -4 26 -4 -13 8 20 -13 38 1 24 0 11 -43 17 30 6 16
5147A6m6k4N1n5O9J8k7QJ9l6L1J1k2j1m6O9J8k6k9J7j0l0J0l5J35j10R1m8J1l5
$$ 16 -30 -54 -3 -58 11 29 2 10 29 -7 24 35 13 2 -44 25 43 17 -12 5 -5 -35 -25 -60 75 -35 56 8 19 -16
5177a6%L2Qj6qj1J5Kl8M5o0N2K6K0o2J8on4P9l4M0J4k2K3n4nJ0J3k4O0l9M3q3
$$ -16 -16 16 24 8 0 -11 4 6 -32 13 -47 5 31 51 -11 7 1 -53 26 -8 32 46 24 47 -7 -12 -2 11 -13 47 8 51 -32
5210c2k2R0l8K1k6m7P4p0M0P4l2j0k5M2j9J7n0j4j4P2k5kL4qj9m1K0L8qK7n6M
$$ -32 -54 36 -2 19 -7 -54 20 -50 -10 64 32 22 -3 39 20 37 -13 -27 -41 31 6 4 38 30 11 -30 -10 28 20 47 -9 -5
5242ej5L6N1m4Jk5L8m8l0K8K2k9M1j9J2m4N5m9J8L3l6j6J9jjM2J0q5N4L3n4j3
$$ -5 -20 16 67 23 24 -1 37 -11 -41 -13 9 -20 21 2 14 -30 25 -24 -6 27 -9 -25 -6 -7 -8 34 44 -41 13 46 -8 -21
5274b1N8p5J6jlN3k9j7P2m8K4n4L8rJ8j9l2Q0o3j5K8l1L5k1k6R2l4J4mk0K3p1
$$ -21 37 -38 -22 -23 -26 27 -2 -19 53 5 29 -25 13 4 22 3 -29 51 -12 -27 1 -30 5 -16 -42 50 16 30 26 6 29 -42
5306d2L8L8N3j02K1k8NO2l6n0M5m2N2k4k3K2J6j5K0mkk6M4m3K2n4K5M2m4O7n8
$$ -42 -4 34 87 -15 6 -22 -17 45 9 -41 4 -38 14 -10 -33 -11 5 -10 10 6 4 -22 22 -21 1 -53 -28 14 -30 37 -21
5337b1N2J6n0m0nP1m0j6J9PJ0rML9l6m1M2pL5n7J2L9m3M8l7M6l9k5K9k5l0L9r
$$ -21 31 47 -3 -43 -48 23 -17 -33 -14 -7 3 -6 -2 37 1 -40 2 -5 30 -27 -15 24 -19 29 -8 38 -1 -26 3 -22 -52 -13 -22
5370b2K6K9k8j0kJ8k4k2NJ2L4%p7N7J0m6P0n0J9J5n6L1J3K3J6J2p8L0k0j3L6k6
$$ -22 4 33 5 -5 -7 11 -13 -35 -30 -18 16 16 -61 -4 6 -40 30 -20 -1 14 -42 -11 2 25 41 53 -25 5 -15 -28 8 -18
5402a8N6L6l1m1J1%j5J0Qm9KJ0N3l2j1Pk0k2P9K6p7%rM4l5%L9n1jK4qJ0J2QK4
$$ -18 38 74 43 2 13 13 -2 8 16 -33 -31 -21 32 0 -11 -4 -24 -46 33 59 -18 -18 -27 17 -18 -18 21 -30 -31 -7 -15 -5 7 15 39
5437C9J9m9j0J1Mj3n5N0kl0J4K7J5l1K6k3M5l7m5L4J4j3k0L2Nj5K6k4j5L5n4L0
$$ 39 58 9 -1 10 14 1 -54 -4 -6 -36 -22 5 20 -11 15 -8 37 0 -45 -11 3 -10 -30 2 7 -8 18 -6 -21 14 -40 -10
5469a0M4p3L8J0k6%K4K4j5K8l4NLJ2mj1j0Km9O1m8k4O1k0K8l4jQnj7P4j2k1j1
$$ -10 34 -39 -1 9 -17 -17 7 31 16 44 10 15 18 30 26 15 5 7 -42 19 -29 -53 8 -12 16 -18 -19 -11 -16 -33 41 29 8 -3
5503cMjl4NL3N2p0L1k4M5m2rO5n5J8j7k8N7j7nk0J1J0m7K2N5l2J7o8N5k2L4k3
$$ -3 1 0 -34 -29 4 56 -14 17 -7 38 -4 -13 52 -3 15 -2 -30 27 10 5 -15 -4 6 -41 -19 36 4 21 -47 8 -14 20 -3
5536cj6ORl3P9m6j6L8Oo6J02o3K9J8k7j8P0k4m8L1j1ll0qL8pl7N5l4L2n5M1k7
$$ -3 -19 -13 -4 -37 42 -4 -20 18 24 -42 60 -3 26 44 17 -1 69 45 -3 28 17 14 -16 -24 14 7 -30 25 -9 23 -32 9 -18
5569a8J6%k1qNK8Jj9O6m3l5L1LL2k0Ln0N3m6K5K0m1pL3J3m2l1M7M4KJ1k7m6J3
$$ -18 -2 -2 -23 -31 -26 2 3 -16 50 7 -28 3 6 38 18 21 -29 24 -22 3 23 -18 -25 8 21 -21 -52 -5 39 41 52 25 -21 -8
5603hn3J04m2j8j0K1J5N6n2k4m2P2p7NK4L5K5m6j4M4rl8K4MM7l9Pj3L8r8Q3Oj7
$$ -8 -61 43 1 -17 -27 -6 9 65 13 -11 -53 19 -58 -53 -29 6 31 -15 -29 15 6 -32 -8 -4 43 4 11 -2 36 -62 21 27 10
5636A0J0l0j2qL6J4k1k2J4l6N9j5l1N4k3lk5J2qK9j2Qj3KJkK7j5Qk6JK2Jm0J5
$$ 10 20 -10 -22 -30 6 20 -1 -23 -9 -45 14 -1 -32 22 -1 -4 -29 -17 -25 4 -8 0 -13 -11 -10 -12 15 0 8 -18 -17 5 6 -34 -19
5671a9O1pj2j9o1M0J5OK1k8J3lk9jJ3j7J6M0ml1N4m3l2Q4q8M9ro9K6K8M1J0l2
$$ -19 42 35 23 4 -57 -17 -2 4 25 -3 10 7 -22 -23 -10 -27 -11 29 25 -6 48 5 -27 57 -31 18 9 -60 -34 -6 35 45 13
5704A3M0l4rJ4J7K1n9kk3K6J1mJ0o8K4kN3qL3o6L5n8N0%j6Mqml7K2L9j2J0k1N
$$ 13 53 19 10 24 41 62 3 1 -22 4 15 11 21 -47 -23 -25 28 20 53 -13 22 -36 14 14 -2 2 -6 -10 -47 -25 14 2 12 -9 -4
5739dl5Q9m4j7J7j8k2L3k4K4lJ5rlj5J0kQ3n6J6o1M1k2K1K0q4L0N3l4J7mk7Ll7
$$ -4 -39 50 6 -11 6 -12 -34 -1 -25 -1 -4 11 2 -1 -16 -6 -8 75 19 35 -26 15 -7 14 34 -50 -20 33 -1 16 12 -15 -12 -49
5773d9J9J0J8l5K3J7l0m1M1m4P9L5o1P9m9j8l1O3K0l3K3p2L8%J2j0L1m1K7nn4
$$ -49 -30 -20 -2 -37 -14 3 -27 -68 -27 -71 8 43 -18 61 12 -6 -37 26 46 13 36 -36 2 2 14 4 35 -6 21 16 -38
5804c8J5M7l9M2Kk9J4l0n1J14n7Pj5K1k0l2M4n0M5QMm6M0n%Q5j01j8P2k2n0K9
$$ -38 -23 24 -15 27 29 0 14 -16 -67 47 -10 -3 -18 3 -17 -49 -5 -55 -10 -2 2 -44 -4 -9 -9 76 -25 -43 29 7 -43 -14
5836a4L6p2J8L9j0K2m1K2j6O1n1JJ6k0Qj9L7k7k4J0j0L4OjO4q2J4k2L1Po0O1j1
$$ -14 22 -50 -32 7 -3 19 -22 0 -16 45 -6 -5 11 -9 -1 -20 17 -10 -34 -24 -34 0 6 5 69 -13 1 -21 10 17 -43 18 7
5869Gj0L0ok8K0M3q2O3jn5KL9J1n1M8J6mm2Pl6j3K1j0M9p8kL5N0j7K3j1l2K3J1
$$ 7 -3 27 21 -7 13 56 -26 37 36 -19 -17 22 33 -18 30 46 42 0 7 -29 -42 -21 -31 18 -60 -62 -27 23 6 29 18 -14 9 20
5903B0k1ORK5n7N2O8j36K1J1K5K4n7M8l4J5rk2LK0o1L7O0l4k3j2O1n5k9M7j2j9
$$ 20 -1 5 14 39 -18 34 102 -34 -13 -2 23 47 -10 38 4 19 10 -12 -9 11 -50 -13 47 13 -10 -22 39 -16 -45 2 -10 -29
5935b9Qj3NJ3JJ0J9Rk7J3Qj2l3qM6J0j4k4L5l3kN5o0LRP%J4l4nK0j7j1P2o4Kj8
$$ -29 -21 -34 -29 -16 -15 -5 14 23 -4 9 17 5 -28 -36 10 20 6 -18 17 -16 -18 37 -23 -20 -11 -4 -4 10 -24 -29 -9 -26 -37 35 -29 -27 -45
5972d5N4J3m5J1j9O7m7K5L2r9M7J3j7M9p2P1l2J8k7J5K4m9K8J9k5m6O6mm6L6M3
$$ -45 9 22 -23 -12 -31 36 -11 14 46 -53 -6 7 -10 39 -33 38 6 24 -3 12 36 -13 15 34 9 -37 29 25 -21 15 58
6003E8l5n2N3rr2K6L3oJ8km0j9J14n2M7m7j2K6k9J8k4j2L3K8n1O0l0m6OM5k8K2
$$ 58 23 -29 24 15 -77 -51 -18 -24 -6 -8 -48 -67 47 -5 42 -5 -17 9 -20 -2 -26 -38 -5 23 -28 32 2 -44 -38 7 -21 1
6035Ak1J8J4QL8p6RQJ8j6j1n5N2lL0m0L5K4p4Q6q3N8j1j1Oj5O7o1k2k6J3K4M4
$$ 1 -20 -2 12 20 58 -18 -9 -1 17 1 -10 -65 -13 -16 14 -26 9 33 -41 45 -38 20 9 -2 4 -11 56 -5 -27 -53 -40 -16 28
6068B8j7j5L5k6K4Nk0J6Onkm6K6j1j3J8L0k8J6nrm6K0n8Q6p2M9M1m8J2j1K6k4
$$ 28 11 -4 31 5 29 34 14 30 36 31 29 -17 9 -2 -15 3 33 5 21 16 7 -39 -19 -77 9 -63 -14 27 -21 -9 -20 6 -18
6101a8L6l6K0KML9J1m1k1J2l7P4n8K4l1L2k3K5l8l3Q5l4J9kmj2Qj1RJ6r2O1K2
$$ -18 18 -18 2 4 8 47 58 17 -4 8 -29 45 -13 11 -20 12 -11 14 -24 -57 28 -6 13 11 7 -5 3 -8 1 17 -75 -14 8
6134HJ9m7n3P4j0j1K8ok2R0r8RL6J3l6K4qoN4j9j6j3J6o1P9k4l4Nk0K0k5M8lJ8
$$ 8 27 -20 -73 1 -9 -20 8 2 -20 70 -28 -19 17 30 -6 18 10 4 58 39 23 10 26 -35 44 20 -14 -9 -29 -9 -34 14 11 29
6168B9k5%k3pj3K5mNPPm2L1l3O5nk0lk1j6K9N3m8j1K0Jn0N5pj0J8J0kk3L5k5J5
$$ 29 4 4 -19 -26 -39 -14 -18 -13 -6 1 -41 -10 -43 22 17 -3 -6 -27 -43 -14 39 -9 -20 0 1 -49 6 -1 -11 7 17 15 -8 27 2 17
6204A7k3J1n5NM1Pm1OM0j2K4l3k8pN5Pl0kM9m1o1M7M2k9j7L2k2j6M4n3L7N3k7
$$ 17 -6 5 -50 -45 -4 3 -38 -32 8 -4 20 -13 -41 -48 7 14 -16 -18 31 -10 -71 -24 18 -11 -28 4 -18 -34 10 -43 -6 47 20
6237B0j8k4P3n8NJJ9l4N8o5M2p2N7o3M6q0M3L8K3qk5K7j4J6l9M4K2o5PP8m5Lj0
$$ 20 2 -22 51 -7 -2 -1 18 -16 42 -23 19 -53 4 -59 -13 -93 -50 -12 11 3 -22 5 -9 7 -32 12 34 -31 -24 54 9 12 2
6270BPJ5k4K6j7MJ3r8J01n8J6K6jk8K6j3l3M6k3Kl3L7Lm5K9mj5M5n6K6J6j6nJ0
$$ 2 9 24 0 26 9 13 26 -72 29 -29 -13 13 12 -16 10 -3 -36 10 -13 -11 -44 -7 -4 -49 -20 -24 -39 6 -50 -24 -8 -24 -29 -19
6304a9J23o1J3n4K7rm9L2J8j5M0p8J6J4J6n4jN2k0l1M4Qj4qL1l8N7n7K3Lm1%M8
$$ -19 104 43 56 2 29 20 -29 3 21 6 46 -32 -16 -2 14 -40 -41 11 -9 -40 4 12 -2 -10 21 -17 40 -17 6 9 -32 -32 16
6337A6l8RL5j2k2k5P4m8J2j6j7K4L0k6L3k0K1j3%oOOl4M6Rj0n0k6L7mk0j7l2M3
$$ 16 -22 -13 22 10 -12 -37 37 -11 1 -15 -32 -8 22 -4 29 9 30 17 17 11 17 23 -11 35 44 34 -16 -42 -5 -9 -29 -46 -78 -35
6371c5jJ2J1Kk1qm9J31k1rk8m7Q4o1O9ROl7M0j0o1M5K2n0J1j7J3K9j5K0k2m5R
$$ -35 -36 -24 -13 -11 -32 -40 -89 42 21 12 -16 -63 21 -40 29 38 44 7 47 37 -24 21 43 -7 4 -13 0 29 14 34 12 -33 -24
6404b4J2l8L1J9p0K6K9m5M3J1l2L9L4l7m1J4J1j1K6K1j2j3K5OoQo4N6j5L8m7k9
$$ -24 -12 -50 -19 0 -70 -44 -15 -60 -17 -6 -38 1 35 -2 -43 -29 -18 -29 -3 18 6 -7 18 24 18 26 -38 18 3 41 -6 -35
6436c5J8QMK2k8nKK7K8p5jN3l2L9k1M3k5m7K7ok5P1n2L3l6l2Q7ok5M9j6llp7J9
$$ -35 -17 -9 -5 17 -11 -16 -14 13 41 -34 -35 18 -14 25 4 47 22 -25 2 -4 -29 42 -10 23 -13 -45 42 36 11 60 44 41 38 -39 -20
6471b0K2K1Rj3m7M6l9L7p2P3q7L8RK4k4M7M3q6J9j0M8j15Q8n1L7j5J9K6nm7M5
$$ -20 2 23 32 19 -28 18 -21 16 -56 17 -70 -32 -23 1 -23 24 67 -19 0 -10 38 -77 11 -40 -3 -18 1 27 22 -25 20
6502B0J4k6rJ5J4m5N7l6M5l1j7k6R1n1olm6M8pN4q5M9k5l9L0l7N2j%kKK5lk2J1
$$ 20 34 8 -1 14 28 -17 40 4 49 18 1 -25 66 15 9 6 -40 8 1 55 -30 19 -6 -45 -15 -52 0 -1 -1 -3 -1 24 21 -1 10
6537A0j6oK8K4p7N2l6K3ljlJK0o0P3l7J0K1k9M1n3j9NL1Kl5M2j1l8O2kPp3M5J2
$$ 10 -6 -12 16 40 -37 15 -21 2 -1 -2 -5 -4 16 -44 29 -8 2 23 -6 35 -18 -37 -32 -1 1 -34 8 -3 -41 21 19 26 -47 -2 10
6572A0J9l4Pl8L0M4m7k7L1L9l6N1j09R8J2p6K7J4l3K1m0L4NK9k6K0KJ3l4N6l3
$$ 10 29 -5 2 -36 -6 38 -9 -36 -5 34 -2 49 -60 38 50 -26 1 15 -18 3 -37 -3 2 31 5 25 27 40 6 62 29
6603B9m0K7p1J3J0L7m4M8Lmj6rJ8K6J5l3j8K4j3Jk6N0m8J0j0oM0k5OM2q2J0N1
$$ 29 -11 16 -55 -42 -32 5 -39 9 12 8 -8 -17 1 27 42 9 -9 15 2 3 -23 27 -21 -11 -21 -27 13 -12 -6 36 -46 -36 15
6636A5nj9P1o6kmrN6l6k6K4Ok0N6n2mnQ4p2m0MK7j2K9K8l0k6K4qM4k2M8l1K7l0
$$ 15 10 -9 62 -4 -6 -10 -19 37 1 -25 -1 5 -15 41 -11 -15 -20 64 -8 -48 -44 -17 -29 0 28 -2 -28 -4 -12 32 10 58 27 54 24
6671B4k1J7j0K3m2QqOLk7L2PJ4l8%j7Nj8j0O7m9O2m3N2k9k9j7M0J6nJ4m2M5m1
$$ 24 3 20 10 33 -9 -1 -9 -3 0 -27 5 12 26 -12 -12 -29 -24 -42 -52 15 -34 28 -15 37 8 -21 -38 2 18 13 27 -15 30 -11
6705a1M1j9k4j3NN0l6pk8J1L6k5P2l1k0J1j3m5N3m0%JN3l7KK1rj2l9R1j15P0l2
$$ -11 30 11 -13 -26 -21 29 -7 -14 -42 -31 5 -20 52 21 1 12 -1 -46 7 -33 -33 -32 21 -16 -14 7 -2 -14 -53 38 -77 -7 -39
6738c9R4j6j6PjqMJ8N6q3l8L7l5J9pL2n2N0QoQj8J1l3om1L3J8j8oL2l0NM7j2J3
$$ -39 55 39 23 30 29 21 25 43 99 16 -22 15 -20 -1 -8 24 -28 22 30 24 32 14 25 -8 -14 -55 -22 -4 -22 -28 4 -26 -21 26 14 27
6774B7n1M7k8LJ2l3QJ1L2m2jM5n8%K0N3r1L2L0j3Mj6j6jN3Pm1Kk2L1l8J3M4k3
$$ 27 -24 23 -5 -2 10 -23 -15 -4 28 -14 -15 30 -28 -28 -8 45 -46 -14 16 3 7 -9 -25 -26 27 34 -7 -5 -27 4 -34 -21 23 0
6808@k9L4%m0k6R6mm8O9o8L1j9M1l7JJ4nL5r1M4J3n3R2o7K3m7M9lKm8M2Mj0j7
$$ 0 -29 5 5 -35 -61 35 31 -17 52 -16 15 -4 37 0 1 15 10 45 -46 -2 11 -42 50 -17 6 -41 8 5 7 -41 1 5 -5 -22
6842b2Nk2K6L0n6M2j9K8j8k6RK1L4o8M9K7n4j2L2K7l5J2Kk8Pk8M0j2N4Rn7L5O
$$ -22 -17 -39 -13 17 -39 3 -16 12 -6 -32 -23 -2 32 -36 13 40 -14 -26 6 33 -2 10 12 -16 -9 -37 3 -9 45 54 -3 32 38
6875C8o7P4n3L%k1K3K4%p1N1k5O3j1o3L2N1n9k1K5pm3K6R7n2k7L3MkRn7qL3L0
$$ 38 -29 45 -8 -5 -5 -26 -3 21 21 -50 1 -24 39 28 -35 -3 48 -11 -32 -7 -14 -57 -31 66 14 -13 20 24 22 31 -26 -34 -1 29
6909B9Pk1nn8M6K3n1P1J6j14N0lJ1jK2Qj3m0j4jK9K3Kl9om1R0J2m4l7L9l1M9M
$$ 29 36 15 10 -48 -2 21 -30 41 57 -57 -7 -10 1 0 22 30 17 -23 -37 -38 -9 14 16 -23 -29 -70 20 32 -12 -49 -10 -41 8 12
6943A2k2J3J1kj0M9J3m6k4K5l6N3%Kk1n1N0mKPl0j5L5J2J0n6L2mqm8Q5m7Nlk4
$$ 12 -10 3 14 12 2 51 64 18 -6 19 -17 36 36 38 17 -34 16 12 14 21 -9 -24 11 23 33 -23 9 5 -3 -51 34 -13 -8 -11 -35
6978c5L4J0qk5L6Qo8L2M2l0onN6n5P5m8j5j5M6Nj7k3k0P8p5kM4n0K5K3m6PL9k7
$$ -35 -1 9 1 -24 12 20 -48 -16 26 -4 -10 -15 41 -14 61 13 -2 -17 29 34 17 -6 -26 52 -23 -25 19 -31 -6 17 -29 -22 17 -10
7012a0j7N1n2P6p5J8j8rK8J2K5k2k3J3J9n4M1L1rl3N5m5l9L1Km9L3LL1j0k3L0
$$ -10 -27 24 -28 48 -27 -9 -27 -36 -8 4 29 7 -16 -3 16 -38 3 34 25 -8 47 2 -37 -6 -4 -53 -20 -17 14 4 -19 11
7044A1l1qQL1m1LL8j4J6k0J3j0k1K5M5p4M0l7J0kj7L0Nl0M5O%j5K1J2jl5k3J8
$$ 11 -20 -28 -20 11 -30 -27 11 -3 13 -7 6 -4 -25 0 45 -29 11 -26 -16 -18 -35 -5 0 -30 15 21 21 6 27 39 38 3 -20 -2
7078bpk3Q1l6rL2N1n8n9M3k7L3j4K0n5J8L6qq1Q4j7Pl8OL7l3K1j9K7J7j1nK0k2
$$ -2 -9 -32 49 13 4 36 87 29 -30 13 -14 19 5 25 -30 -12 24 16 -65 19 2 9 -29 -23 14 -19 2 -17 10 27 16 11 31 9
7112Il5MN3m7ok6L3j4N2r2P1k0j0L6K0j5k5L7j5Oo9N9l8M8%j8K5Rj8m3K4k1oM1
$$ 9 -26 -22 31 -16 -22 -48 -15 -29 23 -69 2 -18 -28 8 28 13 -12 25 10 16 -53 6 -32 16 16 -2 23 32 14 -29 -5 -26 -32 9
7146IK3k2k4N7p1N4o1L3OK9Lp5M4l8N1n4M2Ok2K7q7J26m4K0J5n7KM9k2o3O9n3
$$ 9 32 10 -14 43 -28 26 -35 -2 4 33 36 -39 5 -33 18 -36 6 12 -10 17 -70 56 12 32 47 -10 -8 41 19 -44 25 -28
7178b8O7lJ1n2M9k3rPln1P1l3M7p7J5K9j2J9J7n2K5K6jj2l4k8K7J3J5k2j8m8%
$$ -28 39 36 47 -5 44 21 12 19 16 -35 36 3 50 -27 -12 17 5 24 41 -11 14 40 39 27 -7 -35 -8 5 20 -2 -20 -68 -68
7211f8Q8o1J0L5J9l5l6P2n1O6m4j4l7N0nO5l3J0o6K0ML0J1l6L3o1L8j6o9N1M8
$$ -68 20 -41 -31 4 23 -12 -48 24 -27 39 -5 -19 -56 -6 -11 54 21 31 -35 -15 -11 19 30 -6 27 -34 4 -12 -81 -30 18
7242A8j6Pnn5K8Mj0Q0m2Lj6Rj2Pj2qL0L8p8M8J0m8M5j9J2m0RN0p4N7n0L2j9N6
$$ 18 2 9 4 -51 -23 -19 -29 51 9 12 -4 5 -7 0 -12 -20 10 48 -30 18 28 -20 25 6 18 -22 -13 37 -37 20 -30 2 -17 39
7276C9p1J6OL4l7J4J5n6P5Oo3k2N7m0O6o4M5o0M6n6N5K2q6L8L2k4M7n0Pj0R0p4
$$ 39 -32 -16 -10 24 -13 1 16 -40 35 41 -22 -44 13 -27 39 -25 20 -40 6 -50 5 27 -59 -21 11 -13 34 -16 -9 -19 71 -3
7308cQJ6j1k5P9l4m4k9MN7m6P3n9mN9n2K4k7j8K7J8J7p3K1N5k0l7K9J7K3o8J7
$$ -3 5 21 10 -15 64 30 -14 -43 -39 18 -28 45 -14 -18 41 -11 13 -14 -32 -5 13 30 -43 -22 33 13 -24 5 22 45 -23 -6
7340fK3j2MOM5rm7j1M9l0l2L6lm2O5l1L4n9%k7QJ3O2k4J3k8k4L0j0Ll1N5j7LL3
$$ -6 17 5 9 15 60 51 4 -7 42 12 -20 16 13 -29 36 5 39 -20 -20 -47 -39 -26 36 12 25 -3 -27 3 -7 -4 -35 20 3 6 39
7375C9ml8o2N0N2j0m2MlL0rpL7l6l0L9l2M5k8L4m2k6J6J9M3q2O8j3m0K5j7l0J00
$$ 39 35 -3 -65 -15 37 27 -15 -11 -14 16 7 0 37 1 -29 10 -22 23 -5 29 -13 -39 -23 -4 39 -43 25 12 -28 -3 -20 -50 50
7408E0m1j4L9k6jkm4N2Mm1j4P1l7n2K3N7k7k8J9M0%n8K7l2QM3k7J8Ll4J9qN9l4
$$ 50 9 -5 34 8 7 5 -39 13 17 -24 -38 33 -4 -56 -33 24 -3 -31 -12 28 28 -30 -3 -35 -27 16 -11 7 10 -24 -5 -13 46 12
7442A2O1o9OO7p8J9m3J0M6n1qM4J6o0P0k0r6R0lKJ2K4m6lK9j1o5L4RK6J7l0J2
$$ 12 73 4 10 77 -1 18 -25 -15 31 -20 -28 16 32 -28 42 22 -74 16 13 15 27 51 5 2 31 20 -45 -11 -2 24 41 11 23
7475B3m4K6Lk8j1M9j4NK2nl3m5K0Q1m3J1ml2M0J7k3kl3j3P3l5Ll0M0m3pN8j0m0
$$ 23 -21 5 8 -20 -31 18 4 9 31 26 -7 -52 -32 49 6 17 13 -19 21 38 15 13 -20 -33 40 5 8 -22 18 -25 -32 26 16 -24
7509b4O5k1j8OQM4j05PRM0j9M1n0J8J1mm7L0P2k0l8k3M2J1n7O5m3j0Rl6O1Jq4
$$ -24 41 20 2 8 16 60 -45 -38 -29 11 -8 33 -17 1 12 8 -39 -9 63 43 5 -18 24 35 -22 43 0 -10 -1 -37 24 25 -59
7542e9Q2k7m2M2Rj3K5k6OP8m4k4kK2n9LONRMK4n6k8N3jl0M7m4N3n6K5J1N5q3K0
$$ -59 23 -4 -46 -4 5 -8 17 -9 -3 75 31 7 5 27 -32 -29 -23 -18 -9 -5 19 -37 -65 -12 -13 -43 4 -40 13 -43 -18 -7 48 -35 -15
7577a5K8J6l4J8j1K3l0o%L4n4M7m0J8M1m9K7k8N7o4n2N4L6K2n6M4n9l5Q5k5Jj4
$$ -15 13 29 -5 13 2 25 -5 -11 -11 23 -31 16 -24 -6 35 -14 13 -15 42 -22 -74 -20 16 38 -18 26 -33 -68 17 -8 -7 -21
7609b1J0J1p7J10n2NL6k8L9n9P9n7j1M0qk2J2kJk9P2k2m4KN1n7JopQ0n2lL3j0
$$ -21 -11 0 -77 33 -19 -14 22 -6 33 -26 53 -4 -15 25 17 -5 7 5 6 -23 49 27 -17 -15 36 -21 -20 -26 -33 47 -5 -8 25 15
7643A5l0J1L4o3M9M3r4N6Nmm4M0J0J0l8M6kn0J4L9o7lM6k5MJ5j3k3N6n6kM8k1
$$ 15 -15 -4 30 -33 16 59 -35 21 26 22 -22 18 28 38 0 46 44 -6 8 47 -20 -23 23 -2 2 17 4 -19 37 -19 -21 27 6
7676FK5p2J3N%Pk1K8M5j4k1MM4j6k2nl4N0L4p5K8K4j6J2n2O0j5k3J2k9J0J0l0
$$ 6 31 -41 -28 -23 -23 -16 -37 -9 36 22 1 5 49 33 11 6 -28 22 56 -19 9 33 17 29 -23 37 22 -1 11 -18 -8 2 -28
7709b8PM9m7M3k2n4N6L8m8RRm8L2m0O3m1P3o8N6NL8o2kom0J6J0M8p1J5L7l7j8
$$ -28 -21 28 -19 24 2 -52 4 42 -6 3 12 -36 -4 -44 19 -22 51 -17 39 44 82 20 18 12 -28 -12 -2 46 -25 -10 27 -10 -28
7742b8qJ7L5Jp4R6k1K5n7kJ7L1k6K1lN5p5l8M5k2k3mNP4m3nNJ5J7l4Pp1N7K6Q
$$ -28 -36 -19 16 17 -57 39 18 43 -14 -16 1 32 6 27 24 79 4 -34 11 -11 -34 -38 -33 41 -2 -7 -2 13 30 -4 3 -68 -11 15 23
7777B3k9J6lK1j9J3Nm1L0n5L7M3n7k5J3M0j7l4M9m5O0j8nJ5Nk4k9j3O4m1%M1l6
$$ 23 -6 10 7 28 9 22 27 -14 16 -39 -2 41 -16 -41 -28 12 -5 -39 10 -35 25 7 2 17 22 -2 -31 -44 20 -21 -21 20 -16
7810a6j0qL6L1q1N3l1P1j8k9L9k2j3j3L7k0O4m9l2P%j4L8J4nj4j4m8R1p6L1Mk0
$$ -16 -26 -34 2 33 -48 5 -26 45 27 -2 37 15 2 -11 26 6 70 21 -11 -4 -4 -18 20 34 29 15 1 -47 44 -32 -1 3 -17
7843a7PL0J6p2N8K4m8K3l9QN4n1j6M7rj5lk5N1k1K8j1K9j8ll9L2k7M0j9l5O0R
$$ -17 -10 20 36 -36 22 46 -2 21 -18 -10 44 -7 -23 24 15 0 -3 -28 23 2 30 19 48 30 27 -12 20 -7 33 14 -21 39 48
7876D8j1l3Nl4PJ7L9l3O4o0j9M1m8PM2m0NL0l7jL7n5O1k2K4jo1L7L6k3lm6J5N2
$$ 48 37 4 9 -25 -18 -1 38 5 69 9 -10 31 -17 -10 32 -8 -3 27 -10 -11 26 -29 32 10 34 33 -28 9 45 22 19 -27 -12 40
7910D0n5O6n1K9o8O1l2k0M4L0o8L6m1NqK6N7m1mK5m6M2n0K3K9mo0L5j0J4nl9J6
$$ 40 -15 51 0 29 -39 22 -10 -30 14 44 -24 12 -29 -24 -32 -6 51 10 6 31 -15 27 -23 0 29 25 -35 0 -10 4 -1 -40 -24
7943b4M6J0n0OJN3o5M2k5jm5K3P0o4K5J6m6j6%L5MJ9n8O7l0M7%o0N7p5P0k5K2
$$ -24 22 32 -18 -12 -11 42 -23 19 -6 -7 -52 -29 41 -23 2 18 -28 -44 -44 -9 -5 14 -44 23 -7 40 40 -20 37 -38 32 7 29
7976B9n3K5JL3l1N0o1K5k2K7M2p0OKQJ7q4R0j00L9J1J2MJ2k0m0R5o8pJ5j1j3N0
$$ 29 -24 1 2 35 4 54 -7 18 -4 23 65 -5 1 3 11 28 -56 34 -66 -27 -16 -4 0 12 -8 -48 47 -21 -28 -13 -24 -37 13
8009A3K0l6jqO5n4L3j4j9K2R%q9Q9Mk6L6l6KK8l6m3j3M9nM7k4j6RJ8m2J7NL9r1
$$ 13 33 -3 -4 -12 53 -1 32 18 -1 21 30 30 -59 30 34 8 44 8 10 38 2 -41 -54 -5 -10 37 13 -3 6 24 -18 -1 4 43 -48
8044d8P9l5Opl7N9k%K2K3o1pJ1l8P0l1QNJ2j8J8j8OL0j0l8nM8p6L5j8J5kKnj4
$$ -48 31 -4 2 -5 -42 17 15 15 37 60 -1 -8 3 -35 35 4 12 17 29 11 29 11 17 47 37 -1 -6 42 -34 1 -17 -2 -4 -2 -7 -21
8080b1j9M0j0J4L3l0j2J3J2m1J1rM1k6M5n7K1L7J1o2K5l0PJ8l7rj1K7K7QrM9o2
$$ -21 -40 0 -10 4 37 7 -5 8 20 -21 -10 -19 22 -4 41 -16 5 42 53 -9 16 -14 -7 11 -26 -35 -46 -19 8 16 7 56 -6
8113fM8n7k5N9j9m6K6jj0J4QJ3k4K4N8j16L9J0N5p0J7L6l9N8m8K5k9M4L7q8L0
$$ -6 42 -15 -40 19 0 -46 -20 -21 -31 -17 -9 4 -20 4 62 -54 -15 -5 50 -20 -3 33 -6 52 4 29 0 44 81 -7 23
8144B3l3O0n9j0MJ0J8m4M5n3O6l0k9K7j7j6M5K3l5m2R6k1k6k0M5k6K4l3oN3p2
$$ 23 -10 50 -9 -19 -15 -5 13 -31 14 -39 27 -3 -32 -5 -22 -38 7 30 -5 -47 49 28 2 -18 27 1 25 -8 -14 39 -33
8175c3K6jQJ7J5k9L7l3k0K4l9N4rj1j0l
$$ -33 -7 -8 0 17 32 3 40 7 -13 11 -28 26 17 6 -4 -7
8191g
$$ Imaginary data points
##PAGE= N=2
##DATA TABLE= (X++(I..I)), XYDATA
0@%%%%%%%%%%Qj6J6j6K4l2L2m0N6o4P2q8J04j25J50j77K07k39K73l14L62m12M68
$$ 0 0 0 0 0 0 0 0 0 0 0 8 -8 8 -8 16 -16 16 -24 32 -32 40 -48 56 -69 81 -96 111 -128 145 -169 193 -219 249
33B49n30N99o78P64q56R59j074J195j326J474j635J808k000K211k436K685k963
$$ 249 -281 318 -360 404 -452 507 -567 628 -698 776 -859 949 -1051 1160 -1276 1409 -1554
50a554L262l590L958m367M820n330N910o570P332q224R286j0575J2173j4224J6964
$$ -1554 1708 -1882 2076 -2291 2529 -2801 3109 -3461 3871 -4353 4933 -5642 6531 -7693 9271
65I271k0826K6731l6971N9655k00115J24263L96582k85399l82865K4524M47084
$$ 9271 -11555 15176 -21795 37860 -162255 -37992 358590 73191 -309674 -285150 161934
76A61934J43169l26351k91796K20249L46354l2247l41115q8099K68495K11331
$$ 161934 305103 -21248 -313044 -92795 253559 221312 -119803 -207902 60593 271924
86B71924j74210k55762O7000K71243J9671k33679j12825J78753J71616j17838
$$ 271924 97714 -158048 -91048 180195 199866 -33813 -146638 32115 203731 85893
96H5893k27319L9167K25394L6861k15404j28343J53774J93348q5578k40967j8533
$$ 85893 -141426 -102259 123135 159996 -55408 -183751 -29977 163371 77793 -163174 -181707
107a81707K35461J09090j88822j90314R6161K33809J6696k30591j12478J83000
$$ -181707 53754 162844 -25978 -216292 -120131 113678 130374 -100217 -212695 -29695
117b9695J85565q4829k06190j4820J98585J12460j36972j60717O5147J80440K2294
$$ -29695 155870 71041 -135149 -149969 48616 161076 24104 -136613 -71466 108974 131268
128A31268j49643q3340J03127J27779m2122j36611r578J17737M9262q4193q2129
$$ 131268 -18375 -101715 1412 129191 87069 -49542 -59120 58617 107879 23686 -58443
139e8443M0177R2103j1334r7006k2970P7319M1915o1311o9487K8238Q0497j404
$$ -58443 -18266 73837 62503 -34503 -57473 19846 61761 450 -69037 -40799 39698 38294
151C8294q9585l3960P6715O0485n0656q1372J1690R1494L2289q0547o2784N6823
$$ 38294 -51291 -85251 -8536 51949 1293 -80079 -68389 23105 55394 -25153 -87937 -31114
163c1114Q5803j0462q2710k8820P2414O6752l9076p7427P383P6077K9691n2486
$$ -31114 54689 44227 -38483 -67303 5111 71863 32787 -44640 -37257 38820 68511 16025
175A6025n2059K5299O2852K089n7052k3355L6400L2548j5947l8774n788L1565
$$ 16025 -36034 -10735 52117 54206 -2846 -26201 10199 42747 26800 -11974 -17762 13803
187A3803J2485k6483j9392J2013J5386o079j7786l008J5760M247j8244p295J6269
$$ 13803 26288 -195 -19587 -7574 7812 1733 -16053 -19061 -3301 946 -17298 -24593 -8324
200h324R037j1526j2263N544J8208M087j7227p388J6134J3394m878j1203j673
$$ -8324 713 -10813 -23076 -17532 676 4763 -12464 -19852 -3718 9676 4798 -6405 -8078
213h078J2405J1153n721j0481K350Q360L694j182n140l934L353M769J419k583
$$ -8078 4327 15480 9759 -722 1628 9988 13682 12500 7360 3426 6779 11548 12967 10384
227A0384r432m952J1024R283j0685j6498n09J6635J0018j6438k2502P204K5716
$$ 10384 952 -4000 7024 16307 5622 -10876 -11385 5250 15268 -1170 -23672 -16468 9248
240I248K915k4946j6606J6316K6989m345l1298p942K9191J9864j7978k6264O295
$$ 9248 12163 -12783 -29389 -13073 13916 9571 -21727 -29669 -478 19386 1408 -24856 -18561
253a8561L1273Q462k7188j6637K1650K4642r390k6127j420K6873J3503k2783k1725
$$ -18561 12712 21174 -6014 -22651 -1001 23641 14251 -11876 -13296 13577 27080 4297 -17428
266a7428J6033K6993o058k9459p198K7473J8867k3598l0054J2734L4027j59l5290
$$ -17428 -1395 25598 19540 -9919 -17117 10356 29223 5625 -24429 -11695 22332 22173 -13117
279a3117j6969K8106K9889j7367l9515R45M0103J5916l3074l1405J8876M1546
$$ -13117 -30086 -1980 27909 10542 -28973 -28028 12075 27991 -5083 -36488 -17612 23934
291B3934o03m2972j6678L6239L1848k0575l9821L102M2299J5593l5107k8693K3040
$$ 23934 23331 -19641 -36319 -80 31768 11193 -28628 -25526 16773 32366 -2741 -31434 -8394
304h394L7557n841l8697j0723L4257K5103k4116l4365J0446L7487M507l4894j9539
$$ -8394 29163 23322 -15375 -26098 8159 33262 9146 -25219 -14773 22714 27221 -7673 -27212
317b7212K6487L0433j5488l6976O01L5973J3753l0434k7504J8908L5977m570l8855
$$ -27212 -725 29708 14220 -22756 -22155 13818 27571 -2863 -30367 -11459 24518 19948 -18907
330a8907j1713L4090K5978k2723l6233P103M0230R946l6241k4458K5842L5030
$$ -18907 -30620 3470 29448 6725 -29508 -22405 17825 27771 -8470 -32928 -7086 27944
342B7944r666l8503o864L5688K2257k5565l2161J1447L6305M465l3567j8802K5274
$$ 27944 18278 -20225 -27089 8599 30856 5291 -26870 -15423 20882 25347 -8220 -27022 -1748
355a748K9284j3092l4006q18L2234J4039k5756k4848J5224L0519l139l1410r615
$$ -1748 27536 14444 -19562 -20380 11854 25893 137 -24711 -9487 21032 17893 -13517 -23132
368b3132K6583K0584j7995k8246O294L0999O413k8427j7945K0996K6448r580l0659
$$ -23132 3451 24035 6040 -22206 -15912 15087 21500 -6927 -24872 -3876 22572 12992 -17667
381a7667l313K9541J5537k2855k4597J2115K9241Q82k8556j3079K2640K2505j2797
$$ -17667 -20980 8561 24098 1243 -23354 -11239 18002 18884 -9672 -22751 -111 22394 9597
394I597k7617J021K7308J0653k2281j9981J3671K5076l053k5493p235K1509J5893
$$ 9597 -18020 -16999 10309 20962 -1319 -21300 -7629 17447 14394 -11099 -18334 3175 19068
407A9068j4398k1203N267K2730M116k0390j2071J4883J7854p096k0533j242J9910
$$ 19068 4670 -16533 -11266 11464 15580 -4810 -16881 -1998 15856 8760 -11773 -13015 6895
420F895R104j5868j5260R377J8762j433j9298o243J6211J2617j0667j6704L503
$$ 6895 15999 131 -15129 -5752 13010 11577 -7721 -13964 2247 14864 4197 -12507 -9004
433i004J7471L869j5439j0463J0543J4560m456j5919k389J4084Q216j0140j2138
$$ -9004 8467 12336 -3103 -13566 -3023 11537 7081 -8838 -11227 2857 11073 933 -11205
446a1205M870J3402R77j2157n964R194R423m570j0632o7J0259M385p795p102M729
$$ -11205 -6335 7067 8044 -4113 -10077 -883 8540 3970 -6662 -6729 3530 7915 120 -6982 -2253
461b253Q714p01q685k573P397N261m899o867J858P150R51o498l502M484N015k260
$$ -2253 6461 5760 -2925 -5498 1899 7160 2261 -4606 -2748 4402 5353 -1145 -4647 -163 4852 2592
477B592o008m18N215K443m033m292J935M695l3m447j920L309L230j857l537K13
$$ 2592 -3416 -3834 1381 3824 -209 -4501 -2566 2129 2096 -2351 -4271 -962 2268 411 -3126 -2913
493b913L347J258k121k100J342K384K01j801q40J517J426m54j129k6R91M75m39
$$ -2913 434 1692 -429 -2529 -1187 1197 1398 -403 -1243 274 1700 1246 117 91 1082 1557 1118
510A118l43O1J7k4K46j7n84o16N95O95o26j258j96J235M73j385j273O23J586o9
$$ 1118 775 836 853 829 1075 1058 474 -142 453 1148 522 -736 -932 303 776 -609 -1882 -1259 327 258
530B58j854j006J678J694j105k298K48K833R46k477j921K213L022q37l321j93
$$ 258 -1596 -2602 -924 770 -335 -2633 -2385 448 1394 -1083 -3004 -791 2231 1394 -1927 -2120
546b120L604J967k657l132J717M106P9m145j847L554L555k200m839L01M920J628
$$ -2120 1484 3451 794 -2338 -621 3485 3564 -581 -2428 1126 4681 2481 -2358 -2057 2863 4491
562D491m510l931K958M928j144n643j507M848L430l724n113J379N647R87n464
$$ 4491 -19 -3950 -992 3936 2792 -2851 -4358 490 3920 196 -4917 -3538 2109 3096 -2368
577b368l232M089N101k016n836l49N972K843m580m525K935N942l77n814j903N252
$$ -2368 -5600 -1511 3590 1574 -4262 -4611 1361 4204 -376 -4901 -1966 3976 3599 -2215 -4118 1134
593A134M237l260n598J095O134J608n535l846L916N519j777o364j002N853L274
$$ 1134 5371 2111 -3487 -2392 3742 5350 -185 -4031 -115 5404 3627 -2737 -3739 2114 5388
608E388m687n355K252O038J33o199k845M716M739k825n968J12N862K446m915m445
$$ 5388 701 -4654 -2402 3636 3769 -2430 -5275 -559 4180 1355 -4613 -4501 1361 3807 -1108 -5553
624e553K981N784m67n839j745N129L980l122n186J212N711J415m864l305L563
$$ -5553 -2572 3212 2745 -3094 -4839 290 4270 1148 -4038 -2826 2885 4300 -564 -3869 -306
639c06M987j352n520q37N217K975l915m712J977N370J54n363k556M172L994k505
$$ -306 4681 3329 -2191 -3028 2189 5164 1249 -3463 -1486 3884 4038 -1325 -3881 291 4285 1780
655A780n255J29N125J886m445l912K627M960o62n223j571M424L538k996m590J104
$$ 1780 -3475 -3346 1779 3665 -780 -4692 -2065 2895 2233 -2990 -4561 -137 3401 405 -4185 -3081
671c081N111J095m426k720L167M370j289m646n32M522K485l262l712J702M471
$$ -3081 2030 3125 -1301 -4021 -854 3516 2227 -2419 -2951 1571 4056 794 -2918 -1216 3255
686C255K78m337k005L496L325k117m195K49M254J300l749k873K327L612q30m100
$$ 3255 3533 -804 -2809 687 4012 1895 -2300 -2051 2203 3503 -246 -3119 -792 2820 1990 -2110
702b110r79L468K388k630l444J016L820M56l543j882K657L018j333l413k4L361
$$ -2110 -3089 379 2767 137 -3307 -2291 1529 1985 -1558 -3440 -783 2235 902 -2511 -2535 826
718H26J510k533k331J507L086j40k900r95K444K113j394k597L82K759P27k414
$$ 826 2336 -197 -2528 -1021 2065 1925 -975 -1970 474 2587 1193 -1404 -1022 1737 2464 50
734E0j651J670K168p76k447l90K187J084j633j894P80K034p2k040r42J551J426
$$ 50 -1601 69 2237 1461 -986 -1376 811 1895 262 -1632 -852 1182 1110 -930 -1872 -321 1105
751A105q57j884J65J767O28j481j113R06J507k00j511k56J335Q84p85j074K73
$$ 1105 248 -1636 -1471 296 924 -557 -1670 -764 743 543 -968 -1224 111 995 210 -864 -591
768e91J344K68r80o20P38R07l09r54p3R56M13p64p11L89P01o4p10k60M12L80l35
$$ -591 753 1021 41 -579 159 1066 757 -197 -270 686 1099 335 -376 13 714 650 -60 -320 92 472 137
789A37n33O3L98P2l60l08J71L18n2m12j1K82R1j36j28J08J59L8m6N5R9k4N8J08
$$ 137 -396 -333 65 137 -223 -531 -360 -42 -94 -506 -517 -235 -144 -280 -408 -300 -141 -103 -149 -94 5 -19 39 147
813A47j2j3l8J09J85r7j47P1J52P1j86j88N3K90j1m06j82L54K03k60m39Q3M10
$$ 147 135 122 84 193 378 281 134 205 357 428 242 54 107 397 386 -20 -202 152 355 95 -344 -261 149
836A49O2m70k83L51L68j05n51j16N02L92m53m72J97O95K7o16l10N95N18k27o80
$$ 149 211 -259 -542 -191 177 72 -479 -595 -93 299 -154 -626 -429 266 293 -323 -633 -38 480 253 -427
857d27M9P41L05n66n13L08P39Mq70k08O65N84m51p89N4R33J15p56n92N78Q01l26
$$ -427 -378 363 668 102 -411 -103 636 640 -230 -438 227 811 360 -429 -375 558 673 -83 -675 -97 704 378
879C78r67p8Q16N23o52q89L55R14N7q91m81Q16Q00m90r40O2R91L38p81o65N26
$$ 378 -589 -667 149 672 20 -869 -514 400 457 -434 -915 -99 701 211 -729 -667 324 662 -119 -784 -258
900b58R55j38r66k36Q89O14o14q08J29J041J99r21n94P08Q76m20r42j59J062M29
$$ -258 697 559 -407 -643 246 860 246 -562 -433 608 807 -114 -708 0 876 456 -486 -645 417 846
920H46q52p90N08Q93m8j015l41Q04P24n44r34J94Q53L72q44o45N73Q84k58q92
$$ 846 -6 -796 -288 605 557 -458 -799 5 729 185 -749 -555 298 670 -174 -819 -246 638 380 -512
940e12j64Q87N31p21o88L41Q79P3q30m30O52P05l65p80o2Q60L58p32n74L88P75
$$ -512 -676 211 742 21 -667 -326 553 626 -204 -634 18 723 358 -422 -484 376 734 2 -572 -184 591
961E91o1q07k88O84M78m27p04J37P56J12o00n16M87O79j79p81r9O43M15n09o38
$$ 591 530 -277 -565 119 597 170 -534 -397 359 471 -129 -645 -158 521 342 -439 -538 105 520 11 -627
982f27L40O50L4o37k81N19N12k67n97p2O21L02m77m16K39N78l1n43k64M87M26
$$ -627 -287 363 397 -240 -521 -2 510 243 -354 -426 195 497 20 -396 -157 421 390 -153 -417 70 496
1003D96l33n40J39N70N6m86k91K89M32r5m24j29M18K51k85m35J29N15j4l75k76
$$ 496 163 -377 -238 332 388 -98 -389 -100 332 237 -187 -316 102 353 68 -367 -238 277 263 -112 -388
1024c88L96L05j36m31l1M43J84l92k48J94K87M7l20j73K80L03k40l60J26L44R9
$$ -388 8 313 177 -254 -285 158 342 -50 -298 -104 183 230 -90 -263 17 320 80 -280 -154 190 289
1045B89l26k31K01K85o0l51M7K20J13j58k32J21K25k0j95j49K64J37p0k79L6K43
$$ 289 -37 -268 -67 218 158 -193 -146 74 187 29 -203 -82 143 123 -72 -221 43 180 110 -169 -133 110
1067A10J3j65j83K12J01o1j15m3J90P1p7j30K2J43Pj23n8J59M7j08n1rO9L7k8
$$ 110 123 -42 -225 -13 88 27 -88 -131 59 130 53 -77 -55 88 95 -28 -86 73 120 12 -39 -48 21 58 30
1092C0j64J43P5o0k4%NOJ3j7k3K4J1lr8Q0QK8j9l9R9j03PL3ql0j2M0kJ7q7J05
$$ 30 -134 9 84 24 0 0 5 11 24 7 -16 8 19 16 -82 -2 6 34 15 -24 75 -28 -21 12 4 -26 -38 2 0 17 -70 35
1124C5L5m7k6p7kJ07k9o3KQ5mom6K8O0O2j40o7J28N1j12n3P4J43l0j41o3J13J18
$$ 35 70 23 -3 -80 -82 25 -4 -67 -65 20 16 10 -36 -8 52 114 -26 -93 35 86 -26 -79 -5 138 108 -33 -96 17 135
1153A35p0j25K7J22L2j27n7M0J45p6j64R6P3K6k6j54O7J35k5j58l0R5J11j3k04
$$ 135 65 -60 -33 89 121 -6 -63 -23 122 46 -118 -22 51 77 51 -103 -36 99 74 -84 -114 -19 92 79 -125
1178a25OJ63O3j43q8O1J01J5j18m9J52O9m6j26J1J47N6j79q2J19J41j3k02lJ67
$$ -125 -119 44 107 -36 -124 -63 38 53 -65 -114 38 107 61 -65 -54 93 149 -30 -112 7 148 135 -67 -70 97
1203I7L0o8j57M1J48Qj82o4J39J40j31p2n5K06P2j72j53J03J77o5j70j4K35K5
$$ 97 127 59 -98 -57 91 99 -83 -147 -8 132 1 -71 -126 80 152 -20 -173 -70 107 42 -128 -142 93 118
1227A18q5j31L6J37L6j65m4P9J58j31r5O3R7P0r3j59R5J09j2j48l4R8J17q7j86
$$ 118 33 -98 -62 75 111 -54 -98 -19 139 8 -87 -24 73 143 50 -109 -14 95 83 -65 -99 -1 116 29 -157
1252a57P2J78l1j07l4L4J35p7j09j0J32Pn6j36R9J01J5j19p9J44Q8l2j26OJ57
$$ -157 -85 93 62 -45 -79 -45 90 13 -96 -106 26 33 -23 -159 -60 41 56 -63 -142 2 90 58 -68 -62 95
1277I5l0r0l4Q7J07r5q4lP9N5m8j13N9Q7no0o6P9L2k8n6k5J22m5l3l3l2P6K4p6
$$ 95 65 -25 -59 28 135 40 -44 -47 32 87 39 -74 -15 72 67 7 -59 20 52 24 -32 -57 65 20 -13 -46 -78 -2 22 -54
1307e4n2J08Q1r5Ol5K8K6n7J0l2P1L2o4n3Q1K7lo8L7J21o3on0M2rM9j03K0J5M7
$$ -54 -106 2 83 -12 -6 -41 -13 13 -44 -34 -66 5 37 -27 -80 1 28 25 -43 -6 115 52 46 -4 38 29 78 -25 -5 10 57
1338E7p1p3M9L1Ql3mL0M3l2Pp1N9J5rn9ON3K5q9QM9L3j7r1Q3k0k9L3J0n8Q0M8
$$ 57 -14 -87 -38 -7 1 -32 -36 -6 37 5 12 -59 0 15 6 -53 -47 6 31 -58 -50 -1 32 15 -76 7 -13 -42 -9 1 -57 23 71
1371G1p4l5L3L7Qo9L5K9J0n1j3N0j3K3k9n3M1J4l6QN2n8JNL1n6Q4j7m6J7M9Jp5
$$ 71 -3 -38 -5 32 40 -29 6 35 45 -6 -19 31 18 41 12 -41 0 14 -22 -14 38 -20 -19 -14 17 -39 45 28 -18 -1 48 49 -26
1404b6J0j3J6o5N0K8M5o7O3m2l1N8kk9K3M0o0lK2l3N7k9L5l4nOk9K2l8PJ5N0j3
$$ -26 -16 -29 -13 -78 -28 0 45 -22 41 -1 -32 26 24 -5 18 58 -2 -5 17 -16 41 12 47 13 8 14 -15 7 -31 -24 -9 41 28
1437B8L4j23R4l4k1L5m0j6N3MK9q3K5L5k8J2J0jrj4o%K9m8M5n0N8qj7J2K1K0J1
$$ 28 62 -61 33 -1 -22 13 -27 -43 10 14 43 -40 -15 20 -8 4 14 13 4 -10 -16 -16 13 -35 10 -40 18 10 -7 5 26 46 57
1470E7r8J9kJ1L7j4K2l9L6k1l9rQ8%n6N3n8L4k7k0L9k9Q2q2jL0jk9pR7r3O8m8
$$ 57 -41 -22 -24 -13 24 10 32 -7 29 8 -31 -40 48 48 -8 45 -13 21 -6 -26 13 -16 66 -16 -17 13 12 -17 -24 73 -20 48 0
1503@m1N1l7N5l2J5kj5O9q3NnP2r3L6J4pK0j6K9j8j6l7L2M2m4N3m0k8L8j2L1q4
$$ 0 -41 10 -27 28 -4 11 9 -6 63 -20 -15 -20 52 -41 -5 9 2 22 6 35 17 1 -36 -4 38 -6 47 7 -21 17 5 36 -48
1536d8L3N8l2k9J7o1O1J8J2q2M9M5o2K5M8l0j9k7n2P5K1j4k8N4kl1M8l8l3L6l3
$$ -48 -15 43 11 -18 -1 -62 -1 17 29 -53 -4 41 -21 4 52 22 3 -24 -76 -1 20 6 -22 32 30 -1 47 9 -24 12 -21
1567b1K9k4nM8J8l2k3L7l7n3O6OK7J2m6Ok3N9Mj01K5nP3m3J0qK4j8MK5m2LN0l8
$$ -21 8 -16 -21 27 45 13 -10 27 -10 -63 3 9 36 48 2 8 -15 44 48 -53 -28 -33 40 -3 7 -1 23 5 9 34 -8 -5 45 7
1601GQk4k8M5k2K1N6q9nO9n1M0k3K2k3N8l7p9P9j5J3l8K1M1o4K4p5L8k7L2nM2
$$ 7 15 -9 -37 8 -14 7 63 -26 -31 38 -13 27 4 26 3 61 24 -55 24 9 22 -16 5 46 -18 6 -69 -31 -58 -26 -31 11
1633A1m5jP5o8O7n3M1k7Rj8PM9k9j3k0j0M3nl2NK5j7k2N7m8O1j16P0qn1O1j7j
$$ 11 -34 -35 40 -28 39 -14 27 0 9 -9 -2 47 18 5 -15 -25 18 13 -19 -14 11 -6 -28 29 -19 42 -74 -4 -12 -63 -2 -19 -20
1666b0j5K2N9n3k3K2J5k8M1J3m6M6j0j1k4oPmL5J2j2j2k7Ok0L1j7k4Q6l5j8NN
$$ -20 -35 -13 46 -7 -30 -8 7 -21 20 33 -13 33 23 12 -12 -18 -11 -15 20 32 20 8 -19 -13 -33 -2 -19 -43 43 8 -10 -5 0
1699@o3O6K0l8J4mJ9nJMnm0J9j9nM0m7L8O1o2L5o0Q6n6pL7k2J5l9l6K9L3K1m8
$$ 0 -63 3 23 -15 -1 -5 14 9 10 14 9 -31 -12 -31 -36 4 -43 -5 56 -6 29 -31 55 -1 -8 29 7 22 -17 -53 -24 9 30 -18
1733a8K3oM2m9j4K2lkjQ3r0M6o2M3k0L9J2r0L9l9O6J0k8pL4l6l3PLO7Lm6L1j5
$$ -18 5 -1 41 -8 -22 0 -3 -5 -6 77 -13 33 -29 14 -6 33 45 -45 -6 -45 21 31 3 -4 30 -6 -39 -32 -29 38 41 -5 26 11
1767A1j2k9lL7JJ4J4n9O3j6n1kM3J0Rj2k6j4J0j3K2J9j3J2r0M3L0K2k7M0n1k0
$$ 11 -1 -30 -33 4 5 19 33 -26 37 21 -30 -32 11 21 30 18 -8 -22 -12 -25 -3 16 3 15 -75 -32 -2 20 -7 33 -18 -38
1799c8O3n0J9M9lm8q9J17L6l0Jn7K6Oo0P0l0l5P6jk0l0K9n0N6j3J0Kj0K3n4M7
$$ -38 25 -25 -6 43 40 -8 -97 20 56 26 27 -30 -4 2 -58 12 -18 -53 23 22 2 -28 1 -49 7 -6 4 6 -4 19 -35 12
1831A2J1j0J3m8O6k1Qml6L5k7%k4k8J02j8Jp9N0J6n1O5kNk9m2J13q4J4J6j2j7
$$ 12 23 13 26 -22 44 23 31 27 -9 26 -1 -1 -25 -53 49 31 32 -47 3 19 -32 33 31 36 7 -35 78 -6 8 24 12 -5
1863ej5N5o1M9rl6L8m1P2p4M3lJ4K2l5J0k1j0J0Rlj2OJ0nNJ5m9J0K8n5M8k4JN4
$$ -5 -20 35 -26 23 14 -22 16 -25 47 -27 16 13 27 49 14 24 3 -7 3 12 9 -3 3 13 8 13 28 -21 -11 17 -38 10 -14 -13 41
1898D1m9K3j4j8L4Qr2O0O%J6j8L6o0O3m4M7j7k5J1k6P4l7l5L4j8M1o3L6n0mM6
$$ 41 -8 15 1 -17 17 25 -67 -7 -1 -1 15 -3 33 -27 36 -8 39 22 -3 8 -18 56 19 -16 18 0 41 -22 14 -36 -40 6
1930FK5mo1oK0N1l1Qo9Q0l2j0K6j6k6kQ1lkl5l0P2q1O8k7rM4m3o2N7L7jlk9l7
$$ 6 31 27 -34 -40 -20 31 0 8 -61 19 -13 -23 3 -13 -39 -41 40 37 35 0 -30 42 -39 29 2 -7 37 -6 -68 -11 26 25 22 -7 -44
1965d4M2PJ0l8M0rj5K5m6N1o1K3%l9R0m1K7rpl2L2l6J4NQKK4Nrp3O1PLl0K6qk3
$$ -44 -2 5 15 -23 17 8 -7 18 -28 23 -38 -15 -15 -54 36 -5 22 13 6 -26 6 -30 -16 -11 -3 -1 23 28 19 -54 7 14 17 -13 13 5 -18
2002a8K2m8M6K7K2p7rL6j0k3j2O0l3L9qj2jn2L8l7Q7m8k7J8%N0l5QJj6N5n0K7
$$ -18 4 -44 2 29 51 -26 -35 1 -9 -32 -44 16 -17 22 14 2 1 -51 -13 -50 37 -11 -38 -20 -20 30 -5 3 4 -12 43 -7 20
2035B0p1L9Om1M4K7k4M8m1m8J4K7L9k1K6q1qO5k1pN3m2J1k0Lnl5P8n7jPk4jM0
$$ 20 -51 -12 -6 -47 -3 24 0 48 7 -41 -27 0 39 18 44 -37 -45 20 -1 -8 45 3 14 -6 -3 -8 -43 35 -22 -23 -16 -40 -41 -1
2069aJ1Nl4K6k8K3m2O6o4M7j6K4Ll5LQK5%r2R5k5j5J2k7J3N8n0K9j5m0P1rj9j9
$$ -1 10 15 -19 7 -21 2 -40 26 -38 9 -7 17 20 -15 -12 -4 21 21 -71 24 -1 -16 -4 -31 -18 40 -10 19 4 -36 35 26 7 -12
2103a2L8o1j0M3qo8K6L8LL3l9J9KMk6P3l2l9j6j1K3L8j2ml4OM0j5Mj2l6M2L5n8
$$ -12 26 -35 -45 -2 -10 -78 -52 -14 -11 22 -17 2 4 8 -18 55 23 -16 -32 -43 -20 18 6 2 -32 -26 14 -1 3 -9 -45 -3 32 -26
2137b6k7P0l8j0L9n2M8rJ7k8mK5l0R1r6K7k0N7J1l7j2K7qPMnj1n3J00m8K1o7M2
$$ -26 -53 17 -21 -31 8 -44 4 -5 12 -16 -20 5 -25 66 -30 -3 -23 34 45 8 -4 23 15 22 26 21 10 -43 57 9 30 -37 5
2170Eq6J10rM7j4r7K9J7m8N1J7j8Kk7l1O9mJ1Po3N0j5o4P4l2Q5r2M9m6K3J0l6
$$ 5 -81 29 20 67 53 -44 -15 2 -46 5 22 4 6 -21 -52 17 13 24 31 -32 18 3 -61 13 -19 66 -26 23 -23 0 10 -26
2202b6J0J9K6l6prP5l7K5q2L9Nj7L3k6j3k5L9j7K9pNN7q2m4P1k2J4m1J8J0N3m7
$$ -26 -16 3 29 -7 -14 -23 52 15 40 -42 -3 2 -15 18 -8 -21 -46 -7 -24 5 -2 3 60 -22 -66 5 -17 -3 -44 -26 -16 37 -10
2235a0L1K0l8m2K7J5j8l7P1K2p7P4po8R2m2mnl5M9J0qj0l4J5K7l0L3m8N1p8M6
$$ -10 21 41 3 -39 -12 3 -15 -52 19 41 -36 38 31 -37 55 13 9 4 -31 18 28 20 10 -24 -9 18 -12 21 -27 24 -54 -8
2267hPJ8jl6%M4rl7L8k4pM6l6k2J2M1l0L2n4J7j1oM9l3J1K5o5jj1N3m7M4J9Qn3
$$ -8 -1 17 16 -20 -20 24 15 -22 16 -8 -15 31 -5 -27 -15 26 -4 28 -26 -9 -20 -26 23 -10 1 26 -39 -40 -51 2 -45 -1 18 26 -27
2302b7K8M4q4PN6m3j9N5m4J1MKL8k1Pk9J3mJ5Po2P2o1O9m9L0j8kL3m7N9k6n0N9
$$ -27 1 45 -39 -32 24 -19 -38 17 -27 -16 -12 -10 28 7 14 -15 -2 -6 9 16 -46 26 -35 34 -15 15 -3 -5 28 -19 40 14 -36 23
2336B3m7Q0Kq3k3P5j5n7K6nk1M6j7J8j9j9J0L5%qK6J0n2l9P2J2n4M2Rl6oN5p3
$$ 23 -24 56 58 -25 -48 27 12 -45 -19 -24 -45 1 -16 2 -17 -36 -26 9 9 1 27 37 -15 -54 18 30 -24 18 27 -9 -15 40 -33
2369c3N9K5q4O2ro8P6k3QJl9QK9k6k6P9mRr5K8O5q8N8j5L5l5k3R7r2J8pj0N2J0
$$ -33 26 51 -33 29 20 -48 28 5 13 14 -25 -17 12 -14 -40 39 35 44 -51 -23 42 -46 12 -3 32 -3 -26 71 -21 -3 -10 -20 32 42
2403D2l2q5M3N9k3K9on4l3L3J3J2j7l3KQ0n4MK6k9j6Qm7P0PJ1l8j0L5K2k4nK4
$$ 42 10 -75 -32 27 4 33 27 -27 -60 -27 -14 -2 -19 -52 -50 30 -24 -20 6 -23 -39 -31 -78 -8 -1 10 -28 -38 -3 19 -5 -10 14
2436A4l3j3L2n0M0K2K1m8K4k0J5KK0k3j0J6l8J7mN4p3J8k5N7J9n0K5m0P0K7o6
$$ 14 -19 -32 0 -50 -10 12 33 -15 9 -11 4 6 26 3 -7 9 -29 -12 -16 38 -35 -17 -42 15 34 -16 9 -31 39 66 0
2467@K4j2k1j2mML6o0Q3k9J5l1OJ0K4pn0J5QJ1O4o6j6L1l5L4l0J8Ro9L9J7QJ8
$$ 0 24 12 -9 -21 -25 -21 15 -45 38 9 24 -7 -1 9 33 26 -24 -9 -1 10 74 8 -8 23 -12 22 -8 10 19 -50 -11 6 14 32
2501C2l3J3Pm6n1M3J3K9k6K7%J2Pm9J3J1L8l7j8lk1P6q3O3J2jn1K7l9M8Jl0OJ3
$$ 32 -1 12 19 -27 -78 -35 -22 7 -19 8 8 20 27 -22 -9 2 40 3 -15 -18 -39 37 -46 17 29 28 -23 4 -35 13 14 -16 -10 3
2535Cj3j2j6O0rj0J0OK1l7N0m8K4p3L2mQJ8M0k0j2K7j6Kl9K4Qn5%L8j6k9j6L9
$$ 3 -10 -22 -38 22 13 3 13 19 40 3 53 5 29 -44 -12 -16 -8 10 50 30 18 45 29 31 -8 16 24 -31 -31 7 -9 -38 -54 -15
2569a5J1K0l9K3j5j4N9n4%oL2L0Kl7k8J1j4j6Q9m2knn5L7K9QK5n8J6k5J8K1qM7
$$ -15 -4 16 -23 0 -15 -29 30 -24 -24 -30 2 32 34 -3 -31 -20 -34 -50 39 -3 -5 -10 -65 -28 1 9 34 -24 -8 -33 -15 6 -2 45
2603D5l3J5l1Mp3M5L5K0l4k9L1j5K0K2k1l1K9K1j1m2nK0n6M6%L4k5N7k8j6QP6
$$ 45 12 27 -4 0 -73 -28 7 27 -7 -36 -5 -20 0 22 1 -30 -1 20 9 -33 -38 -18 -74 -28 -28 6 -19 38 10 -6 2 78
2635G8o3L1m2J5jk1RJ5Nl1oR3p9M5l3k7L9j7K0m5pM5J3p8j3N8j8l5j2N0K4k6J1
$$ 78 15 46 4 19 18 -3 6 21 26 -5 -11 82 3 48 15 -12 27 10 30 -15 -22 23 36 -42 -55 3 -15 -50 -62 -12 12 -14 -3
2668cj5L3K6n5N8o7L6Mn0K7J8j3M4l0J3m3n8N2K6Jj9k8L5J8Ork0l9M3L0j9L2p0
$$ -3 -18 15 41 -14 44 -23 13 17 -33 -6 12 -1 43 13 26 -17 -75 -23 3 4 -15 -43 -8 10 16 7 -13 -52 -9 21 2 34 -36
2701c6%J9o9Q1M2n6MJ6k7rN4Lk3p3J18k5l7K7K8ln5L9J3rJ6n0J5l5QRPrj7nN8
$$ -36 -36 -17 -86 -5 37 -19 -15 1 -26 -35 19 22 -1 -74 44 19 -18 9 37 34 -21 18 31 22 38 -12 3 -32 -24 -15 -8 -17 -34 -39 19
2736A9j6j1K5lj3K4l3K1l3L2ok7rNL9J6j5mK3j3rl7QM5n3M4J7l2o0P6Po0L5j7
$$ 19 3 -8 17 14 1 25 -8 13 -20 12 6 -21 -30 -25 14 30 15 11 34 21 12 -25 -17 28 -25 19 36 4 -56 20 27 -33 2 -15
2770a5j7lK6K4pm8K2oN2l6N4n1J4l3K5L6l7j3K6k8QJ8l7k1pJ2K5L6m9K9NL8o1
$$ -15 -32 -35 -9 15 8 -40 -18 -24 28 -8 46 -5 9 -24 1 37 0 -13 13 -15 -7 11 -26 -47 -54 -42 -17 19 -30 -1 4 42 -19
2803a9J4Pl8O6m1J1kK4l5L0k5M5j2nn4L7nn3K4L9j4Oj5J0K2J8r3L7O6l8J4nl6
$$ -19 -5 2 -36 30 -11 0 -2 22 -13 17 -8 37 25 20 -34 3 -2 -55 -31 8 -6 0 -15 -5 17 35 -58 -21 45 7 21 16 -20
2836b0L3j6Jj6K8k2qm5K9JNO6j7J7q3P1n0O9J4r3O0j5k1MO5np3J7K4m9P7o4K0
$$ -20 13 -3 -2 -18 10 -12 -20 -65 -36 -35 -30 36 19 36 -47 24 -26 43 57 -36 24 9 -12 -8 57 52 -21 -4 20 -29 48 -16 4
2869DPM8n5j9qlL0LN0p8k7N3nm8Q0lm6J4Kl0R0j7o2LK8j1N6k9ok6NL4l8m3J8M3
$$ 4 11 59 4 -15 -23 -26 4 7 57 -21 -48 5 0 -48 32 29 -17 -3 -1 -31 59 42 -20 -17 11 0 56 27 21 -5 0 34 -4 -47 -29 14
2905A4m5K7O2o8j0K5Oj3n3P9kj4lM8k2q1M9L4j1n4M3QOJ5m8L3ok2KQm5O3j1mn
$$ 14 -31 -4 58 -10 -20 5 11 -2 -55 24 22 8 5 53 31 -50 -1 33 22 -32 11 19 25 40 -8 25 19 -3 -1 7 -38 25 14 10 5
2940EK4k2l0k4K9J1M3m1J5JQm2qL0j5K3k0M1n7J6L7oj2K1K1n3%m6J8O8l7Ml1M6
$$ 5 29 7 -23 -47 -18 -7 36 -5 10 11 19 -23 -31 -1 -16 7 -13 28 -29 -13 24 18 6 27 48 -5 -5 -51 -33 35 -2 2 -29 17
2974A7n0JK7pN1n6mQK8Mn0O9k9J6l0M1n7J9j9ONJ2L3pJ5k8K6m1j1j8J1L9l4P3
$$ 17 -33 -32 -5 -12 39 -17 -21 -13 15 19 -31 38 9 25 -5 36 -21 -2 -21 -15 -10 2 35 28 43 15 41 0 -11 -29 -18 21 -13 60
3008F0l5Pn4j7N2k5mJ8k1j6O4Jn4jN7o0L9pK2n1l9O7%K0j3KQOoqK6K2p9J2j4j5
$$ 60 25 32 -22 -39 13 -12 -16 2 -19 -35 29 30 -24 -25 32 -28 11 4 26 -25 -64 3 3 23 10 12 20 26 20 12 38 60 -19 -7 -21 -36
3044c6J0K9mJJ7l0M4l3K7m7NJ46j24N2m2j0l9J5L5Nn9R2rj0l7Opj8R1p7J7j0K4
$$ -36 -26 3 -1 0 17 -13 31 -2 25 -22 -17 129 5 57 15 5 -34 -19 16 21 -38 54 45 35 -2 4 -3 -21 70 -7 10 0 24
3077B4%m1R6m6Qm2j5J5Ml3J2L3pL7p4N8q1R8m3l5J2K1L5qPm5NM8n6J8J8pj3j3
$$ 24 24 -17 79 33 41 -1 -16 -1 3 -30 -18 15 8 45 -29 29 -52 46 3 -32 -20 1 36 28 35 -10 -5 43 -13 5 23 16 3 -10
3111a0j3K0j7N2kmo6M0J8L0l6l3OK5O5l3m7k3M6k7J7l8L5m4L3N1j8q3L9j0J9j
$$ -10 -23 -3 -20 32 30 26 -40 0 18 48 12 -21 -15 10 75 42 -5 -28 18 -9 8 -30 5 -39 -6 45 27 -56 -17 -27 -8 -9
3143im7Q3k1Nm1N8lJm1J9ok0N3p1J6LRO5k8m1N8m3Qj9L6l4MK3p1L7K8K3m1k4J1
$$ -9 -56 27 6 11 -30 28 25 26 -15 4 -2 -22 31 -40 -24 -21 -12 53 25 -16 42 -1 7 -12 24 -10 -6 17 -54 -17 11 34 -7 -31 -20
3178b0J3mj8M2k9KJ3Qpj2l4O7J1j1nl1k3O1L2k4LMo0M1k3J8k9L1J4J0o1J7ML4
$$ -20 -7 -11 -29 13 -16 -14 -1 7 0 -12 -46 21 32 21 16 -15 -38 23 55 31 34 38 -22 19 -4 14 -15 16 30 40 -21 -4 0 34
3212C4j9RJM5o3Nk2qJ4k0M8k6l8L6PQN4m5l0j4P5r6K1M9Po2N0j1M2n7k2J2lqJ9
$$ 34 15 24 25 70 7 12 -10 -18 -4 -24 24 -2 -40 -4 3 11 65 20 -10 -24 51 -45 -24 25 32 -30 20 9 51 -6 -28 -16 -19 -27 -8
3247hJnl6L0n1M6lK9K1j0m1qN5j1k4J7ll3N8m8K1J8j6L5l5j7K7lpj1K2N0j27M4
$$ -8 -7 -12 -48 -18 -69 -23 -26 3 24 14 -27 -35 20 9 -15 2 -1 -34 24 -24 -3 15 -1 34 -1 -18 9 6 -1 -12 10 60 -67 -23
3281b3M6l2RRj6mn5M7M0m2jKrM0m1OLJ4M0j14J18o0J1m6P0j3LJ1j2J8J4l6nkP0
$$ -23 23 -9 0 9 -7 -11 -66 -19 21 -21 -22 -20 -29 11 -30 -24 -21 -7 33 -81 37 -23 -12 -58 12 -1 2 13 1 19 33 -3 -8 -10 60
3316F0n8L9o2J9Mm1j3Q9n4jN3n2P5l8m9N6nm8lM7jl2M1o2L6JJ5k4L4L2o1mJ5M
$$ 60 2 41 -21 -2 2 -39 -52 37 -17 -18 35 -17 58 20 -29 27 22 -26 -29 18 17 -15 26 -36 0 1 16 -8 26 58 -3 -7 8 12
3350A2L6qn2Q4q4K6m5N3rqJ7l5l8M7J0k9K4l3k6K3N6p5M1m4Q5m2pOn0pJ6M0J9
$$ 12 48 40 -12 72 -12 14 -31 22 13 5 22 -13 -51 -4 6 -23 1 -32 -58 -35 21 -54 -13 -57 28 -14 -21 -15 -65 -72 -56 -16 3
3383CJ5n4L8k7K7K8l5j3l2K4K3Mj3K9l0K0J0l6M7l9J9Mj7K1Pj2m0J8l3O7o4lK0
$$ 3 18 -36 2 -25 2 30 -5 -18 -50 -26 -3 1 -12 17 -13 7 17 -19 28 -11 8 12 -5 16 23 11 -29 -11 -44 23 -41 -44 -24
3416b4N3n4M7l6L7l3J7N3j04L3nL1ll1MJ6K3Qm2J3K0k7K0m9O6k9nM4p3N9k8j5
$$ -24 29 -25 22 -14 23 -10 7 60 -44 -11 -16 15 12 -19 -15 1 24 32 -10 3 23 -4 16 -33 33 4 -1 43 -30 29 1 -14
3448a4rK8j5m2K3J1j4K4K0n8P1J6j5l5K2K9p7kM6m3M4mpO3n3K7o0M0L8m5L0rk4
$$ -14 -23 5 -10 -52 -29 -18 -32 -8 12 -46 25 41 26 -9 13 42 -35 -37 9 -34 10 6 -1 62 9 36 -24 16 54 9 39 30 6
3481FmQl1OLM8p1J4L4Ll3npLN5m5K4l6L7j9M8nk6K2l2k9O5j8Prm8M3jpJ6j3J2
$$ 6 2 10 -21 -15 -12 36 -35 -21 13 16 -17 -22 -29 -26 29 -16 8 -28 9 -10 38 33 7 29 -3 -32 33 15 22 13 -35 8 7 0 16 3 15
3518A5l4P4p2M9ko6R6r9K1J5j4k8M7J1qK5l9j7J0L4Km6M5k0nJ0j0J0m0J7N7j0
$$ 15 -19 55 -17 32 30 -36 60 -39 -18 -3 -17 -45 2 13 5 30 -9 -26 -16 18 20 -26 19 -1 -6 4 -6 4 -36 -19 38 28
3550B8rk6K2pJ5k5j4j0qO1m2%M8j4%l3M1k3j3l1N2nL0p6N3j8oQL9o7j9L9k5J3
$$ 28 19 -7 15 8 23 -2 -16 -26 -34 27 -15 -15 33 19 19 -14 27 4 -9 -40 12 7 37 -39 14 -4 -10 -2 37 -30 -49 -10 -35 -22
3584b2j4O0Ml2L0n4L6%m5L3k8L2Km1L9l0M2j7RJ4k1J9oj4K6mk1l6P2n6M9Ko5R9
$$ -22 -36 24 28 -4 26 -28 8 8 -37 -4 -32 0 2 -39 0 -30 12 -5 4 18 -3 16 10 -4 22 18 -3 -39 33 -23 26 28 -37 62
3618F2m6oJj6k6M2K1l0l3K7K8m1N9p3L8JK7k3k0qM6k0l9J3K7k0Kl8N3K8qmo6J6
$$ 62 16 10 11 -5 -31 11 32 2 -31 -4 24 -17 42 -31 7 8 35 12 -8 -16 30 10 -29 -16 11 -9 -7 -45 8 36 28 24 -42 -26
3652b6jJ1m4N9J6%J1n3k5Q8j6k5k4k7M3K1pLj6M5l9q5M0J23r6N6o2L7L2l6n%O5
$$ -26 -27 -16 -60 -1 15 15 26 -27 -52 36 20 -5 -29 -56 -13 8 1 4 -12 33 -6 -91 -51 72 -24 32 -30 7 39 3 -2 -2 63
3685F3l8k0j1j9L4J1j5Pl4O6l9j9JN2m7n5Q2J0j8K1k6M7m6k4PK9J1j2mj6JK9j2
$$ 63 25 5 -6 -25 9 20 5 12 -22 44 5 -14 -13 39 -8 -63 19 29 11 32 6 53 7 -17 -10 19 30 18 14 -2 -1 28 16
3718A6n3N5L8p3N8l1k6Ll4J6L9N6j16K7L5M6o6mKl8M9j9kJ8j3J6Pk5qL3m0P2K
$$ 16 -37 18 56 -17 41 10 -16 -13 -47 -31 8 64 -52 -25 10 56 -10 -14 -12 -50 -1 -20 -22 -4 -17 -1 6 -19 -27 6 -34 38 40
3751D0m4O3q8PN1%rL3p0L4J8o5O5mj1J1l8NJ4L6o5J7j4M1m6Oqj0K5oP4q5O9o6
$$ 40 -4 59 -29 -22 29 29 20 53 -17 17 35 -30 35 31 20 31 -7 -2 12 48 -17 0 -14 27 -19 -13 -21 -31 -6 -12 62 -23 46 -20
3785b0L7n9O9k6O0p9LJ0M4p8L2%L5j6Jk2lL1l4n6J17Mk5J5l3J1l2K1L7l8Rk1O
$$ -20 17 -42 27 1 61 -18 -15 -5 39 -39 -7 -7 28 12 13 -9 -12 19 -15 -71 46 50 25 40 7 18 -14 7 44 6 15 -6 0
3818@K0J3o2J8M3m9M7j3J1J3k9K6J0k2k0QJ5o7O1l6j0M3jm0L5kKm3k0R2k7o4p
$$ 0 20 33 -29 -11 32 -17 30 17 28 41 12 38 48 26 6 14 29 -38 23 -13 -23 20 19 -21 14 12 14 -29 -49 43 16 -48 -55
3851e5O3J1o4M8k3J5l6K4K9l6M7m3l4L0L4j0JJ3j0J6j6m5L3J3k9l3O3j1J5k9K5
$$ -55 8 19 -45 3 -20 -5 -41 -17 12 -24 23 -20 -54 -24 10 0 1 14 4 20 4 -41 -8 5 -24 -57 6 -5 10 -19 6
3882Fj8M1p8L8n2N7%l1P9j5lk1L2l4k1J2K4J1l0Ll0K7J9nj3j0l3M1J8K2k9k6N8
$$ 6 -12 29 -49 -11 -63 -6 -6 -37 42 27 24 3 35 1 -20 -8 16 27 -3 0 -30 -3 16 11 -2 -12 -45 -4 14 36 7 -19 39
3915C9rn0M0l2kK6J4m0j9M3n7M4m4M2j2J5m5L0k2J1J3k6O6l2qRN9n4K4o5L3LJ8
$$ 39 30 -20 20 -12 -14 12 26 -14 -33 10 -47 -3 -47 -5 -17 -2 -47 -17 -39 -28 -15 -41 25 -7 -15 -6 53 -1 23 -42 -9 -6 12
3948A2J1l8N3n7MJ1K6pKRn6P4l2n2KK3L2J6k2J5p4jK8j6K7L3j5l2j4MJ9K5j0K4
$$ 12 23 -15 38 -19 -15 -4 22 15 17 26 -30 44 12 -40 -38 -15 17 33 11 26 -48 -49 -21 -37 -10 23 8 -24 -38 -34 -15 10 0 24
3982B4k8J0K5l2L5j3Lpl3K0KK3J0n0jk6K1M1j00J06n8M2J2l3J3L2n4K5o6N2k9
$$ 24 -4 6 31 -1 34 21 24 17 -16 4 6 29 39 -11 -12 -38 -17 24 -76 30 -28 14 26 -7 6 38 -16 9 -57 -5 -34
4013c4O4L4n4qJ4p5O8rlK7nk1K2qpL7k0N3q2j3rQM0j1K5p3K2K9L1n6J3Pk3j0k6
$$ -34 30 64 10 2 16 -59 9 0 -3 24 19 -2 20 12 5 42 22 75 -7 -20 -29 -21 19 8 33 -40 -18 11 42 -14 -1 6 -17 -27 -53
4048e3N3Nk4K0q4Q9M2o9L1l9M7k1M1k8Kk4K1o1K1L3K5j8J7J3n8J5M2l2j6K2K4
$$ -53 0 5 -19 1 -83 6 48 -21 10 -29 18 -3 38 10 12 -12 9 -52 -31 2 27 9 26 39 -19 -4 38 6 -10 12 36
4079C6k5rJ8n7OL7l9M7L5l3m6M1l6RK1k4K6K1l2K6L9r6p%L8j5J1J0K6n9N5kl2
$$ 36 11 2 20 -37 -31 6 -33 14 49 16 -30 11 -25 -16 5 -19 7 28 -4 22 61 -35 -42 -42 -4 -19 -8 2 28 -31 24 22 -10
4112a0L1o3P0qJ4Jo0P2j7j6n5P4k4jk2J4j5L2k1K7n0KK8k3O1n8O1m2K1k9j6N9
$$ -10 21 -42 28 20 34 35 -25 47 30 14 -41 33 9 8 -14 0 -15 17 -4 23 -27 -25 3 -20 41 -17 44 2 23 -6 -22 37
4144C7r3M9rL7rl9N0l8Qj9rM8OL0m8Nj2K4J3j1n5L0L1%J7n4k3J3J2j8K0J4%J1
$$ 37 -56 -7 -16 21 12 -27 23 -15 -7 -26 -35 13 19 49 1 6 -6 18 31 20 -35 -5 26 26 43 -11 -34 -21 -9 -27 -7 7 7 18
4178A8j2KnJ8J8k1j9M3l1M3m1J4m2L2n8P1j4m0O1l5Om5L6L4Pr7M9j6L6N1l4L0
$$ 18 6 8 3 21 39 18 -1 42 11 54 13 27 -15 17 -41 30 16 -24 37 2 8 -37 -1 33 40 -57 -8 -24 12 63 29 59
4210E9j0m2k1NN9m7k5J2k9L4j8J5M8n0%K2Oj0j3QJ2L1q7Q1p7R7r7J6K9J7m3J8
$$ 59 49 7 -14 -9 50 3 -22 -10 -39 -5 -23 -8 40 -10 -10 12 18 8 -5 3 15 46 -41 40 -37 60 -37 -21 8 25 -18 0
4242@J3m0J0MJ1m7J4mkK5O3n0MRNNJ5l2k5M1p3N7k7P7q0N2l9QL5l7k6mM8LL4k4
$$ 0 13 -27 -17 -13 -2 -49 -35 -39 -41 -16 47 -3 1 10 15 20 35 3 -22 19 -54 3 -24 53 -27 25 -14 -6 29 -8 -34 -38 10 13 47 23
4278B3n3O4j0l4RL2k1p2L1L4l0L7k8k6O1qJ9j2n3K7K8prN3j0n3M2l5L6J3j7M1
$$ 23 -30 34 24 -10 -1 31 10 -62 -31 3 -27 10 -18 -44 17 9 28 16 -37 -10 18 11 2 55 45 -8 34 -1 35 48 31 72
4310G2o4m3K2L9K7Pm1l0j6J7j4M0j9l1O9r1J16j14O7J5K7o6j2P2k4nl4O2l2l5
$$ 72 8 -35 -13 26 53 60 19 -11 -27 -10 -24 16 -3 -34 35 -56 60 -54 13 28 55 -11 -23 49 25 20 -14 48 16 -19
4340a9kN6j4m7N5l8KK9m1mK8kk9KJ5j3m3O7k6K1rL8n7K0k5J6J3K6n0J7n1Q0j2
$$ -19 -21 35 21 -26 29 -9 -7 22 -19 -23 5 3 -26 -24 -9 -22 -65 2 -24 -3 -12 26 -31 -11 -36 -20 -7 19 -31 -14 -65 15 3
4373Cl0pM3k3M6m1l3L2J2K8M7o9J0j9K2n3M3j3j7QN8o8j4K3N3k2nm1K3P5l3p5
$$ 3 -27 -34 9 -14 32 -9 -42 -10 2 30 77 8 18 -1 21 -32 11 -2 -19 -11 47 -21 -35 -12 41 19 14 -27 -4 71 38 -37
4405c7K3L9OrQn2N1kl3J6j8O3m0NoM3m9m5O3m1LOL3n2M5lm7lM5K0j8j5orJ1J6
$$ -37 -14 25 31 22 30 -22 29 27 -6 10 -8 55 15 20 14 57 8 -37 26 -15 -12 -6 27 -25 20 17 -30 -33 12 32 14 -1 -7 -16 -5 11
4441A1mk6m1M3L0L0J4r0O8o0J7O0r1M1L5j6l0M5Ll0K5o4L9j4K4k9J1l1J08p6n
$$ 11 7 -19 -60 -17 13 43 57 -33 35 -25 -8 52 -39 2 37 21 -9 36 39 9 34 -30 9 -5 19 -10 1 -30 78 2 -3
4472cQk0K7p0M8k9M9K0J0j4l3J4j5j8K1jL5o1nM0j5k6PQO6k1ok7K9m4J1L3n1R
$$ -3 5 -15 12 -58 -10 -39 10 30 40 26 -7 7 -8 -26 -5 -6 29 -32 -37 3 -12 -38 -31 -23 43 22 16 -11 18 -26 -15 18 -33 -24
4506b4K9j8kk6P0j0k8K2k7k1J8N4k7j8j4R4p3J6J3J8l3%j0L3l0j8J8N5k9l8lK7
$$ -24 5 -13 -15 -41 29 19 -9 13 -14 -35 -17 37 10 -8 -22 72 -1 15 28 46 13 13 3 36 6 -12 6 61 32 -6 -9 18
4538A8l3K1N7j16M1j5M0k4j7L9qmj4J1k0Nl8K6PJ8mJJO9n4j2K7p3O1%KK0m3L0
$$ 18 -15 6 63 -53 -12 -27 13 -11 -28 11 3 -1 -15 -4 -24 -19 -57 -31 -24 -6 -10 -9 -8 61 7 -5 22 -51 10 10 12 32 -11 19
4572A9m4J9Qm9O6n6N2o2L1L9j4k8l4N7K1K2o7J2K2k1q3O8K9J4l4J4J9k1nJ0m9
$$ 19 -25 -6 2 -47 19 -37 15 -47 -16 23 9 -19 -53 4 25 47 -20 -8 14 -7 -90 -22 7 21 -13 1 20 -1 -6 4 -45
4603d5O1l9K0l3L6M5o2L0j8J8%o4L6JK9qK5l1J2pk3K6j9Mj8N1K7n8J9m8N3k7M7
$$ -45 16 -23 -3 -36 0 45 -17 13 -5 13 13 -51 -15 -14 15 7 32 1 13 6 -17 9 -10 -6 -24 27 54 -4 15 -33 20 -7 40
4636D0l3Mk8lqK7m2K0J6J0k8J1l1R8l6m5j2L2nNJ4Rj0j0PJ2K0n4J0O9q2PQK4o
$$ 40 7 11 -17 -20 -28 -1 -43 -23 -7 3 -25 -14 -45 53 17 -28 -40 -8 -13 -8 6 15 5 -5 2 14 34 -20 -10 59 -23 -16 -8 16 10
4671A0K6j0n2L5k3QPnj1M6j8Nj6Mj5M9n4k5J8M2l7o2M9M1Nn9M0j7Mj3J4J0M8J
$$ 10 36 26 -26 9 -14 -6 1 -4 -15 31 13 18 2 6 -9 40 -14 -39 -21 21 -16 -78 -29 12 17 -42 -2 -19 -15 -28 -14 -4 44 45
4705D5l8qN7q5K7J2nj9J0KL3m8K1LJ0l8pML3PMK4m4l8J5J7k7J1j0L8mK5j5J0l0
$$ 45 7 -1 56 -29 -2 10 5 -14 -4 -2 31 -17 4 7 17 -21 -28 -24 9 16 20 44 0 -38 -23 -6 -33 -22 -32 6 2 27 12 22 -8
4740hKj4Np6J47Jm3K8m6rM0j2m6M3j4J5j7nj6N9n4K2j2k4N7m1J1L6l6K0j4QJ4
$$ -8 -6 -20 -15 -91 56 57 14 42 -4 -13 27 15 -31 12 -2 13 -4 -9 -25 34 -20 2 -10 -34 23 -18 -7 29 -7 13 -1 7 21
4773B1l1M3l3K8o7J7QK7l2M9ql0nQ7l1q1L4N1p4OP7j06N5K3ol6N4o0M3j2J8o1
$$ 21 -10 33 0 28 -39 -22 -14 13 -19 30 22 -8 -13 74 43 -38 -4 47 -27 -21 56 -50 5 28 22 -14 40 -20 23 11 29 -32
4805c2mM4PJk8LJl5L9l4N0m5K5oK5Qlk4L6k1j9J5%l0j1O2Mo9M0M1o3j2J2N7J5
$$ -32 -36 8 15 16 -12 -9 -8 -43 -4 -38 12 -33 -8 -14 11 19 16 -8 28 7 -12 3 3 -27 -38 24 28 -41 -1 40 -23 -35 -23 34 49
4840D9o0j9L1oJ5Qm0L7mk5K5k3K3j9k3N9k5%K5n2J7j5K9K9j6l0K6M3m2n1J9O8
$$ 49 -11 -30 1 -5 10 18 -22 15 11 -14 11 -12 11 -8 -31 28 3 3 28 -24 -7 -22 7 36 20 -10 16 59 17 -34 -15 53
4872E3o2J2%O0p7K3J3k0J6Kl3K0Jj6N5l3L2n9j1Qm9L0J6M9j8l3N5l3Qj5m3J01
$$ 53 -9 3 3 63 -14 9 22 2 18 20 -13 7 8 -8 47 14 46 -13 -24 -16 -65 -35 -19 30 12 -21 34 1 9 -6 -49 52
4904E2n7L5m1K9J7j5rO%Ql7J2j3LM4p7L8LM1q0JO0k1j9J3l3O6j2n7O8l0OJ0m6
$$ 52 -5 30 -11 18 35 20 11 17 17 25 -12 0 -13 -10 34 -43 -5 -2 39 -41 -40 20 -1 -20 -7 -40 26 14 -43 25 -5 1 11 -35
4938c5Q3o8k2M3j9l8P3j0P6q1M9n8k2N6m0J6K8l6k4N2m4j6J6Lk9Q3K4J1q0L8j9
$$ -35 48 -20 -42 1 -18 -56 17 7 83 2 51 -7 -29 27 -13 3 31 -5 -29 23 -21 -37 -21 -18 -47 36 60 71 -9 29 10
4969A0j4lM9n3J9mL2j1Ql6l1P0l2km5M8k3K6%K0K3q7k0P4j7K0p1M2L6k0l7K5M0
$$ 10 -4 -7 42 -11 8 4 36 25 33 -3 -34 36 4 2 -43 5 -18 8 8 28 51 -36 -56 18 1 21 -50 -8 28 8 -29 -4 36
5002C6o3J5M3j2M%n1K1lkN1j03R6l6K7k0J2m7M2j6K7Nj8j5l6J6K4M9Lo8L5j4p
$$ 36 -27 -12 31 19 23 23 -28 -7 -10 -12 39 -64 32 -4 23 3 15 -32 10 -6 21 26 8 -7 -43 -27 -3 46 49 -19 16 2 -5
5035eK9J6qj5k4L4Rj4%L6p3l1Q5k7rj7qL6m2M8k4JK9j4ql9KM7rk9mL3j1L0q7R7
$$ -5 24 40 32 17 -7 27 36 22 22 58 -15 -46 39 12 3 -14 -22 14 -28 20 -4 -3 26 12 4 -35 -33 14 5 -24 -28 5 -6 24 -63 34
5071C4q0R5m3P1r2LNl4M1KJ2%Qo4O6p5N3j4NJ3K0m0k3mP8rm4J0m2N1m8M0K6J1
$$ 34 -46 49 6 77 -15 -12 -7 -41 0 2 14 14 22 -42 24 -51 2 -12 -7 6 26 -14 -37 -41 37 28 -16 -6 -48 3 -45 -5 21 32
5105C2j9pnPJ6l8L8n0O8n1J0qN5j1n6M8n7L9l3L6nk0PJ5M9p9J4m2L6k0P0rj5R
$$ 32 13 6 1 8 24 -14 24 -26 42 -9 1 -7 48 37 -19 29 -28 11 -22 14 9 -11 -4 11 60 -19 -5 -47 -11 -31 39 30 15 24
5139B4ppL5o7MJ1J0l7K1N8l4k5M4j10J19n0RJJ9J6l3K3j4k5mJ4J3k4k6L0k6N6
$$ 24 17 10 45 -22 -18 -7 3 -34 -13 45 11 -14 30 -80 39 -11 -2 -1 18 34 1 24 10 -15 -19 -5 8 -16 -42 -12 -38 18
5171A8pJ9m1qL8j6J9j9J6mm4JN5j4l5M1J6m8RQl5L4K1j0l1L2LKj1J3K5k2p4O5
$$ 18 11 30 -11 -19 19 3 22 3 19 15 -29 -28 27 13 -22 19 35 -13 -4 4 -31 3 24 14 -17 15 18 20 9 22 47 25 -49 16
5205A6n4P3m5l0L9KL5l6k1J9rL1K0r1J02n5j6J7pn2N0K4Mj6jj6N4k5Mk9m8R1j4
$$ 16 -38 35 -10 -40 -1 1 36 0 -21 -2 -11 20 40 -51 51 -4 -20 -3 -10 -62 -12 12 16 0 -1 -17 37 12 16 -13 -61 30 16
5238A6J9l9Ko9L8J8PL5j1l2qO5m0qj2O7q4M8m3P8n5K9j5J2nJ7o9O8n7K3k2M5l3
$$ 16 35 -4 -2 -71 -33 -15 -8 27 16 -16 -24 41 1 -7 -19 48 -36 12 -31 47 -8 21 6 18 13 30 -39 29 -28 -5 -27 18 -15
5271a5M2oj8LNk6j3Q7j02K7PK2j3L8o7J0jPL0l8K6qM5k5m2M8l6OJ8kl1jlM1k1
$$ -15 27 21 3 6 11 -15 -28 59 -43 -16 -9 13 0 38 -29 -19 -20 -13 17 -21 5 -3 42 17 -25 23 -13 -7 11 9 -22 -23 -26 15 -6
5306fj3M3n7M2L3n5N8k7l7MM0Rl4N7p4J4lK6Rmj4L0l4rJ0J2k0oM5l6J9n9L2ok7
$$ -6 -19 24 -33 9 42 -13 45 18 -19 -15 25 34 0 57 -17 -3 -6 20 29 25 11 41 7 -2 8 20 0 -6 39 3 22 -37 -5 -11 -38
5341c8N7Ql3P4j8p6J8k4M0m1RJ7l9O1q3P9q4P4m2N7l0L4Mm4O2n1K4k6L2K9n3L5
$$ -38 19 27 -6 68 50 -26 -8 -32 8 -33 -24 -7 -46 15 -68 11 -73 1 -41 16 -14 20 24 -20 42 -9 15 -11 21 50 -3 32
5373C2k3Rn2J5P9j07O1j4j8Ok1M5pM1l2M3m3j0J6l8J9Qj5lj9j6N8o0J3L6M0p0
$$ 32 9 18 -34 -19 60 -47 14 0 -18 -12 -33 12 5 46 14 57 14 4 20 -18 1 9 -6 -9 -28 -44 14 -46 -33 3 43 -27
5405b7J1N8l9J7n0KM6J0q2P7K4m7L5m6rl%M0l4K2l0L6Jl1O0m0k8J4K4K4k1n0q
$$ -27 -16 42 3 20 -30 -28 18 28 -54 23 47 0 35 -11 -20 -23 -23 17 -17 5 -25 11 12 -19 41 1 -27 -13 11 35 14 -36 -44
5438d4N6kk3l4O7kk6N5m0k3L7Pj8K6j2o7N3K1o4L2K8ml3L6j9qj1M9m8M1j6l2J2
$$ -44 12 10 -13 -47 20 18 -8 47 7 -16 21 28 10 36 24 -43 10 31 -33 -1 27 23 -10 26 7 -1 -12 37 -11 30 14 -18 -6
5471fpO1l6k1P1n5J1lJ5j2K8l5l0K4L5l9n5L6J9pl7N2L1o0P2lK4o6L1Nj6jm5K5
$$ -6 -13 48 12 -9 62 7 18 15 30 18 46 11 -19 5 40 1 -54 -18 1 -6 -43 9 40 -20 52 49 73 7 38 43 27 26 -19 6
5505Fn4L9Lk7M3L4o0m5L6J5L2mRq1L2L4l5pK4j6J2L4m6R0o1K6l2kOK7L2n9N3Q
$$ 6 -48 -9 -6 -33 10 44 -16 -61 -25 -10 22 18 27 -54 -22 12 -23 -30 -6 -22 -10 24 -22 68 7 33 1 -1 5 32 64 5 58 66
5539F6q9L8k3j6j4N8j8K8l0knJl3L4m4M1K0m5K6j9j2K5K2k1J4Pk3Lj0K8K0m4N4
$$ 66 -23 15 -8 -24 -38 20 2 30 0 -2 -7 -6 -39 -5 -49 -8 12 -33 -7 -26 -38 -13 9 -12 2 9 -14 -11 -21 7 27 -17 37
5572C7pLj2K4m9l3R2m3n4M8J7Qn9K3J6L7k6k9M5n6lM7j6j6N3m2mK2nJk0olj9J6
$$ 37 30 33 21 45 -4 -37 55 12 -42 6 23 31 -28 -5 11 48 22 -7 38 -18 -21 26 10 -6 47 5 1 23 18 19 -1 -7 -10 -29 -13
5607a3Oj9L2ko0P8k1j4M1k5qj0K4k7J0n9Q9l8L2J3kOl6Lk6O1l2K0l3j1k2M3L7
$$ -13 -7 -26 6 4 -56 22 1 -13 28 3 -5 -15 9 -18 -8 -67 22 -16 16 29 27 33 -3 0 -26 35 3 23 -10 -21 -43 0 37
5640C7p5Q9m2l3N6K3n9J7j9L0n8L9L1j1q9M7J9k2N8m6PLJ6Pj8kM6n2nlqm9P1M0
$$ 37 -38 51 9 -24 32 55 -4 13 -6 24 -34 5 36 25 -64 -17 2 -20 38 -8 -1 2 18 25 7 5 51 -1 -6 -9 -17 -66 5 45
5674D5k5Noj0Rm0K8l8L9Mjj5j2nQ9j18M3JK0K6o9jK9N6o0K8m3L4k1RL5Oo2j4P
$$ 45 20 25 19 9 18 -22 6 -32 7 11 10 -5 -17 -22 67 -51 -8 -7 13 39 -30 -31 -2 54 -6 22 -21 13 -8 1 36 42 -20 -34 -27
5709b7K2MK0oRk2%N7m4M5p9oK7j6J4J1ok8L1rJ7k8J0lLJ6j7l9O6o9K2PJ1jpK0
$$ -27 -5 -1 19 13 22 0 0 57 13 58 -21 -27 0 -16 -2 9 3 -25 6 -3 14 -14 -4 -7 -4 12 -5 -44 22 -47 -25 -18 -7 -8 -15 5
5745E%L5jJ7p6L0l2R%lP2pk6Mj2lm5J3l4PL6O7j8on0K3M0o6Q2n5K2J3o3L7l3K8
$$ 5 5 40 39 56 -20 10 -22 -13 -13 -16 56 49 23 27 15 12 -33 -20 -54 -47 -11 56 38 32 -18 5 45 -21 61 6 28 41 -22 15 -18 10
5781A0k8lK4j4lK1L6o3M3k9k7L0J4k6K4K3l8jN8j9l9JL1oM7p4lM7p0M6n0J8J6
$$ 10 -18 -21 3 -11 -14 7 43 -20 23 -6 -33 -3 11 -15 9 32 -6 -7 51 32 -7 -6 25 19 66 -8 -11 36 -34 12 -38 -20 -4
5814dJ8m8OK0rlm9Q8K1l4J3L8q8%pK9Mn0L0J7lk0J2JO6n9OJ2m1K5L7j1k4M3j3
$$ -4 14 -34 -28 -8 -17 -20 -69 19 40 6 19 57 -31 -31 -38 -9 -5 -55 -25 -8 -11 -31 -19 -18 48 -11 -5 7 -34 -9 28 17 -7 36 23
5849B3o7K6J6J5QNk5J0k5Oj3KL3j1j1QK4n6K5KMMK5J0k8M4l3n1O4q3O0J1M3n6
$$ 23 -44 -18 -2 13 21 26 1 11 -14 -8 -21 -19 14 3 -8 0 24 -32 -7 -5 -1 3 28 38 10 54 21 -30 34 -49 11 22 65 9
5883Ijm6K4L3k0L8o3K6K0j8mpL4l1%L6k5j8k1OK6LKj5J4Jj8L0M2o4Ok4P1l5mk0
$$ 9 8 -38 -14 19 -1 37 -26 0 20 2 -2 -9 25 -6 -6 30 5 -13 -34 -28 -2 1 3 -12 2 3 -15 15 57 -7 -1 -25 46 11 7 -13
5919a3J3L6m7n6L5J2K4k2N6o9J0P3rkp8O4l4K0qpj0L8j8Okl1lO5m3j8L9n5L4k8
$$ -13 0 36 -11 -67 -32 -20 4 -18 38 -31 -21 52 43 41 -37 27 -7 13 5 -2 -12 26 8 14 12 -19 -22 43 0 -18 21 -34 0 -28
5953b8M0k5OM0jl0J4lo0M0M7m7M4k7mj3RJ4ork4O7q0Q4n3Nn0O8l9K7k2M9r0N8
$$ -28 12 -13 -7 33 32 2 16 13 -47 -7 40 -7 37 10 6 -7 2 16 10 1 -23 44 -36 48 -5 0 -50 18 -21 6 -16 33 -57 1
5987AK2l2L1k2j9QK7o1RM7n0QM2pqL2m0J1J2jOj8K1Ok5m9M0RJ3Jj2qk9L3OM9k2
$$ 1 23 -9 22 0 -19 -11 16 -45 -36 11 -39 -31 11 4 -4 28 -12 -1 11 10 16 -2 19 25 0 -49 -9 0 13 14 2 -6 -35 -2 4 53 31
6024C1m4j6K7mj9N8l9pL4m8L1q4J20m1O1o7M7o9L1J2J6j8L6k7j7J9j3%J6l0nL7
$$ 31 -13 -29 -2 -6 -25 33 -6 -13 21 -27 4 -80 40 -1 60 -7 40 -29 2 14 30 12 48 21 4 23 10 10 26 -4 -9 28
6056B8j2n4N5j7Mm9J4K1M5l0K2oo7N0n2J7K6k3M0n0M9k3k7N3qj8PnL8k7l7M2J1
$$ 28 16 -38 17 0 4 -45 -31 -10 35 5 27 21 -46 4 -48 -31 -5 -28 12 -38 11 -12 -39 14 6 -12 -5 -10 28 1 -36 6 17
6089A7J6l3L7k8K8k7m3N3mn2Q3n0JM0l4Jl2K6%Lk8L0K3ok3Rj8RK6m4K2l1LJ0K8
$$ 17 33 0 37 9 37 10 -33 20 16 -36 47 -3 -2 38 4 5 -27 -1 -1 2 -26 4 27 21 -2 7 -11 -2 24 -20 2 -29 -26 -16 12
6124A2n7J2Q0o3K2m2K0O8q4J0L0p8R6l3K7l3L2n2O1K7j2j5j9J6m0NOM6o0L0J8
$$ 12 -45 -33 47 -16 6 -36 -16 52 -32 -22 8 -70 26 -7 20 -13 19 -33 28 55 43 28 9 25 -15 -10 -4 42 -18 12 30
6155C0n4Pn6N5J1pKJ9l0M8ok6Jj2K6J4m4JmO6k4m8N4n7J2K2n4L5L9LJ4o0L7k3
$$ 30 -24 -17 -73 -18 -7 -14 -12 7 -23 25 19 -7 -6 -18 8 22 -22 -21 -25 41 17 -31 23 -34 -22 0 -54 -19 20 23 37 -23 14 -9
6189iJ8k3j6L1mJ8Oj4n8N8J2j6k6O0l1jj0nj8m3N6L5m1L8nK1oj6o9L0K1KJ0%J2
$$ -9 9 -14 -30 1 -3 15 21 7 -51 7 19 3 -23 37 6 5 -5 -10 -28 -71 -15 20 -21 17 12 33 27 11 -58 -28 -7 -5 5 5 17
6224A7J2l2J6J7j3m9j0P5j9qj8j4M0j5k6N0n8Q6k9j4L2o0J1P3j20L7J2k9N1K5
$$ 17 29 -3 13 30 17 -32 -42 33 14 6 -12 -26 14 -1 -27 23 -35 51 22 8 40 -20 -9 64 -56 -19 -7 -36 15 40
6254D0l4qnk3J30j00K6%j1NM8Nq6N5l2Pq6P5L7m2K3q4R8K6n3J3k8J7j0j1k8J2
$$ 40 6 -2 -7 -30 100 0 26 26 15 20 68 73 -13 42 10 17 -69 6 43 1 24 -60 38 64 11 24 -4 13 3 -8 -36 -24
6286b4NK1L8n3M1Op0R4j07J01nK5j02O8m3Pn1J6J6j0j7K5K7k6K4J6J3m0N2j5m8
$$ -24 -19 2 40 -13 28 34 -36 58 -49 52 47 72 -30 38 -5 2 -49 -33 -17 -27 -44 -19 8 -18 6 22 35 -5 47 32 -16
6317a6kL0Mp9O3L0j6J9Mk3m9P1j4m6N2jl6M0j5Jl0QN1m1l1K9jNJ7j2m2k2L2Pl5
$$ -16 -18 12 16 -63 0 30 14 33 37 14 -35 36 22 -24 28 27 -9 31 16 17 -13 -5 46 5 -26 3 2 7 24 12 -30 -52 -20 -13 -48
6352d8K1L7k5L5k0K1m7M4kk1J1plK4k2rJ2Mn6M4K3lqj0k8K3K1J0k0nrj0jLM9J8
$$ -48 -27 10 -15 20 0 21 -26 18 16 -5 6 -1 -4 20 -2 -11 1 5 -51 -7 16 13 5 -5 -33 -10 11 21 1 -4 -13 -23 -24 -21 28 46
6388D6L1n6p1K8qnJ5L9l4m4L5O0m6J3K4n5L1Nj5JrL0J9p5N4j4Pnk0Qj3O%O0r3
$$ 46 77 21 -50 -22 -30 -35 -20 19 -15 -59 -24 36 -10 3 27 -28 3 8 -7 -6 -15 15 34 -41 13 -1 6 1 -19 -11 -24 -18 -18 42 -51
6423e1l8J27j7k9k0R1q6K6K2k5Nl7O7k1Pl8mN0j9m0%L3M9n5O7j5m8ko1Q5Ln9J3
$$ -51 -89 38 21 -8 -28 63 -23 3 25 0 5 -32 35 14 21 -17 -21 29 10 -30 -30 3 52 -3 64 49 1 -1 -62 23 26 -33 -20
6456b0n4K1R9m0n6O9o0Q7m2k8JK5M3n5K8m0R3l1k8L4l0l5K4lo0R3p0N4o8P9m5
$$ -20 -74 -53 46 6 -50 19 -41 46 4 -24 -23 2 45 -10 18 -22 71 40 12 46 16 -19 5 2 -58 35 -35 19 -49 30 -15
6487a5K7Jl7Q1q8L6l4jkj5N7Jjj3KMk7O6l4no7M0oN4p3O9j3kj2J2l9Om3P0J5p0
$$ -15 12 13 -24 57 -31 5 -29 -30 -32 -47 10 11 10 -3 -1 3 -24 42 8 3 -64 -24 -30 24 -49 20 7 5 -7 5 -34 -28 -71 -1 14 -56
6523e6M6L0k6OjMmj5J1L1Qm2jK2J3qLl7K5KM2m3O0l2n1J2K4l7J5k4L8j1n9N2l8
$$ -56 -10 20 -6 0 -1 3 -1 -16 -5 26 34 -8 -9 13 26 18 21 -16 9 11 53 10 70 38 -13 -1 23 -14 1 -23 15 4 -55 -3 -41
6558d1jP0l3L9m0%k4O4o0M6l1k5O5j5o7N1M4o2Mj6M3K9m2PJ1j4N0o5j0K4k6P3
$$ -41 -42 28 -5 34 -6 -6 -30 34 -26 20 -11 -36 29 14 -53 -2 42 -20 -16 -32 11 40 -2 5 16 2 52 -13 -23 1 -25 48
6590D8q0%M4l0oM2k9kPn2J6K3J0kL3%l4k3L0k9M1l3M8j9k3K8mKJ3k9K4l4j9L9
$$ 48 -32 -32 12 -18 -24 18 -11 -13 -6 -58 -42 -19 -9 -11 22 22 -12 -35 -5 -34 7 -26 22 3 -20 8 4 6 19 -10 14 -20 -39 0
6624@QL3q3PQ9q0N0k7l4O2l0k3J9K4m3M1Qm7NL7jo8K6P0r4O6L1o0j2M9K1Pj2p0
$$ 0 8 41 -42 -35 54 -26 24 -3 -37 25 -5 -28 -9 15 -28 13 21 -26 -21 16 15 -53 -27 43 -51 15 46 -14 -26 23 44 51 39 -31
6658c1OJ7L9m3n0M3J2jJ5Kj7PJ6Nkn5M7m4N1J9k4l9K9m0P4l1k0K5l1J6K8l8J9
$$ -31 -25 -8 31 -12 -62 -19 -7 -8 7 9 -8 -1 15 20 18 -37 10 -34 17 36 12 -27 2 -38 36 5 -15 10 -21 -5 23 -15 4
6691Dj4M9Jj18J26Np7J3J3J3Nj4J8l8l4M1m3M8K1J7k4K0k1nl2M2mPl3J4J2m5P0
$$ 4 -10 39 40 -78 48 53 -24 -11 2 15 20 6 24 -14 -48 -7 -50 -2 19 36 12 32 11 6 -26 16 12 19 -14 0 12 -33 37
6724C7l1Pl7N0k4J3qJ0k5m0M4j6J0%l1Q7o9ML2pj2K8j2m2L1L0l8N7p0K7k6J2J9
$$ 37 6 13 -24 26 2 15 7 17 -8 -48 -4 -20 -10 -10 -41 46 -23 -19 13 6 -6 22 10 -32 -1 29 -9 48 -22 5 -21 -9 10
6757A0m0J0N5m4RL5l3k0RK5k1j7K5k5K4k8M1m9jN8j6mj4K1J9l4J8k1L3j4kL1k1
$$ 10 -30 -20 35 -9 0 35 2 -18 -9 16 -5 -22 3 -22 2 -26 15 -34 -35 23 7 3 -11 10 29 -5 13 -8 25 11 9 40 19
6790A9nJ4o4Q6k8p4P1om3L6J4K7Pp3K4%j4%k6L1N0pk0m2O1n7J8M0m6QJ0lkj0J7
$$ 19 14 28 -36 50 22 -52 19 13 -30 6 20 47 54 -19 5 5 -9 -9 -35 -4 46 39 19 -23 38 -19 -1 39 -7 1 11 8 6 -4 13
6825A3m0L3%k9P3l3lk4K1Np1L8l0M6j6K0JMk0O2o6J2k1j9O8j0k0k7P2j4jL4l0
$$ 13 -27 6 6 -23 50 17 14 -10 11 16 -55 -17 -47 -1 -17 3 4 8 -12 50 -16 -4 -25 -44 24 14 -6 -33 39 25 24 58 28
6858B8k5k6K2m9O5l1L0j0Mlj5K7Jk1K9Jl3K5m2N0l1KqJ8k7L9m7M0j3pJ3m7L6k4
$$ 28 3 -23 -1 -50 15 -16 14 4 8 5 -10 17 18 -3 26 27 -6 19 -23 27 -4 -2 -10 8 -19 20 -27 13 0 -7 6 -41 -5 -29
6892b9QoJ9Qj9l6K2K9OK9l6K4k5o1J29r4N0k4J0J4K2o7M2qOq6O7o0K1P6o2KM8
$$ -29 -21 -27 -8 0 -19 -55 -33 -4 2 31 -5 19 -6 -67 62 -32 18 -6 4 18 40 -27 15 7 13 -73 -6 -66 -45 31 -31 -29 19
6925A9m8K8m6P9l0J6k2n4O3k0N0Kj3jn4K4N0Lm7J9%nK2oJm2N2l5k2O5p2K4k5K
$$ 19 -29 -1 -47 32 2 18 -4 -58 5 -15 35 37 24 23 -31 -7 43 46 -1 18 18 13 35 29 30 -12 40 5 -17 48 -24 0 -25 -23
6959b3%M4QQl7%lkk4L5oM6n3m1J10n6j2l8L2J9mKp1M2qkK8K0k6J9J2l3K4n3Q1
$$ -23 -23 21 29 37 0 0 -3 -5 -29 6 0 46 -7 -48 62 6 -6 -44 -12 7 3 5 -66 -24 -32 -34 -6 14 -12 7 19 -14 10 -43 38
6994C8o0L8K6l2j9j6J3L7k1j3L3j0%j3L8q2L6K1j6Mk3K1J1k4N4k8K8j3j9j3%J4
$$ 38 -22 16 42 10 -9 -25 -12 25 4 -9 24 14 14 1 39 -43 -7 14 -2 2 -21 0 11 -13 41 13 41 28 9 -4 -4 10
7026A0o9N0L7mqM4o5K8j7K8p8L7j5J3K3m1M7N1q3K5kk7j1K9Oj6l2Q8l0j3L8p9
$$ 10 -59 -9 28 24 16 60 -5 23 6 34 -44 -7 -22 -9 14 -27 20 71 -12 13 11 -16 -27 2 8 -8 -40 48 18 5 43 -36
7058c6JN0m9N0j4o7N1K6%%J9m9K2l6mJ7N1k5Ll8qJ6J5J7krnK2J8j1J1k5l1N4k7
$$ -36 -35 15 -34 16 2 -65 -14 12 12 12 31 -18 4 -32 -36 -19 32 7 10 -28 -36 -20 -5 12 10 1 -4 18 36 25 36 11 -20 34 7
7093GL4p4R2o6lL1J6m7K6nl3K5K7N2o6Pq0K7jM0j5j8M5lJ5On9k3J0j6K8lL5J8
$$ 7 41 -33 59 -7 -10 21 37 -10 16 11 -22 3 30 82 16 23 -57 -30 -31 9 -6 -24 21 18 33 39 -20 -43 -33 -49 -21 -24 11 29
7127B9l6L0l5l1M8Rl6J1jK7Mn2kO3LQK2o8RLK2j7k8J0K9m3oJ1M2n8L1Kp7L8K1
$$ 29 -7 23 -12 -43 5 14 -22 -11 -12 15 19 -33 -35 28 31 39 61 -7 2 5 27 10 -18 -8 21 -22 -28 -17 25 -33 -2 0 -77 -39 -18
7162a8J7L4j2m2pL9j2k1QNM3n4L5K0k3J7K1j18M8j7P6j4m6J0J8J3l3o3N4M6rr
$$ -18 -1 33 21 -21 -28 11 -1 -22 -14 -9 34 -20 15 35 12 29 50 -68 -20 -37 39 25 -21 -11 7 20 -13 -76 -22 24 15 6
7194FM8n7l5L6N1l7k4J4K1Kn9M4j5K9j8J3r4O6J1j0M4m9l7N7moj6l7N7pl9J07
$$ 6 54 -3 -38 -2 49 12 -12 2 23 25 -34 10 -5 24 6 19 -75 -9 2 -8 36 -13 -50 7 3 -3 -19 -56 1 -6 -45 62
7226F2m4l2oKJ1J7%L7j02QR6q1J3Oj6K1J3N4r1P0j7j04P2K0k2Qk1O8mk5Nn1J6
$$ 62 18 -14 -20 -18 -7 10 10 47 -55 -47 49 -32 -19 -13 -29 -8 5 59 -32 38 21 -83 -11 9 -13 -5 -26 42 38 13 18 -33 -17
7259a7PJ3n4Q1n3K2Lk3Nk0O0l6L9oNj9l3K7k6L9j7KJ2J8k1K6J1o5K2K6J6p4K6
$$ -17 -10 3 -51 30 -23 -1 2 -21 -16 -36 24 -12 27 21 26 7 -26 1 -25 14 -3 -1 11 29 8 34 45 -20 2 28 44 -30 -4
7292dro0J02K6k9m4L0k0NM0j13M7j7O2l2k1O3k9nK2J9o7O6k0n1qO3Pm1M3Rl9j2
$$ -4 -13 -73 29 55 26 -18 12 -8 -3 37 -76 -29 -46 16 -16 -37 26 -3 -8 14 33 -34 32 12 -39 -47 16 23 -18 25 34 -5 -17
7325a7J9Qk1J1j8OPK9l9L3ool1K8%m1N0J1j9L2m3jlO1o4QOJ6LoL8m1k0J5L5Ml8
$$ -17 2 10 -11 0 -18 -12 -5 24 -15 18 12 6 -25 3 3 -38 12 23 4 36 -7 -8 -11 50 -14 -6 0 16 19 13 51 10 -10 5 40 44 6
7362Fq1L6O0j3k8N1p3N5ok9j1M7k9oL3j0kqnm1%N9K7n7O8o8JOK8k6K9m3P9j9n9
$$ 6 -75 -39 21 8 -20 31 -42 13 7 -22 -33 14 -15 -21 12 2 0 -8 -13 -54 -54 5 32 -25 43 -25 -24 -18 10 -16 13 -30 49 30 -29
7397b9pN4k7%J8Rn6O7l7kj5mM7l3L3j1K1p3M8K3n4J4qM3n4PK7J7K3o7MN1k5KP9
$$ -29 -36 18 -9 -9 9 18 -38 29 -8 -10 -25 -29 18 -15 18 7 28 -45 3 26 -28 -14 -22 21 -33 -26 1 18 41 -26 -22 29 4 6 85
7432H5j21M8l4L4K1m6N3op7P7r7J6Q9k2o4O2j3J1K2n8rN5m0N0k8k5J9l5N3o3N
$$ 85 -36 12 -22 12 33 -13 40 34 -43 34 -63 -47 42 20 -44 18 5 16 38 -20 -29 26 -14 36 8 -17 2 -33 20 -43 -38
7463c8J7J1J1K8kl2O8j00K1J5k6pPM8J6o1J4rmM6Kl5J2KK3rKj8L5k1n6QP1q3L7
$$ -38 -21 -10 1 29 27 -5 63 -37 -16 -1 -27 -34 -27 21 37 -24 -10 -19 -23 23 25 -10 2 4 27 18 20 2 37 16 -40 -32 39 -44 -7
7498gJ9Ol1K2l2M9m1N0o1jJ6PJ1l6M1k0K0l5M0pj8M8l3mJ4j4K7o4O0o4M5Ol2K4
$$ -7 12 18 -13 9 -23 26 -15 35 -26 -27 -11 -4 7 -29 12 -8 12 -23 17 10 -8 40 7 3 17 3 30 -34 26 -38 7 13 -19 5
7532EJk3K3l9P5l6j5L1l4l4L0N5p2O3k0j1k7l5P4j5J1j1j6L2k7k6J1N9j7l6J2
$$ 5 6 -17 6 -33 42 6 -9 22 -12 -46 -16 39 -33 30 10 -1 -28 -63 11 -4 7 -4 -20 12 -15 -41 -30 29 12 -24 -12
7563a2J5L6o0j9M9l3P3o1L2pm4L2Pl5M6j18O7K8K4m8L8JJ7m6O2q7K3M5m7M8k1
$$ -12 3 39 -21 -40 9 -24 49 -12 20 13 -31 1 8 -27 19 -99 -32 -4 20 -28 10 11 28 -18 44 -43 -20 25 -22 26 5
7594EqK7kK3rq2KM5QlL1j7l4L2lql8L5J2k8K4k6L3k3K4l1K5PK4l9k4QM6Np8N8
$$ 5 -3 24 22 45 36 -46 -44 1 9 6 37 20 -14 18 15 7 -31 4 16 -12 12 -14 19 -4 20 -11 14 21 45 6 -18 -10 36 41 -37 21
7630B1Qoml4N2m8L4n0M7n9K4LJ5j4jK3m6P7k7j5J9j5rNm9M9K4k8L7q1P4m1K6k
$$ 21 29 23 19 -15 37 -11 23 -27 20 -39 -15 -12 3 -11 -12 11 -35 42 15 0 19 4 -5 0 -49 0 24 -4 33 -48 26 -15 11 9
7664IJo4R7l9J3Lo8K2NJ1M1K4m5K9j6m4K3l3N1J1j04P5Jk3RLn2M9J9j7L3l0l0
$$ 9 10 -54 43 4 17 20 -48 -26 -21 -10 31 55 10 39 23 -21 2 -31 20 31 -73 2 3 -20 -11 -8 -60 -11 8 -9 24 -6 -36
7697c6j1M7l3M2k1j1PO0o3N8o0qLk5L9Qj5J%JM0J0o9M9j8M2m8J1L4l4K5nk1m0
$$ -36 -47 0 -33 9 -12 -23 -16 44 -19 39 -21 -29 -26 -51 -12 -4 -19 -18 -18 -17 23 33 -36 13 -5 37 -11 0 34 0 25 20 -1 -41
7731d1M8kj8j7K3n9J17k7Kln0j3K7J1J0k2K4n0P4m3M9k5mM6r8M2mL1n6L1Kj5k1
$$ -41 7 5 -13 -30 -7 -66 51 24 26 23 -27 -40 -13 -2 8 -14 10 -40 34 -9 40 15 11 57 -41 1 -3 28 -28 3 5 -10 -31
7764c1N1J1j0m7K3j1NKJ7Jo3L8L9l4KJ6k5rN6p3P5n7oK8NmnJ4n5L6j5M3n6J9K3
$$ -31 20 31 21 -26 -3 -14 -9 -7 10 11 -52 -14 25 -9 -7 9 -16 -25 31 -42 33 -24 -30 -2 3 -1 -6 8 -47 -11 -26 17 -39 -20 3
$$ [...]
8191A3
##END NTUPLES=NMR FID
##END=
