##TITLE=1H_LY-2Dix 60.4
 CD3CN,8 sc, 
 5.03.2021
##JCAMPDX= 6.0         $$ Bruker NMR JCAMP-DX V2.0
##DATA TYPE= NMR FID
##DATA CLASS= NTUPLES
##ORIGIN= UXNMR, Bruker Analytische Messtechnik GmbH
##OWNER= root
$$ XWIN-NMR		Version 3.5
$$ Fri Mar  5 12:34:33 2021 Russian Standard Time (UT+4h)  she@DPX200
##.OBSERVE FREQUENCY= 200.131506
##.OBSERVE NUCLEUS= ^1H
##.DELAY= (6, 6)
##.ACQUISITION MODE= SIMULTANEOUS
##.ACQUISITION SCHEME= undefined
##.AVERAGES= 8
##.DIGITISER RES= 18
##SPECTROMETER/DATA SYSTEM= spect
##.PULSE SEQUENCE= zg30
##.SOLVENT NAME= CD3CN
##.SHIFT REFERENCE= (INTERNAL, CD3CN, 0, 15.7039)
##AUDIT TRAIL= $$ (NUMBER, WHEN, WHO, WHERE, WHAT)
$$ ##TITLE= Audit trail, XWIN-NMR		Version 3.5
$$ ##JCAMPDX= 5.01
$$ ##ORIGIN= Bruker BioSpin GmbH
$$ ##OWNER= she
$$ F:/spectra/data/she/nmr/H-F/1/audita.txt
$$ ##AUDIT TRAIL=  $$ (NUMBER, WHEN, WHO, WHERE, WHAT)
(   1,<2021-03-05 12:33:01.25 +0400>,<she>,<DPX200>,
      <created by zg, POWCHK disabled, PULCHK disabled
       configuration hash MD5:
       00 E9 B6 7A A2 85 ED C7 34 08 36 98 17 FE 4E 26
       data hash MD5: 16K
       FC 1E 2F 5A FC 8B DF 8B 08 FF F7 5D B0 0B 36 73>)
$$ ##END=
$$ 
$$ hash MD5
$$ 80 E6 03 CD 73 99 B7 14 68 EE 36 3A 17 31 E8 36
##$RELAX= 
##$RELAX= 
##$RELAX= 
##$RELAX= 
##$RELAX= 
##$RELAX= 
$$ Bruker specific parameters
$$ --------------------------
##$DU= <F:/spectra>
##$EXPNO= 1
##$NAME= <H-F>
##$PROCNO= 1
##$TYPE= <nmr>
##$USER= <she>
##$AMP= (0..31)
100 100 100 100 100 100 100 100 100 100 100 100 100 100 100 100 100 100 
100 100 100 100 100 100 100 100 100 100 100 100 100 100 
##$AQSEQ= 0
##$AQ_mod= 1
##$AUNM= <au_zg>
##$AUTOPOS= <>
##$BF1= 200.13
##$BF2= 200.13
##$BF3= 200.13
##$BF4= 200.13
##$BF5= 200.13
##$BF6= 200.13
##$BF7= 200.13
##$BF8= 200.13
##$BYTORDA= 1
##$CFDGTYP= 0
##$CFRGTYP= 5
##$CHEMSTR= <none>
##$CNST= (0..31)
1 1 145 1 1 1 1 1 1 1 1 1 1 1 1 1 1 1 1 1 1 1 1 1 1 1 1 1 1 1 1 1 
##$CPDPRG= <>
##$CPDPRG1= <>
##$CPDPRG2= <>
##$CPDPRG3= <>
##$CPDPRG4= <mlev>
##$CPDPRG5= <mlev>
##$CPDPRG6= <mlev>
##$CPDPRG7= <mlev>
##$CPDPRG8= <mlev>
##$CPDPRGB= <>
##$CPDPRGT= <>
##$D= (0..31)
0 1.2 0 0 0 0 0 0 0 0.06 0 0.03 0 0 0 0 0.0002 0 0 0 0 0 0 0 0 0 0 0 0 
0 0 0 
##$DATE= 1614933180
##$DBL= (0..7)
120 120 120 120 120 120 120 120 
##$DBP= (0..7)
150 150 150 150 150 150 150 150 
##$DBP07= 0
##$DBPNAM0= <>
##$DBPNAM1= <>
##$DBPNAM2= <>
##$DBPNAM3= <>
##$DBPNAM4= <>
##$DBPNAM5= <>
##$DBPNAM6= <>
##$DBPNAM7= <>
##$DBPOAL= (0..7)
0.5 0.5 0.5 0.5 0.5 0.5 0.5 0.5 
##$DBPOFFS= (0..7)
0 0 0 0 0 0 0 0 
##$DE= 6
##$DECBNUC= <off>
##$DECIM= 32
##$DECNUC= <off>
##$DECSTAT= 4
##$DIGMOD= 1
##$DIGTYP= 9
##$DL= (0..7)
0 120 120 120 120 120 120 120 
##$DP= (0..7)
150 150 150 150 150 150 150 150 
##$DP07= 0
##$DPNAME0= <>
##$DPNAME1= <>
##$DPNAME2= <>
##$DPNAME3= <>
##$DPNAME4= <>
##$DPNAME5= <>
##$DPNAME6= <>
##$DPNAME7= <>
##$DPOAL= (0..7)
0.5 0.5 0.5 0.5 0.5 0.5 0.5 0.5 
##$DPOFFS= (0..7)
0 0 0 0 0 0 0 0 
##$DQDMODE= 0
##$DR= 18
##$DS= 0
##$DSLIST= <SSSSSSSSSSSSSSS>
$$ [...]
##$SUBNAM2= <"">
##$SUBNAM3= <"">
##$SUBNAM4= <"">
##$SUBNAM5= <"">
##$SUBNAM6= <"">
##$SUBNAM7= <"">
##$SUBNAM8= <"">
##$SUBNAM9= <"">
##$SW= 16.9725357007746
##$SWIBOX= (0..15)
0 0 2 0 0 0 0 0 0 0 0 0 0 0 0 0 
##$SW_h= 3396.73913043478
##$TD= 16384
##$TD0= 1
##$TE= 0
##$TE2= 300
##$TE3= 300
##$TEG= 300
##$TL= (0..7)
0 120 120 120 120 120 120 120 
##$TP= (0..7)
150 150 150 150 150 150 150 150 
##$TP07= 0
##$TPNAME0= <>
##$TPNAME1= <>
##$TPNAME2= <>
##$TPNAME3= <>
##$TPNAME4= <>
##$TPNAME5= <>
##$TPNAME6= <>
##$TPNAME7= <>
##$TPOAL= (0..7)
0.5 0.5 0.5 0.5 0.5 0.5 0.5 0.5 
##$TPOFFS= (0..7)
0 0 0 0 0 0 0 0 
##$TUNHIN= 0
##$TUNHOUT= 0
##$TUNXOUT= 0
##$USERA1= <user>
##$USERA2= <user>
##$USERA3= <user>
##$USERA4= <user>
##$USERA5= <user>
##$V9= 5
##$VALIST= <valist>
##$VCLIST= <CCCCCCCCCCCCCCC>
##$VD= 0
##$VDLIST= <DDDDDDDDDDDDDDD>
##$VPLIST= <PPPPPPPPPPPPPPP>
##$VTLIST= <TTTTTTTTTTTTTTT>
##$WBST= 1024
##$WBSW= 4
##$XGAIN= (0..3)
0 0 0 0 
##$XL= 0
##$YL= 0
##$YMAX_a= 1054242
##$YMIN_a= -953086
##$ZGOPTNS= <>
##$ZL1= 120
##$ZL2= 120
##$ZL3= 120
##$ZL4= 120
##$ABSF1= 10
##$ABSF2= 0
##$ABSG= 5
##$ABSL= 3
##$ALPHA= 0
##$AQORDER= 0
##$ASSFAC= 0
##$ASSFACI= 0
##$ASSFACX= 0
##$ASSWID= 0
##$AUNMP= <proc_1d>
##$AZFE= 0.1
##$AZFW= 0.1
##$BCFW= 1
##$BC_mod= 2
##$BYTORDP= 1
##$COROFFS= 0
##$CY= 11.3945322036743
##$DATMOD= 1
##$DC= 2
##$DFILT= <>
##$DTYPP= 0
##$F1P= 15.9154993809931
##$F2P= -4.1035820241983
##$FCOR= 0.5
##$FTSIZE= 0
##$FT_mod= 4
##$GAMMA= 1
##$GB= 0.15
##$INTBC= 1
##$INTSCL= 1
##$ISEN= 128
##$LB= 0.24
##$LEV0= 0
##$LPBIN= 0
##$MAXI= 10000
##$MC2= 0
##$MEAN= 0
##$ME_mod= 0
##$MI= 1.114404
##$NCOEF= 0
##$NC_proc= 0
##$NLEV= 6
##$NOISF1= 3.799351
##$NOISF2= 2.8
##$NSP= 1
##$NTH_PI= 0
##$NZP= 0
##$OFFSET= 15.70392
##$PC= 1
##$PHC0= -11126.48
##$PHC1= 15.20094
##$PH_mod= 1
##$PKNL= yes
##$PPARMOD= 0
##$PSCAL= 0
##$PSIGN= 0
##$REVERSE= no
##$SF= 200.130013532006
##$SI= 16384
##$SIGF1= 3
##$SIGF2= 2
##$SINO= 400
##$SIOLD= 16384
##$SREGLST= <1H.CDCl3>
##$SSB= 0
##$STSI= 0
##$STSR= 0
##$SW_p= 3612.71676300578
##$SYMM= 0
##$S_DEV= 0
##$TDeff= 0
##$TDoff= 0
##$TI= <>
##$TILT= no
##$TM1= 0
##$TM2= 0
##$TOPLEV= 0
##$USERP1= <user>
##$USERP2= <user>
##$USERP3= <user>
##$USERP4= <user>
##$USERP5= <user>
##$WDW= 1
##$XDIM= 8192
##$YMAX_p= 0
##$YMIN_p= 0
$$ End of Bruker specific parameters
$$ ---------------------------------
##NTUPLES= NMR FID
##VAR_NAME=  TIME,          FID/REAL,        FID/IMAG
##SYMBOL=    X,             R,               I
##VAR_TYPE=  INDEPENDENT,   DEPENDENT,       DEPENDENT
##VAR_FORM=  AFFN,          ASDF,            ASDF
##VAR_DIM=   8192,          8192,            8192
##UNITS=     SECONDS,       ARBITRARY UNITS, ARBITRARY UNITS
##FACTOR=    0.0002944,     1,               1
##FIRST=     0,             0,               0
##LAST=      2.4114304,     0,               0
##MIN=       0,             -953086,         0
##MAX=       2.4114304,     1054242,         0
$$ Real data points
##PAGE= N=1
##DATA TABLE= (X++(R..R)), XYDATA
$$ [...]
1207C40N59j020j100M41J443J5j382n37J183J028q26j189K93J244O51j156j175
1224a188R79J362l52j189n11J263J027q41j585O17J437J69j488o09R31J258o77
1241F03j354j27J357N86j060j196N64J307N5j345o28J325P63o23j425M00J113
1258C15N89j177q56P50J134l02j086k08J105O53q15r86N32J070J64j021n16O31
1276b4J005n06j045O4J156po69o74N51Q06j31p95n25Q29N88l58r07M2J006K89
1296F95j024m60O56M94j28q11j69Q91L48m07q18L68P19K00p80l81M73P63m30o70
1316d71K40N81K87m80n78J86Q48p9o46l22O10K23k58m59R4N77P1l49m58K19N77
1337D13j91n34j14M51M79n64m18K89L25J68n26k04K86M65k20m93J31L58K08j97
$$ plain form
1207 340 899 -121 -1221 -780 663 678 -704 -1241 -58 970 144 -1045 -752 492 1143 -13 -1188
1224 -1188 -209 1153 801 -388 -899 364 1391 550 -1035 -418 1019 1188 -300 -909 22 1280 603
1241 603 -751 -878 479 1065 5 -1191 -627 680 735 -610 -1238 87 850 227 -1198 -798 315
1258 315 904 -273 -1129 -379 755 453 -633 -841 264 917 102 -884 -352 718 882 -139 -655 -24
1276 -24 981 475 -570 -506 650 643 -26 -700 -149 657 526 -269 -794 35 623 265 -642 -600 406 695
1296 695 -329 -789 -133 361 233 -578 -747 144 492 85 -733 -365 354 554 -226 -607 -134 629 199 -471
1316 -471 -231 350 637 157 -421 -235 613 534 -112 -434 176 399 141 -318 -224 353 424 75 -383 -164 413
1337 413 222 -312 -426 25 504 -60 -478 -189 136 304 -222 -426 -140 325 105 -388 -257 101 309 112
1357A12l71J20O06j54l38j05K23J88m8l66p8M76K2l01p2K6K59N0l33j11K60J57
1379B22j87j48qJ54o0p8j63K19J38j14k31J50R4L2r7k09J19K20L1r3J15n5k2J12
1403A41k01J98m2Rr2J17j02L7Nj09P9J08j7n7J06m3j49j29K64k33N7J18l11K88
1427D2L6n6j92m2J52J4j40j14L26K13l28j32J10J63J46j95j29L9K02j17r9L9R8
1450C6O2n8l29K01K18o1k10O5J19J21k8l46J89K68j13k26q1J99J1o0j11P2J55
1473I3J32k72j10L2K11K5k93q4J78K08l04M1jL02k36n4p8K06K67j29k62l0K85
1496A27J11n4k46n5K75J96l58k78L46K76j63l76n1N05p0k41j26J38J14Q5l98j6
1518b59K71K55k83l22L58J55J25m84l6K35K27k85j12p9L15K01j85l70J62L12k2
$$ plain form
1357 112 -259 -139 467 313 -25 -130 93 281 233 -133 -211 265 287 -14 -86 -60 199 249 -84 -195 65 222
1379 222 35 -113 -121 33 -27 -105 -268 -49 89 -25 -256 -106 -12 20 -77 -286 -167 53 84 -9 106 51 29 141
1403 141 -60 138 96 105 13 130 28 65 70 -39 40 148 131 74 180 137 -12 -141 123 -110 -53 65 -246 42
1427 42 78 22 -170 -212 -60 -46 -186 -300 26 239 -89 -221 -111 52 198 3 -126 -87 115 -2 -101 -62 36
1450 36 98 40 -289 -88 130 69 -141 -76 43 164 136 -210 -21 247 134 -92 -173 26 37 -23 -134 -62 93
1473 93 225 -47 -157 -125 86 111 -182 -266 -88 120 -184 -143 -144 158 -78 -132 -210 -4 263 134 -128 -158 127
1496 127 238 184 -62 -117 158 354 -4 -282 64 340 177 -199 -250 255 185 -56 -182 -44 70 155 -243 -259
1518 -259 12 267 -16 -338 20 175 300 -184 -220 15 242 -43 -155 -234 81 282 97 -273 -111 201 179
1539A79l40K9J80K61j57l59K54L17n5j80k41J67K90j56k23k15M72o0j44k52J40
1560i3J37J65k42k33L17kk21k2J29J58O0j71m10L28J58O6l22Q4K46k6Nl05J21
1583g3K05P0k69j29J52J54J39m54R2Q4L1j88P9J6K59k5j98k87M91k7q7m13L18
1606f0n0K94K5l43L6K65j4l17j7K79K84l66Pj45L88q6k14r5J41Q6P9l95ML93o4
1631A15j33p3K5J56l0o3j01J50N7q5K0N5n0M9j16j05O8J5J07j27r7J25R4J5j22
1656e1k0J34n9O3j39ML0N8j33N1J60l03K50j43J56l7oj23n9K39j4Q5k43K66j19
1681D7L9k8k09K38k16K54j61M1mm7J81j4j6j1r3n5N6ln1J41j16J3j7r5J85j18
1707e9m1J09n4J08P0j95n9J61k23J37l4j30Q9K3K12j63K7lR2r9k0J11p2r2J9J27
$$ plain form
1539 179 -161 -132 48 309 152 -207 47 364 309 129 -112 55 345 189 -34 -249 223 163 19 -233 -93
1560 -93 44 209 -33 -266 51 49 -172 -194 -65 93 153 -18 -428 -100 58 124 -198 -114 132 106 111 -194 -73
1583 -73 132 202 -67 -196 -44 110 249 -205 -113 -29 2 -186 -107 -91 168 143 -55 -342 149 122 35 -378 -60
1606 -60 -110 184 209 -134 -98 167 153 -164 -181 98 382 16 23 -122 266 180 -34 -129 12 98 177 -218 -214 179 115
1631 115 -18 -91 -66 90 60 -3 -104 46 103 18 38 93 43 92 -24 -129 -61 -46 61 -66 -163 -38 56 71 -51
1656 -51 -71 63 4 67 -72 -68 -38 20 -113 -62 98 -205 45 -98 58 21 15 -108 -167 72 58 143 -100 166 47
1681 47 86 58 -151 87 -129 125 -36 5 1 -46 135 121 105 94 1 -54 2 -1 -52 89 -27 -14 -31 -126 59 -59
1707 -59 -100 9 -45 63 133 -62 -121 40 -183 -46 -80 -210 -121 -98 114 -49 -22 -25 67 -32 -52 59 -13 -105 -86 41
1733D1r7J51k39J52p2R3nj60N5p1N9K19k0j36q7J34k8n7J33L3n1o7K2l6J62j14
1759A4L2n9p0O0L2j67J7K66j8k02MK07r6J19j24q5J19J3j79n6J21J35j28M5l8
1784c8J73j90J1Q7m9K6OL2k27J07l1N3r0L57k54O8M4j19k6o6J36n9J03q8J51k81
1810a64O4J07PJ0j93J52o5K27k2o7j4j28N3O9o7J4O8j3ml5J49k08M9P3o4L6q9
1837e5O7L1k12J71r2J30M8O0o1j67J61j16pK46k08j27K38q7n8m1l9Q7N4j23J06
1862FM8m9L5m7p8J37J28k62m6J81J19j94q7J61k4l1j1J17M0r7J49j70j53J97r8
1887b9O6K1j55M7n8M2N4j2M6j5j00k4j15J09J78j29K9Q7P2l2j90J45K0n1r7M7
1913d4J69m1o7q8jJ82q2L9j13j2J66r3q3n9P4K34j94P8j56nJ98Qj33r9J58Q0p8
$$ plain form
1733 41 -56 95 -144 8 -64 29 24 -136 -81 -152 -93 126 106 -30 -117 17 -11 -68 65 98 47 -20 2 -34 128 14
1759 14 46 -13 -83 -23 9 -158 -141 125 107 -95 -91 116 20 139 15 -70 49 62 -117 -173 -52 83 -45 0 -38
1784 -38 135 -55 -44 43 -6 20 26 58 -169 -62 -93 -40 -130 227 -27 41 85 -34 -60 -126 10 -49 54 -34 117 -164
1810 -164 -100 7 14 24 -169 -17 -82 145 123 56 42 -86 -33 36 -31 -17 51 38 34 -1 148 -60 -11 62 -2 34 -55
1837 -55 12 43 -169 2 -90 40 88 148 87 -80 81 -35 -42 204 -4 -131 107 20 -38 -79 -118 -31 23 -100 6
1862 6 54 5 40 -7 -85 52 180 -82 -128 53 172 -22 -109 52 28 -3 -14 103 143 46 195 25 -128 69 -29
1887 -29 37 58 -97 -50 -108 -66 -12 -24 22 7 -93 -117 -232 -123 55 -74 -45 42 114 82 -108 37 57 6 -91 -44
1913 -44 125 84 17 -71 -72 110 28 67 -46 -58 108 15 -68 -127 -53 181 -13 65 -91 -96 102 110 -23 -122 36 116 38
1940C8p8J8Q2J14k33J65p2J07j72j40K46j03mM3OJ04j34o2J49k14K37j16Q2j63
1964a00J45J8K3o2M0j68J04PN9L9j53j04J34J37j63L1N3K8l8j91J51N4j7K0m0
1989GP7j7j33P4O4m7k25K07Q3K3q0n0q6J7M8R2j22L1M7Jljl0j37N5J2P6r8R0Q2
2019E7j09Q8r3n0R3L7k18J65J91k67O1J8N9lo7J62k28J94P2o4o8j95J62m0J93
2044A50k81J71m5q7n5J22O2O4N2j49M9j13K17n4j21O1Mj37J16k16J03J75j60J14
2068D2Mp6l3O5l4j09J13O5M9J92m56L66q0j47L0j5J28j03j6k3Q0j50J02l0R2j13
2094e7N3%R4r6P2q8l7J25j82J28Pk9M5K0J20j95JK5r2P1J8mQ8mo8qj8mN6N7n3
2125D5J9o7p1J4J85l2k46J21K1J0J20j46j4M0K3J1o6J66o4m9J12j0j32l6J33q6
$$ plain form
1940 38 -40 -22 60 174 -59 106 34 141 -31 -171 75 -28 -32 11 17 121 -13 -75 74 -140 97 -19 63 -100
1964 -100 45 63 86 24 64 -104 0 7 66 105 -48 -152 -18 119 -44 -13 40 68 30 -161 -10 44 27 47 7
1989 7 84 67 -66 8 72 25 -200 7 90 113 33 -17 -103 -86 -38 54 -68 -37 10 11 8 7 -23 -160 -105 -93 -17 -115 -25 57
2019 57 -52 36 -57 -107 -14 23 -195 -30 161 -106 -45 -27 32 29 -38 124 -104 90 162 98 30 -165 -3 -43 150
2044 150 -131 40 -5 -92 -147 -25 37 101 153 4 53 -60 157 103 -18 43 47 -90 26 -190 -87 88 -72 42
2068 42 46 -30 -63 2 -32 -141 -28 37 86 278 -178 188 108 -39 -9 -24 104 1 -15 -38 42 -108 -6 -36 56 -57
2094 -57 -4 -4 90 -6 66 -22 -59 66 -116 12 19 -10 35 55 175 -20 -19 6 -86 -15 3 -1 87 83 15 7 -11 -15 41 98 45
2125 45 64 -3 -74 -60 125 93 -153 -32 -11 -1 119 -27 -41 -1 22 33 -33 133 69 20 132 122 -10 -46 87 1
2151AJ6n7K4k1J21j02mJ0rJ25j71J7N5J05j51L6p4N2Q5N5q3l2j8m1J04n0lr1J59
2180E8m2m7P5K7j06Q0j8j82J36J6J11j09k8R0%Jl0O0j17P8k4j12J50o8L8n3m1
2207e7J13m6r5MJ04p6m4k4J21l1M5o9J40r1m9K1m5P9J10k35J35J1M4j01lMl7J53
2235H1o1j50k1J75p6L3j45J21mQ0J07k8j49N0O4Qj42J60q8PJ2k08L71o8r3rl1
2262dj95J14P5O0j23N1J07j66J63n2P3k32K26p0r3L0r4J84O7k9r3J34o0n7N3P5
2288A44q2j98L3P6P5j26K76k44M1KRl6q0J3J2Q0Pj99J44L7kQ6j2j00J55j34J71
2315A48j59J00J54k59l5J50j79J45j11j7p8L49j99J48k79n1K77p7Qj31J66j27
2337e7MJ11q8Q7j72J87k01J40O5k5L3M8n4r9J53j18J20j60NN6j11J39k9j27J68
$$ plain form
2151 1 17 -40 -16 -37 84 -18 -22 -12 -21 104 -67 -50 5 110 -41 -5 -79 -27 58 113 30 -2 -20 -61 43 -7 -10 -101 58
2180 58 16 -31 44 71 -35 45 27 -155 -19 -3 108 -1 -29 61 61 62 32 92 -25 53 29 -83 67 -1 37 -16 -57
2207 -57 56 10 -85 -81 23 -53 -97 -121 0 -31 14 -55 85 -6 -55 -34 -79 0 110 -125 10 21 65 -36 -39 -35 -72 81
2235 81 20 -130 -151 24 -52 -19 -164 -43 -47 33 140 112 -37 13 77 85 -57 103 15 22 34 -174 197 129 36 27 -4
2262 -4 -199 -85 -10 50 -73 -22 85 -81 82 30 103 -129 97 27 -66 -36 -130 54 121 92 -1 133 73 16 69 144
2288 144 62 -136 -103 -27 48 -78 198 -46 -5 -3 6 -30 -110 -97 -85 -5 2 -197 -53 -16 -18 68 56 -44 111 -23 148
2315 148 -11 89 243 -16 -51 99 -80 65 -46 -63 -141 208 9 157 -122 -173 104 27 35 -96 70 -57
2337 -57 -53 58 -30 57 -115 72 -129 11 76 51 84 132 78 -21 132 14 134 -26 -21 35 -76 63 34 -93 75
2362G5r8J06j33J52l0k45J75jl5J26j36k9J72k63K28j40J53k27K38Q1j43m0K3
2385Ij5j10J78%r3lp3L6J60m8M4k41JJ75PJp3J07j29J09p7N7K1r2L5O7q4R0l9
2414B0JLp7qL6j9j9J03j13P2L7J02k15j15J95K33j56j43J47O1j99m3J27oM4l9
2440B9k2qp0J79j64j2P1O3k16J13J05j8n4j20O6K5k9O1P5J1L2p7q1O7KK0j36O3
2468b5j09M1P2J12Q6k58Q8N1l4J12n1r5o3P1p1nQ1p5J13j63P3oJ35j24O1K2j00
2495f1%j2J61j63K1Op6K69j73q2Q3L3J27r1L4J00k28J36j3j6J93k71k2J72k05
2520g8n8R3P0N7K4j59rJ2M5J8j39q1Q3J80p6q3M2Q0nn8J87p8j24J12n8p0J01m5
2548a7M7J52k45O3O9j79J19l0q8J07Q5m1j07P7O4Ro3j9j8P8q0mN7L9m5O3j03J19
$$ plain form
2362 75 -23 83 -50 102 72 -173 2 1 -34 92 -44 -73 99 -164 64 -76 77 -150 88 169 26 -14 9
2385 9 -6 -116 62 62 -31 -34 -107 -71 89 41 85 -156 -155 20 27 28 -45 62 -67 42 -35 22 43 -49 -14 53 -31 59 20
2414 20 21 24 -53 -61 -25 -44 -63 40 -73 -1 36 138 -77 -192 3 236 80 -63 84 145 -54 -97 30 24 68 29
2440 29 7 -1 -71 108 -56 -68 3 66 -150 -37 68 50 -4 -124 -58 -33 -62 -1 74 85 117 40 -41 26 28 48 -88 -25
2468 -25 -134 -93 -21 91 177 -81 7 58 24 136 85 -10 -73 -2 -73 -78 3 -72 41 -122 -49 -55 80 -44 17 39 -61
2495 -61 -61 -73 88 -75 -54 -48 -124 145 -28 -110 -27 6 133 42 76 176 -52 84 71 55 248 -23 -45 127 -78
2520 -78 -136 -43 27 84 108 -51 -60 -48 -3 15 -124 -205 -122 58 -18 -101 -59 21 16 -42 145 67 -57 55 -3 -73 28 -17
2548 -17 30 182 -63 0 69 -110 9 -21 -109 -2 83 42 -65 12 76 85 22 3 -15 63 -17 -21 36 75 30 93 -10 109
2576A09l9l5m7O9K4k1j46J11m9OK9j65N1R2j2J44j10m8K69j45Jj77J82j56M9J39
2602A25k22K22j02n5J16J06p3k72J10m6O3J09m7r7J79r0J77k31kL6k5P8kj37J70
2627I0k04Lm8J18j09O2J41l5o0J87q6o4r5J25L8O5j18j18K12j62R5j32J3N6j27
2652a53J74L2j50J06mQ2k36J31O9o4j9P5r9N4J17j65L0k3rJ26l63K18LJ13K6K5
2678I6j57J75j30n5K3N9Qj8K8j5q0J73K6j51r9K4K4Q2K0NRr7J20r7O9rP1r5J2
2707B1oQj26P6k3J34k6q4n0J6Q1nk9q5Q9l9N0o9m0m2K13p0J44j22p0J15j66J80
2735G5O4k57J99k10J43q1J27k7o5N4M5j6R0k5k05J63k52J40Jm9J92k4K1j10K3
2760A6n4K1K2P5j81R2J3j23J0J44j01O2j42J73J13k38N7P2q1J4r4O9J2o6J46j26
$$ plain form
2576 109 70 35 -12 57 81 60 -86 25 -24 -18 11 -154 -103 -11 -23 121 11 -37 232 87 88 -89 93 -63 -14 125
2602 125 -97 125 23 -32 84 190 117 -155 -45 -91 -28 81 34 -63 116 26 203 -28 -30 6 -19 59 57 -80 90
2627 90 -114 -111 -159 -41 -150 -88 53 18 -42 145 59 -5 -100 25 63 128 10 -108 104 -58 37 -95 -82 -26 -153
2652 -153 21 53 -97 9 5 87 -149 -18 51 -13 -32 43 -56 -2 115 -50 -20 -43 -52 74 -289 -71 -68 45 71 96
2678 96 -61 114 -16 -71 -48 11 19 1 29 14 -66 107 133 -18 -117 -93 -69 13 33 38 47 -50 70 -27 42 33 104 9 21
2707 21 15 23 -103 -27 -50 84 58 -26 -76 -60 21 16 -13 -98 -9 -48 2 -67 -107 -149 64 -6 138 16 -54 61 -105 75
2735 75 139 -118 81 -129 14 -67 60 33 -32 22 67 51 141 116 -89 74 -178 -38 -37 -86 106 82 103 -7 16
2760 16 -38 -17 5 80 -101 -9 4 -119 -109 35 -66 -4 -146 27 140 -98 -41 31 -50 -36 -130 -61 -49 -115 31 -95
2786i5K8K08j16m4P4j59J10q7L5J03K0n4ONO2k34L7K19j4Qk11J96q7l9j5K0J06
2813H2K7n4q8R6Or8k8J98k66R3Q2P4p3Q0k17O6O0R8o5j03J49k32Q2pN7J6j77P6
2841f6O7N4n9jJ58k63K09j70K5N1Jk9L6qp5J00LQ9j02k5q9Q1Q4j31m3K90k54J15
2869D8j37M0J38j56Ol5N9QJ68k14J92j86J0J65r3rL0j30K18p8l2MJ06k16O1m5
2895g8N9J5K3M7j05J38k35K37j18P8m4k8J69j68l3Ll0N8j21OJ28m4J2j02P9L3
2921b1PK81l28N7p2L2L4q0J10J2r7J0l6J21j57J06L8p4L5n2k3J34r3N5op5J36
2948E4R8j57k5PK70k61M6l2q3J99q9K1kl32K04J17M3J39k58j8J00L0r9N6o2jn8
2975i3J88k2J7j15J67j54n9k5J50O1k52L4J9J45q1J9m2m2J6J59m6nJ2o9j0O7L4
$$ plain form
2786 -95 -67 141 25 -19 55 -104 6 -81 -46 57 77 23 29 34 96 -138 -101 118 104 112 -99 97 10 -29 -44 -24 82
2813 82 109 55 -33 63 69 -29 -57 141 -125 -32 50 124 51 131 -86 -20 40 138 73 -30 119 -113 -31 -38 19 35 -142 -66
2841 -66 1 55 -4 -5 153 -110 99 -71 -46 5 6 -23 13 5 -70 30 33 122 20 -5 -94 -13 71 -60 -103 187 -67 48
2869 48 -89 -49 89 -67 -61 -96 -37 -29 139 -75 117 -69 -59 106 13 4 34 -96 122 44 12 16 122 -94 -33 -78
2895 -78 -19 -4 19 66 -39 99 -136 101 -17 61 17 -11 158 -10 -43 -40 -70 -12 -133 -127 1 -43 -31 -133 -54 -21
2921 -21 -14 267 -61 -4 -76 -44 -10 -90 20 32 -65 -55 -91 30 -127 -21 17 -57 -22 -74 -97 37 -56 -1 -7 -82 54
2948 54 152 -5 -30 -23 247 -14 32 0 -83 116 27 48 46 -286 -82 35 78 217 -41 -59 41 71 -28 28 -34 -35 -93
2975 -93 95 73 90 -25 142 -12 -71 -96 54 115 -137 -103 -84 61 -20 -1 -43 -85 -69 90 44 39 51 -18 -28 39 73
3002G3j85J54nj7j73O9J14P2j29j33M1J89j5j28LO9Q3j00n1j10J70L4m6L6O3r
3028F9Kk84J94N9q3N5j08K07j69P5m6%J00p8j07J01R6l7J07j86O9j43Q7j9k26
3053b65L85l8oj20J31p9K3N6j19J06L8p4r9lJ9J31j31r5N1o1J26J14k10L8J0K47
3079A75j30nr0l5M8q0M1J50k09K99q8j06po6O3J8J96k76R2J7j33K1J98q7lL6L
3106D2Pj79o0K65j33m8J29j35Q4K22j73n6R1L0j32R1O7r9j41K47j06j9J42j24
3130A2k2P0o3KN5q8Q5K6j15M0j12L0O1M7l1P5k0j4k8j3ln0O7n7O0O3r5L2j9oK9
3161A8J3LL1p2l8Q5k1j40J67N4m1J4k4rj17K17p3K5j20Rj07J00L8kP4j32q3J1
3189a20O8jL8M3j90L17k15j10J07M4j7M5O7k24Q8o9R9K9j8J06k3j39K45m5k18
$$ plain form
3002 73 -112 42 37 20 -153 -84 30 102 -27 -160 -119 70 55 -73 -70 -1 82 -18 -69 -179 -9 25 -21 15 78 69
3028 69 71 -213 -19 40 -43 12 -96 111 -58 17 -29 -29 71 -7 -114 -13 83 46 153 -33 36 -107 -20 -39 -265
3053 -265 120 82 76 -44 87 8 31 87 -32 74 112 38 -61 -64 -45 86 -45 -140 -89 -150 -24 90 -120 -82 -72 175
3079 175 45 40 -50 -85 -37 -117 -76 74 -135 164 76 -30 -37 -103 -40 -22 174 -102 -10 7 -126 -105 93 6 3 39 42
3106 42 49 -130 -190 75 -58 -106 23 -112 -28 194 21 -35 56 86 -46 45 112 13 -128 119 13 -6 136 12
3130 12 -10 60 -3 -1 54 -34 51 77 -38 2 -110 -80 -19 28 -3 72 52 38 10 -3 -6 -56 11 -46 14 77 -18 14 -5 -11 18
3161 18 31 34 65 -7 -45 40 19 -121 46 100 59 73 49 40 -77 140 67 92 -28 -19 -126 -26 12 10 84 -48 -131 -120
3189 -120 -52 -53 -15 28 -162 155 -60 -170 -63 -19 -36 9 76 -148 -60 -129 -30 -1 -19 87 64 -75 170 125 -93
3214i3J96m8j38P8L2M9L7j49m4O8P6O0K9j05k1N4j16O7m5l4RrJ35j6k73J79L9
3241A7p6K28k84O1J23q4q2J43O3l4L7j63n4R0k3Q9L5r4K9J06j32o0Q9%p7Q2K3
3268E2Q3K2k07J74k12L08j21j02MM5Kj42p9Q3J74j16O8j13R2L2j8j94J78n9O8
3293B2N5j09l2M1r4J92J4j26m5J42j29n2K23k8n1r6N5j0QJ07k0j12M3M0pn0m1
3320f0o9J14O3o4j3J26p9P1k3k6J00j24Q1m8l1J2k0k71J94M9J40k2K4j07o8O0
3346In4J8J43j32J32j72P1J2n5Ln9Q4LOL4%mP5l9L5q9n7nr8mK82q3j49K11j41
3376b3j95L29j37K2J36k04K81k66R6q7p6MK1K29k62Q0L6K1q3M3K3K1J42o6j82
3401i7K33j82j0K5k8M2q9O3l9M9J46Ok56J12J7O0j56K18qo2q4K7M1n8j44K57j81
$$ plain form
3214 -93 103 55 -83 -5 27 76 113 -36 -80 -12 64 124 153 48 27 81 -35 32 -13 -47 -38 -47 88 72 -201 -22 17
3241 17 -59 169 -115 -54 69 -15 -97 46 109 75 112 -51 -105 -15 -38 51 86 -8 21 127 -5 -65 24 24 -53 29 52
3268 52 135 157 -50 124 -88 220 99 -3 1 46 48 -94 -173 -90 84 -32 36 -77 15 47 29 -165 13 -46 22
3293 22 77 -32 -64 -23 -117 75 89 -37 -82 60 -69 -121 102 74 23 -73 -18 -28 -20 87 67 -45 -2 38 31 -19 -60
3320 -60 -129 -15 48 -16 -29 97 18 89 66 40 140 16 97 49 18 30 10 -261 -67 -18 122 100 124 17 -51 9
3346 9 -45 -27 116 -16 116 -56 15 27 -28 -25 -84 0 3 9 43 43 39 114 75 110 21 -36 -41 -139 -143 139 56 -93 118 -23
3376 -23 -218 111 -26 -4 132 -72 209 -57 39 -48 -124 -120 -99 130 -132 -52 -16 5 -78 -35 -12 9 151 85 -97
3401 -97 136 -46 -56 -31 -59 -17 -106 -43 -82 -33 113 119 -137 -25 -8 52 -104 114 106 44 -40 -13 28 -30 -174 83 -98
3428i8J73J8o9M2j31P8J14j38Pj36j33L35j16M2n8O2J69l13J01p0K17j64Q7MR6
3453A19r0j65K34l9j66m1J79j75J62j9J52j89J29j28j8j1N2J05q5j45J66o4LJ35
3477A01k08J26O2j56J18O9n2N0n3j09l3O6J9j1l7J38j62O3k0L9j4J80k31k8Q0
3502cK0q1J03q4j5N5j46K14l9m8J95j35M1k02P5O8J84k54J21q4J35q0o7M2j05
3527i0L2R8K4k8o5J00J4j36j0jJ11m6M0L6K3lj91N8rK10l28J15J2K6j2N6q5l1
3555h0O6Q0k8l7Ln8J69j24M9Lk8K6O4k00R0Q6n1Q6j46j92L17j60K78k12q2J48
3581F7r1j09O8n9J66J00l1r4p3P1P2j17J32k32K05j56K06l3Q6r9np4p4J0J18n4
3607@K6l7N9M9r6r2O8J46j19j9n5J32p6L2n5j31J49o0M0p2K13oj52k9l8K15j43
$$ plain form
3428 -98 75 93 24 66 -65 13 127 -11 -4 -140 -273 62 -54 -12 -70 -8 161 -152 -51 -121 96 -68 19 23 119
3453 119 29 -136 98 59 -107 -148 31 -144 18 -1 151 -38 91 -37 -55 -66 -14 91 6 -139 27 -37 -34 101
3477 101 -107 19 81 -75 43 112 60 110 57 -52 -85 -19 0 -11 -48 90 -72 -9 -29 10 -4 176 -55 -83 -3
3502 -3 17 -64 39 -45 -60 -5 -151 63 24 -24 171 36 77 -125 -50 18 202 -52 69 -15 120 40 -27 15 -90
3527 -90 -58 40 64 36 -29 71 85 -51 -61 -62 49 3 43 79 102 99 -92 -34 -43 167 -161 -46 -34 -8 -20 36 -49 -80
3555 -80 -14 66 38 1 4 -54 115 -9 40 43 15 41 105 -95 -5 81 30 116 -30 -222 95 -65 213 1 -81 67
3581 67 -24 -133 -65 -124 42 142 111 17 -56 15 87 -30 102 -130 75 -81 125 92 178 79 74 0 -74 -64 54 0
3607 0 26 -11 48 97 1 -91 -23 123 4 -15 -70 62 -14 18 -37 -168 -19 -79 -39 -111 102 96 -56 -85 -123 92 -51
3634e1Q8K2j49QJ15Rj76J76J6j09Q1o8j2R6N7p1n1O9K8j28N3%Mj0l9J10q0k3J01
3663F6j24J37L0k48J44j67L08n2j92O2l9R3J8k5m6oJ36J82l18%j12J23N1LQn8
3689b6P0j79J49O9m4J2J4p2m3J96j37K5o7l6O6Q0j7r3m5K17j22P0r2P5K0K3O7
3716A80j43kN1j42N9j9R0j06M8j18J35j4P9j73O8J7r3K9M6J85l10J44N8M4k70
3741a57J32N5M4n5L0J3j05Rl9j6J57j63J46j99L91l51L8N5M1R6m9L6j42K09j46
3766C0j23NR8O9L0j63n8K07j51o9J10K6l3P2m3j3Kr4J40n9j8j36J51m5O6r1J29
3793C9j51J64j21NO9Q7j90n5J37j05L6O8n1J5RM6M1K3K9j03M6j5n8o7J36J20r2
3820F2J1j58Q2M4r4J70k30J27q2L2r7N0J19q4J99j01r0m9OQ0O8%r9N1m0N1k2r8
$$ plain form
3634 -51 37 59 -90 -82 33 42 -134 42 58 -51 30 -38 -50 46 103 32 -19 50 78 -50 3 3 7 -3 -42 68 -12 -35 66
3663 66 -58 79 109 -139 5 -162 146 94 -98 -36 -75 18 36 11 -35 -41 95 277 -41 -41 -153 -30 21 24 32 -26
3689 -26 44 -135 14 83 39 51 65 -7 -50 146 9 34 -33 -69 -3 77 60 -33 -78 139 17 87 -5 70 90 113 180
3716 180 37 35 86 -56 3 -16 74 -32 16 -102 33 19 98 -75 -7 10 -83 -54 -8 177 -133 11 69 113 -157
3741 -157 -25 30 74 19 49 62 -43 -34 -73 -89 68 -95 51 -148 243 -108 -70 -15 26 122 73 109 -33 176 30
3766 30 -93 -88 10 79 109 -54 -112 95 -56 -125 -15 11 -22 50 7 -6 -4 -98 42 -17 -35 -171 -20 -65 1 -90 39
3793 39 -112 52 -69 -64 5 92 -98 -153 -16 -121 -85 -17 -68 -53 -44 2 43 66 95 -8 38 23 -35 -102 34 154 62
3820 62 73 -85 -3 41 -53 117 -113 14 -68 -36 -133 -83 36 -48 151 50 -40 -89 -83 -3 65 65 -34 17 -23 28 6 -92
3848i2J87n5j32N6J70k24J18k4j5p6k5J27p2O1l2n6KK8J48j36R4J43k89J20j03
3873g7J74k74J56l8N3J67o5j13K6j85K43j52J64j7p4p9l8Qq0J99k2m7N2J99k88
3898a08K57j36m0q3N3r4M0K13l13K39o1j01J72k0q4O4J58l25J79N8k37Q7O9J28
3922A15p8j27N8Ql1J25J3k60J80j30L9J01l1J30p0m3P5J8k66M0J31j01j56K90
3946C0QL8m9j4j00q8K18j1o5n6Q8POo3m0p3J05j1P6L6j2j91J04J12j47J74n6k5
3974Aj9R5k40J70o1j4J88k22K34k31J26J7j08N4N7q2M4n6P3M2o4P4l9j0j19J7
4000g3J5jL2K35k28j5j46M4K13j73L6L0P0j48O8Q5r8M2k0R0j8J07j47J03j74Q1
4026A0j68J99n7L4m8J16k05J62q8L4Q8pr3j20Q6O1j13J20M6n1J84l51O8K1oQ7
$$ plain form
3848 -92 95 40 -92 -36 134 -90 28 4 -11 -87 -112 15 -57 4 -28 -84 -82 -54 94 -42 52 195 -94 26 -77
3873 -77 97 -177 -21 -59 -6 161 96 -17 9 -176 67 -85 79 62 -12 -91 -129 -121 -201 -2 -24 -71 -19 180 -108
3898 -108 149 13 -27 -110 -57 -151 -111 102 -211 28 -33 -134 38 18 -66 -2 156 -169 10 68 -169 -82 -13 115
3922 115 37 -90 -32 -24 -55 70 83 -177 3 -127 -88 13 -18 112 42 -1 74 92 -174 -134 -3 -104 -260 30
3946 30 38 76 27 13 -87 -175 43 32 -33 -89 -1 6 12 -51 -91 -164 -59 -70 6 42 30 -161 -57 55 -92 82 26 1
3974 1 -18 77 -163 7 -54 -68 120 -102 132 -99 27 44 -64 -10 47 -35 9 -47 26 68 4 78 39 29 -90 -73
4000 -73 -58 -59 -27 208 -20 -35 -181 -137 76 -97 -61 -31 39 -109 -41 44 -54 -12 -32 58 40 147 0 103 -71 10
4026 10 -158 41 -16 18 -30 86 -119 43 -45 -11 77 70 -23 -143 -57 4 -109 11 57 6 190 -161 -93 -72 -78 9
4052Ijj4P8J7j10m3K25l33K89j67j16J40kP1nq7J70j3j37J2o4J15J14j10j41J1
4078i2J23j9Q2l8l0L9kk4q8J01j29J28o0l3P9J2p3J26o5NM8j03j46J59R3m7j12
4105f6J02p2r8J74j54J42l1L3j17O9J06L1J4j84O0Lj7o0J93n0j19O2p1l5%J08
4131B3m2J58j03K67l44r3J50J70l22P6R3j02j5J29j03J67j60O0j33J97n8m3k6
4154e4O7o4m4J31j7j39K39j08j77K09p2q6L8Q5k5j7J70nq7j45P9K1o1P2p3j00
4180a63J70r8k4J80n0K5m6n7J47j76R2j01J69p5Q9k03k1J47Q5j23K8L3j2o9K3
4205c0M2M5o7Pj83K37o6q7J70j28R6l2n4l1J02o3O4L1r6qJ10j2J3NJ30k22J33
4232A06k96O0K04r8Q0j07J24jr9n0Q4p9J00k5J15M7l81J93L1j05J5J00j21J72
$$ plain form
4052 9 8 -6 72 89 -21 -64 161 -172 117 -50 -166 -26 -28 43 38 -49 121 108 -29 -17 -81 34 148 38 -103 -92
4078 -92 31 12 94 56 26 65 63 39 -49 52 -77 51 -9 -42 37 49 -24 102 37 42 90 -13 -159 0 93 46 -66
4105 -66 36 -36 -134 40 -114 28 -3 30 -87 -18 88 119 133 -51 9 12 -5 -65 128 78 -41 21 -50 -85 -85 23
4131 23 -19 139 36 303 -41 -134 16 186 -136 -60 33 -69 -84 45 -58 109 -51 9 -124 73 15 -28 -54
4154 -54 13 -51 -95 36 19 -120 119 11 -166 43 -29 -115 -77 8 -17 -34 136 131 44 -101 -22 -1 -62 10 -63 -163
4180 -163 7 -91 -115 65 15 40 -6 -63 84 -92 0 -101 68 -7 82 -121 -142 5 90 -33 -5 28 16 -53 -30
4205 -30 12 57 -10 -3 -186 51 -15 -102 68 -60 36 4 -50 -81 21 -42 22 53 -43 -51 59 47 60 65 195 -27 106
4232 106 -190 -130 74 -24 56 -51 73 72 -27 -77 7 -72 28 3 118 165 -216 -23 8 -97 -82 18 -103 69
4256F9j50J27k2L6j40N0P8l0o3N3j61J89j35M4L7K1j5J6n6j48J76j69N1o9K00
4281a1M7q9P6j8q0r2J28J02j36R9n8L0j35J13n9R5l2J3k7L0p4J28m4L3PJ22k93
4308a25N8N8L6J09j83P9J00O1j24j50j06K18jj22K1j11K11m7p2J0l1J44j28P4
4332b1Q3j22J8Q3p6K4q3q5K03j77J25O2P1L9j29J24j89pj1J43j39M4J04k54R3
4357g7K15k15P0l0J39K3q4%M1L6r2P0j73lk8M4j2j12K47o8m1J0Q4j19RJ40j23
4384d9j07J50J3j45J77j96O7J36Qj40J50j13J37n1k9q5m0R5j03L5J14q9NJ40k7
4409E3j4j14J73mq8J14k0j52J19p5O1r0K7m1j2Q5l7J4j78M7J5K78j41j32K24k05
4435i3J4M4J30k68J70O3j65J20n4j2L0N5Km2k3Q2p9p2J09mL3l1Lp5MK3o6J90q0
$$ plain form
4256 69 -81 46 24 60 -80 -30 48 18 -45 8 -153 36 -99 -55 -18 3 -12 4 -52 -200 -24 -193 -142 -211 -11
4281 -11 36 -53 23 5 -75 -167 -39 63 -73 26 -32 -2 -137 -24 -83 12 -20 -7 -34 -4 -78 50 6 39 46 168 -125
4308 -125 -67 -9 27 136 -47 32 132 193 69 -81 -187 31 30 -92 -71 -182 29 -18 -90 -80 -111 33 -95 -21
4332 -21 62 -60 -42 41 -35 -11 -94 -179 24 -153 -28 34 105 144 15 139 -50 -57 -68 75 -64 -20 84 -170 -77
4357 -77 138 -77 -7 -37 102 125 41 41 82 118 26 96 -77 -80 -108 -64 -76 -188 59 -9 -50 -40 44 -75 -66 74 -49
4384 -49 -156 -6 7 -138 39 -157 -90 46 54 -86 64 -49 88 37 8 -77 -117 -22 -125 -90 24 -65 -60 80 53
4409 53 39 -75 98 94 6 120 100 -52 67 -8 53 -37 -10 -51 -63 22 -15 -1 -179 -132 -117 161 20 -112 112 -93
4435 -93 -79 -35 95 -173 -3 60 -105 15 -39 -51 -21 34 36 -6 -29 53 -26 -98 11 7 40 9 12 -63 -59 -36 -102 88 8
4464Hj5m4O1o1qQ8J24l1p8k2j80J48o5PJ27j63P7J06n0o6j5j22K17q1K37k55N5
4491akL7K8K7j20N1nK6q0L7J28j39M4j00q8J84pj26K25Rj94J31L1j42Q7N2k67
4518a74J81j66J42L8M0j14J59k49R8J10K1r4P2K9j47k0P4J30q6k0o0J17r5n2J19
4543E3j17M6kk04K64j33K2K40k26p9J91l1j77J77j07j0R0J14n8kKN9r4j06K08
4568A20j17M0j95K00k46K73r2j1j67K21J7J45l50J65j06J00j8j7K08j59M5k6k1
4591Ij1J0r5K3J97m5j25om1K42k41J38l0m5J00q2o1L1LK6N4r4j39J61R3j19n9
4618a06L1j7j37K24P1P4j17j79J40L0l0L8k5J3j59J39q6K39j48M6p0J5r7O1J11
4643F1J0j37J78j82N3p4K44o2j01J30p2J9rJ7j37p7N0Rk2K06n3m6L4p7q4J52L2
$$ plain form
4464 8 -7 -51 10 -51 -59 29 153 122 44 22 -158 -10 -75 -68 59 -104 -27 79 29 -37 -52 -174 43 -38 199 -56 -1
4491 -1 -3 34 62 89 -31 20 15 41 -39 -2 126 -13 31 -69 -157 27 20 -106 119 128 -66 65 96 -46 41 93 -174
4518 -174 7 -159 -17 21 61 -53 106 -143 -45 65 86 -8 64 93 -54 -74 0 130 44 24 -36 81 -14 -66 53
4543 53 -64 -18 -20 -224 40 -93 -71 169 -57 -136 55 24 -153 24 -83 -93 -3 111 53 51 53 112 18 -88 120
4568 120 3 43 -152 48 -198 75 -17 -28 -195 26 43 188 -162 3 -103 -3 -21 -38 170 11 56 30 9
4591 9 -2 8 -87 -64 133 88 -37 -43 -84 158 -83 55 25 -20 80 -2 -63 -32 -29 -3 51 -43 -182 -21 72 -47 -106
4618 -106 -75 -92 -229 -5 66 140 23 -156 -16 14 -16 22 -3 10 -149 -10 -96 143 -5 41 -29 -14 -111 -50 61
4643 61 71 -66 112 -70 -17 -91 153 91 -10 120 48 67 58 75 -62 -139 -89 -80 -102 104 51 5 39 -38 -122 30 62
4670F2j41l5Q9j27OR5r1P2R2L1J55j68j59J01J17j70J05j17K6p4P2m0J35j10j9
4695i3N7J26Pk1j10J18m3Q4j58L6r9J38k10K10j5j48J5J47K9r5L4j75J51pN3Q9
4721A20j16N0m3J9j13J67m0k01J64n5J26j01l3K26j93k1p2Q8M8j15Q9P9l6j1j91
4746a65J54P2m4R0j2k48J11O7j33J54j24R8l7p7P0Q5j20J37j7n2j48K95j01j5
4770D0r1J42k01J31j2j16nJ69J7n6n7J40m5P8j25lR5j71L2K2J5j11J53M3o3K0
4796D1k31K51O3j45j30P7L3j28K01K4n4o0J57N1j34n8j8M1N0o1O2M0j19R0J14
4821A57o1j81J16K0q6P2J6m6J14r4l2j04N5L5K35j71j22N4M0K1Mj75R5O6k85L07
4847E0j03k7j33K03k8J20q0L6M4n2J5P1k05P8M2q1K7N2n3J58j53n4Q0PQ1j30Q0
$$ plain form
4670 62 -79 -114 -25 -152 -146 -51 -142 -70 22 53 208 40 -119 -18 99 -71 34 -83 -57 -131 -59 -99 36 -74 -93
4695 -93 -36 90 97 76 -34 84 41 125 -33 3 -96 42 -168 42 27 -121 -106 41 70 -25 9 -166 -15 -22 31 120
4721 120 4 54 11 30 -83 84 44 -157 7 -48 78 -23 -56 170 -23 -44 -116 -28 20 -95 -6 73 37 26 -165
4746 -165 -11 61 17 107 95 -153 -42 25 -108 46 -78 20 -17 -94 -24 61 -59 78 61 9 -139 156 55 40
4770 40 -51 91 -110 21 9 -107 -112 57 74 18 -39 101 56 134 9 6 101 -70 -38 -16 -1 -112 41 84 21 41
4796 41 -190 61 124 -21 -151 -74 -41 -169 32 56 2 -58 99 150 16 -42 -60 -19 31 -30 32 72 -47 43 157
4821 157 96 -85 31 51 -35 37 53 7 121 27 -5 -109 -54 -19 216 45 -77 -23 17 38 42 -133 -38 28 -257 50
4847 50 -53 -80 -213 -10 -38 82 2 38 82 30 45 116 -89 -11 31 -50 -23 29 -24 134 -19 -73 7 14 95 -35 45
4874D5q1P6qO0k38K38r7K1p5l8n4J54p9J2R6m2Q1j08p6J10nQ0j81J64o7J03n5
4901C6n7j35J35K39k50J63j87R5j48J63r5o1Q3k2J12p3o0M9J07n5j1j7j11Q5m3
4926e8j19J92q9m0J09nl1K9j51L14k82O8j6J49j05o6nNK7o6J15J09k60K01J76
4951B01j92o3j42J57K07j73M0P7j75R6L4o8J92j40k14K09q0jJ31j04J0p9O8O1
4975E2j24J21n4J3k4L7K1n8J49j99Q6l4l8K01r5L5k53J65j73K66r4K03j50j04
4999e1n2M3lP5k0J10q0omkk07K38L8k51M4J87r2o2n5K51O1k08J38r3J09j86k0
5026i8J2J41q7L0j28J31O5n7l9k3l4Q7k2qL6n6J43j70M8K6j0L8J75j85j3o2J20
5053F0Rj47j3J68o3p1k8K32k83J78j2n5m4N5j11P3m1P7P3j76Q4O7j19N8J31p8
$$ plain form
4874 45 -36 40 32 92 -146 92 -5 16 -59 -97 -151 3 -76 -64 32 -10 71 -37 -113 -3 -8 72 -109 55 -12 91 36
4901 36 -21 -156 -21 218 -32 131 -56 39 -109 54 -41 -102 -19 -41 71 -2 -62 -13 94 39 28 11 -100 -15 -58
4926 -58 -177 15 -74 -114 -5 -10 -41 -12 -163 151 -131 -63 -79 70 -35 -101 -106 -101 -74 -140 -25 84 -176 25 201
4951 201 9 -54 -196 -39 168 -5 35 112 -63 33 67 -1 191 51 -163 46 -34 -35 96 -8 2 -77 -9 52
4975 52 -72 49 -5 8 -16 21 42 -16 133 -66 20 -14 -52 149 54 89 -164 1 -172 94 0 203 53 -51
4999 -51 -103 -60 -63 12 -8 102 22 16 12 10 -197 41 79 -172 -128 59 -33 -95 -150 101 162 -46 92 -1 108 -78 -98
5026 -98 -86 55 -32 -2 -130 1 66 9 -30 -53 -87 0 -22 -30 6 -50 93 -77 -29 -3 -13 25 200 15 2 -60 60
5053 60 69 -78 -91 77 14 -57 -85 147 -136 42 30 -25 -69 -14 -125 -52 -93 -16 57 -119 -35 32 -87 -29 102 24
5079B4J02j18J08k26l5K70J2j28n4j25J99M6Qj0j16o0J73Jr3n9J02p0J12K2q4
5104AM1J7j3j16Q0J16o3n9l3n4qQ2N3k3k5n5J7q3J31p6K2Q4q6o1K57j81J19j29
5132d5O7L9M1o6m1N4J43j54j3J86n16L97Q7l19K6KJ10mP1m3j65K22j12l0L6J75
5158A48j60L4j1mj3R4j56R8q1o0j0K23qj90J16n8o9K7L7M1j05J1p4L04j58J55
5184A31k22J61r1NQ1j0Jo1k3P1nj4J9r9K5O1j46K03j20nM9r0Q1j22R9J86j07K2
5212H0k5j35K4j8J16J13j71J6p2J07j48R7J8M8j39J82j91J0p0J14R3j50O4P6K3
5237F2r4l8L6j00O9J27r6K5k1J10j31O8K7j46Q1j46K96j54k7K38o1j16j87p1L26
5262G7J16l26J19J36j20Kk6k7Q1j24K84j23j15k2k5K3J08J3J6p4qKK1J3r2K4Q8
$$ plain form
5079 24 126 8 116 -110 -145 125 137 9 -45 -170 29 75 83 73 -43 -103 70 71 -22 -81 21 -49 63 85 1
5104 1 42 59 46 -70 10 126 63 4 -29 -83 -91 -9 44 21 -4 -59 -42 -125 6 -70 -48 36 -50 -111 146 -35 84 -45
5132 -45 22 61 102 36 -5 49 192 38 25 211 -305 92 179 -140 -114 -112 -2 -6 65 22 -143 79 -33 -63 -27 148
5158 148 -12 22 11 7 -6 88 -68 30 -51 -111 -121 102 94 -96 20 -38 -107 -80 -43 -2 -107 -96 -170 134 -24 131
5184 131 -91 70 -21 -16 65 55 56 -5 -28 43 38 24 43 -56 -31 30 -116 87 -33 -38 11 -79 2 -120 -21 165 58 80
5212 80 55 -80 -56 -74 42 155 -16 0 -72 35 -113 -16 2 50 -89 93 -98 -88 -158 -44 49 -101 -37 39 62
5237 62 -32 -70 -34 -134 -65 62 -34 -9 -30 80 -51 17 44 -102 -21 -167 129 -25 -52 186 125 9 -178 -249 77
5262 77 193 -133 -14 122 2 4 -22 -49 32 -92 192 69 -46 -68 -93 -70 38 51 67 -7 -15 -13 8 21 -71 -47 41
5289D1k5Rk31J90J03L5j14J16l8j10L5j15l0J52O3J05j96K07l57J86k30K79r8
5312b3j03J43J6p4p8N5J93m9k08J91o0j56J31J37j07M8j34J69p8j43N4Q8K3R6
5336A31j05qk6n9J63n5j01J71j97R0j6p4O0J8J2m1L8o4J53j50N8k0l3J10m6Lj6
5363dQ5q7N9p5L9N9k45J97m8m1j01K02o1q0k3J76p4Pj33P1j7R5j11K11j44PkJ0
5391b8J45j05m3J09j36J63n9l6k5n9J13q2M2R8R1k71J52J63k69j25K59l7k4j07
5415g1P0j54K14l4mr6r1R6J01n0N5r7J11j04L9o8L6Q9m7O1j31J17P1j32m7J4K1
5442c1J89k24P0P4pj60O2l6p1M5K16j90J09%j03J8j08J05K6Rq5M2R6N6j16j26
5468a40K26nm2K3j00J33l7p9k6O4j66Q3R2l18K75l2P6Pj28J46m8k3N7OK9p0j68
$$ plain form
5289 41 16 25 -206 -16 87 122 8 124 86 -24 11 -104 -134 18 81 186 -10 197 -160 26 -204 75 -23
5312 -23 -126 17 33 -41 -119 -64 129 80 -128 63 3 -153 -22 115 8 56 -78 91 13 -130 -76 12 35 131
5336 131 26 18 -8 -67 96 41 -60 111 -86 4 -12 -86 -26 -8 4 -37 1 -63 90 -60 -2 -22 -55 55 9 12 -4
5363 -4 81 -6 53 -22 17 76 -169 28 -20 -61 -162 40 -21 -101 -124 52 -22 -15 -148 -77 -94 1 -110 101 -43 -36 -38 -28
5391 -28 117 12 -31 78 -58 105 46 10 -15 -74 39 -43 -1 97 188 -83 69 232 -37 -162 97 60 36 -71
5415 -71 -1 -155 59 25 21 -75 -166 -70 31 -19 36 -61 50 -54 -15 -83 -47 42 -5 56 -75 42 113 -19 -66 -52 -31
5442 -31 158 -66 4 78 71 -89 -27 -63 -134 -89 127 -63 46 46 -57 -39 -147 -42 -16 -7 -92 -50 46 102 -14 -140
5468 -140 86 81 39 62 -38 95 58 -21 -47 17 -149 -66 26 -292 -17 -49 27 34 -94 52 4 -19 38 44 73 3 -165
5495a65J63q9j1J86m8jO2o2k7K1j5O2k66L00J23k63n0J68L4L4j02q5l4k2J06M1
5521F0J4j34J87n0j71L03k02L1j21Q8J5OK7q7Q7j1j17J8OJ19j21N5K0j39J23n7
5547e1J54j80K07j43k5m4j5O4M6j93K88j14L3K3k21J22O9L1p9J15n4j44O6J11
5571F6o8N7q9l7r6J09MJ59k15J20q5J78j42J25rj22J10j99J71j43K07J4j77K36
5595A74j91J2O9r2O5R0k41j7K46j59O3Q5J1l3o0KR0j96L6Q3P2k10J57n9Q8k64
5621a79K62J2L2j6j07N9m7o9mJ88j87J40p8M1j69O9L0m7J86j73nk6J18j37J02
5646eJ1q5J21j32R6l1O7k1j16J41R9o9qj4j39K4J34q9J68M8q3j43l7k9J06M3j15
5673e8j8J30j58J56o6j5k4J35l0N1k21J0J91k49J38M7J1k4n7J18j6q7n2Q1k6k7
$$ plain form
5495 -165 -2 -91 -102 84 36 35 97 35 8 29 14 76 -190 110 233 -30 -80 88 122 156 54 -31 -65 -87 19 60
5521 60 74 -60 127 77 -94 209 7 38 -83 5 20 26 53 -34 53 42 -75 -57 -51 68 -53 2 22 -117 6 -51
5547 -51 103 -77 130 -13 -38 -82 -97 -33 13 -180 108 -6 27 50 -171 -49 20 51 -28 87 33 -111 -45 66
5571 66 -2 55 -34 -71 -167 -58 -54 105 -110 10 -75 103 -39 86 77 -45 65 -134 37 -106 101 115 -62 174
5595 174 -17 -5 64 -28 37 127 -114 -131 115 -44 19 104 115 82 22 24 114 -82 -46 37 109 -101 56 -3 85 -179
5621 -179 83 95 127 111 4 63 16 -53 -57 131 -56 84 6 47 -122 -53 -23 -70 116 -57 -62 -88 30 -107 -5
5646 -5 6 -79 42 -90 6 -25 42 21 -95 46 145 76 68 54 -85 -61 73 -16 152 200 117 -26 -63 -92 14 57 -58
5673 -58 -76 54 -104 52 -14 -29 -53 82 52 103 -118 -108 83 -166 -28 19 30 6 -51 67 51 -36 -88 -7 -33 -60
5699f0pQ6r0J57Jj56P1N5j0L1M2m7q1J67o0j53l6k1K11l34K81k04J56O0l5J13
5725A37j47L1J9J69k26o6M6M0K7r4J01J19j76M7n2j00P0N0m3Q6j24J30j1j65K67
5750A35k38M2l1J40RPj7j50P2M8J2k6M7n3r7M4m2O4L5j36J45j59K11l6J3Qp6r7
5778a26P3J40j73n1J35L0j05J59j66j5R4J03k84L1J68J6j16R0q3k4K5Q8n8O4J4
5803B9oK7q1J59m5k17K78j24j64J70n0O1j8p7M6J19j61Q1j83R2J5P1j25J5J13
5828B5j34K09M5q1j79J31l9J30m6k44J21j46J72r5N4J32k31O6J43N0J7Lk29J75
5852D9J8r6K6n7J81P1k35j28K41j18J73j10O4j08qJ11lo6P8k37l2M08l48j8P9
5877f5L7L0J00q5k3J05p2K8k49J33j5P6o4J06j0oq0O1N2j44K0N5q1rJ7O5K0K1
$$ plain form
5699 -60 -67 19 -71 86 87 -69 2 57 47 78 120 73 -8 159 99 -54 -90 -111 100 -234 47 -157 -1 59 24 137
5725 137 -10 21 40 209 -17 -83 -37 3 30 -64 37 156 -20 27 -25 -125 -55 -5 -48 38 -86 44 33 -132 135
5750 135 -103 -61 -92 48 57 64 47 -103 -31 17 29 3 50 -3 -100 -56 -98 -34 1 -135 10 -149 62 26 39 47 -29 -126
5778 -126 -53 87 -86 -137 -2 28 -77 82 -84 -99 -5 98 -186 -155 13 29 -87 3 -80 -104 -79 9 -49 15 29
5803 29 23 50 -31 128 83 -134 144 20 -144 26 -24 37 19 -58 -12 107 -54 27 -156 -64 -49 22 -103 -88 25
5828 25 -109 100 145 64 -115 16 -23 107 61 -183 -62 -208 -36 -131 -77 55 -176 -110 33 83 100 103 -126 49
5852 49 67 -29 -3 -60 121 192 -43 -171 70 -48 125 15 79 -29 -37 74 71 5 83 -154 -186 222 -126 -144 -65
5877 -65 -28 2 102 17 -6 99 27 55 -194 -61 -76 0 -64 42 32 26 -54 7 59 -85 -65 -10 -91 -100 -83 -18 2 23
5905B3q9m5L8Q8l5J04K0j14J2o2J4j07J57j81L09j57r6J94j91j3J87J1pk2j42
5930a04K15j97Q5K5j00R6j0p7Q8q2K2R9j11J25k5m8J00p4l4J30j12N0k7m6K8q2
5956f6N8RP4j95K49o1Nr0J6j66J70j4j2J01P2l93K78K4k82J18J63q8k2O8n4R3
5982E5j00K26j94p5L1N7J65k24K27l33O6J37j47J40j19J83j01J3J40J2j66r9J43
6005C7m5K0k7L7j28k8J01L5j72K06lJ08j19N0j0o3j0O2j83J46J07k28J40r0n1
6030a08P2J2l3m9K6L2J0n1M2Kj7M5J08pp7p0J28M7j65K2J25p5J27l01K26j52Q
6057g3J23rJ08r9K2L3k22K1M8K8q2j2J14k9Q4l7j9o9M2J62p3l1J1q2J80j90J41
6084I0j6j66J68j44J64j04jo8J32mL4L1M2k73J54j17J20R2q3p1J59j71L6j07k
$$ plain form
5905 23 -66 -111 -73 15 -20 84 104 -10 2 -60 -46 -153 4 -177 132 -25 -121 73 -118 -131 56 67 60 38 -104
5930 -104 111 -86 -1 24 -76 20 10 -67 21 -61 -39 60 -51 74 49 1 101 27 -7 123 11 61 34 -12 16 -66
5956 -66 -8 1 75 -120 129 68 73 -17 -1 -167 3 -11 -23 78 150 -243 35 59 -223 -105 58 -30 -52 16 -38 55
5982 55 -45 181 -13 -88 -57 0 165 -59 168 -165 -99 38 -109 31 -88 95 -6 7 147 159 -7 -106 37
6005 37 -8 12 -15 22 -106 -134 -33 2 -170 36 33 141 22 72 62 -1 -11 51 -132 14 121 -107 33 -57 -108
6030 -108 -36 -24 -57 -106 -80 -48 -38 -89 -47 -45 -62 -17 91 84 7 -63 65 112 -53 -31 94 19 146 -155 71 -81 -73
6057 -73 50 41 149 50 72 105 -117 -96 -48 -20 -102 -114 0 -29 55 18 -1 -70 -28 134 61 30 41 -41 139 -51 90
6084 90 74 -92 76 -68 96 -8 -9 -77 55 51 85 116 158 -115 39 -78 42 134 51 -20 139 -32 4 -103 -105
6109a05R3q7O5R7j42Q6J88k56J8PO4R6j97rP8m9O1k1p6J92j84O2J01k18K70p2
6135F2p1k9o4K34k42Q8J15j36l8kL8mM3K27k60pP5j44J14no8Q8N1j52J00q9J5
6162f1J24n8M0KJ26l09K17k4Jr7p5J28j9K10k09p9N0m8J24Rp4N7j19J14k6j86
6188a82K26k9K4k4Ln5kn4J55q8J9Jn6Q0k4K6L5o1L1P4n9q7J50j73J16j6O0j37
6216d7L1N1P5j67J47j18r0M5J40o4n9O4q7J52l6Q9K4j25j7J4N9kj36K5mnp1J96
6244H4j81J39mj32K41j42L9j2p1J06O4k31J55K1k25J01K46j07M0k73Q0j4J65l46
6268b57K51j07Q3K9J75N3k38p2P5L5m9L2o9K47j80j9M4n3K6K3r6J24j52O1N5m6
6294b5p6O0o2P3M7L2o5J16r9j08K47q7pj01j0R5o9L5J06m7j29M7K9kJ3p0R5p0
$$ plain form
6109 -105 -12 -99 -34 63 -79 7 195 -61 -43 -36 28 124 -73 -82 -4 -53 8 -13 -89 103 -81 -19 82 -136 134 62
6135 62 -9 -38 -102 132 -110 -22 93 -43 -81 -83 -45 -49 -6 221 -39 -46 29 -115 -1 -6 -74 14 65 -87 13 -76 -61
6162 -61 63 5 45 47 173 -136 81 57 58 -39 -114 14 -5 205 -4 -83 -33 -81 43 52 -22 35 -84 30 4 -182
6188 -182 44 15 39 15 18 -37 -39 -93 62 -26 -7 -6 -62 18 -6 20 55 -6 25 99 40 -47 103 -70 46 30 90 -47
6216 -47 -16 35 110 -57 90 -28 -118 -73 67 3 -56 8 -79 73 37 126 150 25 8 22 81 79 -57 -32 -36 -41 -112 84
6244 84 -97 42 38 -94 147 5 44 32 -39 67 131 -100 55 76 -149 -48 198 91 131 -142 -62 -76 89 -257
6268 -257 -6 -113 -30 -1 174 227 -11 -83 -8 27 -22 10 -59 188 8 -11 33 -20 6 29 -67 57 -95 -34 21 -25
6294 -25 -101 -41 -103 -30 17 49 -16 100 1 -107 140 53 46 -55 -65 30 -39 -4 102 55 -74 -27 2 0 13 -57 38 -32
6322c2L3PpN1j08l4J87j34J26o2j01J71m7Mj20K09j80J8R7j91K55j55q2R5L7n1
6348a4L6Q0k11J20j0l1k5J09r1P9m9lL1j1Qj15N1J24j32K23j11j26J57q0j02M8
6374d5m1O8LO7o3pJ21o6n7J03P2q9r1N5j74K16n8N4l0Ml3K6p9M8K7l7Q4j11K04
6403A71j08j50n2J52k5o2P6j35J59op2J21j34j3J97j2r0P7p8j77K23j70R2NM4
6428C3Q9j44l9K1J79r5O5k4j18L6o8N4j52J55J29j37J30j10o6NpJ08j42J40q7
6453d5K05lk97L3J94Lq2J3pLj0n3K8J0M1j03J35j98Q6r0P0K24j77Q1n4J1N1R6
6481A65l11J81j2j06K50j23J17j57j02J29r8l2J23J2J1l1l7j65J25J47p0P3k6
6504F3j66kJ18J0j6O6j8j66J39j01L55l44P3j42P3RJ17l5q8J61l5j14R3l8N4j03
$$ plain form
6322 -32 1 8 1 52 -56 -90 97 -37 89 27 -74 97 50 54 -66 143 -37 -19 78 -113 142 -13 -95 0 37 -14
6348 -14 22 102 -109 11 1 -30 -55 54 -37 42 -7 -10 21 10 18 -97 -46 78 -54 169 58 -68 89 9 -93 -45
6374 -45 -86 -18 -15 52 -11 -18 103 37 -20 83 155 66 -25 30 -144 72 14 68 38 42 9 35 -44 4 31 -6 78 -33 171
6403 171 63 -87 -139 13 -12 -74 2 -133 26 20 -52 69 -65 -78 119 107 17 94 16 -161 62 -108 -16 -11 33
6428 33 122 -22 -61 -40 139 44 109 85 -33 3 -65 -11 -163 -8 121 -16 114 4 -62 -57 -64 44 -98 42 -45
6453 -45 160 157 -140 -107 87 90 8 21 14 17 7 -46 -18 -8 33 -70 65 -133 -47 -137 -67 157 -20 61 7 18 69 165
6481 165 -146 35 23 -83 167 44 161 4 -98 31 -67 -99 24 36 47 16 -21 -186 -61 86 16 89 63
6504 63 -103 -105 13 23 7 73 55 -111 28 -73 282 -62 11 -131 -58 -49 68 33 -55 106 71 -43 50 12 66 -37
6530c7K8J55n0j09Q5j97M9j8J8N0n7J13oq9j2N6q6O5Q8K13l09j29K55o4o7P6j78
6557a57R7J68p5rM0J19j38m1j01J98j30KL6Q6j31M6M8j3j26J27j49L6J79j29J0
6582gL1k8l5M9m6J66j2j55q1J87q1m4j9J36n1J69j10j83J0Q3O3k05R2J04N2K9
6608A14k35K72j66j3N3n5l9R2kJ01o3q0Q3M5j34J1P1q1m3J16j29N9J23j86M1M9
6634DR6r2J41k34%J53j01L6m5P2j1L4L5n1R6j5k35M2J07j84R7P4P4o4Q9l2j77
6661i1m8J10K1J37q6K7o0k8k9J15j44K2J6L7QM5j58J62j7j6lp0N8j00J58j11N0
6688EN9nm3k22J52K5Q8j07l6J45j38J04q2j6J04l2lj4J05j21K11k19n6J56j22
6713f2J44J25l32J94m2L2j18j7K10j38M7Q5p6o5m4n3K41j51O6o9K4P5p2J8l4j44
$$ plain form
6530 -37 -9 146 96 -13 72 -125 -76 -94 -76 -26 -83 30 24 -65 -77 -21 -107 -42 46 259 -50 -179 76 12 -55 21 -157
6557 -157 -60 108 33 24 64 183 45 4 -97 101 -29 -27 9 95 -36 10 58 45 -81 46 -103 -67 112 -17 -7
6582 -7 24 -4 -39 10 -36 130 118 -37 -118 69 -12 -56 -75 61 10 179 69 -114 -104 -21 42 -163 -71 33 85 114
6608 114 -121 151 -15 -28 25 -30 -69 23 21 122 59 -21 62 107 -27 -16 55 -26 -69 47 -82 -23 100 -86 -45 4
6634 4 100 8 149 -85 -85 68 -33 3 -42 30 19 53 88 37 133 118 -117 -75 32 -152 -55 19 93 29 118 86 -91
6661 -91 -139 -29 -8 129 43 70 10 -18 -47 68 -76 -54 -38 -1 7 52 -106 56 39 23 20 -50 8 -92 66 -45 5
6688 5 64 59 16 -206 -54 -29 59 -48 -84 61 -77 27 -55 -71 33 1 -2 -16 89 -32 179 -40 -96 60 -62
6713 -62 82 207 -125 69 27 59 -59 -76 134 -4 43 128 52 -13 -57 -110 131 -20 46 -23 1 76 4 22 -12 -156
6739a56o1K41j9q7J75l1k39K11K6K1j45J51n7q8Q1R4j26P8O6Nq0q8L0O8j34J5
6765d9J53q9k9pO2k44J85j10L2M7J00j37J23l7k7qJ01M6k66R1K2j0J19j62K95
6790B01k33L4M9j09k6R2jn4N6J05o8p5O3q8J36j17P4K6j5K2o4J0j20N3J00j00
6816d9J87j57O4j3k05J53MO0j88K49j78J1L4L2j12J98m2p3p1J07j47J15J33j49
6840c7J10m6o2r9K47K3j45P3K3k27J56J87j74N9k19K69k94J36K0j0R9o6j8j15
6864a10L8o2JP5j03K28J3o5j10nL3o6J91J9Rj78J50p1k2m6J60r1J04j31P2K3r4
6891c8M8n2j70J89q4L49k67K4p6K17j70J7j40O5J53j35P7j07O5P0m0l0j06J23
6915a8j0l8K0p5O8N9n8R9j37J07j3p8Q0J11Qj00M1j54J23j0j39J52j72K33p8m
$$ plain form
6739 -156 -217 24 5 -82 93 62 -177 34 60 81 -64 87 30 -58 23 117 -9 69 135 140 60 -28 2 70 -64 -49
6765 -49 104 15 -14 -21 41 -203 -18 -128 -96 -49 51 -86 37 0 -27 -35 66 112 -154 -63 -41 -51 68 -94 201
6790 201 -32 2 51 -58 -84 8 7 -47 9 114 46 -29 34 -54 82 -35 39 65 50 72 8 18 -102 -49 51 -49
6816 -49 138 -19 45 32 -173 -20 -16 44 -144 105 -73 -62 -28 4 -108 90 48 -25 -96 11 -136 -21 112 -37
6840 -37 73 27 -35 -134 113 136 -9 64 87 -140 16 203 29 88 -131 138 -156 -20 0 -10 89 23 5 -110
6864 -110 -72 -134 -133 -58 -161 67 80 15 -95 -100 -67 -133 58 77 86 -92 58 -13 -35 -81 79 -12 92 -39 33 56 -38
6891 -38 10 -42 -212 -23 -107 242 -25 -1 -77 140 -30 -13 -153 -88 65 -70 7 -100 -35 35 -5 -35 -141 -18
6915 -18 -28 -66 -46 -121 -53 6 -52 47 -90 17 4 -74 6 117 125 25 66 -88 35 25 -114 38 -134 99 21 17
6941A7m7J21m8j17J86j24J2J41k93J21P0M2n7L0j09P1Jk08J61M7j9p8J16l2jJ19
6967A22k53O7P8%l7O3m3n9M7J57k51J07J0j45Q1Nn0P6o0J65l5k63J63O9o0j11
6993a57L05j28p1j0J77j74K48j84Q7k28K49j13j43L13j60jj42J29P6l6nj83N2
7016i9J17pj01P5P8l0Q4k0j21L6k3qK8J07k15J05JN0Q9j59J12n6j5Q9k2q3k8M1
7044B5j62O2k9J29j9l7k3qJ50r7J15j50l2J20q3L2N1l3Q4j49k4N4L8R0k41K06
7070F9J22j38rK2o8J8P9k8j58P4jM6J39j69q6P9r4P1K0m8J65q8m5Q7r4J5K8l9
7098c1J29l5k04K40m9j16l3J27j06P7P6n4J3p7k5J0J49M6k62J13o4J41j70L4J54
7123H3j41M8k49K23n4J7J72P2j29N1j52q7M5R9J49r9m5R5j11r3K26r6q0P3k4Q6
$$ plain form
6941 17 -30 91 43 -74 112 -12 0 141 -152 -31 39 81 24 54 -55 16 17 -191 -30 17 -2 -80 36 4 3 122
6967 122 -131 -64 14 14 -23 40 -3 -62 -15 142 -109 -2 8 -137 -56 -51 -101 -25 -85 80 45 -218 -55 14 -46 -157
6993 -157 148 20 -51 -61 116 -58 190 6 93 -135 114 1 -142 171 11 10 -132 -3 73 37 32 -151 -99
7016 -99 18 11 -90 -15 63 33 117 97 -24 12 -11 -19 9 116 -99 6 7 57 146 -13 99 43 28 117 95 12 -16 25
7044 25 -137 -75 -104 25 6 -31 -54 -62 88 -9 106 -44 -76 44 -39 -7 44 11 95 -54 -78 -24 14 104 -137 69
7070 69 191 53 44 66 -2 16 95 67 -91 -17 -18 28 167 -2 -88 -9 -103 -32 -12 -60 105 17 -28 59 -35 -20 8 -31
7098 -31 98 63 -141 99 50 -66 -99 28 -78 -1 75 21 34 -43 -68 -58 91 137 -125 -12 -76 65 -105 -71 83
7123 83 -58 -10 -259 -36 -90 -73 99 171 42 93 -59 -146 -101 -2 147 48 3 98 -13 -106 120 24 -56 17 -7 79
7149G9k6j38o4K48q0j39J52o9J35J5k54J22k4J16nj27j0L8Q5L6N4k18Q0K8j01
7174f7LR7j49P1pQ7j66K12K07l01o8J40p8q6N6jR8n9m3J62j71N8L1j36J05r4J93
7201I4q2m1J04K2j68O1J80o7p9Lo9Q5L7n5l7k8o2J44q7L4O1j76Q7r0K02j09Qj8
7229d6J08l3j34K17oj69R4n2m4O5J61j54k02L52k03M0j2PQ7k6k5j10K09l36K91
7254G9Qj83J95q6n0qMJ67k93Q0J39M1k3j58K8K4N6KJ6mj00l0J14P9j61O7q5J69
7282H7o3K5J27q2j39j1J48l3q2m6Q8P7m9Q8m3j95K6K31k29J20j72M0J21L4N4k32
7308a10J04K3q9L2j5k17K58J0p5J42j75j8J38p3k6K48r8o6R4k06K15j91J4J78
7332I7rm2j27J1N8J4J07kk3L1l00J55N5P8m6j25jJ44K1j51J38k4o6P6j52J70k00
$$ plain form
7149 79 53 -85 -149 99 19 -120 32 -37 98 113 -141 -19 -43 73 68 -59 -69 -31 54 90 144 -74 6 34 -67
7174 -67 -64 33 -116 -45 -52 35 -131 81 288 -13 -81 59 -19 -105 -49 -50 48 -11 -54 108 -63 -5 26 -110 -5 -99 94
7201 94 12 -29 75 97 -71 -10 170 103 24 27 -42 43 80 25 -12 -40 -102 42 -45 -11 50 -126 -39 -129 73 -36 -28 -46
7229 -46 62 29 -105 112 106 -63 31 -21 -65 0 161 7 -195 157 -46 -6 -18 -11 76 50 25 -85 124 -212 79
7254 79 87 -96 99 13 -37 -45 -41 126 -167 -87 52 93 70 -88 -60 -36 20 22 38 34 -66 -96 18 97 -64 3 -82 87
7282 87 24 49 176 94 -45 -56 92 59 -23 -69 19 96 47 135 92 -103 -77 154 -75 45 -127 -87 34 68 122 -110
7308 -110 -6 17 -72 -40 -55 -272 -14 -4 -79 63 -112 -130 8 -65 -91 157 59 -7 87 -119 96 -95 -81 97
7332 97 88 46 -81 -70 -12 2 109 107 84 115 -185 -30 25 103 57 -68 -69 75 96 -55 83 59 -7 69 -83 87 -113
7359a13J99j49K5L62m04j9J08r1K8R1j60J05K6K0j06Q2KL3M1j4r1K2r2m4J06O3
7385C0l5o8j7J19j38J63PP7Q5l01R8q5LJ06r2K48k05M1P3r0l1J1J08j30J15o9
7411B3j4K3q1K05o5k88K20k9j35J48p8P5j92Q4Q6J09R3k19j40J81L0N9Oq6Pm6
7437b4n5L5RJ48O0j08Q6k24J52P4k01r4J94LM1j13m4J42p8P3p7J4N5j7P1m8J9
7464I3q4q3J26%m4kn5J27j75R3O2q8j9Q5o0J2J6r0P3ml8j4R5Qj0l6J5R9k09j4
7494a21M3Q4o7q8K02j29K0J7J38o4r4l0J0J00M4P2j58K2l3O0m7m5J82k08k4K12
7520I8j36M0j26K03RL4j85J29o3P4j50M3Qm4J31j09Q7r5L9K0l8p3Q4L7k5J04q6
7547A0j93J92o5K3r0P5j0M6J00j04j07J72m5Nr9O8J0N9R4j27q4J61j06J3nmJ68
$$ plain form
7359 -113 86 -63 -38 324 -80 -99 9 -82 -54 37 -123 -18 8 28 -78 4 6 39 80 66 -25 -3 -95 -139 -33 30
7385 30 -5 -73 -90 29 -109 54 61 138 223 -78 20 -65 -62 44 -48 200 -5 36 109 19 -12 -1 107 -23 92 23
7411 23 9 32 -49 156 91 -197 23 -6 -141 7 -71 4 -188 -104 -18 91 184 -35 -175 6 36 95 101 15 22 -24
7437 -24 -79 -44 -35 113 173 65 151 -73 79 153 -48 -142 52 55 96 -17 -61 81 3 76 -1 13 68 51 122 74 93
7464 93 9 -74 52 52 8 6 -49 78 -97 -4 58 -30 -49 36 -24 -12 4 -86 -13 -17 -55 -69 26 34 24 -12 3 102 -107 -121
7494 -121 -78 6 -61 -149 53 -76 -56 -39 99 35 -59 -89 -79 21 65 137 -21 1 -32 28 -19 -64 118 -90 -114 98
7520 98 -38 2 -124 79 88 122 -63 66 3 77 -73 -30 -22 -66 65 -44 43 -52 -13 7 -31 -104 -20 17 -8 96 10
7547 10 -183 9 -56 -33 -123 -48 -58 -12 88 -16 -123 49 4 9 -90 -22 -12 47 141 14 -70 91 -15 -2 -7 -11 157
7574A57m7K3O8j98kQ0k43Q0J4N0n4J44l9j66J45R3p7o1MJ2J14m9k18J17O9p9l7
7601a00Q2K4k0j10J72n2j74J68J63n2k44O5P8K0mN5M3l14J11Q5Q8j11J30J02j24
7626H1l9r8P7k7J47j40j11J73j8K9o5M6j26L2l7p0J06M6J34j78J53k37J88P0j52
7651a6M1Ok3K6R0k45J31M4O1p6pn3j2K6P1j87J06n0L2p6j2J79n1m6k2J26N7k06
7679h6L3K38k46R7Rk3n1q9J98l8Q8k05Q9O4o6l9K8K3P7L5j30j81K91j0mj44J37
7706I5n7N7j14J46m2j47MQK23j06L3k23nJ83j66Q6j35J40P8p0Q0J70k22l2J2J63
7732A59j96J11Nk7J4j43j20K08J08l0j46L7RN7j16P1L3n5K2K3m0J23O3j07q5Q5
7758F3Q9k32n3K26j66J44qqj90J83j06J78j10L1j29J67j42J93l2q3l9k9j13N4
$$ plain form
7574 157 110 133 201 3 1 81 -162 -82 -68 -18 -72 72 33 -133 12 105 28 -33 -29 -17 97 48 -170 -53 16 -63 -100
7601 -100 -18 6 -14 -124 48 -4 -178 -10 153 101 -143 -78 0 20 16 71 114 -200 -89 -4 84 -27 103 205 81
7626 81 42 -56 21 -6 141 1 -110 63 45 74 9 55 -71 -39 -76 -146 -40 6 140 -38 115 -122 66 136 -16
7651 -16 25 31 8 34 124 -121 10 54 115 39 32 -21 -33 -7 64 -123 -17 -67 -35 -111 -123 56 5 -41 -63 63 120 -86
7679 -86 -53 185 -61 36 45 22 -29 -118 80 42 130 -75 14 78 12 -27 1 24 101 136 6 -175 116 106 102 -42 95
7706 95 38 95 -19 127 85 -62 -58 -50 173 67 100 -123 -128 55 -111 -25 -160 -20 58 -12 68 238 16 -16 -4 159
7732 159 -37 74 79 52 66 -77 -197 11 119 89 -57 -20 -11 46 -70 1 34 -21 1 24 -16 107 170 63 -22 63
7758 63 152 -80 -133 93 -73 71 63 55 -135 48 -58 120 10 41 -88 79 -63 130 98 15 -24 -53 -166 -112
7782a12J61l2l8j12J74O9o8p1l1O1J47j56j3r6J40%L7j06J2J31om2%o8l0%J49
7809A00j02J14n3R0j83j16J46m2J69Ql13J88O2j41o5O0O3J69k50O6J27j69o2J29
7833eJ05r7K9J22j10J1J27j80koP2k52J12J05O9J6j45Q7K8Pj10MO6l0j05J40K2
7860H0rj97jO3J28q7QPj1L8Q9m4j25J34j01J01j2K2J7q7rN7M0j09N7j63K57p0
7888G3k65J25M8R7L4n2J0KK4k16l4K42j01j6k6n9J14R1N4q4K0l8o0J22l4j90J70
7915E1j02P3j25J7K1O9j15J37J57m7j43J04j96J39lj2j7k4J69n7L1j47J29j2j84
7940h7K63p4j06o3O7j21m1PJ90j01K23r7km1J7J18j98J10j65kQ4k0o7J36n6J92
7966A66O5j55q2Qn9MR4L3n4q9J4J23j39K49j92R6j18M3m8O0l2J10J5j72M3l8l1
$$ plain form
7782 -112 49 17 -21 -133 41 110 42 -29 -60 1 148 -8 -21 -117 23 23 60 -46 -34 97 91 49 49 -19 -49 -49 100
7809 100 -2 112 59 149 -34 -150 -4 -46 123 131 -182 6 68 -73 -138 -78 -15 154 -96 -30 97 -72 -134 -5
7833 -5 100 3 32 154 44 55 182 2 0 -6 66 -186 -74 31 100 116 -29 58 86 93 -17 -13 53 23 -82 58 80
7860 80 71 -126 -127 -64 64 -23 -15 -8 -19 19 108 64 -61 73 -28 73 61 83 100 13 4 61 101 -8 49 -114 143 73
7888 73 -192 -67 -19 78 112 60 70 72 96 -120 -154 88 -13 -29 -55 -114 0 91 145 61 81 43 -17 105 71 -119 51
7915 51 -51 22 -103 -86 -65 4 -111 26 183 136 -7 97 -99 40 37 25 8 -16 153 96 127 -20 109 97 -87
7940 -87 176 102 -4 -67 0 -121 -162 -155 35 -66 157 60 58 17 34 152 -46 64 -101 -103 -19 -39 -106 30 -26 166
7966 166 231 76 -6 2 -57 -53 41 74 20 -69 -55 68 -71 178 -14 82 -36 7 -41 19 -13 97 112 -60 -17 -55 -86
7993h6P1K6%P7r3P3O8q1j02J22o4p1P4n2L1Q3l1Ll8j97J54P5q6J89k23J13j93
8020a58J55j1K6N0Nj34KM7Q9M2J1j86P6J56j95J2J8L6q1J93j46o2n4J76n8K3K5
8047E7k01J00kJ15n1J9m4p9J41J9p4J29k08p8P1J27j0j04K37j71K7r8J80j44J52
8072A10n6N7K2k38KP8J66j61J04j19K56k75O0Rl9j40R0J79j15O9j20Q0o7K42k89
8097i5O2M6O5j65J52Np4q6Q2q6lP5J27M5P9j70n1J8m5m6m9J25r2OJ14r1m4K56
8125A60k09P0l7J27j26pK4O7m4M0j6k1J42l45J22N6J24l25J53J39j07l7O1J2P1
8150I4k6n1R3P0j87j01J12L0J77k93R5j34J95R4k41J23p7l6K9k1R7j53QO5R5k6
8176C1L5o5n5K64k15p8J33k8K1Mk46J47%J18o
$$ plain form
7993 -86 -15 11 11 88 -5 68 136 55 -47 75 11 -60 14 -38 -7 76 45 48 10 -187 -33 42 -44 145 -78 35 -158
8020 -158 -3 -14 12 62 67 -67 -65 -18 71 113 124 -62 14 170 -25 -13 5 41 -40 153 7 -55 -109 67 9 32 57
8047 57 -144 -44 -46 69 18 37 -7 -86 55 74 0 129 -79 -157 -86 41 31 -73 164 -7 20 -78 102 -42 110
8072 110 54 111 133 -105 -103 -25 141 -20 84 -35 221 -54 6 15 -24 -164 -74 105 -10 59 -61 19 -48 194 -95
8097 -95 -33 13 78 -87 65 70 -4 -90 -8 -94 -97 -22 105 150 229 59 8 26 -19 -65 -114 11 -81 -75 39 -52 -96 160
8125 160 -49 21 -16 111 -15 -22 2 69 25 65 49 28 170 -175 -53 3 127 -198 -45 94 -13 -50 11 23 94
8150 94 68 17 110 180 -7 -108 4 34 211 -82 13 -121 74 168 -73 50 -27 -63 -34 -55 42 -111 -103 -38 57 31
8176 31 66 1 -54 210 -5 -83 50 22 43 47 -199 -52 -52 66 60
8191F0
$$ Imaginary data points
##PAGE= N=2
##DATA TABLE= (X++(I..I)), XYDATA
0@%%%%%%%QqMj2K4l2L2m0N6p2Q8j10J34j58J90k27K67l15L73m32M97n79O67p61
31d06Q71r95J127j273J440j622J816k034K276k535K819l133L475l843M249m697
47b465N180n710O296o937P637q414R281j0245J1327j2550J3946j5552J7427j9654
61a0433K2341k5659K9892l5498M3312n5067P4949j17082L63525n96282o47084
72i53086J047098P80159m50507j083021M8516R40111L00034q67872n33435O02007
82a69996P61353l69180r07548n9428R51398M82644p50426q22630L99213R33165
92D48565R9341q08562m47508N92176O83693k99802o82589O5165O72302K00460
102E23241n69923m27215M48522O48167j86365p42194j25412O60706M22990m15518
$$ plain form
0 0 0 0 0 0 0 0 0 8 0 4 -8 16 -16 16 -24 32 -40 48 -62 72 -86 104 -123 144 -171 202 -230 267 -312 355 -406
31 -406 465 -530 597 -676 764 -858 958 -1076 1200 -1335 1484 -1649 1826 -2017 2232 -2465
47 -2465 2715 -2995 3301 -3636 4001 -4413 4868 -5377 5950 -6600 7346 -8206 9221 -10433
61 -10433 11908 -13751 16141 -19357 23955 -31112 43837 -73245 290280 -306002 -953086
72 -953086 94012 874171 423664 -659357 -610841 329270 629304 -238568 -772003 -169996
82 -169996 591357 222177 -685371 -744799 206599 689243 -61183 -883813 -484600 448565
92 448565 547906 -260656 -708164 -115988 567705 267903 -414686 -349521 322781 523241
102 523241 -46682 -473897 -25375 622792 436427 -305767 -431179 229527 652517 236999
112B36999o17472Q5371O29276J49327n34176l21207L26157L84278j61076m64798
122b87321l0868M59457J84220m12855l64254K38524M58137j3228m57971k26462
132d52621L44430L80744j65355l95338N5L41235J59498k32669k37415J70482L08863
143B21909o3881l06860m1563K93456J99953j90602l02058N7227L40624R6700k73875
154C1030k00554J45234K36942k0942k39795q1061J99915J17530j66723j66373
164a44797P9708J85613J064k15371j13204J70135J76335r4509k07493j8783J69424
175a1878J04328j05986j46762M8898J49898q87j14854k4949R6711P7465o0172
186A1812j08148L9068J40101K1940j10080o4820O6676J04649J733r8109l9060
$$ plain form
112 236999 -380473 -295102 334174 483501 -50675 -371882 -45725 338553 177477 -287321
122 -287321 -318189 141268 325488 -87367 -451621 -213097 245040 231812 -226159 -452621
132 -452621 -108191 272553 107198 -288140 -288085 53150 212648 -20021 -257436 -86954 221909
143 221909 158028 -148832 -190395 103061 303014 112412 -189646 -132419 208205 304905 31030
154 31030 -169524 -24290 212652 191710 -48085 -129146 70769 188299 21576 -144797
164 -144797 -65089 120524 121588 -93783 -206987 -36852 139483 44974 -162519 -181302 -11878
175 -11878 92450 -13536 -160298 -111400 38498 37611 -77243 -102192 -5481 71984 11812
186 11812 -96336 -57268 82833 104773 -5307 -70127 -3451 101198 102931 4822 -34238
197c4238P4332M9581m1257m1683J1496L0682j593m5485j6844M3901J6274m3162
209B004l2852N643K3662J5252k1315l3059p40J4021M944Q270j231k5434j0428
222e1263K0208K1973O736k0213k4911K3996L8737j2796k6382J3025L0832O420
234B6362l0852k0269M3865N1320l2390o7068Q312P2557L2772n5627p0647K4616
246a7049Q7241L333q6463l4469O1459N4014m1637q2806Q873R2081J6723r6230
258c4930n8018O8036Q8461k6271j09955l0101J02976P5010p2600r9374K8793J06889
270C8916K4044r6379o4045Q3347J00092m7943j13090N646J19384N4601r7301j00735
282i3463N9880J31797m051j30608n1154J03413R6512n8561j26180O180J31176
$$ plain form
197 -34238 40094 89675 48418 6735 18231 48913 47320 1835 -15009 28892 45166 2004
209 2004 -30848 -25205 -1543 13709 -7606 -40665 -41405 -27384 -22440 -14170 -15401 -40835 -51263
222 -51263 -31055 -9082 -2346 -22559 -47470 -23474 15263 2467 -23915 -10890 19942 26362
234 26362 -4490 -24759 19106 70426 38036 -29032 -20720 51837 84609 28982 -41665 -17049
246 -17049 70192 73525 -12938 -47407 14052 68066 26429 -56377 -47504 44577 61300 -34930
258 -34930 -92948 -24912 63549 37278 -72677 -102778 198 75208 2608 -96766 -67973 38916
270 38916 62960 -33419 -97464 -14117 85975 38032 -75058 -69412 49972 104573 7272 -93463
282 -93463 -33583 98214 94163 -36445 -87599 15814 112326 53765 -72415 -66235 64941
293F4941L9795j17108q6376P6488J18929k7324j40568l4730J29278Q6025r3401
304A5949j26507L3833J38641K9009j26616q3896R3383J20546m5545j34184r420
315i4807J29755O7666j02865j12225O2306J40287l749j37329n4841J12837J07369
326A14404o5126j36121R064J40070M8147j17256r5021P5473J26574k2688j39785
337f2265l4057J28231Q3208r4235j22788L8723J38529K0987j31565p7250R7055
348a5427J14416m7850j30960q828J24524O1500r9052j02428N8174J25148o346
359G2871j25510m6197J04941R3296o5294j19897J6019J25261L6933j05541q0572
370i3690O9089J09444k2419j18319k5512J06739O7863p7800r9417L5019J14377
$$ plain form
293 64941 104736 -12372 -98748 -22260 96669 69345 -71223 -105953 23325 109350 15949
304 15949 -110558 -76725 61916 90925 -35691 -119587 -26204 94342 48797 -85387 -94807
315 -94807 34948 102614 -251 -112476 -50170 90117 86368 -50961 -105802 7035 114404
326 114404 49278 -86843 -77779 62291 110438 -6818 -101839 -26366 100208 77520 -62265
337 -62265 -96322 31909 115117 20882 -101906 -63183 75346 96333 -35232 -112482 -15427
348 -15427 98989 51139 -79821 -88649 35875 97375 -1677 -104105 -45931 79217 72871
359 72871 -52639 -98836 6105 99401 34107 -85790 -69771 55490 92423 -13118 -93690
370 -93690 -24601 84843 62424 -55895 -81407 25332 93195 15395 -84022 -49003 65374
381F5374J3639j09825n9536Q3728R2431m2909j08090m959J03692M8340q1644q0902
393h0661M7599R8219n965r8389l5419Q2473P0213n2950r1396J4871R5338K5071
405F9004q2184n9648N5290Q1226k0139q7277j6530P7538M7416n5737o9473K5136
417c5378P8827P807p5727l8470N8815O2038l1528p3930m73P2920L1009n8148n3338
430e5576L4433O5631o274o5330k0362N5122M2897l5426n6159J2616N9399J2685
442D3656n1836l4259L6293M8207j5501n2560p112M6553K6191l3944l9151J5770
454a7693M3076J963m0667j9319L1106L0162j8043l7293J079L6673J4051l0283
466e188k5702J8381L1438l825l1348q290K6455J8317j6160k3098O566K5191M516
$$ plain form
381 65374 79013 -30812 -90348 -6620 85811 42902 -65188 -70147 33545 81885 241 -80661
393 -80661 -33062 65157 59192 -39197 -74616 7857 78070 25120 -66276 -51405 43933 69004
405 69004 -13180 -72828 -17538 63688 43549 -43728 -60258 17280 64696 8959 -60514 -35378
417 -35378 43449 51256 -24471 -62941 -4126 57912 26384 -47546 -48019 24901 55910 -2238 -55576
430 -55576 -21143 44488 38214 -27116 -47478 7644 50541 15115 -41044 -28428 30971 43656
442 43656 -8180 -42439 -6146 42061 26560 -26000 -33112 13441 39632 5688 -33463 -17693
454 -17693 25383 27346 -13321 -32640 -1534 28628 10585 -26708 -25629 11044 25095 -5188
466 -5188 -30890 -12509 18929 15104 -16244 -24534 1921 20238 4078 -19020 -12454 12737 17253
479A7253k1045j1802J5176J8379o015j9393j693J7311R110j1607j3775N339J4398
492A1636O3j2731n534Q088P679n240r263J93P081K246o478n417K893N050r73m613
508e320j684K473K155q77j206N35J74J28J381K084q08k573J617M794R19m098k228
525b534M819N625k506o276q5P800M060o908p513M139R958J22j1756n770R483R617
541A2275o672j4067J00J4310M273j3836j0954Q632J4794l637j7709m468J6203
554g56J1485j2029j7283M983K0850L715j9287j1790J5853J9541p132k2495p28
567a5073K3720J1422j8275j8404J1972K4488j298k4651r175K2028J8704j4354
579A1104k5198L423K6753P183k4532j8313J6602K3917p403k8403n147K5755J4663
$$ plain form
479 17253 -3792 -15594 -418 17961 11946 -7447 -9140 8171 17281 5674 -8101 -2762 11636
492 11636 11699 -1032 -6566 1522 9201 3961 -5302 -5109 1972 4218 -2260 -7677 -4784 266 -707 -5320
508 -5320 -7004 -4531 -2376 -3253 -4459 -3924 -3750 -3622 -2241 -157 -965 -3538 -1921 2873 3792 -306 -2534
525 -2534 2285 7910 5404 -872 -957 6843 10903 3995 -3518 621 10579 10701 -1055 -6825 2658 12275
541 12275 5603 -8464 -8364 5946 10219 -3617 -14571 -5939 8855 5218 -12491 -16959 -756
554 -756 10729 -1300 -18583 -13600 7250 10965 -8322 -20112 -4259 15282 8150 -14345 -15073
567 -15073 8647 20069 1794 -16610 -4638 19850 18552 -6099 -15274 6754 25458 11104
579 11104 -14094 -10671 16082 23265 -1267 -19580 -2978 20939 13536 -14867 -20014 5741 20404
592B0404k0382k4300R344K7930J877k7823j3861K1753K3333j2091k8412M80K9750
605H002J1940k4126k1068J6294K8568l487k9254p596K6767J9526j7832k6235P528
618a0973K9504N647k6201j6915J9026K4855q666k8483l553K6023J4191k0807k3449
631a9801J0185K6575L81k7055j2446K0588K0222j2404k6157P80K5841R782k1869
644e378j8958J3382K4789k695k5416p612K2886J7376j4774k2439N847K5451N845
657A8304k1865j4517J6321K1949o310k3646l659K2324J3231j5976k0298P515K3035
670A6408K070k2488j1771J6425J7991r262k2459r50K1214Q928j7776j6842R666
683h846K0197j339k1089q072J7433J5328j1224j9528K887K0907O060j7746j3131
$$ plain form
592 20404 22 -24278 -14934 12996 14873 -12950 -26811 -5058 18275 6184 -22228 -21748 8002
605 8002 19942 -4184 -25252 -8958 19610 16123 -13131 -20727 6040 25566 7734 -18501 -10973
618 -10973 18531 24178 -2023 -18938 88 24943 16277 -12206 -15759 10264 24455 3648 -19801
631 -19801 -9616 16959 17340 -9715 -22161 -1573 18649 6245 -19912 -19132 6709 16491 -5378
644 -5378 -24336 -10954 13835 11140 -14276 -21888 998 18374 3600 -18839 -12992 12459 18304
657 18304 -3561 -18078 -1757 20192 13882 -9764 -13423 8901 22132 6156 -14142 -6627 16408
670 16408 18478 -4010 -15781 644 18635 9373 -13086 -14036 7178 16106 -1670 -18512 -8846
683 -8846 11351 10012 -11077 -19149 -1716 13612 2388 -17140 -14253 6654 12714 -5032 -18163
696a8163J3203J8508m603j9384l155J8586J1325j2616j6280O674J8950J746j7752
709b961q612J3764J4584p643j7609M3J7002O407j4257j2510Q160J5304k511j6142
723f981n111J3254R822r278j3749K848J4116L061j3185q583R712J1880m429j3207
737i830p56J2612O363r536r324N566J1966k97j0686l814R319P908n349r311J482
752c687J0142K818q306o116N510P955k078q745j601P357M003n649o235J942O604
767C914K75o529l351M351M472k605n369k53M855K222m260l251K519M206n30m025
783c359o58L344K543j915k414P74L243M62j860j083J418K144j67k070k1J651O75
800B707r56j135M25Q71j80r86j04J94j32n62J17k09m06n48L16K10m48j042K0J068
$$ plain form
696 -18163 -4960 13548 8945 -10439 -13594 4992 16317 3701 -12579 -5905 13045 14791 -2961
709 -2961 -11573 2191 16775 9132 -8477 -8434 8568 14975 718 -11792 -3632 11672 9161 -6981
723 -6981 -12092 1162 10984 1706 -12043 -9195 4921 7982 -5203 -13786 -4074 7806 3377 -9830
737 -9830 -10586 2026 8389 -1147 -10471 -4905 7061 6764 -3922 -7736 1583 9491 4142 -5169 -3687
752 -3687 6455 9273 967 -5149 361 8316 6238 -2507 -4108 3249 7252 1603 -4632 -2690 3914
767 3914 4189 -2340 -5691 -1340 3132 527 -4842 -5095 -240 1982 -2278 -5529 -3010 1196 666 -3359
783 -3359 -4017 -673 1870 -45 -2459 -1685 1558 2020 160 -923 495 2639 2472 402 381 2032 2707
800 2707 1751 616 1041 1912 1732 746 642 836 704 142 259 50 -356 -904 -588 -378 -826 -1868 -1848 -780
820g80L6q49p79P07J268J47j596m12J726J654j257j703N35K565O55k251j357K111
838D20K697r88k772k74L098J478k148k922J393L317j64l665j652K841K922k113
854A468m106J44M130J253l950l034K684L748o92m772j303M261K908k864m226R75
870c376N133J170m696k866L868M600j842n247j91N544K619m159m606K978N479
885D408n10n309k217M802M112l016n596Q64N583J698n215l931L517N251j504o107
901c170j186N371L471m178n281J883N970N24n635l089M457M902k423n903j30O113
917A696K643m895m427L325N622n99n942j679N340L813l275n475J500N737J355
932D739n499l462L887N061j715n772q78N444L050m194m972K105N697l4n582k315
$$ plain form
820 -780 -744 -1593 -2372 -1665 -397 -250 -1846 -2258 -532 1122 -135 -1838 -1303 1262 1917 -334 -1691 420
838 420 3117 2129 -643 -917 2181 3659 1511 -1411 -18 3299 3135 -530 -2182 659 3581 1468
854 1468 -2638 -2494 1636 2889 -1061 -4095 -1411 2337 1645 -3127 -4430 -169 2739 -125 -4351 -3376
870 -3376 1757 2927 -1769 -4635 -767 3833 1991 -3256 -3447 2097 4716 557 -4049 -1071 4408
885 4408 3898 -1411 -3628 1174 5286 2270 -3326 -2462 3121 4819 -396 -4327 -810 4441 2937 -3170
901 -3170 -4356 1015 4486 308 -4973 -3090 2880 3404 -2231 -5320 -863 4039 1616 -4287 -4417 1696
917 1696 4339 -556 -4983 -1658 3964 3365 -2577 -4256 1084 4897 1622 -3853 -2353 3384 4739
932 4739 -760 -4222 -335 4726 3011 -2761 -3639 1805 4855 661 -4311 -2206 3491 3457 -2125 -4440
948d440M255M041k238n438K27N162K059m324l877K762N040n34n141j701M417L670
964C940l025m626J141N124J133m474k988L423M151j312m833p84M541K627l229
979H09m046J578M581L72m613k069L406L541k021m439J09M243J659l387l033J903
995a407M010n98l976j229L436K724k151l630N48L960R93l418k379K397L475j210
1011A545l419m80L317J723k486k477R80L370K46l076j709K499K560j406k965o5
1027a843L158J093k551k171J327K912l67k985p50K394J795j511k329N06K266O84
1043A628k123j436J535K055o11k299p2J887J000j409j624O33K015l4j781p93J419
1060a0J297q20j424N7J471O84j350j128R63J244r8j525m76J406N67q45q37L67
$$ plain form
948 -4440 -185 3856 1618 -3820 -3593 1569 3628 -696 -4573 -1811 3229 2695 -2446 -4147 270 3940
964 3940 915 -3711 -2570 2554 3687 -787 -3775 -352 3799 2487 -2346 -3130 1411 4038 809
979 809 -3237 -1659 2922 3294 -1319 -3388 18 3559 1538 -2901 -2792 1451 3110 -277 -3310 -1407
995 -1407 2603 2005 -1971 -3200 236 2960 809 -2821 -2273 1687 2680 -738 -3117 -720 2755 1545
1011 1545 -1874 -2354 963 2686 200 -2277 -1297 2073 2319 -757 -2466 33 2593 1187 -1778 -1843
1027 -1843 1315 2408 -143 -2314 -987 1925 1558 -1427 -2177 217 2012 501 -1828 -1322 944 1628
1043 1628 -495 -1931 -396 1659 1048 -1251 -1323 564 1564 155 -1469 -836 1179 1145 -636 -1429 -10
1060 -10 1287 467 -957 -900 571 1255 -95 -1223 -260 984 886 -639 -1115 291 858 13 -824 -457
1078d57J037K45j059o67P35R59m72r04K08P74L21o12o44L05R08l04m36l20K99
1097h4M20k89j56m9L77k06j94J14J1Q0l4j90K04Rl11R1J83k4l03m1M25K8l3k38
1121b10O8L06J27m31m7K39L07q9m71q4N96L21n45l05K04N17j12n20l35N20O13
1142F69l43r88K72P27J37o44p46P25Q09l97r63r4Q19M37n18q00J88J330k45p91
1162d16n28Q81R21n22j101J3J128M65q48q14P03R61%j353k07J100Q51q60j063
1181f89K34J190K68j133r92R20J253m65j381l06J429O58r97j266P10J267Nj519
1199h14l14R41J088o00j351l1J592L90j307o18O37J233j7j472l40J344P43j010
1217I4j089N83J177L96j360o95R45J247o63j487J11J191P45r86j228N85J388k48
$$ plain form
1078 -457 580 825 -234 -901 -166 793 321 -583 -375 399 720 108 -536 -231 677 373 -63 -383 -84
1097 -84 336 47 -109 -158 219 13 -181 -67 -56 24 -10 -200 4 13 -298 -207 -24 -48 -351 -392 33 61 28 -210
1121 -210 -142 164 291 -140 -187 52 359 270 -201 -285 311 632 87 -218 -14 503 391 -129 -464 56 669
1142 669 326 -662 -390 337 474 -170 -916 -191 618 221 -742 -836 -17 420 -98 -898 -710 620 375 -416
1162 -416 -944 -63 858 336 -765 -752 376 841 -7 -821 -118 843 843 -510 -717 383 1234 374 -689
1181 -689 -455 735 1003 -130 -1122 -202 1051 586 -795 -1101 328 986 -11 -1277 -567 700 705 -814
1199 -814 -1128 -187 901 301 -1050 -1081 511 901 -406 -1024 -387 846 829 -643 -983 361 1104 94
1217 94 -995 -412 765 1161 -199 -894 51 1298 635 -852 -741 450 1195 209 -1019 -434 954 706
1235G06j338l42J047Q16o95j269J95J357K60j203r53J036J130M7j568k53J417
1252C90N86r49j103N83J272M8j264n96J190J004p50q47j71J113M80p84j023P97
1270b4R42k0j186o81J094Q42p21j022K57J099J22r49o07N65R77k14j312pJ115
1289B70J79n62o25J44J143r1j078k15P97R36p21p29J26P93L80p51o78N82Q27k74
1309D53o90m19P18O28l49n55M8O35N9o10m38M34P19j55q76j54Q11Q2l19m23m6
1330d47Q22n7o25l73M46N67l04n74K11M91L28o35l71L64N07j34o18L4M07L93j14
1351C18n41O4N34l1k67k02M6N09j09k99j88M12J02j83m91K20K29P7k75j75J91
1372e9K68j63m25J30J57K98k51k19J69J58j12O7k28J69J33n1k60K54P5n3J62l15
$$ plain form
1235 706 -632 -974 73 889 194 -1075 -880 477 737 -466 -1419 -383 747 794 -774 -1027 390
1252 390 976 27 -1076 -493 779 827 -437 -1033 157 1161 411 -436 -607 506 986 202 -821 -24
1270 -24 918 898 -288 -969 125 967 246 -776 -519 580 702 -247 -854 -289 688 474 -838 -845 270
1289 270 449 -113 -738 -594 549 458 -620 -835 -38 898 177 -552 -426 367 747 -4 -682 -100 727 453
1309 453 -237 -656 62 690 341 -214 -166 469 528 -82 -520 -86 633 478 -398 -552 259 341 22 -401 -447
1330 -447 375 318 -307 -680 -234 333 29 -545 -334 157 485 -150 -521 -157 350 216 -402 -368 39 432 318
1351 318 -223 -159 375 344 77 -125 -79 430 321 22 -166 246 348 165 -326 -106 123 200 -75 -250 -59
1372 -59 209 46 -379 -249 -92 206 -45 -264 -95 63 -49 18 -210 -41 92 41 -219 35 110 57 219 -96
1394i6J51K42k28j66J79J59r8L2k14N5R7J9l7J1J0j35J48K7k02J21L3j72L0O4
1418C0l8j59J30j1jj81J68l4P2j29k5L08j1j01k15K17R0N4j78j38K36K7r7J81
1442A95j99m8K49k10Q9m2K70k59r3q2K21K35l85j15L62Q6k71nj26RM72k19m43
1465c09N3L04R9l0l26m0M22r5k07j50L23J69p6m18R8M14N9l14j83N2L87l7l98
1488b03k7L72K74m70n4O4R9K5j49j99J58L47P1n76J49K50M8q9l35RL44j10k47
1511b49j44L91J34j25k24Q3L40O8l78j97J59L08j74k41j08M26K31k56j21l6L09
1532A96j20J6l57K48K00L8k93o1K06J28k0l79l4L83k1l70j1K24J94M2n05J79L06
1555A89J03l51j02P1K34m9k36j75L32K35k11k98J24L16J11n59n7L28J88j18m25
$$ plain form
1394 -96 55 297 69 -97 82 241 143 175 -39 16 113 132 95 106 116 -19 129 156 -46 75 108 -64 -34 30
1418 30 -8 -167 -37 -48 -49 -230 -62 -96 -24 -153 -178 130 119 18 -197 20 110 164 -14 -152 84 111 14 195
1442 195 -4 -52 197 -13 76 34 304 45 -48 -130 91 326 -59 -174 188 274 3 -2 -128 -119 353 134 -309
1465 -309 -256 48 147 117 -209 -249 173 78 -129 -279 44 213 137 -281 -183 231 290 -24 -207 -155 232 195 -203
1488 -203 -230 142 416 -54 -108 -44 55 80 -69 -268 -110 237 308 -268 -119 131 179 90 -245 -236 108 -2 -249
1511 -249 -393 -2 132 7 -217 -134 206 274 -104 -301 -142 166 -8 -249 -357 69 300 44 -77 -113 196
1532 196 76 92 -265 -17 183 221 -72 -133 73 201 181 -198 -232 151 130 -240 -251 -27 167 209 -296 -117 189
1555 189 292 -59 -161 -90 144 95 -141 -316 16 251 40 -258 -134 182 293 -266 -323 5 193 75 -350
1576c50L14K08M7k27k43J58L40l9l18r7K39J07k0l45n2L06J78m18k2K51J32J9
1598A68l43j14L72J6r9j23J03O2Nk25j22M01L5j50o0n5L09j27m4j37P1K29q6q5
1622AQ9M0j23n2j32M9K46k3j91J12o2J04p8j96R1L40r3j21q2r1L33j23j01j38
1646b01J59M9N1k56N4O1J34N5k20R5J63O6j96ON2L2p1k6j91L63j28k1j61K34j8
1671H5K4j15O3j7j3m4ML4k6J08J3j66J0J35j14J4m5J63n0k23J15M6rJ95k54M6
1697b1N4Q7k09J13K32l00%N6j9N1M6Jj60O2q4j00K52j22N3j2O6M3j31j1J76k12
1723h9J34k2j19N5J47L5j46r5M7J46Jq2j8k1Q0o5J5K6o0K6N2k09N4J50l0k0m5
1750e3j17J88l3p8J77j04N8j65J8nJ77j29O3n9MJ19k3k47J34M2J34l4l0j4J01
$$ plain form
1576 -350 -36 172 219 -8 -251 -93 247 208 -110 -207 32 139 119 -226 -278 28 206 -212 -234 17 149 168
1598 168 -175 -289 83 99 0 -123 -20 42 47 -178 -300 101 136 -14 -74 -129 180 53 9 -128 -57 172 86 1
1622 1 90 130 7 -45 -177 -128 118 95 -96 16 -46 58 -20 -216 -125 215 122 1 -81 -172 161 38 -63 -201
1646 -201 -42 7 58 -198 -144 -83 51 106 -114 -19 144 210 14 20 72 104 33 7 -184 179 51 30 -131 103 85
1671 85 109 -6 57 40 27 -17 -13 21 -5 103 116 -50 -40 95 -19 -5 -50 113 63 -160 -45 1 -8 187 -67 -21
1697 -21 33 120 -89 24 256 -44 -44 12 -7 44 90 91 -69 -7 -91 -191 61 -61 -8 -20 46 89 -42 -53 123 -89
1723 -89 45 23 -96 -41 106 141 -5 -100 -53 93 94 12 -6 -27 53 -12 3 29 -31 -5 47 -162 -108 42 12 -8 -53
1750 -53 -170 18 -15 -93 84 -20 38 -127 -109 -114 63 -66 -3 -62 -58 61 38 -209 -75 -33 101 67 37 23 124
1775A24j52o6j4pJ04j06l9J58m8J65J41k86J23j70K14k03n7lJ86k07M4J02L1m5
1799a1J11j50K72k05j40L4J4J30J4k3j94l0J66J01j67J51j79K80j60M9o9K6K7
1822D7n7q9m2J44j77J70O3R5q1j88k9K33j12L6q3k47L09M0m5j11L86k56R2l1p3
1847fNo9N9oK0R6K2j31P8j87R5n3J27j40P3J28j46J5O3m0k7Lm6J08n9J57j53k6
1875d0J35Rj52K38j98K4Nj13Pn0K52j61R2q1J19l4j23K7L38k57L3r1L0p4M8m7
1901f4j2K7k0J65j39O0J2J9j66K28j84k2K62j23j29n6K50j83n1j6J46M2J31j79
1925bm1J24j49N2q4J87r6N5k03K28j24L3M9j25O2R5J34k25O9J63k71m1k3J50o8
1950e1R8JMJ3o3l9J23n1l7o5J1J10q6r3J57q1J40r0m3O8M5p4R1j07k23P4J07J18
$$ plain form
1775 124 -28 -94 -108 -115 -11 -117 -156 2 -46 119 260 -26 97 -73 141 -62 -119 -122 64 -143 -99 3 34 -11
1799 -11 100 -50 222 17 -123 -89 -75 55 69 46 -148 -178 -12 89 -78 73 -106 174 14 63 -6 20 47
1822 47 -10 -99 -141 3 -174 -4 59 154 73 -115 -144 89 -23 13 -70 -317 -8 32 -13 -124 262 6 98 67 -6
1847 -6 -1 -70 -11 -17 3 99 121 -10 68 -119 -24 -77 50 -90 -17 111 -35 -20 43 3 -24 -21 -67 41 -18 139 -14 -40
1875 -40 95 104 -48 190 -8 16 21 -92 -85 -135 117 -44 48 -33 86 52 -71 -44 294 37 70 -21 9 -65 -17 -64
1901 -64 -76 -49 -69 96 -43 17 29 48 -118 110 -74 -96 166 43 -86 -142 108 -75 -126 -142 4 46 177 -2
1925 -2 -43 81 -68 -16 -100 87 -9 46 -157 71 -53 -20 29 -96 -34 61 195 -30 39 202 -69 -110 -133 17 -51
1950 -51 47 48 52 65 2 -37 86 35 -2 -67 -56 54 -32 -125 32 -49 91 1 -42 26 71 -3 88 -19 -242 -168 -61 57
1978E7j0j42N3Q5j86J96l2m0l8J97j64RJ84j80k3L7j1P6L0m00L89j1m6P7j92J02
2004A7j9o9n7J08k3J0J5P2j2j0lJ38j65l0J50o3Lo9k4J01q0N6j0J58n3k57K23
2031A07j83n8J58l4l0M3N9p3oR5M8j0o3j19k9n5K51j84J28l1R1nl2M2j07O3o9
2058cQ1R2j68o8J17N9m2j39K87j89Kj9N7J09j63p7K39k34J86o6j2j27%J43o4N8
2084E9p1O6j35J19Q1j58P4j6M2p5j0K17j86m0N5P5p8k42K38N8j62J68J76l35J
2109g9J53p1r8Q9lR1ro7j8R1o3j20J59O4k1k9r7o4J31j56J50m0J25j30J19o1K6
2136G2jj5n1O9K9j0J8l2j79J2J73m0j20N2L6q7J24j99lO5J67n4j80K33qj46K34
2163A59j68K4l3k9K4j18K77j27m4l2K31k49J05n5r3O1k2L19k85J73j21k2oQ6j23
$$ plain form
1978 57 47 -95 -42 43 -143 53 21 -19 -57 140 -24 -15 169 -11 -34 3 -8 68 98 -302 87 76 30 107 -85 17
2004 17 -2 -71 -128 -20 -43 -33 -18 54 42 32 29 167 2 -28 122 59 62 -7 -31 70 -10 46 36 194 141 -116 107
2031 107 -76 -134 24 -10 -40 3 62 -11 -17 78 126 116 53 -66 -95 -150 101 -83 45 14 105 100 68 110 3 66 -3
2058 -3 78 170 2 -66 51 110 68 -71 216 27 29 10 67 176 13 -64 175 -59 127 61 49 -78 -78 65 1 59
2084 59 -12 54 -81 38 119 -39 35 19 61 -14 -24 193 7 -33 22 97 19 -223 15 73 -89 79 255 -80 -79
2109 -79 74 3 -95 -6 -9 82 73 6 -12 79 16 -104 55 119 98 69 -28 -92 39 -117 33 -7 118 -12 107 46 72
2136 72 71 56 5 74 103 93 111 79 -100 -88 85 45 -75 -23 13 -74 50 -149 -152 -87 80 26 -154 79 71 -75 159
2163 159 -9 15 -18 -47 -23 -141 136 9 -35 -67 164 -85 20 -35 -128 -67 -89 230 -55 118 -3 -25 -31 55 -68
2188f8K22j45J7n5LJ30L1k18K05K6k0r8n7N7n1J12J6j79J23r1P9O0j39P5o0o2
2214h7J24j11m7J05L8j10J24J33j66j25Q8R7o3l3m8Q7j01Q4K8n9M0J74j03J68
2238B37m52K47J04k5l06K16j42O1N6j78L04j2p2j50J04j02K18l7k2M9r5%K0O9
2262I2K3j28Q9j25J04j35P1Q0j43J34L6j76m9R7J38j62N6J18j05m9r3M4KJ23j57
2287a15J31N6l8q3Pm3J23on2J8p9K17q3k6j2N2L4k28J65J48l38J93p6Q8o0j20
2313a27O5N6J27K8k00N2l1n5J97j58pK0J21r3O2N0j18N0l7j60L47j87nO9j72J1
2339i5J63N3j15ok5P9j02n3N5R9m8k8J58k45J34j5J3Q3qq3o8n2J52j35N5L1L5
2366C2o1K2r0J68j54J9RO0j52J58L8p6Lo1J33j8j7J01j03k6j1o6l8J59m4j01m1
$$ plain form
2188 -68 154 9 26 -29 -26 104 135 -83 122 148 128 30 -27 30 -21 91 107 -72 51 -40 39 99 -40 35 -25 -87
2214 -87 37 -74 -121 -16 22 -88 36 169 3 -122 -34 63 0 -33 -81 6 -95 -11 17 -42 -2 172 69 237
2238 237 -215 32 136 111 -195 21 -121 -60 -4 -182 122 110 38 -112 -8 -110 108 71 49 98 3 3 23 92
2262 92 115 -13 76 -49 55 -80 -9 71 -72 62 98 -78 -127 -30 108 -54 2 120 15 -34 -127 -83 -81 42 -115
2287 -115 16 72 34 -49 -42 -85 38 32 -20 -2 -81 136 53 27 15 67 101 -127 38 186 -152 41 -35 53 -7 -127
2313 -127 -62 -6 121 149 -51 1 -30 -85 112 -46 -53 -33 88 -5 57 107 -11 39 2 -158 189 2 -3 66 -106 -95
2339 -95 68 121 6 0 -25 54 -48 -101 -46 53 5 -23 135 -110 24 9 22 105 97 14 -54 -106 46 -89 -34 -3 32
2366 32 -29 -7 -97 71 -83 -64 -55 5 -147 11 49 -27 -24 -85 48 30 13 114 11 -15 -26 -92 -130 29 -15 -116 -157
2393a57J09q6K52p1j06J10K0m4l6L1L4L2J2j74K79k63M2N1j49J90q1J13p5J6j52
2418a03N8k3J70j34J42j20k3J7Q8r2J0P5j21N9l1O8Mn4j82K10j35Q6J53r4K3k3
2444B8n1M6j29Q0j00J13M7j41J42j00j6J4J84q0q3KJ02q2j22J31K8J78k58J54
2468H7r6m2J6m4P1p6n4rR4J14Pj35M2p9J14p6J10j23N3JJ09q5r7qn5K48r7J33
2496A23n6j72M6r4R6R9J78k37j22K01j99O6O9O3j57M2O0J29M1r2j99N8k8J68j04
2521b1J33o1mj28J05N3j21L8J03j52k7k2K54j45O9l9j25J06j29J04k4Lj07K0J69
2546E2j0j16Q5L5r8R5o7n7Q7N3k32O9P4%j00K98k98n6J34J1J24m9l6PQ4m5Qk34
2574a82J87j30J8J69L1q5k0p3K3L2m6J8J17j64R8N9%m9rK0MQ8m8j57j23K52J04
$$ plain form
2393 -157 -48 -134 118 47 -59 51 71 27 -9 22 56 88 100 -74 205 -58 -16 35 -114 76 -5 108 33 49 -103
2418 -103 -45 -68 102 -32 110 -10 -33 -16 72 -20 -10 65 -56 3 -28 40 44 -10 -192 18 -117 -31 122 28 51 28
2444 28 -23 23 -106 -26 -126 -13 34 -107 35 -65 -81 -67 117 37 -46 -44 58 -24 -146 -15 13 191 -67 87
2468 87 -9 -51 -35 -79 -8 -84 -138 -147 -53 61 68 -67 -25 -104 10 -66 44 -79 -26 -25 84 -1 -98 -106 -161 87 -10 123
2496 123 67 -105 -59 -153 -57 42 220 -17 -139 62 -137 -71 -2 61 -96 -54 6 135 176 84 -115 -57 -85 83 -21
2521 -21 112 51 47 -81 24 77 -44 -6 97 -55 -82 -104 150 5 74 35 -90 16 -113 -9 -33 -30 -137 -117 52
2546 52 42 -74 11 46 -52 43 -24 -81 6 59 -173 -104 -30 -30 -130 168 -130 -186 -52 -41 83 34 -2 5 89 44 52 -182
2574 -182 5 -125 -107 62 93 8 -12 -85 -62 -30 -76 -58 59 -105 -7 52 52 3 -6 14 18 106 58 -99 -222 30 134
2601A34j10k1j15J77j46m4J06J08k7j10n9j1J00q1M6kJ92j90J07k48L14n3j84
2624a17J91j31J99j00j62O7L9q9J34L4r9J21J3m6n2rJ1O0Lr3k4j1J58r3j5l6O9
2651B2j02J24N4j43J55j09k6p5K07j07N1O1j71J35n7j21N1M3R6kj68Q6j37O4P1
2676Bo0K4Q9j39J23j8K7j0L3Rj59p4K49Qj55P5M4j24K1K7nr2J14L7K3mp5j30M4
2705i6J11j58R8j00O9P9j5J61k36j0J76j13N5q5M6J12k47Q0LK3K25k05R6J0k4
2730E5L1q3kM9o8K26j84K8O5o5qk10K15O8kk98J82j9J58k44J81k0K5j05K9j11
2756a07J48q7Q9n9r7J26k1J12o4k5j20O9j17L5J23J01n3LJ1o6J5n2P8p1l4N9O8
2783F4K6k35J39k0m6M8l0J06j04m3N2j9N3L2J1P9n7j80J57j34O8K5J4k2R3j72
$$ plain form
2601 134 24 3 -112 65 -81 -125 -19 89 62 -48 -107 -118 -18 -99 -53 -55 137 -53 54 -194 120 67 -117
2624 -117 74 -57 142 42 -120 -53 -14 -103 31 65 -34 87 100 54 2 -7 4 64 67 -26 -50 -61 97 4 -11 -47 22
2651 22 -80 44 98 -45 110 1 -25 -100 107 0 51 112 -59 76 19 -102 -51 -8 88 86 -82 4 -133 -69 2
2676 2 -58 -34 55 -84 39 21 48 38 71 80 -79 -153 96 104 -51 24 68 -56 -35 -8 -13 -105 9 46 69 65 -10 -140 -96
2705 -96 15 -143 -45 -145 -76 3 -12 149 -87 -97 79 -34 21 -64 -18 94 -153 -73 -70 -47 178 -27 69 79 55
2730 55 86 3 1 50 -18 208 24 52 117 52 44 -166 49 117 115 -183 -1 -20 138 -106 75 55 80 -25 4 -107
2756 -107 41 -46 43 -16 -113 13 -8 104 40 15 -105 -36 -153 -118 5 106 53 56 67 1 16 -36 42 -29 -63 -4 64
2783 64 90 -145 -6 -26 -72 -24 -54 52 -52 -95 -43 -62 -9 23 34 113 56 -124 33 -101 -33 -8 6 -16 77 -95
2809i5p0J84j01R2n5L1m0M8P5p7J26j18j9MJ48l14K28m7m1J23j18m1J59K6j06
2834Bl4K2j9O0J7j40J72j99k7J61%j44J00j60R6L5P5K0o5J03r5O2n2K4l6M2J0
2861C0nj03Q4k0P9n6K1l5n8P0J2j24J78L5q1J23j51K9j33Q1o6j7R7m3p3M5J16
2888C5J2j74J91j70j2J83j04m5L3K23j59M3L3lk58N9J37L4l17K33J10j23K5K5
2912A1j02O6k8Q1o3Q7p7J9J3r8P8N8Q7j96J78J8j59r9J33l1j39J59K09l00R9L6
2938D0o4J3J1k1j39K39k27K83j6r9j27MJ28j79J69j49J72k7l5J8r2o4Q5Q7LJ4
2964B7j7J35L3k28J53p1Q8j31l9o8J61O8k5m9n0kPm5oJ81j74J17n1n5n4J58j08
2991d5k1J64k6k6j28N2Lk2r8J81J6r4m6R0R1j49R3L2j15Q8j21M1m8l6J60j13J12
$$ plain form
2809 -95 -165 19 -82 10 -45 -14 -54 -6 69 -8 118 0 -19 -15 133 -181 47 0 -41 82 -36 -77 82 108 2
2834 2 -32 -10 -29 31 48 -92 80 -119 -146 15 15 -129 -29 -189 -93 -58 17 37 -28 75 -20 42 -10 14 -22 20 30
2861 30 25 -78 6 -14 65 9 30 -5 -63 7 19 -105 73 108 27 150 -1 28 -105 -24 -90 -107 -10 -53 -126 -81 35
2888 35 47 -127 64 -106 -118 65 -39 -84 -51 172 13 56 89 86 -172 -113 24 58 -259 -26 84 -39 -14 11
2912 11 -91 -25 -53 28 -35 52 -25 -6 7 -91 -13 45 132 -64 114 132 -27 -126 7 -24 -163 -4 205 -95 4 40
2938 40 -24 -11 0 -21 -160 79 -148 135 119 20 -107 -103 25 -154 15 -134 38 11 -24 -6 -98 -162 -77 10 13 27
2964 27 10 145 178 -50 103 32 120 -11 -50 -118 43 111 86 37 -13 -15 -8 -53 -59 122 -52 65 14 -41 -95 63 -45
2991 -45 -66 98 72 46 -82 -30 -27 -49 -147 34 50 -44 -90 0 91 -58 35 67 -48 40 -81 -40 -88 -124 36 -77 35
3018C5n0J65k34J13Mk4M0m7p1R4q3J03j6p2O2J4Mo3N3K3Q0k39K16p6m2K2R2p4
3046B9K24k61L5r6p5J94L5p4j47P6O5L7j32l7J6R6N8N3j01JJ0L5p5R7K3j40qk
3074f4J27l3m3K5M2j0j11j3J54q4J45k0k1k0j50J15k6J44r8j36J95j75o3J28L7
3099D5m3m9O6o4L1j30J28L6m6NQ6J7km9P1L6r5j73J24jQ4rk82K52j77N9J36j43
3127h7O2m5K8M4o5J29q2J84k27J48q6M1K2p6L1o8J53k4j86P3N3m2K9n2J12K1j55
3154f5oO8pk0R1q5q7J54k00J2O3J43m0n7J37n4j28oj5O8K1l0O0K5%j8Q2r3O5k4
3184E4NK9n5n8J17q4K6o0j2l6p1K11j73K23j40P5j27P7Mp1M5k1P3p8J67j51j04
3211a35J08J69k51K11j6j83J5O2m3r9J79r6J35p0j12J6J37j02L7m6k1M9Q8j07
$$ plain form
3018 35 -15 150 -84 29 33 9 49 2 -69 25 -58 45 29 -43 19 33 37 -26 27 50 130 -109 107 31 -11 11 103 29
3046 29 253 -8 27 -69 -144 50 85 11 -136 -60 5 42 -90 -127 -111 -15 43 96 -5 -4 6 41 -34 63 86 -54 -62 -64
3074 -64 63 30 -13 12 54 44 -67 -80 74 -10 135 115 94 74 -76 39 13 157 59 -77 118 -57 -120 8 45
3099 45 2 -47 19 -45 -14 -144 -16 20 -26 -21 65 82 80 31 102 138 43 -130 -6 -7 77 68 -214 38 -139 -80 56 -87
3127 -87 -25 -70 -42 2 -63 66 -16 168 -59 89 3 44 66 -10 21 -47 106 82 -104 -31 22 -20 9 -43 69 90 -65
3154 -65 -71 -3 -10 -30 61 -24 -111 43 -157 -145 -82 61 21 -36 101 47 -81 -87 -102 -34 -13 -43 17 42 42 24 106 13 78 54
3184 54 59 88 33 -25 92 8 34 -26 -38 -74 -145 66 -107 116 -24 51 -76 1 5 -66 -21 -42 31 -47 120 -31 -135
3211 -135 -27 142 -109 102 86 -97 -82 -20 -63 -162 17 -79 56 -14 -126 -110 27 -75 -38 -84 -105 -56 32 -75
3235g5Q8Q2m2p0P0r3J3P0M6j25J6J13j57N2J7K0Q5q1N3l8m1O6l0q3JK05j93J3
3263a8l2O4%ro0K07j92J4J01l28K78r6K13j71O3j6l0o8J82ol2m8j70K27rlK7k6
3291F2k1j43J79lq4O0k02K82j33J42k62L0J72J7n5k14J24J09j88R0J9r0Q0j03
3315a32L8Q3mj2J4l2P4O4oj26j37P9J11j62J63K05k00m0L4n7Lm0J54p6N9p4j3
3342c0oJ77Kj40J4j04R7k6r6J8J00k9j0P5Pk1m1l3J03j84J55j22R6k4J10j53J77
3369A12j29l3J22j87J26M3j18j7L5j7M5R%j13J75j63O1N2L7J0r4O1k0J6n0J87
3395A50k30J71k4l9J99k66N1lm9K4k1K1J7P2k02J95k0j30R0j78J55J02j18n2l2
3420a17K9L7J6k7j00J26K3J12lj29N9j61J42k6j8R9K7M4R1l02J50k23J18K10j34
$$ plain form
3235 -75 13 95 53 -17 53 -40 -27 43 89 -36 -20 93 -64 -12 5 25 110 29 82 44 3 69 39 -44 -43 162 -31 -18
3263 -18 -50 14 14 5 -55 152 -40 -26 75 -253 25 -71 142 -29 34 18 -12 -80 102 96 64 16 -154 73 64 61 88 62
3291 62 41 -102 77 74 -10 50 -152 130 -3 139 -123 -93 79 96 41 -173 -49 60 -128 -38 -19 -109 -29 -132
3315 -132 -94 -11 -15 -27 -13 -45 29 93 87 -39 -176 -97 14 -148 15 220 20 -20 14 -43 -40 -80 74 -2 57 -17 -30
3342 -30 -36 141 143 3 17 -87 10 -16 -112 -94 6 -23 -33 42 49 28 -13 -46 57 -127 28 -94 2 -22 88 -65 112
3369 112 -17 -50 72 -115 11 54 -64 -81 -46 -63 -18 -9 -9 -122 53 -110 -49 3 40 50 -44 17 -3 13 -37 150
3395 150 -80 91 67 28 227 -39 12 9 -40 -16 -37 -16 1 73 -129 66 46 -84 6 -172 -17 85 -33 -85 -117
3420 -117 -88 -51 -35 -62 -162 -36 -13 99 96 -33 26 -135 7 -19 -37 62 89 133 224 -78 72 -151 -33 177 43
3445D3k8J9m0j88K72%Kk4m0l6R5j20J26Nm5j32j3O5L8m3k8K1K28j89j6J08J6j8
3473G8j31M8K3r0n6K06j3j29J4J67j06M6L7k9o3o7j01K90j45l2J02l7n8oJ71k21
3499a02N1K3l9j32L24j08j19J25j2Q4q7J00j99J43L2r3O8o0J23o8l3L8r0j42J16
3524e7R1Qj8Oj14L8lJ71j25J9o8P0l9o4n5J92j40M3l1O1j10J54M1k7o7q1J43n
3552C3j04M0P6n9J5K5q2P9k6j32oJ17J27o6Q7k6j24J3rJ7p5J73k3j67m8J60j08
3579i3J42j6j31K00j73km7J14j72J35J04j02pP6l0N4j3mj48N7M7J35n4j33K08
3604A47Oj42l3L1J16j06O7k8m8KL0K2m0M5O9j40K00j54j7n7o8KQKL4J13M2O0k86
3633a23L2l1K06q3p8%O4M9p1J64j39L5p8l6P7Q7j52J94k1j61K19j69NQ1j87M1
$$ plain form
3445 43 15 34 -6 -194 78 78 80 56 16 -20 75 -45 81 86 41 -91 -104 -39 -1 -44 -72 -51 177 -12 -28 80 96 78
3473 78 -53 -5 18 -72 -128 78 65 -64 -50 117 11 57 94 65 2 -65 -166 124 -21 -53 49 12 -46 -52 119 -102
3499 -102 -51 -28 -67 -199 125 17 -102 23 11 95 8 108 -91 52 84 -9 59 -1 122 54 21 59 -31 -173 -57
3524 -57 34 42 24 30 -84 -46 -49 122 -3 16 -52 18 -21 -85 -140 52 -88 -45 -76 -15 -125 29 70 43 -24 -105 38 33
3552 33 -71 -31 45 -14 1 26 -56 23 -3 -135 -141 -24 103 37 124 98 -26 -13 -22 -5 -80 93 70 -97 -145 15 -93
3579 -93 49 33 -98 102 -71 -73 -120 -6 -178 -43 61 -41 -48 28 -2 52 39 35 -113 -56 -9 126 72 -61 147
3604 147 153 11 -22 9 125 19 86 58 10 12 42 64 24 69 138 -2 198 44 27 -30 -98 -96 -88 -86 -52 61 103 163 -123
3633 -123 -91 -122 84 1 -77 -77 -13 36 -35 129 -10 25 -53 -89 -12 75 -77 117 96 -65 154 -15 -10 71 -116 -75
3659g5O8J5J79j00r1m5N9O4j59J17kj1K3Q9j66j7M7J22N1k82J90m0J07r8o0P5
3685F0j81J48M7j67J42Mm4N0n5j1P4jj40J99j30q4P0j4J45q9K2k6m7Qj54K91j24
3712gj12K56j95jrL5J19j98j9J7J34j11M4J63j16O0p8J08o8o3l9J03R2o4j66K27
3738A12J0m3q7j54K38p5n8J58j91J92j22M0nJ30o1j39Q8J3r1J34j55q4R7J78m7
3763G8l6m4j12L01l36Q1L4J30j33J7N3P6p2M9j92M9J18j4J14k63O9l7rJ20m4j56
3789a59K2J57MN3j92M2P6K62l40P2L6L2k59J91j13M4k1J05N2M4o2m7q4R4j06J42
3815D5j31j04K51j71J01J65j55K6k67L1J22J13o4P2r5OJ01k25J94J1K2n6M2n4
3839b0P6q4n0N4K7J75j17j17Q3j70K20p5J11r2k6J9np4P0k0N9j1K8n6q4K9R3m3
$$ plain form
3659 -75 -7 8 187 87 -4 -49 10 74 -85 32 30 19 42 131 -35 -52 -5 117 168 -114 76 36 143 45 -15 60
3685 60 -121 27 74 -93 49 53 9 59 4 -7 67 66 -74 125 -5 -89 -19 -33 112 23 45 19 -28 -20 -174 117 -7
3712 -7 -119 137 -58 -59 -68 -33 86 -112 -131 -114 20 -91 -47 116 0 60 -18 90 22 -41 -80 23 115 51 -115 112
3738 112 122 79 -8 -162 76 1 -57 101 -90 102 -20 20 15 145 84 -55 33 46 -45 89 -66 -150 -53 125 78
3763 78 42 -2 -114 187 -149 -68 -34 96 -37 -20 33 109 37 86 -106 -57 61 47 161 -102 -33 -70 -79 41 -3 -159
3789 -159 -137 20 24 77 -115 -73 3 265 -75 -3 33 65 -194 -3 -116 -72 -93 12 64 108 46 -1 -85 9 -97 45
3815 45 -86 -190 61 -110 -9 156 1 27 -240 -209 -87 26 -38 34 -61 -55 46 -179 15 26 48 -8 34 -20
3839 -20 56 -28 -78 -24 3 178 61 -56 27 -143 77 2 113 21 -5 14 9 -65 5 -15 44 33 61 5 -79 -50 43 0
3867@n1J3l2P5K3k07K59j64Q3j2j07J63l1J3l7m0J01j26N4J29n1j04K8Qj71K07
3893B3J14j42L9p8O4N2o4K9K5r2n4P7j72P4K71j35j77J35j21J89k12R6j0M4q2
3918a07pQ8j22J61q2O0Q6p0K4k21J13J10r3L2o2J09J09j54oJ8j10Q4J15j16J33
3943I2j22o0R4P8j12p5R8J24r1k11J86j13J37l2M0l3j70J31N0ON5Q8j42j36R8
3968b0k2N5k4p6J00J33j43K39k41J30K0j49M1o5N4m1J0N3o0j1N0n8J70k41J38
3993D2l5L4L3p5J9M0P9j60J05l8j48J02lJ00j27J27j24K51j75j19M1m8J79j30
4017c0K5L8J8L2j47K7j49K84j41p0J91k15K70k49Q1p1pMJ22j57K15k58L07j08
4041A2Q5k45N2J89r2k38J76P1J27j01L2n1J68k43LK40j94J94j94M2O2j98Q3O8
$$ plain form
3867 0 -51 -38 -70 5 28 -179 80 -84 -1 -13 -120 43 12 25 -12 -52 49 -77 -23 106 55 -49 -21 -13 -184 23
3893 23 137 -5 34 -44 20 72 8 37 62 -30 -84 -7 -179 -105 166 31 -146 -11 -132 57 -155 -59 -69 -25 -107
3918 -107 -114 -26 -148 13 -69 -9 77 7 31 -190 -77 33 -60 -28 -90 19 128 -26 -32 -14 -124 -40 75 -41 92
3943 92 -30 -90 4 82 -30 -105 -7 117 26 -185 1 -112 25 -7 33 0 -170 -39 11 17 72 160 18 -118 -20
3968 -20 -42 13 -11 -87 13 146 3 242 1 131 151 2 43 -22 32 -9 1 54 -6 -17 33 -25 145 -96 42
3993 42 7 41 74 -1 18 58 137 -23 82 44 -104 -2 -5 95 -32 95 -29 222 47 -72 -31 -79 100 -30
4017 -30 -5 33 51 83 -64 -37 -186 98 -43 -113 78 -137 133 -116 -35 -106 -113 -109 13 -144 71 -187 120 12
4041 12 97 -148 -96 93 1 -237 -61 10 137 36 68 17 185 -58 -55 185 -9 185 -9 33 95 -103 -20 48
4065D8j15j3P6P2j40l5K02n0n0l1j1N0q5O4pm8k2L9j14N6J47q6O7j11J04l8J41
4092A10r5j05J25m1p5jM7R0n9j01O4R6j13J48J5k18m0K97p9j29R9k7O9q7M1m2
4118a1J5o7J18J30j68o5K02p9j02M3J6K9j26j5R1o4%n7k5J75k1m4N8n9O2j23M1
4145d6K4P6O6j17R1n3K5j47J95j04mL1r1N0j25N5J41l4P2J8j53L4j9J9J1L6j01
4172e0J73k39n7q1L26j59R4N7q5rR1j82J11J1l4Q6q5k2K2J6K13k21j87K57r8J53
4198A01r1n4n7R3j9K3m7R2j07N1J32j07R9j19q8j2K63k64kP3j23K45j35K49j26
4223G0o%M3j42j55L07n2j02K39k10q4J40P5J35k88O9K0j9k3M8k1j60J44J98k07
4248A9q6Q3J83k00kl8r3J63r0K34k27N7j13J23K4j60J33r5J18l7k7m4k5M4J16
$$ plain form
4065 48 -67 -80 -4 68 -72 -107 95 45 -5 -36 -47 3 -82 -18 -25 -73 -95 -56 -170 -114 33 -53 14 -97 7 -31 110
4092 110 15 -90 35 -6 -81 -82 -35 55 -4 -105 -41 55 -58 90 105 -113 -153 144 65 -64 35 8 77 -10 31 -11
4118 -11 4 -63 55 185 17 -48 154 75 -27 16 32 61 -65 -80 11 -53 -53 -110 -135 40 19 -25 33 -26 36 -87 -46
4145 -46 -22 54 120 3 94 41 66 -81 114 10 6 37 -54 -4 -129 -74 67 33 105 123 -30 4 -15 4 15 51 -50
4172 -50 123 -116 -173 -254 72 -87 7 64 -21 -30 61 -121 -10 1 -33 53 -32 -54 -32 -16 197 -24 -211 46 -52 101
4198 101 10 -44 -101 -8 -27 -4 -51 41 -66 -15 117 10 109 -10 -98 -110 153 -111 -113 -40 -163 82 -53 196 70
4223 70 64 64 107 -35 -190 117 65 -37 202 -8 -92 48 123 258 -30 39 59 40 17 65 44 -116 28 226 19
4248 19 -67 16 199 -1 -3 -41 -134 29 -61 173 -54 3 -110 13 37 -123 10 -85 33 -4 -31 -75 -100 -56 60
4273F0K3j94K04p7k2K2lJ7J40j62j07J43j15K7n7Q5j29K84j84j14L93j79K9o2
4297B2PM0oJ3j88O2N1m7J06J56o0j84J1J27j87J08p3J44l6J8j25J63j31l6j1r8
4323a54R2J25j37J34l1q1J83o0q0P8k14K18p5n6n7O9J33q5l2o3J53p2K10j29K
4348G1q6j14L7K83j22p6p0J1j9J07p5l6N9J07o4l1L5o2p2J79k3j23j88J28J60
4373A6K0l6j0M0r2J31j46L6J69r1r0J95k7j33j39K88k22J82m1j58J83J8j52L1
4397b8P4j5o2l7K12j15j44Q8j70J47P6K2NJ9q2N0j26J11j66J88n2M0N3j6j10o8
4423a06J27j15J63J6l01K83p3J04l3k15J59l9k8K27j68L3o8J67q7n2J44k07J41
4446G2r5K0K6j93J84j2J2j10MJ24n1k3J35q7N5K7q2r5J15k48K07J30j59M2R0k
$$ plain form
4273 60 83 -111 93 16 -6 16 13 30 170 8 -99 44 -71 -44 -101 -16 -145 139 -45 -159 234 55 84 22
4297 22 29 69 63 76 -112 -50 1 -46 60 216 156 -28 -17 110 -77 31 -42 102 66 84 -41 122 -9 -45 -56 -154
4323 -154 -62 63 -74 60 29 -52 131 71 -9 69 -145 73 -2 -58 -115 -46 87 2 -30 -93 60 -12 198 69 71
4348 71 -15 -129 -92 191 69 -7 -77 -66 -85 22 -53 -89 -30 77 13 -18 17 -45 -117 62 39 -84 -272 -144 16
4373 16 36 0 -10 30 -62 69 -77 -41 128 37 -53 142 115 -18 -157 131 -91 91 50 -108 75 93 -59 -28
4397 -28 46 31 -31 -68 144 29 -115 -27 -197 -50 26 48 53 72 -10 40 -86 25 -141 47 -5 35 88 72 -38 -106
4423 -106 21 -94 69 85 -216 67 -6 98 65 -150 9 -30 -58 169 1 34 -34 133 46 -6 138 -69 72
4446 72 -23 -3 23 -170 14 2 14 -96 -92 32 -19 -42 93 6 61 88 6 -89 26 -222 -15 115 -44 -2 88 86
4472H6j04Q0j07j1L2Q4n5j15K65j39Q0j1j79Q1j03L8R5j38N3Q4o5o1L4Q3M1j74
4498a26J4J42r3P9q0j0Q7n2J41k25J49M7j80J58n2Q7k31J33n2J04j0j6QM8l5j0
4524B5J5l4K3J07k60K10K7k87R4J32j14J10r3j46P6p1J79J45q7j69K17n9p1K9
4548bJ43j83K28j41o3J40m3q5P9j26n3J99r0p9N5j16J46J2r0O4l9K7k9M5J18j14
4574CJ3p2lr6J48j7J37q6q0P7m9K5M9o1KP1p1O9m0M0j28M0M1J30j00n7n3L0l2
4603g0M3LJ34k2J1j30J01Op5K5n3mR9j63P2J26M9j94j46J33K67k27Kq2m0J53%
4630A8k6q2J45l2J23k42J93J38k70Q3p0r1m4K74j30p2N8P3K9j07K7rK4L2r0N4
4656FO3j60M7J11j74nN3L9Pl1J3J14q5L4j54L4O5j4PL3o9N4m4J95m9r0q9rK46
$$ plain form
4472 86 -18 62 -45 -56 -24 60 5 -110 155 16 96 85 -94 -13 -116 -78 17 -121 -68 16 -49 -110 -76 7 48 -126
4498 -126 -112 30 -63 16 -64 -74 13 -39 102 -123 26 73 -107 51 -1 86 -145 -12 -64 40 30 14 22 70 35 25
4524 25 40 6 29 136 -124 86 113 -174 -80 52 -62 48 -45 -191 -115 -186 -7 138 51 -118 99 40 -31 -2
4548 -2 141 -42 186 45 -18 122 79 -6 73 -53 -106 93 3 -76 -21 -137 9 21 -69 -5 -44 -17 -46 -1 117 3
4574 3 16 -56 -59 -155 -7 -24 113 27 -53 24 -25 0 49 -12 -10 61 -10 59 19 59 -69 -29 12 142 42 -15 -68 -38 -70
4603 -70 -27 -24 110 88 99 -31 70 76 1 26 -27 -31 68 -95 -23 103 152 -42 -188 -55 212 -15 -13 -95 -135 18 18
4630 18 -8 -90 55 23 146 -96 97 235 -35 48 -22 -113 -157 117 -13 -85 -27 46 75 -32 -5 -14 10 42 -48 6
4656 6 69 -91 -44 67 -107 -112 -59 -20 -13 -44 -31 83 -2 32 -122 -88 -23 -37 -30 3 -66 -12 -56 139 90 0 -89 -98 148
4685A48m8K8j10L0J20j24j22r0K37l8o6o2L4l9L2O2P6o4p1Q8R8j45R3o1%j0J65
4712A61k35R4q0J61j30J62o3L1o5m6m9l4J51j65K39j32P6k00J51J6J21P0k13j30
4736a09JK55l9j13NJ0J1p7J09p1J17n4N2k3q0m7R5r6J15j68R7k89M06l07J63L4
4762cJ3m2N6Jr0R3j94K79p5Jn9o5l9J06J35j97N1J30q8P0o4k4R8Pm8n2M4j27P9
4791dK5R4j30L9O3o6j19J2K03p9o1Jl1Q6j2J38j21m4l8N0j28J68j00J6M5qp1m1
4819a13J05M7J00n4r0R1o7P9l7o1o2P0M6j46J28m7n4N7L7p8P1nO4j58l5M6J84
4846A18j21J36j33J55j43kj16J15oK05j80l4%K5L4L6j41r6J40j3l6M5K1j29J83
4871F3L7j11J1m1j10J58l0J83k06J1J7j4P5q5J23n7k37K87j07L9J13p5J7m3j74
$$ plain form
4685 148 100 128 18 48 168 44 -78 -168 69 31 -35 -97 -63 -102 -70 -8 68 4 -67 21 119 -26 67 6 6 -4 161
4712 161 -74 20 -60 101 -29 133 70 101 36 -10 -59 -93 58 -107 132 0 76 -124 27 43 164 234 21 -109
4736 -109 -108 147 108 -5 0 10 21 -56 53 -18 99 45 97 74 -6 -53 42 -54 61 -107 -10 -299 107 -200 -37 -3
4762 -3 10 -32 24 25 -65 28 -166 113 38 39 -20 -85 -124 -18 117 -80 -29 101 13 83 19 -5 93 100 52 0 44 -83 -4
4791 -4 21 115 -15 24 87 21 -98 -86 117 38 -23 -22 -53 33 21 159 38 -6 -44 6 -122 46 -54 -38 7 -1 -72 -113
4819 -113 -8 39 139 85 -5 86 19 98 61 0 -62 8 54 -92 36 -11 -65 -8 29 -49 22 17 81 -77 -112 -66 118
4846 118 -3 133 0 155 12 10 -106 9 3 208 28 -6 -6 19 53 89 -52 -148 -8 -21 -57 -12 9 -120 63
4871 63 100 -11 0 -41 -151 7 -23 160 -46 -35 -18 -32 43 -42 81 24 -213 74 -33 6 119 44 61 18 -156
4896a56J01m5J35r1q5J58n8N1j4J2j02k4J3J93r4p9L5o5K23j70P0o0O8j4P4j31
4922e5LNP5j0j50J62l0n8K08l05K03M2k56P5K11j48J13m2r0O3N4j89l9J24J09
4947G5j2OK4p0K5k4j1J07k29J91m8M5k7j1R8k69K50k08R2j05J18j1J2j06k8N0
4973f6J6Q1k8n6%n2J39n1N2j01M1J56j34L6J1M2l1O5k20L6k3N2J14p9J45j40j03
5000i8Q7pr6Q7N9l9q3l0K12o2K1J3j01L9L5N0m2k02J34J2k3L8j83P9J67J7j54
5027g0JK28j95N7O0j52JJ53r9K2m7J64q0n7P4K7Jl4n2Q9l05K65m8N9j60K59j50
5054A1p8J24l9l1j28J90J64k23L5j42%J42Qq6J3J49l9j42O8M3r5O3J0q3J45J1
5080I0p0n0j53K39J17j24j19J26r2J13k52J13m5J0K12k09J25r5K01o7l3j07J45
$$ plain form
4896 -156 -55 -100 35 -56 -141 17 -41 10 -4 8 -94 -118 -105 88 -6 -85 -50 -115 108 -62 8 -52 16 2 76 -55
4922 -55 -52 -47 28 18 -132 30 0 -58 150 -155 48 90 -166 -91 120 -28 85 43 -47 16 70 -119 -158 -34 75
4947 75 63 69 93 23 48 24 13 120 -109 82 34 79 52 41 139 -130 120 -88 4 -101 17 6 18 -88 -116 -66
4973 -66 -50 31 3 -53 -53 -105 34 -17 35 -66 -25 131 -3 33 44 86 55 120 -100 -64 -87 -35 79 0 145 5 -98
5000 -98 -11 -18 -114 -27 32 -7 -90 -120 92 30 51 64 -37 2 37 87 45 -157 -23 -11 -34 4 -179 -100 67 84 -70
5027 -70 -69 159 -36 21 81 -71 -70 83 -16 6 -41 123 43 -14 60 87 88 54 2 91 -214 51 3 62 -98 161 11
5054 11 -67 57 18 -13 -141 49 213 -10 25 -117 -117 25 33 -53 -40 109 70 -72 -4 39 -56 7 17 -66 79 90
5080 90 20 -30 -183 56 173 49 -70 56 -36 77 -175 -62 -107 -97 115 -94 31 -64 137 70 37 -70 75
5103G5j6p1n4R9k8O3j56K77j38j4j02J27j49k8Q8J35k24K52r6l1n3j8J03r4J64
5128A11j64k3N4O6p8J6R2m1M7m4J40p2j62l4K51j19j38p0J09K67l05jK28m4m3
5153D3m5l5kJ36k13P3Q8J3j59J54j18k5K41o8n8M5j08j91K58L8k08m6L2K42k23
5178a36J0K16j20J26j45Q4J86k08nq0K1K2Oo5Q1n6LM8o7Q8J8l3m3K3J21j47O1
5205IN0j85J3J91l3k1k0j21J46j39P7k4J38o5O1j82j4J28j84J40qJ05o5L1J00
5230A28q1R4p2j57O1O6n0n0Q3K9j32J16J21r9j38J5j28L22k00p2R5J54j39r8J24
5255hjp0J04k2O0j36J18LJ54k28k3Q4l7j12K00j66M6J53l5n1m7J4P9j56n5R2N9
5282A9o5N5j07J9J65l8k1l9L2p5L2o9R4Oqj19k9K25p8p0M8j3k0J06j91J73j12
$$ plain form
5103 75 59 -12 -66 33 5 68 -88 189 51 37 -65 62 -87 -115 -27 108 -116 136 40 9 -44 -62 41 -53 111
5128 111 -53 -76 -22 44 -34 -18 74 33 80 36 176 104 -58 -92 159 40 -98 -168 -59 208 -97 -98 130 86 43
5153 43 -2 -37 -39 97 -116 -43 45 58 -101 53 -65 -90 151 83 25 70 -38 -229 29 67 -141 -187 -155 87 -136
5178 -136 -126 90 -30 96 -49 35 221 13 8 -72 -51 -29 -23 -88 -7 -63 -60 -12 -79 9 27 -6 -49 -26 95 -52 9
5205 9 59 -126 -113 78 45 24 4 -117 29 -110 -33 -57 81 16 77 -105 -119 9 -175 -35 -43 62 -3 28 128
5230 128 47 141 69 -88 -27 39 -11 -61 22 51 -81 35 156 57 -81 -66 -194 128 -72 -144 -49 105 -34 -132 -8
5255 -8 -9 -79 25 3 63 -73 45 48 202 -26 -49 35 -2 -114 86 -80 -34 119 84 33 -14 0 79 -77 -132 -40 19
5282 19 -46 9 -98 -79 86 48 27 -12 20 -55 -23 -92 2 8 0 -119 -148 77 -1 -71 -23 -36 -56 50 -141 32 -80
5309h0J34oL0j76O9L9j23K19j24k1p6J6O1J5j16K37j06j27R5O0%M1r6K0p4P8q
5336a9m7O4J4Q7l36K16j7j25K40l4j08M0%O7q8o4J6K74k63J64n9m1J08j51j04
5361a66J54J65r1l7j39p5K56j15m9J35k6r9J31r9J73j85m8K00j48N7l4K30j56
5384C4N0rj00l6K02k02J1L0J86j34m9m8n4J17j0N9j1m2Q3r9p9K10k6r5M9m8N4
5411D3j0R8j88J78j61L5O5j14J48j82J50j20j26J87K0j46J05J28Jl03L20p5j65
5434a12N5J7LJ63l4m0k06J53J5kk5J0Q6k4l5Ll8M3j53J83j85M4J03J14j79J07
5460F6j6qr8L7j78M7J26p9J14l2q7J68M7m2l6N5Oj24L2n8O3p3J19l0n5J40j24
5487b0P4l4pl1l7k2K2O7Lo4M1k0MJ0J00N5j62K00k48J86j66L9P0M0k42J38N4k24
$$ plain form
5309 -80 54 48 78 -98 -29 10 -113 106 -18 -39 -115 -99 -38 -23 -139 98 -8 -135 -40 20 20 61 -35 -15 -89 -11 -19
5336 -19 -66 -2 12 99 -237 -21 -38 -163 77 43 -65 -25 -25 42 -46 -110 -94 180 -83 81 22 -19 89 -62 -166
5361 -166 -12 153 62 25 -114 -189 67 -48 -97 38 12 -87 44 -55 118 -67 -115 85 -63 -6 -40 190 34
5384 34 84 75 -25 -61 141 -61 -50 -20 166 32 -17 -65 -119 -2 -12 47 36 -6 77 -22 -101 109 83 -12 37 -11 43
5411 43 33 131 -57 121 -40 -5 60 -54 94 -88 62 -58 -184 3 23 -123 -18 110 111 -192 128 53 -112
5434 -112 -57 -40 -37 126 92 52 -154 -1 14 12 -13 -3 83 59 24 27 -11 32 -121 62 -123 -79 24 138 -41 66
5460 66 50 42 -56 -19 -197 -150 -24 -103 11 -21 -108 60 107 65 29 84 90 -34 -2 -60 3 -70 49 19 -36 104 -20
5487 -20 54 20 13 -18 -55 -77 -55 12 15 -49 -8 -28 -24 -14 86 141 -21 179 -69 117 -49 -10 60 100 -142 -4 50 -174
5515a74oK44O7j11K9k8L3L5n1O8l2l2P2j16o2J39k03J70l7K3MM4j36O8p3o0J08
5542a7O2j43M1K8l2R1j34Q2R3m1n9O6J16j79Q3R1j52J40j60J10j11N6j67K15k69
5567a90J69p4R7q7J21pJ48j61j65J41k6j9o9J51k31Q0R7p2J60p3J6Ll3k1J51p1
5593C5r4J16kP1j32J1J01q4N6r1O3k0r5P7M2m4l9q7J31j00%nJ11O1J0j19mJ24
5621I3j70J55o9N2j37M3j07Q3N1p8J59L8j42n7N6p6L1l4J34N3j39J49j46m8J61
5646E5j04L7J88k74J65l4R9j83J20r4r8J92j15R6m3J24l14J32J7N4Q6J14l61P9
5670f2NJ04j8o4J56j83m8LL5N5l1P7l4RM7m3m3J9l7r1K20j18j98J93J56o3M1n9
5698B8q5O4p8J36J31l35K10j28J32KN9p4j14J92j03r8J77l17L28j53Q2j10J20
$$ plain form
5515 -174 -180 64 131 20 49 21 54 89 38 106 74 42 114 -2 -64 75 -128 42 5 28 32 76 -60 8 -65 -125 -17
5542 -17 45 -98 -57 -29 -61 30 -104 -22 71 30 -29 37 153 -26 57 148 -4 136 -24 86 -25 31 -136 79 -190
5567 -190 -21 -95 2 -85 36 29 177 16 -149 -8 -34 -53 -122 29 -202 -122 -25 -97 63 -10 6 9 -24 -45 106 35
5593 35 -59 57 55 126 -6 5 106 22 78 -13 50 30 -65 12 54 10 -29 -116 15 -85 -85 -90 21 82 92 -27 -31 93
5621 93 -77 78 9 61 -76 -33 -140 -57 -6 -84 75 113 -29 -86 -30 -106 -75 -109 25 78 -61 88 -58 -106 55
5646 55 -49 -12 176 -98 67 33 132 -51 69 -25 -123 69 -46 50 7 131 -183 -51 -34 20 106 220 -141 -62
5670 -62 -57 47 29 -35 121 -62 -110 -107 -72 -17 -48 29 -5 4 51 8 -35 -16 -53 -144 76 -42 -240 -47 109 46 87 28
5698 28 -57 7 -71 65 196 -139 71 -57 75 77 136 62 -52 140 37 -61 116 -201 127 -26 56 -54 66
5721F6Kq3k5J12j44j39J62P2L9j39J17n1J03N0o9k0p0pP2j51P3J03o7j3M3M8r9
5748a5k0m2J80j09Q6N7k10N0o0J01J03k45K11r3P5j13Q2p9O5l4j06O8N7J8m5k6
5774d4K1J2m2r2q3R1P5J76j32p3J21R5j83p2J28N6L8j34j25j4K38j62n9R8N8j
5800iR9k0j99K65p4q5p3j60L57j94J24P6r3q1M4J04r3Q2j5j76J6J8J07j41N0J17
5826D6lk39K12J14j97L7J6k7q1O6N3o2K5J21r7j0l2J29k7j07p5J04J29j08rN7
5852C5l0m5K2l2O3LOL7J3j71J20K4p9J19Q3k83K58k65J13J58n3j04O9k27J29j3
5878e0k2J38k64K32k16K30j8o1P5m0J4K0p3M5kk5n6M9J4l3J04q0M0J32j63R5j40
5905e5J9J40M4m7r2K3j25J78j62l2mJ60m1k4J9rJ2j3J5J63o1p2Q1j80M5O1r1P5
$$ plain form
5721 66 68 -15 -40 72 -72 -211 -49 23 62 -77 40 -11 92 142 73 53 -17 -24 48 -103 -30 73 6 -7 36 84 -15
5748 -15 -35 -77 103 -6 80 137 -73 -23 -83 18 121 -124 87 -6 69 -44 38 -41 24 -10 -116 -48 9 27 -18 -44
5774 -44 -23 -11 -53 -145 -228 -137 -62 114 -18 -91 30 125 -58 -130 -2 54 92 -42 -167 -181 57 -105 -164 -66 -8 -9
5800 -9 90 70 -129 136 62 -23 -96 -256 101 -93 31 107 14 -67 -23 81 -12 70 55 -121 -105 -87 20 -121 -71 46
5826 46 43 -196 16 130 -67 -30 -14 -41 -122 -56 -3 -65 -40 81 -16 -26 -58 71 44 -63 -138 -34 95 -13 -22 35
5852 35 5 -40 -18 -50 13 16 22 59 72 -99 21 45 -34 85 168 -115 143 -122 -9 149 96 -8 61 -166 -37 -50
5878 -50 -72 66 -198 34 -182 48 30 -31 44 4 18 38 -35 10 8 -17 -73 -24 -10 -43 61 -19 21 153 -10 85 -55
5905 -55 -36 104 148 101 9 32 -93 85 -77 -109 -113 47 6 -18 1 -8 4 -9 6 169 108 36 117 -63 -18 43 -48 27
5933B7p4R2j81k0K04j04J03k81K05p1mPK9J00n6K7r4m1J07Q8M3R3j30j9q1K22
5959A91j37j1K5n4k28K15O9m9n9M8J08r6J2m3L7M8k38J58m4P4jR6j2k14J14rm4
5986d4J17o3q5J13r7N3J75n9J2k9r3R6p4Q0j61N5r5J14o4J94m2j40J1j03K69k2
6012A18j14n1K9q7Q0N6m9q8N1N7R1j9op5m8R5P1n1l7M7j08J07j00J97k21K39j18
6039F6M0r8j5o7m7J6J70L3j86P4k3J41p5JN5j57j28J70M3r1J71k31J91j2L3q4
6065a0M8n6r7J32l0J81k33p8K60r6m4K3P9j9p3K1p1J38k28J31j11J19M6K1RQ3
6091A45p1j77J21k8n1J41o7j0m5R4j87J65k65J00PO0J78k12J69L6j55P3p9N1K12
6116B05l06O3J00M9j1r0J03l6p7j25J53p4R4r1j02K1J34j61M7J12J0Q4r5O5P3
$$ plain form
5933 27 -47 45 -136 -156 48 -56 47 -234 -29 -100 -104 -97 -68 32 -24 3 -91 -132 -25 63 106 199 69 50 -31 191
5959 191 54 43 68 14 -214 1 70 21 -38 10 118 22 34 -9 28 76 -162 -4 -48 26 25 121 109 -105 9 0 -44
5986 -44 73 10 -75 38 -59 -6 169 110 122 93 0 96 22 102 -59 -4 -99 15 -49 145 103 -37 -26 -129 140 118
6012 118 4 -47 -18 -105 -25 31 -18 -106 -55 2 93 74 68 -7 -55 40 111 60 23 70 -38 69 -31 166 -55 184 66
6039 66 106 8 -7 -74 -121 -105 65 98 -88 -14 -37 104 29 30 85 -72 -200 -30 13 -78 93 -138 53 41 74 -10
6065 -10 38 -18 -115 17 -13 168 -65 -143 117 21 -23 0 79 60 -13 8 -63 75 -153 -22 -133 -14 32 53 62 145
6091 145 74 -103 18 -10 -61 80 13 3 -42 52 -135 30 -235 -135 -128 -68 110 -102 67 103 -52 21 -58 -7 205
6116 205 -101 -38 62 111 100 10 113 77 0 -125 28 -46 48 -43 -145 -124 10 -151 -104 8 18 102 7 72 145
6141A45k67J39j42l0J75MR0j43J78p9q0O6p4M8j3n6q7P0Q5p8Q2j7m9O0p2P8j18
6168h5M4ML0n9O6p1j8Q3p9j05R5K1L4Q5o2M7r0l9J51K4MJ44j79J8K4j16N2j04
6196h1J14p2k6j2R9l8K6N6P2j89M9QJ40j56n8N3j64J61j1QQ9o3J43j18k7M2m2
6223CQ4l6l7l8m2Q3J5J3J50k07R2r6P7j5p3k7M4M5k9k3J02k7j47j3j4J39PM0N0
6252A20p6j0j56P2J24m1Q2Nq0j08J53r4j2J02J3k12J23P8N4k59K23j17j1N9j00
6277f8q8K31p6o8J78q1j3q8R7P2n0m7M6j4M7j32r5K93K5l53R7J38O9j52q9M8O3
$$ plain form
6141 145 -122 17 -125 -155 20 24 114 -29 149 70 -10 56 -18 30 17 -39 -126 -56 29 -49 33 16 -33 27 -45 33 -85
6168 -85 -41 -37 -7 -66 0 -71 -89 -6 -85 -190 -95 -74 -40 45 -17 30 -60 -99 52 76 80 224 45 63 87 -29 23 -81
6196 -81 33 -39 -65 -77 22 -16 10 66 138 -51 -2 6 146 -10 -68 -15 -179 -18 -29 -21 68 5 148 30 3 45 3
6223 3 87 51 14 -24 -66 17 32 45 195 -12 80 -16 61 46 -27 -54 -10 35 6 -17 85 58 -89 -102 -116 23 30 70 120
6252 120 44 34 -122 -50 74 33 115 120 40 -68 85 -9 -21 81 94 -118 5 83 137 -122 101 -16 -27 32 -68
6277 -68 -156 75 -1 -69 109 28 15 -73 24 96 46 -1 45 31 78 -54 -149 144 169 -184 -87 51 120 -32 -121 -73 -10
$$ [...]
8191a03
##END NTUPLES=NMR FID
##END=
