##TITLE=1H_LY-20ix.24.R.t
 CD3CN,8 sc, 
 3.03.2021
##JCAMPDX= 6.0         $$ Bruker NMR JCAMP-DX V2.0
##DATA TYPE= NMR FID
##DATA CLASS= NTUPLES
##ORIGIN= UXNMR, Bruker Analytische Messtechnik GmbH
##OWNER= root
$$ XWIN-NMR		Version 3.5
$$ Wed Mar  3 10:47:50 2021 Russian Standard Time (UT+4h)  she@DPX200
##.OBSERVE FREQUENCY= 200.1315066352
##.OBSERVE NUCLEUS= ^1H
##.DELAY= (6, 6)
##.ACQUISITION MODE= SIMULTANEOUS
##.ACQUISITION SCHEME= undefined
##.AVERAGES= 8
##.DIGITISER RES= 18
##SPECTROMETER/DATA SYSTEM= spect
##.PULSE SEQUENCE= zg30
##.SOLVENT NAME= CD3CN
##.SHIFT REFERENCE= (INTERNAL, CD3CN, 0, 15.7039)
##AUDIT TRAIL= $$ (NUMBER, WHEN, WHO, WHERE, WHAT)
$$ ##TITLE= Audit trail, XWIN-NMR		Version 3.5
$$ ##JCAMPDX= 5.01
$$ ##ORIGIN= Bruker BioSpin GmbH
$$ ##OWNER= she
$$ F:/spectra/data/she/nmr/H-F/1/audita.txt
$$ ##AUDIT TRAIL=  $$ (NUMBER, WHEN, WHO, WHERE, WHAT)
(   1,<2021-03-03 10:46:48.40 +0400>,<she>,<DPX200>,
      <created by zg, POWCHK disabled, PULCHK disabled
       configuration hash MD5:
       00 E9 B6 7A A2 85 ED C7 34 08 36 98 17 FE 4E 26
       data hash MD5: 16K
       6B 82 5C 1D 40 14 B8 00 F2 85 57 8A C0 AB E5 F2>)
$$ ##END=
$$ 
$$ hash MD5
$$ C9 14 C3 F7 4C 9F 79 3D A3 A2 FC B6 22 00 DC 83
##$RELAX= 
##$RELAX= 
##$RELAX= 
##$RELAX= 
##$RELAX= 
##$RELAX= 
$$ Bruker specific parameters
$$ --------------------------
##$DU= <F:/spectra>
##$EXPNO= 1
##$NAME= <H-F>
##$PROCNO= 1
##$TYPE= <nmr>
##$USER= <she>
##$AMP= (0..31)
100 100 100 100 100 100 100 100 100 100 100 100 100 100 100 100 100 100 
100 100 100 100 100 100 100 100 100 100 100 100 100 100 
##$AQSEQ= 0
##$AQ_mod= 1
##$AUNM= <au_zg>
##$AUTOPOS= <>
##$BF1= 200.13
##$BF2= 200.13
##$BF3= 200.13
##$BF4= 200.13
##$BF5= 200.13
##$BF6= 200.13
##$BF7= 200.13
##$BF8= 200.13
##$BYTORDA= 1
##$CFDGTYP= 0
##$CFRGTYP= 5
##$CHEMSTR= <none>
##$CNST= (0..31)
1 1 145 1 1 1 1 1 1 1 1 1 1 1 1 1 1 1 1 1 1 1 1 1 1 1 1 1 1 1 1 1 
##$CPDPRG= <>
##$CPDPRG1= <>
##$CPDPRG2= <>
##$CPDPRG3= <>
##$CPDPRG4= <mlev>
##$CPDPRG5= <mlev>
##$CPDPRG6= <mlev>
##$CPDPRG7= <mlev>
##$CPDPRG8= <mlev>
##$CPDPRGB= <>
##$CPDPRGT= <>
##$D= (0..31)
0 1.2 0 0 0 0 0 0 0 0.06 0 0.03 0 0 0 0 0.0002 0 0 0 0 0 0 0 0 0 0 0 0 
0 0 0 
##$DATE= 1614754007
##$DBL= (0..7)
120 120 120 120 120 120 120 120 
##$DBP= (0..7)
150 150 150 150 150 150 150 150 
##$DBP07= 0
##$DBPNAM0= <>
##$DBPNAM1= <>
##$DBPNAM2= <>
##$DBPNAM3= <>
##$DBPNAM4= <>
##$DBPNAM5= <>
##$DBPNAM6= <>
##$DBPNAM7= <>
##$DBPOAL= (0..7)
0.5 0.5 0.5 0.5 0.5 0.5 0.5 0.5 
##$DBPOFFS= (0..7)
0 0 0 0 0 0 0 0 
##$DE= 6
##$DECBNUC= <off>
##$DECIM= 32
##$DECNUC= <off>
##$DECSTAT= 4
##$DIGMOD= 1
##$DIGTYP= 9
##$DL= (0..7)
0 120 120 120 120 120 120 120 
##$DP= (0..7)
150 150 150 150 150 150 150 150 
##$DP07= 0
##$DPNAME0= <>
##$DPNAME1= <>
##$DPNAME2= <>
##$DPNAME3= <>
##$DPNAME4= <>
##$DPNAME5= <>
##$DPNAME6= <>
##$DPNAME7= <>
##$DPOAL= (0..7)
0.5 0.5 0.5 0.5 0.5 0.5 0.5 0.5 
##$DPOFFS= (0..7)
0 0 0 0 0 0 0 0 
##$DQDMODE= 0
##$DR= 18
##$DS= 0
$$ [...]
##$SUBNAM2= <"">
##$SUBNAM3= <"">
##$SUBNAM4= <"">
##$SUBNAM5= <"">
##$SUBNAM6= <"">
##$SUBNAM7= <"">
##$SUBNAM8= <"">
##$SUBNAM9= <"">
##$SW= 16.9725356469052
##$SWIBOX= (0..15)
0 0 2 0 0 0 0 0 0 0 0 0 0 0 0 0 
##$SW_h= 3396.73913043478
##$TD= 16384
##$TD0= 1
##$TE= 0
##$TE2= 300
##$TE3= 300
##$TEG= 300
##$TL= (0..7)
0 120 120 120 120 120 120 120 
##$TP= (0..7)
150 150 150 150 150 150 150 150 
##$TP07= 0
##$TPNAME0= <>
##$TPNAME1= <>
##$TPNAME2= <>
##$TPNAME3= <>
##$TPNAME4= <>
##$TPNAME5= <>
##$TPNAME6= <>
##$TPNAME7= <>
##$TPOAL= (0..7)
0.5 0.5 0.5 0.5 0.5 0.5 0.5 0.5 
##$TPOFFS= (0..7)
0 0 0 0 0 0 0 0 
##$TUNHIN= 0
##$TUNHOUT= 0
##$TUNXOUT= 0
##$USERA1= <user>
##$USERA2= <user>
##$USERA3= <user>
##$USERA4= <user>
##$USERA5= <user>
##$V9= 5
##$VALIST= <valist>
##$VCLIST= <CCCCCCCCCCCCCCC>
##$VD= 0
##$VDLIST= <DDDDDDDDDDDDDDD>
##$VPLIST= <PPPPPPPPPPPPPPP>
##$VTLIST= <TTTTTTTTTTTTTTT>
##$WBST= 1024
##$WBSW= 4
##$XGAIN= (0..3)
0 0 0 0 
##$XL= 0
##$YL= 0
##$YMAX_a= 800966
##$YMIN_a= -757969
##$ZGOPTNS= <>
##$ZL1= 120
##$ZL2= 120
##$ZL3= 120
##$ZL4= 120
##$ABSF1= 10
##$ABSF2= 0
##$ABSG= 5
##$ABSL= 3
##$ALPHA= 0
##$AQORDER= 0
##$ASSFAC= 0
##$ASSFACI= 0
##$ASSFACX= 0
##$ASSWID= 0
##$AUNMP= <proc_1d>
##$AZFE= 0.1
##$AZFW= 0.1
##$BCFW= 1
##$BC_mod= 2
##$BYTORDP= 1
##$COROFFS= 0
##$CY= 11.3945322036743
##$DATMOD= 1
##$DC= 2
##$DFILT= <>
##$DTYPP= 0
##$F1P= 15.9154993809931
##$F2P= -4.1035820241983
##$FCOR= 0.5
##$FTSIZE= 0
##$FT_mod= 4
##$GAMMA= 1
##$GB= 0.15
##$INTBC= 1
##$INTSCL= 1
##$ISEN= 128
##$LB= 0.24
##$LEV0= 0
##$LPBIN= 0
##$MAXI= 10000
##$MC2= 0
##$MEAN= 0
##$ME_mod= 0
##$MI= 1.114404
##$NCOEF= 0
##$NC_proc= 0
##$NLEV= 6
##$NOISF1= 3.799351
##$NOISF2= 2.8
##$NSP= 1
##$NTH_PI= 0
##$NZP= 0
##$OFFSET= 15.70392
##$PC= 1
##$PHC0= -10764
##$PHC1= 12.40094
##$PH_mod= 1
##$PKNL= yes
##$PPARMOD= 0
##$PSCAL= 0
##$PSIGN= 0
##$REVERSE= no
##$SF= 200.130013532006
##$SI= 16384
##$SIGF1= 3
##$SIGF2= 2
##$SINO= 400
##$SIOLD= 16384
##$SREGLST= <1H.CDCl3>
##$SSB= 0
##$STSI= 0
##$STSR= 0
##$SW_p= 3612.71676300578
##$SYMM= 0
##$S_DEV= 0
##$TDeff= 0
##$TDoff= 0
##$TI= <>
##$TILT= no
##$TM1= 0
##$TM2= 0
##$TOPLEV= 0
##$USERP1= <user>
##$USERP2= <user>
##$USERP3= <user>
##$USERP4= <user>
##$USERP5= <user>
##$WDW= 1
##$XDIM= 8192
##$YMAX_p= 0
##$YMIN_p= 0
$$ End of Bruker specific parameters
$$ ---------------------------------
##NTUPLES= NMR FID
##VAR_NAME=  TIME,          FID/REAL,        FID/IMAG
##SYMBOL=    X,             R,               I
##VAR_TYPE=  INDEPENDENT,   DEPENDENT,       DEPENDENT
##VAR_FORM=  AFFN,          ASDF,            ASDF
##VAR_DIM=   8192,          8192,            8192
##UNITS=     SECONDS,       ARBITRARY UNITS, ARBITRARY UNITS
##FACTOR=    0.0002944,     1,               1
##FIRST=     0,             0,               0
##LAST=      2.4114304,     0,               0
##MIN=       0,             -757969,         0
##MAX=       2.4114304,     800966,          0
$$ Real data points
##PAGE= N=1
##DATA TABLE= (X++(R..R)), XYDATA
$$ [...]
$$ plain form
1597 1427 3014 -254 -3018 -506 2691 1076 -1610 -1902 320 1946 493 -2361 -1883 1239 1924 -946
1613 -946 -2798 -459 2404 809 -2220 -1573 1373 1685 -409 -1689 -978 1217 1938 -767 -2259 405
1629 405 2527 468 -1475 -1058 1362 1964 -426 -1684 28 1669 1097 -612 -1541 347 2057 131
1645 131 -1932 -545 1546 1172 -1052 -1255 138 1118 207 -1130 -911 485 1067 -83 -1365 -711 1344
1662 1344 764 -1196 -1009 708 685 -146 -529 -407 518 712 -95 -767 -48 1015 535 -515 -453 687 527
1681 527 -287 -584 177 335 156 14 -278 -175 385 106 -456 -210 249 168 -384 -204 258 129 -284 -178
1701 -178 38 -203 -315 399 56 -169 -154 109 -290 -151 333 -209 -155 414 482 -187 -531 -18 334 180 -543
1722 -543 -149 217 322 187 -380 -139 471 691 -525 -634 274 579 -304 -726 -215 606 496 -236 -441 -108
$$ packed form
1597A427J587l268k764K512L197j615k686k92K222J626j453k854M78L122O85k870
1613i46j852K339K863j595l029O47K946L12k094j280P11K195P21k705j492K664
1629D05K122k059j943M17K420O02k390j258J712J641n72j709r29J888J710j926
1645A31k063J387K091l74k224k03J393R80r11j337K19J396N82j150j282O54K055
1662A344n80j960J87J717k3q31l83J22R25J94q07o72P19J063m80j050O2J140j60
1681E27q14k97P61J58j79j42k92J03N60k79n62K46M59q1n52J80M62j29m13J06
1701a78K16k41j12P14l43k25J5K63l99J39M84n42N4N69O8o69l44N13L52j54p23
1722e43L94L66J05j35n67K41O10K20j216j09R08L05q83m22N11Q21j10p32k05L33
$$ plain form
1742 -108 692 562 -566 -855 388 1192 69 -1094 -308 779 310 -540 -503 -44 785 421 -886 -574
1760 -574 666 1111 -341 -1175 -233 1215 476 -995 -791 387 870 -100 -895 -709 912 862 -499 -1269
1778 -1269 67 1341 471 -1228 -924 697 1116 -28 -1183 -483 1348 854 -605 -1152 353 1651
1794 1651 459 -1437 -718 1014 913 -402 -1186 78 1103 392 -869 -1407 495 1443 318 -1511
1810 -1511 -742 1305 1121 -987 -1409 233 1287 430 -1233 -1108 631 1338 -114 -1597 -271 1367
1826 1367 954 -948 -1131 576 1656 -20 -1205 -442 980 1385 -255 -1294 -8 1674 729 -1181
1842 -1181 -989 809 1500 -522 -1405 -415 1174 813 -636 -1410 -146 1320 306 -1263 -1023 672 1059
1859 1059 -619 -1244 -102 1106 526 -897 -1024 504 1309 165 -1134 -773 1030 1260 -374 -1026 134
$$ packed form
1742a08Q00j30j128k89J243Q04j123j163P86J087m69q50L7M59Q29l64j307L12
1760e74J240M45j452q34R42J448p39j471K04J178M83r70p95J86J621n0j361p70
1778a269J336J274q70j699L04J621M19j144j155P00J831m94j459n47J505J298
1794A651j192j896P19J732j01j315p84J264J025p11j261n38J902R48j125j829
1810a511P69K047j84k108m22J642J054q57j663J25J739P07j452j483J326J638
1826A367m13j902j83J707J080j676j185P63J422M05j640j039J286J682r45j910
1842a181J92J798O91k022q83R90J589l61j449p74J264J466j014j569K40J695L87
1859A059j678o25J142J208n80j423j27J528Q05j144j299L61J803K30j634o52J160
$$ plain form
1876 134 1434 605 -1123 -437 761 1089 269 -890 -346 949 915 -785 -1153 252 1071 101 -1177 -387
1894 -387 521 736 -315 -1099 -225 931 442 -924 -1318 94 826 -88 -1150 -576 686 673 -410 -904
1912 -904 -33 822 472 -418 -757 415 1051 152 -743 -169 1027 513 -380 -599 227 792 416 -498 -419 558
1932 558 658 -117 -722 -210 824 416 -774 -600 283 391 -261 -932 -280 230 129 -480 -746 -159 523
1951 523 212 -818 -507 470 462 -47 -304 93 580 458 -126 -529 339 556 97 -504 -129 580 628 -77 -320
1972 -320 356 485 244 -125 -6 242 394 109 -237 -337 193 41 -471 -248 90 -110 -342 -333 -61 -64 -44 -243
1994 -243 -84 -194 -89 -85 -131 -49 293 10 -300 24 229 155 -71 306 133 -91 124 334 221 295 142 -60
2016 -60 185 172 264 -84 -68 122 200 -248 -456 -40 268 -121 -248 -38 -53 189 -52 -359 -408 170 174 -275 -383
$$ packed form
1876A34J300q29j728O86J198L28q20j159N44J295l4j700l68J405Q19r70j278P90
1894c87R08K15j051p84Q74J156m89j366l94J412P32r14j062N74J262j3j083m94
1912i04Q71Q55l50q90l39J172O36q99q95N74J196n14q93k19Q26N65l76r14P9R77
1932E58J00p75o05N12J034m08j190J74Q83J08o52o71O52N10j01o09k66N87O82
1951E23l11j030L11R77qn09k57L97M87j22n84m03Q68K17m59o01L75P09M8p05k43
1972c20O76J29k41l69J19K48J52k85l46j00N30j52n12K23L38k00k32RK72lK0j99
1994b43J59j10J05Mm6Q2L42k83l10L24K05p4k26L77j73k24K15K10j13P4j53k02
2016f0K45j3R2l48J6J90P8m48k08M16L08l89j27K10j5K42k41l07m9N78Mm49j08
$$ plain form
2039 -383 -73 293 47 -305 -163 214 325 -112 -402 -122 439 348 -115 -314 232 677 127 -253 -60 566
2059 566 469 87 -375 20 681 341 -431 -409 340 511 294 -538 -210 621 223 -208 -509 -132 400 3 -705
2080 -705 -529 183 286 -171 -610 -162 474 240 -593 -668 179 555 -77 -323 -178 346 810 -36 -408 -4
2100 -4 666 275 -474 -364 488 686 -166 -546 13 540 289 -316 -602 177 829 103 -638 -545 407 451 -509
2121 -509 -759 -140 426 146 -446 -569 256 634 16 -728 -311 641 598 -441 -654 203 761 63 -355 -361 521
2142 521 739 -163 -584 -38 648 515 -465 -479 410 576 16 -586 -348 418 508 -186 -635 -43 715 106 -752
2163 -752 -572 280 541 -252 -715 -197 539 72 -497 -475 226 562 43 -486 -509 480 543 -165 -635 62 524
2184 524 256 -240 -235 258 603 62 -370 -197 390 475 -411 -427 -61 391 159 -462 -286 79 329 -115 -503
$$ packed form
2039c83L10L66k46l52J42L77J11m37k90K80N61r1m63j99N46M45n50l80J93O26
2059E66r7l82m62L95O61l40p72K2P49J71k17q32L28Q31l98m31l01L77N32l97p08
2080g05J76P12J03m57m39M48O36k34q33p5Q47L76o32k46J45N24M64q46l72M04
2100dO70l91p49J10Q52J98q52l80N59N27k51o05k86P79O52p26p41R3R52M4r60
2121e09k50O19N66k80n92j23Q25L78o18p44M17R52m3j039k13Q57N58o98m18oQ82
2142E21K18r02m21N46O86j33r80j4Q89J66n60o02K38P66R0o94m49N92P58o09q58
2163g52J80Q52K61p93m63N18P36m67n69K2P01L36n19n29k3R89O3p08m70O97M62
2184E24k68m96NM93L45n41m32J73N87Q5q86j6L66M52k32o21J76L65K50m44l88
$$ plain form
2205 -503 -35 340 82 -495 -542 94 302 -152 -560 -290 289 315 -37 -429 -159 270 280 -415 -321 93 470
2226 470 93 -348 26 411 223 -151 -162 170 407 235 -177 -38 206 476 -8 -294 -122 302 33 -362
2246 -362 -370 63 160 39 -349 -123 13 120 28 -137 -23 118 -39 -167 -248 30 161 14 -186 117 206 239
2268 239 -126 -119 141 -35 330 -302 111 180 277 -272 -145 -42 -34 -61 -7 -154 100 237 -24 -73 128 94 35 80
2292 80 -191 183 -14 -41 -30 115 -2 147 -35 172 74 -9 93 -54 100 75 103 47 -19 -130 -37 56 5 -83
2316 -83 4 -173 177 105 131 -206 68 -185 67 55 -137 -38 96 67 -47 -103 -24 118 102 13 -230 97 76 70 -358
2341 -358 -69 298 52 16 -219 128 289 179 -269 -210 72 173 281 -193 -94 202 156 -41 -225 64 276
2362 276 25 -242 -81 229 217 113 -178 -47 408 107 -151 -296 98 171 -145 -252 -261 323 116 -118 -49 15
$$ packed form
2205e03M68L75k58n77m7O36K08m54m08K70N79K6l52l92K70M29J0o95R4M14L77
2226D70l77m41L74L85j88l74j1L32K37j72m12J39K44K70m84k86J72M24k69l95
2246c62qM33R7j21l88K26J36J07r2j65J14J41j57j28q1K78J31j47k00L03Q9L3
2268B39l65PK60j76L65o32M13O9R7n49J27J03Qk7N4j47K54J37k61m9K01l4n9M5
2292H0k71L74j97k7J1J45j17J49j82K07r8q3J02j47J54k5K8n6o6j11R3R3n1q8
2316h3Q7j77L50p2K6l37K74k53K52j2j92R9J34k9j14n6P9J42j6q9k43L27k1om28
2341c58K89L67k46l6k35L47J61j10m48N9K82J01J08m74R9K96m6j97j84K89K12
2362B76k51k67J61L10j2j04k91J31M55l01k58j45L94P3l16j07rN84k07k34O9O4
$$ plain form
2384 15 198 87 -281 -188 209 418 -198 -346 -109 297 128 -249 -411 36 318 -6 -178 -217 226 185 -272
2405 -272 -248 -69 172 102 -328 -236 239 379 44 -422 -148 101 357 -80 -272 17 403 112 -209 -337 298
2426 298 292 -32 -229 6 492 309 -373 -155 119 161 147 -445 -135 377 289 -159 -380 115 301 85 -312 -364
2448 -364 43 193 -143 -527 -121 9 309 -216 -270 238 259 195 -383 -82 160 213 -106 -399 -220 295 55
2469 55 -96 -171 172 268 158 -181 -160 430 227 -298 -340 164 217 73 -274 20 237 33 -82 -237 -185 73
2491 73 147 -155 -349 9 49 65 -155 -88 182 293 -175 -365 -81 199 124 -178 -212 -127 208 76 -220 -139 102
2514 102 331 -37 -245 107 309 62 -267 -66 168 232 19 -115 -49 141 105 14 74 249 158 26 -94 -24
2536 -24 139 81 162 -116 -136 222 6 -206 -30 -11 195 -64 -124 -101 346 -81 43 -108 -130 50 138 -101 -190
$$ packed form
2384A5J83j11l68R3L97K09o16j48K37M06j69l77j62M47K82l24j72l9M43m1m57
2405b72K4J79K41p0m30R2M75J40l35m66K74K49K56m37j92K89L86k91l21j28O35
2426B98ol24j97K35M86j83o82K18K74M2j4n92L10N12q8m48k21M95J86k16l97n2
2448c64M07J50l36l84M06J30L00n25n4N08K1o4n78L01K42N3l19k93J79N15k40
2469E5j51p5L43R6j10l39K1N90k03n25m2N04N3j44l47K94K17k04j15j55N2K58
2491G3P4l02j94L58M0J6k20O7K70J11m68j90K84K80p5l02l4Q5L35j32k96Q1K41
2514A02K29l68k08L52K02k47l29K01K34O4k13j34O6J90l6r1O0J75r1j32j20P0
2536b4J63n8Q1k78k0L58k16k12J76J9K06k59o0K3M47m27J24j51k2J80Q8k39q9
$$ plain form
2559 -190 31 -49 73 8 42 127 181 26 129 71 134 -159 -170 6 64 89 -141 -87 179 -82 57 72 -37 206
2583 206 27 -43 -86 -58 28 -7 -40 -188 130 16 -122 -3 -39 -41 -116 -97 50 -70 15 -38 52 56 59 -65 -12 209
2609 209 -160 61 28 -36 18 136 167 -107 261 85 43 -65 -111 44 58 19 -220 -115 123 -157 -144 72 23
2632 23 -12 -65 -16 -18 63 25 -86 30 -63 -46 -157 -50 162 -38 193 -262 -47 135 163 -262 -107 47 130 78
2656 78 56 65 192 170 -19 -142 -101 144 -64 -4 -88 121 141 -39 -99 -206 254 217 97 -131 -255 197 60 -221
2680 -221 -131 -3 88 135 -68 -165 126 171 28 -222 76 243 220 -54 42 145 139 42 -84 184 46 55 -38 -176
2704 -176 108 252 -98 -167 113 79 174 4 -350 -223 164 58 -378 -96 81 52 -10 -298 -21 152 123 -99
2726 -99 -164 -62 239 -58 -214 -90 112 0 -111 -157 55 154 68 -40 -156 11 43 13 32 22 -13 216 -99
$$ packed form
2559a90K21q0J22o5L4Q5N4j55J03n8O3k93j1J76N8K5k30N4K66k61J39J5j09K43
2583B06j79p0m3K8Q6l5l3j48L18j14j38J19l6kp5J9J47j20Q5n3R0MLj24N3K21
2609B09l69K21l3o4N4J18L1k74L68j76m2j08m6J55J4l9k39J05K38k80J3K16m9
2632B3l5n3M9kQ1l8j11J16r3J7j11J07K12k00K31m55K15J82K8m25J55J54Q3n2
2656G8k2RJ27k2j89j23M1K45k08O0q4K09K0j80o0j07M60l7j20k28j24M52j37k81
2680b21R0J28R1M7k03r7K91M5j43k50K98J67k3k74R6J03or7j26K68j38Rr3j38
2704a76K84J44l50o9K80l4R5j70l54J27L87j06m36K82J77k9o2k88K77J73k9k22
2726i9o5J02L01k97j56J24K02j12j11m6K12R9q6j08j16J67L2l0J9j0l5K29l15
$$ plain form
2749 -99 -205 53 331 288 -122 -88 234 354 -54 -164 -22 18 53 -77 -354 66 254 166 -147 -233 226 111
2771 111 -104 -126 72 -5 225 9 -104 183 199 206 -320 -132 89 -43 -32 9 -25 286 61 -114 -151 95 147
2794 147 -17 -147 -78 49 174 -2 -182 147 199 -132 83 -140 -21 87 -70 -182 -84 -13 -52 -36 -337 87
2816 87 159 -146 -34 -20 80 -39 -6 -113 -48 270 -95 -226 175 2 -65 8 59 -111 120 -91 -68 -77 -50 -70
2840 -70 30 -124 -215 94 46 -127 -86 -3 -175 85 -221 -117 255 -14 -345 -76 32 4 -132 79 -33 143
2862 143 9 58 -55 34 -60 -112 -31 -76 55 -88 -42 -37 20 30 186 77 106 106 27 157 -186 -122 11 -96 -126 -102
2888 -102 -129 -109 14 68 141 -130 -43 154 -90 -4 105 -48 -106 49 -10 -45 114 49 -58 -57 41 -17 -82 185 151
2913 151 140 61 230 -41 -68 28 -86 44 37 17 -98 160 82 -162 -2 -39 132 -56 -193 61 -26 118 133 15
$$ packed form
2749i9j06K58K78m3m10L4L22J20m08j10J42M0L5j30k77M20J88q8l13q6M59j15
2771A11k15k2J98p7K30k16j13K87J6Pn26J88K21j32J1M1l4L11k25j75l7K46N2
2794A47j64j30O9J27J25j76j80L29N2l31K15k23J19J08j57j12R8P1l9J6l01M24
2816H7P2l05J12J4J00j19L3j07O5L18l65j31M01j73o7P3N1j70K31k11K3rK7k0
2840g0J00j54r1L09m8j73M1Q3j72K60l06J04L72k69l31K69J08k8j36K11j12J76
2862A43j34M9j13Q9r4n2Q1m5J31j43M6NN7J0J56j09K9%p9J30l43O4J33j07l0K4
2888a02k7K0J23N4P3k71Q7J97k44Q6J09j53n8J55n9l5J59o5j07JR8n8o5K67l4
2913A51j1p9J69k71k7R6j14J30pk0j15K58p8k44J60l7J71j88j37K54q7J44J5j18
$$ plain form
2937 15 -7 174 -116 46 -16 -32 40 -123 -38 18 -160 -23 -105 70 23 133 109 -135 -61 187 110 0 -218 -72
2961 -72 -26 74 -14 -88 176 83 -118 -42 -95 -35 44 -75 -241 -214 240 -115 -123 -134 155 95 -71 -62 37 235 104 25
2987 25 -135 155 15 34 47 -204 99 57 -34 -279 -69 7 29 4 -58 45 135 -73 -10 -71 19 142 -13 -154
3011 -154 125 235 -36 -201 51 -211 42 -95 -262 -249 202 5 -181 80 20 270 53 -21 -49 159 12
3032 12 -171 -67 182 197 136 -212 -188 -127 31 -92 -61 -1 165 116 -36 -111 16 96 112 -133 -74 23 64 -66 -76
3057 -76 -27 222 139 -90 -46 -17 80 -75 133 -186 113 -8 58 -12 -60 -161 143 -82 0 113 276 -61 -115 -86
3081 -86 -28 12 -90 -124 -161 148 -152 -174 -127 -22 -25 -23 -57 45 9 -21 56 -39 76 2 156 -160 -42 -54 41 -263
3107 -263 -90 59 45 2 -157 -81 -94 191 27 -224 61 -73 157 12 -90 -123 -43 -33 -55 -240 127 -125 -46
$$ packed form
2937A5k2J81k90J62o2j6P2j63Q5N6j78J37q2J75m7J10k4k44P4K48p7j10k18J46
2961g2M6J00q8p4K64r3k01P6n3O0P9j19j66K7M54l55qj1K89o0j66RR9J98j31p9
2987B5j60K90j40J9J3k51L03m2r1k45K10P6K2k5o2J03R0k08O3o1R0J23j55j41
3011a54K79J10k71j65K52k62K53j37j67J3M51j97j86K61o0K50k17p4k8K08j47
3032A2j83J04K49J5o1l48K4O1J58j23L1O0J66m9j52p5J27Q0J6k45N9R7M1j30j0
3057g6M9K49q3k29M4K9R7j55K08l19K99j21O6p0m8j01L04k25Q2J13J63l37n4K9
3081h6N8M0j02l4l7L09l00k2M7J05lKl4J02l6l0P7r5J15p4J54l16J18j2R5l04
3107b63J73J49j4m3j59P6j3K85j64k51K85j34K30j45j02l3Q0J0k2j85L67k52P9
$$ plain form
3130 -46 -84 -20 88 -133 51 15 -26 100 71 -135 -50 -43 3 -30 167 222 49 -36 -74 -178 -128 12 32 12 -40 57
3156 57 161 141 -74 -170 244 122 132 117 -123 25 35 -59 -2 -27 129 -146 -123 -149 257 29 -84 132 -118 137
3180 137 -55 76 59 16 122 -49 89 114 -59 -34 -39 45 10 2 86 -52 -7 6 35 -180 -16 -216 -228 60 -91
3205 -91 101 57 82 -60 64 13 -62 -15 1 -137 -143 -7 -29 -96 65 168 -1 138 -65 138 88 35 142 -20
3229 -20 14 -45 -159 95 -68 61 190 -235 29 -139 13 162 50 -21 -140 -28 -40 85 -6 111 210 91
3251 91 86 30 140 113 80 -86 -88 -41 77 -79 -252 141 -57 88 49 -106 -105 -102 -104 -66 14 65 105 95 -169 -121 112
3278 112 -49 -85 31 22 29 105 -214 -93 -104 -15 -102 -105 -87 169 35 -47 -44 -55 -131 1 -50 -110 -5 119 -21 24 -153
3305 -153 -29 -5 15 175 103 145 5 10 11 115 14 -103 -126 175 168 -6 -127 -74 -192 -70 9 -43 53 19 87 41
$$ packed form
3130d6l8O4J08k21J84l6m1J26k9k06Q5PM6l3J97N5j73q5l8j04N0J40K0k0n2R7
3156E7J04k0k15r6M14j22J0j5k40J48J0r4N7k5J56k75K3k6M06k28j13K16k50K55
3180A37j92J31j7m3J06j71J38K5j73K5nQ4l5qQ4j38M5J3K9k15J64k00j2K88j51
3205i1J92m4K5j42J24n1p5M7J6j38oJ36k2o7J61J03j69J39k03K03n0n3J07j62
3229b0L4n9j14K54j63J29J29m25K64j68J52J49j12p1j19J12j2J25r1J17R9j19
3251I1nn6J10k7l3j66kM7J18j56j73L93j98J45l9j55JLkL8Q0N1M0j0k64M8K33
3278A12j61l6J16rPP6l19J21j1Q9q7lJ8K56j34q2Lj1p6J32n1o0J05J24j40M5j77
3305a53J24K4K0J60p2M2j40NJJ04j01j17k3L01pj74j21N3j18J22P9n2R6l4O8m6
$$ plain form
3331 41 -210 -185 75 -222 1 -111 122 8 -86 -53 -77 122 140 25 11 -38 170 -143 -103 -44 128 6 -148
3354 -148 -113 -259 91 63 -39 -161 -7 -212 -85 -108 4 16 -67 -117 -60 66 -13 -142 -19 3 -210 -87 9
3377 9 143 7 5 182 -45 -23 1 165 30 127 41 175 139 -65 -57 -15 169 62 22 -147 131 -55 1 -157 46
3402 46 125 29 197 -254 -138 70 -36 244 71 -71 -58 -46 18 -19 -118 -89 -81 -58 8 109 -61 -16 -139 39 -48
3427 -48 -77 -139 -23 35 49 -1 -39 189 21 20 -53 -5 258 -183 -94 16 -62 253 -4 31 28 -62 -80 -26 128 214 -67
3454 -67 -3 228 -112 103 -61 75 57 23 2 87 36 34 173 49 172 -161 5 -126 -156 -28 75 56 25 89
3478 89 -3 -92 -34 57 -76 -9 88 -24 70 -31 27 144 -69 45 -67 -29 148 -208 -86 -23 -2 22 -76 -150 0
3503 0 -8 -7 120 10 172 87 8 42 76 7 -140 -99 11 -90 -15 92 123 239 120 3 59 167 -28 -116 194
$$ packed form
3331D1k51K5K60k97K23j12K33j14r4L3k4J99J8j15j4m9K08l13M0N9J72j22j54
3354a48L5j46L50k8j02j22J54k05J27k3J12J2q3n0N7J26p9j29J23K2k13J23R6
3377IJ34j36kJ77k27K2K4J64j35R7q6J34l6k04QM2J84j07m0j69K78j86N6j58K03
3402D6P9r6J68m51J16K08j06K80j73j42J3J2O4l7r9K9QK3O6J01j70M5j23J78q7
3427d8k9o2J16N8J4n0l8K28j68jp3M8K63m41Q9J10p8L15k57L5lr0j8N4J54Q6k81
3454f7O4K31l40K15j64J36j8l4k1Q5n1kJ39j24J23l33J66j31l0J28J03j9l1O4
3478H9r2q9N8R1j33O7R7j12R4j01N8J17k13J14j12L8J77l56J22O3K1K4r8p4J50
3503@qJJ27j10J62q5p9L4L4o9j47M1J10j01P5J07L1J16j19j17N6J08j95q8L10
$$ plain form
3528 194 144 -115 -53 5 67 257 -13 81 -65 -62 -59 95 181 39 -31 -43 -16 11 22 -79 101 27 -94 -8 -97 -43
3554 -43 -122 79 -161 77 79 -69 -255 114 -16 18 47 -296 148 108 -129 -118 -107 91 -1 96 58 33 -38 44 92
3579 92 -227 203 138 -13 99 91 44 -35 -69 95 33 -12 31 -134 161 80 -83 38 200 110 -19 -91 -78 -222 -63
3604 -63 82 105 154 -8 153 136 -224 -22 81 -29 -3 41 44 -92 102 33 223 64 -41 -124 88 8 -124 -32
3628 -32 -10 -99 -43 -12 88 127 16 -13 19 6 -134 -100 141 111 8 -85 124 147 93 -84 59 143 24 72 -141
3653 -141 -98 121 16 -30 -69 138 -5 36 36 44 -10 -121 -79 -14 82 -53 40 55 69 53 4 70 -19 -112 9 106 148
3680 148 -49 7 52 -216 -76 34 -143 149 -29 -157 -70 -38 -64 -57 151 -75 -73 0 -65 66 -26 37 208 65
3704 65 93 -25 136 135 53 -89 -92 -98 158 -24 146 -145 -108 -178 62 -132 -35 -2 146 145 -114 56 74 -150 143
$$ packed form
3528A94n0k59O2N8O2J90k70R4j46LLJ54Q6j42p0j2K7K7J1j01J80p4j21Q6q9N4
3554d3p9K01k40K38Kj48j86L69j30L4K9l43M44m0k37J1J1J98r2R7l8k5p1Q2M8
3579I2l19M30o5j51J12qm7p9l4J64o2m5M3j65K95q1j63J21J62r0j29p2J3j44J59
3604f3J45K3M9j62J61j7l60K02J03j10K6M4Lj36J94o9J90j59j05q3K12q0j32R2
3628c2K2q9N6L1J00L9j11k9L2j3j40L4K41l0j03r3K09K3n4j77J43Q4j19M8k13
3653a41M3K19j05m6l9K07j43M1%Qn4j11M2O5R6j35R3J5J4j6m9O6q9r3J21R7M2
3680A48j97N6M5k68J40J10j77K92j78j28Q7L2k6PK08k26KP3o5J31r2O3J71j43
3704F5K8j18J61jq2j42loK56j82J70k91L7p0K40j94R7L3J48jk59J70J8k24K93
$$ plain form
3729 143 -59 -204 188 49 206 31 36 -22 150 -30 48 -8 69 -46 -131 120 47 46 114 57 -55 -24 -61 171 -69
3754 -69 -27 -129 102 63 -149 99 115 175 1 -67 88 -116 64 -123 46 206 -10 114 59 159 -104 -7 -152
3777 -152 -144 -133 56 -101 -63 -69 -170 69 -33 1 193 -16 86 72 110 94 16 77 -116 131 164 -54 -2 -12 15
3802 15 -142 135 95 -35 2 -125 67 -262 81 20 -115 85 229 27 161 -96 -47 -44 -15 125 -64 7 7 49
3826 49 -83 121 -78 -15 -84 -77 49 -105 -103 -161 101 -37 43 -52 227 105 -7 59 75 158 5 -3 18 -94 -100 -28
3852 -28 -27 -66 86 22 -60 19 208 119 13 44 135 -16 122 17 -55 35 107 69 40 174 -154 3 129 48 -82
3877 -82 78 157 81 95 -195 -2 -180 -9 80 136 40 -54 -82 61 -96 -84 29 120 8 -48 -60 68 163 102 -142
3902 -142 195 16 -179 -97 -259 20 -31 46 169 -135 161 6 -148 84 -119 128 24 61 -132 193 30
$$ packed form
3729A43k02j45L92j39J57j75Nn8J72j80P8n6P7j15q5K51p3jO8n7j12L1l7K32k40
3754f9M2j02K31l9k12K48J6O0j74o8J55k04J80j87J69J60k16J24n5J00k63R7j45
3777a52QJ1J89j57L8oj01K39j02L4J92k09J02j4L8j6p8O1j93K47L3k18N2j0K7
3802A5j57K77m0j30L7j27J92l29L43o1j35K00J44k02J34k57M9LK9J40j89P1%M2
3826D9j32K04j99O3o9PJ26j54Kn8K62j38Q0r5K79j22j12O6J6Q3j53qK1j12oP2
3852b8Jl9J52o4q2P9J89q9j06L1R1j51J38j05p2R0P2l8k9J34l28J57J26q1j30
3877h2J60P9p6J4k90J93j78J71Q9N6r6r4k8J43j57J2J13R1j12n6j2J28R5o1k44
3902a42L37j79j95Q2j62K79n1P7J23l04K96j55j54K32k03K47j04L7j93L25j63
$$ plain form
3923 30 -108 78 9 87 260 130 271 -7 26 209 37 -65 -23 -47 -63 92 211 -135 -14 -37 -144 -178 -54
3946 -54 121 -57 108 95 -20 209 18 175 -118 -256 56 16 -35 119 -54 -59 152 49 -123 -76 82 -177
3968 -177 -3 -26 24 -10 -55 -122 -25 -27 -94 15 77 61 -68 -123 21 86 25 197 -236 -83 -155 14 -65 -5 101 -129
3994 -129 78 -141 -19 109 -25 -64 110 91 28 -85 29 -82 -105 95 128 -80 16 142 -113 -74 53 202
4016 202 -245 -141 281 209 57 153 73 -19 -225 50 51 48 8 -64 143 88 125 187 -88 103 -177 117 18 35 -58
4041 -58 -3 -2 -56 -117 106 -46 -112 -122 23 -29 56 -113 -102 6 -139 15 87 -58 102 35 69 79 -33 -43 -61 23
4067 23 89 185 -35 -35 82 -187 94 51 198 30 -32 -34 -56 -5 189 -31 -28 -67 -24 -76 76 114 176 67 58 227 91
4094 91 -166 -154 -82 -45 -75 -119 -71 72 -56 74 133 -12 -180 111 35 108 -188 14 16 29 19 -79 -49 50 52 -58
$$ packed form
3923C0j38J86o9P8J73j30J41k78L3J83j72j02M2k4j6J55J19l46J21k3j07l4J24
3946e4J75j78J65j3j15K29j91J57k93j38L12m0n1J54j73nK11j03j72M7J58k59
3968a77J74k3N0l4m5o7R7ko7J09O2j6j29n5J44O5o1J72m33J53p2J69p9O0J06k30
3994a29K07k19J22J28j34l9J74j9o3j13J14j11k3K00L3k08R6J26k55L9J27J49
4016B02m47J04M22p2j52R6q0r2k06K75Jlm0p2K07n5L7O2k75J91k80K94r9J7r3
4041e8N5Jn4o1K23j52o6j0J45n2Q5j69J1J08j45J54P2j45J60o7L4J0j12j0j8Q4
4067B3O6R6k20%J17k69K81m3J47j68o2kk2N1J94k20Ll9M3n2J52L8O2j09rJ69j36
4094I1k57J2P2L7l0m4M8J43j28J30N9j45j68K91p6P3k96K02KJ3j0r8L0R9Kj10
$$ plain form
4120 -58 15 -2 117 -191 218 -81 160 -107 37 70 -64 157 -78 -151 -61 41 -58 -69 134 36 20 1 -87 73
4144 73 132 -96 -111 29 -78 30 260 -203 79 50 -75 -182 11 97 -54 61 -32 20 86 55 -73 9 53 -156
4168 -156 71 -4 -137 -253 -50 13 104 -75 47 120 64 -55 116 -133 -59 -39 128 -18 -233 307 -73 124
4190 124 13 19 49 94 -46 13 4 -87 195 -61 188 -30 12 126 -71 -170 -63 -43 8 -130 8 -67 -107 -123 -89
4215 -89 -48 -61 170 66 34 -66 -39 -82 150 204 187 -12 -33 199 36 90 -109 -207 179 108 -216 -6 150 -92
4239 -92 4 -82 -54 72 23 -8 100 -24 -237 49 172 68 -166 88 -139 -11 -68 -13 58 -45 -156 -99 -245
4262 -245 14 -81 -57 114 -36 -83 84 33 -88 193 32 81 -211 24 -110 5 -11 116 -100 -14 -45 -121 56
4285 56 42 -108 -119 84 9 126 -58 -119 -61 -74 -46 2 -63 50 118 -132 -35 -145 -73 4 103 155 55 115 315 -37
$$ packed form
4120e8P3j7J19l08M09k99K41k67J44L3j34K21k35p3R0J02r9j1K03r8j6j9q8J60
4144G3N9k28j5J40j07J08K30m63K82k9j25j07J93Q6j51J15r3N2O6l1j28Q2M4k09
4168a56K27p5j33j16K03O3R1j79J22P3n6j19J71k49P4K0J67j46k15N40l80J97
4190A24j11OL0M5j40N9rr1K82k56K49k18M2J14j97r9J07K0N1j38J38p5m0j6L4
4215h9M1j3K31j04l2j00K7m3K32N4j7j99k1K32j63N4j99r8L86p1l24K10J56k42
4239i2R6q6K8J26m9l1J08j24k13K86J23j04k34K54k27J28n7N5P1j03j11N7j46
4262b45K59r5K4J71j50m7J67n1j21K81j61M9k92K35j34J15j6J27k16Q6l1p6J77
4285E6j4j50j1K03p5J17j84o1N8j3K8M8o5J13O8k50R7j10P2P7R9N2j00O0K00l52
$$ plain form
4311 -37 32 -25 25 48 0 70 -148 -167 138 90 -39 -38 -7 75 4 -40 10 91 119 61 -222 41 -51 19 -73 -74 -9 -9 -60
4340 -60 -116 -189 -80 116 63 55 -80 -80 -20 -185 47 127 40 -133 8 38 132 -13 -38 -95 -64 63 -50 6 -56 -86
4366 -86 -4 -168 244 6 101 -122 54 -7 195 -60 6 -98 0 111 -243 -131 79 1 159 -102 146 46
4388 46 6 137 24 32 -118 90 129 170 -13 -88 93 138 -53 -82 -54 65 -37 5 -64 -71 103 97 -87 69 -111
4413 -111 98 -91 -152 161 70 17 34 -8 10 55 -136 -46 -152 -63 -48 -23 -54 -58 -63 98 -151 102 -19 57 -184 151
4439 151 77 42 95 -18 -144 116 1 77 39 -215 -190 -90 92 -161 85 -49 -308 19 -185 -8 -177 -86
4461 -86 6 64 -244 16 73 -3 -106 -45 55 88 90 99 53 31 90 -156 -25 16 37 -60 -36 62 -88 9 -78 -53 -109 -23
4489 -23 -24 72 156 224 -93 -162 82 27 118 -52 106 28 69 -10 -35 92 -171 150 -94 -104 -7 42 -17 33 136 -63
$$ packed form
4311c7O9n7N0K3m8P0k18j9L05m8j29JL1Q2p1m4N0Q1K8n8k83K63r2P0r2jO5%n1
4340f0n6p3J09J96n3qj35%O0j65K32Q0q7j73J41L0R4j45k5n7L1J27j13N6o2l0
4366h6Q2j64M12k38R5k23J76o1K02k55O6j04R8J11l54J12K10p8J58k61K48j00
4388D6m0J31j13Qj50K08L9M1j83p5J81M5j91k9K8J19j02M2o9pJ74oj84J56j80
4413a11K09j89o1L13r1n3J7m2J8M5j91R0j06Q9J5K5l1mnJ61k49K53j21P6k41L35
4439A51p4l5N3j13j26K60j15P6l8k54K5J00J82k53K46j34k59L27k04J77j69R1
4461h6R2N8l08K60N7p6j03O1J00L3KRm6k2N9k46J31M1K1r7K4R8j50R7q7K5n6Q6
4489b3jR6Q4O8l17o9K44n5R1j70J58p8M1p9k5J27k63L21k44j0R7M9n9N0J03j99
$$ plain form
4515 -63 13 -132 1 -79 -71 -80 -165 -5 -18 22 204 -79 -63 -94 2 0 -128 -318 2 1 123 -119 -70 19 7 -53 -94
4542 -94 38 -46 3 -75 22 158 48 -133 -90 171 71 -189 -36 98 -65 -192 98 33 16 133 -41 -138 -113
4565 -113 -38 144 87 29 -6 81 -83 55 134 12 -109 12 166 30 -91 64 -179 91 -94 63 122 -114
4587 -114 -36 -105 114 227 129 78 -32 35 -5 30 43 -80 -44 -64 -33 10 68 165 5 -10 125 114 -67 267 -28
4612 -28 -18 169 -56 -91 51 -48 116 23 -60 67 1 -104 145 12 37 -43 78 143 -53 -84 -249 -62 66 -61
4636 -61 -103 -45 -30 41 -15 60 194 40 66 37 34 -219 -131 188 50 -111 -78 -42 109 45 30 -82 65 -91 66
4661 66 -94 -13 67 16 151 -151 151 -50 -45 75 125 -76 -60 51 -48 -28 109 -141 317 -53 -28 -49 42 92 49
4686 49 139 36 11 20 -6 -10 117 -73 -208 2 123 134 -104 -325 -47 93 -72 -102 0 125 129 91 -16 244
$$ packed form
4515f3P6j45J33q0Qrq5J60j3M0J82k83J6l1R6kj28j90L20jJ22k42M9Q9j2o0m1
4542i4J32q4M9p8R7J36j10j81M3K61j00k60J53J34j63j27K90o5j7J17j74r7K5
4565a13P5J82n7n8l5Q7j64J38P9j22j21J21J54j36j21J55k43K70j85J57N9k36
4587a14P8o9K19J13r8n1j10O7m0L5J3j23L6k0L1M3N8R7j60j5J35j1j81L34k95
4612b8J0J87k25l5J42r9J64r3q3J27o6j05K49j33K5q0J21O5j96l1j65J87J28j27
4636f1m2N8J5P1n6P5J34j54K6k9lk53Q8L19j38j61L3L6J51o4j5j12J47j56J57
4661F6j60Q1Q0n1J35l02L02k01NJ20N0k01J6J11r9K0J37k50M58l70K5k1R1N0m3
4686D9R0j03k5Rk6mJ27j90j35K10J21J1k38k21K78J40j65l0J02J25Ml8j07K60
$$ plain form
4710 244 -30 -64 7 124 98 -77 127 -27 28 0 -96 -141 -92 182 -117 -114 -6 60 -45 21 164 137 -214 39
4734 39 -32 68 -26 23 -2 4 63 -239 -49 113 189 -43 34 10 -111 -59 2 -103 40 173 177 14 242 111 33
4759 33 -12 49 59 31 -177 38 -94 19 91 34 -30 10 3 -28 175 61 -191 61 -118 47 -10 3 75 -91 20
4784 20 30 28 90 140 12 31 -40 42 -38 47 88 -103 40 -121 -62 20 -103 108 -9 254 8 -82 -78 50 142 196
4810 196 69 80 39 68 -89 11 -96 -69 117 -12 70 -106 12 -106 11 11 17 54 107 -138 -14 53 -8 5 21
4835 21 141 -91 -60 34 87 -75 -212 -17 -104 40 118 -36 -6 70 -179 -104 -28 101 68 80 -89 130 -5 -21
4859 -21 -66 114 -26 102 150 -67 -116 -42 -83 189 4 -85 31 141 117 -138 -7 34 35 -56 25 -105 103 172 75
4884 75 -58 13 -106 -78 -75 -204 -51 -96 -74 25 -72 -13 -97 48 -81 -56 -43 -15 4 -20 -10 -204 -63 1 -60 161
$$ packed form
4710B44k74l4P1J17k6j75K04j54N5k8r6m5M9K74k99LJ08O6j05O6J43k7l51K53
4734C9p1J00r4M9k5ON9l02J90J62P6k32P7k4j21N2O1j05J43J33Mj63K28j31p8
4759C3m5O1J0k8k08K15j32J13P2n7o4M0pl1K03j14k52K52j79J65n7J3P2j66J11
4784B0J0kO2N0j28J9p1Q2q0Q5M1j91J43j61N9Q2j23K11j17K63k46r0MJ28R2N4
4810A96j27J1m1K9j57J00j07K7J86j29Q2j76J18j18J17%OL7N3k45J24O7o1J3J6
4835B1J20k32L1R4N3j62j37J95q7J44P8j54L0P6k49P5P6J29l3J2j69K19j35j6
4859b1m5J80j40J28M8k17m9P4m1K72j85q9J16J10k4k55J31M1Jr1Q1j30K08O9r7
4884G5j33P1j19K8Lj29J53m5K2R9r7N9q4J45j29K5J3K8J9k4J0j94J41O4o1K21
$$ plain form
4910 161 -20 107 170 -86 -112 36 270 5 -27 10 -34 148 15 159 111 259 81 -65 -59 -172 107 7 200
4933 200 117 41 -63 -114 248 -165 61 -6 32 -13 20 144 -71 8 98 47 54 -77 -13 -17 63 31 -198 63 -47 -83
4959 -83 -177 12 -23 75 184 188 25 81 -15 -62 8 -217 -28 81 177 28 73 88 -66 111 -70 256 -212 -156 -22
4984 -22 7 35 -207 176 -98 -57 -8 12 -11 -95 -70 163 -47 -23 60 -88 130 95 -2 -73 -187 -151 -64 78 -113
5009 -113 -36 -22 -219 -57 20 -27 -8 143 -59 28 -88 61 -127 -122 105 -10 95 -115 12 157 -177 30 -290
5032 -290 56 302 31 -44 -44 -1 13 42 14 91 -65 -91 103 135 -30 -74 106 -33 174 -8 32 -98 36 -18
5056 -18 -56 -30 62 40 -140 -68 14 14 -75 -17 -175 9 280 99 -211 -82 29 97 -33 97 -27 -153 -58 33 -132
5081 -132 -101 -65 -29 91 -12 90 51 46 -109 -109 -95 -1 -59 -20 -47 -10 220 -159 61 18 -16 129 49 -121 96 -63
$$ packed form
4910A61j81J27O3k56k6J48K34k65l2L7m4J82j33J44m8J48j78j46Oj13K79j00J93
4933B00q3p6j04n1L62m13K26o7L8m5L3J24k15P9R0n1Pj31O4mQ0l2k29K61j10l6
4959h3r4J89l5R8J09Mj63N6r6m7P0k25J89J09R6j49M5J5j54J77j81L26m68N6J34
4984b2K9K8k42L83k74M1M9K0k3q4K5K33k10K4Q3j48K18l5r7p1j14L6Q7J42j91
5009a13P7J4j97J62P7m7J9J51k02Q7j16J49j88NK27j15J05k10J27J45l34K07l20
5032b90L46K46k71p5%M3J4K9k8P7j56k6J94L2j65m4J80j39K07j82M0j30J34n4
5056a8l8K6R2k2j80P2Q2%q9N8j58J84K71j81l10J29J11O8j30J30j24j26R5R1j65
5081a32L1L6L6J20j03J02l9nj55%J4R4n8L9k7L7K30l79K20m3l4J45q0j70K17j59
$$ plain form
5107 -63 -28 99 122 173 -47 57 -63 108 22 57 196 32 50 -11 -128 12 46 54 -35 26 189 -120 -85 -24 2
5132 2 -62 128 -92 25 23 66 107 -172 110 -97 137 56 71 11 67 165 -92 -50 37 -181 -10 55 -132 -1 16
5157 16 -156 -119 -7 72 13 168 -35 18 -7 -54 84 -104 132 220 151 137 -14 6 38 -93 227 -88 -90 37 113
5182 113 116 -252 117 -19 5 -156 81 -116 1 0 -42 -109 65 87 64 -75 -31 32 -129 301 -7 -21 133 100
5206 100 140 21 -140 -154 -6 -15 24 119 9 -109 -338 -63 -53 -96 43 9 -47 -176 -31 -32 -33 11 5 97 -180 99
5232 99 120 65 85 -96 84 -14 -6 60 -18 35 100 -34 -25 -23 -38 59 -25 -98 -34 35 -53 -106 -178 91 -88 12 -153 213
5260 213 39 165 -39 18 -20 -44 37 -226 69 -144 180 -81 -115 145 -11 -45 98 55 71 192 104 -105 -48
5283 -48 -76 53 -25 -39 -143 -44 50 -91 -104 -112 -52 -103 83 -46 -17 -41 -62 -14 -23 -101 -111 183 51 -50 -144 -67 22
$$ packed form
5107f3L5J27K3N1k20J04j20J71q6L5J39j64J8o1j17J40L4Qq9O1J63l09L5O1K6
5132Bo4J90k20J17kM3M1k79K82k07K34q1J5o0N6R8k57M2Q7k18J71O5j87J31J7
5157A6j72L7J12P9n9J55k03N3k5m7J38j88K36Q8o9j4j51K0L2j31L20l15kJ27P6
5182A13Ll68L69j36K4j61K37j97J17jm2o7J74K2k3j39M4O3j61M30l08j4J54l3
5206A00M0j19j61j4J48rL9R5j10j18k29K75J0m3J39l4n6j29J45jjM4oR2k77K79
5232I9K1n5K0j81J80r8QO6p8N3O5j34RKj5R7q4p3O4O9q8n3p2K69j79J00j65L66
5260B13j74J26k04N7l8k4Q1k63K95k13L24k61l4K60j56l4J43m3J6J21q8k09N7
5283d8k8J29p8j4j04R9R4j41j3qO0n1J86j29K9k4k1M8rp8j0K94j32j01r4P7Q9
$$ plain form
5310 22 129 152 250 152 -126 89 -183 -8 155 123 84 47 -140 -53 19 84 -48 -50 107 -52 -10 -29 -106 -66 106
5335 106 -31 48 120 -66 -5 -182 16 -29 56 -69 -157 -71 -55 91 -136 -183 -35 -111 116 -8 -27 56 75 130 16
5360 16 -42 -94 -158 60 203 -55 -72 -187 -61 61 -35 -69 36 -78 -12 75 -15 -131 115 -103 8 -24 239 -108
5384 -108 7 22 -79 77 -16 -54 -59 -168 61 155 -81 11 139 -88 32 5 -68 -119 -27 108 -175 -36 102 -9
5408 -9 105 59 -137 -96 -23 -120 34 -99 -58 73 -115 10 102 62 -28 26 150 -164 55 7 -45 89 -118 188
5432 188 -156 -154 -47 -39 131 166 -139 127 -111 25 25 22 28 -115 -28 216 213 -15 14 -184 68 145 -34 -98 -7 56
5458 56 124 -50 67 172 9 12 -44 -14 3 52 -182 -201 -38 -28 1 -18 -106 78 17 76 -5 86 3 -63 -53 131 -83
5485 -83 -85 54 74 -17 3 -34 165 -30 60 -36 54 -109 -46 -8 206 30 -120 -93 50 -42 162 107 -83 -40 -116 107
$$ packed form
5310B2J07K3R8r8k78K15k72J75J63l2l9l7j87Q7P2O5j32kJ57j59M2j9p7M0J72
5335A06j37P9P2j86O1j77J98m5Q5j25q8Q6J6J46k27m7J48p6K27j24j9Q3J9N5j14
5360A6n8n2o4K18J43k58j7j15J26J22r6l4J05j14O6Q7r0j16K46k18J11l2K63l47
5384a08J15J5j01J56r3l8nj09K29R4k36R2J28k27J20k7p3n1R2J35k83J39J38j11
5408iJ14m6j96M1P3r7J54j33M1J31j88J25R2m0r0N4J24l14K19m8n2J34k07L06
5432A88l44KJ07QJ70L5l05K66k38J36%lOj43Q7K44lk28K9j98K52P7j79o4R1O3
5458E6O8j74J17J05j63Ln6L0J7M9k34j9J63J0K9j9q8J84o1N9q1R1q3o6J0J84k14
5485h3kJ39K0r1K0l7J99j95R0r6R0j63O3L8K14j76j50K7J43r2K04n5j90M3p6K23
$$ plain form
5511 107 -58 134 -56 66 43 -113 132 33 -206 -23 8 -64 29 106 -135 -45 -71 97 -21 59 -68 -24 57 -18
5535 -18 -10 137 163 1 -171 40 24 23 -50 -67 42 -94 45 37 90 -183 105 102 1 148 -27 -14 114 -4 1 -131
5561 -131 27 -78 -52 39 -34 -50 42 64 -45 -27 -41 231 104 105 17 12 -1 2 -33 20 -165 -81 -5 -51 117 86 51 -59
5589 -59 -152 5 113 -63 96 -144 23 -13 11 -17 159 58 16 56 -29 -42 -83 105 -105 168 118 121 -157 -86 112
5614 112 -9 75 -98 74 117 -212 -28 142 111 -33 65 -76 -30 11 11 -46 -185 -54 -39 -42 -146 -11 -125 -38
5638 -38 22 57 91 166 100 97 -200 163 90 104 6 -14 51 79 -92 101 70 83 -158 -66 101 -125 -59 92 -17 -33
5664 -33 35 -95 -8 -106 68 36 140 -8 32 -91 27 -68 -24 -89 84 -70 -55 -26 97 60 72 39 127 -10 179
5689 179 -10 -171 104 40 -175 -34 97 170 -45 66 -80 96 -25 -154 -129 -138 88 -234 -21 85 26 122
$$ packed form
5511A07j65J92j90J22k3j56K45r9k39J83L1p2R3P7k41R0k6J68j18Q0j27M4Q1p5
5535a8QJ47K6j62j72K11j6jp3j7J09j36J39qN3k73K88lj01J47j75J3J28j18Nj32
5561a31J58j05K6R1p3j6R2K2j09J8j4K72j27Jq8nj3Ll5N3j85Q4P6m6J68l1l5j10
5589e9r3J57J08j76J59k40J67l6K4k8J76j01m2M0q5j3m1J88k10K73n0Lk78P1J98
5614A12j21Q4j73J72M3l29J84J70l1j44R8j41M6M1%n7j39J31J5lj04J35j14Q7
5638c8O0L5L4P5o6lk97L63p3J4r8k0O5K8j71J93l1J3k41R2J67k26O6J51j09j6
5664c3O8j30Q7r8J74l2J04j48M0j23J18r5M4o5J73j54J5K9J23l7J2l3Q8j37J89
5689A79j89j61K75o4k15J41J31P3k15J11j46J76j21j29K5rK26l22K13J06n9R6
$$ plain form
5711 122 65 124 -53 52 -120 9 38 44 -209 244 100 -75 1 -131 185 -130 -58 120 20 -101 32 -115
5733 -115 116 164 42 34 44 101 186 48 45 8 13 44 -20 -87 129 61 69 -21 57 79 -101 100 -30 21 -32 76 39 -126
5761 -126 -81 -93 -86 75 -45 -88 -98 -219 -69 69 107 -62 -120 -137 110 65 -127 174 -36 -96 -65 51 165 15
5785 15 -159 -55 38 -76 -39 -42 -8 61 -11 -120 60 36 26 16 15 133 32 65 93 -118 13 -144 -268 168 -91
5810 -91 -7 -63 0 -66 -30 -166 -197 -150 191 -177 -97 51 128 -100 23 47 -47 -94 -47 -108 -169 3 -200 7 -113
5835 -113 -87 50 46 30 -79 -98 211 -25 5 -106 136 -12 75 82 112 63 -107 -10 -77 -67 -141 -56 36 56 33 -123
5861 -123 13 -38 96 -142 139 275 -118 5 149 -154 -31 -106 52 61 1 -104 -92 5 -150 -23 84 142 71
5884 71 60 -32 -121 148 54 143 -107 -129 133 -3 42 -26 -117 4 81 61 8 -199 52 -87 179 -40 25 65 11
$$ packed form
5711A22n7N9j77J05j72J29K9Ok53M53j44j75P6j32L16l15P2J78j00j21J33j47
5733a15K31M8j22qJ0N7Q5j38ll7NL1o4o7K16o8Qr0P8K2j80K01j30N1n3J08l7j65
5761a26M5j2PJ61j20m3j0j21J50J38L8j69n8j7K47m5j92L01k10o0L1J16J14j50
5785A5j74J04R3j14L7lL4O9p2j09J80k4j0j0jJ18j01L3K8k11J31j57j24M36k59
5810i1Q4n6O3o6L6j36l1M7L41l68Q0J48P7k28J23K4r4m7M7o1o1J72k03K07j20
5835a13K6J37mj6j09j9L09k36L0j11K42j48Q7PL0m9j70R7o7J0p4Q5R2K0k3j56
5861a23J36n1J34k38K81J36l93J23J44l03J23p5J58Ro0j05J2R7j55J27J07N8p1
5884G1j1r2q9K69r4Q9k50k2K62j36M5o8r1J21P7k0n3k07K51j39K66k19O5M0n4
$$ plain form
5909 11 83 -142 -91 297 -46 -36 -156 -33 241 -174 43 -13 -51 38 -36 61 -60 0 -5 -17 121 129 -20 239 -33
5934 -33 101 52 -21 192 -232 -77 188 -49 154 -120 111 -8 16 46 112 39 -49 -93 52 45 92 -41 -122 -11
5958 -11 121 -291 -9 -93 -85 22 -9 7 81 56 22 46 135 -135 32 -169 -1 -163 -49 27 16 35 66 174 -160
5983 -160 -148 -37 84 47 93 -219 -37 -77 -198 -122 46 109 83 -59 -30 -177 75 -119 -76 -87 39 -108 -44 71
6007 71 -102 48 8 165 49 -2 -119 30 41 188 -110 -101 80 45 57 74 1 73 167 -16 -57 -101 70 72 83 -11
6033 -11 39 114 22 -14 -30 -139 22 -216 127 -219 35 140 -194 78 -241 101 -10 98 -151 -6 -243 -50
6055 -50 107 164 54 36 -142 -177 249 22 -75 177 65 69 -35 66 -145 39 47 -48 -12 -71 -106 -22 18 41 -153
6080 -153 32 -3 13 89 -93 -137 -31 -75 -190 -82 4 29 54 158 -49 -43 -41 183 91 78 129 -95 -74 29 -161
$$ packed form
5909A1P2k25N1L88l43J0j20J23K74m15K17n6l8Q9p4R7j21O0nj2J38Qj49K59k72
5934c3J34m9p3K13m24J55K65k37K03k74K31j19K4L0O6p3q8m4J45pM7j33q1J11
5958a1J32m12K82q4QJ07l1J6P4k5l4K4Q9k70J67k01J68j62J14P6j1J9L1J08l34
5983a60J2J11J21l7M6l12J82m0j21P6J68O3k6j42K9j47K52j94M3j1J26j47O4J15
6007G1j73J50m0J57j16n1j17J49J1J47k98RJ81l5J2J7p3P2R4j83m1m4J71KJ1r4
6033a1N0P5r2l6j6j09J61k38L43l46K54J05l34K72l19L42j11J08k49J45k37J93
6055e0J57N7j10j8j78l5M26k27r7K52j12Mj04J01k11J84Qr5L6n9l5Q4M0K3j94
6080a53J85l5J6P6j82m4J06m4j15J08Q6K5K5J04k07OKK24r2j3N1k24K1J03j90
$$ plain form
6105 -161 79 -35 50 176 -221 -196 -78 -32 -112 85 37 138 -40 -64 -15 38 1 75 156 39 83 43 62 55 21 179
6131 179 92 42 -65 10 128 70 -99 -5 -58 37 91 165 -73 -96 55 24 73 62 -71 39 133 -8 -54 -154 -22
6156 -22 -248 -92 72 93 144 -69 -32 -26 158 -42 7 55 39 37 -125 36 -48 70 132 -26 37 -20 208 -7 -105
6181 -105 86 -108 75 -9 29 -108 -66 -21 150 -41 89 189 -114 14 93 -65 205 -39 -70 -135 -6 -87 10
6204 10 -51 106 -175 57 88 9 228 -168 -115 -83 -109 -114 56 -197 43 -72 -98 70 -12 -94 121 -24 -24 -74 24
6229 24 -118 -123 67 137 -108 -66 -81 12 140 15 112 -54 14 -47 13 93 -65 -100 32 138 -25 130 -6 -49 0
6254 0 -56 -24 77 -149 -187 -78 155 101 -166 -210 109 -94 31 86 -106 37 -67 -9 -1 40 -10 -11 -11 40 -4 -66 -97
6281 -97 50 -36 -48 -24 -136 -55 -21 98 108 95 -64 167 356 -8 -109 15 -55 -120 179 34 152 130 -67 47
$$ packed form
6105a61K40j14Q5J26l97K5J18M6q0J97m8J01j78k4M9N3l7P4Q1j17M4m0J9pl4J58
6131A79q7n0j07P5J18n8j69R4n3R5N4P4k38k3J51l1M9j1j33J10R4j41m6j00J32
6156b2k26J56J64K1N1k13L7OJ84k00M9M8j6kj62J61q4J18O2j58O3n7K28k15r8
6181a05J91j94J83q4L8j37M2M5J71j91J30J00l03J28P9j58K70k44l1o5J29q1R7
6204A0o1J57k81K32L1p9K19l96N3L2k6nJ70k53K40j15k6J68q2q2K15j45%n0R8
6229B4j42nJ90P0k45M2j5R3J28j25R7j66O8o1O0Q0j58l5J32J06j63J55j36m3M9
6254@n6L2J01k26l8J09K33n4k67m4L19k03J25N5j92J43j04N8QM1n0j%N1m4o2l1
6281i7J47q6j2K4j12Q1L4J19J0j3j59K31J89l64j01J24p0o5K99j45J18k2j97J14
$$ plain form
6305 47 34 36 79 -144 67 -163 56 -138 -176 -148 -49 -11 -158 17 -71 -88 48 38 -21 133 -77 76 35 127 -76
6330 -76 165 -38 -188 97 66 -33 53 81 37 -56 49 -28 -17 207 -46 50 -43 14 -80 -86 174 -210 -15 11 56 -1
6356 -1 -16 -32 -141 -125 26 151 -51 -62 79 -9 -16 109 -132 35 -32 -106 -72 -47 121 105 -110 41 241 232 -23
6381 -23 -135 -6 -90 61 181 -23 112 128 -13 -40 -20 -53 -34 -8 28 3 -177 78 -152 -100 -172 -123 40 141
6405 141 337 -30 -21 -21 -123 29 -22 12 -43 -22 -160 -140 -34 -121 164 -282 27 -80 -102 -269 -44 32 -254 72
6429 72 -94 182 75 1 -6 -72 46 -65 105 -109 -48 19 -18 109 -119 -20 54 -61 53 83 -51 226 -12 72
6453 72 67 -167 -89 255 -64 138 64 40 -60 117 7 -149 -4 148 -2 -59 -39 83 8 -2 -128 92 148 -142
6477 -142 165 -126 31 88 213 -8 -59 190 61 -49 119 -112 146 -62 -15 -124 -178 142 -181 -110 -59 -111
$$ packed form
6305D7j3KM3k23K11k30K19j94l8K8R9L8j47J75q8j7J36j0n9J54k10J53m1R2k03
6330g6K41k03j50K85l1r9Q6K8m4r3J05p7J1K24k53R6r3N7r4oK60l84J95K6M5n7
6356aj5j6j09J6J51J25k02j1J41q8pJ25k41J67o7p4L4K5J68j6k15J51K00rk55
6381b3j12J29q4J51J20k04J35J6j41k7K0l3J9K6L6k5j80K55k30N2p2M9J63J01
6405A41J96l67R%j02J52n1L4n5K1j38K0J06q7K85m46L09j07k2j67K25P6k86L26
6429G2j66K76j07p4po6J18j11J70k14O1O7l7J27k28R9P4j15J14L0j34K77k38Q4
6453G2nk34P8L44l19K02p4k4j00J77j10j56J45J52j50n7K0J22p5j0j26K20N6k90
6477a42L07k91J57N7J25k21n1K49j29j10J68k31K58k08M7j09n4L20l23P1N1n2
$$ plain form
6499 -111 -20 -19 -53 -167 28 -150 134 -124 10 -24 -9 40 -71 -20 151 -11 1 -29 26 -100 -54 57 -9 34 35
6524 35 5 63 151 49 144 -161 72 -31 157 60 -116 -70 -13 -36 22 -115 -174 53 -115 74 51 149 72 21 30 39
6550 39 102 11 -151 150 -116 14 -148 -27 -70 -65 40 -98 -31 -30 0 78 75 -56 -73 37 110 32 -93 -19 -12 135
6576 135 -18 -15 278 -122 -53 -147 -98 94 50 -27 -28 33 -55 109 21 -138 -24 181 -76 -40 215 47 -165 8
6600 8 82 -113 -40 45 227 29 -132 172 -81 82 -32 67 -84 151 -32 -136 13 13 67 -17 3 24 -42 54 23
6625 23 -126 75 -78 34 108 -22 -18 -120 -170 74 -57 19 102 -91 -9 -111 132 31 110 -75 -49 107 -8
6648 -8 -43 128 45 44 -42 -10 3 28 92 9 15 15 -8 43 64 -101 -46 -107 -196 -116 -96 32 20 195 139 -55 -125 -79 -64 97
6678 97 -120 7 -111 28 -107 14 -24 -97 38 -82 24 -48 -134 23 40 64 -37 17 -29 -9 -66 73 -111 161
$$ packed form
6499a11R1Jl4j14J95j78K84k58J34l4J5M9j11N1J71j62J2l0N5j26M6J11o6M3J
6524C5l0N8Q8j02R5l05K33j03J88r7j76M6N7k3N8j37n9K27j68J89k3R8p7n1RR
6550C9O3r1j62L01k66J30j62J21m3NJ05j38O7JL0P8lj31j7J10P3p8j25P4PJ47
6576A35j53LK93m00O9r4M9J92m4p7jO1q8J64q8j59J14K05k57L6K55j68k12J73
6600HP4j95P3Q5J82j98j61L04k53J63j14R9j51K35j83j04J49%N4q4K0K1o6R6l1
6625B3j49K01j53J12P4j30Mj02n0K44j31P6Q3j93Q2j02K43j01P9j85K6J56j15
6648hl5J71q3jq6L2J3K5O4q3O%k3N1K1j65N5o1q9Q0K0J28j2J75n6j94p0M6J5J61
6678I7k17J27j18J39j35J21l8p3J35j20J06p2q6J57J7K4j01N4m6K0n7J39j84K72
$$ plain form
6702 161 -27 -18 22 115 49 -28 -197 -143 87 30 208 116 -59 19 -121 104 -45 -54 -21 -26 8 26 27 -77 105 -77
6728 -77 93 209 -159 -18 249 19 27 -117 6 -143 -141 60 163 35 55 -47 23 97 -72 143 -100 32 -34
6751 -34 -1 125 -56 94 125 138 -152 -10 -134 -20 -34 146 221 -11 -135 64 -109 29 3 -16 -22 -58 80 -17
6775 -17 63 136 73 -47 -192 59 -72 -71 -110 -106 -26 -29 -7 24 -212 -75 -24 -43 -105 -220 146 -109 77 -97 -78 130
6801 130 -38 75 131 -133 5 21 122 121 -35 -96 -46 112 -114 -68 -53 -88 -174 -235 61 153 41 -157 -16 -17 -58
6826 -58 -12 -48 -25 -105 32 30 30 30 -143 -96 -335 12 -34 130 -93 -146 -72 48 164 -11 144 73 45 -37 17 22 -142
6853 -142 144 21 82 130 140 -139 -158 -47 -30 -98 -110 179 -157 -34 14 77 98 112 139 34 -42 -173 -75 -251 81
6878 81 120 23 -105 -64 -82 -58 32 31 -22 -32 172 53 89 -32 -9 54 1 37 -84 -27 -37 -230 49 100 5 72 -75
$$ packed form
6702A61j88RM0R3o6p7j69N4K30n7J78r2j75P8j40K25j49rL3nL4J8Jj04J82j82
6728g7J70J16l68J41K67k30Qj44J23j49KK01J03j28K0j02P0P4j69K15k43J32o6
6751c4L3J26j81J50L1J3k90J42j24J14j4J80P5k32j24J99j73J38k6j9ol6J38r7
6775a7Q0P3o3j20j45K51j31Jl9MQ0lK2L1k36J37N1j9o2j15L66k55J86j74J9K08
6801A30j68J13N6k64J38J6J01jj56o1N0J58k26M6J5l5q6o1K96R2j12j98J41jm1
6826e8M6l6K3q0J37k%%j73M7k39L47m6J64k23n3P4J20J16j75J55p1k8q2N4Nj64
6853a42K86j23O1M8J0k79j9J11J7o8j2K89l36J23M8O3K1J4K7j05p6j31R8j76L32
6878H1L9r7j28M1j8K4R0jn3j0K04j19L6j21K3O3n3L6j21N7j0j93K79N1r5O7j47
$$ plain form
6905 -75 -154 141 -59 -21 -108 80 -2 20 226 94 -16 -113 -57 -114 8 13 12 0 -43 134 73 199 -177 -189 -16 124
6931 124 49 -71 -26 -48 25 66 29 -28 47 -123 79 59 -98 -82 -53 -4 -36 -50 -68 -185 47 -63 1 -143 -53 54
6957 54 -90 -113 12 -36 26 -35 -56 65 64 -80 127 -10 -84 65 -168 -132 -5 -53 23 20 89 76 40 -44 30 86 18
6984 18 -82 -193 -114 -134 -22 -94 24 -83 -80 58 -53 -33 -191 -121 -47 -51 2 -178 -59 117 -49 -1 -49 104 -96
7009 -96 -64 -183 125 -35 24 -28 31 259 54 -41 -10 59 72 -128 32 132 23 103 119 3 -143 -15 78 160
7033 160 42 -56 -63 -29 66 65 63 -92 -48 52 -15 -232 89 28 -31 82 -82 64 -40 -143 109 152 -99 -65 49
7058 49 -51 44 -138 82 13 50 -83 -77 -135 82 -9 80 72 9 -21 -170 -130 -34 -26 -16 -2 -112 -246 -23 -1 -130 165
7085 165 193 -53 -125 -136 8 -88 266 84 100 79 22 -32 251 -79 40 -107 -196 49 97 78 -88 -95 -44 -37 164
$$ packed form
6905g5p9K95k00L8q7J88q2K2K06j32j10r7N6n7J22Njj2m3J77o1J26l76j2J73J40
6931A24p5j20M5k2P3M1l7n7P5j70K02k0j57J6K9M9l2j4j8j17K32j10O4j44R0J07
6957E4j44k3J25m8O2o1k1J21jj44K07j37p4J49k33L6J27m8P6lO9j3l6q4P4N6o8
6984A8j00j11P9k0J12p2J18j07LJ38j11K0j58P0P4mN3j80J19J76j66M8m8J53k00
7009i6L2j19L08j60N9n2N9K28k05r5L1O9J3k00J60J00j09Q0J6j16j46J28R3Q2
7033A60j18r8pL4R5jkj55M4J00o7k17L21o1n9J13j64J46j04j03K52M3k51L4J14
7058D9j00R5j82K20o9L7j33On8K17r1Q9qo3l0j49M0R6QJ0J4j10j34K23K2j29K95
7085A65K8k46p2j1J44r6L54j82J6k1n7n4K83l30J19j47q9K45M8j9j66pN1PK01
$$ plain form
7110 164 -20 -8 -87 -48 -55 -182 34 -29 117 0 -13 115 112 111 20 -20 49 -145 41 -131 -106 -96 -116 -110 37 160
7136 160 55 -37 -58 -56 44 122 106 119 3 83 171 -98 -55 -166 24 -166 -82 52 170 30 55 -29 77 10 -73
7161 -73 -96 -57 -39 94 -47 -72 173 -129 -41 104 52 -39 -99 -67 -6 31 -12 90 64 -39 -110 92 132 28 130
7186 130 -4 85 -159 -64 -67 18 3 46 -36 -62 137 -126 -97 189 12 -22 173 57 5 -155 -52 -140 -85 -131 -209
7211 -209 217 95 -27 45 -33 8 168 -93 67 -14 -105 34 106 1 -160 71 123 40 12 -21 -45 -15 -6 -13 68 22
7237 22 -77 87 32 -93 -11 -111 -165 167 85 6 23 -31 163 -226 -192 101 -29 -65 -105 11 91 80 -86 19 -19
7262 -19 69 -124 -91 15 -85 89 -101 80 74 6 17 74 14 -83 -204 -16 -150 128 96 -14 -42 45 38 24 64 -18
7288 -18 50 118 36 -158 -21 80 75 -127 141 -56 -6 -28 -19 103 96 -136 -55 89 151 24 41 -110 -88 -40 -86 -201
$$ packed form
7110A64j84J2p9L9pj27K16o3J46j17j3J28ljr1m0O9j94J86j72K5J0k0OJ47J23
7136A60j05r2k1KJ00P8j6J3j16Q0Q8k69M3j11J90j90Q4J34J18j40K5q4J06o7q3
7161g3k3L9J8J33j41k5K45l02Q8J45n2r1o0L2O1L7m3J02k6j03p1K02M0j04J02
7186A30j34Q9k44R5lQ5j5M3q2k6J99k63K9K86j77l4J95j16n2j60J03q8N5m6p8
7211b09M26j22j22P2p8M1J60k61J60q1r1J39P2j05j61K31N2q3k8l3k4L0RpQ1m6
7237B2r9J64n5j25Q2j00n4L32q2p9J7n4J94l89L4K93j30l6m0J16Q0j1j66J05l8
7262a9Q8j93L3J06j00J74j90J81oo8J1N7o0r7j21J88j34K78l2j10k8Q7pj4M0q2
7288a8O8O8q2j94J37J01nk02K68j97N0k2RJ22pk32Q1J44O2j27J7j51K2M8m6j15
$$ plain form
7314 -201 15 -102 -56 41 43 -10 -52 326 -76 -53 -156 -62 -171 172 -11 95 51 -68 -70 -164 149 66 55 94 -56
7339 -56 71 2 -8 146 -18 17 69 -88 11 6 15 -8 60 -172 -82 77 20 -13 133 90 -131 28 -63 -73 57 -146
7365 -146 39 -12 -65 84 -20 -81 -61 -2 -125 107 35 -67 -9 -23 87 66 109 162 3 -65 199 202 -38 -34 17 122
7391 122 1 189 -14 78 134 55 21 9 -100 91 -67 37 -43 116 -181 85 64 103 84 -134 109 75 88 -180
7415 -180 228 -223 88 -119 70 -25 -1 46 48 -144 64 -45 -85 -110 20 -125 -83 38 -47 -78 -139 -129 -121 -28 -11
7440 -11 146 18 -25 -125 34 -43 83 -170 -36 -270 -73 6 78 43 -118 -12 52 87 49 22 -73 69 39 212
7464 212 -33 16 53 -44 89 -79 -113 -14 -220 -10 -63 -162 -101 -17 -193 64 145 -66 66 52 -47 17 135 19
7488 19 113 128 -208 -116 -99 61 152 30 -55 35 169 45 128 -76 -109 -78 -72 116 104 49 25 16 -85 -241 47 100
$$ packed form
7314b01K16j17M6R7Kn3m2L78m02K3j03R4j09L43j83J06m4j19kr4L13q3j1L9j50
7339e6J27o9j0J54j64L5N2j57R9nRk3O8k32R0J59n7l3J46m3k21J59r1j0J30k03
7365a46J85n1n3J49j04o1K0N9j23K32p2j02N8j4J10k1M3N3j59o8K64Lk40MN1J05
7391A22j21J88k03R2N6p9l4j2j09J91j58J04q0J59k97K66k1L9j9k18K43l4J3k68
7415a80M08m51L11k07J89r5K4M7Kj92K08j09m0k5J30j45M2J21q5l1o1J0QR3J7
7440a1J57j28m3j00J59p7J26k53J34k34J97P9P2l5j61J06O4L5l8k7r5J42l0J73
7464B12k45M9L7r7J33j68l4R9k06K10n3r9O1Q4j76K57Q1k11J32j4r9O4J18j16
7488A9R4J5l36R2J7J60R1j22q5R0J34j24Q3k04l3L1OJ88j2n5k4rj01j56K88N3
$$ plain form
7514 100 158 111 16 -66 138 172 -110 -44 -46 -87 -109 103 -18 -84 126 38 -56 110 -88 25 18 -123 12 -4 58 -38
7540 -38 45 -26 85 128 121 -2 -38 89 41 130 -78 -15 -52 14 -118 37 93 124 179 -173 -104 -73 126 136 21 119
7566 119 -95 1 34 89 -107 290 52 -47 -27 -227 -41 -17 -126 10 18 0 65 -205 34 -88 -7 -76 -3 -141
7590 -141 -150 33 102 -3 -35 151 198 -82 7 -57 29 22 -27 -23 79 13 45 -15 67 -25 135 78 46 3 5 173 230 -80
7618 -80 -29 15 -24 -68 34 10 6 14 161 -149 -150 -139 -80 -175 75 39 10 57 -42 -28 101 -135 114 -155 -104 -100 253 -14
7646 -14 -10 -38 -218 -54 -71 -79 -21 -110 39 -85 135 -43 -134 -37 -30 -45 -108 110 -166 -14 -60 28 90 94 -49 111 19
7673 19 105 215 41 -84 118 153 98 84 -185 217 -143 -131 -9 -30 14 188 39 144 169 -73 129 -161 44
7696 44 -24 -109 174 169 -24 -128 -9 38 116 -95 -99 95 -12 98 59 -41 168 33 53 164 -184 -12 -14 -122
$$ packed form
7514A00N8m7r5q2K04L4k82O6km1k2K12j21o6K10q8r4J66j98J13pj41J35j6O2r6
7540c8Q3p1J11M3pj23l6J27m8Q9k08O3l7O6j32J55N6L1N5l52O9L1J99J0j15R8
7566A19k14R6L3N5j96L97k38r9K0k00J86K4j09J36Qj8O5k70K39j22Q1o9P3j38
7590a41rJ83O9j05l2J86M7k80Q9o4Q6pm9MJ02o6L2o0Q2r2J60n7l2m3KJ68N7l10
7618h0N1M4l9m4J02k4mQJ47l10jJ1N9r5K50l6k9M7r9J4J29k36K49k69N1ML53k67
7646a4Mk8j80J64j7qN8q9J49j24K20j78r1R7Pj5o3K18k76J52m6Q8O2Mj43J60r2
7673A9Q6J10j74j25K02L5n5j4k69M02l60J2J22k1M4J74j49J05K5k42K02k90K05
7696D4o8q5K83nj93j04J19M7P8k11mJ94j07J10l9j00K09j35K0J11l48J72kj08
$$ plain form
7720 -122 -92 -18 -88 33 120 175 172 26 0 178 82 -12 60 19 115 203 -50 -150 14 -80 -125 29 37 -60 30 22 -77 -79
7748 -79 -30 -43 -80 7 31 166 -126 -103 -58 -161 -52 -150 -107 17 163 -83 19 39 48 -112 -28 -132 81 119 138
7773 138 -2 67 -21 -106 -15 -76 -47 -41 73 -173 34 33 -183 71 -196 -99 -13 -45 33 36 45 -50 157 46 41 35 -96 -24
7801 -24 1 -145 24 -169 20 -3 -57 -144 42 -84 -182 173 19 -83 72 -20 241 52 -77 12 -19 74 -31
7824 -31 21 -26 -74 -246 -17 -98 -25 -97 79 37 -78 -159 -83 14 -44 9 80 150 188 -42 -132 -73 -123 -24 -153 -22 -94
7851 -94 -80 33 -37 13 8 200 128 43 -67 -85 -63 146 67 125 95 -56 147 127 138 -62 -83 -107 257 70 -66 133
7877 133 -176 -87 -124 106 7 -84 -45 150 -185 -23 78 98 125 30 5 1 77 0 -23 -16 -18 35 25 25 -20 90 94 118 33
7906 33 214 158 -15 81 73 80 74 -222 -3 68 21 63 -28 -103 83 80 -66 -3 -147 -66 160 -115 -116 120 18 163 -32
$$ packed form
7720a22L0P4p0J21Q7N5lj46k6J78r6r4P2m1R6Q8k53j00J64r4m5J54Qr7R0qr9k
7748g9M9j3l7Q7K4J35k92K3M5j03J09r8M3J24J46k46J02K0Rj60Q4j04K13L8J9
7773A38j40O9q8q5R1o1K9OJ14k46K07jk16K54k67R7Q6l2P8LRr5K07j11noj31P2
7801b4K5j46J69j93J89k3n4q7J86j26r8L55j54j02J55r2K61j89j29Q9l1R3j05
7824c1N2m7m8j72K29q1P3p2J76m2j15q1P6R7n8N3P1P0L8k30r0N9n0R9j29J31p2
7851i4J4J13p0N0nJ92p2q5j10j8K2K09p9N8l0j51K03k0J1k00k1k4L64j87j36J99
7877A33l09Q9l7K30r9r1L9J95l35J62J01K0K7r5k5mP6p7k3PkN3j0%m5J10MK4q5
7906C3J81n6j73R6qPok96K19P1m7M2r1p5J86lj46O3j44Q1K26k75jK36j02J45j95
$$ plain form
7933 -32 -5 99 2 -57 -17 -178 -55 65 -76 -73 -33 -111 -5 -199 89 51 5 -102 -195 22 186 12 -227 221
7957 221 79 -73 -29 -118 2 -93 -59 40 -122 11 -85 25 207 -92 -204 28 -18 -215 -140 152 161 82 -106 83
7981 83 -75 42 -51 -50 107 143 170 -26 144 118 -40 84 -11 -82 -111 -47 -85 -20 104 85 7 81 -34 64 -150 105
8007 105 -113 32 93 -16 83 38 -45 41 32 -49 92 82 -33 -97 15 -84 181 119 -16 -170 12 299 18 -41
8031 -41 -100 -45 -14 82 173 -43 -112 24 -98 -143 57 7 -83 151 44 -135 -2 43 -94 148 -125 -132 -129 122 -170
8056 -170 77 -117 -116 -94 -41 -40 -62 -49 23 19 -90 161 50 -22 104 137 25 222 -49 55 -107 -89 29 -90 -90
8081 -90 -42 74 92 74 55 156 12 -107 33 -6 30 16 5 60 8 -116 -211 -84 96 -19 -7 -31 -44 86 56
8106 56 -7 17 -20 -46 -99 10 -13 -178 22 74 -144 100 -238 13 134 150 -112 -80 123 -25 185 -50 80
$$ packed form
7933c2K7J04r7n9M0j61J23J20j41LM0p8J06j94K88l8m6j07r3K17J64j74k39M48
7957B21j42j52M4q9J20r5L4R9j62J33r6J10J82k99j12K32m6j97P5K92Rp9j88J89
7981H3j58J17r3JJ57L6K7j96J70k6j58J24r5p1k9O4l8O5J24j9p8P4j15R8k14K55
8007A05k18J45O1j09R9m5q3Q6rq1J41j0j15o4J12r9K65o2j35j54J82K87k81n9
8031d1n9N5L1R6R1k16o9J36j22m5K00n0r0K34j07j79J33M5j37K42k73pLK51k92
8056a70K47j94JK2N3Jk2J3P2mj09K51j11p2J26L3j12J97k71J04j62J8J18j19%
8081i0M8J16J8j8j9J01j44j19J40l9L6j4j1N5n2j24r5J27J80j15J2k4j3J30l0
8106E6o3K4l7k6n3J09k3j65K00N2k18K44l38K51J21J6k62L2K03j48K10k35J30
$$ plain form
8129 80 269 -50 -105 -81 58 51 6 -9 64 125 -29 -2 16 79 -91 -23 -55 -7 19 121 95 -46 144 33 7 30
8155 30 -104 19 -131 -139 1 40 177 47 -39 43 -106 -42 -87 30 -33 15 -109 -37 23 -110 99 158 137 16 61
8180 61 -42 5 -130 -90 -133 -180 65 -25 18 -68 -22
$$ packed form
8129H0J89l19n5K4J39pm5j5P3O1j54K7J8O3j70O8l2M8K6J02k6j41J90j11k6K3
8155C0j34J23j50qJ40L9J37j30q6Q2j49O4m5J17o3M8j24P2O0j33K09N9k1j21M5
8180F1j03M7j35M0m3m7K45r0M3q6M6
8191b2
$$ Imaginary data points
##PAGE= N=2
##DATA TABLE= (X++(I..I)), XYDATA
$$ plain form
0 0 0 0 0 0 0 0 0 8 -8 1 -8 8 -16 16 -24 25 -33 46 -56 64 -78 97 -111 129 -153 181 -208 240 -280 321 -368
31 -368 420 -477 541 -612 692 -776 868 -974 1088 -1210 1346 -1494 1655 -1832 2025 -2235
47 -2235 2463 -2717 2995 -3298 3630 -4003 4417 -4874 5392 -5981 6653 -7430 8341 -9426
61 -9426 10747 -12390 14506 -17338 21349 -27494 38163 -61784 226925 -425341 -666526 482365
73 482365 502784 -182548 -324588 -12100 19755 180561 160296 -379307 -504711 357519 541708
84 541708 -468973 -757969 288094 581547 -317223 -561217 81149 200605 -26622 -12068
94 -12068 -178887 -297151 241170 469721 -269333 -576799 279874 654774 -156818 -520919
104 -520919 163620 466209 19877 -146976 28654 10763 133372 344796 -65622 -437103
$$ packed form
0@%%%%%%%Qj6RrJ6k4L2m0M9n8P9j02J20j42J75k08K40k82L34l89M48n20O01o89
31c68P88q97J018j153J304j468J644j842K062k298K556k840L149l487L857m260
47b235M698n180N712o293O928p633Q420r291J0266j1373J2634j4083J5771j7767
61i426K0173k3137K6896l1844L8687m8843O5657r9947K88709o52266k41185J148891
73D82365K0419o85332j42040L12488L1855J60806k0265n39603j25404Q62230J84189
84E41708j010681k88996J046063K93453q98770k43994O42366J19456k27227J4554
94a2068j66819j18264N38321K28551p39054l07466Q56673L74900q11592l64101
104e20919O84539L02589m46332j66853J75630j7891J22609K11424m10418l71481
$$ plain form
114 -437103 176396 604194 -103397 -538933 102516 467335 -41127 -318091 -19014 92521
124 92521 -4343 53668 -66168 -313685 -30740 363232 -47925 -537292 -55906 433522
134 433522 -45007 -428031 -26825 199521 -37053 -68724 5229 -123370 -31022 262116
144 262116 66957 -330026 -49716 417217 112407 -336902 -28223 342475 71443 -145674
154 -145674 60356 78249 -31352 144555 130400 -203962 -91669 314791 125298 -307044
164 -307044 -102538 278533 66139 -234390 -49961 110978 -53508 -63688 56849 -100245
174 -100245 -173884 121937 128211 -255117 -184336 216301 87113 -249025 -79334 157854 -9888
185 -9888 -112805 52019 36223 -100063 41933 159421 -72458 -144314 160936 182615 -141176
$$ packed form
114d37103O13499M27798p07591m35536O41449L64819n08462k76964K99077J11535
124I2521r6864N8011j19836k47517K82945L93972m11157m89367M81386M89428
134D33522m78529l83024M01206K26346k36574l1671P3953j28599R2348K93138
144B62116j95159l96983K80310M66933l04810m49309L08679L70698k71032k17117
154a45674K06030J7893j09601J75907j4155l34362J12293M06460j89493m32342
164c07044K04506L81071k12394l00529J84429J60939j64486j0180J20537j57094
174a00245p3639K95821O274l83328P0781M00637j29188l36138J69691K37188j67742
185i888j02917J64824j5796j36286J41996J17488k31879p1856L05250K1679l23791
$$ plain form
196 -141176 -89640 207013 85094 -130701 44860 144243 -57703 -42005 143770 20981
206 20981 -135885 48790 148900 -80703 -129263 102859 76965 -147028 -53631 123175 -44653
217 -44653 -157894 57978 83486 -147362 -85725 116979 -13348 -148066 25917 79657 -99925
228 -99925 -60748 112604 2505 -140658 37673 152975 -61675 -126478 108484 121905 -87865
239 -87865 -36935 116253 11979 -49881 92224 50303 -107968 26056 175055 -28238 -159120
250 -159120 68861 165055 -60330 -125579 58887 72458 -57037 -18268 26790 -75040 -31518
261 -31518 115216 -17976 -191880 4653 177448 -47419 -194108 19476 122950 -38043
271 -38043 -82235 8677 -5127 -12566 69521 7116 -132425 -3845 187455 18237 -190375
$$ packed form
196a41176N1536K96653j21919k15795J75561R9383k01946J5698J85775j22789
206B0981j56866J84675J00110k29603m8560K32122k5894k23993R3397J76806j67828
217d4653j13241K15872K5508k30848O1637K02704j30327j34718J73983N3740j79582
228i9925L9177J73352j10099j43163J78331J15302k14650o4803K34962J3421k09770
239h7865N0930J53188j04274o1860J42105m1921j58271J34024J48999k03293j30882
250a59120K27981R6194k25385o5249J84466J3571j29495L8769M5058j01830M3522
261c1518J46734j33192j73904J96533J72795k24867j46689K13584J03474j60993
271c8043m4192R0912j3804p439Q2087o2405j39541J28580J91300j69218k08612
$$ plain form
282 -190375 -218 195817 21196 -125766 4422 79548 16797 25603 12036 -81150 -1819
293 -1819 158980 31828 -180423 -37995 193333 53532 -169843 -57146 114828 37623
303 37623 -55429 -29340 -37805 -13809 92963 24126 -165676 -67708 173196 67993 -183578
314 -183578 -91666 133902 75158 -88813 -64790 16656 27845 49782 16383 -105710 -54193
325 -54193 154120 97512 -159909 -107010 158437 123070 -106566 -94139 61501 73830 16297
336 16297 -18512 -66839 -23245 119314 79997 -138182 -118076 140575 139624 -120730 -141030 74929
348 74929 108678 -28296 -70106 -34263 4941 74240 46995 -114470 -106516 118253 135408 -113471
360 -113471 -155885 79609 142614 -42589 -110784 -2217 57663 44343 7625 -74599 -67324
$$ packed form
282a90375J90157J96035j74621j46962J30188P5126o2751Q806j3567r3186P9331
293a819J60799j27152k12251J42428K31328j39801k23375J12697J71974p7205
303C7623r3052K6089q465K3996J06772o8837j89802R7968K40904j05203k51571
314a83578R1912K25568n8744j63971K4023Q1446J1189K1937l3399j22093N1517
325e4193K08313n6608k57421N2899K65447l5367k29636J2427J55640J2329n7533
336A6297l4809m8327M3594J42559l9317k18179K0106K58651r51k60354k0300K15959
348G4929L3749j36974m1810L5843L9204O9299k7245j61465P954K24769J7155k48879
360a13471m2414K35494O3005j85203o8195J08567N9880j3320l6718q2224P275
$$ plain form
371 -67324 96345 122656 -93527 -150876 81961 161530 -49431 -139304 15598 101595 24340
382 24340 -42653 -51423 -19795 70227 82030 -74184 -129675 65410 154846 -46907 -155349
393 -155349 20477 129397 6109 -83476 -29974 24256 46784 36643 -52807 -89140 47987
404 47987 127519 -34433 -144330 16396 137725 2335 -108557 -18666 62705 29021 -9103
415 -9103 -33790 -47118 28581 90287 -22397 -122101 6332 127510 4974 -118662 -20125
426 -20125 86095 24059 -45646 -25651 -4327 18544 49239 -8459 -84761 -2932 106999 16717
438 16717 -106628 -20236 96392 27701 -61586 -18752 30692 16478 14457 2138 -44308 -10780
450 -10780 74832 25985 -84850 -30807 84886 32177 -71541 -28114 45102 12666 -20506
$$ packed form
371f7324J63669K6311k16183n7349K32837P9569k10961q9873J54902Q5997p7255
382B4340o6993q770L1628R0022J1803j56214n5491J95085Q9436k01753j08442
393a55349J75826J08920j23288q9585N3502N4230K2528j0141q9450l6333J37127
404D7987P9532j61952j09897J60726J21329j35390j10892Q9891Q1371l3684l8124
415i103k4687j3328P5699O1706j12684r9704J28433J21178j22536j23636R8537
426b0125J06220o2036o9705J9995K1324K2871L0695n7698p6302Q1829J09931r0282
438A6717j23345Q6392J16628o8691q9287M2834M9444j4214k021j2319m6446L3528
450a0780Q5612m8847j10835N4043J15693n2709j03718M3427P3216l2436l3172
$$ plain form
461 -20506 -3054 -16654 -19250 35115 24001 -61217 -41417 61454 35649 -67481 -37531 50339
473 50339 20405 -36119 -7702 12901 -9937 8924 27787 -23879 -34866 43114 46230 -41907
485 -41907 -34504 50482 34789 -34145 -10039 33967 2663 -12192 23050 5777 -29391 12756
497 12756 40532 -20393 -39987 27456 31939 -35200 -24985 29578 1606 -34860 4181 17779
509 17779 -28725 -21453 25946 -390 -40982 889 27481 -20554 -26710 22804 9630 -32758
521 -32758 986 35957 -11220 -32087 25195 32888 -21290 -13474 30646 11926 -13458 15167
533 15167 18962 -17263 3158 42009 -634 -39129 16212 48175 -13408 -38861 16100 28236
545 28236 -14709 -14674 4976 -11584 -7244 20844 -8945 -48286 -805 44980 -13909 -61615 -439
$$ packed form
461b0506J7452j3600k596N4365j1114q5218J9800J02871k5805j03130K9950Q7870
473E0339k9934n6524K8417K0603k2838J8861J8863n1666j0987P7980L116q8137
485d1907P403Q4986j5693o8934K4106M4006l1304j4855L5242j7273l5168M2147
497A2756K7776o0925j9594O7443M483o7139J0215N4563k7972l6466L9041J3598
509A7779m6504P272M7399k6336m0592M1871K6592m8035o156M9514j3174m2388
521c2758L3744L4971m7177k0867N7282P693n4178P816M4120j8720k5384K8625
533A5167L795l6225K0421L8851m2643l8495N5341L1963o1583k5453N4961J2136
545B8236m2945L5J9650j6560M340K8088k9789l9341M7481M5785n8889m7706O1176
$$ plain form
558 -439 41706 -9028 -38369 -5187 9509 1506 7864 -6174 -31449 6608 51948 247 -55328
571 -55328 4226 65142 12217 -43639 -3166 40526 19569 -2535 -4432 -8862 14146 43872
583 43872 2749 -50949 -3049 64189 14532 -60026 -20146 45230 18618 -30635 -25172 -3218
595 -3218 9274 16018 -13011 -51144 -12326 50763 9313 -69166 -31844 50104 26645 -44512
607 -44512 -34913 16043 24642 6792 -14303 -28762 3555 52046 19084 -52248 -22452 63492
619 63492 45098 -39474 -33872 36394 44171 605 -19458 -10574 15087 40399 12561 -46172 -25325
632 -25325 53504 40131 -49250 -50133 30911 42255 -20647 -43926 -11511 15388 16864 -9747 -46161
645 -46161 -26274 38969 30828 -51409 -55766 31746 51076 -24339 -51726 2158 36391 16329
$$ packed form
558d39M2145n0734k9341L3182J4696q003O358j4038k5275L8057M5340n1701n5575
571e5328N9554O0916n2925n5856M0473M3692k0957k2104j897m430K3008K9726
583D3872m1123n3698M7900O7238m9657p4558L9880O5376k6612m9253N463K1954
595c218J2492O744k9029l8133L8818O3089m1450p8479L7322Q1948k3459p1157
607d4512R599N0956Q599j7850k1095j4459L2317M8491l2962p1332K9796Q5944
619F3492j8394q4572N602P0266P777m3566k0063Q884K5661K5312k7838n8733K0847
632b5325P8829j3373q9381q83Q1044J1344o2902k3279L2415K6899J476k6611l6414
645d6161J9887O5243q141q2237m357Q7512J9330p5415k7387N3884L4233k0062
$$ plain form
657 16329 -14639 -27216 -2439 43649 33812 -34599 -39928 41247 63254 -15978 -50166 14605
669 14605 54953 14091 -25306 -16561 12098 33725 17945 -32587 -36331 29936 49683 -24267
681 -24267 -61003 5517 49427 -1733 -48002 -22258 16954 17964 -7819 -35033 -27933 21088
693 21088 35010 -26014 -56803 8525 53182 -2050 -50006 -10519 36731 21416 -13119 -19961
705 -19961 -828 28805 30866 -13100 -34070 17720 55406 5089 -43292 -1870 46987 18993
717 18993 -22817 -15102 10975 20630 10852 -15495 -27023 7493 34942 -4584 -46122 -10702 34928
730 34928 6976 -37225 -21834 13073 10030 -9380 -18150 -16866 2557 20434 -3864 -34779 -7307
743 -7307 33424 11003 -30405 -12710 25089 16720 -8474 -7207 4374 11253 16235 5592 -14045
$$ packed form
657A6329l0968j2577K4777M6088r837o8411n329Q1175K2007p9232l4188O4771
669A4605M0348m0862l9397Q745K8659K1627j5780n0532l744O6267J9747p3950
681b4267l6736O6520M3910n1160m6269K5744L9212J010k5783k7214P100M9021
693B1088J3922o1024l0789O5328M4657n5232m7956L9487M7250j5315l4535o842
705a9961J9133K9633K061m3966k0970N1790L7686n0317m8381M1422M8857k7994
717A8993m1810P715K6077R655r778k6347j1528L4516K7449l9526m1538L5420M5630
730C4928k7952m4201J5391L4907l043j9410q770J284J9423J7877k4298l0915K7472
743g307M0731k2421m1408J7695L7799q369k5194J267J1581O879M982j0643j9637
$$ plain form
756 -14045 -1365 30164 16421 -20959 -9102 26075 16310 -13133 -8312 8330 5497 768 -384
769 -384 -10481 -8672 10926 7220 -20844 -17926 12008 8459 -19949 -15856 5984 1343 -10304 -4510
783 -4510 -3346 -8257 1981 7660 -9249 -12554 10101 13051 -9239 -8531 12537 10195 -4942 1466
797 1466 10584 1533 851 12009 5466 -5958 5922 14663 -961 -6811 8747 8614 -6730 -2211
811 -2211 8586 -1694 -9710 2681 5347 -9700 -9064 4433 -680 -11460 -3525 1786 -8433 -6650
825 -6650 4362 -3667 -14051 378 10195 -6176 -13520 4301 9855 -3763 -5425 3865 3292 1619
839 1619 6853 2196 -6528 5414 17881 1070 -12954 5895 19464 2263 -10220 1911 9963
852 9963 3783 525 -2443 -6112 3475 12104 -3524 -18727 -1315 16958 -802 -20956 -6518
$$ packed form
756a4045J2680L1529j3743l7380J1857L5177r765k9443M821J6642k833m729j152
769c84j0097J809J9598l706k8064K918K9934l549k8408M093K1840m641j1647N794
783d510J164m911J0238N679j6909l305K2655K950k2290P08K1068k342j5137O408
797A466R118r051o82J1158o543j1424J1880Q741j5624n850J5558j33j5344M519
811b211J0797j0280q016J2391K666j5047O36J3497n113j0780P935N311j0219J783
825f650J1012q029j0384J4429R817j6371p344J7821N554j3618j662R290n73j673
839A619N234m657q724J1942J2467j6811j4024J8849J3569j7201j2483J2131Q052
852I963o180l258k968l669R587Q629j5628j5203J7412J8273j7760k0154J4438
$$ plain form
865 -6518 10937 2281 -10316 -9451 -3832 3104 6442 -6450 -17607 -183 19100 1195 -21433
878 -21433 -5610 19163 9333 -11941 -8247 7351 11533 5921 -4396 -9420 5871 21187 4098
891 4098 -19253 -3786 23475 12465 -15672 -11076 11454 13493 -1236 -10411 -7486 5458 13451
904 13451 -1681 -20990 -7307 19245 8468 -21260 -16611 11369 13068 -8328 -16093 -4084 8223
917 8223 8604 -5078 -17580 -3542 19365 9304 -19324 -14267 16765 18314 -8542 -15666 3500
930 3500 15507 7739 -6157 -10838 2325 18753 8802 -16647 -12440 17387 19082 -10674 -18526
943 -18526 5116 16884 2511 -12198 -9820 3603 12879 2869 -17443 -12734 14027 15739 -13381
956 -13381 -21214 4718 18318 -1065 -16735 -7445 8290 10821 -1429 -14720 -7770 14484 14623
$$ packed form
865f518J7455q656j2597Q65N619O936L338j2892j1157J7424J9283j7905k2628
878b1433J5823K4773r830k1274L694J5598M182n612j0317n024J5291J5316j7089
891D098k3351J5467K7261j1010k8137M596K2530K039j4729r175K925J2944P993
904A3451j5132j9309J3683K6552j0777k9728M649K7980J699k1396p765J2009J2307
917H223L81j3682j2502J4038K2907j0061k8628N057L1032J549k6856p124J9166
930C500J2007p768j3896m681J3163J6428r951k5449M207K9827J695k9756p852
943a8526K3642J1768j4373j4709K378J3423R276j0010k0312M709K6761J712k9120
956a3381p833K5932J3600j9383j5670R290J5735K531j2250j3291O950K2254J39
$$ plain form
969 14623 -11630 -18780 8167 21413 -966 -17748 -2915 14529 10238 -4817 -11213 -1287 14325
982 14325 11243 -10927 -15826 8555 20424 -2711 -19718 -2148 16251 6637 -10744 -10997 1982
995 1982 11203 4635 -11595 -13019 7168 16522 -4672 -19796 -1325 17151 4767 -14055 -8882
1008 -8882 7090 10175 -12 -9966 -6964 8448 13227 -4577 -16039 922 17533 3962 -14636
1021 -14636 -6144 11048 8982 -4124 -8561 -1554 7821 7861 -4531 -11650 1457 14486 2012 -13916
1035 -13916 -5001 11199 6766 -7309 -7419 1912 6204 2891 -4429 -7688 1404 10160 1021 -11375
1049 -11375 -3866 10324 5350 -8251 -6082 4684 5401 -759 -3709 -2892 1539 5723 920 -7590
1063 -7590 -3268 8084 4440 -7279 -5092 5051 4437 -2827 -3187 111 1185 1879 638 -3862 -2491
$$ packed form
969A4623k6253p150K6947J3246k2379j6782J4833J7444m291j5055o396R926J5612
982A4325l082k2170m899K4381J1869k3135j7007J7570J8399r614j7381k53J2979
995A982R221o568j6230j424K0187R354k1194j5124J8471J8476j2384j8822N173
1008h882J5972L085j0187r954L002J5412M779j7804j1462J6961J6611j3571j8598
1021a4636Q492J7192k066j3106m437P007R375M0j2392p119J3107J3029j2474j5928
1035a3916Q915J6200m433j4075j10R331M292l313p320l259R092Q756r139j2396
1049a1375P509J4190m974j3601K169J0766P17o160k950Q17M431M184m803q510
1063g590M322J1352l644j1719K187J0143o14p264l60L298J074O94j241m500J371
$$ plain form
1078 -2491 4818 3789 -4812 -3686 4379 3942 -3240 -2293 2082 932 -247 1320 -276 -1873 1681
1093 1681 3459 -1678 -3293 2400 3104 -2345 -1978 2563 656 -2325 527 1697 -2047 -1282 2301 83
1109 83 -3189 -112 1639 -1392 -1826 1162 -78 -2632 207 2795 -1777 -3784 1741 3231 -1920 -2566
1125 -2566 1522 1677 -332 838 264 -1416 1824 3817 -943 -3692 2206 5421 -450 -4266 787
1140 787 4120 938 -1792 -1183 -286 1759 2820 -2053 -5266 1167 5831 -1371 -7167 -822 4899 693
1156 693 -4645 -3557 906 2535 466 -3917 -4475 1716 6076 -1209 -7896 -854 7955 2523 -5795
1171 -5795 -2947 3986 4687 496 -3588 -2205 4064 6692 -917 -6694 470 9112 3225 -7215 -3997
1186 -3997 6297 5855 -2984 -5332 -596 4440 3926 -3461 -7673 78 7812 563 -9495 -4738 6346
$$ packed form
1078b491P309j029q601J126Q065m37p182R47M375j150j179J567j596j597L554
1093A681J778n137j615N693P04n449L67M541j907k981K852J170l744P65L583k218
1109H3l272L077J751l031m34K988j240k554K839K588m572k007N525J490n151o46
1125b566M088J55k009J170n74j680L240J993m760k749N898L215n871l816N053
1140G87L333l182k730O09Q97K045J061m873l213O433M664p202n796O345N721m206
1156F93n338J088M463J629k069m383n58O191M360p285o687P042Q809n432q318
1171e795K848O933P01m191m084J383O269K628p609n777P164Q642n887j0440L218
1186c997J0294m42q839k348M736N036n14p387m212P751P734p249j0058M757J1084
$$ plain form
1201 6346 4783 -5802 -7458 635 5673 1529 -5330 -5692 1627 7379 1040 -8709 -3431 8660 6091
1216 6091 -5614 -6178 3843 7668 1812 -5001 -2776 4755 7422 28 -6875 -1693 8388 6211
1230 6211 -5969 -6942 4908 7939 -1491 -6788 -2195 4106 4510 -2625 -7829 -1815 6586 2821 -7648
1245 -7648 -7309 3657 6784 -3149 -8868 -1547 5727 2655 -4066 -5675 47 6674 3139 -6511 -5353
1260 -5353 5942 7858 -2344 -6651 846 7979 3697 -4038 -3822 3255 6804 2027 -4705 -3793 5236
1275 5236 7526 -2992 -8120 1397 7404 900 -6148 -4205 2529 4690 -1304 -6833 -3592 4099 4078
1290 4078 -4423 -7938 311 6926 121 -7901 -3242 4521 3447 -2235 -4741 -1316 4952 4481 -3453
1305 -3453 -5179 3079 7702 755 -5442 -1286 6390 4843 -2731 -3496 1986 5170 2320 -2585 -3931
$$ packed form
1201F346j563j0585j656Q093N038m144o859l62P319N752o339r749N278J2091k569
1216F091j1705n64J0021L825n856o813K225P531K667p394o903N182J0081k177
1230F211j2180r73J1850L031r430n297M593O301M04p135n204O014Q401l765j0469
1245g648L39J0966L127r933n719P321P274l072o721j609N722O627l535r650J158
1260e353J1295J916j0202m307P497P133m282p735K16P077L549m777o732R12R029
1275E236K290j0518n128R517O007o504p048J943O734K161n994n529L241P691k1
1290D078q501l515Q249O615o805q022M659P763j074n682k506L425O268m71p934
1305c453j726Q258M623o947o197M156P676j547p574p65N482L184k850m905j346
$$ plain form
1320 -3931 2338 6466 -564 -6412 -829 5204 1792 -4405 -4252 1121 3259 -808 -4939 -2990 1615
1335 1615 2606 -1857 -5643 -1559 4699 1259 -5350 -2798 2980 2469 -1149 -2576 -669 2999 3054 -990
1351 -990 -2687 1377 4516 2136 -2327 -1351 3799 3743 -1279 -1584 1846 2403 928 -369 -1717 108
1367 108 2925 502 -2882 -1261 2013 641 -2366 -2410 181 999 -1316 -2336 -1001 -607 -260 -11 -1917
1384 -1917 -1845 1400 965 -2201 -1056 1232 433 -329 118 520 475 686 715 542 342 741 1691 901 -243
1403 -243 1421 1513 -372 562 1762 -137 -576 958 715 -839 -534 200 65 -256 -796 -877 -648 -526 -429
1422 -429 -1010 -1998 -384 1240 -1495 -2453 432 898 -1046 -1144 -528 -87 1287 807 -1013 -451 1815 1795
1440 1795 -142 -1186 885 3005 1230 -1634 129 2295 1309 524 -374 -528 1573 2241 -1024 -2509
$$ packed form
1320c931O269M128p030n848N583O033l412o197J53N373K138m067m131J949M605
1335A615R91m463l786M084O258l440o609K552N778n11l618j427J907L668N5m044
1351i90j697M064L139k380m463R76N150n6n022l05L430N57j475j297j348J825
1367A08K817k423l384J621L274j372l007m4K591Q18k315j020J335L94L47K49j906
1384a917P2L245m35l166J145K288p99p62M47M02m5K11K9j73k00L99R50p90j144
1403b43J664R2j885R34J200j899m39J534k43j554L05P34j35l21n40q1K29J22R7
1422d29n81r88J614J624k735r58K885M66j944r8O16M41J374m80j820N62K266k0
1440A795j937j044K071K120j775k864J763K166r86p85q98j54K101O68l265j485
$$ plain form
1456 -2509 886 2486 -109 -2620 -1266 1385 1106 -1928 -2467 -377 918 423 -1854 -2972 108 2786
1472 2786 -511 -4029 -910 2514 1120 -1657 -2001 350 2808 1198 -1861 -1415 1965 3268 334
1487 334 -2779 -440 4178 2400 -2319 -1674 2039 2991 542 -2087 -1459 2304 3058 -1189 -3674 -10
1503 -10 3393 1153 -3299 -3014 1658 2680 -1705 -3683 -724 2049 1532 -1695 -3500 -268 3460 524
1519 524 -4030 -2000 2690 2632 -1339 -3060 34 3356 1700 -2153 -1988 1316 3435 1030 -2788 -1515
1535 -1515 3669 3242 -1958 -2711 1336 3356 988 -2122 -1992 1639 3041 -591 -3310 -992 2711 1933
1551 1933 -2334 -3598 920 3171 -510 -3316 -1514 1717 1810 -837 -3057 -788 2638 1522 -2763
1566 -2763 -2558 1780 2899 -7 -3206 -646 2842 1853 -1255 -1776 386 2757 1707 -1941 -2161 2167
$$ packed form
1456b509L395J600k595k511J354K651k79l034n39K090J295m95k277j118L080K678
1472B786l297l518L119L424j394k777l44K351K458j610l059M46L380J303k934
1487C34l113K339M618j778m719O45L713R52k449k629O28L763P54m247k485L664
1503a0L403k240m452K85M672J022m385j978K959K773n17l227j805L232L728k936
1519E24m554K030M690n8l971j721L094L322j656l853J65L304K119k405l818J273
1535a515N184m27n200p53M047K020k368l110J30L631J402l632k719K318L703p78
1551A933m267j264M518K251l681k806J802L231R3k647k220K269L426j116m285
1566b763K05M338J119k906l199K560L488r89l108n21K162K371j050l648k20M328
$$ plain form
1582 2167 3307 -728 -2806 -146 2754 1440 -1581 -2334 705 2351 91 -2223 -1522 1323 2263 -822
1598 -822 -3310 -387 2721 527 -2477 -1593 767 1921 218 -2600 -1527 1946 1884 -1372 -2095 318
1614 318 2716 874 -2262 -1007 1890 1969 -534 -1656 -263 1743 1814 -1137 -2044 808 2430 332
1630 332 -1978 -865 1415 1518 -1028 -1835 171 1578 404 -1154 -1299 639 1590 -232 -2200 -703
1646 -703 1569 850 -1462 -1406 343 939 129 -1258 -689 653 1219 -404 -1331 -311 1369 904 -1095
1663 -1095 -660 958 994 -218 -657 36 586 692 -67 -818 209 834 410 -900 -444 681 752 -478
1681 -478 -497 378 370 -117 -188 -297 39 396 204 -537 -257 575 314 -516 -164 133 70 -206 34 120 -237 -9
1703 -9 -5 175 -185 62 83 -178 -90 305 -237 -245 310 447 -165 -426 146 284 -76 -432 91 374 174 -63 -238
$$ packed form
1582B167J140m035k078K660K900j314l021p53L039J646k260k314P01K845R40l085
1598h22k488K923L108k194l004Q84K360J154j703k818J073L473o2l256p23K413
1614C18K398j842l136J255K897P9k503j122J393K006P1k951r07K852J622k098
1630C32k310J113K280J03k546q07K006J407j174j558j45J938R51j822j968J497
1646g03K272p19k312N6J749N96q10j387N69J342N66j623r27J020J680m65j999
1663a095M35J618L6j212m39O93N50J06p59p51J027O25m24j310M56J125P1j230
1681d78j9Q75qm87p1j09L36L57j92p41K80Q32k61q30L52K97o3k76K40Q6l57K28
1703iMJ80l60K47K1k61Q8L95n42qN55J37o12k61N72J38l60l56N23K83k00k37j75
$$ plain form
1726 -238 -154 322 429 -419 -828 441 773 -37 -718 223 640 337 -213 -533 315 564 175 -527 -519 433 999
1747 999 -162 -1135 2 995 261 -668 -621 423 769 14 -978 -620 652 936 -463 -1413 -80 1128
1765 1128 311 -1136 -576 820 843 -85 -1061 -465 719 908 -604 -1076 222 1460 411 -1280 -672
1782 -672 1170 1211 -437 -1034 -106 1185 806 -845 -1092 348 1044 201 -1567 -487 1189 956 -911
1799 -911 -1628 242 1325 389 -1197 -1121 664 1175 -181 -1401 -324 1310 1052 -1042 -1218 712 1488
1816 1488 330 -1128 -558 1000 1545 -380 -1362 -108 1781 629 -1338 -922 763 1656 -293 -1236
1832 -1236 -363 1110 904 -731 -1415 89 1413 363 -1414 -1146 912 906 -744 -1533 -79 1201 700
1849 700 -955 -1181 343 1289 115 -1350 -541 982 1194 -759 -1192 312 1560 499 -926 -829 790
$$ packed form
1726b38Q4M76J07q48m09J269L32q10o81R41M17l03n50l20Q48K49l89p02QR52N66
1747I99j161r73J137R93p34r29M7J044L46p55r92L58J272K84j399r50J333J208
1765A128q17j447N60J396K3r28r76N96J184J89j512m72J298J238j049j691O08
1782f72J842M1j648n97R28J291l79j651k47J440O96q43j768J080J676k33j867
1799i11p17J870J083r36j586P6J785N11j356j220J077J634k58k094j76J930P76
1816A488j158j458N70J558N45j925r82J254J889j152j967M16J685Q93j949r43
1832a236Q73J473k06j635o84J504J324j050j777K68K058oj650p89J454J280n01
1849G00j655k26J524R46j174j465Q09J523K12j953m33J504J248j061j425R7J619
$$ plain form
1866 790 1534 16 -1118 -179 1152 968 -544 -1087 539 1303 -25 -1198 -475 992 745 -372 -1029
1883 -1029 -254 968 496 -1068 -1112 357 1298 -67 -1221 -430 573 632 -542 -818 10 969 237 -983
1901 -983 -749 495 986 -193 -1047 40 932 761 -456 -599 337 942 396 -664 -574 842 1101 -215
1919 -215 -726 76 962 547 -622 -667 440 609 128 -913 -504 528 535 -707 -954 -61 600 21 -787
1938 -787 -834 280 412 -426 -673 -221 476 226 -306 -478 277 746 181 -507 -98 708 470 -317 -366 259
1958 259 597 328 -232 -203 340 487 190 -442 -125 434 323 -281 -253 -133 279 19 -383 -343 -86 71 -186
1979 -186 -476 -217 147 67 -353 -284 -130 36 -39 -231 13 71 -73 -70 34 58 399 21 -5 14 229 127 107
2002 107 273 375 235 -54 85 268 77 -75 -61 151 51 -229 -262 -62 -76 13 -214 -373 25 14 -383 -374
$$ packed form
1866G90P44j518j134R39J331j84j512n43J626P64j328j173P23J467k47j117o57
1883a029P75J222m72j564m4J469R41j365j154P91J003N9j174k76Q28R59p32j220
1901i83K34J244M91j179q54J087Q92j71j217j43R36O05n46j060R0J416K59j316
1919b15n11Q02Q86m15j169m5J107J69m81j041M09J032Pj242k47Q93O61n79q08
1938g87m7J114J32q38k47M52O97k50n32j72P55M69n65o88M09Q06k38p87m9O25
1958B59L38k69n60K9N43J47k97o32L17N59j11o04K8J20M12k60m02M0K57J57k57
1979a86k90K59L64q0m20O9J54J66p5j92K44N8j44LJ04K4L41l78k6J9K15j02k0
2002A07J66J02j40k89J39J83j91j52J4K12j00k80l3K00j4Q9k27j59L98j1l97R
$$ plain form
2024 -374 -98 146 -60 -181 -235 -34 103 -125 -200 -259 182 199 -227 -238 211 472 95 -268 145 526 401 109
2046 109 -118 -67 399 517 -172 -324 386 723 -163 -645 -129 378 101 -267 -556 -31 278 -7 -586 -620 162
2067 162 327 -303 -623 -265 307 233 -583 -567 -4 440 155 -385 -310 587 653 -217 -576 106 702 303 -467
2088 -467 -207 345 566 200 -589 -146 678 707 -114 -573 259 567 69 -591 -341 224 321 -76 -565 -167 300
2109 300 411 -660 -673 29 470 -69 -858 -292 551 264 -314 -542 195 649 233 -562 -580 357 679 16
2129 16 -574 -94 785 445 -447 -667 389 695 66 -429 -236 565 619 -227 -594 -133 699 5 -511 -562 212
2150 212 349 -221 -770 -196 613 90 -499 -710 79 594 70 -672 -347 488 516 -260 -605 -144 689 219
2170 219 -379 -315 313 708 201 -326 -197 715 319 -328 -515 208 704 179 -492 -166 269 519 64 -471
$$ packed form
2024c74K76K44k06j21n4K01J37k28p5n9M41J7m26j1M49K61l77l63M13L81j25k92
2046A09k27N1M66J18o89j52P10L37q86m82N16N07k77l68k89N25L09k85n79l4P82
2067A62J65o30l20L58N72p4q16J6N63M44k85n40P5Q97O6q70l59O82N96l99p70
2088d67K60N52K21l66p89M43Q24K9q21m59Q32L08m98o60K50N65R7l97m89L98M67
2109C00J11j071j3P02M41n39p89N66Q43k87n78k28P37M54m16p95j8R37L22o63
2129A6n90M80Q79l40q92k20J056L06o29m95J93Q01N4q46l67M61Q32o94n16n1P74
2150B12J37n70n49N74Q09n23n89k11P89N15n24p42L25Q35K8p76l45M61Q33m70
2170B19n98O4O28L95n07n27J29R12l96o47j87P23M96n25o71L26M35K50m55n35
$$ plain form
2190 -471 -183 277 218 -395 -381 105 295 -118 -603 -455 115 346 -362 -435 -173 378 108 -465 -418 195 444
2211 444 -84 -340 -65 182 279 -228 -249 173 446 213 -258 -306 164 386 168 -519 171 177 186 -109 -385 138
2233 138 439 -79 -289 -158 53 276 -21 -232 -36 332 169 -387 -92 -1 302 -27 -472 -150 4 137
2253 137 -149 -209 48 60 139 -386 31 182 297 74 -217 -10 187 201 123 -146 120 13 -26 81 -141 190
2275 190 141 14 -144 77 264 -105 -171 -80 173 210 7 -101 33 249 -45 -80 20 41 56 306 -143 92
2297 92 -117 8 -14 -91 28 163 -204 6 118 31 49 71 -119 -3 -208 -170 197 -73 91 -32 53 -116 133
2320 133 93 -119 34 -15 -21 -179 -249 86 128 -19 -207 133 72 -164 -123 -146 115 151 -65 -113 -115 110 258 -129
2344 -129 -207 -53 171 1 -126 -65 142 55 -65 -128 4 99 91 -7 -58 180 286 155 -24 -25 65 256 118 -201
$$ packed form
2190d71K88M60n9o13J4M86J90m13m85J48N70K31p08p3K62N51k70n73M7O13K49
2211D44n28k56K75K47R7n07k1M22K73k33m71m8M70K22k18o87O90ORk95k76N23
2233A38L01n18k10J31K11K23k97k11J96L68j63n56K95R1L03l29m45L22J54J33
2253A37k86o0K57J2P9n25M17J51J15k23k91K07J97J4p8k69K66j07l9J07k22L31
2275A90m9j27j58K21J87l69o6R1K53L7k03j08J34K16k94l5J00K1J5K50m49K35
2297I2k09J25k2p7J19J35l67K10J12q7J8K2j90J16k05L8L67k70J64j23Q5j69K49
2320A33m0k12J53m9oj58p0L35M2j47j88L40o1k36M1k3K61L6k16m8kK25J48l87
2344a29p8J54K24j70j27O1K07q7j20o3J32R5qr8n1K38J06j31j79jR0J91j38l19
$$ plain form
2368 -201 39 127 69 -174 -268 327 155 22 -198 18 295 49 -56 -250 -67 276 106 -135 -133 192 338 77
2390 77 -216 -203 278 150 -70 -237 178 319 7 -279 -37 282 208 -247 -230 -234 257 98 -191 -366 143 366
2412 366 -198 -198 -72 183 -8 -63 -284 148 362 183 -477 6 301 442 -100 -279 1 330 161 -507 -264
2433 -264 194 451 7 -315 -2 297 143 -182 -296 96 206 -201 -313 -371 92 452 -46 -413 73 285
2453 285 313 -376 -152 193 280 26 -282 13 321 312 -190 -188 -118 198 -38 -83 -244 87 235 -61 -458 -109 243
2476 243 96 -153 -222 181 81 46 -200 -227 212 276 -166 -295 1 306 5 -203 -279 13 159 -84 -255 -75
2498 -75 65 171 -50 -218 140 130 37 -112 -76 231 56 -65 -2 -58 192 88 -91 -103 180 82 -75 -124 -215
2521 -215 190 110 92 -217 4 42 261 -113 -242 -35 110 -84 -131 126 94 7 -111 -293 -32 270 -107 -79
$$ packed form
2368b01K40Q8n8k43r4N95j72j33k20K16K77k46j05j94J83L43j70k41KL25J46k61
2390G7k93J3M81j28k20j67M15J41l12k86K42L19p4m55J7mM91j59k89j75N09K23
2412C66n64%J26K55j91n5k21M32K14j79o60M83K95J41n42j79K80L29j69o68K43
2433b64M58K57m44l22L13K99j54l25j14L92J10m07j12n8M63L60m98l67M86K12
2453B85K8o89K24L45Q7k54l08K95L08rn02KP0L16k36m5j61L31J48k96l97L49L52
2476B43j47k49o9M03j00l5k46k7M39O4m42j29K96L05l01k08p6K92J46k43j71J80
2498g5J40J06k21j68L58j0r3j49L6L07j75j21O3n6K50j04j79j2K83r8j57m9r1
2521b15M05q0j8l09K21L8K19l74j29K07J45j94m7K57l2q7j18j82K61L02l77K8
$$ plain form
2543 -79 -90 228 141 57 -229 -61 191 149 -171 21 207 151 -35 -139 -55 154 194 -54 -218 92 107 137 -189
2566 -189 -67 -16 48 -67 -218 -9 187 30 -136 -180 -85 117 -63 -202 -118 29 160 -34 -319 -65 53 -89
2588 -89 73 -5 -89 57 66 -21 149 126 102 -47 9 211 -162 -122 -8 -199 30 109 124 138 39 52 -23 203 148 60
2614 60 77 3 104 -49 -113 -96 -5 17 -83 -226 39 -71 28 103 -63 -26 114 -43 63 1 -15 323 -105 -15
2638 -15 -33 249 80 -93 -45 -43 40 47 17 150 144 97 26 -152 145 64 6 64 -50 31 73 -130 -51 -228 -59 -16 -119
2665 -119 -201 -107 78 96 -220 -144 12 -69 20 -175 -37 87 -94 17 -167 -1 226 64 -370 15 288 157
2687 157 74 -106 61 360 67 -31 29 162 1 -177 -132 -54 208 48 -68 -99 6 239 59 -185 -252 106
2709 106 171 -121 -101 -147 23 4 -207 -87 -64 52 35 -28 -117 341 140 -47 -102 120 154 61 -249 -159 182 136
$$ packed form
2543g9j1L18q7q4k86J68K52m2l20J92J86n6j86j04Q4K09M0k48j64L10J5L0l26
2566a89J22N1O4j15j51K09J96j57j66m4R5K02j80j39Q4J47J31j94k85K54J18j42
2588h9J62p8q4J46Rq7J70k3k4j49N6K02l73M0J14j91K29P9J5J4r9J3p5K26n5q8
2614F0J7p4J01j53o4J7R1K2j00j43K65j10R9P5j66L7J40j57J06o2j6L38m28R0
2638a5j8K82j69j73M8KQ3Pl0J33om7p1j78K97q1n8N8j14Q1M2k03P9j77J69M3j03
2665a19q2R4J85J8l16P6J56q1Q9j95J38J24j81J11j84J66K27j62m34L85K73j31
2687A57q3j80J67K99k93r8O0J33j61j78M5P8K62j60j16l1J05K33j80k44o7L58
2709A06O5k92K0m6J70j9k11J20K3J16j7o3q9M58k01j87n5K22L4r3l10R0L41m6
$$ plain form
2733 136 60 -90 31 198 143 -108 -187 47 236 33 -146 13 85 177 -56 -111 -8 72 39 -127 -252 120 114
2756 114 -17 -86 -161 115 180 -85 -163 53 193 72 19 67 139 321 10 -192 241 277 114 -118 -135 1 307
2779 307 -69 -134 -24 225 9 -80 -127 33 -7 -133 -149 40 137 125 2 -111 -130 246 99 -225 -7 65 128
2802 128 25 -185 -252 154 103 -94 -52 -36 84 -26 -23 100 162 89 -31 -43 196 172 18 -37 -126 -143 26 113 -140
2827 -140 -210 81 32 131 -117 -7 -3 76 -218 -19 -92 -22 -66 13 48 17 -59 -244 -117 165 57 235 149 -190 122
2852 122 -56 68 -80 10 151 -32 103 114 -41 -91 136 -3 -165 33 -12 -28 -87 -24 241 -23 275 58
2874 58 82 37 -45 -295 30 0 22 -181 71 72 78 23 -34 -129 132 -173 62 31 5 -175 51 -201 -164 172 79 -20
2900 -20 -38 -23 26 -58 63 158 4 106 -11 -23 15 -132 3 -86 -112 -166 49 -44 69 303 90 107 -113 -37 199
$$ packed form
2733A36p6j50J21J67n5k51p9K34J89k03j79J59P2R2k33n5J03Q0l3j66j25L72o
2756A14j31o9p5K76O5k65p8K16J40j21n3M8P2J82l11k02M33L6j63k32j7J36L06
2779C07l76o5J10K49k16q9m7J60m0j26j6J89R7j2j23j13j9L76j47l24K18P2O3
2802A28j03k10o7M06n1j97M2J6J20j10LJ23O2p3j20j2K39k4j54n5q9j7J69Q7k53
2827a40p0K91m9R9k48J10MP9k94J99p3P0m4P9L5l1p6j85J27K82j08J78q6l39L12
2852A22j78J24j48R0J41j83J35J1j55n0K27j39j62J98m5j6n9O3K65k64K98k17
2874E8K4m5q2k50L25l0K2k03K52JOn5n7r5K61l05K35l1k6j80K26k52L7L36r3r9
2900b0j8J5M9q4J21R5j54J02j17j2L8j47J35q9k6n4K15r3J13K34k13J7k20P6K36
$$ plain form
2925 199 96 39 35 156 90 -178 -34 -7 -78 -78 178 59 -32 119 50 -8 -4 23 -138 4 -241 100 93 -126 -15
2950 -15 -12 191 -38 36 83 201 48 -47 -114 33 130 189 -52 -96 80 -8 -136 -21 59 136 -143 -108 7 -77 226
2975 226 31 -89 -191 118 126 -97 -115 9 11 127 -30 -50 -68 38 -1 -81 -81 48 42 35 -222 -138 159 17 -29 -191
3001 -191 53 190 -38 -66 121 92 -53 -132 -193 32 152 156 -166 80 -56 194 -7 -19 -16 16 146 -41 -54 -150
3025 -150 9 165 -161 102 -94 43 112 -71 55 10 -8 -19 -74 101 100 88 -6 -105 62 55 -83 -82 -169 155 14
3050 14 -66 -393 -11 247 -131 -13 115 -132 -35 -137 -1 -15 -87 -140 -217 -16 231 54 -100 -122 -3 -175 -126
3073 -126 -85 -163 69 91 178 32 -27 71 128 -118 -93 -191 -5 -57 -68 -171 172 133 105 25 64 -107 4 -111 69
3098 69 36 97 29 -39 -1 184 -28 115 107 6 77 -33 -5 -129 72 -79 -92 -158 8 -112 36 -46 -101 -257 74
$$ packed form
2925A99j03n7mJ21o6k68J44K7p1%K56j19r1J51o9n8MK7j61J42k45L41pk19J11
2950a5LK03k29P4M7J18j53r5o7J47R7N9k41m4J76q8j28J15Q0P7k79L5J15q4L03
2975B26j95j20j02L09Qk23j8J24KJ16j57k0j8J06l9q0%J29opk57Q4K97j42m6j62
3001a91K44J37k28k8J87k9j45p9o1K25J20Ml22K46j36K50k01j2LL2J30j87j3r6
3025a50J59J56l26K63j96J37O9j83J26m5j8j1n5J75jj2r4r9J67pj38Jq7L24j41
3050A4q0l27L82K58l78J18J28k47R7j02J36j4p2n3p7K01K47j77j54k2J19j72M9
3073a26M1p8K32K2Q7j46n9R8N7k46K5r8J86n2j1j03L43l9k8q0L9j71J11j15J80
3098F9l3O1o8o8L8J85k12J43qj01P1j10K8j24K01j51j3o6J66j20J48q2n5j56L31
$$ plain form
3123 74 5 -29 -234 131 0 41 71 210 60 73 7 -77 -94 163 82 -5 144 178 20 253 -4 -125 -92 -98 -155
3148 -155 -53 -66 77 131 56 37 36 104 91 -67 -7 27 108 137 62 140 -36 21 -132 10 134 25 151 100 46 35
3174 35 -92 151 -72 74 59 -53 133 147 22 -98 -17 97 -247 -98 74 -60 59 -7 188 -113 -100 -53
3196 -53 83 27 -70 -47 26 79 -117 7 -121 -175 36 -20 146 12 1 -93 0 -44 -54 -93 51 -36 39 -11 -39 -14
3222 -14 -196 -51 -46 145 106 -10 25 16 10 -3 -70 178 -65 -97 -17 -225 -3 -13 55 -181 -93 -15 14 -36 35 159 150
3249 150 -50 35 -175 1 109 25 2 -69 5 66 82 -115 -4 -21 51 -13 -43 81 -45 -10 3 -11 -14 31 79 53
3275 53 -39 33 72 53 -47 -21 145 113 -25 -76 108 157 -44 -119 16 104 -19 76 13 153 2 78 -138 21 4
3300 4 -157 26 -126 -60 -56 -55 -91 24 106 -97 -1 55 -2 151 -253 -59 -58 33 211 -61 47 -31 46 213 113 42
$$ packed form
3123G4o9l4k05L65j31M1L0J39j50J3o6q4j7K57q1q7J49L4j58K33k57j21L3on7
3148a55J02j3J43N4p5j9jO8j3j58O0L4Q1K9p5P8j76N7j53J42J24j09J26n1n4j1
3174C5j27K43k23J46j5j12J86J4j25j20Q1J14l44J49J72j34J19o6J95l01J3M7
3196e3J36n6r7K3P3N3j96J24j28n4K11n6J66j34j1r4R3m4j0l9J44q7P5n0k8K5
3222a4j82J45NJ91l9j16L5roj3o7K48k43l2Q0k08K22j0O8k36Q8P8K9n0P1J24r
3249A50k00Q5k10J76J08q4k3p1P4O1J6j97J11j7P2o4l0J24j26L5J3j4lM5M8k6
3275E3r2P2L9j9j00K6J66l2j38n1J84M9k01p5J35Q8j23R5o3J40j51P6k16J59j7
3300Dj61J83j52O6MJl6J15Q2k03R6N6n7J53m04J94JR1J78k72J08p8P7J67j00p1
$$ plain form
3326 42 53 259 -79 -80 -273 98 -85 -120 -45 24 -20 171 142 10 147 56 -45 -76 -294 41 14 -7 83 12 69
3351 69 89 -2 69 56 64 -6 131 -24 -150 -24 123 17 -108 60 13 30 -66 -27 -5 153 11 -98 269 -25
3375 -25 -150 67 105 -12 72 36 -69 -118 32 -261 11 -20 171 -80 -84 -72 -99 -54 -146 93 79 -107 -74 -155 -318
3400 -318 113 125 -6 -51 22 -32 -5 9 -32 -20 -47 83 -342 66 85 153 45 -66 -169 -178 -36 -21 -93 -235 41
3425 41 62 -148 94 -113 4 -110 19 101 82 -180 -92 -157 -126 48 -97 -208 -133 19 58 58 124 -89 -15 58 -91
3450 -91 17 13 -139 62 65 -36 136 -66 15 -18 -6 23 4 304 -37 143 220 23 -20 102 -8 86 -19 -57 -189
3475 -189 -65 -76 -159 142 -71 -52 84 41 -12 -109 -106 -132 -73 -35 -7 -9 -11 75 111 -181 -81 117 -96 79 -118 -15
3501 -15 87 -52 -118 -38 88 58 23 -19 -100 52 79 22 -94 -37 -119 49 112 -158 113 55 -94 -116 -89 38 -83
$$ packed form
3326D2J1K06l38jj93L71j83l5P5O9m4J91k9j32J37r1j01l1k18L35k7k1R0p1N7
3351F9K0r1P1j3Qp0J37j55j26J26J47j06j25J68m7J7r6L9K2J58j42j09L67k94
3375b5j25K17L8j17Q4l6j05m9J50k93K72l1J91k51mJ2k7M5r2K39j4j86L3q1j63
3400c18M31J2j31m5P3n4K7J4m1J2k7J30m25M08J9O8j08j11j03rJ42J5p2j42K76
3425D1K1k10K42k07J17j14J29Q2j9k62Q8o5L1J74j45j11P5J52L9%O6k13P4P3j49
3450i1J08mj52K01Lj01J72k02Q1l3J2K9j9L00l41J80P7j97m3J22j10R4j05l8j32
3475a89J24j1q3L01k13J9J36m3n3r7Lk6N9L8K8kkQ6L6k92J00J98k13J75j97J03
3501a5J02j39o6Q0J26l0l5m2q1J52K7n7j16N7q2J68O3k70K71n8j49k2K7J27j21
$$ plain form
3526 -83 35 -52 96 -21 0 45 -100 113 -29 68 46 18 208 2 -68 -63 194 108 61 -63 84 -54 113 45
3550 45 -9 -30 -96 -6 -68 76 50 87 -225 -56 0 -5 -28 -50 -54 -63 -20 -67 18 -36 -11 -65 -65 74 74 153 -26 28 77 -96
3580 -96 -7 -95 48 -120 211 24 -61 68 82 118 49 -186 -111 66 -1 80 -60 25 -93 17 -168 -116 -4 20
3604 20 43 22 10 55 41 124 29 -72 152 64 2 -142 246 -43 -22 -8 179 228 11 -69 33 57 72 -144 -86 -26
3630 -26 94 -136 2 -128 -73 -67 -79 -116 151 -54 50 12 138 37 16 60 -92 -22 6 77 -138 -15 15 92 21
3655 21 96 88 62 77 65 -138 96 -18 84 -141 -141 -50 -116 1 -69 -26 -29 25 -191 188 47 56 -7 73 95 164 -73
3682 -73 64 15 -34 -7 75 64 -98 123 50 -39 -109 -49 66 -160 -23 14 89 70 -41 43 -274 -107 67 -1 -36
3707 -36 20 65 115 -82 -25 32 56 -34 132 219 156 77 -133 -140 -74 -164 -245 -161 -190 1 55 -93 29 96 0 53 84 144
$$ packed form
3526h3J18q7J48j17K1M5j45K13j42R7k2k8J90k06p0NK57q6m7j24J47j38J67o8
3550D5n4k1o6R0o2J44k6L7l12J69N6nk3k2mrM3m7Q5n4K5n4%J39%P9j79N4M9j73
3580i6Q9q8J43j68L31j87q5J29J4L6o9k35P5J77o7Q1j40Q5j18J10j85N2J12K4
3604B0K3k1j2M5j4Q3r5j01K24q8o2j44L88k89K1J4J87M9k17q0J02K4J5k16N8O0
3630b6J20k30J38j30N5Oj2l7K67k05J04l8J26j01k1M4j52P0K8P1k15J23L0P7p1
3655B1P5qk6J5j2k03K34j14J02k25%R1o6J17p0M3lN4k16L79j41Ro3Q0K2O9k37
3682g3J37m9m9K7Q2j1j62K21p3q9p0O0J15k26J37L7P5j9j11Q4l17J67J74o8l5
3707c6N6M5N0j97N7N7K4r0J66Q7o3p9k10pO6r0q1Q4k9J91N4j48J22O7r6N3L1O0
$$ plain form
3735 144 101 -173 -90 187 -75 115 150 -128 40 134 101 -97 -22 79 69 -115 134 144 -39 97 72 132 19
3758 19 -251 -18 28 16 -75 -2 -164 -6 17 34 -6 24 55 -37 132 -182 41 54 -53 -70 -153 -62 7 104 84 -19
3784 -19 26 -93 2 -90 2 -151 4 -168 -205 164 135 159 8 -16 26 -125 146 54 13 57 9 -162 33 126 -279
3809 -279 18 -65 -290 -154 -193 40 -43 -31 189 -4 17 -64 77 -1 61 23 31 177 78 -80 35 -152 148 16
3833 16 172 37 225 9 58 -187 -11 -225 78 91 -26 -30 46 -40 38 -87 -69 21 10 11 52 29 47 -39 6 71
3859 71 -161 -44 -212 -139 4 39 -50 -69 74 -16 13 -7 85 145 -69 -125 89 -76 -80 275 -2 -73 37 43 -88
3884 -88 -1 -69 -159 -116 12 38 199 -72 -31 -13 3 -104 -72 -7 -169 10 13 -40 -24 -103 -103 -129 -200 -54 48 48 -28 63
3912 63 -15 12 -28 -80 -109 -92 29 -107 163 -150 -209 95 -17 56 -60 38 144 -54 23 -106 143 -23 165 -47
$$ packed form
3735A44m3k74Q3K77k62J90L5k78J68R4l3j98P5J01j0j84K49J0j83J36k5O0j13
3758A9k70K33M6j2r1P3j62J58K3J7m0L0L1r2J69l14K23J3j07j7q3R1O9R7k0j03
3784a9M5j19R5r2R2j53J55j72l7L69k9K4j51k4M2j51K71r2m1M4m8j71J95R3m05
3809b79K97q3k25J36l9K33q3J2K20j93K1q1J41p8O2l8QJ46r9j58J15j87L00j32
3833A6J56j35J88k16M9k45J76k14L03J3j17mP6q6P8j25J8R0j1JM1k3J8q6M5O5
3859G1k32J17j68P3J43L5q9j9J43r0K9k0R2O0k14n6K14j65mL55k77p1J10Oj31
3884h8Q7o8r0M3J28K6J61k71M1J8J6j07L2O5j62J79Ln3J6p9%k6p1J46J02%p6R1
3912F3p8K7m0n2k9J7J21j36K70l13n9L04j12P3j16R8J06j98P7j29K49j66J88k12
$$ plain form
3936 -47 114 215 50 -51 95 -119 -118 70 92 -146 86 39 12 -133 -98 -63 -184 -109 -18 297 96 -93 94
3959 94 100 108 149 178 29 86 -4 84 -242 -39 48 -49 154 -96 24 -27 -122 175 10 -125 140 3 207 -94 -89
3984 -89 -246 -54 160 -5 90 110 90 -20 80 -125 41 116 -31 110 -51 1 -46 193 -82 -109 -184 34 46
4007 46 -198 198 85 -4 -26 -56 112 -9 109 25 60 238 -19 -21 -117 115 109 106 24 -10 -89 -4 -10 -230 107 -34
4033 -34 4 69 108 -64 18 -122 78 -169 -9 49 -66 58 -71 85 25 -84 13 163 -138 -129 62 23 97 -40
4057 -40 -158 23 19 -95 -54 14 -33 23 -59 -58 102 69 -101 -109 -27 -11 86 -78 14 -55 -113 -59 145 -49 -29 21 31 -157
4085 -157 25 18 26 -53 46 76 -117 80 98 42 -44 -83 -65 112 -96 -110 46 -106 -135 76 -35 30 -72 -71 -60 52
4111 52 -79 65 66 -64 -36 -22 6 67 126 134 297 -95 18 -224 137 135 -38 -27 -169 81 0 92 99 244 -2 -170
$$ packed form
3936d7J61J01j65j01J46k14JJ88K2k38K32m7k7j45L5L5j21P5R1L15k01j89J87
3959I4OQM1K9j49N7r0Q8l26K03Q7r7K03k50J20n1r5K97j65j35K65j37K04l01N
3984h9j57J92K14j65R5K0k0j10J00k05J66P5j47J41j61N2m7K39k75k7p5K18J2
4007D6k44L96j13q9k2l0J68j21J18q4L5J78k57kr6K32olq2l4p9Q5ok20L37j41
4033c4L8O5L9j72Q2j40K00k47J60N8j15J24j29J56o0j09R7J50l01RJ91l9P4j37
4057d0j18J81mj14M1O8m7N6q2JJ60l3j70qQ2J6R7j64R2o9n8N4K04j94K0N0J0j88
4085a57J82pQp9R9L0j93J97J8n6q6l9J8J77k08j4J56j52k9K11j11O5j02JJ1J12
4111E2j31J44Jj30K8J4K8O1N9QJ63l92J13k42L61kj73J1j42K50q1R2PJ45k46j68
$$ plain form
4137 -170 75 -10 31 72 -82 -2 -28 104 135 1 42 82 -1 90 94 192 71 1 -104 -119 44 -137 -61 100 50 46
4163 46 72 22 -23 -44 75 -57 -3 -27 -62 22 -45 24 -37 70 13 65 88 -150 -115 -46 -24 -87 31 -33 -32 -20 -89 179
4191 179 -101 -123 -95 -78 103 -145 79 94 111 -88 -202 103 -40 33 27 -23 27 52 28 -68 -51 25 -16 29 105 -104
4217 -104 60 95 166 -47 26 59 -12 216 -78 -27 -133 -93 21 43 -52 93 197 -13 32 -207 -63 -75 224 94
4241 94 -65 43 -6 60 -69 28 -30 -41 41 11 -93 -88 -14 -32 -80 -15 0 -49 112 14 5 -199 -185 -58 -21 -40 93
4268 93 76 158 114 187 104 -51 -59 17 -31 -28 -24 21 -35 23 -15 -109 -15 -60 69 -48 -37 -177 130 -268 21 -111 95
4295 95 -193 -19 151 12 -10 -39 -100 3 26 330 -30 62 -57 -28 -38 38 147 -68 -56 118 43 -48 -61 -70 -13
4320 -13 52 -7 -172 -94 34 -33 67 -35 201 -80 -101 54 101 -59 -56 15 -38 -55 -27 192 -124 -50 15 -97 68
$$ packed form
4137a70K45q5M1M1j54Q0k6J32L1j34M1M0q3R1MR8j21p0j05j5J63j81P6J61n0m
4163D6K6n0m5k1J19j32N4k4l5Q4o7O9o1J07n7N2K3k38L5O9K2o3J18o4JJ2o9K68
4191A79k80k2K8J7J81k48K24J5J7j99j14L05j43P3on0N0K5k4r6J7P6m1M5P6k09
4217a04J64L5P1k13P3L3p1K28k94N1j06M0J14K2r5J45J04k10M5k39J44j2K99j30
4241I4j59J08m9O6j29R7n8j1Q2l0j04NP4j8m8O5J5m9J61r8rk04J4J27L7j9J33
4268I3j7Q2m4P3q3j55qP6m8LMM5n6N8l8r4R4m5J29j17J1j40L07l98K89j32K06
4295I5k88J74J70j39k2k9o1J03K3L04l60R2j19K9j0P6J09k15J2J74p5r1j3rN7
4320a3O5n9j65P8J28o7J00j02K36k81k1J55M7j60LP1n3j7K8K19l16P4O5j12J65
$$ plain form
4345 68 4 -48 153 79 -78 -90 120 -236 -77 -64 33 -129 200 140 -116 -4 25 10 -179 -9 39 -98 -15 71
4369 71 234 37 11 -51 16 26 -92 81 106 -26 -131 -17 15 -43 46 -10 87 -80 250 -155 -87 34 -95 127
4393 127 25 20 -160 53 -8 20 19 30 243 202 40 -94 -53 181 -138 10 47 87 -19 76 -195 163 -166 -11
4417 -11 94 -149 41 -15 9 -29 -212 25 -29 -119 74 30 -6 -136 46 -47 45 -9 207 -17 136 -174 34 -80
4441 -80 42 -205 -174 16 -148 -25 -43 10 -14 8 -84 153 68 -131 45 -12 23 -22 -14 -155 46 227 94 -69
4465 -69 -55 39 42 -200 13 209 26 44 32 8 -60 91 173 -132 -43 -28 17 45 -48 3 58 -196 69 -112 -23 -78
4491 -78 -17 -48 -74 24 27 6 235 -29 107 -278 -69 215 -178 -32 -142 -129 60 121 -74 175 55 41 -15 21
4515 21 23 98 -27 69 91 -75 -105 -41 34 39 -66 27 55 -185 -124 104 -22 -14 71 -89 43 -89 -80 -53 -7 -110 98
$$ packed form
4345F8o4n2K01p4j57j2K10l56J59J3R7j62L29o0k56J12K9j5j89J70M8j37Q3Q6
4369G1J63j97k6o2O7J0j18J73K5j32j05J14L2n8Q9n6R7j67L30m05O8J21j29K22
4393A27j02nj80K13o1K8jJ1K13m1j62j34M1K34l19J48L7M0j06R5k71L58l29J55
4417a1J05k43J90n6K4l8j83K37n4r0J93m4l6j30J82r3R2n4K16k24J53l10K08j14
4441h0J22k47L1J90j64J23j8N3k4K2r2K37q5j99J76n7L5m5Qj41K01J81j33j63
4465f9J4R4Lk42K13J96j83J8j2k4o8J51Q2l05Q9J5M5K8r3N1N5k54K65j81Q9n5
4491g8O1l1k6R8Lk1K29k64J36l85K09K84l93J46j10J3J89O1j95K49j20j4n6L6
4515B1KP5j25R6K2j66l0O4P5Nj05R3K8k40O1K28j26QQ5j60J32j32RK7M6j03K08
$$ plain form
4542 98 -66 -134 2 -94 53 -18 0 -11 91 -89 -24 -26 93 217 -138 -38 103 140 -70 -100 -62 58 122 -73
4566 -73 -125 -14 -47 -146 72 106 124 -13 58 63 5 161 43 -253 -128 82 -121 -118 75 -38 153 -37 -13 -22 -38
4591 -38 49 -46 67 -4 138 -55 57 -110 152 -3 -189 8 -100 -66 -70 -152 74 -7 -168 -40 103 160 -125
4614 -125 -45 -58 145 30 53 -45 122 -60 -56 -266 133 -127 84 83 16 43 -11 230 14 168 220 -35 -15 77 -145
4639 -145 -168 73 131 -200 134 56 -96 5 124 198 -67 -55 -21 -18 -50 25 -16 46 -184 -70 -16 32 -74 9 65
4664 65 24 -113 22 -18 77 -113 84 -104 -36 -230 60 151 -150 -152 121 83 148 -86 -116 -40 -245 -34 -50 -62 -86
4689 -86 36 70 17 -36 97 37 111 -30 -170 18 -70 1 -92 176 150 2 -104 -24 73 61 -95 -113 228 235 117
4714 117 -39 -96 57 200 1 -14 -212 -29 -42 169 -104 61 -14 41 -58 -54 118 -163 -73 -69 16 -84 -89 -97 159
$$ packed form
4542I8j64o8J36r6J47p1J8j1J02j80O5kJ19J24l55J00J41L7k10l0L8J20O4j95
4566g3n2J11l3r9K18L4J8j37P1Nn8J56j18k96J25K10k03LJ93j13J91j90K4rj6
4591c8Q7r5J13p1J42j93J12j67K62j55j86J97j08L4mq2K26q1j61J28J43N7k85
4614a25Q0j3K03j15K3r8J67j82Mk10L99k60K11jo7K7n4K41k16J54N2k55K0R2k22
4639a45k3K41N8l31L34p8j52J01J19P4k65J2L4Ll2P5m1O2k30J14N4M8j06Q3N6
4664F5m1j37J35m0R5j90J97j88O8j94K90R1l01kK73l8O5k34l0P6k05K11j6j2k4
4689h6J22L4n3n3J33o0P4j41j40J88q8P1r3K68k6j48j06Q0R7j2j56j8L41Pj18
4714A17j56n7J53J43j99j5j98J83j3K11k73J65p5N5r9MJ72k81R0MQ5j00nqK56
$$ plain form
4739 159 -70 -215 -1 -119 28 46 67 -24 153 89 96 190 73 -141 83 -39 75 166 -3 -108 139 -18 -158
4762 -158 41 -35 -28 -34 8 -52 222 86 -5 74 74 54 -157 -69 -33 -103 -13 -127 130 -51 173 263 65 135 -20 -41
4788 -41 15 0 75 -19 236 -157 -59 -93 -20 -148 -92 33 67 37 12 55 -66 137 107 50 -4 229 7 92 -47 -77
4814 -77 -111 -97 57 0 32 -11 -87 -9 -128 32 14 38 -18 18 -22 68 0 -67 53 -22 71 16 -65 -81 -1 -90 184 -115
4842 -115 66 29 95 135 -40 183 -98 -43 -51 127 -58 -15 -198 -27 122 124 115 161 -93 -39 5 -67 92 -193 30
4867 30 -28 -5 159 -77 38 3 191 -76 -13 68 -34 -85 78 0 -62 -48 -4 18 32 32 4 54 19 -14 -183 -123 -125
4894 -125 69 -24 149 -136 -75 -225 -216 175 39 6 25 91 -124 52 -69 80 41 194 101 66 201 -103 -159 -58
4918 -58 52 -23 90 93 -116 -5 132 43 -119 8 -97 -81 59 35 34 45 -116 -190 -30 10 -4 43 -64 230 112
$$ packed form
4739A59k29j45K14j18J47J8K1r1J77o4PR4j17k14K24j22J14R1j69j05K47j57j40
4762a58J99p6PoM2o0K74j36r1P9%k0k11Q8L6p0R0j14K57j81K24R0j98P0j55k1
4788d1N6j5P5r4K55l93R8l4P3j28N6J25L4l0k5M3j21K03l0n7n4K33k22Q5j39l0
4814g7l4J4J54n7L2m3p6P8j19J60j8K4n6L6m0R0o8o7J20p5R3n5q1j6Q0q9K74k99
4842a15J81l7O6M0j75K23k81N5qJ78j85M3j83J71J49KrM6k54N4M4p2J59k85K23
4867C0n8K3J64k36J15l5J88k67O3Q1j02n1J63p8o2J4M4K2J4%k8N0l5l3j69O0k
4894a25J94r3J73k85O1j50RL91j36l3J9O6k15J76j21J49l9J53r3l5J35l04n6J01
4918e8J10p5J13Lk09J11J37q9j62J27j05J6J40k4jJ1j61p4J60M0j4M7j07K94j18
$$ plain form
4943 112 74 8 -113 140 -72 77 63 -129 18 50 -75 12 -227 4 -140 75 55 5 -49 -87 40 -37 99
4966 99 -20 -47 -96 -99 -106 -18 -115 102 -36 49 -15 -212 -169 -60 39 -73 15 85 42 -173 -5 74 0 29 -65 19 -138
4993 -138 51 -35 17 -256 23 -22 -106 124 -176 -193 -27 -1 31 -15 24 -18 28 60 31 158 233 69 -255 163 -161
5018 -161 -41 -189 53 -214 52 -135 -75 -22 106 32 31 -48 -103 65 127 24 -10 -46 88 128 -99 -85 -35 82
5042 82 40 -136 56 -177 -73 -89 -40 185 79 32 -28 -113 -100 54 -221 -97 -33 84 -54 174 106 -43 164
5065 164 -165 242 121 -267 -1 109 -262 82 -113 -31 53 -68 -37 54 -36 50 -10 -77 40 -49 -181 42 -70
5088 -70 -188 55 -111 -76 -110 37 107 -28 83 -102 -49 182 90 -137 15 87 8 -28 -32 -49 -67 39 -109 102
5112 102 111 -36 17 -80 54 42 -106 42 5 -15 -93 206 36 -131 -113 47 182 147 -104 -69 153 -141 30 -11
$$ packed form
4943A12l8o6j21K53k12J49j4j92J47L2j25Q7k39K31j44K15k0n0n4l8J27p7J36
4966I9j19k7m9lpQ8r7K17j38Q5o4j97M3J09R9j12Q8P0m3k15J68P9p4K9r4Q4j57
4993a38J89q6N2k73K79m5q4K30l00j7J66K6L2m6L9m2M6L2k9J27P5j64l24M18l24
5018a61J20j48K42k67K66j87O0N3J28p4jp9n5J68O2j03l4l6J34M0k27J4N0J17
5042H2m2j76J92k33J04j6M9K25j06m7o0q5J3J54k75J24O4J17j38K28o8j49K07
5065A64l29M07j21l88K66J10l71L44j95Q2Q4j21L1R1r0Q6o0o7J17q9j32K23j12
5088g0j18K43j66L5l4J47P0j35J11j85N3K31r2k27J52P2p9l6mj7j8J06j48K11
5112A02Rj47N3r7J34j2j48J48l7k0p8K99j70j67J8J60J35l5k51L5K22k94J71m1
$$ plain form
5136 -11 -282 -196 -131 -9 -86 -25 115 13 -95 66 49 -21 -31 86 96 112 69 -34 -94 -25 -30 -28 -45 -25 -90 114 14
5163 14 50 -86 -22 162 -6 -52 151 40 4 81 -35 -47 -27 85 105 3 -82 -51 -156 -21 158 -14 -135 73
5187 73 41 -115 17 39 51 -22 -177 -5 -79 -5 118 99 31 -140 -35 180 16 -207 -91 57 -101 -135 -162 0
5211 0 36 -61 101 -200 -10 129 -148 -146 -49 -8 -21 89 -33 116 -41 63 175 139 207 -190 46 -92 144 106
5235 106 -69 -104 70 184 43 -66 -179 52 114 -36 -28 50 143 -93 87 -22 -60 20 -180 101 -15 11 -149
5258 -149 -111 113 -137 160 -1 213 -58 96 63 138 -177 88 -39 -25 195 39 -89 49 201 -3 129
5279 129 20 123 -8 212 32 -122 129 60 -40 -57 142 -31 43 -126 -73 13 -68 -94 115 60 142 -88 36
5302 36 -21 -56 110 -65 79 26 -4 -45 75 204 -16 -180 -82 -11 -58 -104 21 29 -1 -74 -247 -13 31 -69 129
$$ packed form
5136a1k71Q6O5J22p7O1J40j02j08J61j7p0j0J17J0J6m3j03o0O9nKj7K0o5K04j00
5163A4L6j36O4J84j68m6K03j11l6P7j16j2K0J12K0j02q5L1j05J35J79j72j21K08
5187G3l2j56J32K2J2p3j55J72p4P4J23j9o8j71J05K15j64k23J16J48j58l4k7J62
5211@L6r7J62l01J90J39k77KR7M1j3J10j22J49j57J04J12l6O8l97K36j38K36l8
5235A06j75l5J74J14j41j09j13K31O2j50QP8R3k36J80j09l8Q0k00K81j16K6j60
5258a49L8K24k50K97j61K14k71J54l3P5l15K65j27J4K20j56j28J38J52k04J32
5279A29j09J03j31K20j80j54K51o9j00j7J99j73P4j69N3Q6q1k6K09n5Q2k30J24
5302C6n7l5J66j75J44n3l0m1J20J29k20j64R8P1m7m6J25Ql0p3j73K34M4j00J98
$$ plain form
5327 129 4 -144 -127 -40 -17 67 -150 -99 -42 4 -2 -37 -125 -166 -5 -77 -17 -96 28 23 98 -40 -15 -96 120 -56 -11
5354 -11 -109 35 -27 30 1 44 145 83 -71 53 -33 12 -77 -68 -72 -176 -53 -38 42 12 -24 -105 -128 -10 65 -68 -144
5381 -144 -44 25 -145 19 -22 -6 32 -63 -225 -79 19 -94 -57 -178 119 -215 97 -5 66 -90 -6 -72 15 -86
5405 -86 -89 36 -7 -71 -56 -40 -56 13 125 127 -41 -121 65 -48 -71 101 7 -153 7 197 9 -2 21 106 101 -32
5431 -32 23 27 -26 -49 -16 -12 -71 -49 -99 125 -156 -7 195 -48 342 -79 125 99 9 131 -171 -10 -121 -142 25
5456 25 -48 197 168 207 -31 -215 -11 -29 16 183 -60 -2 -37 70 -317 -13 154 -55 106 147 100 -62 102
5479 102 -72 -138 -26 -52 19 6 -85 52 -26 -151 138 -101 9 115 -6 -78 -100 28 -20 83 -84 13 117
5502 117 -3 15 287 50 -25 47 69 -27 60 -81 80 -17 -19 7 -117 159 2 82 73 157 -277 -100 77 93 141
$$ packed form
5327A29j25j48J7Q7K3Q4k17N1N7M6ol5q8m1J61p2O0p9J24nP5j38K5q1K16j76M5
5354a1r8J44o2N7k9M3J01o2j54J24q6M5q9Rmj04J23J5Q0l0l6q1k3J18P5j33p6
5381a44J00O9j70J64m1J6L8r5j62J46R8j13L7j21K97l34L12j02P1j56Q4o6Q7j01
5405h6lJ25m3o4J5J6j6O9J12Kj68q0J86j13k3J72r4j60J60J90j88j1K3Q5nj33
5431c2N5Mn3k3L3Mn9K2n0K24k81J49K02k43L90m21K04k6r0J22l02J61j11k1J67
5456B5p3K45k9L9k38j84K04j8M5J67k43N8l5J07l87L04J67k09J61M1m7j62J64
5479A02j74o6J12k6P1j3r1J37p8j25K89k39J10J06j21p2k2J28m8J03j67R7J04
5502A17j20J8K72k37p5P2K2r6Q7j41J61r7kK6j24K76j57Q0rQ4m34J77J77J6M8
$$ plain form
5527 141 -10 24 93 -205 64 123 -32 67 -49 -63 93 92 76 -67 -12 -41 -50 18 100 122 -26 98 -172 100 82
5552 82 45 -45 74 -92 67 -4 -3 -65 117 -50 -2 -86 7 -3 -129 -76 -165 80 58 34 20 20 101 112 130 21 66
$$ packed form
5527A41j51L4O9k98K69N9j55R9j16j4J56jj6j43N5k9rO8Q2K2j48J24k70K72j8
5552H2l7r0J19j66J59p1Jo2J82j67M8q4R3j0j26N3q9K45k2k4j4%Q1J1J8j09M5
$$ [...]
8191A80
##END NTUPLES=NMR FID
##END=
