##TITLE=1H_LY-1hexyne Pd240
 CDCl3,8 sc, 
 23.9.2021
##JCAMPDX= 6.0         $$ Bruker NMR JCAMP-DX V2.0
##DATA TYPE= NMR FID
##DATA CLASS= NTUPLES
##ORIGIN= UXNMR, Bruker Analytische Messtechnik GmbH
##OWNER= root
$$ XWIN-NMR		Version 3.5
$$ Thu Sep 23 10:46:29 2021 Russian Standard Time (UT+4h)  she@DPX200
##.OBSERVE FREQUENCY= 200.1314
##.OBSERVE NUCLEUS= ^1H
##.DELAY= (6, 6)
##.ACQUISITION MODE= SIMULTANEOUS
##.ACQUISITION SCHEME= undefined
##.AVERAGES= 8
##.DIGITISER RES= 18
##SPECTROMETER/DATA SYSTEM= spect
##.PULSE SEQUENCE= zg30
##.SOLVENT NAME= CDCl3
##.SHIFT REFERENCE= (INTERNAL, CDCl3, 0, 15.7039)
##AUDIT TRAIL= $$ (NUMBER, WHEN, WHO, WHERE, WHAT)
$$ ##TITLE= Audit trail, XWIN-NMR		Version 3.5
$$ ##JCAMPDX= 5.01
$$ ##ORIGIN= Bruker BioSpin GmbH
$$ ##OWNER= she
$$ F:/spectra/data/she/nmr/H-F/1/audita.txt
$$ ##AUDIT TRAIL=  $$ (NUMBER, WHEN, WHO, WHERE, WHAT)
(   1,<2021-09-23 10:44:47.10 +0400>,<she>,<DPX200>,
      <created by zg, POWCHK disabled, PULCHK disabled
       configuration hash MD5:
       00 E9 B6 7A A2 85 ED C7 34 08 36 98 17 FE 4E 26
       data hash MD5: 16K
       E0 51 95 71 49 D8 BA 61 72 DB E6 FC 0D 9E F7 34>)
$$ ##END=
$$ 
$$ hash MD5
$$ CC B6 1D 39 A1 A8 A7 19 E6 E1 B0 D7 EE 65 08 59
##$RELAX= 
##$RELAX= 
##$RELAX= 
##$RELAX= 
##$RELAX= 
##$RELAX= 
$$ Bruker specific parameters
$$ --------------------------
##$DU= <F:/spectra>
##$EXPNO= 1
##$NAME= <H-F>
##$PROCNO= 1
##$TYPE= <nmr>
##$USER= <she>
##$AMP= (0..31)
100 100 100 100 100 100 100 100 100 100 100 100 100 100 100 100 100 100 
100 100 100 100 100 100 100 100 100 100 100 100 100 100 
##$AQSEQ= 0
##$AQ_mod= 1
##$AUNM= <au_zg>
##$AUTOPOS= <>
##$BF1= 200.13
##$BF2= 200.13
##$BF3= 200.13
##$BF4= 200.13
##$BF5= 200.13
##$BF6= 200.13
##$BF7= 200.13
##$BF8= 200.13
##$BYTORDA= 1
##$CFDGTYP= 0
##$CFRGTYP= 5
##$CHEMSTR= <none>
##$CNST= (0..31)
1 1 145 1 1 1 1 1 1 1 1 1 1 1 1 1 1 1 1 1 1 1 1 1 1 1 1 1 1 1 1 1 
##$CPDPRG= <>
##$CPDPRG1= <>
##$CPDPRG2= <>
##$CPDPRG3= <>
##$CPDPRG4= <mlev>
##$CPDPRG5= <mlev>
##$CPDPRG6= <mlev>
##$CPDPRG7= <mlev>
##$CPDPRG8= <mlev>
##$CPDPRGB= <>
##$CPDPRGT= <>
##$D= (0..31)
0 1.2 0 0 0 0 0 0 0 0.06 0 0.03 0 0 0 0 0.0002 0 0 0 0 0 0 0 0 0 0 0 0 
0 0 0 
##$DATE= 1632379486
##$DBL= (0..7)
120 120 120 120 120 120 120 120 
##$DBP= (0..7)
150 150 150 150 150 150 150 150 
##$DBP07= 0
##$DBPNAM0= <>
##$DBPNAM1= <>
##$DBPNAM2= <>
##$DBPNAM3= <>
##$DBPNAM4= <>
##$DBPNAM5= <>
##$DBPNAM6= <>
##$DBPNAM7= <>
##$DBPOAL= (0..7)
0.5 0.5 0.5 0.5 0.5 0.5 0.5 0.5 
##$DBPOFFS= (0..7)
0 0 0 0 0 0 0 0 
##$DE= 6
##$DECBNUC= <off>
##$DECIM= 32
##$DECNUC= <off>
##$DECSTAT= 4
##$DIGMOD= 1
##$DIGTYP= 9
##$DL= (0..7)
0 120 120 120 120 120 120 120 
##$DP= (0..7)
150 150 150 150 150 150 150 150 
##$DP07= 0
##$DPNAME0= <>
##$DPNAME1= <>
##$DPNAME2= <>
##$DPNAME3= <>
##$DPNAME4= <>
##$DPNAME5= <>
##$DPNAME6= <>
##$DPNAME7= <>
##$DPOAL= (0..7)
0.5 0.5 0.5 0.5 0.5 0.5 0.5 0.5 
##$DPOFFS= (0..7)
0 0 0 0 0 0 0 0 
##$DQDMODE= 0
##$DR= 18
##$DS= 0
##$DSLIST= <SSSSSSSSSSSSSSS>
$$ [...]
##$SUBNAM2= <"">
##$SUBNAM3= <"">
##$SUBNAM4= <"">
##$SUBNAM5= <"">
##$SUBNAM6= <"">
##$SUBNAM7= <"">
##$SUBNAM8= <"">
##$SUBNAM9= <"">
##$SW= 20.0188988654967
##$SWIBOX= (0..15)
0 0 2 0 0 0 0 0 0 0 0 0 0 0 0 0 
##$SW_h= 4006.41025641026
##$TD= 16384
##$TD0= 1
##$TE= 0
##$TE2= 300
##$TE3= 300
##$TEG= 300
##$TL= (0..7)
0 120 120 120 120 120 120 120 
##$TP= (0..7)
150 150 150 150 150 150 150 150 
##$TP07= 0
##$TPNAME0= <>
##$TPNAME1= <>
##$TPNAME2= <>
##$TPNAME3= <>
##$TPNAME4= <>
##$TPNAME5= <>
##$TPNAME6= <>
##$TPNAME7= <>
##$TPOAL= (0..7)
0.5 0.5 0.5 0.5 0.5 0.5 0.5 0.5 
##$TPOFFS= (0..7)
0 0 0 0 0 0 0 0 
##$TUNHIN= 0
##$TUNHOUT= 0
##$TUNXOUT= 0
##$USERA1= <user>
##$USERA2= <user>
##$USERA3= <user>
##$USERA4= <user>
##$USERA5= <user>
##$V9= 5
##$VALIST= <valist>
##$VCLIST= <CCCCCCCCCCCCCCC>
##$VD= 0
##$VDLIST= <DDDDDDDDDDDDDDD>
##$VPLIST= <PPPPPPPPPPPPPPP>
##$VTLIST= <TTTTTTTTTTTTTTT>
##$WBST= 1024
##$WBSW= 4
##$XGAIN= (0..3)
0 0 0 0 
##$XL= 0
##$YL= 0
##$YMAX_a= 140336
##$YMIN_a= -181119
##$ZGOPTNS= <>
##$ZL1= 120
##$ZL2= 120
##$ZL3= 120
##$ZL4= 120
##$ABSF1= 10
##$ABSF2= 0
##$ABSG= 5
##$ABSL= 3
##$ALPHA= 0
##$AQORDER= 0
##$ASSFAC= 0
##$ASSFACI= 0
##$ASSFACX= 0
##$ASSWID= 0
##$AUNMP= <proc_1d>
##$AZFE= 0.1
##$AZFW= 0.1
##$BCFW= 1
##$BC_mod= 2
##$BYTORDP= 1
##$COROFFS= 0
##$CY= 11.3945322036743
##$DATMOD= 1
##$DC= 2
##$DFILT= <>
##$DTYPP= 0
##$F1P= 2.36226072786647
##$F2P= -0.459571619588291
##$FCOR= 0.5
##$FTSIZE= 0
##$FT_mod= 4
##$GAMMA= 1
##$GB= 0.15
##$INTBC= 1
##$INTSCL= 1
##$ISEN= 128
##$LB= 0.24
##$LEV0= 0
##$LPBIN= 0
##$MAXI= 10000
##$MC2= 0
##$MEAN= 0
##$ME_mod= 0
##$MI= 1.114404
##$NCOEF= 0
##$NC_proc= 0
##$NLEV= 6
##$NOISF1= 3.799351
##$NOISF2= 2.8
##$NSP= 1
##$NTH_PI= 0
##$NZP= 0
##$OFFSET= 15.70392
##$PC= 1
##$PHC0= -14152.31
##$PHC1= 9.60088
##$PH_mod= 1
##$PKNL= yes
##$PPARMOD= 0
##$PSCAL= 0
##$PSIGN= 0
##$REVERSE= no
##$SF= 200.130013532006
##$SI= 16384
##$SIGF1= 3
##$SIGF2= 2
##$SINO= 400
##$SIOLD= 16384
##$SREGLST= <1H.CDCl3>
##$SSB= 0
##$STSI= 0
##$STSR= 0
##$SW_p= 3612.71676300578
##$SYMM= 0
##$S_DEV= 0
##$TDeff= 0
##$TDoff= 0
##$TI= <>
##$TILT= no
##$TM1= 0
##$TM2= 0
##$TOPLEV= 0
##$USERP1= <user>
##$USERP2= <user>
##$USERP3= <user>
##$USERP4= <user>
##$USERP5= <user>
##$WDW= 1
##$XDIM= 8192
##$YMAX_p= 0
##$YMIN_p= 0
$$ End of Bruker specific parameters
$$ ---------------------------------
##NTUPLES= NMR FID
##VAR_NAME=  TIME,          FID/REAL,        FID/IMAG
##SYMBOL=    X,             R,               I
##VAR_TYPE=  INDEPENDENT,   DEPENDENT,       DEPENDENT
##VAR_FORM=  AFFN,          ASDF,            ASDF
##VAR_DIM=   8192,          8192,            8192
##UNITS=     SECONDS,       ARBITRARY UNITS, ARBITRARY UNITS
##FACTOR=    0.0002496,     1,               1
##FIRST=     0,             0,               0
##LAST=      2.0444736,     0,               0
##MIN=       0,             -181119,         0
##MAX=       2.0444736,     140336,          0
$$ Real data points
##PAGE= N=1
##DATA TABLE= (X++(R..R)), XYDATA
0@%%%%%%%%%%%%%%%%%%Qj6J6j6J6j6K1k9L2l2M0m8N3o1O9p7Q5r7J08j20J34j47
40g7J62j82K06k27K49k74L02l34L68m04M45m92N41n97O61p33Q18r16J030j166
60f20J334j545J818k184K701l485M798p366J4056o0680j29946K09156M0407k01787
74a33343N4252J93952p4106r7680R9355J7917j04381K0703M8886n3615Q877P9595
86F0412k8125n4367M0973J5407o7812l1203L2380L1805k357k4143K7879P8138
98G8987k7434j03105M1369Q7599r9314q1817J31581N3647j28603J1626J18883
109H3419o8164r4123Q0352J7328r3104N1948Q7695p7634j7032J20288l5374j27931
121g2332O6001P9170j15204m7924J23414J7331r4927K1948P1076l4106m7792J8063
$$ plain form
0 0 0 0 0 0 0 0 0 0 0 0 0 0 0 0 0 0 0 0 8 -8 8 -8 8 -8 13 -16 16 -16 24 -24 29 -32 37 -40 45 -52 56 -64 70 -77
40 -77 85 -97 109 -118 131 -143 159 -175 193 -211 234 -258 283 -314 347 -386 432 -484 546 -620
60 -620 714 -831 987 -1197 1504 -1981 2817 -4549 9507 -51173 -181119 28037 68444 -133343
74 -133343 -79091 114861 40755 -56925 42430 60347 -44034 -23331 25555 -28060 -19183 60412
86 60412 32287 -22080 18893 34300 -33512 -64715 -32335 -530 -2887 -27030 849 78987
98 78987 51553 -51552 -10183 77416 -21898 -103715 27866 81513 -47090 -35464 83419
109 83419 15255 -78868 1484 18812 -74292 -22344 65351 -12283 -29315 90973 55599 -72332
121 -72332 -6331 72839 -42365 -90289 33125 50456 -44471 -22523 48553 14447 -33345 -15282
133a5282J9282j363m369m245K0741K0599k9832k1564K5828q073l3979K2979J8654
146I376l0370K0635M1975m8068k7476P0262q921q9570M1684Q4932o8786n3939
158e8266R4747K1959r8264P614P3610m1101m7342N3090J7565m1386J7325K6463
170B6014l4401n385L3222j9680k6391L3195J5568l0683q06K2665p046j5153j274
183a0155L082J2546K562j9986R425L2191k2497l5618L1242J9619m5092k984M7764
196B2099j1482l0578L1585J2036l9437P220K8493l2201j4324M6441k436m2822
208b5406K6108L4497m2342k3636M1228K857l6984J2820L1073j2060j2634J2082
220G603j30j0588j655l764m18J0654L16m830J1397M193j4208q34N109j3200j837
$$ plain form
133 -15282 4000 2637 -1732 -5977 14764 35363 5531 -16033 9795 1722 -32257 -9278 9376
146 9376 -20994 -359 41616 -6452 -33928 36334 27413 -62157 -20473 64459 -4327 -58266
158 -58266 36481 58440 -39824 -32210 41400 299 -47043 6047 23612 -17774 -449 26014
170 26014 -8387 -13772 19450 -230 -26621 6574 22142 -8541 -9347 13318 6272 -8881 -10155
183 -10155 -7073 5473 8035 -11951 -2526 29665 7168 -28450 2792 22411 -22681 -25665 22099
196 22099 10617 -19961 11624 23660 -15777 -8557 19936 -12265 -26589 19852 17416 -25406
208 -25406 702 35199 -7143 -30779 10449 13306 -23678 -10858 20215 8155 -4479 7603
220 7603 7473 -3115 -4770 -8534 -8952 1702 2018 -2812 8585 12778 -1430 -2264 2845 -10355 -12192
235a2192J6543n400q428K3000O347k7921K721K2938k1549k3201K7117J3251k5689
248a2463N354K8128j2058j8913J4518J943k0066M782J3945r242o41J7236l233
261I290j3529O806L513j4742l275J0774R43k419O009M531l30k469o784l133L035
276a780m717n479J1056R020p314J413J1370p705j3437O062K022j2991L653J5313
290F486m148n257J3371J507j6477m77Q461r666p267J2961O683o474L529P883o046
305E069q129O21j426m262K168N095L017L209J724j753k309l907n398r47K125M19
321d684L829P544J172k974R51k454r215k887L743j024M65R153N063l363L00R55
337F574p933o593K307O43j662O061P571n15j658J182l794p291k004J501N16K587
$$ plain form
235 -12192 4351 -1049 -9477 13523 19870 -8051 -5330 17608 -3941 -27142 -25 13226 -12463
248 -12463 -7109 21019 8961 -9952 4566 6509 -13557 -8775 5170 -4072 -4713 12523 9290
261 9290 -4239 2567 6080 -8662 -11937 -1163 -220 -2639 3370 7901 7571 5102 -1682 -4815 -1780
276 -1780 -6497 -11976 -920 8100 786 2199 13569 5864 -7573 -1511 511 -12480 -8827 6486
290 6486 2338 -2919 10452 11959 -4518 -4995 3466 -6200 -13467 -506 6177 -297 3232 11115 5069
305 5069 -3060 -2439 -3865 -8127 -5959 -864 2153 5362 7086 5333 3024 -883 -6281 -7228 -5103 -4684
321 -4684 -855 6689 7861 4887 5838 3384 -5831 -8718 -4975 -5999 -5534 3619 8682 5319 5619 6574
337 6574 -1359 -7952 -5645 -5002 -6664 -603 6968 6453 4795 5977 2183 -5108 -7112 -5611 -5095 -2508
353b508N480L704L59j845l166l609l666k623J627M542K874K523M017j32n487l400
369a310j243m092j809N168M590Q89L083K869l645n066j671k386k574K407M262
384e28K205K723K212k231l412j806l066k470K244L207J379K900K661k007l023
399I88j154k881k742K002K847P35K798L058j886k953n10k452l127J664K804M01
415d08K479L086j932k753L13k387l796K123L586p72J301M228j222m199n4n60l329
432d296O74L398N63J313K824j615k994N57j726l870K297M158j339O85M633j787
448C475n206Q53n6m752J495N791p24k13N685p64o921K51J700n806j390O911J678
465B007k275L645J982n003k484M18k784lM705J275N82M737k57o206j191K09n538
$$ plain form
353 -2508 2972 6676 7035 5190 2024 -1585 -5251 -7874 -6247 -1705 1169 3692 7709 7577 2090 -1310
369 -1310 -2553 -6645 -8454 -3286 1304 2193 5276 8145 4500 -566 -2237 -4623 -7197 -4790 -528
384 -528 1677 4400 6612 4381 969 -837 -3903 -6373 -4129 -922 457 3357 6018 4011 988
399 988 -166 -3047 -5789 -3787 -940 -205 2593 5651 3765 812 302 -2150 -5277 -3613 -809 -408
415 -408 2071 5157 3225 472 785 -1602 -5398 -3275 311 -461 840 5068 3846 -353 -407 -967 -4296
432 -4296 -3622 -224 339 1652 4476 2861 -133 424 -1302 -5172 -2875 1283 -56 629 5262 3475
448 3475 -1731 -878 -934 -5686 -4191 1600 876 663 6348 5584 -1337 -1086 614 -5192 -6582 329 2007
465 2007 -268 3377 5359 356 -2128 -1710 -4494 -4497 208 1483 2065 6802 6545 339 -852 -643 -6181
482f181j452N658J611K9N160Q88m982K09J71o797k29P881n23k968P962L313r661
499H9l000L945o202o049O857M378k258N509N765n265k505L275n746o554O051L929
515B219m875K954P340l988o146J246j727m607J953K968J198O036L801m190j9K965
531G128p577p304N267K046n573L912P517l715k877L816m055n778N449K125n266
546d885O404R782o474n299P882k472j3214J242P096n205j768Q853J462l611L384
561C177k77o097K290L324n621J001R111j970o456M374J465q446j849L648k202
576d528M13N497q76l91O596k107q496M333N141r248k537J0837m75q344M556M359
592D730p408j540M584l722j059P512j351m966P770L391j0620n89Q980n192p959
$$ plain form
482 -6181 -7633 -1975 -364 -335 4825 5713 731 940 1111 -5686 -5915 1966 1443 -1525 6437 9750 89
499 89 -2911 1034 -5168 -11217 -4360 18 -2240 3269 9034 3769 1264 4539 -1207 -7761 -1710 2219
515 2219 -2656 298 7638 3650 -2496 -1250 -2977 -7584 -5631 -2663 -1465 4571 8372 4182 4163 7128
531 7128 -449 -7753 -2486 -440 -6013 -2101 5416 1701 -1176 2640 -1415 -7193 -1744 381 -4885
546 -4885 1519 11301 4827 -472 7410 4938 -8276 -7034 62 -5143 -6911 1942 3404 -207 3177
561 3177 2900 -3197 -907 2417 -3204 -2203 6908 4938 -1518 2856 4321 -4125 -5974 -2326 -4528
576 -4528 -4115 1382 506 115 6711 4604 -3892 441 5582 -3666 -6203 4634 4159 -4185 371 4730
592 4730 -2678 -4218 366 -3356 -4415 3097 1746 -3220 4550 7941 -2679 -3268 5712 520 -7439
607g439P146M192o607P97M905l601j123L836l674k182P164n43p276N110O235q014
623a074l559P780j196o658L784L014m223K032L126n293O66O724n315n968Q831
638B671K799j0483J427R682m983o536O688K119o027J946L038m338J292M306n437
653a836k031P953j563q022N228N945p328k433P109j364m826L740R40l834L309
668I87J874o115J677O652n643n180Q344J996q789J903P301m617l918N332m73m188
684b857L590P86n119L377M581o517j711Q351j659p798M781N331o377j920N829
699B668j456l648L064j87l332L222J241n134K087N669m273l178O570P20o157J943
715a81L600m461j206L521k747j991M889r81m868M802L963o573o95P658k002o024
$$ plain form
607 -7439 -293 3899 -2708 -1911 2994 -607 -1730 2106 -1568 -3750 3414 2871 -4405 705 6940 -1074
623 -1074 -4633 3147 1951 -4707 -923 2091 -2132 -100 3026 -2267 -1601 5123 -192 -6160 2671
638 2671 5470 -5013 -3586 6096 1113 -5423 1265 3384 -2643 -697 2341 -1997 -705 3601 -1836
653 -1836 -3867 4086 2523 -5499 -271 5674 -1654 -4087 3022 1658 -3168 572 1512 -2322 987
668 987 2861 -3254 -1577 5075 -568 -5748 2596 4592 -4197 -2294 5007 390 -3528 1804 1331 -2857
684 -2857 733 1519 -3600 -223 4358 -2159 -3870 4481 2822 -4976 -195 5136 -1241 -3161 2668
699 2668 1212 -2436 628 441 -2891 331 1572 -3562 -1475 4194 -79 -3257 3313 4033 -2124 -181
715 -181 3419 -1042 -2248 1273 -1474 -3465 1424 443 -4425 377 4340 -2233 -2928 4730 2728 -3296
731c296M688L486n674q24L915k978k801L156q94k945L888K168l936J662M893k976
747A532l034M005M32m208J093K129k691l90J786k532j210L010j291k728M127K814
763B844l548J054M770k320l432K771j07m398R37K097l127j50L660j890k650L776
779B87J095m009J661M526k005j730L606J54l767J41P74k888p31J742q71k67K726
796D44J46j522J819J047k306K43K196j118r04J981m30k256P36L7k847J41K210
813c83j327o21L498Q24k317J304J979k552j421K227l93k114J400J199j971l31
829i99J289j313j189J529M39q00J402J438q12q0P66j107j115N01m21q40J035N42
847B65r78N82J027j353o44J544k56j323J447J331j511k21J578j005j798J040N68
$$ plain form
731 -3296 1392 4878 -796 -1620 2295 -683 -3484 -328 -1222 -4167 -279 1889 -2047 -385 4508 1532
747 1532 -1502 2503 2935 -1273 -180 1949 -742 -1132 654 -1878 -3088 -78 -1369 -4097 30 2844
763 2844 -704 350 5120 2800 -632 2139 2032 -2366 -1429 668 -2459 -2609 1051 -839 -3489 287
779 287 1382 -2627 -966 3560 1555 -175 3431 3585 -182 -41 733 -2155 -2886 -1144 -2015 -2282 444
796 444 590 -932 887 1934 -372 -129 2067 949 45 2026 1596 -660 76 113 -2734 -2593 -383
813 -383 -1710 -2331 1167 1991 -326 978 2957 405 -1016 1211 818 -1296 104 1303 -668 -999
829 -999 290 -1023 -2212 -683 -244 -1044 358 1796 984 904 1670 563 -552 -51 -472 -1312 -277 265
847 265 -713 -131 896 -457 -1101 443 187 -1136 311 1642 131 -90 1488 483 -1315 -275 293
864B93j567L60J755n64p80J245J01j477K32P88q28k28J125O2o04M74J45p56r4
883c18J99l77J47N08j99J31O13m81o13O72o3j088N37J002r22l49J444k48j455
902h60Q39R03j480k42J731l90j395J170Q24j647l45J477n06j217J050Q99r52j56
920b97R68j62p68J30K85k22k29J9L20K53m84j25Q01j79j027O77R26j197m59J609
940H39k30j698R66J307j672o20K029j93j872J092J371j707o29J791k83j581R31
957a59J056j184l18J206j80q92M19M53n01k29K56J83o5l48J25O75l59q34R28O92
977I24j530j98J905p11j948J677J411k467l63K899q48k600K067J708k896n04L040
994A566q70k561J937J639k447m91K410n02j904J067J184j181o05R44L35o08m44
$$ plain form
864 293 -1274 -914 841 277 -503 742 843 -634 -402 386 -442 -670 455 517 -87 387 532 -224 -318
883 -318 -119 -496 -349 159 -40 91 704 223 -390 282 219 -869 -332 670 -252 -601 843 595 -860
902 -860 -21 882 -598 -840 891 501 -894 276 1100 -547 -892 585 79 -1138 -88 811 -141 -297
920 -297 671 509 -259 -129 156 -66 -295 -276 44 297 -187 -312 489 310 -717 -40 886 -311 -770 839
940 839 609 -1089 -123 1184 -488 -1108 921 728 -1144 -52 1319 -388 -1017 774 491 -1090 -159
957 -159 897 -287 -605 601 421 -471 -52 401 -100 -329 -73 110 45 -303 -178 497 138 -696 232 924
977 924 -606 -804 1101 390 -1558 119 1530 -937 -1300 1599 751 -1849 218 1926 -970 -1474 1566
994 1566 696 -1865 72 1711 -736 -1227 1183 681 -1223 -156 1028 -153 -758 186 521 -87 -531
1011e31M56P91o56j029J300R76k070m04K612q05k776K085K106l240o91L977r92
1028A109l611K796K463m095p47M358j327l761K957K368l801n30L777j105k911
1043b060K171J595k450k79K031n45j221O94M46l90j93j86N16O17j216l22K061
1060A269n99k552J917K128l459r12M502r61m473L207L419m952j398N677j221n212
1076c620L579L579n059j081N393j436m489L263K581m183n17L936j149k744K083
1091A36J367k001k55J241j51k96k04k33J117m1k093R51K259k505j615L887J37
1108A701m307K211L821m276k059N474p01n615L392M154n444j561O336j301n644
1123c819L833L715n322j103N404j338m198K994K143l580k57K849j134j465J689
$$ plain form
1011 -531 -75 716 60 -969 331 1307 -763 -1167 1445 640 -2136 -51 2055 -1185 -1876 2101 1109
1028 1109 -2502 294 2757 -1338 -2085 2273 946 -2815 142 2510 -1291 -1821 1956 851 -2060
1043 -2060 111 1706 -744 -1023 1008 463 -758 -64 382 -8 -201 -387 129 746 -470 -792 1269
1060 1269 670 -1882 35 2163 -1296 -2208 2294 1333 -3140 67 3486 -1466 -2864 2813 1592 -3620
1076 -3620 -41 3538 -1521 -2602 2791 1355 -3134 129 2710 -1473 -1990 1946 797 -1947 136
1091 136 1503 -498 -753 488 337 41 -163 -396 721 680 -1413 -462 1797 -708 -2323 1564 1701
1108 1701 -2606 -395 3426 -850 -2909 2565 1864 -3751 -359 3795 -1649 -3210 3126 1825 -3819
1123 -3819 14 3729 -1593 -2696 2708 1370 -2828 166 2309 -1271 -1528 1321 187 -1278 411
1138D11K91r25O51p9n73R05o11j381J791N55k912J066L166l010k185M685J71n249
1156c233K565M723m635k449O104l89o172K908M192n353j908N753j000m856L559
1171a91L172m414m19M530j445k965K819J299k858J25J588j513q72O80p98k4J139
1188a47r39J5K588n98j955K663J234l720M50L551k964k941M047K49n211J742M042
1205B106m125j953N740R3m653L381M022m393j447M723j422m512K423J857l914
1220b074m09K997j457j767K328N88j406J430J302q15P54Q65j389J3P18k261r99
1237a582J854j420k320K702J307l230J122M024k177k091M345Q24m252J518L393
1252D017l774k444L615q37m389J951K620l191l65M062n37k200K712J480k527L15
$$ plain form
1138 411 702 -223 428 349 -224 681 70 -1311 480 1035 -1877 -811 2355 -655 -2840 1845 2016 -3233
1156 -3233 -668 4055 -580 -3029 3075 2686 -3486 -578 3614 -1739 -3647 2106 1106 -3750 -191
1171 -191 2981 -1433 -1852 2678 1233 -1732 1087 2386 -472 -347 1241 -272 -1144 -464 -1262 -1286 -147
1188 -147 -1086 -1071 1517 919 -1036 1627 2861 -859 -409 3142 178 -2763 1284 1533 -3678 -1936 2106
1205 2106 -2019 -3972 1768 1861 -2792 589 4611 218 -1229 3494 2072 -2440 -17 1840 -2074
1220 -2074 -2483 514 -943 -2710 -382 206 -1200 230 1532 717 1471 2336 947 960 1678 -583 -1582
1237 -1582 272 -1148 -3468 -766 541 -2689 -1567 2457 280 -1811 2534 3358 -894 624 4017
1252 4017 243 -2201 1414 577 -3812 -1861 759 -2432 -2797 1265 728 -1472 1240 2720 193 508
1268E08J985j610j235J317p18j614P11j52j338R61Q10j159J051K007j203l04K435
1285B452p18k328J722Q50l150l7K548k062k099K847M53l079J443K910k159q71
1301a278L406j60k729J639J482k793o42K113j202j787J739N09j735P70J365j181
1317d84p3J541n79o85J393j29j369Q85M47j793J33J354j322p55J969j06j691J429
1335A65J214k007m7K086j107j513J902M28k158O52J617j699p82J971l66j607J426
1352A75R29j703J87J568j137r77J490r3j452R22R03j324M0J341q10p48J258n6
1370E13j195Q34O75j310O5J167r72p53J325r9j271J021R42j385P7J551q85j103
1388h03J408J75j702N88J221j365n08J588l73j300J145P43j370K19J341q52p05
$$ plain form
1268 508 2493 883 -352 965 247 -1367 -656 -808 -2146 -1185 -375 -1534 -483 1524 321 17 2452
1285 2452 1734 -594 1128 1978 -1172 -1209 1339 -723 -2822 25 478 -2601 -1158 1752 -407 -1278
1301 -1278 2128 1968 -761 878 2360 -433 -1075 1038 -164 -1951 -212 297 -1438 -668 697 -484
1317 -484 -557 984 405 -280 1113 984 -385 500 947 -846 -713 641 -681 -1436 533 427 -1264 165
1335 165 1379 -628 -675 1411 304 -1209 693 1121 -1037 -385 1232 -467 -1249 722 356 -1251 175
1352 175 1104 -599 -412 1156 19 -958 532 439 -1013 -91 812 -512 -472 869 59 -689 569 513
1370 513 -682 152 827 -483 -418 749 -223 -976 349 250 -1021 0 942 -443 -366 1185 300 -803
1388 -803 605 780 -922 -334 887 -478 -986 602 229 -1071 74 817 -553 -334 1007 155 -550
1405e50J211r3j207O18N97j084rR74n94m93R63q7q13P13M06r45K76Q59q36l47
1425d41J084l82j011Q90M15j293K72J201r34o52J454m1j363Q24R68j356k97J454
1443G92n19j194J066N69j306J57J114o78o15R82L6q37M68M22o93N4N22n00j53
1462c13O26l36l86P50l0p64N89N13j020k0J037o42q23J109K60j273M75J084j024
1481a88n08J253j67j154P78P09j070m1J035n19o97Q19Q0q55L88N20o96L5P25m60
1501a3l61P50j23p24O16L71q86J78Q11o87m94R46j47r51O67O04r62K7J083n38
1521A67p20R15J36j064L53P08p43k05Q55k51n69O52P8p14L74M00p24J10P51n76
1541f7l85R15j69r26P23N31j127R5J166p25p98J223J54j393N27J093j094n06J376
$$ plain form
1405 -550 661 568 -639 -21 576 -508 -517 457 -137 -630 333 246 -567 146 552 -393 -117 742 -94 -441
1425 -441 643 261 -750 140 555 -738 -466 735 -199 -851 603 562 -801 23 991 -365 -662 792
1443 792 273 -921 145 714 -592 -435 679 1 -614 368 404 -433 35 457 -236 -182 340 -160 -313
1462 -313 313 -23 -409 341 311 -453 136 649 -371 -391 646 4 -819 290 550 -723 -248 836 -188
1481 -188 -696 557 390 -764 14 723 -347 -388 647 128 -569 250 330 -525 -137 383 -313 -278 447 -13
1501 -13 -374 376 253 -471 145 516 -370 -192 619 -68 -562 384 237 -714 -47 557 -405 -378 705 167
1521 167 -553 362 498 -566 -213 495 -248 -453 402 151 -418 234 312 -402 -28 372 -352 -242 509 -67
1541 -67 -452 463 294 -632 91 622 -505 -410 756 31 -767 456 610 -783 -256 837 -257 -763 613
1560F13j34j180P48O88j077j42R45m29n91P28J30o10L65L09n54J32L74n49j6O22
1580C72n00l63R02j27r37P82O27j244j3J371p38j110J354M26j651M02J477j143
1598a13q52J627L1j569P57J104j331l93J409l98j094R36N20j088J61Q49o16l61
1616d21P26j89m85N55j2n75N14K24q02L68P41r04k29J219m85j165J133N19j638
1635i06K87J607j055r79J812K40j880P44J452j644p72J831k91j669J141J063j527
1652e46j48J525o37j014J100L29j054M32P24p58j28O28n71l80O73l76n29R12R2
1671B74r67P80P85j297p9J520q13j192J642M82j964N01J676j663j209J995n6k090
1689a675J202J745j662m10K197m31j779J203Q30j803j26J462p88r55J138J34j091
$$ plain form
1560 613 479 -701 47 735 -342 -484 461 32 -559 169 299 -311 54 363 -191 -59 315 -234 -250 372
1580 372 -128 -491 411 284 -653 129 756 -488 -501 870 132 -978 376 802 -849 -447 1030 -113
1598 -113 -965 662 693 -876 -119 985 -346 -739 670 272 -822 114 634 -454 -293 556 -60 -421
1616 -421 305 116 -369 186 174 -401 113 337 -465 -97 644 -260 -489 730 245 -920 213 732 -906
1635 -906 -619 988 -67 -1046 766 1006 -874 -130 1322 -322 -1094 737 446 -1223 -82 981 -546
1652 -546 -694 831 194 -820 280 609 -445 -13 711 -47 -175 453 -118 -498 175 -201 -730 182 274
1671 274 -693 87 872 -425 -504 1016 203 -989 653 1135 -829 -328 1348 -315 -1524 471 415 -1675
1689 -1675 -473 1272 -390 -800 1397 966 -813 390 1220 -583 -709 753 -35 -990 148 282 -809
1706h09M66N87p33K11P50m16O4Q21n54n34Q95m36j307Q81O16j599J88J831j009
1725h7j260J957M22k199P70K014j615j018K368n9k339J015J400k190p27K051n16
1742a3j624J538J123j487J61J494p63q89R92J9r34M57L29p32K03L36q14Q4P49
1761B29p43k40J362j97j042J236O64j726P9J583j275j292J858L07k097Q52J818
1778A376j747r64K190j57k071J242J533j748l88J949n70j576J129N94j558J30
1794f36J178p53m86J075o9p28O28K05p36L55L88p78J95P66q10l60J159l78j156
1813i41J096O73j543J69J617r69j147J604L03j816N87J471j387p49J782j72j603
1830a025J047J053j512k03J517o27j141J092L95j225L06R44p16k96Q93k66o43
$$ plain form
1706 -809 -343 244 -489 -278 472 56 120 941 387 -147 748 312 -995 -114 502 -1097 -909 922 -87
1725 -87 -1347 610 1032 -1167 -397 1617 2 -1016 1352 1293 -1046 -31 1369 -821 -1548 503 -13
1742 -13 -1637 -99 1024 -463 -302 1192 429 -460 532 551 -383 74 403 -329 -126 210 -604 -520 229
1761 229 -514 -754 608 411 -631 605 1269 -457 -378 1205 -70 -1362 496 803 -1294 -442 1376
1778 1376 -371 -1335 855 698 -1373 -131 1402 -346 -734 1215 645 -931 198 792 -766 -636
1794 -636 542 -211 -697 378 309 -419 209 414 -322 33 421 -357 -162 604 -206 -566 593 215 -941
1813 -941 155 828 -715 -546 1071 102 -1045 559 862 -954 -367 1104 -283 -1032 750 578 -1025
1830 -1025 22 1075 -437 -640 877 250 -891 201 596 -629 -323 621 -95 -391 502 236 -407
1847d07O12L3p63M38M47p62J77Q55o44m32R67k39j039P74N87j178J55J306p64
1866A23q68J255J13j528M90J133j108m43J522j02j171Q49O66j258j63J045o01
1883d6p05R84J98q91M14N60q43j94P25l52l71Q42J87n21M96L14q71j13M70p59
1903d76m34Q80j6o45P88N90r14QQ98o34o49J015K12r24N07P53r87m89P83n00r87
1924a221P47N68p17L91J107m07m56P11j47r09K96L62o07M6O19l96l77M48k93o39
1944h74M42L47m26M71Q89k94k10O27l18r77K23J62q49P2Q50l01l71P94O0q02K67
1965b18N52n37j9Q92m5m34M80Mq82j17K08o59j25P25K0j89P07K60n93J15L55n89
1987h9k07O10q5l92N23J48p53k9L05o25k87P42R9l06O51N02n29r0L72m91m96L89
$$ plain form
1847 -407 205 238 -525 -87 360 -402 -225 630 -14 -446 521 282 -757 17 604 -574 -419 887 123
1866 123 -745 510 623 -905 -415 718 -390 -833 689 587 -584 265 931 -327 -490 555 -46
1883 -46 -751 233 431 -460 -46 514 -329 -523 202 -150 -521 321 508 -13 483 797 -74 -187 283 -476
1903 -476 -910 -30 -46 -691 97 687 -227 -219 679 45 -604 411 623 -301 206 959 -28 -517 266 -234 -1221
1924 -1221 -474 94 -623 -232 875 468 12 723 576 -333 -37 325 -282 -236 383 -13 -390 58 -235 -874
1944 -874 -432 -85 -511 -40 849 555 345 972 654 -323 -100 62 -787 -715 135 -166 -537 257 317 -485 -218
1965 -218 334 -203 -222 670 625 191 671 675 -207 -324 -116 -775 -900 -175 -155 -344 363 623 30 145 500 -89
1987 -89 -296 314 229 -163 360 508 -245 -274 31 -594 -881 -139 -40 -346 305 807 278 188 560 69 -427 -38
2009c8M2l89L43L59l85o9L20l32k97L70P0j96M06K94l37P1K44n36k95L98j83m50
2031e90N51L82n21Q6N92m08n10N31R9o10K74N83m38k25N49j51n60K78K77m51K3
2052b39M78j41k28L02Lk91J06P2k18J32J42k30O7K47k60j35L87p1l51L53K27n41
2074a89RM81l93l75O03J26o00K94N57n60l33O23r9o22M00M78m60p9N90k54m96
2095b99K48R1m31J01L85o2J7K83o9j91J5k12j90K20L4j40L97K85m37n7L55m89
2117a46m88N26K10n08M14P22m77l92N68k43q86L20N19n13K1R06m1n87L22J17p51
2138c87j52M36j25o6N52J75j90Q6r2m58q1L0j95K48M58o6M7L91l32o08K45L1o48
2161g01K79Q41k77k48P93k6j028Q8M89p37k81R98J95n55N16M85q05l95M45l32
$$ plain form
2009 -38 4 -385 -42 317 -68 -137 183 -149 -446 -76 -6 -202 204 498 161 232 476 -60 -355 43 -140 -590
2031 -590 -39 343 -178 -92 500 92 -418 113 212 -398 -124 459 21 -204 345 194 -366 -88 189 -262 -239
2052 -239 239 98 -130 172 175 -116 -10 62 -156 -24 118 -112 -45 202 -58 -193 194 123 -228 125 352 -189
2074 -189 -180 301 -92 -467 136 262 -338 -44 513 -47 -380 243 144 -478 -78 400 -60 -139 451 197 -299
2095 -299 -51 40 -391 -290 95 33 50 333 264 73 88 -124 -314 -94 -60 -200 197 482 45 -12 343 -146
2117 -146 -634 -108 102 -406 8 730 253 -139 429 186 -700 -380 139 -374 -353 553 512 -75 247 364 -387
2138 -387 -539 -103 -228 -294 258 433 243 329 237 -221 -302 -272 -467 -219 239 173 220 611 279 -329 -84 -53 -701
2161 -701 -422 419 142 -106 687 661 -367 -279 210 -527 -808 190 385 -170 346 831 26 -369 76 -256
2181b56m87N37M31k09K24L52l34k86J0l13j57K78O0O4N07O0m01J64N7p59r4O26
2203G4k62l07Q77L38q14J17O06p94o35P98J45p31N33Q45o06l63O50k45q75L40
2223c09M33n10Q2P53j04l82L19Kn22m1J50j34J21K47o8J78K18m29k10M01k56n56
2245f17N45M56o03P6P97m20o66O12J10q95K63Q19n79l43R73j7r55L66O11q13l29
2266f09Q29k0n77M19M00m65p9K92k73j59L04j23j62L88M8l39K16J77m23PK99l29
2288a79r4N18j55m38O06K32q32R4Q13n74o61Q54K72r03J90Q13n07m43O89k4o75
2309d04L99L52o44L4O77l75m67O03J64o38J02M30k97j22L03q4l9K86k10k82M43
2330B31l1o85K36N74n41k62P67K2o00L94L45o39JN73m49l62Q10K3q40L86O28q36
$$ plain form
2181 -256 -743 -206 225 16 240 592 258 -28 -18 -331 -488 -210 -150 -86 421 481 80 244 301 -458 -552 74
2203 74 -188 -495 382 720 -94 23 629 -165 -800 -2 143 -588 -55 790 184 -179 471 226 -649 -309
2223 -309 124 -386 -304 449 345 -37 282 284 -238 -279 -129 -263 -142 105 37 215 433 4 -206 195 -61 -617
2245 -617 -72 384 -219 -143 654 234 -432 180 290 -605 -342 477 -102 -445 528 511 -444 -78 533 -280 -609
2266 -609 220 200 -377 42 442 -23 -102 190 -83 -242 62 -61 -223 165 213 -126 90 267 -156 -149 150 -179
2288 -179 -273 245 90 -348 258 490 -342 -248 565 -9 -670 184 456 -447 -257 556 49 -394 295 271 -404
2309 -404 -5 347 -297 -263 414 39 -428 175 339 -299 -197 233 -64 -186 117 33 -6 280 70 -212 231
2330 231 200 -485 -249 325 -216 -478 289 311 -289 105 450 -189 -188 385 -64 -426 384 407 -433 -47 581 -255
2352b55m71Q28j0o97M55O24l56nM10k96k83K58k85m18M54J90n08J80N34m05l31
2373c87M09p9l09M14K15k61M11L71o74k19N65n35q71N88N04p21R2R88j92n41M96
2394B64J10o42K14M16m10N1P02l62o16M04Jr07j5O11j99p6O82K40j70K26o3m74
2416a3R8J09n60P7O78k99m77M90P3p91K2M99k91J4Q01O5k62N27M2q92n7M30o89
2439d06m62Q03K37o05L06N60m82l29M10o7k21M61K07k15L07J59o45k18K51m54
2459d03m37N15K69k65L48M09l25p1L18l64l16N47M5m98L96M65o83l41N12k42o39
2480g60M10M65l26J70N93k22k97L43j58n73K62K78m39J7N57j85l84K69O4l90J02
2501b04K45j47J17L14k15r9L23k43m55L23J81m73J01N61k70l17M64K3n46K26L65
$$ plain form
2352 -255 -726 102 92 -605 -150 474 118 113 523 227 -56 202 -83 -501 -47 143 -365 -185 349 -56 -387
2373 -387 22 -57 -366 48 263 2 413 784 110 -109 456 -79 -950 -362 142 -579 -487 501 309 -232 264
2394 264 374 -268 -54 362 -48 3 705 343 -273 131 132 -775 -790 -179 -378 -454 228 468 298 524 461 -13
2416 -13 85 194 -366 -289 389 90 -387 103 176 -615 -593 -94 -385 -371 430 495 233 760 802 -90 -147 283 -406
2439 -406 -868 -65 172 -433 -127 433 -49 -378 32 -35 -256 205 412 197 504 663 18 -200 51 -403
2459 -403 -840 -325 -56 -321 27 436 111 40 358 -6 -322 225 270 -228 168 633 -50 -391 121 -121 -760
2480 -760 -350 115 -211 -41 552 330 33 376 218 -355 -93 185 -254 -237 320 135 -249 20 84 -306 -204
2501 -204 41 -106 11 325 110 11 334 91 -364 -41 140 -333 -232 329 59 -258 206 229 -317 -91 274
2522B74m31o8N58j80m71M15J99n78L1N04k19k85M12J04l69J00J74k70l6K32j75
2543g9q7K89q3k46K21J09k98R1L22j97j02L09j31l03K17N3m06J37L93l03j47N06
2565B65k4n07K38L15m46p3M99r1l31L20J14m49J1K52k72j57M04M7k27K27J98k90
2587B3q4J61j60j07J95k1p8K24mk68R4J39l62n1L90m9k11L39J94l76k8K39k92
2610i3k18L12K2k20K49K43l10p7K87k03k97K63J28k19J43K55j69j01J55j68k14
2631b32J85M9j94J76K58j87q5K10j29k54J44O6j90J41K11j53l9K39j63k75K10
2652a2P7k80Q3L37j28j61K39J7l21O4J42k00j3K59n2j11J95K1k20L8R7j66k8J81
2676E8n6n7J70l5j84J25O2k54L9K70j26j69K93O7l08O1J96k12j21K31k0j76J74
$$ plain form
2522 274 -157 -225 333 153 -318 97 296 -282 -251 253 34 -251 161 265 -104 -4 170 -100 -136 96 -79
2543 -79 -166 123 40 -206 15 124 -174 -83 239 42 -60 249 118 -185 32 85 -321 -184 209 -94 -241 265
2565 265 241 -266 -28 287 -159 -232 267 176 -155 165 279 -170 -159 93 -179 -336 68 115 -112 115 313 23
2587 23 -61 100 -60 -167 28 7 -71 153 149 -119 -25 114 -248 -299 91 42 -169 170 364 -12 -40 199 -93
2610 -93 -311 1 23 -197 52 295 -15 -92 195 -8 -305 -42 86 -133 10 265 96 -5 150 -18 -232
2631 -232 -47 2 -192 -16 242 55 -30 180 51 -203 -59 7 -183 -42 169 16 -23 216 53 -222 -12
2652 -12 65 -215 -132 205 77 -84 155 172 -149 -85 57 -143 -156 103 51 -60 135 156 -64 -26 71 -95 -123 58
2676 58 2 -55 115 80 -104 21 83 -171 -132 138 12 -157 136 203 -105 -44 152 -60 -181 50 30 -146 28
2699B8J22k38M6J97j83j41K33Nk09J29J56j52k5J50j09r5J08nj35J33P2j46M3
2722a6J63j29r3J51n1j46J18O4j65O9J85j89q3K65p8k73J80J98k78l3L25r0k48
2745a54J89J21k74j4K24j08j20K24J4j70R1R0j65j7J25q9m9J40j4p0J12jj67O4
2769a8R6j75k7K30p8j46K02N6k46M3J98k00j16K67j6k24J97J55k70l9K43j43j97
2792b08K35R2k26Q0K24j91j15J99n5j95J26J16j35L4J55j00n5R6r7q5J23k9j15
2815a26J75R6k13K4K18j99j80K54M1k45J46K36k41q7K78j18l01K07J52l04M3L37
2837A93j34j86K17M4k61M6J51j14rJ71o1p6J36o2k06R6Q8j91O1K12o9o1J64l9
2861A10j63R1K2k02Q1K21j99r1K91m7l50J50K03k70n8L43k0j78K04Q9k71kJ70
$$ plain form
2699 28 150 -88 -42 155 -28 -169 64 69 -140 -11 145 -7 -32 118 9 -86 22 17 -118 15 87 -59 -16
2722 -16 147 18 -75 76 25 -121 -3 61 -104 -35 150 -39 -122 143 65 -208 -28 170 -108 -141 184 94 -154
2745 -154 35 156 -118 -132 92 -16 -136 88 102 -68 23 113 -52 -69 56 -33 -82 58 44 -26 86 85 -82 -18
2769 -18 78 -97 -124 106 28 -118 84 140 -106 -63 135 -65 -181 86 70 -154 43 198 -72 -111 132 -11 -208
2792 -208 27 119 -107 -27 197 6 -109 90 35 -160 -34 82 -53 -19 136 36 -19 77 -20 -105 18 -11 -126
2815 -126 49 145 -68 -44 174 -25 -205 49 90 -155 -9 227 -14 -101 177 59 -242 -35 117 -187 -144 193
2837 193 59 -127 90 134 -127 -81 70 -44 -53 118 57 -19 117 55 -151 -55 33 -158 -97 115 46 -15 149 110
2861 110 -53 38 60 -142 -61 160 -39 -130 161 114 -236 -86 117 -153 -211 132 112 -66 138 227 -44 -46 124
2884A24k38q7K52j1k04J70J50k11n4J54n2o6J16J3j7J50o3j82J09N9k99m3L01
2907G1p2k03K44J59k61K9J88j67j07K23k8j89K18J02l15j1K47j91k41K50J18j93
2929a29P2K04q2n0J01j14p1J50n8j78J82J19k38l1K33j20j65J80M1j16J10J04
2951A44j71N7J83k46j43K90j1l32J69K61k44j26K61jk42J33J07j46M2J42j57l5
2973f5J93j07j85J73R3k10L2J89j21p3J40m5r3J43kj86J51J62k67o9L07q3k91
2996b14J93K01k34k2K34r3j60J55j5j67J22R9k03M4K34j55j57J92L1j93N4J47
3018I3j12qJ14j02m3J32q0j70J93J09k38L5K83j44k02K15L1k53Q5J59j74J0K05
3041A38q5j32J78M1k82O8K24j86j28K46K4j76O2R0j32oP6r1j0J70n4r2J83J1k19
$$ plain form
2884 124 -114 -201 51 40 -164 6 156 -55 -109 45 -7 -73 43 56 39 189 126 -56 53 112 -187 -230 71
2907 71 -1 -204 40 199 -62 -33 155 -12 -119 104 76 -113 105 207 -108 -119 128 -63 -304 -54 64 -129
2929 -129 -57 147 65 15 116 2 -69 81 23 -155 27 146 -92 -123 110 -10 -175 5 46 -70 40 144
2951 144 -27 30 213 -33 -176 114 103 -229 -60 201 -43 -169 92 91 -151 -18 89 -57 -15 127 -30 -65
2973 -65 128 21 -164 9 102 -108 -76 113 -8 -81 59 14 -79 64 62 -124 27 189 -78 -147 160 77 -214
2996 -214 -21 180 -54 -76 158 65 -95 60 45 -122 0 99 -104 -60 174 19 -138 54 85 -108 -54 93
3018 93 -19 -27 87 -15 -58 74 -6 -176 17 126 -112 -77 206 62 -140 75 106 -147 -62 97 -77 -67 138
3041 138 53 -79 99 140 -142 -74 150 -36 -164 82 106 -70 -8 82 -50 -56 20 -71 -81 89 35 -57 126 137 -82
3066h2K9J37j79q0J98j1j23J48P9j99O5J47j99p5K64pk22J74J70k40r8J76j08
3089c6j96J50O5r6J24J54j14oJ49j38j71J34K9j65Q9J34j08n0R7j09j20J24J0
3112e0j00J78J77j23RJ74j59k37J16j1j85R1J85r6rJ70r9j75J30L5j79J27K56
3135B25r2p8K06p0k89LN4k03J4K09J2j8J80Jj71L9L8j59kJ78j1l7J24k9j86J5
3161d7l6j84O6J76l8M8K42Mk05N4L8k36n0J92m3n2J99L8k06K4N7k08n9K25J7q5
3187f9K17J39j98n0N5j48j40J10M1n3J47Q9j11qL6j42p3J18J7l0J42Q0j11RJ3
3212H0k01m0J34n5n6K26J15k02L1J44k09j73J84M2j32J19J69j11q2J25j21j44
3234a57J04O6r1Q6J53p5q1L8n2j21L8L4pJ04P1p1OO4j68j10J32L0j07J37J56j37
$$ plain form
3066 -82 -53 84 -95 -175 23 12 -111 37 116 -83 -18 129 -70 -145 119 112 -110 64 234 -6 -104 72 -36
3089 -36 -232 -82 -17 -113 11 165 51 45 194 56 -115 19 48 -117 -28 106 -2 -52 45 -64 -184 -60 -50
3112 -50 -150 28 205 82 91 265 106 -131 -15 -26 -211 -120 65 -31 -40 130 31 -144 -14 21 -158 -31 225
3135 225 133 55 261 191 -98 -95 -41 -244 -230 -21 -9 -27 153 154 -17 22 60 -99 -101 77 66 29 153 124 -62 -47
3161 -47 -83 -267 -201 -25 -63 -15 227 231 26 80 118 -118 -168 24 -19 -71 128 166 -40 -16 41 -167 -226 -1 16 -69
3187 -69 148 287 89 39 94 -54 -194 -84 -43 -96 51 140 29 21 57 -85 -158 -40 -23 -53 89 169 58 67 80
3212 80 -121 -161 -27 -82 -138 88 203 1 32 176 -33 -206 -22 20 -112 7 176 65 -17 108 -13 -157
3234 -157 -53 13 -78 8 161 86 5 43 -9 -130 -92 -58 -65 39 110 39 45 109 -59 -169 -37 -7 -114 23 179 42
3260D2o2J06j30j54J26N6r1J22J93j25q8J24o7k26P1J35j01L0J85k6j22M1l4j46
3284a41K1Q7j7O7J28pp6J4q8j29L9J9l3J26J14n8k0P8j21j86Q8R0j31P5K45m9
3310A35j36J12j6k47j8J35n6j9K08P0j15L2K4j79p8P3Qj1J45O4l8J0l9j12m1%
3336h9m4N4J48Pj6Q2m0j88OL2j16K0K05K9q7J28K5k18l3J01j25o2K02R3j10O9
3362G3J15j67j21P1pj06R4J26m4J6N9n3q4j6l4j7O8K6PP8J3r6oL3j11m8J34J3
3390A6q3J01J10j49l9J11p6j29J04Q6j18M2J52q4r8R8Rj44L6J02o5j8J08j1o5
3415dL8qo5QM3n1J9M6k2j4N6l8n0N1%p7M6Q1r5j6J44m3j40Q9P8j49k0J49l4j05
3445h3J12P3j35qJ01p1q1Q9L1q5N4O8n1k7M1j4n4K4LnN8j3l4N1Mq7mQ2o9m5J05
$$ plain form
3260 42 -20 86 -44 -198 -72 -16 -107 15 208 83 -5 119 52 -174 -103 32 -69 -39 146 120 -2 39 5 -141
3284 -141 -120 -33 -50 17 145 138 62 76 -12 -141 -102 -83 -116 10 124 66 46 124 3 -183 -95 -5 -136 -61 184 135
3310 135 -1 111 95 -152 -170 -35 -91 -110 98 168 53 85 109 -70 -148 -75 -67 -78 67 131 93 103 64 -48 -89 -89
3336 -89 -133 -79 69 76 60 142 102 -86 -80 -48 -164 -144 61 90 3 131 156 -62 -95 6 -119 -181 21 114 4 73
3362 73 188 21 -100 -29 -36 -142 -48 78 34 50 109 56 -28 -44 -78 -95 -27 -1 6 84 97 1 -5 28 -83 -131 3 16
3390 16 -67 34 144 -5 -44 67 -9 -138 -34 52 -66 -24 128 44 -54 44 53 -91 -55 47 -18 -36 72 61 -4
3415 -4 34 26 -39 -31 12 -39 -20 26 4 -10 46 8 -42 9 9 -68 -22 59 -36 -52 92 49 -91 -2 76 -73 -93 56 22 -83
3445 -83 29 102 -33 -41 60 -11 -92 -3 28 -57 -3 65 14 -13 28 14 -40 -16 -13 -18 40 27 -7 44 48 -39 -43 39 -30 -75 30
3476C0M0j06M3Q2j22n6R9k6q1R6Q4j00kJ16q1j14J04K6j11M0J30n7n0N9j8q9R
3503e5M4l0J9O8%LQl8m4J4k6j6O5K7n2L1O2j11n7J01k4r3J05J20r6k7J10m7j71
3532a10M0P1j00KJ48j0o5O1J5j09mO0k1jR0L6m8Kk8q7k8j1rM5Q6NK1M9m8p6K0
3563drn4N0R1k5l6P5n3j56J4L4q5N2J68J0l4R8J9j62m5N5o2n3J12P8o1JK7p2q5
3593a12J0J2K5O8O9M7L2k8p8l8m3q4K1P4J2oR1kj07j5L3p5rJ45N4l9P5L4j35q2
3623e1%o3p3Q5Q3pO7N8n1o4J8k2o1N6R2pJ6L9p4q0k7l6l6N5P0K6N5M6l4l0j6o6
3655c2n2O2L2j5N5N3q0o8L7o8o8R1N5j4N4Q6l7q2Nl8o9J8O7oK9O7k7n3Ok0o7K3
3687e6N8MK0P0k3o4Nk8n7RL7J6L0N5j7k9Ml8p2J4N0j4K9O2k2l6Lj5n4MO7k5J4
$$ plain form
3476 30 70 -36 7 89 -33 -89 10 -16 -97 -1 83 -17 -19 97 16 -98 6 32 -79 -39 91 34 -16 43 25 -64 -55
3503 -55 -11 -41 -22 46 46 49 57 19 -25 -11 -37 -53 12 39 -13 18 80 -31 -88 13 -11 -104 1 121 25 -2 108 61 -110
3532 -110 -70 1 -99 -97 51 41 -24 37 52 -57 -61 -1 -22 -23 67 103 55 57 29 -58 -86 -97 -106 -61 25 30 51 100 52 -24 -4
3563 -4 -13 -67 -17 74 49 13 88 35 -121 -107 -73 -158 -106 62 72 38 136 155 -7 -52 3 -59 -112 0 78 17 18 45 -27 -112
3593 -112 -102 -90 -65 3 72 119 151 123 45 7 -36 -120 -99 -25 -13 -19 72 70 -37 -52 -19 -94 -103 42 96 57 132 166 31 -51
3623 -51 -51 -114 -187 -102 -19 -26 41 99 48 -16 2 -20 -81 -25 67 60 76 115 41 -39 -66 -102 -138 -83 -13 13 68 114 80 50 34 -32
3655 -32 -84 -22 10 -5 50 103 23 -45 -8 -76 -144 -53 2 -12 42 128 91 9 14 -24 -93 -75 -8 -14 15 82 55 2 8 -12 -79 -56
3687 -56 2 6 26 96 73 9 14 -14 -71 -62 -25 -9 21 76 59 30 34 -4 -76 -62 -12 -26 3 65 43 7 10 -5 -59 -55 12 -13 1
3720AP9j1o7J0pp5j3N8QpP5J4m2NLn6j6N2qkM0J3n3Pj2m6j3L8jJ3O1J4m0PPo1
3756b5kL9j8j7M3J6n3J7J0o2j5N9Ok4N7M2n9QK2m4n1N1Ll5L6K5k3mK6k3k6K6N
3789A0j1K6K0l4QJ7l4k8L6j9k2L5K6l3ML3l5m1M7J3m9J4N2l4j4K7nl8K8J7m3J2
3821a5L8j7l5M9%l5J9L3l7mK1j0j9J6Qk0K3J9m5KK0k0j5L1Ml3K9K4o3K1L2l9k2
3854d0N1J8n3K6L5n9j6M5k0l2L2L0k8J4M9m2k2L0k6j7K6Mj3K3K9l5oJ9k6l3L6
3885aJ3l4L7K8k7k8M0k4m4K9K0l2K4N6l7l8K5rm3PM7l7K3M1rk8Qkn4J2M3j6QL7
3919C5Nl7Rjm0J1K7j8J0M9k1l1J6qm6J0M2k6J4M2pm7L1qn1JL5jk0N8Qm7J0Nl7
3954b8k6M4Jj0M7J1l2RKm3j2J8j1J2N3Pl0J8j3n6OK9orO1%l7J3Mn1j8L6oj3N5
$$ plain form
3720 1 80 69 2 12 5 -70 -83 -25 -17 -24 51 65 23 28 31 -25 -41 11 3 1 41 54 1 8 -4 -50 -63 -25 -26 -13 48 62 22 29 36 -25
3756 -25 -27 12 -6 -23 20 36 -17 0 10 -52 -67 -8 -2 -26 31 73 14 22 44 0 -51 0 3 -32 4 29 6 2 28 5 -21 5 10
3789 10 -1 25 45 11 19 36 2 -26 10 -9 -31 4 30 -3 1 34 -1 -42 5 18 -31 -17 35 1 -13 14 9 -29 -1 16 -27 -15
3821 -15 23 6 -29 20 20 -15 4 37 0 -4 17 7 -12 4 12 -8 15 34 -11 -9 11 -9 -24 7 11 -22 7 31 -32 -11 21 -18 -40
3854 -40 11 29 -24 2 37 -22 -38 7 -13 -45 -13 17 -11 3 52 10 -12 18 -8 -25 1 5 -8 15 44 9 3 22 -4 -37 -1
3885 -1 12 -22 15 43 16 -12 28 4 -40 -11 9 -23 1 57 20 -18 7 -2 -45 -38 9 -28 -5 36 27 -1 7 5 -49 -37 6 -10 -2 35
3919 35 40 3 12 11 -29 -18 9 -9 1 50 29 -2 14 6 -40 -30 12 -14 0 42 35 -12 19 11 -40 -39 -4 -5 -25 33 41 -6 4 9 -28
3954 -28 -54 -10 -9 -19 28 39 7 16 18 -25 -37 -19 -30 -18 35 42 12 30 17 -39 -33 -4 -10 -19 42 42 5 18 22 -29 -47 -11 -17 -30 25
3989B5J8k5KOl8k8K3%qL3K2j7JK0m5k1K0mrL7L0l6J2J2l3k6K5pj8L9J2j2QQl9
4024a3j8J6Pj5L8K2j9mK0m4k3RQk9L5L4j5mJ8j8l9J7Jj3K9K7kj5Rk7k2J9lj0K5
4059AJ9j3PK1l6l4L6%k3K2L4j7qK5k6l5J2%j5J4M5j7rK8k1j9MJ5m0JL3oj2K7j1
4094Bl0OJ0j5K6J8kLPj0k7J0mj8KK1rJ0K1rj8lJ1k1J7L1j2k7L1%m1PJ4k2j3L8
4130DJpJ1%k3LJ0j1mJ4OpK%qnJ5j8qL1lmK5nk0kK4k1k1J7J0j3J7Pj5lJ6prKNk1
4172a5J7J5k2pJ4j4kJ1J2rmPjk0J0jljJ4pJ0j0LJLPk5J8J5k6K1%jk3J0K0j6%R
4211A0j9MK0rj2LMmLLknJ8k5qK2rpPK1j8lJ5lj7nK4k0qK9nj2J7onOK7k1j2J0K
4252A0qmJ5j8%J3rkJ8j0j0J9oj3PJ3k6JK1k7qJ3J7k2PJ6k7%K6jj7J3J3k6NK1j2
$$ plain form
3989 25 43 18 20 26 -12 -40 -17 -17 -25 8 30 13 14 34 -11 -32 -12 -16 -25 12 42 6 18 30 -3 -29 -4 -11 -29 10 22 10 18 26 -13
4024 -13 -31 -15 -8 -23 15 37 18 14 34 -10 -33 -24 -16 -45 -10 24 9 5 23 5 -34 -17 -16 -29 0 27 25 10 19 -8 -30 -11 -14 -24 1
4059 1 20 7 14 35 -1 -35 1 1 -22 0 34 17 9 34 8 -27 -15 -15 -30 -16 29 12 3 31 10 -9 -5 10 -30 -29 4 -2 -14 13 2
4094 2 -28 -22 -12 -27 -1 17 15 18 25 15 -12 -2 -6 -24 -22 -1 -10 0 21 12 -6 -9 2 -19 -2 29 17 -10 21 21 -20 -13 1 -21 -34 4
4130 4 5 -2 9 9 -14 -11 -1 -12 -16 -2 4 -3 -1 -1 -9 -14 1 -17 -25 6 3 -1 24 19 -1 -3 21 0 -21 -4 6 -7 10 17 2 -1 15 8 -1 1 6 -15
4172 -15 2 17 -5 -12 2 -12 -14 -3 9 0 -4 3 2 -18 -8 -9 -12 -13 1 -6 4 -6 -3 -2 1 8 -17 1 16 -10 11 11 10 -13 -3 17 1 1 10
4211 10 -9 -5 15 6 -6 -3 1 -3 0 3 1 -4 14 -11 -19 3 -6 -13 -6 15 -3 -6 9 6 -11 -16 8 -12 -20 9 4 -8 9 3 -2 4 31 10 -2 8 10
4252 10 2 -2 13 -5 -5 8 -1 -3 15 5 -5 14 8 -5 2 15 -11 -10 11 -16 -24 -11 6 -16 -9 7 -20 -20 6 5 -12 1 14 -12 -7 14 2
4289Bl1K5J2k7jL7k6JJ7Nj6PK0k3%NoJOj5kLrj1K8kk2J6K3j5qK0Kl5J5J8k7j8
4327c1L7Nk9RK4l3%L2j7rJ9Rj4lQLj7PloRLj3J5Mj6J1Oj1PJ0j0j8K1%k6KK1k8
4366b2rM5%l9J9L3m3lK8kl5J5K1npONk3J0MqJ4J2k1J0J0nJmj6MJ1j0kJ2J7l8J3
4404bK1j3k7L4lk0PK4k4j7K7lk5J5J8j8nK3kk4J7Qj5qJ1Kj6J2MPlj6J2JkkjJ1
4442Hj8jJ6j5qK2jk1RK5k1j8L2qj3%L6k7k7M1qk5J1Rmj9K9Jj5Pj%LP%n%jlJ4j2
4483aqK8j2k1K1K0l0OPok3L3kk4RQkl7M8qk7KL4k4qL2j0k1NK2k4qJ2PnnJ1%Mp
4523dL%%nJ0Qj6QK1j7k4L7Jk1mK7k3j9K5Ok5LK3k2j4L4rj7J8J1k1j6J5Lj7J8M
4560AqrJ8poJ0j%nJkjQkJQj0pK4rj4J4Qj0pK3j6oJ8pj2RNj4lJ4%k2J0J1rlJ4l
$$ plain form
4289 2 -29 -4 8 -19 -20 17 -9 -8 9 14 -2 5 25 2 2 7 1 2 8 -7 -9 -6 -15 -26 2 0 -22 -6 17 2 -6 14 16 -19 -4 14 -13 -31
4327 -31 6 11 -18 -9 15 -18 -18 14 -3 -12 7 16 2 -1 7 10 -7 0 -3 -9 0 3 -10 5 9 -7 4 10 -1 6 16 6 -12 9 9 -17 -15 6 -22
4366 -22 -31 14 14 -25 -6 27 -16 -19 9 7 -28 -13 8 3 -4 2 7 -16 -6 -2 -10 4 16 -5 5 15 10 11 7 -9 -5 6 -4 -6 6 23 -15 -2
4404 -2 19 6 -21 13 10 -10 -3 21 -3 -20 7 4 -21 -6 12 -6 -11 12 10 -14 3 11 -4 -12 -1 1 -15 -3 1 8 5 -11 1 2 0 -2 -3 8
4442 8 -10 -11 5 -10 -18 4 3 -18 -9 16 -5 -23 9 1 -12 -12 24 -3 -30 11 3 -22 -11 -2 -6 -25 4 5 -10 -3 -4 -4 -1 6 6 1 1 0 -3 11 -1
4483 -1 -9 19 7 -14 7 27 -3 3 10 4 -19 14 12 -12 -3 5 3 -34 14 6 -21 -19 15 -9 -17 15 5 -16 -11 11 -13 -21 -9 -2 -7 -12 -1 -1 3 -4
4523 -4 -1 -1 -1 -6 4 12 -4 4 25 8 -16 21 22 1 -3 24 1 -18 7 13 -12 -9 14 -8 -22 12 3 -14 4 15 -6 -22 -7 -4 -21 -3 1
4560 1 -7 -16 2 -5 -11 -1 -2 -2 -7 -6 -8 -9 -1 -3 -2 6 -4 -11 13 4 -10 4 12 2 -5 18 2 -4 14 7 -5 4 9 -5 -8 6 6 -16 -6 5 -4 -7 7 4
4604Dj1jJ6j8mJ7nM%RrjjjJ2J0k2J1rLlJ0lj7J6mqORpk2K8o%j4J5oj8K2Jj8J5
4646@Nj0j2J8Lj9J3KqqJ5mLln%RrJ4NmlkQoKJpRPMl1RJ6j8PPmj3LPj2MK0rj4R
4693aJ2j6jJLrJ1Qj2J2jj0k%Ql%MQMr%jkmOmLoJ3%j6Qkj1J9onjJRj5pJ7Lk1Q%
4741g%j4K6jLrJ3j8LJ4jj4KNk2K4Okj1KRk%kOJ2k0NNmoQJ1j7lPmk0QPkoPRr%N
4788Clj2J1nk%J4j4J3Nj4JJ3j0%LKnJQJj4J5j4Nj0OKnJ5rNm%lPPoj0J1rKrNj3
4833a6NJ0pMjQlKMk0J6NnoRrlPOk%QmlMOrmOj2kJ5j6lK0j2pJ1J%mJ0j2jN%r%J3
4882Ej6J7pjJ0Mlj0J1knnRoKoRkpJ0pkJ7%oNMj6KLnmJ4Qk3MJ4k7QJ2j6QMNj1K0
4928A8qk0kPK%Ql%J3pnNKj2oJ2NrLJ0onOOj2JKkLJ9pk1J1LrrOjJ3Qj7Rlj3N%r
$$ plain form
4604 4 -7 -8 8 -10 -14 3 -2 2 2 11 2 1 0 -1 11 21 -1 10 1 4 1 11 8 -9 7 3 -5 1 10 3 -19 9 3 3 -11 4 -2 -20 2 3 -15 0
4646 0 5 -5 -17 1 4 -15 -2 0 -8 -16 -1 -5 -2 -5 -10 -10 -1 -10 4 9 5 2 0 8 2 4 5 -2 7 14 18 -13 -4 12 -6 1 8 4 -9 -6 1 -11 -7 13 4 -10 -1
4693 -1 11 -5 -6 -5 -2 -11 0 8 -4 8 7 -3 -5 -5 3 0 0 4 12 16 7 7 6 4 0 6 2 5 -1 12 12 -4 4 2 -9 10 4 -1 -2 -1 8 -7 -14 3 6 -15 -7 -7
4741 -7 -7 -21 5 4 7 -2 11 -7 -4 10 9 -5 -3 2 -20 4 10 8 -3 -1 8 6 6 4 10 22 2 7 12 8 2 10 21 4 1 8 4 -16 -8 -1 -3 -9 -2 7 -2 -2 3
4788 3 0 -12 -1 -6 -8 -8 6 -8 5 10 -4 -3 10 0 0 3 5 0 1 9 10 -4 11 -3 2 -8 -2 0 -5 10 1 6 2 2 -1 6 13 7 -3 8 -1 1 -8 -3 -16
4833 -16 -11 -1 -8 -4 -5 3 0 2 6 -14 2 7 2 -4 5 -4 -7 0 6 4 4 12 8 5 9 15 6 2 8 -4 -6 9 -7 -10 10 -2 -9 2 3 3 -1 9 -3 -4 1 1 -8 -8 5
4882 5 -11 6 -1 -2 8 12 9 -1 10 8 3 -2 7 1 3 -3 6 4 -3 7 0 -2 15 15 9 14 18 2 4 7 2 -2 12 20 -3 1 15 -12 -4 8 -8 0 4 9 -2 18
4928 18 10 -10 -12 -5 -3 -3 5 2 2 15 8 3 8 10 -2 -8 4 9 0 3 13 7 2 8 14 2 3 5 3 6 25 18 -3 8 11 2 -7 -1 -2 11 19 2 11 8 -5 0 0 -9
4976iMnJ4RrJ0oj9OJ6k8J3J3lMLppKJ3j0kJ2pOJqnMjj6OJ1mjJ0%j0M%j4NNkMm
5022bMlPj7KmJ5j3NJ5N%j4Qk3RK2rpP%mNLj1QmnLMLJj3Rj1oJ1jJL%nJ0nrONlj4
5071a2J0KkM%oNPl%MjpnJ4lr%Qj1J0LpJ1j7J2lmlkJ%Pjq%%P%NjknlJoRMpQnRo
5124BjJ4jpjJ0j6OJ3j5pRmjkJ3j4RLj1KRqNJooRnKQOj4j4J0NMrQljPoj2J2lpL
5172dJ4QrpQj2OLPj0QMkjOk0Pkj3J0kRlM%%%j5llJ7kLJ0K%j3oj2OkJ1OJ1j0Km
5219GqrqJ1RLK6qj1qj0lOkkJ3KR%lkk1OL%qNKJ5jj1qo%J5j0LJ3Oj1Mjqj2J1pL
5266fOkOnKnrK4pnJ0j0LMJ4j7jjj0kJ4jjLljpKlmMNokJ5Lojj5LJ2poJ7j1J0pK
5314blnOkRNQj2LQj4nQLnJ%J0nOnnlJ1j2oJ6oo%kpJ1Oj1mJ9j4JKJ0rNPpj1J0r
$$ plain form
4976 -9 -5 -10 4 13 4 14 8 -11 -5 11 -17 -4 9 6 10 13 6 -1 1 14 4 2 14 7 13 14 6 1 5 4 -12 -6 5 1 0 10 10 0 4 4 -10 -5 0 -2 2 -2
5022 -2 2 -1 6 -11 -9 -13 2 -11 -6 9 14 14 0 8 -15 -6 16 7 0 7 7 3 8 11 0 8 4 -1 2 6 9 10 -3 6 -5 -11 0 -1 0 3 3 -2 8 3 -6 0 5 2 -12
5071 -12 -2 0 -2 2 2 -4 1 8 5 5 9 8 1 -4 10 7 -2 -2 6 -5 5 8 1 12 -5 7 4 0 -3 -5 -4 -4 3 2 -6 -6 -6 1 1 6 5 3 -2 -5 -4 -10 -1 3 -4 4 -1 8 2
5124 2 1 15 14 7 6 16 0 6 19 4 -3 6 2 1 -1 12 -2 7 10 -1 1 10 2 7 8 2 -4 5 0 2 10 16 2 -12 -2 3 7 -2 6 3 2 9 3 -9 3 0 -7 -4
5172 -4 10 18 9 2 10 -2 4 7 14 4 12 16 14 13 19 -1 6 4 -9 1 -1 8 5 9 9 9 9 -6 -9 -12 5 3 6 16 18 18 5 -1 -13 -7 -9 2 8 19 9 11 7
5219 7 -1 -10 -18 -7 2 5 31 23 12 4 -6 -9 -3 -5 -7 6 8 17 17 14 12 -9 -3 0 0 -8 -3 -1 14 13 2 -6 -12 -12 3 -7 -4 9 15 4 8 7 -1 -13 -2 -9 -6
5266 -6 0 -2 4 -1 1 -4 -13 11 4 -1 9 -1 2 6 20 3 2 1 -9 -11 3 2 1 4 1 0 -7 -5 -8 -12 -8 -3 -9 -11 4 7 1 0 -15 -12 0 -7 -13 4 -7 3 -4 -2
5314 -2 -5 -10 -4 -6 3 8 16 4 7 15 1 -4 4 7 2 3 3 13 8 14 9 4 1 12 0 -6 10 4 -2 -2 -4 -11 0 6 -5 -9 10 -4 -3 -1 9 0 5 12 5 -6 4 -5
5362elJJ3LjOj1MjjmQPk8J0J0nKKj1mMJj6J7JNlMlj4Oj3kQJ0J2lpJ2k3J1jqNJ1
5408FjpJ6lj3Q%j5J4Mkj1J8kqkMk2kRJQJ0lj1J1pqJ0j5ORRmlKj1LqOK%J4nk%j1
5455fQrOj1NPnJ0kJ1kpMmoQJjj1J0kj4J8j9LKR%NoLoojN%JlQJkK%j2mNQpJ6Kj0
5506BkJ5j2j1LLLO%pORj4qJn%J3jJ1j2jJ4nj9J3j1JRnMKj3LJ%JQJkKqJ4opOjq
5554gR%JJJ6j3Ojj1lPj0jJ2jj0kLoOJLJLj2RpPkolONmQj1J1nKKpKLMqrQPJKnQ
5606A0j1J1orJ4mnQ%nj6J2LrKMqOjOoN%mj5J1K%KjLL%MrLP%KKMpJ3rk1J3Kj0N
5655AOLMkrj%jnkJJJ3j0joRLj0KLJPKpJml%%KLoK1pjLrj2QjJ0pPRj8J2p%rLJ%
5708bJ1o%mqJ6j5MjpQOjjLj0mjoJ1lJ7nQj0MrKOmmMMJ4j2qNkmj1J6qQJ1mmj5J
$$ plain form
5362 -5 -8 -7 6 9 8 14 3 7 6 5 1 9 16 -12 -2 8 3 5 7 -4 -8 -4 -3 -19 -2 -1 4 1 5 2 -12 -6 -19 -21 -13 -3 9 6 -1 11 -12 -1 -2 -10 -5 6
5408 6 5 -2 14 11 -2 6 6 -9 5 9 7 -4 14 12 4 2 6 -16 -18 -9 -8 0 10 7 -4 7 0 -8 2 -13 -7 2 11 7 4 6 -5 -2 -10 -4 -2 -2 12 7 5 5 -6
5455 -6 2 -7 -1 -12 -7 0 -5 5 3 14 12 5 9 5 -1 7 8 7 -4 6 4 -10 8 -11 -8 -6 3 3 8 2 5 -1 -7 -8 -3 -3 -2 -5 3 4 2 4 4 -8 -12 -7 1 -6 10 12 2
5506 2 0 15 3 -8 -5 -2 1 7 7 0 6 15 1 -7 -6 -11 -11 2 1 12 0 -1 13 8 -11 2 -9 -8 1 -4 0 2 -11 -8 -7 -7 -6 2 3 1 3 -5 9 3 -4 2 1 -7
5554 -7 2 2 3 4 20 7 13 12 1 -2 5 -5 -6 6 5 -5 -7 -4 -10 -4 -3 0 1 4 -8 1 -6 1 -1 -7 -10 -4 1 -3 5 -6 5 0 2 4 -3 -1 2 6 -2 -11 -3 4 5 7 2 10
5606 10 -1 10 4 -5 9 5 0 8 8 3 -13 -1 2 -7 -5 -1 -9 -3 -4 2 -4 1 1 -3 -18 -7 -5 -5 -3 -4 -1 2 2 6 -3 0 7 7 9 11 15 8 21 12 -9 4 6 -4 1
5655 1 7 10 14 12 3 2 2 1 -4 -6 -5 -4 9 -1 -2 -8 1 4 -6 -4 -1 0 7 9 2 3 -1 -4 -4 -4 -2 1 -5 16 9 8 11 2 -10 -2 -3 7 0 7 16 -2 10 3 3 -6 -3 -2 -2
5708 -2 9 3 3 -1 -9 7 -8 -4 -5 -12 -4 2 1 0 3 -7 -11 -12 -18 -7 -10 7 2 10 0 4 -5 -3 3 -1 -5 -1 3 17 5 -3 2 0 -4 -15 1 -7 1 12 8 4 -11 -10
5756a0J0j2LJ0j0J6j0OMk1PNNLjj3%J7j2%okQqJ3mO%nMQnjlmQJmlkRj0lQnJ1%
5803HLj7kjMMjJMKpOmoOOOj0LmoNJmOnNKqQKkQmj0MJ5j7n%NkKJ4qpQrPj3PoLk
5857ejJJ2mjj2OmRmoOJ4j2pJJ6j4RLlkK0j6LojMj8K1j8pPJ2oPmNJJkoKJnN%q%
5906fJoJ8j0rR%ppJ9PomJ0oj1J1M%j0OjpNMjljjjKJ3mj1oR%kOJpo%J2oplJ2jn
5956fL%lOj1LPqJkJ2lj1J5j0ONjKoJ4%kj1%llMJnnQNLNj3%j7ORjOnnLj%Jj4J5
6006fKQkmPlmqJ0qJ5j2LQnlllpLJ3%oJ2krLj2LQo%%RNj6nOoLMJ1%j0OklNjOj0
6057fjJnJ2%pJlRoJQoPljLJmNkkNj1nQjloOOrOPkj3LPj1RljOjj3J5LpMKKrRkj3
6112a0RNqLJrNO%mMjKkj0QmLnPpNkpQmkJlkJRNj0oPkJ2mQj4Q%j8OJ3j1RJ2j5l
$$ plain form
5756 -10 0 -12 -9 1 -9 7 -3 3 7 -14 -7 -2 3 6 5 -8 -8 9 -3 -3 -9 -11 -3 -11 2 -2 4 4 -1 3 11 6 5 2 -2 6 7 3 0 -2 7 -3 -6 2 -3 8 8
5803 8 11 -6 -8 -9 -5 -1 -2 -1 3 5 -2 4 0 -6 0 6 12 2 5 1 -5 0 1 -3 3 -2 3 5 -3 5 7 5 13 9 -1 3 18 1 -4 -4 1 -1 1 15 7 0 8 -1 6 -7 0 -6 -3 -5
5857 -5 -6 -5 7 3 2 -10 -4 -8 1 -3 -9 -3 11 -1 -8 -7 9 -5 4 7 4 2 22 6 9 3 2 6 -12 9 -9 -16 -9 3 -3 4 0 5 6 7 5 -1 1 2 -3 2 2 -6 -6
5906 -6 -5 -11 7 -3 -12 -3 -3 -10 -17 2 9 3 -1 9 3 -8 3 7 7 -3 3 2 -5 0 4 3 0 -1 -2 -3 -1 12 8 -3 -9 0 0 -2 4 5 -2 -8 -8 4 -2 -9 -12 0 -1 -6
5956 -6 -3 -3 -6 0 -11 -8 -1 -9 -8 -10 2 -1 -12 3 -7 -1 4 3 5 -1 13 13 11 0 0 -3 -6 -2 -1 -6 -11 -3 2 5 10 -3 -3 -20 -14 -5 -6 0 -5 -10 -7 -8 -8 -7 -21 -6
6006 -6 -4 4 2 -2 5 2 -2 -10 0 -8 7 -5 -2 6 1 -2 -5 -8 -15 -12 1 1 -5 7 5 -4 -1 -13 -10 -2 -8 -8 -8 1 6 -10 -15 -9 -15 -12 -8 3 3 -7 -1 -3 -6 -1 -2 4 -6
6057 -6 -7 -6 -11 1 1 -6 -5 -8 1 -5 -4 4 -2 5 2 1 4 5 1 6 4 2 7 -4 -9 -1 -2 -5 -11 -5 1 -8 -2 5 3 -10 -7 0 -11 -2 -5 -6 0 -1 -14 1 4 -3 1 3 5 -4 5 3 -10
6112 -10 -1 4 -4 -1 0 -9 -4 2 2 -2 2 1 3 1 -9 -1 -5 -2 -7 0 -7 -2 -4 -11 -3 -7 -9 -8 -11 -13 -12 -3 2 -8 -14 -7 -9 3 -1 7 -7 1 1 -17 -11 2 -9 0 12 -3 -6
6163fJ2mj7K2KljNjj3mlQlqJ4j0PMl%pMpMJ1j7J1LmMmJRmj7J3qJ7NrnpJ4Omj6
6210iJ2JoJ5lj0jJJj0J5rQNj9l%J5Kj2RJjKlpNKjnRlkMPj2KRj1KkJ3j1NpjnJ6
6258Hj0Kj2J3%qJ6mj6OJ3pKj0JOkpJJ5j6MpQ%NrkJ8Jj2oJ0qLlJ1jLpOojOMjOj0
6306CkMjJ%nLJrOmOqjPlKMrJ4j2KK%lo%kJ5j5J0QKpJJj0KLQokMj4MJ0jJMLqMP
6359A4j0j2kJ3nL%k%JklNMpnNJ6j1nPk%NqKKJj1J1jpJ3Oj0%MpkOJ2j9J2qpnJ4
6406Ej0J1%jMJj0lNjPokj0J9k0NKQj2QRlq%PlKqLNmrK6qrRqJJQmoPrnMPqK0j7
6457@lrJ9rOpMnj1J9j0kJ9j9J1l%nJ7j1nQqJ2j0J8j3PqL%jMMj3J2mkqLJMNj1p
6502hNNrJ1%KKrl%J3kj8J4rRj0J1ojkLnOmRmj2J2rJ4J0j5JJjmNJkJKpMp%Qj0K
$$ plain form
6163 -6 6 2 -15 7 9 6 5 10 9 -4 -8 -11 -3 -6 -14 0 -10 -3 1 -2 -2 -9 -5 -12 -8 3 -14 -3 0 -4 0 -4 -3 6 2 -15 -2 -10 7 12 3 -2 -9 5 11 7 -9
6210 -9 3 4 -2 13 10 0 -1 0 1 -9 6 -3 5 10 -9 -12 -12 3 5 -7 2 3 2 4 1 -6 -1 1 0 -5 4 1 -1 3 10 -2 0 9 -2 0 -2 11 0 5 -2 -3 -8 8
6258 8 -2 0 -12 1 1 -7 9 5 -11 -5 8 1 3 -7 -6 0 -2 -9 -8 7 -9 -5 -12 -4 -4 1 -8 -10 8 9 -3 -9 1 -7 -4 -7 4 3 6 -1 5 -1 -2 4 8 7 13 3
6306 3 1 5 4 5 5 0 3 4 -5 1 -3 3 -5 -6 1 -2 0 4 -5 9 -3 -1 1 1 -2 -8 -8 -10 5 -10 0 8 10 3 4 5 -5 -3 0 8 2 0 4 -10 -6 4 3 4 8 11 3 7 14
6359 14 4 -8 -10 3 -2 1 1 -1 -1 0 -2 -5 0 4 -3 -8 -3 13 2 -3 4 2 2 7 -1 1 3 4 -7 4 3 -4 9 15 5 5 9 2 0 6 18 -1 11 3 -4 -9 5
6406 5 -5 6 6 5 9 10 0 -3 2 1 8 2 0 -10 9 -11 -6 -4 4 -8 0 9 6 -2 -2 5 2 4 -4 -1 4 0 -9 17 9 0 9 1 2 3 11 7 1 8 -1 -6 -2 5 -3 17 0
6457 0 -3 -12 7 -2 4 -3 1 -4 -15 4 -6 -8 11 -8 3 0 0 -5 12 1 -4 4 -4 8 -2 16 3 10 2 5 5 4 8 12 -1 11 7 5 -3 0 1 5 10 -1 -8
6502 -8 -3 2 -7 4 4 6 8 -1 -4 -4 9 7 -11 3 -6 3 -7 4 -2 -3 -5 -2 -7 -1 -5 4 0 -12 0 -9 5 15 0 1 2 1 -3 2 3 1 2 4 -3 1 -6 -6 2 -8 -6
6551fMJ1j1JOkmJjqmNRKlQj3mJ2lnR%kKKqN%JnjJ1ojJQmqjlPnORj3pQK%j3R%L
6605AoJMj1J0nNjpMOkoJ1KJ0j1jnLrQmKJMJjJkKlJ0pPj7J1mpK%PnmJ3Oj7J2jj1
6655cJ1pkLMm%nJO%RnOj6L%J2qOmlj2J5Mj1NJ3k1P%mj0OJ2Kj0LpJKmMrJ0kj0J7
6703Ekj0Kj1J3nJ7j0JJ2j3qPkLKNjOnKmQppmMJ1j5RPj0lkqQlJ4Nj4NjlkLLKpk
6752eRQj2kjjlJ0jmJ3J3k4KJj5KJ3m%NRopMJj1lJOkJ8k2J4mjj5J3%Rj6J5mkNj1
6798epJ0J0j4J8onlOmJLPLqPrnkPj4NJ8j1LOlj9J1J1j2JkMlNlpOjnKQomJ2mj2
6846a0QkmPkJ1kJ1nNj1Nj2LJ2j2OKQk9MJ6k1OK0j3nJ5Mj3rJ5j2nJ2Jj2ORJj3J6
6888A1lk0J9j0KJ2Pj1%Jj1OoKoJ7nj2J6mRj8MlLJJ5j4%Orj5K0j5lJ2jkNPqj0%
$$ plain form
6551 -6 -2 9 -2 -1 5 3 -1 0 -1 -9 -13 -8 1 3 0 8 -5 -9 3 0 -5 4 4 2 4 6 -2 3 3 4 -1 -2 9 3 2 3 11 7 -1 -2 -5 2 -3 3 12 -1 -8 0 2 2 -11 -2 -2 1
6605 1 -5 -4 0 -11 -1 -6 -1 -2 -9 -5 1 -1 -7 4 6 16 5 4 -1 2 -7 1 -3 -1 0 4 5 4 5 3 5 2 12 5 12 -5 6 2 -5 -3 -3 4 -1 -5 8 14 -3 9 8 -3
6655 -3 8 1 -1 2 6 2 2 -3 -2 4 4 13 8 14 -2 1 1 13 5 11 7 4 -8 7 11 0 5 18 -3 4 4 0 -10 -4 8 10 0 3 -4 -3 -1 -5 -1 -10 0 -2 -12 5
6703 5 3 -7 -5 -16 -3 -8 9 -1 0 12 -1 -9 -2 -4 -1 1 6 5 11 6 8 4 12 5 -2 -6 -2 9 -6 3 10 0 -3 -5 -13 -5 -8 6 11 -3 2 1 -2 -4 -1 2 4 -3 -5
6752 -5 4 12 0 -2 -3 -4 -7 3 2 -2 11 24 0 2 3 -12 -10 3 -1 -1 4 13 7 0 4 5 -6 -9 -8 -2 -4 14 -8 6 2 1 -14 -1 -1 8 -8 7 3 1 6 -5
6798 -5 -12 -2 8 -6 12 6 1 -2 4 0 1 4 11 14 6 13 4 -1 -3 4 -10 -5 13 2 5 11 8 -11 0 11 -1 0 -2 2 -1 4 1 -6 0 -1 -6 -4 4 -2 -6 6 2 -10
6846 -10 -2 -4 -8 -1 -3 8 6 17 12 17 6 11 -1 2 14 2 8 10 18 -11 -7 9 -12 -6 14 1 -4 11 15 2 -7 8 -4 -9 3 4 -8 -2 7 8 -5 11
6888 11 8 -12 7 -3 -1 11 18 7 7 8 -3 3 -3 -1 -7 10 5 -7 9 5 14 -4 0 -3 0 1 16 2 2 8 -1 -16 4 -11 -14 -2 -3 -5 0 7 -1 -11 -11
6931a1J4noJ3k%QrnJJ0%qJ7qnLj3qK0Jj7J4kKj3J9o%KNj6j1L4j7OKLj2oJ0lj0
6974iPKq%J3j5PjOpNLpJ1Oj9LKKrJ0mJj3J5jNJj3QPqkJk%KPrqJ3m%oJ6roRJ2r
7024Ej5J3Nj1pJ7j4J8jj0kJKLkj4J4J1pknJ5nj6J3Mk0K0LknOnoMqrJ1Klm%Plo
7069hJLjNMj4LQkjnNNnLj2J2lJoJ2kLj7J3mJ1j0J0Qr%pJ1rmj5J5l%%kjKJ3j2l
7116gj1K5rJ4%qj4J3mpPkNNJ2k2J3rlLKj0J7LoK%%qknmRJ2Lj9J7Kj9lkn%RLJ6
7162A3qPqj5j4OPNjMJ2pj0JjmJJ0pJ0PLNj6Kj7NQKmJNRj0Rj2pQQj4KJ7J0k2j0
7207a0NlKlONjLlj5J3lpjJ8%Mj4J2LMj3k%KLoJ5kj2JnNl%Mj1OJ9j5Qj0k%jNjJ
7255AlKNjrkNkMmNmj3PRJkQj0JjJ1pKmJ0kMoRqjj4J2J1lJ1j0nRj0j3Lj1NRj1K0
$$ plain form
6931 -11 3 -2 -8 5 3 3 11 2 -3 -2 8 8 0 17 9 4 7 -6 -14 6 7 -10 4 2 4 -9 10 4 4 6 11 -5 -16 18 1 7 9 12 0 -6 4 1 -9
6974 -9 -2 0 -8 -8 5 -10 -3 -4 2 -5 0 3 -4 7 13 -6 -3 -1 1 -8 2 -2 -1 -14 1 0 5 6 -7 1 8 0 -2 -1 -3 -3 -1 6 -3 -11 2 -2 -2 -8 8 -1 -7 2 14 5
7024 5 -10 3 8 -3 -10 7 -7 11 10 0 -2 -1 1 4 2 -12 2 13 6 4 -1 14 9 -7 6 10 -10 10 13 11 6 12 7 1 5 -3 -12 -1 1 -2 -6 -6 1 -2 -8
7069 -8 -7 -4 -5 0 4 -10 -7 1 -1 -2 -7 -2 3 -2 1 -11 1 -2 -1 -7 5 3 6 -11 2 -2 9 -1 9 17 8 8 1 12 3 -1 -16 -1 -4 -4 -4 -6 -7 -5 8 -4 -7
7116 -7 -18 7 -2 12 12 4 -10 3 -1 -8 -1 -3 2 7 19 -3 10 1 -2 1 3 -7 10 13 7 9 9 9 1 -1 -6 -10 -1 11 14 -5 12 14 -5 -8 -10 -15 -15 -6 -3 13
7162 13 5 12 4 -11 -25 -19 -12 -7 -8 -4 8 1 -9 -8 -9 -13 -12 -2 -9 1 8 11 16 0 2 -15 -10 -2 0 -4 -3 2 11 1 10 -2 -9 -1 7 -7 -5 12 22 0 -10
7207 -10 -5 -8 -6 -9 -3 2 1 4 1 -14 -1 -4 -11 -12 6 6 10 -4 8 11 15 2 0 0 2 5 -1 14 12 0 1 -4 1 -2 -2 2 -9 -3 16 1 9 -1 -3 -3 -4 1 0 1
7255 1 -2 0 5 4 -5 -7 -2 -4 0 -4 1 -3 -16 -9 0 1 -1 7 -3 -2 -3 8 1 3 -1 9 7 11 5 14 6 5 -9 3 14 11 22 12 7 16 6 -7 -4 -15 -10 -1 -12 8
7303HmmkKj4LNJ2%MknNmj8LKJ4kJ2J%mqJrjKjJ5OpQj1j2%j0%J1OQ%Mkj7Oj9Oo
7352a8J8K1j4R%k2KK%pLK0j2J4Mjj9nMj3J6JORnpj5Rj3J4qPnJ6OqNj0j0ljlNM
7396djJ8j0oRj4mPjqK2Rj6kJrOL%rJ4kJ1oJ2j4qLKrMQqKLKrJJ2npOj0P%n%J0j4
7445iM%jNj0K0KnmOJj7J9j3mJ1jpJ7j0mmJ7j4RKkj0PK%kj8J7k0NOLmJ6pKjj2J
7490gJ%KnJ6j2PlMj3QlrQJ2KLokokrQmK3j6RJ4lj6KojjJ3j5J9J3rqj0Lk0J1J0
7535BPkLNj8KJ2k8R%lQJ8Kj1Njqj8J3MLmJ4J0j8J2ppjkoJ5PJm%k3ONj5OKNJ4j1
7581CJ7j4j9MJ3j9LJ5NqJ3rj2J2%j8OMJ0NJNj0nLjj3kJ3lJ1J0pjqqpmOoK0kOr
7625@JnnooJ2PjkJJ3j3k1J6JJQJ4j5J0Ooj7J0KqjJ0%JJ1oj6J8rlpJ1J1k0KLKq
$$ plain form
7303 8 4 0 -2 0 -14 -11 -6 6 6 10 8 3 8 4 -14 -11 -9 5 3 15 16 16 12 4 5 -4 -5 -3 -4 11 17 10 18 7 -5 -5 -15 -15 -4 2 10 10 14 12 -5 1 -18 -12 -18
7352 -18 0 21 7 16 16 -6 -4 -2 -2 -9 -6 14 2 16 20 19 0 -5 -1 -14 2 3 9 18 13 6 -9 0 -13 1 -7 0 -5 11 17 9 14 4 -6 -9 -10 -13 -8 -4
7396 -4 -5 13 3 -3 6 -8 -12 -5 -6 -14 8 17 1 -1 0 -9 -3 0 0 -9 5 3 14 8 20 6 -2 1 3 -6 -2 6 -2 0 3 5 -4 -3 9 4 -3 3 -7 0 0 -5 -5 5 -9
7445 -9 -5 -5 -6 -1 -11 9 11 6 2 8 9 -8 11 -2 -6 5 4 -3 14 4 0 -4 13 -1 8 10 8 -2 5 7 7 5 -13 4 -16 -11 -5 -2 -6 10 3 5 4 -8 -7
7490 -7 -6 -6 -4 -9 7 -5 2 -1 3 -10 -2 -5 -14 -6 6 8 11 5 3 -3 -5 -14 -6 -10 13 -3 6 20 17 1 3 -3 -4 -5 8 -7 12 25 16 8 -2 1 -19 -8 2
7535 2 9 7 10 15 -3 -1 11 -17 -8 -8 -11 -3 15 17 6 11 10 2 -16 -3 1 4 0 14 24 6 18 11 4 3 1 -5 10 17 18 14 14 -9 -3 2 -13 -7 -5 0 14 3
7581 3 20 6 -13 -9 4 -15 -12 3 8 0 13 4 -8 4 4 -14 -8 -4 6 11 12 17 7 2 5 4 -9 -11 2 -1 10 20 13 12 4 -4 -11 -15 -9 -15 5 3 9 0
7625 0 1 -4 -9 -15 -21 -9 -2 -3 -5 -4 9 -4 -25 -9 -8 -7 1 15 0 10 16 10 -7 3 5 -3 -4 6 6 7 18 12 -4 14 5 2 -5 6 17 -3 -1 2 4 -4
7669d%Oj1QkPmLkMqPqlNj4J4QjkkMOmj4%J5pnJ2mQj8J4nj5J3n%J0m%J0j2MrjL
7717cj4J2j0K5qNrPqn%oJ7jJ2ojj5QJLj5oK8jOMnj5mLj0J3J0kjNmnmOj5j4J7K
7762cQNJolqj5QORJ3kj3J0Jj8j1PjOJ0MKKJk0Lj3K0NmJ2oLKpj2nkNkLJ6JPk1L
7809Aoj0oQK0j3RkQlj7jKjPQJ3%j2mJkj0J4rMJ0lJ4j2npMlOoKJ4jlnmjoMm%J3
7857F%QpKj1%mj0OjJ0PpNKJj7%J1Kj1LQrnJ1Jj0J2kL%mkJ4jj2Kj5J6j0P%KPj5
7903gJ3JmqKj1PKLJJ1j1J1j6K%J3kqlJ2knOJ1k2J6nrRPKj2LjKj4QqOMmjl%L%j1
7951a2RoJP%jJOmpj3J8poJ7J4j6KJ%j6J0RjmJ2pQJnNk9J7lJ3rRqLj0KnlKlJ4q
7998bRLopMkn%LRoJ3Qokoj0j4J0J9j8J7%mpJ5j6jKJ3pjQJ0Nk0pLj0rJ2ONlJ0n
$$ plain form
7669 -4 -4 2 -9 -1 -3 4 0 3 1 5 -3 4 -4 -7 -2 -16 -2 6 5 3 1 5 11 7 -7 -7 8 1 -4 8 4 12 -6 8 3 -12 1 -4 -4 6 2 2 12 0 4 -5 -6 -3
7717 -3 -17 -5 -15 10 2 7 -2 5 -3 -8 -8 -14 3 2 14 8 7 -8 0 1 4 -11 -17 11 10 16 20 15 0 -4 -1 -11 2 12 10 9 14 10 5 1 7 -8 -22 -5 -3
7762 -3 5 10 11 5 2 -6 -21 -13 -7 2 15 13 0 10 11 -7 -18 -11 -12 -6 4 8 10 12 13 -7 -4 -17 3 8 4 16 10 13 15 8 -4 -9 -11 -6 -8 -5 11 12 19 -2 1
7809 1 -5 -15 -21 -13 7 -6 3 1 9 6 -11 -12 -10 -11 -4 4 17 17 5 1 2 0 -10 4 -5 -1 9 6 20 8 3 -4 0 -3 3 -3 -1 13 12 9 4 0 -1 -7 -3 -7 -7 6
7857 6 6 14 7 9 -2 -2 -6 -16 -10 -11 -1 6 -1 4 6 7 -10 -10 1 3 -8 -5 3 -6 -11 0 1 -9 3 1 4 4 0 -2 12 11 -1 1 -14 2 -8 -1 -1 1 8 -7
7903 -7 6 7 3 -5 -3 -14 -7 -5 -2 -1 10 -1 10 -6 -4 -4 9 7 -1 -4 8 6 1 7 18 -4 12 7 -2 7 14 16 4 7 6 8 -6 2 -6 0 4 0 -1 -4 -4 -1 -1 -12
7951 -12 -3 -9 -8 -1 -1 -2 -1 5 1 -6 -19 -1 -8 -14 3 17 1 3 4 4 -12 -2 7 6 2 14 7 15 16 11 16 -13 4 1 14 5 14 6 9 -1 1 -4 -7 -5 -8 6 -2
7998 -2 7 10 4 -3 1 -1 -6 -6 -3 6 0 13 21 15 13 7 -3 -17 -7 12 -6 11 11 7 0 15 -1 -2 0 13 6 5 13 23 28 8 1 4 -6 -15 -3 3 8 5 15 10
8044A0j1J0loqNPpQkNj6%J6orJ6%qJ6qJnNj2mNKRMnKj1Q%rJ0KrqOMMoMj1lJ5J
8093HnJLokLrMoO%J0j3J4Kj1kJJ7k4MJ5Kj2qK0j0oQllMLpJ1j3LLqJ2j5KKjJ4p
8139AnPj0LqJ4r%J3j3jKQoJJ0rJ0pQlmK%KjKj1PJ0j6J2rJ7j4j3K1k4J4j0J2Jj5
8182a1PLOLj9KKKl
$$ plain form
8044 10 -1 9 6 0 -8 -3 4 -3 5 3 8 -8 -8 8 2 -7 9 9 1 17 9 10 5 10 -2 -6 -1 1 10 14 9 11 0 8 8 -1 9 11 2 -6 0 4 8 2 6 -5 -8 7 8
8093 8 3 4 7 1 -1 2 -7 -3 -9 -3 -3 7 -6 8 10 -1 -3 -2 15 -9 -5 10 12 0 -8 12 2 -4 4 1 -2 2 5 -2 9 -4 -1 2 -6 6 -9 -7 -5 -6 8 1
8139 1 -4 3 -7 -4 -12 2 -7 -7 6 -7 -8 -6 2 -4 -3 7 -2 8 1 9 6 2 4 4 6 5 7 -4 3 13 -3 9 0 17 3 -10 11 -13 1 -9 3 4 -11
8182 -11 -4 -1 5 8 -11 -9 -7 -5 -8
8191h
$$ Imaginary data points
##PAGE= N=2
##DATA TABLE= (X++(I..I)), XYDATA
0@%%%%%%%%%%%%Qj6J6j6J6k4L2l3M1m9N7p2Q6r6J12j34J53j75J99k26K58k92L33
35A78l78M24m75N32n95O60p33Q14r02J000j105J219j344J483j635J801j985K188
53A147k412K662k945L266l630M051m544N128n839O722p849R351j1464J4676k0196
68a1876L2209j02567P6721J37488k21141L3915J95587n8630j60419R0910M4388
79E6585j04671q17Q5447m0273j3318O7239k0868p6807L2956K7840n6075j9968
91f2730N9680L6901p204k2389J4674M6123l1274j00182K7581R4858o8671q4796
103i7429J21658P2684j32291k4148J23730m5240j11389P7973O1395q4407K4458
114a3006R8412o5824n7018R6961j6049j34023M8241J05245r1244o0154J27016
$$ plain form
0 0 0 0 0 0 0 0 0 0 0 0 0 0 8 -8 8 -8 8 -16 16 -17 24 -25 32 -40 46 -50 62 -72 81 -94 105 -121 137 -155 178
35 178 -200 224 -251 281 -314 346 -387 427 -475 525 -580 639 -705 778 -857 944 -1041 1147
53 1147 -1265 1397 -1548 1718 -1912 2139 -2405 2723 -3116 3606 -4243 5108 -6356 8320 -11876
68 -11876 20333 -82234 -5513 131975 -89166 -55251 140336 81706 -78713 12197 56585
79 56585 -48086 -48903 36544 -3729 -17047 50192 29324 -47483 -14527 13313 -42762 -62730
91 -62730 -3050 33851 26647 4258 18932 65055 33781 -66401 -38820 56038 -12633 -97429
103 -97429 24229 96913 -35378 -59526 64204 18964 -92425 -14452 46943 -37464 -13006
114 -13006 85406 19582 -37436 59525 43476 -90547 -42306 62939 -28305 -88459 38557
125C8557L5249j10056L770Q2038l2476o0099K8251L3771p874p937j382J0096J1112
138B3020k8744k6059K6749P770k9703J8730L1397k5361Q95L7515l6262l8969N8819
151A9797J0131q1467K6543R1323n5261p1299Q2704L6846j00888p960Q7780k5060
163A3189n9859N1192L3873m8565O81L4054k8922j7123L5122p656l0159K8574K1636
176B6037l3500q318K6565m996j9208M516R587P633J868j6077J850K5663j7001
189D619l6489K6522K9158l7918j0341M9290l582m0589K1486K0711l8301l320L5366
202A6612j9722k1226M1773O882m6199J3922L8539l6405l0066M3381J4156l8578
214a6931P136L5325j3658k2939J1164L934j2854j17M291J592R503J990q028M992
$$ plain form
125 38557 73806 -36250 -32480 49558 17082 -43017 -14766 19005 11131 3194 1812 11908 23020
138 23020 -5724 -31783 -5034 2736 -26967 -8237 23160 -2201 -1306 36209 -53 -39022 19797
151 19797 29928 -51539 -24996 66327 11066 -60233 22471 59317 -41571 -49531 38249 13189
163 13189 -46670 4522 38395 -10170 -9489 24565 -4357 -21480 13642 5986 -24173 4401 26037
176 26037 -7463 -15781 10784 5788 -13420 -8904 683 8316 10184 -5893 -4043 21620 4619
189 4619 -31870 -5348 23810 -14108 -24449 24841 21259 -19330 2156 22867 -15434 -18754 16612
202 16612 -3110 -24336 17437 24319 -21880 -7958 30581 -5824 -35890 7491 21647 -16931
214 -16931 -9795 25530 11872 -11067 97 4031 -8823 -8940 -4649 -3057 6446 8436 408 5400
228E400L553j5099m152R793n863k586J7332M2j2436J4201O764k7982l909K5053
242A0111j2474k2937K6551K0459k5852l433K7194j0444k5659J2663R912j7724
254a1633K800J9034o251o818J3720k498j7372L995P855j1291k364J4676L390n497
268A746L160K645m902m980m648j369N444P00k757R606Q744r287m973Q025o362
283G92j4235O532Q501q533K499J6118l180j0741Q035J922j6907j976J2705m006
297b474o545J3268Q235r658k051N959o764r472K924L594j363L706O308J187r41
312E913j581m319l776k065j811K321N543K538K117M125j991p020k102j289o006
327i403J12Q083K918J32O364K391p586m256L06n559m220O117N327j75M262N293
$$ plain form
228 5400 8953 -6146 -10298 -505 -6368 -8954 8378 8420 -4016 10185 16949 -11033 -14942 10111
242 10111 -2363 -25300 1251 21710 -4142 -7575 19619 9175 -16484 -3821 6091 -11633
254 -11633 -8833 10201 3950 -2868 10852 8354 -9018 -5023 2832 -8459 -10823 3853 7243 1746
268 1746 4906 7551 2649 -2331 -6979 -8348 -2904 -2204 -4961 4645 13389 4102 -871 7154 792
283 792 -13443 -6911 1590 -6943 -4444 11674 8494 -2247 5788 7710 -9197 -11173 1532 -2474
297 -2474 -9019 4249 12484 2826 775 6734 -30 -9502 -6578 -2984 -4347 -641 5667 6854 5913
312 5913 4332 13 -3763 -5828 -7639 -5318 225 2763 4880 9005 7014 -6 -2108 -3397 -9403
327 -9403 -9291 -1208 1710 1842 8206 10597 3011 -1245 -939 -6498 -10718 -4601 726 551 4813 10106
343A0106l995o176r22k665n075J370N783L017K214L436L17l746m498l511j943
358f288k12J514M299N377J823q64k63k860o605k973J796K87J115O467M635j636
374E612j204k15n142n470L59J602N61M019M928O32q83q19l967m282n32J88L51
391d262L963M236K85q3P6l674m171k66m0l03L545M098P7J10P35l361m240nQ8r44
411d136L012M131L3rJ057l116m020N02L8j765L094M723q55j040K232k074n214
428c407M0J766j360J390M387M50j040Q74k246l907O06O60j948K767M946j391j813
445G74K656k030n894R57K735k379J685O375o10l131K726j230p563j74M278k668
461c493o91P559K253m545P15J397n446k811K814K83P01M982J273k188J147j571
$$ plain form
343 10106 6111 -65 -987 -3652 -8727 -7357 -1574 1443 3657 7093 7410 3664 -834 -4345 -6288
358 -6288 -6500 -4986 -687 4690 6513 5649 5386 2526 -4079 -7052 -5256 -4969 -3854 2613 7248 5612
374 5612 4408 4193 -949 -6419 -6060 -4458 -3897 122 5050 5682 4799 3980 13 -4269 -4801 -4613 -4262
391 -4262 -299 3937 4222 4139 4215 541 -3630 -3896 -3936 -4239 -694 3404 3481 3591 4326 965 -3275 -3280 -3192 -4136
411 -4136 -1124 3007 3040 3031 4088 972 -3048 -2546 -2508 -4273 -1179 3544 2689 1649 3881 1807 -3407
428 -3407 -3367 -1601 -2961 -1571 2816 3266 2226 3100 854 -3053 -2447 -1787 -3735 -968 3978 2587 774
445 774 3430 1400 -4494 -3537 -802 -3181 -1496 4879 4269 1138 3864 2634 -4929 -5103 -825 -3493
461 -3493 -4184 3375 5628 1083 1798 3195 -2251 -5062 -2248 -1965 -1264 3718 4991 2803 3950 2379
477B379p018j472L037j796K08P219K738k366J748k17o393j365K324l422M01Q531
493D536O89n398L844K174j0388m381O522j303l993Q400O939l729Q79L621o858
508A554n767L336k171m950O789O326n001l09N861m527p851K255K262k293L408
523a078N492N85J999J060o528l760K220m878n654P117N905m575J813P167m211
538B674o001L432q78m855N658N166m698K519P596p544r224N918L38j1377K280
553h996J1458k140l284Q278J893o753N76J134n512J201N223l743r81P685j909
568D130q787K456L347p061j451P100P26o61N019k56l288L323j506q625K679O953
584D098o883l746J0628J176j0012K419O281o511k965O669o82k419O477K20o631
$$ plain form
477 2379 -4639 -6111 -3074 -4870 -4662 2557 5295 2929 4677 4460 -1933 -3298 -974 -4396 -3995 4536
493 4536 5225 -173 3671 5845 -4543 -8924 -2402 -3705 -7698 702 7641 3912 4791 8412 1554
508 1554 -4213 -877 -3048 -7998 -1209 5117 116 -193 5668 1141 -6710 -4455 -2193 -4486 -1078
523 -1078 4414 4999 6998 8058 1530 -2230 -10 -4888 -10542 -3425 2480 -2095 -282 6885 2674
538 2674 -3327 105 -773 -5628 30 5196 498 3017 10613 3069 -6155 -237 101 -11276 -8996
553 -8996 2462 322 -2962 5316 7209 456 1032 2166 -3346 -2145 3078 -665 -1646 6039 4130
568 4130 -4657 -2201 1146 -5915 -7366 -266 460 -201 4818 4562 1274 4597 3091 -5534 -2855 4098
584 4098 -2785 -6531 4097 5273 -4739 -2320 3961 -2550 -5515 1154 472 -1947 4530 4750 -1881
599a881M278L839j0116k634R823k400q549O775O555o972j524O028k527l215M048
614A528j250l141N808J042p562K722O778p063n273Q095J181p362K893N240m122
629d86m12L979l941j500O213l071o671P269M622r937p04J0395l377q364O116M379
645D510o669M6M796l420r52M659l487l409O979L25q288L490P215o572m324P523
661B422M44o185K825L022m072J263L087m985k54O689l706o160P252L774q832k3
677c439Q283l539n819N187J685n022K263K735m552J382N182n068l330P651J2q427
693d816L303O711n869l740O297P6m977K488J810l352J924K639m211N24N758l222
709A343m677N481J777o865M37M839l548k529M307o74k711M278Q57m931L108M710
$$ plain form
599 -1881 2397 6236 -3880 -6514 3309 909 -7640 -865 5690 -1282 -2806 3222 695 -2520 1528
614 1528 278 -2863 2945 3987 -3575 -853 5925 -1138 -6411 1684 2865 -4497 -1604 3636 -486
629 -486 -898 3081 -860 -2360 3853 782 -5889 1380 6002 -3935 -4639 5756 2379 -5985 131 4510
645 4510 -2159 -2113 2683 -737 -1689 2970 -517 -3926 3053 3378 -4910 -1420 5795 -777 -5101 2422
661 2422 2866 -3319 -494 2528 -1544 -281 2806 -2179 -2433 4256 550 -5610 1642 5416 -3416 -3439
677 -3439 4844 1305 -4514 673 2358 -2664 -401 2334 -2218 -836 4346 -722 -4052 3599 3611 -4816
693 -4816 -1513 5198 -671 -4411 1886 1962 -3015 -527 1283 -2069 -145 2494 -1717 -1193 4565 1343
709 1343 -3334 2147 3924 -2941 -2504 2335 -1213 -3742 565 -109 -2820 1458 2315 -2616 492 5202
725E202n842k490P285q20p249L262M634n696k392M801j276l387L531J354k796
740a879K954L038l891k73M426k692m452L321J486m540K47L185k110j321K428j028
756a101j414L272M19k584L206L155l870j107L925k293m857K170J367l886O27L542
772E71j846q78L849o68l068L143K162l866M52M420k018l504K519M18m413l58K148
789i37j578m75K903L90n90K268L84k195Q03J189k310n37K239q55j798J412k2k506
807b215M29J166j724L45L084k79j076K740Q24l137j9J906k307j987K351M58k231
824a672R70J673j788q07J711m32j084J768J114r90O54J134j346j085N11q44j172
841a685P99M08n51R53Q79r71L8J031j029q69J550K85j425R32J358j620r51J441
$$ plain form
725 5202 -640 -3130 4155 3335 -3914 -652 3982 -1714 -4106 695 -581 -3968 -437 917 -1879
740 -1879 1075 4113 222 -51 4375 1683 -2769 552 2038 -2502 -2255 930 -1180 -2501 -73 -1101
756 -1101 -2515 757 1176 -1408 1798 4953 1083 -24 3901 1608 -3249 -1079 288 -3598 -2971 571
772 571 -1275 -2153 1696 1028 -2040 1103 3265 -601 -149 4271 2253 -1251 1268 1686 -2727 -3085 -937
789 -937 -2515 -2990 -87 303 -287 1981 2365 170 973 2162 -148 -685 1554 699 -1099 313 291 -2215
807 -2215 -1786 -620 -2344 -1999 1085 806 -270 2470 3294 157 138 2044 -263 -2250 101 559 -1672
824 -1672 -702 971 -817 -1624 87 -345 -1429 339 1453 463 1117 2251 905 -180 331 -513 -1685
841 -1685 -886 -478 -1029 -76 803 -168 -130 901 -128 -997 553 838 -587 345 1703 83 -868 573
859E73n63j823J076J313j216O8J835m41j316Q80L39j483M0J187m94m54J084J28
877G33r26J62K98p35j24N25r3N5N55j39k36M12l67p46N45K89q76L54J154p07p03
898e70J188K6j521N40J193j165n73J686q6j614P75J093j500o09J630m6j311Q74
916A0J096j002n39R42r8r36J28M94j91j79J49K80J66l92k14O37j0r48M18J009
936H20r27p39J412J45j702N72J550j316r82J903K34k013O63J654j471j031J794
953E66J82j715O60J366j091o87J234K5j099L23O52m84l19L91K03j38k36P5N14
972D22k11p78N94P93j243n13J748k12j982J203J760k090r19K739k30k845J475
989b89K210k561j149L049j75k862J466K166k266j070K495o3k189Q28J545j179
$$ plain form
859 573 10 -1813 -737 576 -640 -572 1263 822 -494 386 725 -758 -718 469 -25 -479 605 733
877 733 -193 -31 267 -468 -592 -67 -160 -105 450 311 75 487 120 -626 -81 208 -668 -314 840 133 -570
898 -570 618 644 -877 -337 856 -309 -882 804 718 -896 -121 972 -528 -1137 493 447 -864 10
916 10 1106 104 -435 507 409 -527 -399 95 -96 -275 -126 154 320 -72 -286 351 341 -607 -189 820
936 820 -107 -846 566 711 -991 -419 1131 -185 -1167 736 970 -1043 -380 1274 -197 -1228 566
953 566 748 -967 -307 1059 -32 -719 515 540 -559 -236 416 -68 -387 4 207 69 -167 -92 422
972 422 211 -567 27 820 -423 -936 812 600 -1382 -179 1581 -509 -1428 1311 1081 -1764 -289
989 -289 1921 -640 -1789 1260 1085 -1777 -311 1855 -411 -1481 1014 951 -1238 -410 1135 -44
1005d4q43J092M05p44l44N04O17n01r46R23J055j706p84K363j49k762J453K574
1023B163k681j450L721j37l927J893L108l561j682M363l12m156K226L167l480
1038g45j466L917l51l421J716K273k395r06K299j92j668O83Q13n83k42J28K88
1055A48M47q16n63J624o4k413J216K467k707j604M099N2m610K081M063m189k523
1072c292N458J15n595K493M536m464k390N364k33n097K470L609l856j514M213
1087A817l95l413J743K065k178p42J677n2p66M9n7O00J83j653M01K286j652k027
1105b114L302J017m215R86M189l339l134M985P11n696K097N082m531k930O083
1120B493J22o183K654M812m752k434N529j94m959K301L218l435j169L384m91k170
$$ plain form
1005 -44 -887 205 610 -134 -478 26 643 142 -804 119 1174 -532 -1316 1047 898 -1864 -411 2163
1023 2163 -518 -1968 1753 1616 -2311 -418 2690 -871 -2553 1810 1498 -2658 -432 2735 -745
1038 -745 -2211 1706 1355 -2066 -350 1923 -472 -1378 921 729 -939 -256 557 -26 -268 -140 148
1055 148 595 -221 -784 840 776 -1637 -421 2046 -661 -2265 1834 1886 -2724 -643 3420 -769 -3292
1072 -3292 2166 2281 -3314 -821 3715 -749 -3139 2225 1992 -3105 -635 2974 -882 -2396 1817
1087 1817 1422 -1991 -248 1817 -361 -1103 574 522 -244 -195 -252 348 531 -1122 -721 1565 -87 -2114
1105 -2114 1188 2205 -2010 -1024 3165 -174 -3308 1677 2388 -3308 -1211 3871 -660 -3590 2493
1120 2493 2615 -3568 -914 3898 -854 -3288 2241 2047 -2912 -611 2607 -828 -1997 1387 896 -1274
1136a274J579Q52j435K35L96q03M78M6j266J211J133k372K12L207j997k821L987
1153A368J321n087J185N154l713l826N457R60o429J610N303m231l057N859N77
1168B451n349K496M205m122j804M607o50l939K149K019l143o82K195j010j251
1183a828J303J46k11J365k29m92J937k18k506J495J511l516o78L584j851l486
1199c674L556J705m685Q94N041k764k848N343J251n281J655M315m301l121M414
1214A500l14m975J919L218l242r66L827l62k198K316J419j782O06J406j333n04
1230E35O19j535q68Q53j362j028K213M0j899K434K281k741Q8L924j627l208L212
1247A931J318m742L6L638l067l223L685Q24l990J728L964k310j179M054M7l177
$$ plain form
1136 -1274 305 1157 -278 -43 353 -450 28 74 -1192 19 1152 -1220 -1008 2199 202 -2619 1368
1153 1368 2689 -2398 -1213 3941 228 -3598 1859 2819 -3610 -2000 3303 -928 -3985 1874 2451
1168 2451 -2898 -402 3803 -319 -2123 2484 1834 -2105 44 2063 -1080 -1762 433 -577 -1828
1183 -1828 -525 -379 -590 775 546 54 1991 1773 -733 762 2273 -1243 -1921 1663 -188 -3674
1199 -3674 -118 1587 -3098 -2204 2837 73 -2775 2568 3819 -1462 193 4508 207 -2914 1500
1214 1500 1186 -3789 -1870 1348 -1894 -2860 967 605 -1593 723 2142 360 966 2372 1039 535
1230 535 1154 -381 -1249 -396 -1758 -2786 -573 -533 -2432 2 2283 -458 -370 3554 1927 -1281 1931
1247 1931 3249 -1493 -1457 2181 -886 -4109 -424 400 -3590 -1862 2102 -208 -1387 2667 2714 -463
1263d63J651J723k980q40K091j349j894J406J18j568Q71R66q79R01J491q60L09
1280F94J772j174j368J670m50k768R91J458k643n29K985r50k269K709J551k855
1296a176O96L275j777j922K808K19l388P16J956k509j200K537k95j920J683J328
1312A031j677L03J706r87o71J451l24j251R57J85j609M21Q83j439j78J714o56
1329a41j007J820M29j873Q18J525j823p05K090n83j907J528R90k140J00J968j230
1346a41j220J955K55j831R72J341j651m24J671p52j334J368M56j511N54J267j156
1363a81m31J380m60j104J094L43j321M55R77j148l37J273n32r76J243L86j307
1380f46O38J177j247m77J484n50j441J149O22j637K28J538r98q76J578J27j477
$$ plain form
1263 -463 1188 2911 -69 -909 1182 -167 -2061 -655 -537 -2105 -1234 -268 -1147 -246 1245 385 694
1280 694 2466 1292 -76 1594 1144 -1624 -633 825 -1818 -2347 638 -312 -2581 128 1679 -1176
1296 -1176 -480 2795 1018 -904 1904 2123 -1265 -549 1407 -1102 -2302 235 -60 -1980 -297 1031
1312 1031 -646 -343 1363 376 -295 1156 832 -419 538 723 -886 -465 418 -1021 -1199 515 -141
1329 -141 -1148 672 1101 -772 46 1571 -252 -957 1133 550 -1357 171 1161 -979 -879 1089 -141
1346 -141 -1361 594 849 -982 -10 1331 -320 -744 927 175 -1159 209 665 -846 -292 975 -181
1363 -181 -612 768 308 -796 298 641 -680 -225 752 -396 -733 540 8 -968 275 661 -646
1380 -646 -8 1169 -78 -555 929 379 -1062 87 709 -928 -700 838 -160 -1036 542 669 -808
1397h08Q23J075j285k65J376n89j114J031K74j306L67R50q85k83J105k73p54Q52
1415B91K29r35M30O44q89q0R32n88o71R84k1j135O72P66j130n4J335o06r55J254
1435D73L26j472M35J211j179o73J441j22j374Q41R17j221j91J273m50q82Q60L16
1453E29r67K33O52o27j80O50l09l32O03q1n16N56K11q05K91O75q60l04J058l12
1473A65r49R26N63j208J20J210p64q29J182J64j247M94R57r75m01J113k63r31
1491f73O97M00q79J80P49n67k51P75k59n83O46J04p84L88N73p81j16Q70m53o99
1511f63Q62J97r82M25Q46q32k91J068l17r42P27M23j032J15R23n57m57Q55k1p48
1531d01M64L30p33J54N98n69j72P97l43o20P73J12r70M39P76r42k35J201m23j035
$$ plain form
1397 -808 15 1090 -195 -460 916 327 -787 244 518 -788 -421 529 -356 -639 466 193 -561 291
1415 291 520 -415 15 659 -230 -310 622 34 -637 347 326 -809 -137 629 -501 -555 780 174 -781 473
1435 473 799 -673 -238 973 -206 -879 562 440 -934 -93 824 -397 -588 685 235 -647 213 529
1453 529 -438 -205 447 -180 -360 290 -19 -351 252 171 -345 211 422 -383 -92 583 -277 -581 477 165
1473 165 -784 142 705 -503 -383 827 63 -766 416 580 -667 -173 784 -191 -592 521 258 -673
1491 -673 24 424 -455 -275 474 -93 -344 431 172 -411 235 339 -445 -57 516 -265 -381 489 36 -663
1511 -663 199 396 -586 -161 685 -147 -438 630 313 -629 98 521 -511 -396 527 -30 -487 368 347 -401
1531 -401 63 393 -340 -186 412 -157 -329 468 125 -495 278 390 -580 -141 635 -307 -542 659 236 -799
1551g99R96M96j351J91J293q31q06J295J89j343M57R53r84m28J078j64p80O41
1569A03L72p00J28M75n13r2M73l66k08O40k46n07P29J43r66M40Q42j048l60J350
1589F89l74j276J064Q00j558OJ625p95j198J428M56j662L64J389j105p79J436
1606E10J3j303P12Q42j066j83J019m16o41P29O7o38L99K51o04K70M45p10P7Q26
1626E99o59n50J104j30j262Q25Q87j409j05J713o65j323J481O16j956K38J672
1643A076j273j148J801K59j767P65J451j368o01J577k77j297R15O92j139O6Q93
1660F25o72m67P00k89n16O67O0n95P17M02r68L47R20j097m85J447l71j439J217
1679B03Q66j895p0J846j128j485J920O70k018P58K068j432j101J946j00k162P64
$$ plain form
1551 -799 197 693 -658 -467 826 -5 -811 484 673 -670 -213 740 -244 -672 406 242 -538 103
1569 103 475 -225 -97 378 -135 -227 246 -120 -328 312 66 -441 288 431 -535 -95 747 -301 -661 689
1589 689 315 -961 103 903 -655 -649 976 181 -1017 411 867 -795 -431 958 -147 -926 510
1606 510 523 -780 -68 774 -292 -475 544 128 -513 216 283 -355 44 295 -309 -39 406 -304 -227 599
1626 599 -60 -610 494 364 -898 -73 814 -595 -700 1013 348 -975 506 1122 -834 -596 1076
1643 1076 -197 -1345 456 715 -1052 -287 1164 -204 -805 772 495 -802 113 805 -334 -268 625
1660 625 -47 -514 186 -103 -619 48 108 -487 230 632 -336 11 931 -166 -651 796 425 -1014 203
1679 203 1069 -826 -896 950 -178 -1663 257 927 -1091 -333 1735 303 -798 1148 1048 -1114 -350
1696c50J264j613m98J714l72j194J065N86j133K50R18n79j42Q39l32m18O00m10
1714A95q54O60Jj179O73J085j194j62J857n52j570J533Q90k121J61K179j254j613
1732a265K006L96k530M75J869j672j048K279K25j781J197J493j569n07J506n81
1748D93j311Q76L99j056K31O57o73n4N90n27r1R00l59m64J165P1j282O74Q34j602
1768e29m22J664p17j498J662Q79k013L10K049j331j427K030M48k192P64J869j559
1785a3j026J881j71j868Q60J083j395j87J470m15q22J007K06r60L82M54p51O5
1803b00O18o29j30Q30n23o08J037Oj215P60R82j338k85J636n87j440J323P39j797
1822h21J47J710j024j121J648L13j738O20J367j337o50J552k45j384R06Q05j201
$$ plain form
1696 -350 914 -699 -1197 517 145 -1049 16 602 -531 -281 637 58 -84 755 423 5 605 195
1714 195 -659 1 2 -1177 -504 581 -613 -775 1082 530 -1040 493 1383 -738 -577 1602 348 -1265
1732 -1265 741 1137 -1393 -918 951 -721 -1769 510 735 -1046 151 1644 75 -432 1074 493
1748 493 -818 58 457 -599 -368 289 -384 -438 152 -375 -466 434 75 -389 776 847 -435 239 1073 -529
1768 -529 -951 713 -4 -1502 160 1039 -974 -664 1385 54 -1373 657 1105 -1087 -323 1546 -13
1785 -13 -1039 842 671 -1197 -337 746 -649 -836 634 219 -603 404 610 -350 32 486 -265 -200
1803 -200 418 -211 -341 489 -34 -642 395 401 -814 -54 928 -410 -695 941 354 -1086 237 976 -821
1822 -821 -674 1036 12 -1109 539 852 -886 -266 1101 -236 -886 666 421 -963 -57 748 -453
1839d53j0J143n45o30Q52l3q31M70L45p34K43O68o08j34Q47m23o95P97Q4j060
1859g07N36Q74r94k16J299m82j155R98M84j437K10J408p76p70J388J89j416M47
1877a20Q96j156m54J204k38q51Q71M72r92J21P34o78l65Q63m0n12O69K92p55Q9
1897E0L41q25l07O75l08m07R45L27p27M76O61r07l63R18l44q23Q49M54j034J00
1917b49P98q77p01R05L4q57P88R53o44PR56m73q98M71M4r23K02O43m59j18O45
1938B47k58n31M47P4n17M79O49l47J19P17m64p04L14k29r67K23N85m73N5R95r0
1959C24n85N80K27q37J11P34l78k75P43o9p78J62R5q24j12N81j92l8Q77K18l99
1980A65L82K06p59j61M32m12l06O54O0n32K77K31p25j20N60k60k09Q20L19m69
$$ plain form
1839 -453 -463 680 135 -495 357 324 -507 -37 308 -426 -183 485 -123 -257 590 167 -528 269 353 -707
1859 -707 -171 703 -291 -507 792 310 -845 153 637 -800 -590 818 42 -728 660 849 -567 -120
1877 -120 776 -380 -834 370 132 -719 152 624 -368 -247 487 -191 -556 307 267 -245 424 716 -39 50
1897 50 391 -434 -741 -66 -374 -781 164 491 -236 240 901 -6 -369 549 205 -618 231 685 -349 -249
1917 -249 549 -328 -1029 -124 -90 -947 -159 794 150 157 1113 640 -258 213 257 -666 -464 179 -280 -398 247
1938 247 -11 -542 -95 -21 -538 -59 590 243 362 1079 615 -89 225 -4 -971 -748 -163 -636 -581 414 324
1959 324 -261 319 546 -291 -180 554 176 -99 644 575 -203 -41 54 -770 -882 -301 -493 -531 346 564 165
1980 165 547 753 -6 -167 265 -147 -453 201 261 -271 6 237 -488 -608 -48 -308 -517 303 622 153
2000A53L12L70p13m04L51k82m87M89L13l57K13M08l96k45L61j37k93M10K64k66
2020F4J84K56m51j85K08l54l19M82J15l59M39M61n17j79N60l12n93M93L20n70
2040b57J13O25l76m37M85J2o09K38M50l61r2N06q9l68K19P7l12O6J80j62L2K06
2062A46j78n9K62j61k12L48M3m02K05K96m67j31N23j86m34N25K94o09R2N86m77
2083Dm69N90J25o34K93N79m26l03N03j34n87K36L22l21O6M74m5j95J54j02l09
2104a79J8l9j02K68J95j62K08K18m90k20L62k41m25N77M39m73J39O31n16o51M58
2125A5K5p61L24Q11l40j94P57r1q27J19K71n84j07O81R3j73L87J24m59j36m2l37
2147d44kL23K0K07M18j54k68J53k83o02K62L64l74K20Q57k44n70M67L2j021JP87
$$ plain form
2000 153 465 835 122 -282 69 -213 -700 -211 102 -255 -42 366 -30 -275 86 -51 -344 66 330 64
2020 64 248 504 53 -132 76 -278 -597 -115 0 -359 80 541 24 -155 405 93 -500 -7 313 -257
2040 -257 -144 481 105 -332 153 165 -444 -206 244 -117 -209 297 208 -160 59 136 -176 -110 70 -92 -60 146
2062 146 -32 -91 171 10 -202 146 189 -213 -8 288 -179 -310 213 27 -407 118 412 -197 -105 481 4
2083 4 -465 125 250 -384 -91 488 62 -241 262 128 -459 -223 99 -222 -156 318 273 78 232 130 -179
2104 -179 -161 -200 -302 -34 161 -1 207 425 -65 -285 77 -164 -589 -12 427 -46 93 724 208 -443 15
2125 15 40 -721 -397 414 74 -120 637 546 -281 -162 109 -475 -582 99 192 19 406 530 71 -65 -107 -444
2147 -444 -446 -123 -103 104 522 368 100 253 -30 -632 -370 -6 -380 -160 697 453 -117 350 382 -639 -638 149
2169A49l69k98J002L00q04J40M36p99n01O13N9l98N53N48l51j20K20l96m23J35
2189c04jm4M08J97n0K46m9n57k7J75n07n6P76L1m29O30L12r32j93O50n16o24Q84
2212B0M68p26K56Q20o39o91N98qq07L55P31l80j07O71j09o41J50J26m63nL71l
2234a3N5K56j05p1J18l71k77L97pm54M58N73n59j94O88l01p95N08L93p60J17R37
2256E93m10n86P84J36j037J79P87o05m54Q74J86p22K60M84m97k61L79j31k30L32
2276F1N4k22K69J25m14N7K45l33j04L90j66j89M66j3n07L85L27p53r7Q51l41p59
2298f68P42N12q91k9Q74l74o60O26J85p06K36N24n35j51O96k03n98N03L13o61
2318b65j2N59k03k75L30K3j96J94j18l29L05J32n83J46P00l66m17P10J59p33J70
$$ plain form
2169 149 -220 -518 484 784 -20 120 556 -243 -744 -131 -72 -470 83 631 280 160 380 -16 -439 -304
2189 -304 -305 -349 59 256 206 452 403 -154 -181 -6 -513 -569 207 238 -191 439 751 -181 -374 276 -240 -864 20
2212 20 488 -238 18 838 199 -492 106 98 -709 -354 377 -3 -110 561 452 -189 -39 87 -376 -381 -10 -13
2234 -13 42 298 193 122 240 -131 -408 -11 -18 -472 -14 559 0 -194 494 193 -602 -94 299 -461 -344 593
2256 593 183 -403 381 517 -520 -341 446 -159 -613 261 447 -275 -15 469 -28 -289 90 -41 -271 61
2276 61 115 -107 162 287 -127 -70 175 -158 -262 128 -38 -227 239 226 -281 104 431 -322 -419 432 91 -668
2298 -668 74 586 -305 -334 540 166 -494 132 317 -389 -153 371 -164 -315 381 178 -420 83 396 -265
2318 -265 -277 282 79 -196 134 157 -39 155 37 -292 13 145 -438 -292 408 42 -375 335 494 -239 -69
2339f9M64n59j89O32k27m82O46K00q74J62P50o60n30Q93K79p22L09O96m32l52
2359f5L46k33m35K48Ql61M17L66m55JN43l01m54M43J50l25K83L11l62N5K67o70
2381b23m17N77j70p29O59Q19n76j22R04j47q08L15K79o11N3N69l39k06N37k72
2401I2p55L25K93o64Q6R32K4k40N26J61n04r8n6m73K8K92l33nO82j92n97L68K86
2424A78o49L3P64o3j77O22L6o34J20J5q54j56O58k71m00Q62M61o86N8O09m37m55
2446c66M79J41k79L16K28l98k1P9n88k97M42p7k71O13M65l13R0L52m19k85K78
2467A69j84l42M81J94n45J32M78o01m75O01R5n44M29O46l26j07M73k64n29K31
2487A2J0n02K17M57l19j18N31j05m98K35K14l27O0L83j19n1K45k14k72K40j06
$$ plain form
2339 -69 395 -164 -353 279 52 -430 216 416 -458 -296 454 -206 -736 157 436 -286 23 719 287 -65
2359 -65 281 48 -387 -139 -131 -492 -75 291 -164 -163 380 79 -375 68 218 -107 176 487 125 180 447 -223
2381 -223 -640 -63 -233 -962 -303 516 -60 -182 722 575 -233 82 361 -250 -197 372 33 -173 364 92
2401 92 -663 -338 -45 -709 -623 309 333 93 619 780 276 178 122 -351 -323 -31 -364 -369 313 121 -476 -108 178
2424 178 -471 -438 326 263 86 708 744 110 230 245 -609 -765 -107 -378 -778 84 545 -141 -83 526 89 -366
2446 -366 113 254 -25 291 519 121 100 179 -409 -706 -264 -341 -612 1 466 153 243 595 176 -109 169
2467 169 -15 -357 124 318 -227 -95 383 -218 -693 -92 3 -541 -112 534 208 101 574 310 -219 12
2487 12 22 -480 -263 194 -125 -243 288 183 -315 -80 134 -193 -133 250 131 80 325 111 -161 79 -27
2508b7m10K90L68l95j3N69k07m58L73J66n39J11M68l32k11N12o1n48L00L38n09
2529b15r3N81j20m00L42J92m31nK66j96j00K68o9j58K38J4k76J66J90k60j4L33
2551B53j54k41K42j9l67J67K02l06O9M46k14k78M14N4n30J26M21l33k18M93%m34
2573b07J83K11m18o8L85j30j77L82J34l12Q9J97l03j77K15n0j20K07N9j42J35
2594I3L1k89L9K13k15p1M06M5l09J97J95m06j55K74j44k17L26J74k75J29K65l24
2616a8j79K71p4k82K41K62k29J5K46j84k15J49o0j91J97J71j73Q3K43k01j97J80
2638E5l7k61J52J90j47N4K21j50j55J85q7k69J85K03k36J6L35j03k85J79P5l07
2660a87L0K28j07o0K33Jj84J21M6k45nJ73j15n1K08Mj45J09K7k00P3J25j74j5
$$ plain form
2508 -27 -437 -147 221 -174 -187 382 175 -283 90 256 -283 -172 296 -36 -247 265 204 -344 -44 294 -215
2529 -215 -308 273 153 -247 95 287 -144 -149 117 -79 -179 89 20 -138 100 114 -162 4 194 -66 -80 253
2551 253 99 -142 100 81 -286 -119 83 -223 -154 292 78 -200 214 268 -262 -136 285 -48 -266 227 227 -207
2573 -207 -24 187 -231 -299 86 -44 -221 161 295 -17 72 269 -34 -211 4 -46 -166 41 100 -42 93
2594 93 124 -165 -126 87 -128 -199 207 252 -57 140 335 -71 -226 48 -96 -313 13 187 -88 41 306 -18
2616 -18 -197 74 0 -282 -41 221 -8 7 253 69 -146 3 -57 -248 -51 120 -53 30 273 72 -125 55
2638 55 18 -243 -91 99 -48 6 227 77 -78 107 20 -249 -64 139 -97 -81 254 151 -134 45 120 -187
2660 -187 -157 71 -36 -96 137 138 -46 75 121 -124 -129 44 -71 -122 86 90 -55 54 81 -119 -46 79 -95 -110
2684a10K89q4k19K11J09l19j9K52j48j60K42P3k19J27J53k22n0K05j16j67K08
2705C6Q1k22P0J88j48r4J45l5j42J17N1j32P7J26j36k9J63q8j51J38K6j40Q0J25
2729A06j38%J74j36j41K20J2k72J33K53k39j25L05j4l01J29J77k31o4K53m8j67
2751a14J82N9k01K6J22j36n1J68m1q8J25J9j14P3K9j59K8J36j19n7K28k4k00J34
2775B5J10k45j4K30j25j40K59M4k54J04J87k36j13K69o6k20K15J52k44JK36j65
2797A0j91K04L2k11J02J92j42m7J54o6j25O7qp9J20L1j07J05J10k00n8K22j22
2820gj97K35J26k46O2K61k10j91K52l8k83J72K42k47l3L26q9k77J73J03k60J0
2842a16K20r0p1J67l8j47Q7j5j71R2J54j16qK34o1j60J08Lj88N2J13j65M4K39
$$ plain form
2684 -110 179 95 -124 87 196 -123 -142 110 -38 -198 44 117 -102 25 178 -44 -94 111 -5 -172 36
2705 36 117 -105 -35 153 5 -89 56 21 -121 -4 47 -85 -8 118 -18 -47 116 28 -123 15 41 -99 -19 106
2729 106 -32 -32 142 6 -135 85 97 -175 -42 211 -28 -153 152 138 -163 -34 143 -88 -152 101 53 -114
2751 -114 68 127 -74 -48 74 -62 -113 55 14 -74 51 70 -44 29 58 -101 -73 63 -56 -113 115 91 -109 25
2775 25 135 -110 -124 106 -19 -159 100 144 -110 -6 181 -55 -168 101 35 -185 30 182 -62 -61 175 10
2797 10 -181 23 55 -156 -54 138 -4 -51 103 37 -88 -21 -29 -108 12 43 -64 41 151 -49 -107 115 -7
2820 -7 -204 31 157 -89 -27 234 24 -167 85 47 -236 -64 178 -69 -102 224 135 -142 31 134 -126 -116
2842 -116 104 14 -57 110 72 -75 12 -3 -174 -82 72 -44 -52 182 121 -39 69 72 -116 -64 49 -116 -72 167
2866A67j49j78K63J5l48J02L06j88j23L43J7k75J01J15k76o6K13j22j21K72O7
2887A35k56J14J92k01j17J94jj15J22L2p3M6l7k00N6J32k05m3L36J1k43J75J81
2910B35k65o9K13j00j47K00L6k17J31J46l05q3L13r5k27K44J97j96k7K19j07j52
2932e6J03o1j10J36K7j86J20J59k22q4K59n7j88J78J22j43L5J09j63m1J71j63
2954e5j63K66P0l12J01L03j88k13K70N6k50O9J83j48k1J43j14j01J86n0j92J51
2976iJ42k04k2K19q0j32J23J3j30J15M6j83P5J79k22j22K86Ql03J56K56k19j24
2999a32K44l9k17J31P6j72P6J50j68k7K22r1k07J67J09k13K0J76q1q8J27m6j07
3022i0J29k8j48J38J61k20l4K70r4k55J59J20k43K9K19j09r2K12n7j88J35R3k59
$$ plain form
2866 167 18 -160 103 118 -230 -128 178 -10 -133 210 227 -48 53 168 -108 -174 39 -83 -204 68 135
2887 135 -121 -7 185 -16 -133 61 60 -55 67 99 26 72 35 -165 -109 23 -182 -225 111 122 -121 54 235
2910 235 -30 -99 114 14 -133 67 103 -114 17 163 -142 -225 88 -7 -234 10 207 11 -16 203 96 -56
2932 -56 47 -14 -124 12 39 -147 -27 132 -90 -174 85 28 -160 18 140 -3 32 141 -22 -63 108 -55
2954 -55 -218 48 118 -194 -93 210 22 -191 79 135 -115 -46 137 -11 -32 111 -3 -104 82 32 -160 -9
2976 -9 133 -71 -93 126 46 -86 37 50 -80 35 81 -102 -27 152 -70 -192 94 102 -201 -45 211 -8 -132
2999 -132 112 73 -144 -13 63 -109 -33 117 -51 -78 144 53 -154 13 122 -91 -71 105 24 -64 63 17 -90
3022 -90 39 11 -137 1 162 -58 -92 178 84 -171 -12 108 -135 -106 113 4 -88 124 67 -121 14 107 -152
3045a52J6K64j10j62K25P7k36J7J34j02m8J17l2l6J43l3j42J07O4k25j5J91j02
3068d0j11K01N9j65J03P9j87qJ86j36j21K60L5k61J00J77k51j56K21j1j77J64
3090c9J71j14M8J33j35j03J10r0j64J31J02j47L9J61r8j14J10j6j12J29J00q9
3112A3J06J48j78j07J19j40k25J20J32j27N9K24q2j05J30m2j92J28J15j32O0K35
3134B59j21k06J25n3k64J3J93r2K4K70J6j05J02rk18lR3j10nJ93%j19N4j4j85
3159a62J0P5p1Q3K33j4o3J52m1k78k4J03j67l0K45K9j11J27K7k38k5J30j13l8
3183a61K68Q0j38J04P2k41j29J01p2r0J63J12m6N8P2j46p5N3n8n6J59P7p9Q2M8
3208A58j62o6L5j04l0J82L2q0J79P4k34p6J52j35j55K14J32j52N7J54j45j33R5
$$ plain form
3045 -152 -136 128 18 -144 81 158 -78 -61 73 -29 -77 40 8 -28 115 82 -60 47 111 -114 -129 62 -40
3068 -40 -151 50 109 -56 47 126 -61 -69 117 -19 -140 120 155 -106 -6 171 -80 -236 -15 -26 -203 -39
3090 -39 132 18 66 199 64 -39 71 -19 -183 -52 50 -97 -58 103 5 -109 1 -15 -127 2 102 13
3112 13 119 267 89 -18 101 -39 -264 -144 -12 -139 -80 144 62 -43 87 45 -147 -19 96 -36 24 259
3134 259 138 -68 57 4 -260 -247 -54 -146 -122 148 164 59 161 152 -66 -69 24 -86 -91 102 102 -17 37 23 -162
3159 -162 -152 -77 -148 -65 168 154 91 243 202 -76 -100 3 -164 -194 51 80 -31 96 123 -115 -140 -10 -123 -161
3183 -161 107 187 49 153 225 -16 -145 -44 -116 -206 -43 69 23 81 153 7 -68 -15 -73 -129 30 107 28 110 158
3208 158 -4 -70 -35 -139 -169 13 45 -35 144 218 -16 -92 60 -75 -230 -16 116 -36 21 175 30 -103 -8
3231hl0j41J31J39p3J6J17j04j34M3rp8P4J09j6O1M0j17n0L8q9q3J66Q4j10P1
3257D7J30j63j33J03l9j23J33J47r3K9J70j41j65R1j4j83R4K16p1m7J38k8j90
3280i2J5M3r2L0J48K3kQ1p3j21k1k1p8P5J01PP3R5j18j09O3p1j63J35J67j01J5
3307IK14q8k25O2K4j92lK29Km5J63L8j95l7L6j26m8J56N9l0J08M1j12o0k3q0q
3334a31P5K8O4J23k1j02J0m2j62J9J19k5K0J75J4j59L8L5k13k8J56j5p5J86R2
3359A81j53l2R1j43j37J26O2o6P6J35n7p5L3n0r7K2L8J4O1M4j9J6oj13j2O2p6
3386g5k7J60M1j08M1R3j46q3J20k3j09J10J26j26nJ29p3j39Q2L8j10K5J26m8l9
3411b0O7lq3J7J7m7QN5j5JM6k5l4L6j9n0M8K8o3L0Q7o9n4J17j6j45O8J03j35m7
$$ plain form
3231 -8 -38 -179 -48 91 18 34 151 47 -87 -44 -53 -131 -57 52 36 97 137 20 -30 8 -81 -164 2 86 -24 47
3257 47 177 14 -119 -16 -55 -178 -45 102 9 38 208 67 -98 -7 -21 -204 -110 106 35 -12 126 98 -92
3280 -92 -77 -34 -126 -96 52 75 73 154 81 -40 -61 -82 -160 -85 16 23 96 191 73 -36 27 -44 -207 -72 95 -6 9
3307 9 223 135 -90 -28 -4 -196 -199 30 32 -13 150 188 -7 -44 -8 -134 -182 -26 33 3 111 152 40 -20 -43 -123 -131
3334 -131 -56 -28 36 159 138 36 46 4 -158 -139 -20 -45 -25 150 164 5 43 78 -135 -163 -7 -22 -97 89 181
3359 181 28 -4 87 -56 -193 -67 -5 -71 5 140 83 8 41 -9 -106 -84 -46 -32 29 73 54 70 64 -49 -61 1 -75
3386 -75 -102 58 99 -9 32 125 -21 -104 16 -7 -116 -6 120 -6 -11 118 45 -94 -12 26 -84 -59 67 19 -20
3411 -20 47 44 -39 -22 -5 -52 -44 11 -4 -3 43 18 -16 20 1 -49 -1 27 -36 -6 81 12 -42 75 59 -86 -18 85 -50 -97
3441i7J69pj34P2Q9j29m7J26n0r3R5O7q1J2O8m1o0M9k7l5L5L0rL5Jm5J6J3p2k4
3471g4R8k8n6J06N4j29JQ4q6p2J18K4q6O9R7j12m7J02m9j30J02P5r8J3J18n1r6
3498e3M5K8r0PQ1nlN7j9m3j1l6k4L3LMN7J9m9PM9r6o3J16L4q6O3J19j14q5R4l0
3530Ij47N0J21o5jJ29kj13J9K9p6oQ6Mk8O3qq9j4j7n8J4N0K4N2O8j1l3Rn7p4L6
3562c6L7l3L8R1n0q0M5m3j19N2J00j9K4J62%j22K4%j62n8J14J0n2J01P3r0m4L6
3590ao1l7O3O0K4N9L1m6k9p1r0l1J7lM0J12K0m0M8j1j17PO6k2jJ27L8q2l6J8j35
3621h3r7P0K6pJ06J05l8j8M0p4r9L5L1k9M8P1l5m2Oo6o8OK8L5O2Q2J1Lj6q0o6
3652e3Nj4k1P9O2m2J6K8r1n7M6Jl0Q4R4j9k2M7o8j07JJ6m3M1J04jj5K6l0r4J4
$$ plain form
3441 -97 72 65 -69 3 92 -37 -84 42 -8 -101 -6 61 -20 -8 60 19 -41 8 -19 -54 -19 11 2 37 38 -7 9 22 -50 -74
3471 -74 24 -4 -60 46 100 -29 -28 56 -30 -102 16 40 -46 23 120 8 -39 63 14 -116 -14 61 -37 -24 94 43 -53
3498 -53 -8 20 -70 -63 18 13 10 67 48 5 -6 -42 -66 -33 -30 -26 31 50 1 8 57 -39 -102 14 48 -38 25 144 30 -55 39 9
3530 9 -138 -88 33 -32 -33 96 94 -19 0 29 -47 -53 33 37 9 72 64 -25 -39 -56 -114 -100 -50 -26 26 94 83 50 59 2 -72 -36
3562 -36 1 -32 6 97 47 -33 12 -31 -150 -98 2 -17 7 169 169 47 71 71 -91 -149 -35 -25 -77 24 97 7 -37 -1
3590 -1 -62 -99 -36 24 48 107 138 92 63 -8 -98 -129 -112 -115 -75 37 57 17 65 54 -63 -56 10 -12 -13 114 152 70 34 52 -83
3621 -83 -180 -110 -84 -91 15 120 82 64 104 30 -69 -34 -3 -32 16 87 52 10 16 -50 -118 -112 -84 -49 13 95 106 109 93 13 -53
3652 -53 -48 -62 -83 -4 58 16 32 60 -31 -88 -42 -41 -71 13 107 88 66 113 45 -62 -61 -45 -88 -47 57 56 41 67 37 -57 -43
3683d3K3m5M0Q1mk2K1k5p7j7J4oJ5P8K0mK0k8p3j9Qj9J3O8J6j7M5k9o1J3Mm4J6
3716c8R1ol1M7rq7k4L1m2J6P1K5j6K1J3o9k0J6k7jN0J6k4K1%n5k1J8j6J1N3L1
3748D5j7K2J7n4j5J1l2j2M0J1k1K4J4n8LL5m6pO3K2l8L4L5o1l6K8k2m4M0M1l2
3779a0K5K4l4j8K0j4k6L6K0l6J0L1l4rJ6k3k3M7Jj9M3J0l2j7M9j8n6M6L3m0rN3
3811D6l2l3M0mm7K0K5l4J2L2nm6M7Om9LM1j5j9K3pj4L0lk1PJ0m4J7L1j9k8M2J2
3845B4m2K7J9l9j0M5k4k6M9K9p0J8M9m4m0M1J4m9K4M8l8KJ1j1l7J7J1k0K3J0j6
3876eKJ9j4l8K6nk0L3K9j9NK6l9l3K9Ml8L7N2n0jL5k6m3K0J9m3L3M2j8rM3k2n8
3910b7J7J7m2J3N0rk3L4k3l6POk8J2N5j8rL8j5n8J8Kk2J3N5j8kM2j8n7J6J2k3
$$ plain form
3683 -43 -20 -65 -25 56 52 30 51 26 -51 -68 -54 -60 -45 33 53 49 69 41 -32 -51 -43 -62 -49 19 35 18 63 34 -27 -14 -10 -54 -38
3716 -38 53 47 16 63 54 -33 -57 -26 -68 -52 19 44 28 49 62 -7 -27 -11 -38 -39 11 27 3 24 24 -31 -52 -34 -50 -39 14 45
3748 45 28 50 67 13 -2 9 -23 -35 5 16 -5 19 33 -25 -22 13 -33 -40 23 45 7 41 76 15 -21 7 -15 -59 -19 22 -10
3779 -10 15 39 5 -13 7 -7 -33 3 23 -13 -3 28 -6 -15 1 -22 -45 2 3 -16 27 37 5 -12 37 19 -37 9 42 2 -7 46
3811 46 14 -19 21 17 -30 -10 15 -19 -7 25 20 -26 21 27 -22 -19 22 7 -12 11 4 -10 20 17 -4 3 13 -31 -14 17 -2 -30 12 24
3845 24 -18 9 28 -11 -21 24 0 -26 23 52 -18 0 49 5 -35 6 20 -29 -5 43 5 7 18 7 -30 -13 -2 -22 1 11 -5
3876 -5 -3 16 2 -36 -10 -15 -35 -2 27 8 13 39 0 -33 -4 0 -38 -1 51 1 0 35 9 -34 -14 5 -38 -5 37 19 10 53 31 -27
3910 -27 -10 7 -35 -22 28 19 -4 30 7 -29 -22 -16 -44 -32 23 5 -4 34 19 -39 -21 -19 -41 -28 27 9 7 49 31 -26 -10 2 -21
3943b1pN4j4oM1mo5J0Rl5J4L0Pj0K8J4n3j2J0j9j1L9jkL6ll4j0%k5nN8pj2M3J
3979C8m9JMl7%N5Qj3L4J6m2k4Ok2k3N0J4pK4J4m0j9J6k6j2L0OoK9Pk7j9J0k5k2
4014e1M1K1j1K0K1l3j4Ok8j7N0Lk2M4Kk2l0K2j8l6M4J4k5M7K7m2j7J1qk8J8K9
4046A8rj2L4k2j5Jpk0J8J0mK6J2k1j0K0m3k3J7L0k5L1K3k4j5J5j9l4M0J5j2PL7
4079C9j4k4K1j7l8RL3l0K1L1j0k2OJ3m1J0L0qQK1lk8Jk0j8MOK%K1J1j6J1lm1J6
4115a9K0k4J7L3ok8J3ok3J0J7mj3K8J4l4RJ8k7PjoMRJ2j2pOk3mJ5rJK3J1j7MJ0
4153A8l6lK8j1j2J3J1k1kK2j2PqjjJ9prRJ6k3j4K4nj4K2OpqJ%j1J6lk4J4J7j4
4191cjJ1rk4J7PrkK8j9j0K1j0j0QJ3k5JJ7mj0J9Mj9LJ7k2JJ1lmRQk1K1lj3J6J3
$$ plain form
3943 -21 -28 26 12 6 47 43 -22 -12 -3 -38 -24 6 13 3 31 45 -8 -20 -10 -29 -40 -1 -2 -4 32 29 -5 -15 -15 -40 -45 13 6 -6 37 38
3979 38 -11 -10 -6 -43 -43 12 20 7 41 57 15 -9 -3 -25 -48 2 16 9 33 47 7 -12 4 -22 -34 -4 2 -4 25 32 5 -14 -4 -29 -51
4014 -51 -10 11 0 20 41 8 -6 0 -28 -45 5 8 -14 30 32 10 -20 2 -16 -52 -8 6 -19 28 55 13 -4 7 -1 -29 -11 18
4046 18 9 -3 31 9 -6 -5 -12 -32 -14 -4 -8 18 30 9 -1 19 -24 -47 -30 0 -25 6 29 5 -10 5 -14 -48 -8 7 -5 2 39
4079 39 25 1 22 5 -33 -24 9 -21 0 31 21 -1 5 18 -23 -13 17 9 17 38 35 7 8 -12 -30 -26 -20 -18 -18 3 14 -2 9 6 -35 -19
4115 -19 1 -23 -6 27 21 -7 6 0 -23 -13 4 0 -13 15 29 -5 4 22 -5 2 1 -5 -1 8 20 8 1 7 -16 -20 -5 -14 -13 10 21 4 8 18
4153 18 -18 -21 7 -4 -16 -3 8 -13 -15 7 -5 2 -6 -7 -8 11 4 -5 4 20 -3 -17 7 2 -12 10 16 9 1 2 2 -9 7 4 -20 -6 11 -3
4191 -3 -4 7 -2 -26 -9 -2 -11 -13 15 -4 -14 7 -3 -13 -5 8 -17 -16 1 -3 -13 6 10 -9 -6 11 -11 -10 1 -2 -6 3 11 -10 11 8 -5 11 24
4230B4k2oJ2%j5RRj4JPj1j2K5Nl6J1J4mj2PLj2LJ0nj2K4mKJ3%j5PMj3nJ5j8pK9
4270A1j0k3K0K1l1OK1rlJ4Mk3oK4k1j2J9mk3RK6l6QK7qk3K7kj2mJ6j6j4K1jqP
4307hrQJ1lj0J8K4m0J8K4j6k7J7Rm4J7K3j4j8K7Pl7J3J7j7JK7mk5J7Qk7jQj0o
4343b2RjKP%j%KlPKj1kK8j3k5J8J8l4KL7j7k2L9J4m1RJ8j8l3L5Mk0JJ8j1k1K3
4381bNk0KJ8rKJ2rmMJnkqLNJ1j9J3J3k3mL8j0l1K2J6k4%K3rk4K6Ol5J8L2j8oJ4
4421B2ok6J1J6k0rK8j4nJPNj2Pj2PJjj1K1j4lONk0K6Nk7mL4j6j2J8J4k9nL2k1
4459aj6J5J8l4J0K3j5j4K5Lk0QJnj6L1j0j5J3j0Rj5J1j0J3jj9K0J6k4oJ6j6rK7
4494CJj5LL0j9pJ4Ml5J2K8j6rOJ8k1%J7j0k2J8Kj1QJ1j2%j1kKJ7k8K9Qj8j0J3
$$ plain form
4230 24 2 -4 8 8 -7 2 11 -3 -2 5 -6 -18 7 12 -24 -13 1 -3 -15 -8 -5 -17 -14 -4 -9 -21 3 -1 1 14 14 -1 6 10 -3 -8 7 -11 -18 11
4270 11 1 -22 -2 19 -12 -6 15 6 3 17 21 -2 -8 16 -5 -17 2 -2 -25 -16 10 -26 -18 9 1 -22 5 3 -9 -13 3 -13 -27 -6 -7 -15 -8
4307 -8 -17 -9 2 -1 -11 7 31 -9 9 33 17 -10 7 16 -28 -11 12 -2 -20 7 14 -23 -10 7 -10 -9 18 14 -11 6 14 -13 -14 -6 -16 -22
4343 -22 -13 -14 -12 -5 -5 -6 -6 -4 -7 0 2 -9 -11 17 4 -21 -3 15 -19 -17 20 3 -19 20 34 -7 2 20 2 -31 4 8 -12 -11 7 -4 -25 -2
4381 -2 3 -17 -15 3 -6 -4 8 -1 -5 -1 0 -5 -7 -15 -12 -7 4 -15 -2 11 -12 -16 22 12 -19 3 19 -5 -5 18 9 -15 11 17 -18 0 32 14 8 22
4421 22 16 -10 1 17 -3 -12 16 2 -3 -2 5 10 -2 5 -7 0 1 0 -11 10 -4 -7 -1 4 -16 10 15 -12 -16 18 2 -10 8 22 -7 -12 20 -1
4459 -1 -17 -2 16 -18 -8 15 0 -14 11 14 -6 2 3 -2 -18 13 3 -12 1 -9 0 -15 -4 -14 -1 -2 -21 -1 15 -9 -15 1 -15 -24 3
4494 3 4 -11 -8 22 3 -4 10 14 -21 -9 19 3 -6 0 18 -3 -3 14 4 -18 0 2 -9 -1 10 -2 -2 -13 -15 -13 4 -24 5 13 -5 -15 -2
4531bkj2KJ2k3LL6k2j4K3J1k8JK5j3pJ9J2k4OJ1j8j0J6J3j6kJ3j1LpJ2pn%oPo
4569a0OLjKJkj6MQlj0J4K0l6%L3j9j9J9J5k8PJ9rpJ7Nl1K4OkolJ5j6qJ6pkOpm
4611fRloJ4j0%oKJLLj2NKj1NK%j1PK0j2oJ0Rj8JK1j1lJ0jj7RrMMPKj3KJ1j3kP
4656@kqJ1J5k2LPpm%%kmm%J0nJnJ3j9J6kJ0j2J7lj3LMOj0J9qnpJ5j1JNJ2k7QR
4700Er%Rrj1jJ1jnJ8jj0pjOj0J0OnNpj5J7j2kJ7loJ1OloJ5j7nMJ0j5J2PJj3J5
4743A1Oj7lRllKpnRkj7mJ4kj3K6poQRj0PqnQrOrRkmMMj4J6RRk5J6mrRjj0LJ3L
4791A1k1PK1j2nPmnpNJn%oMmKqpQJJ0J5j8LMjlPJqjLJ0j2J4j5oRnJJ1JlrK2nj6
4839hLJ2j0nK1j8NlojNKj1JRkNMqkj3PrjJ3J1j6J6Mj7K2Lk0JPjmPJ6k1OKojMj
$$ plain form
4531 -2 -4 -16 -14 -2 -25 -22 14 -8 -22 1 12 -16 -15 10 -3 -10 9 21 -3 3 14 -4 -14 2 15 -1 -3 10 -1 2 -5 7 0 -5 -5 -11 -4 -10
4569 -10 -4 -1 -2 0 1 -1 -17 -13 -5 -8 -18 -4 16 -20 -20 13 -6 -25 -6 9 -19 -12 7 -2 -9 8 13 -18 6 12 10 4 1 16 0 -8 8 1 -1 5 -2 -6
4611 -6 3 0 -6 8 -2 -2 -8 -6 -5 -2 1 -11 -6 -4 -15 -10 -8 -8 -19 -12 8 -4 -10 0 9 -9 -8 13 2 -1 9 8 -9 0 -9 -5 -1 6 8 -5 -3 8 -5 -7 0
4656 0 -2 -10 1 16 -6 -3 4 -3 -7 -7 -7 -9 -13 -17 -17 -7 -12 -11 -16 -3 -22 -6 -8 2 -10 7 4 -9 -6 -2 4 -6 13 5 0 -7 8 -3 -2 3 15 -12 -4 5
4700 5 -4 -4 5 -4 -15 -16 -5 -6 -11 7 6 -4 -11 -12 -6 -16 -6 0 -5 0 -7 -22 -5 -17 -19 -2 -5 -11 0 6 3 -3 12 -5 -10 -6 4 -11 1 8 9 -4 11
4743 11 17 0 -3 6 3 0 2 -5 -10 -1 -3 -20 -24 -10 -12 -25 1 -6 -12 -4 5 -5 2 -6 -11 -3 -12 -6 -15 -6 -8 -12 -8 -4 -18 -2 7 16 -9 7 3 -6 3 2 -8 -5 8 11
4791 11 -10 -3 18 6 1 8 4 -1 -8 -3 -2 -7 -7 -13 -9 -13 -11 -19 -26 -18 -17 -7 8 -10 -7 -3 -4 -7 0 1 -7 -8 -5 5 -7 7 -8 -14 -5 -10 -9 2 3 0 -9 13 8 -8
4839 -8 -5 7 -3 -8 13 -5 0 -3 -9 -10 -5 -3 -14 -13 -4 -6 -1 3 -5 -7 -20 -13 -22 -23 -10 1 -15 1 5 -12 10 13 -7 -6 1 0 -4 3 19 -2 4 6 0 -1 3 2
4885Bj3J0lnRKrLRmj1JJ2opRmMKj8J0JPj7nQNqJ2pQmJ2j4kJ5K%oJ4j2nMQj6PK
4932Bj2J2J3j9J2Kk2RLj2rJ4LqkJ0j2qJ2%llK2nkPj6LOj3kkJ8MqPKlJ1k2KR%J3
4976A3mQprQj1qJ1J9k9J1J0j9j1J0jj7J7jJj2K4j3LlPpmOjOP%NmokmjjQJ1lom
5021cNj3JJ0j4%K2joJ7j8oj8J9Pj4J1Nj4K%L%knj3J9Lj2J7Rk1J3Jj1mJ6KmJ0O
5062A9rlJqJJ3j4K%lpOlLj4J3pKNJ6j9lMRj2KknJ1mokJ8j3qPJ6j5PNoQJj1nJ9
5108ILj3RqJ3mPrnPkj0%MqpJ2lj6J2J3j1kLrMpJ%%J0J2qRj0L%rRrMJ1kjKlmjL
5157aK%kOllqJ3Pj3J0kLj7J3kj1qJ2mqRNnOoj5R%pNqJ3PJ2qOrlplJ4%rJ7MMk9
5205a4J2pnJ2LnOKlkJ9k0qMj0jJ2MKOrqkmolRJ1%LlNj3O%j3J2KK1olOpOj4rJ5
$$ plain form
4885 2 -11 -1 -4 -9 0 2 -7 -4 5 1 -10 -9 3 -3 -10 -1 -5 -1 1 -17 -7 -6 1 -16 -21 -13 -8 -16 -4 -11 -3 -7 5 -9 -11 4 6 6 0 14 2 -3 1 9 -7 0 2
4932 2 -10 2 15 -4 8 10 -12 -3 0 -12 -21 -7 -4 -12 -14 -4 -16 -24 -12 -12 -15 -18 4 -1 -3 4 -12 -9 -3 -16 -18 -20 -2 2 -6 1 3 0 11 -11 -9 0 0 13
4976 13 9 17 10 1 9 -2 -10 1 20 -9 2 12 -7 -18 -8 -9 -26 -9 -10 -9 -21 3 -10 -7 -10 -3 -10 -14 -8 -9 -3 4 4 9 5 -1 -3 -7 -8 -9 -1 10 7 1 -3
5021 -3 2 -11 -10 0 -14 -14 8 7 1 18 0 -6 -24 -5 2 -12 -1 4 -10 -8 -8 -5 -5 -7 -12 -25 -6 -3 -15 2 11 -10 3 4 -7 -11 5 7 3 13 19
5062 19 10 7 8 0 1 14 0 2 2 -1 -8 -2 -5 -2 -16 -3 -10 -8 -3 13 -6 -9 -5 4 -8 -6 -8 -13 -2 -6 -12 -14 4 -9 -17 -10 6 -9 -2 3 -3 5 6 -5 -10 9
5108 9 12 -1 8 0 13 9 16 7 2 9 7 -3 -3 1 -7 -14 -2 -5 -21 -9 4 -7 -9 -6 -15 -11 -18 -17 -17 -17 -7 5 -3 6 -4 -1 -1 -10 -1 -10 -6 5 3 2 4 1 -3 -4 -1
5157 -1 1 1 -1 5 2 -1 -9 4 11 -2 8 6 9 -8 5 3 -8 -16 -4 -8 -16 -7 -2 -7 -1 -7 -22 -13 -13 -20 -15 -23 -10 -3 9 1 7 -2 -5 -12 -15 -1 -1 -10 7 11 15 -14
5205 -14 -2 -9 -14 -2 1 -4 2 4 1 -1 18 -2 -10 -6 -16 -17 -5 -1 1 7 -2 -10 -12 -16 -22 -25 -16 -5 -5 -2 -5 0 -13 -7 -7 -20 -8 -6 15 9 6 12 5 11 -3 -12 3
5252CmPoJ3Oj0j4kq%J0RqPPj0JnpjJ0j0RO%pkPj6ONLJKLmNo%oM%jQ%lMQj2Nmm
5304akkK0j5kLj3NMOmj4J0knPMpmQj3nJ4%J0Nj5nOmNMjRpRj1OoK%j0J9mJLqjM
5353CPj5lRPj0jj3%J1PlJrJk0L2lrOkjMRpmlJJlLJ1j1J2j9J1%nMqJ3oMmN%ljo
5402gNLm%JLqJ3j4K%mnJ1NoqK2k0noJ6qmJ1jJ0J0Kj4jMj0OQmOlnMj1%Pj3J6Rk2
5449iJ2mLj2J0j9lP%J1R%j3kRj3j3J4RpNJNRkk0nNJ2j1K0Jj0LMj0Mq%jMJ0nqJ
5494grLQoqJ0Qj1J2%oj6J3JjnQQj7J3Oj6JJ3k0KK5j1lJ3oM%olmKKJ2jNooOnrP
5541@mJRmoMkj6kPpJ4n%knJ2j3NoJ8pMonQNJnNj9J1J2rOLj0NlRj0jMmrJ5j2OP
5590aLj4QjpPnJJLj0jNoM%pJkM%J2rJ5rONojrJ4KjrJ4moJ4j9LJj0J2Kl%kLj5J1
$$ plain form
5252 3 -1 6 0 13 19 9 -5 -7 -15 -15 -5 4 -4 3 10 0 1 -4 -11 -12 -2 -12 -3 3 3 -4 -6 1 -15 -9 -4 -1 0 2 5 1 6 0 0 -6 -2 -2 -3 5 5 2 6 14 2 7 3 -1
5304 -1 -3 -5 15 0 -2 1 -12 -7 -3 3 -1 -15 -5 -7 -12 -5 -1 -8 -12 -4 -17 -22 -8 -8 2 7 -8 -13 -7 -11 -6 -2 -3 6 -1 8 -3 3 -3 -1 -1 -11 8 4 5 8 0 -1 3
5353 3 10 -5 -8 1 8 -2 -3 -16 -16 -5 2 -1 0 -9 -8 -28 4 1 -8 -2 -4 -5 -1 8 1 -3 -6 -5 -4 -7 -4 7 -4 8 -11 0 0 -5 -1 -9 4 -2 2 -2 3 3 0 -1 -7
5402 -7 -2 1 -3 -3 -2 1 -7 6 -8 -6 -6 -10 -15 -4 1 -5 -13 9 -11 -16 -22 -6 -14 -18 -7 -8 2 12 14 0 -1 3 -7 -1 7 3 9 6 1 5 -6 -6 1 -12 4 13 -9
5449 -9 3 -1 2 -10 0 -19 -22 -15 -15 -4 5 5 -8 -10 -1 -14 -27 -13 -4 -11 -6 -5 0 9 7 -13 -18 -13 -1 -12 8 9 -1 2 6 -4 0 -8 -8 -9 -5 5 0 -8 -7
5494 -7 -16 -13 -5 -11 -19 -9 -1 -12 0 0 -6 -22 -9 -8 -9 -14 -6 2 -15 -2 4 -12 -11 2 -18 -16 9 -2 -5 8 2 6 6 0 -3 -7 -5 -3 9 8 13 7 1 7 2 -7 0
5541 0 -4 -3 6 2 -4 0 -2 -18 -20 -13 -20 -6 -11 -11 -13 -18 -6 -19 -14 -20 -2 -9 -5 -11 -16 -8 -3 -2 -7 -2 -21 -10 2 -7 -1 2 -8 -3 -6 3 -7 -8 -4 -8 -17 -2 -14 -8 -1
5590 -1 2 -12 -4 -5 -12 -5 -10 -9 -8 -5 -15 -16 -11 -17 -13 -13 -20 -19 -21 -17 -17 -5 -14 1 -8 -2 3 -3 -4 -13 1 3 2 -7 7 3 -3 11 -8 -5 -4 -14 -2 0 -3 -3 -5 -2 -17 -6
5640fLnlnJ2mmKOj7J3KrkLJ1rOkjkrMJ2OJ3oojnrJ3j0J7jlJ2j2moLj6NRJKLnJ
5689cj6J1rmRJ6j0JjoRkqj1J5KRj1J7j4Mj0QkoOR%Qjo%q%nMmPNJ2j6%kqj0J3l
5736a1KJ1olk%j0LJ3pOqJ2RppkpOKJ0LJj3ONj1MMm%j%%Kj3O%LlN%JmONj0qjMJ
5787hRj8J4nJ0j6%mJ8j4JJ1qJ2%J0j7MLLloLj1J4rnlK3j1OpOj1Q%j0mRj0J2Nj6
5830a5MJ7j0qMNomNJj0J6j3kORjpQqjJ0JJj1J2qMOKMojj0%nJ0Njj0qOKj2QoPm
5878a4QMo%J3jj2LLj2J2j3MQoOlnOMNj1jLJ5j0%JnjJ5nLqMq%OOj1NkoPPj5qRj
5927gJnKj5J6jJ6j3lNnnOJ4j6RNpPmjKkmJjOqQMnOlmLJpkQnJ%%rJQnMj6ROqPJ
5981dj3NMK%MpKPj3J5j0J0mKkJKlnQRj5PJ2j6LoJ2pKj4kJ4nkkKjOqKjJ0kLmlj
$$ plain form
5640 -6 -3 -8 -11 -16 -4 -8 -12 -10 -4 -21 -8 -6 -15 -17 -14 -3 -12 -6 -8 -9 -11 -20 -16 -4 2 15 9 3 2 -3 -12 1 -9 8 7 4 16 4 0 -6 -3 -19 -14 -5 -4 -2 1 -4 -3
5689 -3 -19 -8 -17 -21 -12 4 -6 -5 -6 -12 -3 -5 -13 -24 -9 -7 2 -9 8 -6 -2 -12 -4 -6 -12 -6 3 3 11 10 4 4 -4 -4 -9 -5 -9 -2 3 15 -1 -1 -3 -11 -21 -8 -11
5736 -11 -9 2 -4 -7 -9 -9 -19 -16 -3 -10 -4 -12 0 9 2 -5 -7 -14 -8 -6 4 7 8 -5 1 6 -5 -1 3 -1 -1 -2 -2 -2 0 -13 -7 -7 -4 -7 -2 -2 -1 -5 1 6 -4 -12 -13 -9 -8
5787 -8 1 -17 -3 -8 2 -14 -14 -18 0 -14 -13 -2 -10 2 2 12 -5 -1 2 5 2 -4 -1 -12 2 -7 -12 -15 8 -3 3 -4 2 -9 -1 -1 -11 -15 -6 -16 -4 1 -15
5830 -15 -11 6 -4 -12 -8 -3 -9 -13 -8 -7 -17 -1 -14 -16 -10 -1 -2 -9 -1 -9 -10 0 1 2 -9 3 -5 -1 5 7 11 5 4 -6 -6 -11 -1 4 3 -7 -15 -9 -7 -19 -11 -17 -10 -14
5878 -14 -6 -2 -8 -8 5 4 -8 -5 -2 -14 -2 -15 -11 -3 -9 -3 -6 -11 -5 -1 4 -7 -8 -5 10 0 0 1 -4 -5 10 5 8 0 4 -4 -4 2 8 -3 2 0 -6 1 8 -7 -15 -6 -7
5927 -7 -6 -11 -9 -24 -8 -9 7 -6 -9 -4 -9 -14 -8 6 -10 -1 4 -3 4 0 -1 1 -1 -5 -4 -5 1 -7 1 5 0 6 3 -1 2 3 -4 -6 2 -3 -2 -2 -2 -11 -10 -2 -7 -3 -19 -10 -4 -12 -5 -4
5981 -4 -17 -12 -8 -6 -6 -2 -9 -7 0 -13 2 -8 2 -2 0 -2 -1 1 -2 -7 1 10 -5 2 14 -2 1 -5 7 0 2 -12 -14 0 -5 -7 -9 -7 -8 -2 -10 -8 -9 1 -1 2 -2 -5 -6
6030fLj8%J3J0Qj5kLJ0Pk0NJjORqkjmNjp%NnPLqq%jPmj0J5j1KJ0rJ3jprJ5Rj7
$$ plain form
6030 -6 -3 -21 -21 -8 2 10 -5 -7 -4 6 13 -7 -2 -1 -2 4 13 5 3 2 -2 3 2 -5 -5 0 -5 2 5 -3 -11 -11 -12 -5 -9 -19 -4 -15 -13 -3 -12 1 0 -7 -16 -1 8 -9
$$ [...]
8191A2
##END NTUPLES=NMR FID
##END=
