##TITLE=1H_LY-1Dix.60.4
 CD3CN,8 sc, 
 1.03.2021
##JCAMPDX= 6.0         $$ Bruker NMR JCAMP-DX V2.0
##DATA TYPE= NMR FID
##DATA CLASS= NTUPLES
##ORIGIN= UXNMR, Bruker Analytische Messtechnik GmbH
##OWNER= root
$$ XWIN-NMR		Version 3.5
$$ Mon Mar  1 13:36:36 2021 Russian Standard Time (UT+4h)  she@DPX200
##.OBSERVE FREQUENCY= 200.1315066352
##.OBSERVE NUCLEUS= ^1H
##.DELAY= (6, 6)
##.ACQUISITION MODE= SIMULTANEOUS
##.ACQUISITION SCHEME= undefined
##.AVERAGES= 8
##.DIGITISER RES= 18
##SPECTROMETER/DATA SYSTEM= spect
##.PULSE SEQUENCE= zg30
##.SOLVENT NAME= CDCl3
##.SHIFT REFERENCE= (INTERNAL, CDCl3, 0, 15.7039)
##AUDIT TRAIL= $$ (NUMBER, WHEN, WHO, WHERE, WHAT)
$$ ##TITLE= Audit trail, XWIN-NMR		Version 3.5
$$ ##JCAMPDX= 5.01
$$ ##ORIGIN= Bruker BioSpin GmbH
$$ ##OWNER= she
$$ F:/spectra/data/she/nmr/H-F/1/audita.txt
$$ ##AUDIT TRAIL=  $$ (NUMBER, WHEN, WHO, WHERE, WHAT)
(   1,<2021-03-01 13:35:05.31 +0400>,<she>,<DPX200>,
      <created by zg, POWCHK disabled, PULCHK disabled
       configuration hash MD5:
       00 E9 B6 7A A2 85 ED C7 34 08 36 98 17 FE 4E 26
       data hash MD5: 16K
       BC D8 16 4F BF 3E 87 43 3F 8C 10 A4 CF 21 88 5F>)
$$ ##END=
$$ 
$$ hash MD5
$$ 58 47 50 97 55 4E 15 0B 8C 5A 20 EA 44 87 7B B9
##$RELAX= 
##$RELAX= 
##$RELAX= 
##$RELAX= 
##$RELAX= 
##$RELAX= 
$$ Bruker specific parameters
$$ --------------------------
##$DU= <F:/spectra>
##$EXPNO= 1
##$NAME= <H-F>
##$PROCNO= 1
##$TYPE= <nmr>
##$USER= <she>
##$AMP= (0..31)
100 100 100 100 100 100 100 100 100 100 100 100 100 100 100 100 100 100 
100 100 100 100 100 100 100 100 100 100 100 100 100 100 
##$AQSEQ= 0
##$AQ_mod= 1
##$AUNM= <au_zg>
##$AUTOPOS= <>
##$BF1= 200.13
##$BF2= 200.13
##$BF3= 200.13
##$BF4= 200.13
##$BF5= 200.13
##$BF6= 200.13
##$BF7= 200.13
##$BF8= 200.13
##$BYTORDA= 1
##$CFDGTYP= 0
##$CFRGTYP= 5
##$CHEMSTR= <none>
##$CNST= (0..31)
1 1 145 1 1 1 1 1 1 1 1 1 1 1 1 1 1 1 1 1 1 1 1 1 1 1 1 1 1 1 1 1 
##$CPDPRG= <>
##$CPDPRG1= <>
##$CPDPRG2= <>
##$CPDPRG3= <>
##$CPDPRG4= <mlev>
##$CPDPRG5= <mlev>
##$CPDPRG6= <mlev>
##$CPDPRG7= <mlev>
##$CPDPRG8= <mlev>
##$CPDPRGB= <>
##$CPDPRGT= <>
##$D= (0..31)
0 1.2 0 0 0 0 0 0 0 0.06 0 0.03 0 0 0 0 0.0002 0 0 0 0 0 0 0 0 0 0 0 0 
0 0 0 
##$DATE= 1614591304
##$DBL= (0..7)
120 120 120 120 120 120 120 120 
##$DBP= (0..7)
150 150 150 150 150 150 150 150 
##$DBP07= 0
##$DBPNAM0= <>
##$DBPNAM1= <>
##$DBPNAM2= <>
##$DBPNAM3= <>
##$DBPNAM4= <>
##$DBPNAM5= <>
##$DBPNAM6= <>
##$DBPNAM7= <>
##$DBPOAL= (0..7)
0.5 0.5 0.5 0.5 0.5 0.5 0.5 0.5 
##$DBPOFFS= (0..7)
0 0 0 0 0 0 0 0 
##$DE= 6
##$DECBNUC= <off>
##$DECIM= 32
##$DECNUC= <off>
##$DECSTAT= 4
##$DIGMOD= 1
##$DIGTYP= 9
##$DL= (0..7)
0 120 120 120 120 120 120 120 
##$DP= (0..7)
150 150 150 150 150 150 150 150 
##$DP07= 0
##$DPNAME0= <>
##$DPNAME1= <>
##$DPNAME2= <>
##$DPNAME3= <>
##$DPNAME4= <>
##$DPNAME5= <>
##$DPNAME6= <>
##$DPNAME7= <>
##$DPOAL= (0..7)
0.5 0.5 0.5 0.5 0.5 0.5 0.5 0.5 
##$DPOFFS= (0..7)
0 0 0 0 0 0 0 0 
##$DQDMODE= 0
##$DR= 18
##$DS= 0
##$DSLIST= <SSSSSSSSSSSSSSS>
$$ [...]
##$SUBNAM2= <"">
##$SUBNAM3= <"">
##$SUBNAM4= <"">
##$SUBNAM5= <"">
##$SUBNAM6= <"">
##$SUBNAM7= <"">
##$SUBNAM8= <"">
##$SUBNAM9= <"">
##$SW= 16.9725356469052
##$SWIBOX= (0..15)
0 0 2 0 0 0 0 0 0 0 0 0 0 0 0 0 
##$SW_h= 3396.73913043478
##$TD= 16384
##$TD0= 1
##$TE= 0
##$TE2= 300
##$TE3= 300
##$TEG= 300
##$TL= (0..7)
0 120 120 120 120 120 120 120 
##$TP= (0..7)
150 150 150 150 150 150 150 150 
##$TP07= 0
##$TPNAME0= <>
##$TPNAME1= <>
##$TPNAME2= <>
##$TPNAME3= <>
##$TPNAME4= <>
##$TPNAME5= <>
##$TPNAME6= <>
##$TPNAME7= <>
##$TPOAL= (0..7)
0.5 0.5 0.5 0.5 0.5 0.5 0.5 0.5 
##$TPOFFS= (0..7)
0 0 0 0 0 0 0 0 
##$TUNHIN= 0
##$TUNHOUT= 0
##$TUNXOUT= 0
##$USERA1= <user>
##$USERA2= <user>
##$USERA3= <user>
##$USERA4= <user>
##$USERA5= <user>
##$V9= 5
##$VALIST= <valist>
##$VCLIST= <CCCCCCCCCCCCCCC>
##$VD= 0
##$VDLIST= <DDDDDDDDDDDDDDD>
##$VPLIST= <PPPPPPPPPPPPPPP>
##$VTLIST= <TTTTTTTTTTTTTTT>
##$WBST= 1024
##$WBSW= 4
##$XGAIN= (0..3)
0 0 0 0 
##$XL= 0
##$YL= 0
##$YMAX_a= 1000290
##$YMIN_a= -935264
##$ZGOPTNS= <>
##$ZL1= 120
##$ZL2= 120
##$ZL3= 120
##$ZL4= 120
##$ABSF1= 10
##$ABSF2= 0
##$ABSG= 5
##$ABSL= 3
##$ALPHA= 0
##$AQORDER= 0
##$ASSFAC= 0
##$ASSFACI= 0
##$ASSFACX= 0
##$ASSWID= 0
##$AUNMP= <proc_1d>
##$AZFE= 0.1
##$AZFW= 0.1
##$BCFW= 1
##$BC_mod= 2
##$BYTORDP= 1
##$COROFFS= 0
##$CY= 11.3945322036743
##$DATMOD= 1
##$DC= 2
##$DFILT= <>
##$DTYPP= 0
##$F1P= 15.9154993809931
##$F2P= -4.1035820241983
##$FCOR= 0.5
##$FTSIZE= 0
##$FT_mod= 4
##$GAMMA= 1
##$GB= 0.15
##$INTBC= 1
##$INTSCL= 1
##$ISEN= 128
##$LB= 0.24
##$LEV0= 0
##$LPBIN= 0
##$MAXI= 10000
##$MC2= 0
##$MEAN= 0
##$ME_mod= 0
##$MI= 1.114404
##$NCOEF= 0
##$NC_proc= 0
##$NLEV= 6
##$NOISF1= 3.799351
##$NOISF2= 2.8
##$NSP= 1
##$NTH_PI= 0
##$NZP= 0
##$OFFSET= 15.70392
##$PC= 1
##$PHC0= -10764.74
##$PHC1= 12.20094
##$PH_mod= 1
##$PKNL= yes
##$PPARMOD= 0
##$PSCAL= 0
##$PSIGN= 0
##$REVERSE= no
##$SF= 200.130013532006
##$SI= 16384
##$SIGF1= 3
##$SIGF2= 2
##$SINO= 400
##$SIOLD= 16384
##$SREGLST= <1H.CDCl3>
##$SSB= 0
##$STSI= 0
##$STSR= 0
##$SW_p= 3612.71676300578
##$SYMM= 0
##$S_DEV= 0
##$TDeff= 0
##$TDoff= 0
##$TI= <>
##$TILT= no
##$TM1= 0
##$TM2= 0
##$TOPLEV= 0
##$USERP1= <user>
##$USERP2= <user>
##$USERP3= <user>
##$USERP4= <user>
##$USERP5= <user>
##$WDW= 1
##$XDIM= 8192
##$YMAX_p= 0
##$YMIN_p= 0
$$ End of Bruker specific parameters
$$ ---------------------------------
##NTUPLES= NMR FID
##VAR_NAME=  TIME,          FID/REAL,        FID/IMAG
##SYMBOL=    X,             R,               I
##VAR_TYPE=  INDEPENDENT,   DEPENDENT,       DEPENDENT
##VAR_FORM=  AFFN,          ASDF,            ASDF
##VAR_DIM=   8192,          8192,            8192
##UNITS=     SECONDS,       ARBITRARY UNITS, ARBITRARY UNITS
##FACTOR=    0.0002944,     1,               1
##FIRST=     0,             0,               0
##LAST=      2.4114304,     0,               0
##MIN=       0,             -935264,         0
##MAX=       2.4114304,     1000290,         0
$$ Real data points
##PAGE= N=1
##DATA TABLE= (X++(R..R)), XYDATA
$$ [...]
2350C988j427n316q47N169L148m343m723K238N854J82o156k740N051N021l169
$$ 3988 2561 -2755 -3602 1567 4715 372 -4351 -2113 3741 3923 -2233 -4973 78 5099 1930
2365A930o285N51O793J868n728m570M022O151j435o874j247O206M314m682o384
$$ 1930 -4355 -3804 2989 4857 -871 -5441 -1419 4732 3297 -3577 -4824 1382 5696 1014 -5370
2380e370K256P271Q46p013l948N783O028l163p643K0P535L281o371n949M019P608
$$ -5370 -3114 4157 5003 -2010 -5958 -175 5853 2690 -4953 -4933 2602 5883 -488 -6437 -2418 5190
2396E190o09q293k660P127N875n105p523J641Q679J646p872m928N924P488k657
$$ 5190 4581 -3712 -6372 755 6630 1525 -5998 -4357 4322 5968 -1904 -6832 -908 6580 3923
2411C923q517r46Q383M487o774p113L865Q607k46q877l358P439O534m804q716
$$ 3923 -4594 -5540 2843 7330 556 -6557 -2692 5915 5669 -3208 -6566 873 7407 2603 -6113
2426f113J327Q994K567q348n688N712P901k433r115j383Q581M884o668p577L415
$$ -6113 -4786 4208 6775 -1573 -7261 -1549 6352 3919 -5196 -6579 2002 6886 218 -7359 -3944
2441c944Q786O77q772m211P136P133m348q580Q41R025L065p677o295N422Q417
$$ -3944 4842 5519 -3253 -7464 -328 6805 2457 -6123 -5282 3743 6808 -869 -7164 -1742 6675
2456F675j877q658j789P643N268n714p266K476Q346J047q078m058O053O558l425
$$ 6675 4798 -3860 -5649 1994 7262 1548 -5718 -3242 5104 6151 -1927 -5985 68 6626 3201
2471C201q079J51P541K941o366n704L732P276r96p537k528O619N024m391o490
$$ 3201 -4878 -4727 2814 5755 -611 -6315 -2583 4693 3697 -3840 -6368 251 5275 884 -5606
2486e606J300P342J616o515m254M948O203k208o763n29O475L622m835n184K590
$$ -5606 -4306 3036 4652 -1863 -6117 -1169 5034 2826 -3937 -4466 2009 5631 796 -4388 -1798
2501a798O390m0n850k877M858M809k755n918J46O263J678m926m076K889N286q08
$$ -1798 4592 4552 -1298 -4175 683 5492 2737 -3181 -3035 3228 4906 -20 -4096 -1207 4079 3271
2517C271o025j277M602L278l409m678J033N155J002m807k872L474M327j848m603
$$ 3271 -2754 -4031 571 3849 440 -4238 -3205 1950 2952 -1855 -4727 -1253 3074 1226 -3377
2532c377l12M564K138l299l629K245M403j55m248j289L361L326j979l756O96L923
$$ -3377 -3689 875 3013 -286 -3915 -1670 2733 2578 -1670 -2959 402 3728 1749 -2007 -1311 2612
2548B612R70l193k514K268L294r56l658p05L164J645k157k885R01K667L16k906
$$ 2612 3582 389 -2125 143 3437 2481 -1177 -1882 1282 2927 770 -2115 -1214 1453 1769 -1137
2564a137j221K062J555j281k196j27J957J220k056j345J225J832k83j747m48J944
$$ -1137 -2358 -296 1259 -22 -2218 -2345 -388 832 -1224 -2569 -1344 488 205 -1542 -1990 -46
2580d6J024j106j142N96J653M1j117K0O91Q60l89p85L34O46M9m26k04J7K35l39
$$ -46 978 -128 -1270 -674 979 1020 -97 -77 614 1474 1085 300 634 1280 1329 903 699 716 951 612
2600F12k97L05J41q75l9M15j17o25m49M39N75o87j175K41J377J67j368o69R65
$$ 612 315 620 761 -114 -153 262 145 -480 -929 -490 85 -602 -1777 -1536 -159 8 -1360 -2029 -1064
2619a064J119k4j896j82K323R25j460j580J319K253J78k865o02K646J827j583
$$ -1064 55 31 -1865 -2047 276 1201 -259 -1839 -520 1733 1911 -954 -1556 1090 2917 1334
2635A334k476O71L016M52k730k046K341K585r79l427m99L082J748k882l171J728
$$ 1334 -1142 -471 2545 2997 267 -1779 562 3147 2168 -1259 -1758 1324 3072 190 -2981 -1253
2651a253L497m14l923j518L304K743k200m210Q42M705L97l639k498K806L872j058
$$ -1253 2244 1830 -2093 -3611 -307 2436 236 -3974 -3132 1573 1970 -1669 -4167 -1361 2511 1453
2667A453m523m49M623K663l497l771K247M519M29m685k236M452L566k472m539
$$ 1453 -3070 -3519 1104 3767 270 -3501 -1254 3265 3694 -991 -3227 1225 4791 2319 -2220
2682b220J70M949K121m753l665L061M673j197n413j219M502L483m013n059J837
$$ -2220 -2050 2899 5020 267 -3398 -337 4336 3139 -2274 -3493 1009 4492 479 -4580 -2743
2697b743N305K60n186k613L826M606k397n531O4N722K165m381m127K722N761l67
$$ -2743 2562 2822 -2364 -4977 -1151 3455 1058 -4473 -4409 1313 3478 -903 -5030 -2308 3453 3086
2713C086o085j535N386L971l314n149J060O196J393n714l739M717N259k184n753
$$ 3086 -2999 -4534 852 4823 1509 -3640 -2580 3616 5009 -705 -4444 273 5532 3348 -2405
2728b405o08N551L176m862n218K882N661l92n708k764N008M499l619n999J095
$$ -2405 -3013 2538 5714 852 -4366 -1484 4177 3785 -1923 -4687 321 4820 1201 -4798 -3703
2743c703O241R17n195l829L544N541j449o307o93N872L051m126m791J964O337
$$ -3703 2538 3455 -1740 -5569 -2025 3516 2067 -4240 -4933 939 3990 -136 -4927 -2963 3374
2758C374K79n742k182M779M399k722n503N26N880J949m832m114L604M991j194
$$ 3374 3653 -2089 -4271 508 4907 2185 -3318 -2792 3088 5037 205 -3909 -305 4686 3492
2773C492n531j193M713L316l717m795J832N062K12m923k769L827M243k581m976
$$ 3492 -2039 -3232 1481 4797 1080 -3715 -1883 3179 3391 -1532 -4301 -474 3769 1188 -3788
2788c788K72M584J667l838l150J858M875n57m756j020M093K760k401l717O95M786
$$ -3788 -3516 1068 2735 -1103 -4253 -2395 2480 1923 -2833 -3853 240 3000 599 -3118 -2423 2363
2804B363J097m379k049L029L379j134l903n76L830K085k920l176J758L437j6l387
$$ 2363 3460 -919 -2968 61 3440 2306 -1597 -2173 1657 3742 822 -2354 -596 2841 2825 -562
2820e62j891K855K684k036l331M98K998Q30k615k354J861K757p91l071j91K256
$$ -562 -2453 402 3086 1050 -2281 -1783 1215 2045 -570 -2924 -1063 1694 903 -2168 -2359 -103
2836a03J609j644k374N07L050M34k617j246J952J909n37k236l70K620J098j780
$$ -103 1506 -138 -2512 -2005 1045 1479 -1138 -2384 -432 1477 940 -1296 -1666 954 2052 272
2852B72j583J109J857K44k050q64J620J688j393j646L66J491M14j316j440R33
$$ 272 -1311 -202 1655 1899 -151 -1015 605 2293 900 -746 -380 1111 1525 209 -1231 -298
2868b98J682q03j283k24Q61N76n49j281L96J042j29r44k74O60O98k18p69n9J062
$$ -298 1384 581 -702 -926 -65 511 -38 -1319 -923 119 -10 -954 -1228 -568 130 -88 -857 -916 146
2887A46Q2l94k32J34N19L1k09J7L31j19n8J30K12k52L44m31J41J3k41j36M65K90
$$ 146 228 -166 -398 -264 255 286 77 94 425 306 248 378 590 338 682 251 392 405 164 28 493 783
2909G83p49l33O46J71m67n57j84R90N87j256q96P21J061j17j437m63J361J153
$$ 783 34 -299 347 518 51 -506 -690 300 887 -369 -1265 -544 517 400 -1037 -1500 -139 1014
2927A014j102j485P58J578m3j249p20J177J649r42j897L54J992O39j597j547J014
$$ 1014 -88 -1573 -815 763 720 -529 -1249 -72 1577 635 -1262 -908 1084 1723 126 -1421 -407
2944d07K472l99k632l26K132J411j735k086M79K718M68k859j499K243K124j327
$$ -407 2065 1666 -966 -1292 840 2251 516 -1570 -1091 1627 2095 -764 -2263 -20 2104 777
2960G77k632k31L266J223k843k306J933K507j64l029r72K783K018j925k727N86
$$ 777 -1855 -2086 1180 2403 -440 -2746 -813 1694 1530 -1499 -2471 312 2330 405 -2322 -1736
2976a736L247P86l003j992K305L065j157l478M6L260J521k688k967J517L756k83
$$ -1736 1511 2297 -706 -2698 -393 2672 1515 -1963 -1917 1343 2864 176 -2791 -1274 2482 2199
2992B199l765j076L074K455j976l447L30L925J015l398k440K255L641r46l891
$$ 2199 -1566 -2642 432 2887 911 -2536 -2206 1719 2734 -664 -3104 -849 2792 1846 -2045
3007b045o99L472K494k959l209J632L492K04l714j803K937L231j826l978O18L600
$$ -2045 -2744 728 3222 263 -2946 -1314 2178 2382 -1332 -3135 -198 3033 1207 -2771 -2153 1447
3023A447J507l235k780K156L786o33m098j086L687K306k401l514Q48M350M83l855
$$ 1447 2954 -281 -3061 -905 2881 2248 -1850 -2936 751 3057 656 -2858 -2010 2340 2823 -1032
3039a032k160K727L544j486m014j42L806J935l251l031J798L993m02l935j332
$$ -1032 -3192 -465 3079 1593 -2421 -2563 1243 3178 -73 -3104 -1306 2687 2285 -1650 -2982
3054b982L442K563k106l875J148L836P03l331k374K591L346j156l931k55L412
$$ -2982 460 3023 917 -2958 -1810 2026 2729 -602 -2976 -385 2961 1805 -2126 -2381 1031
3069A031K122l149k926J461L744J62m012j376L107K533j898l460M78L656J022
$$ 1031 3153 4 -2922 -1461 2283 2445 -1567 -2943 164 2697 799 -2661 -2183 1473 2495
3084B495l271j986K156K908o65l573k85L132J780k402k689J379L193Jk775j561
$$ 2495 -776 -2762 -606 2302 1637 -1936 -2221 911 2691 289 -2400 -1021 2172 2173 -602 -2163
3100b163K464K183j435k597p4K913Q16j953k163J523K459o66k563o01K256J554
$$ -2163 301 2484 1049 -1548 -1622 1291 2107 154 -2009 -486 1973 1307 -1256 -1857 399 1953
3116A953j317k745Q26K405J29j903j320J526J838q43k097oK064J004j474j326
$$ 1953 636 -2109 -1283 1122 1251 -652 -1972 -446 1392 549 -1548 -1554 510 1514 40 -1286
3132a286O67J830J03j978o38J485J594r51j661Q9J738M14j129j278R77J456m73
$$ -1286 -619 1211 1314 -664 -1302 183 1777 826 -835 -746 992 1406 277 -1001 -24 1432 959
3149I59j323l97J105P36p79j127O1J289J74r66o51N82P71j03j055k87R00N25p87
$$ 959 -364 -761 344 1080 301 -826 -765 524 698 -268 -919 -337 434 331 -724 -1011 -111 414 -373
3168c73o48L39R34K84j148k11O29O53k84o83K16O15M78o39l60K46N41Q2l47k51
$$ -373 -1021 -682 252 536 -612 -823 -194 459 175 -508 -292 323 801 162 -198 48 589 671 324 73
3188G3K22K75k65k04J07J72p0j5j68m2j16j06J53n2j66j06J64M0k9n51N3O72N8
$$ 73 295 570 305 101 208 380 310 295 127 85 -31 -137 16 -36 -202 -308 -144 -104 -133 -684 -631 41 99
3211I9o61k01M14N56o9r30J91P79L76q29m52N53R32j02r73k00R08Q34o16j125
$$ 99 -562 -763 -349 207 138 -792 -601 178 554 -275 -727 -174 758 656 -317 -517 391 1225 609 -516
3231e16K78J435N4j129j027J167J103m71j604k75J476P04j058j416M82J678k9
$$ -516 -238 1197 1251 122 -905 262 1365 894 -710 -985 491 1195 137 -1279 -797 881 852
3248H52j908q64J722J394r91k022J36K214P40j924j419J305K112o26k065l20K173
$$ 852 -1056 -1920 -198 1196 205 -1817 -1681 533 1273 -651 -2070 -765 1347 721 -1344 -1664 509
3265E09J390j659j875R02K382J62k195j214K093K082j364k401j9K829O64j995
$$ 509 1899 240 -1635 -733 1649 1811 -384 -1598 495 2577 1213 -1188 -1207 1622 2286 291
3281B91k144J602K377n80k747o05K456J588k082k565Q41K768M69k858j429K005
$$ 291 -1853 -251 2126 1546 -1201 -1806 650 2238 156 -2409 -1568 1200 1669 -1189 -2618 -613
3297f13K427j246k853N6L000J066k352k060J496K933l98k915o72K474K107j718
$$ -613 1814 568 -2285 -2229 771 1837 -515 -2575 -1079 1854 1456 -1459 -2131 343 2450 732
3313G32k728P60L296N15k904j660J891K759q96l137m24L206J417k616k430J517
$$ 732 -1996 -1236 2060 2575 -329 -1989 -98 2661 1765 -1372 -1796 1410 2827 211 -2219 -702
3329g02K811j87l016j395K593K084j668l021M29L114P17k743j991J993K759n31
$$ -702 2109 1922 -1094 -2489 104 2188 520 -2501 -2072 1042 1759 -984 -2975 -982 1777 1246
3345A246l406k24K859J840k158k529J226L323k39l007r71K218K628j528l095L20
$$ 1246 -2160 -2384 475 2315 157 -2372 -1146 2177 1938 -1069 -2040 178 2806 1278 -1817 -1497
3361a497L209J059k549k271J860K662n38k826r12K690J706k239k542J053K844
$$ -1497 1712 2771 222 -2049 -189 2473 1935 -891 -1803 887 2593 354 -2188 -1135 1709
3376A709J25k929j353K005K061r29k916O9K850R69k420j724J463K287j53k716
$$ 1709 1834 -1095 -2448 -443 1618 689 -2227 -2158 692 1661 -759 -2483 -1020 1267 1114 -1602
3392a602n19K372J703j652k157Q47K405K68j994j639J738K337r29k142j50K080
$$ -1602 -2121 251 1954 302 -1855 -1008 1397 1665 -329 -1968 -230 2107 1178 -964 -1114 966
3408I66J003j633j776J268K006m24k012p05J740J129j324j526J56J926J60j549
$$ 966 1969 336 -1440 -172 1834 1410 -602 -1307 433 1562 238 -1288 -1132 794 954 -595
3424e95r68R43J559m71j773j37J416Q39r13j494O16J412J27j326n27J313R99o83
$$ -595 -1563 -620 939 468 -1305 -1442 -26 813 -100 -1594 -978 434 561 -765 -1292 21 1020 337
3442C37j205K63J237L86p23q11N28J147l08j020j45R92N75p22q81K06M47L79p60
$$ 337 -868 -605 632 1018 295 -516 12 1159 851 -169 -314 678 1253 531 -350 -144 303 682 -78
3461g8l99L33P25l17n64k13N10M01l50o45p7O31n9j85k84J61K58J60l04P0J77
$$ -78 -477 -144 581 264 -300 -513 -3 398 48 -597 -674 -43 -102 -287 -571 -410 -152 8 -296 -226 -49
3482d9Q2l8j12M0K72J17k11j40K12J38JJ8j13O2J14O8j11r0k66K50J02r6k58j45
$$ -49 33 -5 -117 -77 195 312 101 -39 173 311 312 330 217 279 393 461 350 260 -6 244 346 250 -8 -153
3506a53L05J16j78o08J34N55L4m47m29K92M65k35m62j88N89N63n19o36K14Q82
$$ -153 152 268 90 -518 -384 171 205 -242 -671 -379 86 -149 -611 -799 -210 353 -166 -802 -588 294
3526B94N9q23l49Q14O60l34p84R3Q93M06q44p61P01J057k27j290m66J345O17n36
$$ 294 353 -470 -819 -5 655 321 -463 -370 523 929 85 -676 25 1082 855 -435 -901 444 1061 525
3546E25j391K79J410L68j551o60R17J279q26j443o7J587O27j310j225Q60J475
$$ 525 -866 -587 823 1191 -360 -1020 -103 1176 350 -1093 -1160 427 1054 -256 -1481 -621 854
3563H54K9j819o37J646J214j038j627K22K129J56j536j033J160J741o82j857j98
$$ 854 883 -936 -1573 73 1287 249 -1378 -1156 973 1129 -407 -1440 -280 1461 779 -1078 -1276
3580a276K056P58j263j587Q77J888j6k128p65J743J412j029k003K92K229N21k094
$$ -1276 780 1538 275 -1312 -435 1453 1437 -691 -1456 287 1699 670 -1333 -1041 1188 1709 -385
3597c85j154J213J848n98k190k06J908J011j548j691P94K047J65k057j139J899
$$ -385 -1539 -326 1522 924 -1266 -1472 436 1447 -101 -1792 -998 1049 1214 -843 -1982 -83
3613h3J584o67k102j7K106J059k041j416J183J824j54k234p15K081J354j124k378
$$ -83 1501 834 -1268 -1285 821 1880 -161 -1577 -394 1430 1276 -958 -1673 408 1762 638 -1740
3630a740N14K419K63j893j140J551J590o85k226J44J880J179k028j710J223J974
$$ -1740 -1226 1193 1456 -437 -1577 -26 1564 879 -1347 -1203 677 1856 -172 -1882 -659 1315
3646A315Q4k245n53J410J612j639j660P27J523Q69j539j679J690J255k58k264
$$ 1315 1399 -846 -1399 11 1623 -16 -1676 -949 574 1443 -96 -1775 -85 1170 912 -1352
3662a352k81K230J437j854j972J99K818m75j802p06K325R96j105j668K51J437
$$ -1352 -1633 597 2034 180 -1792 -1593 1225 750 -1052 -1758 567 1563 458 -1210 -959 478
3678D78J271j866k069J898J419N2k736P29J241Q65o23j415k29J945J96j468j460
$$ 478 1749 -117 -2186 -288 1131 1183 -1553 -824 417 1282 659 -756 -985 960 1156 -312 -1772
3695a772J851J414q50j853Q70J325K49j637p76J122J119k25j449k77J638L36j222
$$ -1772 79 1493 643 -1210 -340 985 1234 -403 -1179 -57 1062 837 -612 -889 749 1085 -137
3712a37r88L92J120M44p95j160J135J161p80j368J0J398O38j099j361O30J466
$$ -137 -1125 -733 387 831 36 -1124 11 1172 392 -976 -966 432 1070 -29 -1390 -760 706
3729G06l0j558j99J095O75l80j193M21J097J3q43M6Q0Q92j79j026M7M99M98n65
$$ 706 676 -882 -1081 14 689 309 -884 -463 634 647 -196 -150 -70 822 643 -383 -336 163 661 96
3749I6n76J81O15Kp12n6M37M43l09m07lL77J87n31j54K82M31j19m11k35M71K50
$$ 96 -480 -299 316 318 -394 -450 -13 430 121 -286 -289 88 275 -256 -410 -128 303 184 -227 -462 9 259
3771B59k14j47J39R4q3M3j04k4K37o4J72l19Q9J00J41m51rK17K9P1oq0k53J88
$$ 259 45 -102 37 131 48 91 -13 -37 200 136 308 -11 78 178 319 -132 -141 76 105 176 170 90 -163 25
3795B5kq8k33J38K28N6j92l71L11N9J45o55K72K76Q6r5q2k76M16R5J0m32K31M05
$$ 25 23 -65 -298 -160 68 124 -68 -439 -128 -69 76 -579 -307 -31 55 -40 -122 -398 18 113 123 -309 -78 327
3819C27J16o01j31N22J98O1q82J44R66j56q18J34K7R38r28m14L8P07J93k37o58
$$ 327 443 -158 -289 233 431 492 -390 -246 720 564 -254 -120 -93 845 -83 -497 -459 248 441 204 -454
3840d54J0P61k26q14j00O55Q09n82q35K66O14O80r36r62L60J376k3j141k99P44
$$ -454 -444 317 91 -723 -823 -168 641 59 -776 -510 104 784 -152 -1114 -754 622 599 -542 -841 -97
3860i7Q71j86j350L05J325l24q67n73J509Q60j112r69k9J157N85j092p56N16J355
$$ -97 774 588 -762 -457 868 544 -323 -896 613 1473 361 -608 -637 520 1105 13 -743 -227 1128
3879A128m40j422k78J294Q20q58j242J55J427L01j475p42J179J043m44j542M6
$$ 1128 688 -734 -1012 282 1102 244 -998 -843 584 885 -590 -1332 -153 890 446 -1096 -1050
3896a050J440P36j346j113J076J197j21j590l82J375J058r61j204L94J420K92
$$ -1050 390 1126 -220 -1333 -257 940 819 -771 -1153 222 1280 319 -885 -491 929 1221
3912A221j402r61J171J325m75j499j47J441O08j137j288O27J619j25j679n25J407
$$ 1221 -181 -1142 29 1354 879 -620 -767 674 1282 145 -1143 -516 1103 978 -701 -1226 181
3929A81J041j064j447N18J242N36j441q88R51J306l05j573j28J253R93j174j174
$$ 181 1222 158 -1289 -771 471 1007 -434 -1322 -371 935 630 -943 -1071 182 1175 1 -1173
3946a173N80J663p6j581m97J303J161p86j287N7J354N73j208j014R47J309m06
$$ -1173 -593 1070 994 -587 -1084 219 1380 594 -693 -636 718 1291 83 -931 16 1325 919
3963I19j709j2J241O30p43j313P19J030R6j361o19R56J038n44r19k98M04J019
$$ 919 -790 -802 439 1069 326 -987 -268 762 858 -503 -1122 -166 872 328 -591 -889 -485 534
3981E34j256Q9J16Q78J98q55n72J027L95n5j292K95J347J11r02m38P22Q39q81
$$ 534 -722 -633 -517 361 559 -296 -868 159 554 499 -793 -498 849 960 58 -380 342 1181 300
4000C00r17J04R20K57m43p02L51R48k29r72l02Q03N24l48r85J81J022q7r41m93
$$ 300 -617 -513 407 664 221 -481 -130 818 589 -383 -685 118 642 294 -691 -510 512 425 -516 -1009
4020a009Q59N25k34p32j79P53L81m37n96L65O85J66r74k06O32M29l30n26K44O65
$$ -1009 -150 375 141 -591 -770 -17 364 -73 -669 -304 381 547 -427 -633 -1 428 98 -428 -184 481
4040D81J60n44n06P56K00r6m40r9M94J84n64k76L83J46j8k86l30M10K78l35l88
$$ 481 641 97 -409 347 547 451 11 -88 406 590 26 -250 133 279 261 -25 -355 55 333 -2 -390
4061c90J96K82j65r9P4j8M1M9p6j17K68q9k53J24l5K46k08Q5J46M9j16J42J37
$$ -390 -194 88 -77 -176 -102 -120 -79 -30 -106 -223 45 -44 -297 -173 -208 38 -170 -85 61 110 -6 136 273
4084B73n9k58J38J77kk27q4K37J35j60j59j29L9K10J06l06j36J90J87j80k61j01
$$ 273 214 -44 94 271 269 42 -42 195 330 170 11 -118 -79 131 237 -69 -205 -15 172 -8 -269 -370
4106c70M60M3m83p2L13K97k11l47R7K68J11k09l43L68L76M1m78k23N70K26m39
$$ -370 90 133 -350 -422 -109 188 -23 -370 -273 -5 106 -103 -446 -78 298 339 -139 -362 208 434 -5
4127ek68R5P43k98m18j91O03L46k73n43j64P19L84p72m06M29M19l4o54k64M83
$$ -5 -273 -178 565 267 -151 -342 261 607 334 -209 -373 346 730 -42 -448 -19 400 366 -288 -552 -69
4148f9N92n26m34J94N77q2n70l61N00M10M9p86j07O05O47p47n52M58P50J47j133
$$ -69 523 -3 -437 -243 334 252 -318 -679 -179 231 280 -506 -613 -8 639 -108 -660 -202 548 695 -438
4169d38P9N24P41m08j095K03R37J30m91q64M12J084m59p67j36Q00O62q54p23K57
$$ -438 -359 165 906 498 -597 -394 543 673 182 -682 -270 814 355 -412 -548 252 914 60 -663 -406
4189d06P74J26o00q74R76O16l77j071K20Q71K62p20p62N73J142l06j030l03J200
$$ -406 368 494 -106 -980 -4 612 235 -836 -616 255 517 -203 -965 -392 750 444 -586 -889 311
4208C11M19o02p53K02R70J26q71m91O32Q98l00j004j66J076L14p69m89K17J076
$$ 311 730 128 -625 -423 547 673 -198 -689 -57 841 541 -463 -629 447 761 -8 -497 -280 796
4227G96m0j115l96J054O55q48p53Q7R98N29j371n05J039P13n56r11j49Q95P30
$$ 796 756 -359 -755 299 954 106 -647 -560 438 967 -404 -909 130 843 287 -624 -773 122 852
4246H52j006p58N66R43R4j128k78P91P80o07r20J72J007J86q80n13N02R82l72
$$ 852 -154 -912 -346 597 691 -437 -715 76 856 249 -671 -499 508 694 -186 -699 -197 785 413
4265D13r00j18Q64P43p13r98L88R51j35o77p41P80R90n56q54o0Q75M89r36n41
$$ 413 -487 -605 259 1002 289 -709 -321 630 495 -182 -923 -143 847 291 -563 -623 252 741 -195 -736
4285g36N91Q13l47r11m5O77O10m95q48L35Q18L6o72m85O84O53k57p09J9O62J5
$$ -736 -145 668 321 -590 -635 42 652 157 -691 -356 462 498 -174 -659 25 678 421 -288 -269 393 408
4306D08l20p87O04O50j44p84j06O81L45l37p43M13M23K79o82l64L64N29k15n18
$$ 408 88 -699 -95 555 411 -373 -479 202 547 210 -533 -120 303 582 -100 -464 -100 429 214 -304
4326c04j41O66J66n44n57P37R8Q3k60k17M09K75k18n27J18N10j52m74R1J06M40
$$ -304 -445 221 387 -157 -714 23 121 204 -56 -273 136 411 193 -334 -216 294 142 -332 -241 -135 305
4347C05o7n13J59K97q%l81J09M10j52j68j91M5L64k42j89J33K62R1m02m0K45N4
$$ 305 238 -275 -116 181 173 173 -208 -99 311 159 -9 -200 -155 209 -33 -222 -89 173 264 -138 -178 67 121
4370A21k12k2J82j55J83j04p9J82r7n2J61l03Q2J40L1j9J02R2j99O3J27o2l39
$$ 121 -91 -113 69 -86 97 -7 -86 96 -1 -53 108 -195 -113 27 58 39 141 233 34 97 224 162 -177
4393a77M7J24K50l17k08L61J25n0l67O0M58k10j46j64J67K16R3k47j54J57M3K10
$$ -177 -130 -6 244 -73 -281 80 205 155 -212 -152 306 96 -50 -214 -47 169 262 15 -139 18 61 271
4415B71n73J28N16J45m22k33q4M79j15k99j14M00K72j41n69O8N34L3n04j90L47
$$ 271 -302 -174 342 487 65 -168 -252 227 112 -187 -301 99 371 230 -339 -271 263 296 -208 -398 -51
4436e1J07J16m67j74N33L22m72m36K75M99O5o17k03M50N43l16n54P5O63J94p09
$$ -51 56 172 -295 -469 64 386 -86 -522 -247 252 317 -300 -503 -53 490 174 -380 -305 358 552 -157
4457a57k01K80O85k17o64j75N75L13k92p24L54O62J53o46n74O25R26n46r91K81
$$ -157 -358 -78 607 390 -274 -449 126 439 147 -577 -223 439 592 -54 -628 -3 923 377 -614 -333
4477c33M99M59q20n26N34N79p2p14m07Q05P27n90j018L60R14K8o90k70M59O78
$$ -333 166 625 -195 -721 -187 392 320 -394 -801 4 731 141 -877 -517 397 425 -265 -535 -76 602
4497F02l63q22Q7Q32M65p18p62P25P58m33o43m22O91O57l51r08K48J017j8q39
$$ 602 239 -583 -496 336 801 83 -679 46 804 371 -272 -694 -3 654 303 -605 -357 660 642 -197
4517a97m63N77O60j81j006L0P52N43p64n87J90J014j06p46n53P29O79k50p90p2
$$ -197 -660 -83 577 396 -610 -580 172 715 -49 -636 -446 568 462 -284 -837 -108 571 321 -469 -541
4537e41P88N09j065l27M98R50l37q69j52Q75M37m23r30J74R59J08q52o55R18N97
$$ -541 247 756 -309 -636 -138 812 475 -394 -546 329 766 343 -587 -413 546 654 -198 -853 65 662
4557F62m57n74j07Q48L12o84o17M89Q06l00p07l95N70P25m07q51J48R41m3q63
$$ 662 205 -369 -476 372 684 0 -617 -128 678 378 -329 -724 -154 571 164 -687 -539 402 359 -504
4577e04r1L87O24j02q20j22P80M58m68o04J79P48L5o86k33N52O16j91p54j13P05
$$ -504 -595 -208 416 314 -506 -628 152 610 142 -462 -283 465 500 -186 -419 133 749 558 -196 -309 396
4598C96Q9l94p10N96M80j14n22j52M23K92m14l63j31Q25l3n27k43M01M08j91m73
$$ 396 485 91 -619 -23 457 343 -179 -331 92 384 -30 -393 -524 301 268 -259 -502 -101 307 116 -357
4619c57m3N70K29m23n53M67M37j32n38J8L85N12n38k12K26K73Kl68k83L53L25
$$ -357 -400 170 399 -24 -577 -110 327 195 -343 -325 60 572 34 -178 48 321 323 -45 -328 25 350
4640C50j9k79j07L92J03l75j30n2M84j44n13lL27P7j67K7p1j2M6k22J18O6J11
$$ 350 331 52 -55 337 440 65 -65 -117 367 223 -290 -293 34 111 -56 -29 -100 -112 -66 -288 -170 -104 7
4663Gj96o0q5L84J4j90K10k30L31q9j37N6L52k47k73M42q0q8n4N5J65N1k63NJ57
$$ 7 -189 -249 -334 50 64 -126 84 -146 185 96 -41 15 367 120 -153 289 209 121 67 122 287 338 75 80 237
4688B37j96R8k26J65k4J06l05m5K11N4j53j60M1J68K06m43l6K72J74j79l61L0
$$ 237 41 139 -87 78 54 160 -145 -190 21 75 -78 -238 -197 -29 177 -266 -302 -30 144 -35 -396 -366
4710c66N68Q5l96j93P2L46J82m16J7J87J56k06j60J15L35j76l14l4L89L95k94
$$ -366 202 287 -109 -302 -230 116 298 -118 -101 86 242 36 -124 -9 326 150 -164 -198 191 586 292
4731B92m94L9M91R3m38m74M24M76k24m86j48O27J38k69n97J60O39K13q07k21K88
$$ 292 -202 -163 328 421 -17 -491 -67 409 185 -301 -449 178 316 47 -550 -390 249 462 -345 -566 -278
4752b78N43j05n83O4O05J81m54k59O8Q71k46m79k83M38L64k16n17N1N57K93o78
$$ -278 265 160 -423 -359 246 427 -27 -286 -218 653 407 -72 -355 83 447 231 -286 -235 322 615 -63
4773f3n14N83N91j80p78J0L48M96m60n68M12O03j30o47l51N30P10l19r80K52O33
$$ -63 -577 6 597 417 -361 -351 -3 493 33 -535 -123 480 350 -297 -648 -118 592 273 -707 -455 178
4794A78J42m48n86L52Q44rq83l11O66P28o13n72J84Q40l1n71l95N73P17l77p36
$$ 178 320 -128 -714 -362 482 473 -410 -721 -55 673 60 -512 -328 512 481 -90 -485 88 805 428 -308
4815c08l74J102L53n92q50M81Q72o0q98n04R36M74l83q60O3P65L63p45n08M45
$$ -308 -682 420 773 181 -669 -188 684 624 -274 -778 158 632 249 -611 -548 217 580 -165 -673 -228
4835b28O61K0j054J15O36N17o52p33Q7J043M3n99m48O23O39m60n36o4O54J53l19
$$ -228 433 453 -601 -486 150 667 15 -718 -631 412 455 -144 -592 31 670 210 -326 -390 264 417 98
4856I8n97K49Q91j3r36k5O24N93o84p00J70Q74n0m79m41K84O09j75p32o2P12K36
$$ 98 -499 -250 641 628 -308 -333 291 884 200 -500 -330 544 494 15 -426 -142 467 292 -440 -502 210 446
4878D46m35m60K48O56j22o75k72M47P79n81n24J45N28J91n53l91M05O80j69o19
$$ 446 11 -449 -201 455 333 -342 -614 -167 612 31 -493 -348 180 371 -182 -573 -168 512 343 -276
4898b76p4O30L75m54m33L9O20kn06m41O29K26p7o21J6N45L30m44l33j00O48N0
$$ -276 -350 280 655 201 -232 -193 427 425 -81 -522 107 333 256 -365 -349 196 526 82 -251 -351 297 347
4920C47p65j07O65K14j73m55J49M07J1m40k26K17N16o5o37L4M69K11m94j88J35
$$ 347 -418 -525 140 354 181 -274 -125 282 293 -147 -373 -156 360 295 -342 -308 161 372 -122 -310 -175
4941a75O05k79j96j85M10j36l4r6L1J61P7j26q1R3J47j93j63R9N4l7Q0j9k5P2
$$ -175 430 151 -45 -230 180 44 10 -86 -55 106 183 57 -24 69 216 23 -140 -41 13 -24 56 37 12 84
4965H4Nl6o3kk9J24j2j18J64j89O8J09P8m09J81L8R5q4n4oK73pj54l0PO6L4l68
$$ 84 89 53 -10 -12 -41 83 71 -47 117 -72 -4 105 183 -226 -45 -7 88 4 -50 -56 217 210 56 26 33 99 133 -235
4993b35l7L23K74m81R6M6J90m4j59j63M29j00l89J35L7L53k01k77o4J73M11j96
$$ -235 -272 51 325 -156 -60 -14 176 132 -27 -190 239 139 -250 -115 -78 275 74 -203 -267 -94 317 121
5015A21m15L27K71P2m38j24J91K05mm08MK51R4l26r1J94J98%j58m61N99M14m02
$$ 121 -294 33 304 376 -62 -186 5 210 206 -202 -198 53 147 -179 -270 -76 122 122 -36 -497 102 516 114
5038A14n23J66M55Qk37l36L97M61j52o42J98K23K62l08n92K41M52K42o04k19P09
$$ 114 -409 -243 212 220 -17 -353 44 505 353 -289 -91 132 394 86 -506 -265 187 429 -175 -394 315
5059C15n4j49k48j08M55L18o03m86M84L52J5n51j98N90L97l97o26J41O22O3o37
$$ 315 261 112 -136 -244 211 529 -74 -560 -76 276 291 -260 -458 132 529 132 -494 -353 269 332 -305
5080c05n0J04N56l14l96P9P14k56k87l59L33M96l1o16P4M71K53m14n10L14O47
$$ -305 -355 -251 305 -9 -405 -326 388 132 -155 -514 -181 315 284 -332 -258 213 466 52 -458 -144 503
5101E03r0o20l51M43O20k8q92r9Q66J32n63m25R9R16p7q09k76P46L98m99m45j3
$$ 503 413 -207 -558 -115 505 477 -415 -514 352 484 -79 -504 -405 511 434 -375 -651 95 493 -6 -451 -464
5123d64Q64j64l78l92L85O62l02o68j9N74K76j51p34L60O40J91q90k31O79K82
$$ -464 400 236 -142 -534 -149 513 211 -457 -476 98 374 223 -511 -151 489 680 -210 -441 238 520
5143E20k60o04J78M74J18k97n29L13N79J0o98k88O42L25l30o33P0Q46k0o50m11
$$ 520 260 -344 -166 308 426 129 -400 -87 492 502 -196 -484 158 483 153 -480 -410 436 416 -234 -645
5164f45M78O19j79o59JN09L72n20k66j5O48J42o77l20N69N59m69l51p6M24K34
$$ -645 -167 452 273 -386 -385 124 496 -24 -290 -305 343 485 -192 -512 57 616 147 -204 -280 144 378
5185C78l38l13J16O61j89m75j03K33N14n00j53o1N84j4n20j74L00L60k36l53n1
$$ 378 40 -273 -157 504 315 -160 -263 -30 484 -16 -169 -230 354 340 -180 -354 -54 306 70 -283 -334
5206c34M70qk40k42L33L7Q7l48j08N77Qj95l09K4L56K86p54J01Q7N74n10J27k63
$$ -334 136 128 -112 -354 -21 16 103 -245 -353 224 232 37 -272 -248 108 394 -360 -259 -172 402 -108 19 -244
5229b44L96J78q0m7r5J27k06k44R8J32N33n58J03m1K62j87l58M20m72N55m27J67
$$ -244 152 330 250 203 108 235 29 -215 -117 15 548 -10 93 52 314 127 -231 189 -283 272 -155 12
5251A2M8j17O09l11k22l10KL90O2j38k72L01m17J01Q2J33K62r62M90J39M24j0
$$ 12 60 -57 552 241 19 -291 -289 101 163 25 -247 54 -363 -262 -180 -47 215 -747 -257 -118 306 296
5273B96l64K62M07r89K44L45j21J03J13P4m90J51M0p9%K26k64q9O0J85j30k8r0
$$ 296 -68 194 601 -388 -144 201 80 183 296 370 -120 31 71 -8 -8 218 -46 -135 -75 110 -20 -48 -138
5296a38j0K17j17j55J46q6J64k11r8K28P2l8l8q4M23r6l69J7K37Q8q4l36J14K18
$$ -138 -148 69 -48 -203 -57 -143 21 -190 -288 -60 12 -26 -64 -148 275 179 -190 -173 64 152 68 -268 -154 64
5320F4M44m33j50l4N26q6l36l74L12L04j84j97r6L66L3k21k69K68K62j47m89R3
$$ 64 508 75 -75 -109 417 331 -5 -379 -67 237 53 -144 -240 126 159 -62 -331 -63 199 52 -437 -344
5342c44M26K51n05l45M14L50n1n40j8M70L29k74l57q8O25j43j87n16N59M64k17
$$ -344 82 333 -172 -517 -103 247 196 -344 -362 108 437 163 -194 -282 343 200 13 -503 56 520 303
5363C03l85k52O45J84k79m39M6M85j08l05m21N14L35l77k79J37M20J68m86o57
$$ 303 -82 -334 311 495 216 -223 -177 308 200 -105 -526 -12 323 -54 -333 -196 224 392 -94 -751
5383g51M18Q00k59n92m3O19Q3j78n44J31M61L09p17k38N70J78M1o04j02O77L20
$$ -751 -333 467 208 -384 -427 192 275 97 -447 -316 145 454 -263 -501 69 247 288 -316 -418 259 579
5404E79o94m18K85Q16j05n79j88N38K79k08m89n3O05K48o15m01L68M47k81n62
$$ 579 -115 -533 -248 568 463 -116 -304 234 513 305 -184 -237 368 616 1 -400 -32 415 134 -428
5424d28Q9N56L57n57n52k3P54J50o38k49N21M06k21m59j87P70K28o46k94K96N66
$$ -428 -339 217 574 17 -535 -558 196 346 -292 -541 -20 386 165 -294 -481 289 517 -129 -423 -127 439
5445D39j11o34j01O91L76o20l84l8O76L40n44m18L03M86q4p39j34Q16O6l94m72
$$ 439 328 -306 -407 284 660 40 -344 -382 294 634 90 -328 -25 461 377 -362 -496 320 386 -8 -480
5466d80K60O08j78n46j42M40K95k47n42K32M63J89m90k08K12M08j46n20K5L63
$$ -480 -220 388 210 -336 -478 -38 257 10 -532 -300 163 352 -138 -346 -134 274 128 -392 -367 -4
5486dM30n46j90J28M26J63m46j98K88K80l29k82P4L20K12k98k44K80L26j37n55
$$ -4 426 -120 -310 -182 244 407 -39 -237 51 331 2 -280 -206 114 326 28 -216 64 390 253 -302
5507c02j50N78J7j86m30K45M94j29j99j42J56L23l43j46J72P6r0Rk21J05K58j
$$ -302 -452 126 143 -43 -473 -228 266 137 -62 -204 -48 275 -68 -214 -42 34 -56 -47 -268 -163 95 94
5529I4l28O3J81Q3Oj21rR1J46k26K4J38o8K6m8o7K95Kr8k66P6J37m1j14kJ68l40
$$ 94 -234 -171 10 93 99 -22 -31 60 206 -20 4 142 74 100 52 -15 280 282 184 -82 -6 131 90 -24 -26 142 -198
5556a98K00O9k26K33m8k38P8P6M6Mp3R2L7k43J85j41J90j9k45L80m0P2j60J6l3
$$ -198 2 71 -155 78 30 -208 -130 -54 -8 -4 -77 15 52 -191 -6 -147 43 24 -221 159 119 191 31 47 14
5581A4Q0m3k39J78M1J47k84J0K46N5k61j2j74K24J10n5j51K78R5k11q5k66K70
$$ 14 94 51 -188 -10 31 178 -106 -96 150 205 -56 -68 -242 -18 92 37 -114 164 259 48 -37 -303 -33
5604c3K70k72J2M9J36r1j69m9N6N3%q2j25L55o6L4k20K39K25k20k10j5K19p6J7
$$ -33 237 -35 -23 26 162 71 -98 -147 -91 -38 -38 -120 -245 110 44 78 -142 97 322 102 -108 -123 96 20 37
5629C7j37j47N37j22m60K7M66k6j69l68M92J45k0l15k49K61K96j08l16p0L93n9
$$ 37 -100 -247 290 168 -292 -265 201 175 6 -362 130 275 255 -60 -309 -48 248 140 -176 -246 147 88
5651H8j45l95L84L60p0m06M8K13L05l27m17L88K58k25l50j03M56K91l64k47j2
$$ 88 -57 -452 -68 292 222 -184 -136 77 382 55 -362 26 284 59 -291 -394 62 353 -11 -258 -270
5672b70M11J87n92k03L94N97j85n23r4L15K61j31m56J34M34j24l38q5L12K04J03
$$ -270 141 328 -264 -467 -73 524 339 -184 -278 37 298 167 -289 -155 279 155 -183 -268 44 248 351
5693C51n36lM22N1k10k50L5L72k9l12j16K31K27k29l17K30L16J68n30j46J60N65
$$ 351 -185 -188 234 285 75 -175 -140 232 203 -109 -225 6 233 4 -313 -83 233 401 -129 -275 -115 450
5715D50k18m53k80O29L07n35k71L31K54R5n04r2L65K81l86j93kK92L32l36k79
$$ 450 232 -221 -501 128 435 -100 -371 -40 214 309 -195 -287 78 359 -27 -220 -222 70 402 66 -213
5736b13K07L01l6m65n1M27J59l18k28J87J65J23l45k17K94J95p1m13k93N59L31
$$ -213 -6 295 259 -206 -257 170 329 11 -217 -30 135 258 -87 -304 -10 185 114 -299 -592 -33 298
5757B98m38r7Q8M16m4l62j41L26J93k12k61l9N50N9n09L0J35K84j8m10j13K74
$$ 298 -140 -237 -149 267 223 -139 -280 46 239 27 -234 -273 277 336 -173 -143 -8 276 258 -152 -265 9
5779IL56l44m47L50M21k37m89L4L88M9P6m22P0J97J08j34j70R0M37j23l70q7L97
$$ 9 365 21 -426 -76 345 108 -381 -347 41 90 166 -256 -186 11 119 -15 -185 -95 342 219 -151 -238 159
5802A59J10k48l09J30J89O7k71j6L60r9K2k63M9L1K93j85k18J57K14o7k82j73
$$ 159 269 21 -288 -158 31 98 -173 -189 171 72 94 -169 -120 -89 204 19 -199 -42 172 105 -177 -350
5824c50M22J69j31l04K72No2m7P2O1N6J2k58Q6p7J81o3k35k9K01R8j96k31L69
$$ -350 72 241 110 -194 78 83 21 -26 46 107 163 175 -83 3 -74 107 44 -191 -220 -19 79 -117 -348 21
5848B1J3P5l57J67J29m7k5M3j84J12Jj47J56R2p9J25L3p6n9M0J71r8k1O1k65J77
$$ 21 34 109 -248 -81 48 1 -24 19 -165 -53 -52 -199 -43 49 -30 95 128 52 -7 33 204 106 85 146 -119 58
5874E8M7KM0q7L5l9j17K9rJ21k47P8J42J46k39r8J16N2r7M9l43J14L91j36r5j9
$$ 58 105 107 147 60 95 56 -61 -32 -41 80 -167 -89 53 199 -40 -138 -22 30 -67 -18 -361 -247 144 8 -87 -106
5900a06j11K99O4p0l34M53K5k20l02M16J01j45J97l39K28R9k35j64R0j5J75j69
$$ -106 -217 82 146 76 -258 195 220 0 -302 114 215 70 267 -72 156 255 20 -144 -54 -69 106 -63
5922f3J8Q6N6J35l45o6K18k4j57j5q9L94j53l60N3M65q0j94j5j52M15l4j07r7
$$ -63 -45 41 97 232 -113 -179 39 15 -142 -157 -246 148 -5 -365 -312 153 73 -121 -136 -288 127 93 -14 -111
5946a11K1L79k90k13L10N8J44l62k66J12M92j82j37j51L12J07j84K1k15K84Q5
$$ -111 -90 289 -1 -214 96 154 298 -64 -330 -218 274 92 -45 -196 116 223 39 60 -155 129 214
5967B14q0l13R8M76k93j79k29L40K37l99k11J34L28L7l25k33K96L07M0n15p9M73
$$ 214 134 -179 -81 395 102 -77 -306 34 271 -128 -339 -205 123 160 -165 -398 -102 205 245 -270 -349 124
5989A24J48l66l47L63L43Q9m37j83M18m1k9l12J73L28O1l87j86K71L08k60k46
$$ 124 272 -94 -441 -78 265 354 -83 -266 152 111 82 -230 -57 271 332 -55 -241 30 338 78 -168
6010a68LJ89L45n07j74J74M35j89l05j3K99K21l25k52r7M32J45m11j83N27Qj40
$$ -168 -165 24 369 -138 -312 -138 297 108 -197 -210 89 310 -15 -267 -364 68 213 -198 -381 146 154 14
6032A4m00k5M26J99L5l47p3K79R8m10R3N1L16k09j94K7L53K34l61k00l8M26j34
$$ 14 -386 -411 15 214 249 -98 -171 108 206 -204 -111 -60 256 47 -147 -120 233 467 106 -94 -132 294 160
6055A60k55o7P7L24k24j61K67J17Q6k79j97K32J05k51k4j17K74l2J5k72JL32J34
$$ 160 -95 -162 -85 239 15 -146 121 238 324 45 -152 80 185 -66 -90 -207 67 35 50 -222 -221 111 245
6078B45m91j7K61J53r4j34J3L13o7j88lQ0K46j82k56J6J82Q9k73j26R7L73k05
$$ 245 -246 -263 -2 151 57 -77 -64 249 182 -6 -9 71 317 135 -121 -105 77 166 -107 -233 -136 237 32
6101C2o8j90J23M14k40l67M12K4n3k64j5L5L31l27jq5J31K73j10k48L6L43j61
$$ 32 -36 -226 -103 311 71 -296 116 140 87 -177 -192 -157 174 -153 -154 -239 -108 165 55 -193 -157 186 25
6124B5k8j78L32m9J77l61j46K45J06n4k86J55J7L18m06J23J39L7j90p9J79n8J50
$$ 25 -3 -181 151 102 279 -82 -228 17 123 69 -217 -62 -45 273 -133 -10 129 166 -24 -103 76 18 168
6147A68l96K52J9k24K50j14J17m6O4J1Ml14K69m7l9M6q4J6M4R4n4r2O0J9k10K62
$$ 168 -228 24 43 -181 69 -45 72 26 90 101 105 -209 60 13 -26 20 -64 -48 -4 90 36 -56 4 23 -187 75
6173G5j63J2J89q6K9n1J67J3j25p0j6M3M9N5k19K17P7k56O1j05J83Mq7j77Q4J80
$$ 75 -88 -76 113 27 56 5 172 185 60 -10 -26 17 66 121 -98 119 196 -60 1 -104 79 83 -4 -181 -97 83
6199H3L3j47O1J3R8J08l49J07j17P6K20k11n6J36q0N1q2J91m5J3j30l2J54N2j67
$$ 83 116 -31 30 43 141 249 -100 7 -110 -34 186 -25 -81 55 -25 26 -56 135 90 103 -27 -59 95 147 -20
6224b0j44K09p6K14j48j12J13N3r6k34K17K12j23o6j76J73J34j12q7pN9J99k91
$$ -20 -164 45 -31 183 35 -77 36 89 -7 -241 -24 188 65 -1 -177 -4 130 18 -69 -76 -17 182 -109
6247a09q9K73P0R2l28k08L85p8J58l20M8J61J27r4l13K87J04j11k63pL06K50l64
$$ -109 -198 75 145 237 -91 -299 86 8 166 -154 -106 55 182 88 -225 62 166 55 -208 -215 91 341 -23
6270b3k82J48L22p7k77K27j11K29k02k63L44OJ71l90o5K50M55m28k7l33M65r5
$$ -23 -305 -157 165 88 -189 38 -73 156 -46 -309 35 41 212 -178 -243 7 462 34 7 -326 139 44
6292D4k62R6J84M4P7k87j23K75K50k72k61K24J75N5k91j98J51L87l55k8p9K27
$$ 44 -218 -122 62 106 183 -104 -227 48 298 26 -235 -11 164 219 -72 -270 -119 268 -87 -115 -194 33
6314C3N5j62p6N0K64j17j52r1Q3K67r2k3j29K57M9j44l64K45P5p8k21Q2K00L3
$$ 33 88 -74 -150 -100 164 47 -105 -196 -113 154 62 39 -90 167 216 72 -292 -47 28 -50 -271 -189 11 44
6338D4Q2j87R0J51o3k79j8P3L22l04K1oN9J90p6l02P5M43j23k15k55J90J91q5
$$ 44 126 -61 29 180 117 -162 -180 -107 215 -89 -68 -74 -15 175 99 -203 -128 315 192 -23 -278 -88 103 18
6362A8j60K4M00j64j65j86J04M55j68l05L1M9J20k20M2J89n8J92k09j14K9K22
$$ 18 -142 -118 282 118 -47 -233 -129 326 158 -147 -116 -67 53 -167 -125 64 6 198 -11 -125 -96 126
6384A26j15M7j94L07P7j43j72J6L42k70j58J36L9J17k06j6j65L91j7j53j35J92
$$ 126 11 58 -136 171 248 105 -67 -51 291 21 -137 -1 38 155 -51 -67 -232 159 142 -11 -146 46
6406D6o4Lk33J84J00J90j15l12K14K32j99J4j45k0M38l06p1l0K05K2j64l3l0L9
$$ 46 -18 -15 -248 -64 36 226 111 -201 13 245 46 60 -85 -105 333 27 -44 -74 131 153 -11 -44 -74 -35
6430c5R4r3K12j33J10l43l2L28k7p4RQl6n5K30j54k61K99O9j63q4kL3K16J8j52
$$ -35 59 -34 178 45 155 -188 -220 108 81 7 16 24 -12 -67 163 9 -252 47 116 -47 -131 -133 -100 116 134 -18
6456a8q3J68J4j13L3J13j39K2Q0nk01L4K7L3j1R1P5r6j71L63k53O3K5n5k49J83
$$ -18 -101 67 81 -32 1 114 -25 -3 77 72 -129 -95 -68 -35 -46 45 120 24 -147 216 -37 26 51 -4 -253 -70
6482g0P3O0j25j2L40o8m03K03j10J20jN1j48J46K4J32j76j88K70jk25J2M1J65
$$ -70 3 63 -62 -74 266 198 -205 -2 -112 8 7 58 -90 56 80 212 36 -152 118 117 -108 -96 -55 110
6506A10J30k31K0p9MK5J50p2o1N0N6j11R0p1l7J63k70J6L74m58N6J26J9L92l08
$$ 110 240 9 29 -50 -46 -21 129 57 -4 46 102 -9 81 10 -27 136 -134 -118 256 -202 -146 -20 -1 391 83
6531H3l20L27n3j28Q1j65K14Kj30L1k51M01M1J6l79J99J09pj52o7L91K2l43oK7
$$ 83 -237 90 37 -91 -10 -175 39 41 -89 -58 -309 92 133 149 -230 -31 78 71 -81 -148 243 265 -78 -84 -57
6556e7K27J85l60r2K89L5j81k5L1kq6p8j53K24J80j76j18J43J95n3l45J29P5R9
$$ -57 170 355 -5 -97 192 227 46 21 52 50 -36 -114 -267 -43 137 -39 -157 -14 181 128 -217 -88 -13 86
6580H6j40n7j04L41j42l2J7k0O8J55m41l7L81O2k5m65L85M02l39m39K68p9L64
$$ 86 -54 -111 -215 126 -16 -48 -31 -51 17 172 -269 -306 75 137 112 -353 32 434 95 -344 -76 -155 209
6603B09k71J76o52N65K36l46o3q8N57l99J76n36J23K69J37m35J24L50l47K94l10
$$ 209 -62 114 -538 27 263 -83 -146 -234 323 -76 100 -436 -313 -44 93 -342 -218 132 -215 79 -231
6624b31pO84k89k47K67k3J03k71l88L00J50N9j55j38L98J64k61m52l6N57o5R6
$$ -231 -238 446 157 -90 177 154 257 -14 -402 -102 48 107 -48 -186 212 376 115 -337 -373 184 119 215
6646B15n36L49j81K02q1l5l85O66k32l01O90n71M47l18M6j49M25l27k67K32L50
$$ 215 -321 28 -153 49 -32 -67 -452 214 -18 -319 371 -200 247 -71 -25 -174 251 -76 -343 -111 239
6667B39J27o15k25N23J57k95O2M6J94o23N54j80l75K88k10M26j54o8j05M99J67
$$ 239 366 -249 -474 49 206 -89 -27 19 213 -410 144 -36 -411 -123 -333 93 -61 -129 -234 265 432
6688D32m02p64N93j17L66j46O66j85m28J46k81j39R63p47l53L91m23K96L11m65
$$ 432 30 -734 -141 -258 108 -38 628 443 15 161 -120 -259 704 -43 -396 -5 -428 -132 179 -286
6708b86L89m8j90m40N82j99P19m93k91M24q47K82J24r3O66m96N96l56k30K49k26
$$ -286 103 55 -135 -575 7 -192 527 34 -257 167 -680 -398 -274 -367 299 -197 399 43 -187 62 -164
6729a64L43o8K70M3m4M1l26l24j03K76M13O4l08j94M5j70L68m8R6K20k04j86j10
$$ -164 179 111 381 424 380 421 95 -229 -332 -56 357 421 113 -81 -36 -206 162 114 210 430 226 40 -70
6752g0j1O2N61n44L5k99J16n66P99l85J67n3j13L25K54p19P81l19j5j7op6J07
$$ -70 -81 -19 542 -2 33 -266 -150 -716 83 -302 -135 -188 -301 24 278 -441 340 21 6 -11 -17 -93 14
6775A4J77j2o0J2l52N34m64k56J039n66n35N25j24J76k77j90K07k9M15J95l14
$$ 14 191 179 119 131 -221 313 -151 -407 632 66 -469 56 -68 108 -169 -359 -152 -181 234 429 115
6796A15j73Q5K29j28R3k75j6k4j74N16j59k20n6M3O8J77j9k67J47l7N4N2Jp2J67
$$ 115 -58 27 256 128 221 -54 -70 -94 -268 248 89 -131 -187 -144 -76 101 82 -185 -38 -75 -21 31 32 -40 127
6821A27n4j27J28l33K96K84o6l24N7K3R3j8l97L93j61J52n4j32J96j26R8j15j3
$$ 127 73 -54 74 -259 37 321 255 -69 -12 11 104 86 -311 82 -79 73 19 -113 83 -43 55 -60 -73
6844g3J31lj61Q0k65K86R8j72j46L17J31l32L6mJ09k2J31k29Q7L6O9k13J86J17
$$ -73 58 55 -106 -26 -291 -5 93 -79 -225 92 223 -109 -73 -77 32 10 141 -88 -1 35 104 -109 77 194
6868A94r5j85N7J30P2j34l4J2j23J57k95J63j34K36r0O5J09k1OJ37l39N9J63K00
$$ 194 99 -86 -29 101 173 39 5 17 -106 51 -244 -81 -215 21 -69 -4 105 84 90 227 -112 -53 110 310
6892C10l50j55K91r0j00j20J73R0K71m20J16j11L81j08k32m1L38K0m1m02K15R5
$$ 310 -40 -195 96 6 -94 -214 -41 49 320 -100 16 -95 286 178 -54 -95 243 263 222 -180 35 130
6914A30L5k74N6K35j96J04j11L8Jj8L4n7k5J88j20j56J67QP5J41l37j91L17K9
$$ 130 165 -109 -53 182 -14 90 -21 17 18 0 34 -23 -48 140 20 -136 31 39 114 255 -82 -273 44 73
6938G3k01k33L28K00r7j67L1J37j3j69J69m8O8J02k82j16J35J74j73M3j28J24
$$ 73 -128 -361 -33 167 70 -97 -66 71 58 -111 58 10 78 180 -102 -218 -83 91 -82 -39 -167 -43
6960d3P2r9P8j10J34m4Q0k55J10R9p7j03l7K54O1l06J22J53k52n5K01j52L16o6
$$ -43 29 -70 8 -102 32 -12 68 -187 -77 22 -55 -158 -195 59 120 -186 -64 89 -163 -218 -17 -169 147 81
6984H1j13q9N2K12j11j01P2L5ro5j02M2K59p8k4j58M9J04L1j25o0PJ67r2k27M01
$$ 81 -32 -121 -69 143 32 -69 3 38 29 -36 -138 -96 163 85 61 -97 -48 56 87 -38 -98 -91 76 -16 -243 158
7010A58j48j04j35Q9K7J54J1j33l0J4R6k%o3J89o5Mj42K17j42M3K1j0J10j97K09
$$ 158 10 -94 -229 -140 -113 41 52 -81 -111 -97 -1 -3 -3 -66 123 58 62 -80 137 -5 38 59 49 159 -38 171
7036A71q3q8m8J74j55J11k32K66l00J68J14j03M5K1q1R7lo3P2J25j70j00j66K96
$$ 171 88 0 -48 126 -29 82 -150 116 -184 -16 98 -5 40 61 -20 77 74 11 83 208 38 -62 -228 68
7060F8j35m1J97m2N1L9J47l16K27k69N2N0K2j97J72J55q4R6k80j0R8P2n3p3j24
$$ 68 -67 -108 89 47 98 137 284 -32 195 -74 -22 28 50 -147 25 180 96 192 -88 -98 0 72 19 -54 -178
7085a78J16L4K3J90j30j66L19j11j32j0J7p7K17o7j96J70j62K75j51k4J41j83
$$ -178 -62 -28 -5 185 55 -111 208 97 -35 -45 -28 -105 112 45 -151 19 -143 132 -19 -43 98 -85
7107h5j05L26k65J91j10K8M2J76j13k69K34j25L27k15j60P4N7L8o1j72L56j82
$$ -85 -190 136 -129 62 -48 -20 22 198 85 -184 50 -75 252 37 -123 -49 8 46 -15 -187 169 -13
7129a3j9j47N1L38j76r1N9J45n9pK4j37J41q8q5j99O2N28n00J30M0J17j04J01
$$ -13 -32 -179 -128 210 34 -57 2 147 88 81 105 -32 109 21 -64 -263 -201 327 -173 -43 -3 114 10 111
7153A11j65l9J03j8q3K9%J77J14l96K39m8mn1r3k2L02n6l56K15K4j5j0L3o4J38
$$ 111 -54 -93 10 -8 -91 -62 -62 115 229 -167 72 24 20 -31 -124 -146 156 100 -256 -41 -17 -32 -42 -9 -73 65
7179F5j2j50j4O5R5n7l1R7j7k6J89k07j32J79O6j55O2N2k1J8q3j31K64nn5j54
$$ 65 53 -97 -111 -46 49 -8 -39 58 41 15 204 -3 -135 44 110 -45 17 69 48 66 -17 -148 116 111 56 -98
7205i8J4K90l33J7K04J5j3j9j97o5L2K45q2k10M01j20J97m64K27K79J35k04r1
$$ -98 -84 206 -127 -110 94 109 96 77 -120 -185 -153 92 10 -200 201 81 278 -186 41 320 455 251 160
7228A60J07l78J81M4j41M44n84L05p1j34K66k25o3n1q6L06N5k55P5J00N5q9Lq7
$$ 160 267 -111 70 114 -27 417 -167 138 67 -67 199 -26 -89 -140 -226 80 135 -120 -45 55 110 21 24 -63
7252f3R6k03K91k96K57J38k03j42j04J46J14r9R1m3J77N5j91k93K59J98r8j25
$$ -63 33 -170 121 -175 82 220 17 -125 -229 -83 31 -68 23 -20 157 212 21 -272 -13 185 87 -38
7274c8j5J05j65K16k29L53r8p7j02M0O2J19n7j12j3nK03l36R3M7o5L7q9K3K23
$$ -38 -53 52 -113 103 -126 227 129 52 -50 -10 52 171 114 2 -11 -16 187 -149 -56 -9 -74 -37 -126 -103 120
7299A20N3k80M9j27K76j37o1J5J49J02j53r1J19KK0j03nJ10l5R6j21J92j08j93
$$ 120 173 -107 -58 -185 91 -46 -107 -92 57 159 6 -85 34 36 56 -47 -52 58 23 119 -2 190 82 -111
7323a11QlK05j21N5j1N8n1P2r1O3k08K03k0m1j62K17J9Lj23j71K09K22k29l1j39
$$ -111 -103 -106 99 -22 33 22 80 29 101 10 73 -135 68 48 7 -155 62 81 84 -39 -210 -1 221 -8 -39 -178
7349a78L74K0k75J4Q5M5M8k13J30N1J47j82JL7r8l8o9J39j70L7L0K04k34j9J31
$$ -178 196 216 -59 -45 40 85 133 -80 50 101 248 66 67 104 6 -32 -101 38 -132 -95 -65 139 -95 -114 17
7374A7R9N0o5j46j06J24mo6o7J86M9M3k93K50j15J7k4j22K64p7q9K1M9M5J37k58
$$ 17 116 166 101 -45 -151 -27 -31 -97 -164 22 71 114 -179 71 -44 -27 -51 -173 91 14 -75 -54 -5 40 177 -81
7400h1J02p2K06r3j29J90k01J37P9l51K55K7o3Rk46L79k22K48k58J5m5J84j24
$$ -81 21 -51 155 62 -67 123 -78 59 138 -213 42 69 6 15 -231 148 -74 174 -84 -69 -114 70 -54
7423e4q9K85L3j29j79k5J67j00R5l8J30k29J71O6j73P5p6J94l20L13N2Pk9k49
$$ -54 -143 142 175 46 -133 -158 9 -91 4 -34 96 -133 38 104 -69 6 -70 124 -196 117 169 176 147 -102
7447a02J38J56j00k8m3r7P0J05j50L8K2o7K12l05L07L2r8k64M4O1K00m9N2k00
$$ -102 36 192 92 64 21 -76 -6 99 -51 -13 9 -58 154 -151 156 188 90 -174 -130 -69 131 82 134 -66
7471f6j9K37j49j17O1L8k9r0j17L43pN0j93K4mK98k12m1J31j2O3k12j75L46j44
$$ -66 -85 152 3 -114 -53 -15 -44 -134 -251 92 85 135 -58 -34 -38 260 48 7 138 126 189 -23 -198 148 4
7496DJ72k86Q1J60l2j70K7MK97j78j15l7l7K15J16j60j50J92j72j2o8R5j00J76
$$ 4 176 -110 -29 131 99 -71 -44 -40 257 79 -36 -73 -110 105 221 61 -89 103 -69 -81 -149 -54 -154 22
7520B2k35J29L1Q2J1k27L36q9j12k5n2J35P8j08j50K98n8jk54k8J04J58j49J03
$$ 22 -213 -84 -53 29 40 -187 149 60 -52 -77 -129 6 84 -24 -174 124 66 65 -189 -217 -113 45 -104 -1
7544aO1rk2j55J37j46J56P7k19K26J4q4N4j51j62J98k4Pp3K28j1j49J96k99K14
$$ -1 60 51 29 -126 11 -135 21 98 -121 105 119 35 89 -62 -224 -26 -50 -43 -116 112 101 -48 148 -151 63
7569F3j23Q8n2K3O2N9j90M8K3L5k50J44J05L0ok42m0M74m0j16n8k33P0K82k27
$$ 63 -60 28 -24 -1 61 120 -70 -22 1 36 -214 -70 35 65 59 -183 -223 251 211 95 37 -196 -126 156 -71
7594g1K0J27j21L1k10J51Q6J15j73J29j46J9j1K50l21ML8K33j90j65K33J3l2j04
$$ -71 -51 76 -45 -14 -224 -73 13 128 -45 84 -62 -43 -54 196 -125 -121 -83 150 -40 -205 28 41 9 -95
7618i5pK5K9L3j4q0M21l05K8m1j30K72j43nJ68l08R6Q7K2j77P7J9J85k95J28n5
$$ -95 -102 -77 -48 -15 -29 -109 312 7 35 -6 -136 136 -7 -12 156 -152 -56 31 53 -124 -47 -28 157 -138 -10 -65
7644f5J41O9J1k94J57j9k19K35l3m6j20O8J74j71R6J28n7j59K33M8r9j07oJ49
$$ -65 76 145 156 -138 19 0 -219 16 -17 -63 -183 -115 59 -112 -16 112 55 -104 129 177 78 -29 -35 114
7668A14j60j2Q8j7R3q8n9J17j11L41m59K10j17J27q5J6NP1j20l8R4j5J53k40M9
$$ 114 -46 -58 30 13 106 18 -41 76 -35 306 -153 57 -60 67 -18 -2 3 74 -46 -84 10 -5 148 -92 -43
7693d3q0%M08m5m74J52r4M0K44l44K66O4j36K09k38p1J48R2j75q2K38J34j70j51
$$ -43 -123 -123 285 240 -234 -82 -176 -136 108 -236 30 94 -42 167 -71 -142 6 98 -77 -159 79 213 43 -108
7717a08J48j16n8N1lJ60rj2j11j44K43l7r5J04m0K37j40o1Q0k31K19n0P8p0L3
$$ -108 40 -76 -134 -83 -86 74 65 53 -58 -202 41 4 -91 13 -27 210 70 9 89 -142 77 27 105 35 68
7742F8K8P8l65J03q9M45n01J25Q3J59j85k08K07%K1j21J03J35P6k18Q0l04L76
$$ 68 96 174 -191 -88 -177 268 -233 -108 -25 134 -51 -259 -52 -52 -31 -152 -49 86 162 -56 24 -280 96
7765I6J02k70J8J31r0m3j50J6J22J73j88N3k5J53k70J04Q4l9L6J17k59K17k9J5
$$ 96 198 -72 -54 77 -13 -56 -206 -190 -68 105 -83 -30 -55 98 -172 -68 16 -23 13 130 -129 88 59 74
7789G4K4j59J74k10R4J9j74K17j3M6k61J38J33P1k22J4L1J21j56N5j35L05K4j52
$$ 74 98 -61 113 -97 -3 16 -158 59 46 92 -169 -31 102 173 -49 -35 -4 117 -39 16 -119 186 210 58
7813E8p3L4n3J02j25P0k4K5M1k13K30m7j2j9Nl9J87l9j17j27K9K72j60k40K03
$$ 58 -15 19 -34 68 -57 13 -11 14 55 -158 72 25 13 -6 -1 -40 147 108 -9 -136 -107 165 5 -235 -32
7838c2K99q4k80j11J84J18N8l00J47p7k3m1Q1p0J26K0q0M3J32p2n1k5N4Q3n1l0
$$ -32 267 183 -97 -208 -24 94 152 -148 -1 -78 -101 -142 -61 -131 -5 15 -65 -22 110 38 -13 -38 16 99 48 18
7864A8j23J44j2j5l6q5J21J96k12J05P3k48R7j9q8J52O4j25K8J4n4L0r6J57J7
$$ 18 -105 39 27 12 -24 -109 12 208 -4 101 174 -74 23 4 -84 68 132 7 35 49 -5 25 -71 86 103
7889A03rj70J98r3j11O5K7m7J26n2J5j18j6J00N1op7j32J31J3j28P7M1j56K24
$$ 103 94 -76 122 29 -82 -17 10 -37 89 37 52 -66 -82 18 69 63 -14 -146 -15 -2 -130 -53 -12 -168 56
7914E6j31j02J35J17n6j53J92O5K02l50J34P6l15K37M0q6Ok9j40j94J78J62mj71
$$ 56 -75 -177 -42 75 19 -134 58 123 325 -25 109 185 -130 107 147 61 67 38 -102 -296 -118 44 40 -131
7938a31J99Rj04j6R3j88j78J59j2L29j45j14J19j12K11j13l1j6M9J09j33qJ46
$$ -131 68 77 -27 -43 50 -138 -316 -157 -169 160 15 -99 20 -92 119 6 -25 -41 8 117 -16 -24 122
7961A22r3m9M6P2L2j19p4J44j51Q1m9M3L2K7j64J15P1o6j89M06j45q3k07K94p7
$$ 122 29 -20 26 98 130 11 -63 81 -70 11 -38 5 37 64 -100 15 86 20 -169 237 92 9 -198 96 19
7986A9q7Nj16K04Q4j01J35J34j85j4M1j15r1J41j64J12J2k8j1K3l3J74j69j2q
$$ 19 -68 -63 -179 25 109 8 143 277 92 78 119 4 -87 54 -110 2 14 -14 -25 -2 -35 139 -30 -42 -50
8011e0J81j26o1Q1k0J34j22Pr4P0n0NO4k65J87K93k17N1j21J38q7l10K15L48j63
$$ -50 131 5 -56 25 5 139 17 24 -70 0 -50 -45 19 -246 -59 234 17 68 -53 85 -2 -312 -97 251 88
8036H8k95K06NQ6q5j0P1P6M1k56J18n4ln7K5M4j74K36k8k11K58P9r3j55J10K9
$$ 88 -207 -1 4 90 5 -5 66 142 183 -73 45 -9 -12 -69 -44 0 -174 62 34 -177 81 160 67 -88 22 51
8062E1k23K32p4LP1j64J21k10K35O7O0k31j5K36K5j91q4k1L16o0l06L0Q9nK41
$$ 51 -172 60 -14 -11 60 -104 17 -193 42 109 169 -62 -77 159 184 -7 -91 -112 204 144 -162 -132 -43 -48 193
8087A93q8j27J62k12L33l57O7J5J31j84N5j3J45r9o4m2K2J70j83j9J27R6j5k93
$$ 193 105 -22 140 -72 261 -96 -29 -14 117 -67 -12 -25 120 21 -43 -85 -63 107 -76 -95 32 128 113 -180
8111a80Q9J31q2K18j87J60q6j93j6L10l69K91m4J3j30J48m1j4r8J59k2j9j23K1
$$ -180 -91 40 -42 176 -11 149 63 -130 -146 164 -205 86 42 55 -75 73 32 18 -80 79 57 38 -85 -64
8135f4J61j58M9j43K73k15M3L00j44j46J21L8r3m2J20P1k32l9jK9K1K3j35J92
$$ -64 97 -61 -12 -155 118 -97 -54 246 102 -44 77 115 22 -20 100 171 -61 -100 -101 -72 -51 -28 -163 29
8159B9m8J10m8k2M3jl0rj3N0N1k84K63j36K01n1j88R9%L3j3Q2j23j1j53J48J7
$$ 29 -19 91 43 21 64 63 33 24 11 61 112 -172 91 -45 156 105 -83 16 16 49 36 118 -5 -16 -169 -21 -4
8186do4K92k71K34j92
$$ -4 -68 224 -47 187 -5
8191e
$$ Imaginary data points
##PAGE= N=2
##DATA TABLE= (X++(I..I)), XYDATA
0@%%%%%%%Qj6J6j6K4l2M0n6O4p2R6j20J42j72K09k51K94l45M08m75N50o39P36
$$ 0 0 0 0 0 0 0 0 8 -8 8 -8 16 -16 24 -32 32 -40 56 -64 78 -94 115 -136 158 -187 221 -254 296 -343 393
30C93q41R62j098J242j403J588j790K004k241K508k795L105l452L830m237M685
$$ 393 -448 514 -584 658 -745 843 -947 1057 -1184 1324 -1471 1634 -1818 2012 -2225 2460
46B460n176N710o293O937p643Q414r270J0223j1283J2471j3815J5348j7109J9162
$$ 2460 -2716 2994 -3299 3638 -4005 4409 -4861 5362 -5921 6550 -7265 8083 -9026 10136
60A0136k1598K4534k8154L2758l8830M7246n9791Q0706j23877L65536p61049m23097
$$ 10136 -11462 13072 -15082 17676 -21154 26092 -33699 47007 -76870 288666 -472383 -895480
72h95480J360744L27424p86672o18365L11494N38247K63105n21187p28278K52685
$$ -895480 465264 792688 6016 -612349 -300855 237392 500497 -20690 -748968 -496283
82d96283J100942n6307j243460k40156J231219M31171j004394n33186O52725N17023
$$ -496283 604659 548352 -695108 -935264 295955 727126 -277268 -810454 -157729 359294
92C59294j24125m10832l49444K95131P93156r1362r88419j02978J075524L35537
$$ 359294 235169 -175663 -525107 -229976 563180 471818 -516601 -619579 455945 791482
102G91482r47554m69517P34921N36032l83062m80245Q013L31454L62049j25544
$$ 791482 -156072 -625589 109332 645364 262302 -217943 -209930 121524 483573 358029
112C58029o87570j12949Q73477K62204r24561l92689P50411M24908n07644m52359
$$ 358029 -329541 -442490 430987 693191 -231370 -624059 126352 551260 43616 -408743
122d08743J73949L50388J09431k10315l90351m853N69718J97852o68858l65220
$$ -408743 -234794 115594 225025 14710 -375641 -380494 189224 387076 -281782 -647002
132f47002O64072M57662n50969m32385L67685L51427q3240j90824j60043O0414
$$ -647002 17070 474732 -76237 -508622 -140937 210490 127250 -63574 -223617 -163203
142a63203L84696J17836m71673k47630N11506L79972m46623m18591L48375L95040
$$ -163203 221493 339329 -132344 -379974 131532 511504 64881 -353710 -5335 389705
152C89705j93543k84717K1576J14765J41980O1470l01624k33698L79010L13330
$$ 389705 196162 -88555 -66979 47786 189766 251236 -50388 -284086 94924 408254
162D08254m09433l66452L21414L32292k24835k91402Q3788J70815J5734m0934
$$ 408254 -1179 -367631 -46217 286075 61240 -230162 -146374 24441 40175 -759
172g59j18238j17118J81912K45448k25592l23839K48289L44026k19463k71898
$$ -759 -118997 -236115 -54203 191245 -34347 -358186 -109897 234129 14666 -257232
182b57232J74549J81598p0877m8164L62m3779P9783J52865j00002k10655J27705
$$ -257232 -82683 98915 28038 -20126 -19764 -63543 16240 169105 69103 -141552 -13847
193a3847K60739j24186k54303J28979K08550j24055j20645J02478K974p5536Q6009
$$ -13847 246892 122706 -131597 -2618 205932 81877 -38768 63710 66684 -8852 77157
204G7157J2881j64118K1013J72329o8925j75701P4907J30236j03449r5396J09056
$$ 77157 90038 -74080 -53067 119262 50337 -125364 -50457 79779 -23670 -119066 -10010
215a0010L1903j30454K1205J31799p6214j13324J19341P0436j27031M403J10923
$$ -10010 21893 -108561 -87356 44443 -31771 -145095 -25754 44682 -82349 -77946 32977
226C2977o6223n0834J34138J3106j59358L1898J91945l6108j84660M8984J73026
$$ 32977 -33246 -84080 50058 63164 -96194 -64296 127649 91541 -93119 -44135 128891
237A28891l4630j17995K8008M6127j1711N0508o724j54459K1340K27987m0886
$$ 128891 94261 -23734 4274 50401 38690 89198 82474 -71985 -50645 177342 136456
248A36456k70295K8396K48815j2078k09440l6705J20789N7985l1294p9983q5284
$$ 136456 -133839 -105443 143372 131294 -78146 -114851 5938 63923 32629 -47354 -132638
259a32638O5217J83129m4842k67414O679L08056L1276k93688o1084K27349R6385
$$ -132638 -67421 115708 70866 -196548 -189869 118187 149463 -144225 -205309 22040 118425
270A18425j05214j11512j9362J23337J51546q9329k40391M6264L10947K7985l20517
$$ 118425 13211 -98301 -117663 5674 157220 67891 -172500 -126236 184711 212696 -107821
281a07821q8833K88192J43873k01002j68136P8495J59141O3888j24526k07085
$$ -107821 -196654 91538 235411 34409 -133727 -55232 103909 167797 43271 -163814
291a63814O3518L04956N84l54239q5745L26937J55181k60319k14861J42287K21396
$$ -163814 -100296 204660 205244 -148995 -234740 92197 247378 -12941 -227802 -85515 135881
302A35881j1449j93793j31209J22675K48473k9491l25718p1872L49088J63121
$$ 135881 124432 -69361 -200570 -77895 170578 141087 -184631 -256503 92585 255706
312B55706l06541k21207K10866K50089o7910k31589p5183J82472K07898q5852
$$ 255706 -50835 -272042 -61176 188913 121003 -110586 -185769 -3297 204601 118749
322A18749k93121k4764L38207J43107l21879k34296K54108K88374j39521k90778
$$ 118749 -174372 -199136 139071 282178 -39701 -273997 -19889 268485 128964 -161814
332a61814j769K40587J44696j50657k67802L0804L37045R0445l49790k08289K93019
$$ -161814 -163583 77004 221700 71043 -196759 -165955 171090 261535 -88255 -296544 -3525
343c525K88273j94496l27378O0622L02306P6031k26163k01393J07258K92336L0759
$$ -3525 284748 90252 -237126 -176504 125802 201833 -24330 -225723 -118465 173871 204630
354B04630l32111j63427L14727K69737k39595l26269J25776L33165J3712k81389
$$ 204630 -127481 -290908 23819 293556 53961 -272308 -146532 186633 200345 -81044
364h1044j42690J88585K47401n8557l03647q1188L10823K10029k66136l02658
$$ -81044 -223734 -35149 212252 153695 -149952 -231140 79683 289712 23576 -279082
374b79082J78003L40974o0876l23134o8269K50149J83917j37483k67812N62L01468
$$ -279082 -101079 239895 179019 -144115 -212384 37765 221682 84199 -183613 -183051 118417
385A18417J32162k83615k43546K15803L13146j14974l30391J57K92427J11044
$$ 118417 250579 -33036 -276582 -60779 252367 137393 -192998 -192841 99586 210630
395B10630k03343j99012Q1626K52504N0610k60658j69469K23475K56377j50265
$$ 210630 7287 -191725 -110099 142405 193015 -67643 -237112 -13637 242740 92475
405I2475k99106N4208K89545M6899k32584j35627J38642J94136k5964k17250r0998
$$ 92475 -206631 -152423 137122 184021 -48563 -184190 -45548 148588 122624 -94626 -185624
416a85624K00860J89637j54638k53137Q3494K70934P26k41885q1634J76218J45052
$$ -185624 15236 204873 50235 -202902 -119408 151526 152252 -89633 -171267 4951 150003
427A50003q1608j78084k1349J80829J19206j50722j89179R8145K26501k8029k22472
$$ 150003 68395 -109689 -131038 49791 168997 18275 -170904 -72759 153742 125713 -96759
438i6759l7677J83264R2963j11939j27172K4366J37306O1389j23950j32456Q5721
$$ -96759 -134436 48828 141791 29852 -97320 -72954 64352 125741 1791 -130665 -44944
449d4944J75349l7831j90161j6107J68499N8252j23773r1140N6372J00878J1185
$$ -44944 130405 92574 -97587 -113694 54805 113057 -10716 -101856 -45484 55394 66579
460F6579r4729p6852O7954J24858l4213j49635k565J47617L8404j18775o1620
$$ 66579 -28150 -105002 -37048 87810 53597 -96038 -98603 49014 87418 -31357 -92977
471i2977P6895P4973k0507o6634k9762N2973P7482k5149j01144O47J11503K7363
$$ -92977 -16082 58891 38384 -28250 -58012 -5039 72443 47294 -53850 -53203 58300 85663
483H5663r9450m1634P4334M7457l8237m3740j561L0579L1916j6816n8095m551
$$ 85663 -13787 -55421 18913 66370 28133 -15607 -17168 13411 45327 28511 -29584 -34135
495c4135O6518J4530p0832k5525N5242K0423m1086j7163J7116M086j309O538j4673
$$ -34135 32383 46913 -23919 -49444 5798 26221 -14865 -32028 -14912 -10826 -12135 -5597 -20270
508b0270j7872K5423K2981k8222j7415L0288J1384k3249N853K4915j5593j8229
$$ -20270 -38142 -12719 10262 -17960 -35375 -5087 6297 -16952 -11099 13816 -1777 -20006
520b0006L2415K1183l3476j5346L4071J7810j9174j2496K345O912K0829L570m2461
$$ -20006 12409 33592 116 -15230 18841 36651 17477 4981 7326 14238 35067 38637 -3824
533c824j8294N4604L0347o2379m7776M9966N2304l5696n8443K148M4459K4872
$$ -3824 -22118 32486 62833 454 -47322 2644 54948 19252 -39191 -37043 7416 32288
545C2288l1254n8438J617P5656K5579q6595n6677P8325P9620n4774r0203K1612
$$ 32288 1034 -57404 -55787 19869 45448 -41147 -97824 -19499 60121 5347 -84856 -63244
557f3244Q9781K3979o7143n9629L8854R6835R743j07725m8690J11366R3435q3907
$$ -63244 26537 50516 -16627 -76256 -37402 59433 69176 -38549 -87239 24127 117562 33655
569C3655j14932M9647J25999J693j10377n0689P7046R3517l0718j22682k8377
$$ 33655 -81277 -31630 94369 96062 -14315 -65004 12042 105559 74841 -47841 -76218
580g6218J23919P7438j10817j25267O6625J40416k1067j43689m1306J10984Q6852
$$ -76218 47701 125139 14322 -110945 -44320 96096 75029 -68660 -109966 1018 87870
591H7870o8712j26405M388J37924N7732j29709j13412R7505J51395m3320j60274
$$ 87870 19158 -107247 -102859 35065 92797 -36912 -150324 -52819 98576 55256 -105018
602a05018j4190J49533P8573j01631j19163M6177J50976L1150j44535r2051J22255
$$ -105018 -119208 30325 108898 7267 -111896 -65719 85257 116407 -28128 -120179 2076
613B076J48801o9181j72166J0188J71071N5733j37156j11305P7378J45391p618
$$ 2076 150877 81696 -90470 -80282 90789 146522 9366 -101939 -24561 120830 113212
624A13212j58517p0983J33886J29050r5344j76300K7924J79955L3529j64911j00033
$$ 113212 -45305 -116288 17598 146648 51304 -124996 -97072 82883 116412 -48499 -148532
635a48532J10602J38425m5594j60172l4901J49234J06377j14155j59175N9535
$$ -148532 -37930 100495 54901 -105271 -140172 9062 115439 1284 -157891 -98356
645i8356J88278J3090j78226p5985J47296J36864p9128j61581Q488J70969P6099
$$ -98356 89922 103012 -75214 -151199 -3903 132961 53833 -107748 -99260 71709 147808
656A47808j39178j36502R2287J83280k1428j92898m6817J71975J08730j20478
$$ 147808 8630 -127872 -35585 147695 126267 -66631 -113448 58527 167257 46779
666D6779j54304M5326J68203K9489j60193j07644J12325J55791n7632j89494j8435
$$ 46779 -107525 -62199 106004 135493 -24700 -132344 -20019 135772 78140 -111354 -129789
677a29789J78522P8546j47802j34835Q4267J59152j3597j61258o2031J34240J27095
$$ -129789 48733 127279 -20523 -155358 -71091 88061 74464 -86794 -148825 -14585 112510
688A12510q4116j65409K4914J81423M7029j58667j00062J20792J47072n2716j55523
$$ 112510 28394 -137015 -112101 69322 116351 -42316 -142378 -21586 125486 72770 -82753
699h2753j1392J48922Q2619j07735j29535N7084J60453O440j59444o4781J31567
$$ -82753 -94145 54777 137396 29661 -99874 -42790 117663 124103 -35341 -100122 31445
710C1445J08810q4811j38269J9543J36242L7021j20646r4678P3266J23671k6308
$$ 31445 140255 55444 -82825 -63282 72960 109981 -10665 -105343 -32077 91594 65286
721F5286j42413l2478J26150P4043r8745j07849N0304J16511J014j07476n0910
$$ 65286 -77127 -109605 16545 90588 -8157 -116006 -65702 50809 51823 -55653 -106563
732a06563Q1752R1737m0168j08718J49J14284M7743r1138p5229O5125R9364k0238
$$ -106563 -24811 66926 26758 -81960 -81811 32473 80216 -10922 -86151 -21026 78338 58100
744E8100r3950j6132Q1719N6371m9147p7881J5364Q8482K0591q2788n1185O0923
$$ 58100 -35850 -51982 29737 86108 36961 -40920 -25556 62926 83517 729 -50456 10467
756A0467O7489l5168p7031k230O5222K5711n2054n2133K0295N7316K808o2247
$$ 10467 77956 42788 -34243 -36473 28749 54460 2406 -49727 -29432 27884 30692 -31555
768c1555l1833M8424M5020l3354n3909J0298N0049J1410l6598k6661K1998M0422
$$ -31555 -63388 -14964 30056 -3298 -57207 -46909 3140 14550 -22048 -48709 -26711 13711
780A3711L58l8624j2786L8694L1205k3294l3449J6287L7630P0k6502o645J7859
$$ 13711 14069 -24555 -37341 1353 32558 9264 -24185 -7898 29732 29802 3300 -3345 14514
793A4514J6137k907j8362p476J6510J4334j3734j9975N628J5373m486j5142l053
$$ 14514 30651 27744 9382 1906 18416 32750 19016 -959 4669 20042 15556 414 -2639
806b639M876j078m118k098m927l875L230J972n818l534Q75p79L910M888o934r080
$$ -2639 2237 1159 -2959 -5057 -9984 -13859 -10629 -8657 -14475 -18009 -17134 -17913 -14003 -9115 -16049 -25129
822b5129J0329J7038n138j8190L330K3606Q372j6469j2115J3473K2657K152k2485
$$ -25129 -14800 2238 -2900 -21090 -17760 5846 14218 -2251 -14366 -893 21764 23916 1431
835A431j2806K4711K8637j7521l7082Q048M0825N569l8894k2287K6341L2101j3065
$$ 1431 -11375 13336 41973 24452 -12630 -4582 36243 41812 2918 -19369 6972 39073 26008
848B6008m2998j1020L9004K7786l4563m9114J4902N5576J827n9741k4821M8188
$$ 26008 -16990 -28010 10994 38780 4217 -44897 -29995 25581 27408 -32333 -57154 -8966
860h966M1304k9983n4237M379N9275K3391n0992m5595L6664O6485r594p0306j4038
$$ -8966 32338 2355 -51882 -47503 11772 35163 -15829 -61424 -24760 41725 32131 -38175 -52213
873e2213O8879M3316m8316o0160K5169P3321R162o8726l9507N5398O6751l1399
$$ -52213 16666 59982 11666 -48494 -23325 49996 59158 -9568 -49075 6323 73074 41675
885D1675q2594Q52Q2990L0146p1837o0706M4351P6342j3466q3469k6741P0629
$$ 41675 -40919 -40067 42923 73069 1232 -59474 -15123 61219 47753 -35716 -62457 8172
897H172N6807n0430q2644J6306Q9609J7216q5437n1250O3862P4890l1205q5621
$$ 8172 64979 14549 -68095 -51789 37820 55036 -30401 -81651 -17789 57101 25896 -59725
909e9725o695Q3365M5321o4172p2685L6049R2765L636r1976l7988Q0126P0981
$$ -59725 -66420 16945 62266 -1906 -74591 -38542 54223 57859 -34117 -72105 8021 79002
921G9002m9287q7679J3822R3694K7048q0290o1994N4515Q7488j9355r7894k1166
$$ 79002 29715 -57964 -44142 49552 76600 -3690 -65684 -11169 76319 56964 -40930 -62096
933f2096Q9094N5744o7252q4183L0079R3270Q457r0138m9913O6156P8879l4855
$$ -62096 26998 82742 15490 -68693 -38614 54656 63113 -27025 -76938 -10782 68097 33242
945C3242r6752o044R5030M4122p8166p5580M7753R3372p909r3800l1744Q0678
$$ 33242 -63510 -69554 25476 69598 -8568 -84148 -36395 56977 49068 -44732 -76476 4202
957D202O8088n0500q9352J3850R8440K8862q7823o2803O4871Q8815k7570r8080
$$ 4202 72290 21790 -67562 -53712 44728 73590 -14233 -77036 -12165 76650 49080 -49000
969d9000j1843R1656N0283o8730p9640L3561R5681N722r5477m5781P6632P5945
$$ -49000 -60843 30813 81096 12366 -67274 -33713 61968 67690 -27787 -73568 3064 79009
981G9009m7158r5550P707R5708L0384q1472o5589N1826Q6854j5668r4252k3442
$$ 79009 31851 -63699 -55992 39716 70100 -11372 -76961 -25135 61719 46051 -48201 -71643
993g1643Q4287N8063o0958q1615K8144R0860R931q3840m4124O4609P1785l3084
$$ -71643 12644 70707 9749 -71866 -43722 47138 57069 -26771 -70895 -6286 65499 32415
1005C2415q4578k310Q4542L8225o9516o4879M4348Q1859j1924q3934k1355P2538
$$ 32415 -52163 -54473 30069 68294 -1222 -66101 -21753 60106 48182 -35752 -57107 15431
1017A5431M9661m9278o9370J8348P6277J3621p0600m2903N2587O2734k7369p2874
$$ 15431 65092 15814 -53556 -35208 41069 54690 -15910 -58813 -6226 56508 29139 -43735
1029d3735j607O8929K8491n4140n0080L0693O1049l823o1649k1915N1476M2968
$$ -43735 -45342 23587 52078 -2062 -52142 -21449 39600 35777 -25872 -47787 3689 46657
1041D6657l3407n5243J1441N7360J2372n0091l1051L5075M4220j5117m8471n833
$$ 46657 13250 -41993 -30552 26808 39180 -10911 -41962 -6887 37333 22216 -26255 -32088
1053c2088M4858K4516l4229l8215J9202M3637j750m1645j5154L2870K6567j9115
$$ -32088 12770 37286 3057 -35158 -15956 27681 25931 -15714 -30868 2002 28569 9454
1065I454l2887L573L2955J1083k7536k1942J7439K8965n312k9898n442K6177J4396
$$ 9454 -23433 -19860 13095 24178 -3358 -25300 -7861 21104 15792 -14106 -19548 6629 21025
1078B1025j7636j8922P773K0285K826j8160j0351J2582J5015n639j6151j265J3672
$$ 21025 3389 -15533 -7760 12525 15351 -2809 -13160 -578 14437 8798 -7353 -8618 5054
1091E054N707j0466r052N087Q814q30p723l364M219N095j947o023K00L873R26
$$ 5054 10761 295 -8757 -3670 5144 4314 -3409 -6773 -2554 2541 594 -5429 -5229 -1356 -430
1106d30k029j25nq96J155K735M61l867j731N406M892l395n967R05P581M546o166
$$ -430 -2459 -2584 -2589 -3485 -2330 405 866 -3001 -4732 674 5566 2171 -3796 -2891 4690 9236 3070
1123C070r167M277J3922M0j5343n043J3774J1186j0304j6550L255J8449L989j7899
$$ 3070 -6097 -1820 12102 12142 -3201 -8244 5530 16716 6412 -10138 -6883 11566 15555 -2344
1137b344j3213J1298J9353l839k4776p115K3748J5448j9345k4156Q965K8318K893
$$ -2344 -15557 -4259 15094 11255 -13521 -20636 3112 18560 -785 -24941 -15976 12342 15235
1150A5235k8676j5971K4171K7310j3978l2973J059L5097J5097k9673k7289K1382
$$ 15235 -13441 -29412 -5241 22069 8091 -24882 -23823 11274 26371 -3302 -30591 -9209
1162i209L7755n620l8371j0135L4673K7492k2816l9209Q485M5055Q907m2216k5956
$$ -9209 28546 22926 -15445 -25580 9093 36585 13769 -25440 -16955 28100 37007 -5209 -31165
1175c1165L1063L9349j5805m8358m464M6188K2116l8443l8893J9776M7579n10
$$ -31165 -102 39247 23442 -24916 -29380 16808 38924 481 -38412 -18636 28943 28433
1187B8433n1864k1729M4502L8450l1237m9852R624N3554J3575m8451l4291L7014
$$ 28433 -23431 -45160 -658 37792 6555 -43297 -33673 19881 33456 -14995 -49286 -12272
1199a2272M9550j6330n4296o248N3025L1689l9872m8638K3508N8842J016n5582
$$ -12272 37278 20948 -33348 -39596 13429 45118 5246 -43392 -19884 38958 39974 -15608
1211a5608k3414M5427M4974k6292n7589L941N9644J9545n1407m0960L2467N3964
$$ -15608 -39022 6405 51379 25087 -32502 -28561 31083 50628 -779 -41739 -9272 44692
1223D4692j0454o0827j5267N3711L4431l9466n1072J3838N7124J0207n6496l4613
$$ 44692 34238 -26589 -41856 11855 46286 6820 -44252 -30414 26710 36917 -19579 -54192
1235e4192M3707M9904k3668n8189j972N7728K7231m6621m6143K9728N8232m159
$$ -54192 -10485 39419 15751 -42438 -44410 13318 40549 -6072 -52215 -22487 35745 31586
1247C1586n6641j9893M9287M4369l0588n6664J0849O1265J4716n1935l5599L5539
$$ 31586 -25055 -44948 4339 48708 18120 -38544 -27695 33570 48286 -3649 -39248 -3709
1259c709N2992j2841o0069j1038N4599L1606m0358m9201J6409N6475O203n7496
$$ -3709 49283 36442 -23627 -34665 19934 51540 11182 -38019 -21610 34865 41068 -16428
1271a6428l0254M3632M4454k4932n5430k005N4601K5078m7907m4623L0964N4409
$$ -16428 -46682 -3050 41404 16472 -38958 -40963 13638 38716 -9191 -53814 -22850 31559
1283C1559q098n5349j5771M9077L8646l3572n0804J5294N6322R708m8348l0055
$$ 31559 23461 -31888 -47659 1418 40064 6492 -44312 -29018 27304 37012 -11336 -41391
1295d1391L6597M9197j6085n5547l040N4036K4117l9983m0886K1254N2014p67
$$ -41391 -4794 44403 28318 -27229 -30269 23767 47884 7901 -32985 -11731 40283 39516
1307C9516n3345j9526M3041L4235k7169m6829L975M8737J4471m6229l2446L1379
$$ 39516 -13829 -33355 9686 43921 16752 -30077 -26102 22635 37106 -9123 -41569 -10190
1319a0190M0130j3792m5331q987M1395K6235l3300l8339J8748M2661R5l9705j7544
$$ -10190 29940 16148 -29183 -38170 3225 29460 -3840 -42179 -23431 19230 19325 -20380 -37924
1332c7924L3128L3468j9848l8517P068L9827J0862l0168k3750K1158L6222p005
$$ -37924 -4796 28672 8824 -29693 -22625 17202 28064 -2104 -25854 -4696 31526 24521
1344B4521l7596m231L3723J6617k2571k6091R288L0927J828l0987j2801K2339
$$ 24521 -13075 -17306 16417 33034 10463 -15628 -6340 24587 26415 -4572 -17373 4966
1356D966J8174j2599k4734k052K4092R862k3249j7561J4093J8546n516j9922o049
$$ 4966 23140 10541 -14193 -16245 7847 17709 -5540 -23101 -9008 9538 4022 -15900 -21949
1369b1949J7514J3443j3822j6324P782J6396J372j2212p516J0728J4095n654j2615
$$ -21949 -4435 9008 -4814 -21138 -13356 3040 4412 -7800 -15316 -4588 9507 3853 -8762
1382h762L739J1802L053n347o631L346J0882l16r513r2O631J751k638m041j120
$$ -8762 -5023 6779 9832 4485 -2146 1200 12082 11766 2253 2161 8792 10543 7905 3864 2744
1397B744M388N79n293j049J259j732k90k32l019p05K62k111R53R05m664j489N147
$$ 2744 7132 7711 2418 1369 2628 896 606 374 -2645 -3350 -3088 -5199 -4246 -3341 -8005 -9494 -4347
1414d347P63l509k720J381O380K264q303k317R654N328m840n413J387R782N771
$$ -4347 -3584 -7093 -9813 -8432 -2052 212 -8091 -10408 -754 4574 -266 -5679 -4292 5490 11261
1429A1261r384p866R772J0741m095j0296k362J0462J0132r649j5006N546J5731
$$ 11261 1877 -5989 3783 14524 10429 133 -2229 8233 18365 8716 -6290 -744 14987
1442A4987q61j5153r056J0249J5238p720k1286j23J9370N303j6051j4497P573
$$ 14987 14126 -1027 -10083 166 15404 7684 -13602 -13725 5645 10948 -5103 -19600 -12027
1455a2027K0091n27k3645p456K1221J4374j2920k0332L560K5760P572k4338j4528
$$ -12027 8064 7537 -16108 -23564 -2343 12031 -889 -21221 -17661 8099 15671 -8667 -23195
1468b3195K0466K2103q287k4031l215K6321J6772k1545k4361J4273K9065j361
$$ -23195 -2729 19374 11087 -12944 -16159 10162 26934 5389 -18972 -4699 24366 23005
1480B3005k7995j2757K3427K4741j6641l2258M888L1821P262k7911k2258J7527
$$ 23005 -4990 -17747 5680 30421 13780 -18478 -13590 18231 25493 -2418 -24676 -7149
1492g149L0909p818l6106o195L1463J7447k2838k9275Q883L5614M545l5780j7051
$$ -7149 23760 15942 -20164 -26359 5104 22551 -287 -29562 -20679 14935 19480 -16300 -33351
1505c3351K8604K7907j5081l4125L60L7495J5668l1985k5920K2971L4005n825
$$ -33351 -4747 23160 8079 -26046 -25686 11809 27477 -4508 -30428 -7457 26548 20723
1517B0723l5110j0114L3383K5738k4300l4330J1926L7191M730l4197k1073K5485
$$ 20723 -14387 -24501 8882 34620 10320 -24010 -12084 25107 29837 -4360 -25433 52
1529E2L3071j4650l9093j107L5730J5419k8281l0142J4526L7550j827l8972j3584
$$ 52 33123 18473 -20620 -21727 14003 29422 1141 -29001 -14475 23075 21248 -17724 -31308
1542c1308L1183K5500j9156l5056L306L8256J1311l4179k3228K4226L2602q238
$$ -31308 -125 25375 6219 -28837 -25531 12725 24036 -10143 -33371 -9145 23457 15219
1554A5219l5603p127L5079K2069k6326l0040J4030L4834L219l2894j7780K6840
$$ 15219 -20384 -27511 7568 29637 3311 -26729 -12699 22135 25354 -7540 -25320 1520
1566A520L0099j5594l5719J771L4168J3638k8012k7120J6777L4813m997l5979
$$ 1520 31619 16025 -19694 -17923 16245 29883 1871 -25249 -8472 26341 21344 -14635
1578a4635r903K9226K1700j8949l2249N124L4887P648l1749k0322K1978K8407
$$ -14635 -24538 4688 26388 7439 -24810 -19686 15201 22849 -8900 -29222 -7244 21163
1590B1163q457l3230n647L2202J8153k4899k6473J3624L1400J357l0610j4229
$$ 21163 12706 -20524 -26171 6031 24184 -715 -27188 -13564 17836 19193 -11417 -25646
1602b5646K6323K5194j6271k9752M217L0516J0015k5682k1344J8205K8770p402
$$ -25646 677 25871 9600 -20152 -15935 14581 24596 -1086 -22430 -4225 24545 17143
1614A7143l0308n061K6664J6341j9275k5799Q880K8891J669k7794j2563K0126
$$ 17143 -13165 -18226 8438 24779 5504 -20295 -11415 17476 19145 -8649 -21212 -1086
1626a086K0688j0572k6559n38K6573J0020k2211j7925J3567K2596k818k4463o789
$$ -1086 19602 9030 -17529 -18067 8506 18526 -3685 -21610 -8043 14553 11735 -12728 -19517
1639a9517K2539J4382j5538j8977P257K0907K924j9134j1117J5751J6586q645
$$ -19517 3022 17404 1866 -17111 -9854 11053 13977 -5157 -16274 -523 16063 7418
1651G418j8399R64J7892P094j4479j3318R362J6381l043j6671l381J3323R058
$$ 7418 -10981 -10017 7875 14969 490 -12828 -3466 12915 9872 -6799 -10180 3143 12201
1664A2201r257j2997L787J3958Q95j2260n547Q139Q754l740j0617n55J0373L393
$$ 12201 2944 -10053 -6266 7692 8587 -3673 -9220 -1081 7673 3933 -6684 -7239 3134 6527
1678F527p948n806M154P259m44p500j879O393L810m518l907J788L921Q79l457
$$ 6527 -1421 -7227 -3073 4186 3742 -3758 -5637 756 4566 48 -3859 -2071 1850 2729 -728
1693g28k065K936K389j725k154Q63J511J76j115m88J138P8j733P29J971j360k070
$$ -728 -2793 143 2532 807 -1347 -484 1027 1203 88 -400 738 816 -917 -188 1783 423 -1647
1710a647Q04K304N93l038k146K888L898k030m985P54M835J658m306m195L042O533
$$ -1647 -843 1461 2054 -984 -3130 -242 3656 1626 -3359 -2605 2230 3888 -418 -4613 -1571 4962
1726D962j309p029j678O533M833m780p461J776R489J117r489m689P489P877m327
$$ 4962 3653 -3376 -5054 1479 6312 1532 -5929 -4153 5336 6453 -3036 -7725 -236 7641 3314
1741C314j0191k98J0727M795r440q864O012J1517j196j2441m257J1435R405q085
$$ 3314 -6877 -7175 3552 8347 -1093 -9957 -3945 7572 6376 -6065 -10322 1113 10518 2433
1755B433j2703L524J3915L434j3023r019J0129J3334m475j5426j897J5039Q726
$$ 2433 -10270 -6746 7169 10603 -2420 -11439 -1310 12024 7549 -7877 -9774 5265 13991
1768A3991j1666j4239O266J7032N28j7459p629J4274J3545q772j8376J708J8926
$$ 13991 2325 -11914 -5648 11384 11912 -5547 -13176 1098 14643 5871 -12505 -10797 8129
1781H129N780j7268j2965J1582J7897m401j9896m329J8240J2179j3764j7947O638
$$ 8129 13909 -3359 -16324 -4742 13155 8754 -11142 -15471 2769 14948 1184 -16763 -10125
1794a0125K1079K218j9989j0797J6539J7766r222k1497O73K2027R246j8438j6240
$$ -10125 10954 13172 -6817 -17614 -1075 16691 7469 -14028 -13355 8672 17918 -520 -16760
1807a6760J1563K1784k484k2652o827J9996J5442j3880k1274M933K3386M488k2180
$$ -16760 -5197 16587 14103 -8549 -15376 4620 20062 6182 -15092 -10159 13227 17715 -4465
1820d465j3413J5945J9898q248k3592j928K2489J0535j8203j8752J0685K2319
$$ -4465 -17878 -1933 17965 9717 -13875 -15803 6686 17221 -982 -19734 -9049 13270
1832A3270j085k3399q630J9827J6581j2410k1803L622K3767O061k0592j4392J5110
$$ 13270 12185 -11214 -19844 -17 16564 4154 -17649 -14027 9740 15801 -4791 -19183 -4073
1845d073K1002o182k2172l366K1350J2477j5526j8637P993K2271J640k1158j0873
$$ -4073 16929 10747 -11425 -14791 6559 19036 3510 -15127 -7134 15137 16777 -4381 -15254
1858a5254J6777J7337r328k1538m8K1317P936j7851j5965J0906J9736l043k1066
$$ -15254 1523 18860 9532 -12006 -12054 9263 17199 -652 -16617 -5711 14025 10982 -10084
1871a0084o568J8088J3206j2695j8581M507K0122L750j8301j1063J3116J7318
$$ -10084 -16652 1436 14642 1947 -16634 -12127 7995 11745 -6556 -17619 -4503 12815
1883A2815n919j9406j681J8934R906j3856j5266P831J8896M02j8014p536J4965
$$ 12815 6896 -12510 -14191 4743 14649 793 -14473 -6642 12254 12656 -5358 -12894 2071
1896B071J4347q474j7482J397J7696O287j5202j2625R666J6409l114j7862m704
$$ 2071 16418 7944 -9538 -8141 9555 15842 640 -11985 -2319 14090 10976 -6886 -11590
1909a1590J5405J0228j1019j5484M457J5735K038j5261q730J1168J2742n985j5714
$$ -11590 3815 14043 3024 -12460 -8003 7732 9770 -5491 -14221 -3053 9689 3704 -12010
1922a2010r9J4612O832j2041j1183P512J4338j130j4308l743J2606R589p894j2231
$$ -12010 -12109 2503 9335 -2706 -13889 -6377 7961 6831 -7477 -11220 1386 10975 3081 -9150
1936i150L460J3880K646j1553p130Q853J0683l888j2078r86J1269N509q952r285
$$ -9150 -5690 8190 10836 -717 -7847 1006 11689 7801 -4277 -5263 6006 11515 2563 -6722
1950f722M832J0248q40j0796l909P932O659n999q975J552Q554J542p934n260N699
$$ -6722 -1890 8358 7518 -3278 -7187 745 7404 1405 -7570 -6018 2536 4078 -3856 -9116 -3417
1965c417O523k345p878j11P148L276n244m629L517O054m07n145j216M830L401
$$ -3417 3106 761 -7117 -7228 -80 3196 -2048 -6677 -3160 2894 2487 -2658 -3874 956 4357
1980D357k485l623J424M097P92k876j839K370K455j192k395k13K244J37j610j294
$$ 4357 1872 -1751 -327 3770 4562 1686 -153 2217 4672 3480 1085 872 3116 3253 1643 349
1996C49O89N10q48j009PJ49j041p45P86J27j223j068Q64J412p48j974R3K249J248
$$ 349 1038 1548 700 -309 -302 -153 -1194 -1939 -1153 -1026 -2249 -3317 -2453 -1041 -1789 -3763 -3670 -1421 -173
2015a73k013j688J554L359Q1l312n30L906K874k766l320J749M797R76m806k462
$$ -173 -2186 -3874 -2320 1039 1120 -2192 -2722 1184 4058 1292 -2028 -279 4518 5494 688 -1774
2031a774M457M151k390n950J22N949K137n567m986L172O456j521p597k245O293
$$ -1774 2683 6834 4444 -1506 -1384 4565 6702 1135 -3851 -679 5777 4256 -3341 -5586 707
2046G07M333m950p492K066P804P60p593m692O143O901k889q467l97Q966M341o895
$$ 707 5040 90 -7402 -5336 2468 3228 -4365 -9057 -2914 3987 1098 -7369 -7766 1200 5541 -1354
2062a354o794M436R580j20r444l474Q928P417n217r714K187J0628K821r566o773
$$ -1354 -8148 -3712 5868 5748 -3696 -7170 1758 9175 3958 -5756 -3569 7059 9880 314 -6459
2077f459O947R938l167j1254k176J0277O445q437j0443L867J1526M66j1973o042
$$ -6459 488 10426 7259 -3995 -6171 4106 10551 2114 -8329 -4462 7064 7530 -4443 -10485
2091a0485R467R404n913j2593P78J2732M047j0897q784P195J2092j932j3303k900
$$ -10485 -1018 8386 2473 -10120 -9342 3390 7437 -3460 -12244 -5049 7043 5111 -8192 -11092
2105a1092J2467Q324q615j1288M136J3857J943j2856o752J0523J1533n692j3213
$$ -11092 1375 9699 1084 -10204 -6068 7789 9732 -3124 -9876 647 12180 6488 -6725
2118f725K68J3600N747j1586j0621P306J3123j498j4362m722J2344R234q907j3402
$$ -6725 -6457 7143 12890 1304 -9317 -2011 11112 9614 -4748 -9470 2874 12108 3201 -10201
2132a0201K835J4258K488j3614q453R749J2299n175j4394q88J3713O477j0618
$$ -10201 -7366 6892 9380 -4234 -12687 -2938 9361 4186 -10208 -11096 2617 9094 -1524
2145a524j0988O365J3537l52j3632m777J1659J0425p372j2698K392J4211L270
$$ -1524 -12512 -6147 7390 7038 -6594 -11371 288 10713 3341 -9357 -6965 7246 10516
2158A0516j1965q168Q933J1973l690j3186j823J2454O891r369j1145M816J2232
$$ 10516 -1449 -9617 -684 11289 7599 -5587 -7410 5044 11935 2566 -8579 -3763 8469
2171H469O41j2443o094R629R752o000j2442N36J1955M444j0412r006O481J1080
$$ 8469 9110 -3333 -9427 202 9954 3954 -8488 -7952 4003 8447 -1965 -10971 -4490 6590
2185F590j776j1800k843J0292P275p014j0135L060J1590J816j0259n803Q030R328
$$ 6590 4814 -6986 -9829 463 7738 724 -9411 -6351 5239 7055 -3204 -9007 -977 8351
2199H351l580j0545m76J0500M963q137p787M479J0138o16r608l954P999P249n095
$$ 8351 4771 -5774 -6250 4250 9213 1076 -6711 -2232 7906 7290 -2318 -6272 1727 8976 3881
2214C881r378R05R287K870q510o692N393Q508j923r608j995Q196N037o033p337
$$ 3881 -5497 -4592 4695 7565 -945 -7637 -2244 6264 4341 -5267 -7262 934 5971 -62 -7399
2229g399K451Q745O41p803m159O392O235l012p588J97P840L036o256n065L918
$$ -7399 -4948 3797 4438 -3365 -7524 -1132 5103 2091 -5497 -5300 2540 5576 -680 -5745 -1827
2244a827P035q87o936j795O425L959l930n756J690O099J068n764l186L933M903
$$ -1827 5208 4321 -2615 -4410 2015 5974 2044 -3712 -2022 4077 5145 -619 -3805 128 5031
2259E031k257n542l42N020K116m284l748K362M244p67m199j182L382K456k302
$$ 5031 2774 -2768 -3110 1910 4026 -258 -4006 -1644 2600 1833 -2366 -3548 -166 2290 -12
2274a2l296J000L357M59k983j629K336K451j030k581L50K493P57j886j110J354
$$ -12 -3308 -2308 1049 1508 -1475 -3104 -768 1683 653 -1928 -1578 915 1672 -214 -1324 30
2290C0J541o07j222J99J196K79j241j09O88m5k72m70P11O8n48m17M34N85p39j050
$$ 30 1571 964 -258 -59 1137 1416 175 66 754 709 437 -33 678 746 198 -219 215 800 61 -989
2310i89O09J083p4j812p20J889J222j188k061L48K835K63k521j675K513K708j563
$$ -989 -380 703 629 -1183 -1903 -14 1208 20 -2041 -1693 1142 1405 -1116 -2791 -278 2430 867
2327H67l152K13L406J179l043k190K128L711q37m229o32L982K339l241l844J699
$$ 867 -2285 -2072 1334 2513 -530 -2720 -592 3119 2282 -1947 -2579 1403 3742 501 -3343 -1644
2343a644M849p0m463k648M219L961k518n140K10N390J923m547m128L148N715j222
$$ -1644 3205 3135 -1328 -3976 243 4204 1686 -3454 -3244 2146 4069 -478 -4606 -1458 4257 3035
2359C035o246j472N825L947m388n614K158O491O49o317l241M782N517k775o828
$$ 3035 -3211 -4683 1142 5089 701 -4913 -2755 3736 4385 -1932 -5173 -391 5126 2351 -4477
2374d477K00O828K832n699n231L336O964p30p304k459O546N306m794o719J645
$$ -4477 -4277 2551 5383 -316 -5547 -2211 4753 4023 -3281 -5740 806 6112 1318 -5401 -3756
2389c756P713J478p239m545N248P050k596q005q32P860M455o358o835L536Q135
$$ -3756 3957 5435 -1804 -6349 -1101 5949 3353 -4652 -5484 2376 6831 473 -6362 -2826 5309
2404E309J32q346l430O862O508m500p946P42Q659K640p558n885N147Q046k135
$$ 5309 5441 -2905 -6335 527 7035 2535 -5411 -4669 3990 6630 -928 -6813 -1666 6380 4245
2419D245q828j668Q166N005n994q147L099R095N08q883m106P170P083m148q657
$$ 4245 -4583 -6251 1915 6920 926 -7221 -4122 4973 5481 -3402 -7508 -338 6745 2597 -6060
2434f060M92Q996L150p557o141M842Q541j359q955k338Q115N896n627q224K528
$$ -6060 -5568 3428 6578 -979 -7120 -2278 6263 4904 -4051 -6389 1726 7622 1995 -6229 -3701
2449c701Q911J555q681m698O446P367l321q935J73Q200L576o987o588M010Q299
$$ -3701 5210 6765 -1916 -6614 -168 7199 3878 -5057 -4884 3316 6892 -95 -6683 -2673 5626
2464E626j023q491k683P103N558m978p564K103P682J683p457m322N419O590k571
$$ 5626 4603 -3888 -6571 532 6090 1112 -6452 -4349 3333 5016 -2441 -6763 -1344 5246 2675
2479B675p375o48P255L715n436n702K766P527J14p162k801N698N413l261o838
$$ 2675 -4700 -5348 1907 5622 186 -5516 -2750 4777 4891 -2271 -5072 626 6039 2778 -4060
2494d060P73O918K098n919m396L760N861j490o218j610N646L928m356n466J375
$$ -4060 -3287 3631 5729 -190 -4586 -826 5035 3545 -2673 -4283 1363 5291 935 -4531 -3156
2509c156O099P46n591l067L820M784k227n482nN065K486m202l913K454N270m95
$$ -3156 2943 3689 -1902 -4969 -1149 3635 1408 -4074 -4079 986 3472 -730 -4643 -2189 3081 2586
2525B586m874j732M249L743k531m309O92M852J462m100l221L301L987j165m305
$$ 2586 -2288 -4020 229 3972 1441 -2868 -2176 2676 4138 38 -3183 118 4105 2940 -1365
2540a365q08L764K540k870l691J146L985L1l749j974K614L078j859l436q7L419
$$ -1365 -2173 1591 4131 1261 -2430 -1284 2701 2732 -1017 -2991 -377 2701 842 -2594 -2681 738
2556G38J099l021k274J936K683k63l057o03K494J538j716j819P84K288M98j881
$$ 738 1837 -1184 -3458 -1522 1161 898 -2159 -2762 -268 1270 -446 -2265 -1481 807 1305 -576
2572e76j012J848J654q88j537j17J950P14j337j172J058J100k97j122k26J018
$$ -576 -1588 260 1914 1026 -511 -628 1322 2036 699 -473 585 1685 1388 266 40 1058
2588A058K54p61o51J90M91j17n98j68j31J21k63k78L13j96m61Q2N81p0o44J6M71
$$ 1058 1312 551 -100 90 581 464 -134 -302 -433 -312 -575 -853 -540 -736 -1197 -1115 -534 -604 -1248 -1232 -761
2609g61O95k90j084M20J424Q6j248j68J134J148n21j484M7K375N08j878j196J417
$$ -761 -66 -356 -1440 -1020 404 490 -758 -926 208 1356 835 -649 -602 1773 2281 403 -793 624
2627F24J882l42k542p42K787J098k303k218J308K404l5k974j643K595K219j951
$$ 624 2506 2164 -378 -1120 1667 2765 462 -1756 -448 1956 1921 -1053 -2696 -101 2118 167
2643A67l037L17L199J036k931k628K486L047r03l829l83L857K270k982l307J868
$$ 167 -2870 -2553 646 1682 -1249 -3877 -1391 1656 753 -3076 -3459 398 2668 -314 -3621 -1753
2659a753M438n0l985j518L352L267j688m225K70M755J542m125l019K498M317l79
$$ -1753 2685 2635 -1350 -2868 484 3751 2063 -2162 -1892 2863 4405 280 -2739 -241 4076 3697
2675C697n382j299M783K794l602m475J575M629M57m647l165L795M379k326n233
$$ 3697 -1685 -2984 1799 4593 991 -3484 -1909 2720 3177 -1470 -4635 -840 3539 1213 -4020
2690d020j88N197J958m045m265K783N475o40n336j586M876L771l147m989J294
$$ -4020 -4208 989 2947 -1098 -5363 -2580 2895 2255 -3081 -4667 209 3980 833 -4156 -2862
2705b862O068J217n218l018L423N248j429n960q09O144K818m600m898K349O001
$$ -2862 3206 4423 -795 -3813 -390 4858 3429 -2531 -3340 2804 5622 1022 -3876 -1527 4474
2720D474L2o168k583N218M184l531n758P72N647J884n418m285L771N441j559o016
$$ 4474 4506 -1662 -4245 973 5157 1626 -4132 -3360 2287 4171 -1247 -5532 -1761 3680 2121 -3895
2736c895j260N480L714m141n454K495O208J1n552k471M657M718k288o042N75O194
$$ -3895 -5155 325 4039 -102 -5556 -3061 3147 3158 -2394 -4865 -208 4510 2222 -3820 -3245 2949
2752B949J917n074l802L167N576o21o249j370N508L354l852n074J496N927M18
$$ 2949 4866 -208 -4010 -843 4733 4112 -2137 -3507 2001 5355 1503 -3571 -2075 3852 4270
2767D270n474l289M438M510k627n301k99N132K340m444m068K656N121r86m916
$$ 4270 -1204 -4493 -55 4455 1828 -3473 -3772 1360 3700 -744 -4812 -2156 2965 1979 -2937
2782b937j535M268L721l191m638J290N423O47m287k608L212M321j680m546j55
$$ -2937 -4472 -204 3517 326 -4312 -3022 2401 3048 -1239 -3847 -635 3686 2006 -2540 -2695
2797b695M570K306l531l271J644M246K88m529j868M122K490k270l674L38L676
$$ -2695 1875 4181 650 -2621 -977 3269 3557 -972 -2840 1282 3772 1502 -2172 -1834 1842
2812A842J271l454k969K502L305r57l796p47L108K246k531k921Q97L547R8k770
$$ 1842 3113 -341 -3310 -808 2497 1540 -2256 -3003 105 2351 -180 -3101 -2204 1343 1441 -1329
2828a329j813K279K843j375k756J13K943J166j940k115J067L136j60k677r00K271
$$ -1329 -3142 -863 1980 605 -2151 -2038 905 2071 131 -1984 -917 2219 2059 -618 -1518 753
2844G53J768j327k162n9K693Q81k652j257J513J659o37j889o97K019J040j549
$$ 753 2521 1194 -968 -1027 1666 2547 -105 -1362 151 1810 1173 -716 -1413 606 1646 97
2860I7j668O59J733j26j336j090J284J268q62j623K63J354N51q29j109P86J198
$$ 97 -1571 -912 821 695 -641 -1731 -447 821 -41 -1664 -1401 -47 504 -325 -1434 -648 550
2877E50k23j108Q1R95L29k56o39q4J098K12q38j99N95j2J83k97j07J93K27p24
$$ 550 327 -781 -700 295 624 368 -271 -355 743 955 117 -82 513 501 684 387 280 473 700 -24
2897b4J21J27j69j56M1J16j72j21j89M07J43o37k31N29O2k66k44j21Q26L78r90
$$ -24 97 224 55 -101 -60 56 -116 -237 -426 -19 124 -513 -744 -215 -153 -419 -663 -784 42 420 -570
2918e70l95N91J164m68j058k6J283Q10j501j082J181J457k99j635n20J465J395
$$ -570 -965 -374 790 322 -736 -762 521 1331 -170 -1252 -71 1386 1087 -548 -1068 397 1792
2935A792j163j788N06J945M03j942j341J530J999q99k514MK379Q94k091j885J167
$$ 1792 629 -1159 -653 1292 1695 -247 -1588 -58 1941 1042 -1472 -1468 911 1805 -286 -2171 -1004
2952a004K416l2k772r01K700J578j718k286J17L217N37k618j523K009K371q42
$$ -1004 1412 1380 -1392 -2293 407 1985 267 -2019 -1902 1315 1852 -766 -2289 -280 2091 1249
2968A249k986m45L199J489k288k676J511L083j50l035j338K827K413k004l128
$$ 1249 -1737 -2182 1017 2506 218 -2458 -947 2136 1986 -1049 -2387 440 2853 849 -2279
2983b279N55L613O46k961k209J940L280q59l974k29L555J616k679k826J252L680
$$ -2279 -1724 1889 2535 -426 -2635 -695 2585 1726 -2248 -2477 1078 2694 15 -2811 -1559 2121
2999B121K58l689j855L249K776j769l448j9L854J569l483k703K133L576m64l979
$$ 2121 2379 -1310 -3165 84 2860 1091 -2357 -2376 1478 3047 -436 -3139 -1006 2570 2106 -1873
3015a873r67L305K724k471l608J320L687N07l475k114K506L443j501l850k50M041
$$ -1873 -2840 465 3189 718 -2890 -1570 2117 2624 -851 -2965 -459 2984 1483 -2367 -2617 1424
3031A424J701l123l112J733M181l87m103j431L680K626k232l526M08M187J259
$$ 1424 3125 2 -3110 -1377 2804 2417 -1686 -3117 563 3189 957 -2569 -2161 2026 3285
3046C285l693k778K778L494j212l966o46L783K127l004l228J667L689r2l535j560
$$ 3285 -408 -3186 -408 3086 1874 -2092 -2738 1045 3172 168 -3060 -1393 2296 2204 -1331 -2891
3062b891K949K830j872l758O33L678Q94k882k722K185L422p31l582p77L466J892
$$ -2891 58 2888 1016 -2742 -2109 1569 2463 -419 -3141 -956 2466 1735 -1847 -2624 842 2734
3078B734k323l174J258L704K78l429j504K613K737j513l324R5L412J185k848k441
$$ 2734 411 -2763 -1505 2199 2477 -952 -2456 157 2894 1381 -1943 -1848 1564 2749 -99 -2540
3094b540J899K893m18l226q04K536K278k243k651P79K745O96k689j719K052K410
$$ -2540 -641 2252 1834 -1392 -2196 340 2618 375 -2276 -1497 1248 1944 -745 -2464 -412 1998
3110A998j021k811lK531J176k125k075J332K325jk204j058K185J687j569j909
$$ 1998 977 -1834 -1837 694 1870 -255 -2330 -998 1327 1326 -878 -1936 249 1936 367 -1542
3126a542M61K255L31j611j313J392J591k23k062l68J837Q96j345j264M05J704
$$ -1542 -1081 1174 1505 -106 -1419 -27 1564 1341 -721 -1089 748 1644 299 -965 -560 1144
3142A144M7j664q66J147J512j000j500J92J219M69j104q25M21J560k73j389k18
$$ 1144 1191 -473 -1339 -192 1320 320 -1180 -988 231 700 -404 -1229 -808 752 479 -910 -1128
3159a128R96P61n60r27K33J075K75p20o16L03J083j23j018q6P68O80o17m36o9
$$ -1128 -132 629 69 -858 -625 450 725 5 -611 -308 775 652 -366 -452 316 996 379 -57 -126
3178a26Q12p4l10m10K91N25k27m92j75K76L8k22j68L1J52p4k29J34k46K19N5j85
$$ -126 686 612 302 -108 183 708 481 -11 -186 90 128 -94 -262 -231 -79 -153 -382 -248 -494 -275 -220 -405
3200d05J8K9j09M67j60j78NnO21j19k40j75L30O40k03q72L47N91L23n83p33Q26
$$ -405 -387 -358 -467 0 -160 -338 -333 -338 283 164 -76 -251 79 719 516 -356 -9 582 905 322 -411 415
3222D15O45k27j042j21Q18P17o89j173L20J163J12j463o93J211R60o56j657n5
$$ 415 1060 833 -209 -330 488 1205 516 -657 -337 826 938 -525 -1218 -7 953 297 -1360 -1415
3240a415J662O64j559j262J182J475l21j668m40J935J168j164j740M63K158L71
$$ -1415 247 911 -648 -1910 -728 747 426 -1242 -1682 253 1421 257 -1483 -1020 1138 1509
3256A509k099j158J948J913j071k273J97K333Q91j952j560J156K416m74k589q97
$$ 1509 -590 -1748 200 2113 1042 -1231 -1034 1299 2190 238 -1322 -166 2250 1776 -813 -1710
3272a710K389J464j691k367O44K526M48k689j244J722K078r00k894k1K757J118
$$ -1710 679 2143 452 -1915 -1271 1255 1703 -986 -2230 -508 1570 670 -2224 -2245 512 1630
3288A630k102k098J463K493k61k445q05K205K263j752k631O53L107N79k627j549
$$ 1630 -472 -2570 -1107 1386 1125 -1320 -2125 80 2343 591 -2040 -1387 1720 2299 -328 -1877
3304a877J929K496q20l305j23L137J365k263k544J571K626m4k993j417K466K191
$$ -1877 52 2548 1728 -1577 -1700 1437 2802 539 -2005 -434 2192 2148 -845 -2262 204 2395
3320B395j502l102M64K976R43k967k058J750K767l64l284p52K847K031k278k355
$$ 2395 893 -2209 -1745 1231 2174 -793 -2851 -1101 1666 1302 -1982 -2734 113 2144 -134 -2489
3336b489Q35L010M48k956j540K521K607j303l068L51K967J247k558k279J937K934
$$ -2489 -1654 1356 1804 -1152 -2692 -171 2436 1133 -1935 -1584 1383 2630 72 -2207 -270 2664
3352B664n81l202p83L019J733k016k692N60L328K47k895j956K537K360j194l110
$$ 2664 2083 -1119 -1902 1117 2850 834 -1858 -1298 2030 2277 -618 -2574 -37 2323 1129 -1981
3368a981j39K761J286k473k136J558K544l58k696j007K624K043j809k468O57K677
$$ -1981 -2120 641 1927 -546 -2682 -1124 1420 1062 -1634 -2641 -17 2026 217 -2251 -1594 1083
3384A083Q11k452j712K192K139o40k872j84K884J109j904k064J233K310Jk455
$$ 1083 1894 -558 -2270 -78 2061 1421 -1451 -1635 1249 2358 454 -1610 -377 1933 1934 -521
3400e21r03J979J721j672k137M73K192M60k028j395J254K001p21k192n6J715R33
$$ -521 -1424 555 2276 604 -1533 -1060 1132 1592 -436 -1831 -577 1424 703 -1489 -1545 170 1103
3417A103j569j439Q89J751kj636q37J424J474p40j540O4J617O80j183j036Q10
$$ 1103 -466 -1905 -1016 735 733 -903 -1740 -316 1158 418 -1122 -1058 559 1239 56 -980 -170
3434a70J412j32j464l18J371P54r82j043K60J289R1j115m89O58R85n65j010q8
$$ -170 1242 1110 -354 -672 699 1453 471 -572 -312 977 1068 -47 -536 122 1107 542 -468 -556
3452e56Q16J64o95o93L50Q52p2o81m51O17N23l59o58J26M84M26m21n31K93N25
$$ -556 260 424 -271 -964 -614 238 166 -515 -966 -349 174 -185 -843 -717 -233 193 -228 -759 -466 59
3472E9J18k42k79N43Rj08j31K0L14K94l31j04N4K87Kk05k7J3j62j3J47k42LJ62
$$ 59 177 -65 -344 199 208 100 -31 -11 303 597 266 162 216 503 505 300 273 286 124 111 258 16 19 181
3496A81k52J39m33R9J01L07r6k96o8J01J92l59l29J98O32o4n64%L98M00j95l65
$$ 181 -71 68 -365 -266 -165 142 46 -250 -318 -217 -25 -384 -713 -515 117 53 -511 -511 -113 287 92 -273
3518b73m7P91J73o94l76M93O57J3r20k06P76N23m07j077K57J165J46j148p24Q48
$$ -273 -320 471 644 -50 -426 67 724 737 -183 -389 387 910 503 -574 -317 848 994 -154 -878 -30
3538c0R30l73j478O5J246N23j099j216P67J356n6j344m89J131J029q41j410L69
$$ -30 900 527 -951 -886 360 883 -216 -1432 -665 691 635 -709 -1198 -67 962 121 -1289 -920
3556i20J432K76j340r40J063J642m45j753j41J790Q58j422j240P07J687Oj572
$$ -920 512 788 -552 -1492 -429 1213 768 -985 -1126 664 1522 100 -1140 -433 1254 1260 -312
3573c12p98J428J241r14j708J12J893N58j706j334J371J701m76k143l54J774J200
$$ -312 -1110 318 1559 645 -1063 -951 942 1500 -206 -1540 -169 1532 1056 -1087 -1441 333 1533
3590A533j526j814P48K244k0k080r19J777J566j058j873P1K116O16j532j543J067
$$ 1533 7 -1807 -1059 1185 1165 -915 -1834 -57 1509 451 -1422 -1351 765 1381 -151 -1694 -627
3607f27J954J49k445n27J901J725j706k039P86K084M05k134j000J423J993p49
$$ -627 1327 1476 -969 -1496 405 2130 424 -1615 -829 1255 1660 -474 -1474 -51 1942 1193
3623A193k387k84K280J022j893j611Q70K241n8k623o86K104J575j276k059K79
$$ 1193 -1194 -1478 802 1824 -69 -1680 -810 1431 1373 -1250 -1936 168 1743 467 -1592 -1313
3639a313K369L67k354q57J266J735K9k331l62J806J376j517j769O02K596l82j922
$$ -1313 1056 1423 -931 -1788 -522 1213 1242 -1089 -1451 355 1731 214 -1555 -953 1643 1261 -661
3656f61p95J426J286q11j937K38K517j0j385j490J182J838j24j953j016K013R45
$$ -661 -1456 -30 1256 445 -1492 -1254 1263 1253 -132 -1622 -440 1398 1274 -679 -1695 318 1263
3673A263r34j536j27K741q3j731r15J867R43j004j998M17J628J187j046k424J825
$$ 1263 329 -1207 -1334 1407 1324 -407 -1322 545 1488 484 -1514 -1097 531 1718 672 -1752 73
3690G3J648n07k122k79J698Q98j319j097P96J203J00j359q35Q69R63J0j453l74
$$ 73 1721 1214 -908 -1187 511 1409 90 -1007 -211 992 1092 -267 -1102 -233 730 740 -713 -1087
3708a087J979j98l63j213N01J495l73j233m79J183Q16n99j508P18J164P3p80j440
$$ -1087 892 694 331 -882 -381 1114 741 -492 -971 212 1028 429 -1079 -361 803 876 96 -1344
3726a344J341R22o29n60o51J514J96m39j144M82J120k07j060j32Q19N10o01n13
$$ -1344 -3 919 290 -270 -921 593 789 350 -794 -312 808 601 -459 -591 228 738 137 -376
3744c76m59J192R0p01n95M68O38K2p67L0N30K13j95n21J63L92L47o13l49L30Q49
$$ -376 -835 357 447 -254 -849 -381 257 279 -488 -458 72 285 90 -431 -268 124 471 -142 -491 -161 688
3765F88m39l56j12L56O6j42l32K15K33J39k01j33l9Q3K50l92OQ9l2P7j2j86N8
$$ 688 249 -107 -219 137 203 61 -271 -56 177 316 115 -18 -57 26 276 -116 -110 -21 -53 24 12 -174 -116
3788a16Q1J7N6n1j6k0k53K23j16L14j51p3l31L57qL63p9j86m04N13L37k43l45
$$ -116 -35 -18 38 -13 -29 -49 -302 -79 -195 119 -32 -105 -436 -79 -87 276 197 11 -393 120 457 214 -131
3811a31K02R5M60n11l32O19L49m57n92J2O36R9l41n94M42L30J34n02m54N89L82
$$ -131 71 166 626 115 -217 402 751 294 -298 -286 350 449 108 -486 -44 286 420 -82 -536 53 435
3832D35l49p86K22N43O02o03j031O28Q99n64m29m19P38Q83o96r75Q59L96N37r62
$$ 435 86 -700 -478 65 667 64 -967 -339 560 -4 -433 -852 -114 769 73 -902 -43 353 890 -72
3852g2j072J296R29o37j106M5J078L10n17r71M39P27M47j023k07M81J004j113
$$ -72 -1144 152 1081 444 -662 -617 461 771 254 -717 -278 449 896 -127 -334 147 1151 38
3870C8n26N08L00O72j772o5N26J157l80j386k20J426M78q21j232N63J479n4j382
$$ 38 -488 20 320 992 -780 -845 -319 838 458 -928 -1148 278 756 -65 -1297 -734 745 691 -691
3889f91n10J368Q55p59j247N38J409J42j394o87R92J190l42j671M3J417P39j240
$$ -691 -1201 167 1022 263 -984 -446 963 1105 -289 -976 16 1206 864 -807 -764 653 1392 152
3907A52j159O11J623k00j334p11J320O88o31j527J05J567M06j420p41Q02J317
$$ 152 -1007 -396 1227 1027 -307 -1018 302 990 359 -1168 -1063 504 910 -510 -1251 -449 868
3924H68l59j667j60J561Q92j094j376M36J827J02j549p42J258J070m20j763M97
$$ 868 509 -1158 -1318 243 1135 41 -1335 -899 928 1030 -519 -1261 -3 1067 647 -1116 -619
3941f19J269M92j210q73P44J438l55j540k23J271Q53j021j133N50J198J44j163
$$ -619 650 1142 -68 -941 -197 1241 886 -654 -877 394 1247 226 -907 -357 841 985 -178
3958a78r04J058Q49m34j244p5J265N26j154j038Q30J304m79j095l74J355N71l57
$$ -178 -1082 -24 825 391 -853 -928 337 863 -291 -1329 -499 805 326 -769 -1143 212 783 426
3976D26j199K61J794n84j098k82P70J021r4j746j9J502r6q07o22N09J313n32j031
$$ 426 -773 -512 1282 698 -400 -682 88 1109 1015 -731 -750 752 656 -151 -773 -264 1049 517 -514
3995e14l82J272J40L43j227n9R43J52j065l01O70O41n02q34qP50M65o81p94L55
$$ -514 -896 376 516 859 -368 -427 516 668 -397 -698 -28 613 111 -723 -731 19 484 -197 -991 -636
4015f36J047r7r21k96P48P05l05q10J86Q07Q6o03l54O87O47m65n94j04N85N31
$$ -636 411 314 -607 -903 -155 550 245 -565 -379 428 514 -89 -443 244 891 426 -168 -272 313 844
4035H44m88p11M05L79o0m42k50N44r1k16l09K6M76J73m72j59Q8M23k66l77q2L07
$$ 844 356 -355 50 429 369 -73 -323 221 130 -86 -395 -369 107 280 -192 -351 -263 160 -106 -483 -565 -258
4057b58K34j89k36R6L66N3n9k61J77J45n7j53K13J09lj5r4J04J1K8J4k16J9J66
$$ -258 -24 -213 -449 -353 13 66 7 -254 -77 68 11 -142 71 180 177 162 68 172 183 211 225 9 28 194
4081A94n1K13k64p6J23j5M5m4k14l2J39J5j48k37L02J36p4k17q9K63J03j96j28
$$ 194 143 356 92 16 139 124 169 125 -89 -121 18 33 -115 -352 -50 86 12 -205 -294 -31 72 -124 -252
4104b52L61k8j07r1l28L25L69l39j99K70K31Q2k85o8K44M05l65m87J93N40R4l54
$$ -252 109 81 -26 -117 -445 -120 249 -90 -289 -19 212 294 9 -59 185 590 225 -262 -69 471 565 211
4126B11m07J91N98k21p48p2L92L96k45n03QN61J86n91k90K94L79r6n32j25N21
$$ 211 -196 -5 593 372 -376 -448 -56 340 95 -408 -400 161 347 -244 -534 -240 139 43 -489 -614 -93
4147i3L96l59m82J58N94R4m55n16Q32L20j40o30k1M51M46n14o44N40P36j06r08
$$ -93 303 -56 -538 -380 214 308 -147 -663 169 489 349 -281 -302 149 595 81 -563 -23 713 607 -301
4168c01q6O96K70m25p67K89P48K47r66l13M52P78l42p40k52Q49N82q95p91O32
$$ -301 -387 309 579 154 -613 -324 424 671 -295 -608 -156 622 280 -460 -712 137 719 -176 -967 -335
4188c35Q58o7r83n19J096O75o54p82L97Q05K76r48o21P75R05n34o91k02J001N76
$$ -335 523 456 -527 -1046 50 725 71 -711 -314 491 767 -181 -802 -27 878 344 -347 -549 452 1028
4208A028j111o10N60R41j12j159k18Q25O30k26j138j07J381L6r56l94M55Q21l10
$$ 1028 -83 -693 -133 808 696 -463 -681 144 774 548 -590 -697 684 720 -236 -630 -175 646 336
4227C36j029n4J193L40q12p62L21J102j18j133k03R28P16o58p24l0J186R0p93
$$ 336 -693 -747 446 786 -26 -788 -467 635 517 -616 -819 109 825 167 -557 -587 599 689 -104
4246a04n06N23J024k85j258o1R95L45m24j102N21P98J39j016l53O80Q61l12j070
$$ -104 -610 -87 937 652 -606 -667 328 673 249 -853 -332 466 605 -411 -764 -84 777 465 -605
$$ [...]
8191B9
##END NTUPLES=NMR FID
##END=
