##TITLE=1H_LY-17.Dix.1B
 CD3CN, 8 sc, 
 1.06.2021
##JCAMPDX= 6.0         $$ Bruker NMR JCAMP-DX V2.0
##DATA TYPE= NMR FID
##DATA CLASS= NTUPLES
##ORIGIN= UXNMR, Bruker Analytische Messtechnik GmbH
##OWNER= root
$$ XWIN-NMR		Version 3.5
$$ Tue Jun  1 10:55:30 2021 Russian Standard Time (UT+4h)  she@DPX200
##.OBSERVE FREQUENCY= 200.131506
##.OBSERVE NUCLEUS= ^1H
##.DELAY= (6, 6)
##.ACQUISITION MODE= SIMULTANEOUS
##.ACQUISITION SCHEME= undefined
##.AVERAGES= 8
##.DIGITISER RES= 18
##SPECTROMETER/DATA SYSTEM= spect
##.PULSE SEQUENCE= zg30
##.SOLVENT NAME= CDCl3
##.SHIFT REFERENCE= (INTERNAL, CDCl3, 0, 15.7039)
##AUDIT TRAIL= $$ (NUMBER, WHEN, WHO, WHERE, WHAT)
$$ ##TITLE= Audit trail, XWIN-NMR		Version 3.5
$$ ##JCAMPDX= 5.01
$$ ##ORIGIN= Bruker BioSpin GmbH
$$ ##OWNER= she
$$ F:/spectra/data/she/nmr/H-F/1/audita.txt
$$ ##AUDIT TRAIL=  $$ (NUMBER, WHEN, WHO, WHERE, WHAT)
(   1,<2021-06-01 10:54:27.93 +0400>,<she>,<DPX200>,
      <created by zg, POWCHK disabled, PULCHK disabled
       configuration hash MD5:
       00 E9 B6 7A A2 85 ED C7 34 08 36 98 17 FE 4E 26
       data hash MD5: 16K
       F2 FB 26 D6 C4 3E 0A B2 FD 6E A2 8F 44 41 10 EF>)
$$ ##END=
$$ 
$$ hash MD5
$$ 07 6A EE 38 B7 87 58 9B 3F 14 5C 5D 24 52 D3 68
##$RELAX= 
##$RELAX= 
##$RELAX= 
##$RELAX= 
##$RELAX= 
##$RELAX= 
$$ Bruker specific parameters
$$ --------------------------
##$DU= <F:/spectra>
##$EXPNO= 1
##$NAME= <H-F>
##$PROCNO= 1
##$TYPE= <nmr>
##$USER= <she>
##$AMP= (0..31)
100 100 100 100 100 100 100 100 100 100 100 100 100 100 100 100 100 100 
100 100 100 100 100 100 100 100 100 100 100 100 100 100 
##$AQSEQ= 0
##$AQ_mod= 1
##$AUNM= <au_zg>
##$AUTOPOS= <>
##$BF1= 200.13
##$BF2= 200.13
##$BF3= 200.13
##$BF4= 200.13
##$BF5= 200.13
##$BF6= 200.13
##$BF7= 200.13
##$BF8= 200.13
##$BYTORDA= 1
##$CFDGTYP= 0
##$CFRGTYP= 5
##$CHEMSTR= <none>
##$CNST= (0..31)
1 1 145 1 1 1 1 1 1 1 1 1 1 1 1 1 1 1 1 1 1 1 1 1 1 1 1 1 1 1 1 1 
##$CPDPRG= <>
##$CPDPRG1= <>
##$CPDPRG2= <>
##$CPDPRG3= <>
##$CPDPRG4= <mlev>
##$CPDPRG5= <mlev>
##$CPDPRG6= <mlev>
##$CPDPRG7= <mlev>
##$CPDPRG8= <mlev>
##$CPDPRGB= <>
##$CPDPRGT= <>
##$D= (0..31)
0 1.2 0 0 0 0 0 0 0 0.06 0 0.03 0 0 0 0 0.0002 0 0 0 0 0 0 0 0 0 0 0 0 
0 0 0 
##$DATE= 1622530467
##$DBL= (0..7)
120 120 120 120 120 120 120 120 
##$DBP= (0..7)
150 150 150 150 150 150 150 150 
##$DBP07= 0
##$DBPNAM0= <>
##$DBPNAM1= <>
##$DBPNAM2= <>
##$DBPNAM3= <>
##$DBPNAM4= <>
##$DBPNAM5= <>
##$DBPNAM6= <>
##$DBPNAM7= <>
##$DBPOAL= (0..7)
0.5 0.5 0.5 0.5 0.5 0.5 0.5 0.5 
##$DBPOFFS= (0..7)
0 0 0 0 0 0 0 0 
##$DE= 6
##$DECBNUC= <off>
##$DECIM= 32
##$DECNUC= <off>
##$DECSTAT= 4
##$DIGMOD= 1
##$DIGTYP= 9
##$DL= (0..7)
0 120 120 120 120 120 120 120 
##$DP= (0..7)
150 150 150 150 150 150 150 150 
##$DP07= 0
##$DPNAME0= <>
##$DPNAME1= <>
##$DPNAME2= <>
##$DPNAME3= <>
##$DPNAME4= <>
##$DPNAME5= <>
##$DPNAME6= <>
##$DPNAME7= <>
##$DPOAL= (0..7)
0.5 0.5 0.5 0.5 0.5 0.5 0.5 0.5 
##$DPOFFS= (0..7)
0 0 0 0 0 0 0 0 
##$DQDMODE= 0
##$DR= 18
##$DS= 0
##$DSLIST= <SSSSSSSSSSSSSSS>
$$ [...]
##$SUBNAM2= <"">
##$SUBNAM3= <"">
##$SUBNAM4= <"">
##$SUBNAM5= <"">
##$SUBNAM6= <"">
##$SUBNAM7= <"">
##$SUBNAM8= <"">
##$SUBNAM9= <"">
##$SW= 16.9725357007746
##$SWIBOX= (0..15)
0 0 2 0 0 0 0 0 0 0 0 0 0 0 0 0 
##$SW_h= 3396.73913043478
##$TD= 16384
##$TD0= 1
##$TE= 0
##$TE2= 300
##$TE3= 300
##$TEG= 300
##$TL= (0..7)
0 120 120 120 120 120 120 120 
##$TP= (0..7)
150 150 150 150 150 150 150 150 
##$TP07= 0
##$TPNAME0= <>
##$TPNAME1= <>
##$TPNAME2= <>
##$TPNAME3= <>
##$TPNAME4= <>
##$TPNAME5= <>
##$TPNAME6= <>
##$TPNAME7= <>
##$TPOAL= (0..7)
0.5 0.5 0.5 0.5 0.5 0.5 0.5 0.5 
##$TPOFFS= (0..7)
0 0 0 0 0 0 0 0 
##$TUNHIN= 0
##$TUNHOUT= 0
##$TUNXOUT= 0
##$USERA1= <user>
##$USERA2= <user>
##$USERA3= <user>
##$USERA4= <user>
##$USERA5= <user>
##$V9= 5
##$VALIST= <valist>
##$VCLIST= <CCCCCCCCCCCCCCC>
##$VD= 0
##$VDLIST= <DDDDDDDDDDDDDDD>
##$VPLIST= <PPPPPPPPPPPPPPP>
##$VTLIST= <TTTTTTTTTTTTTTT>
##$WBST= 1024
##$WBSW= 4
##$XGAIN= (0..3)
0 0 0 0 
##$XL= 0
##$YL= 0
##$YMAX_a= 85501
##$YMIN_a= -81853
##$ZGOPTNS= <>
##$ZL1= 120
##$ZL2= 120
##$ZL3= 120
##$ZL4= 120
##$ABSF1= 10
##$ABSF2= 0
##$ABSG= 5
##$ABSL= 3
##$ALPHA= 0
##$AQORDER= 0
##$ASSFAC= 0
##$ASSFACI= 0
##$ASSFACX= 0
##$ASSWID= 0
##$AUNMP= <proc_1d>
##$AZFE= 0.1
##$AZFW= 0.1
##$BCFW= 1
##$BC_mod= 2
##$BYTORDP= 1
##$COROFFS= 0
##$CY= 11.3945322036743
##$DATMOD= 1
##$DC= 2
##$DFILT= <>
##$DTYPP= 0
##$F1P= 15.9154993809931
##$F2P= -4.1035820241983
##$FCOR= 0.5
##$FTSIZE= 0
##$FT_mod= 4
##$GAMMA= 1
##$GB= 0.15
##$INTBC= 1
##$INTSCL= 1
##$ISEN= 128
##$LB= 0.24
##$LEV0= 0
##$LPBIN= 0
##$MAXI= 10000
##$MC2= 0
##$MEAN= 0
##$ME_mod= 0
##$MI= 1.114404
##$NCOEF= 0
##$NC_proc= 0
##$NLEV= 6
##$NOISF1= 3.799351
##$NOISF2= 2.8
##$NSP= 1
##$NTH_PI= 0
##$NZP= 0
##$OFFSET= 15.70392
##$PC= 1
##$PHC0= -11202.61
##$PHC1= 12.20099
##$PH_mod= 1
##$PKNL= yes
##$PPARMOD= 0
##$PSCAL= 0
##$PSIGN= 0
##$REVERSE= no
##$SF= 200.130013532006
##$SI= 16384
##$SIGF1= 3
##$SIGF2= 2
##$SINO= 400
##$SIOLD= 16384
##$SREGLST= <1H.CDCl3>
##$SSB= 0
##$STSI= 0
##$STSR= 0
##$SW_p= 3612.71676300578
##$SYMM= 0
##$S_DEV= 0
##$TDeff= 0
##$TDoff= 0
##$TI= <>
##$TILT= no
##$TM1= 0
##$TM2= 0
##$TOPLEV= 0
##$USERP1= <user>
##$USERP2= <user>
##$USERP3= <user>
##$USERP4= <user>
##$USERP5= <user>
##$WDW= 1
##$XDIM= 8192
##$YMAX_p= 0
##$YMIN_p= 0
$$ End of Bruker specific parameters
$$ ---------------------------------
##NTUPLES= NMR FID
##VAR_NAME=  TIME,          FID/REAL,        FID/IMAG
##SYMBOL=    X,             R,               I
##VAR_TYPE=  INDEPENDENT,   DEPENDENT,       DEPENDENT
##VAR_FORM=  AFFN,          ASDF,            ASDF
##VAR_DIM=   8192,          8192,            8192
##UNITS=     SECONDS,       ARBITRARY UNITS, ARBITRARY UNITS
##FACTOR=    0.0002944,     1,               1
##FIRST=     0,             0,               0
##LAST=      2.4114304,     0,               0
##MIN=       0,             -81853,          0
##MAX=       2.4114304,     85501,           0
$$ Real data points
##PAGE= N=1
##DATA TABLE= (X++(R..R)), XYDATA
$$ [...]
1781A835k785J72K284k347R7K479k496n29L012j819j264K694j419j148K760j441
$$ 1835 -950 -778 1506 -841 -744 1735 -761 -1290 1722 -97 -1361 1333 -86 -1234 1526 85
1797H5j801L043o47k213K401l30k034K561k51k674K473P17k779J614R21k478J815
$$ 85 -1716 1327 680 -1533 868 538 -1496 1065 814 -1860 613 1330 -1449 165 1086 -1392 423
1814D23R67l023J418J925k778N70J868k399O29K072k707l0K747k046p60K349j611
$$ 423 1390 -1633 -215 1710 -1068 -498 1370 -1029 -400 1672 -1035 -1065 1682 -364 -1124 1225 -386
1831c86o31K605j850j323K975r33j894K357o01j661K509o03k339K538L76k545
$$ -386 -1017 1588 -262 -1585 1390 457 -1437 920 319 -1342 1167 564 -1775 763 1139 -1406
1847a406J778N03k229J944O35k885J673J571k705Q51J495k352J002J700k781M50
$$ -1406 372 875 -1354 590 1225 -1660 13 1584 -1121 -270 1225 -1127 -125 1575 -1206 -756
1863g56K414k253k87K168j917j95K422k093r13K840j298j441K335r93j291K539
$$ -756 1658 -595 -882 1286 -631 -826 1596 -497 -1410 1430 132 -1309 1026 33 -1258 1281
1879A281r61k008K586n5k230J920J71k048K044L61k623J737J182k481J076J165
$$ 1281 320 -1688 898 843 -1387 533 704 -1344 700 1061 -1562 175 1357 -1124 -48 1117
1895A117k268J181J462k680O45K101k233L4J910k017J00K216k165n60K571j535
$$ 1117 -1151 30 1492 -1188 -543 1558 -675 -641 1269 -748 -648 1568 -597 -1157 1414 -121
1911a21r95K198j307r33K462j206j646K537m47j848K065l01j856K247%k392J945
$$ -121 -1116 1082 -225 -1158 1304 98 -1548 989 542 -1306 759 458 -1398 849 849 -1543 402
1928D02P00k303J351Q35k248J419J195k552R02J712k206L78J662k048L21J994
$$ 402 1102 -1201 150 985 -1263 156 1351 -1201 -299 1413 -793 -415 1247 -801 -480 1514
1944A514k170k48K294j672o46K133j499p44K357j367j284K404p94j525K132o22
$$ 1514 -656 -904 1390 -282 -928 1205 -294 -1038 1319 -48 -1332 1072 278 -1247 885 263
1960B63j605K234l16k054K040K67k122J655M68k112J575Q17k346J190J267k200
$$ 263 -1342 892 576 -1478 562 829 -1293 362 830 -1282 293 1110 -1236 -46 1221 -979
1976i79P83J407k114N49J722k106J04J993j815k94K002j595n39K134j400r18K210
$$ -979 -196 1211 -903 -354 1368 -738 -634 1359 -456 -750 1252 -343 -882 1252 -148 -1066 1144
1993A144j068j225K139p65j443K098m70j696J981j19j861J804K10k007J630M91
$$ 1144 76 -1149 990 225 -1218 880 410 -1286 695 576 -1285 519 729 -1278 352 843
2009H43k067J429P93k159J151J137k141P87J394k023N21J575j987J94J854j780
$$ 843 -1224 205 998 -1161 -10 1127 -1014 -227 1167 -856 -335 1240 -747 -553 1301 -479
2025d79k54J927j499m86J988j358q51K133r82j224J974o37j313J928m95j616J938
$$ -479 -733 1194 -305 -791 1197 -161 -1012 1121 139 -1085 889 252 -1061 867 372 -1244 694
2042F94m3j870J598L01j787J473M22k015J361R04k067Q90J098j865P87J211k045
$$ 694 651 -1219 379 680 -1107 366 788 -1227 134 1038 -1029 -139 959 -906 -119 1092 -953
2059i53N51J668j885oJ695j541r1J742j598m41K055j217r38J875q67r37J888q28
$$ -953 -402 1266 -619 -625 1070 -471 -562 1180 -418 -859 1196 -21 -959 916 49 -888 1000 172
2077A72j355K013k55j670J571M6j506J529Q7j847J500O79j953R33Q51j685R24
$$ 172 -1183 830 575 -1095 476 522 -984 545 632 -1215 285 964 -989 -56 795 -890 34
2094C4R37j993P14J482j816J21J435j490J88J484j704j59J943j317o96J696r87
$$ 34 971 -1022 -308 1174 -642 -521 914 -576 -388 1096 -608 -767 1176 -141 -837 859 -128
2111a28o00J764j090j028K025n24j413J570k46j209J624k65j676J639M21j797
$$ -128 -728 1036 -54 -1082 943 419 -994 576 330 -879 745 480 -1196 443 864 -933
2127i33J033N76j532J095O24j927R09J263j785K85J205j454L85J281j729L9J778
$$ -933 100 676 -856 239 863 -1064 -155 1108 -677 -392 813 -641 -256 1025 -704 -665 1113
2144A113j335n36J526j012l62J601j222p81J950p05j150J519m42r69J618n28j416
$$ 1113 -222 -758 768 -244 -606 995 -227 -1008 942 237 -913 606 164 -805 813 285 -1131
2161a131J699J23j591J170K66j358J237K97j775J142R25j722N48R28j437N93J029
$$ -1131 568 691 -900 270 536 -822 415 712 -1063 79 1004 -718 -170 758 -679 -86 943
2178I43j696K84J500j377k39J351j108j59J453j267n59J773p93r17J434n75q01
$$ 943 -753 -469 1031 -346 -585 766 -342 -501 952 -315 -874 899 106 -811 623 48 -753
2195g53J507n95j179J615r5j344J205N0j224J291J25j587J163O40j547P42O70
$$ -753 754 159 -1020 595 500 -844 361 411 -813 478 603 -984 179 819 -728 14 684
2212F84j390P73P88j616N00J205j408J03J141j246P7J312j306l06J555r32o04
$$ 684 -706 67 855 -761 -261 944 -464 -361 780 -466 -389 923 -383 -689 866 -66 -670
2229f70J345p55o12J470o97r96J520k80j132J251j29j104J253K2j391J148M11
$$ -670 675 -80 -692 778 81 -915 605 325 -807 444 315 -789 464 486 -905 243 654
2246F54j381Q39M95j346Q52O56j513O11R84j374K70J001j240K44J106j269q0J360
$$ 654 -727 112 607 -739 113 769 -744 -133 851 -523 -253 748 -492 -248 858 -411 -491 869
2264H69j114k91J215q60m04J381q67p44J453n32q56J288l44r56J292j45j203J178
$$ 869 -245 -536 679 -181 -585 796 -71 -815 638 106 -750 538 194 -762 530 385 -818 360
2282C60J34j247R37L98j299Q38N46j356O33P74j312M52Q76j250K86R95j191P7
$$ 360 494 -753 184 582 -717 121 667 -689 -56 718 -594 -142 734 -516 -230 765 -426 -349
2300c49J127j101j29J207r57l42J263q17m90J267o91o63J289m93q36J230k84r45
$$ -349 778 -323 -452 755 -202 -544 719 -98 -588 679 -12 -675 614 121 -715 515 231 -714
2318g14J144j14j079J087J56j197Q81L61j183P65M72j250O35P46j263L54Q72j095
$$ -714 430 316 -763 324 480 -717 164 525 -658 107 579 -671 -36 710 -553 -199 673 -422
2336d22K01R22j116L6J138r88k67J140p75l23J126q04m78J287n79p47J130l26
$$ -422 -221 701 -415 -379 759 -229 -496 644 -131 -454 672 -132 -610 677 98 -649 481 155
2354A55p42J067k94r08J136j8j082Q93J92r87Q25K24j175Q07N58j221M56O75j009
$$ 155 -587 480 186 -722 414 396 -686 207 399 -588 237 461 -714 93 651 -570 -114 561 -448
2373d48L87O70j128K71R95j040j18J002p95j39R83q67l35J244o33o52J049l72
$$ -448 -61 609 -519 -248 747 -293 -411 591 -204 -343 640 -227 -562 682 49 -603 446 74
2391G4n57R99m40p70J163j15j008Q68J00q33Q26M3j067Q92M14j145N22M90r24
$$ 74 -483 516 76 -694 469 354 -654 214 314 -519 307 350 -717 175 589 -556 -34 456 -468
2410d68N33M69j120M45Q47j044L5Q19p82O0Q27r54j17J119p10m78R64m67l86R62
$$ -468 65 534 -586 -141 706 -338 -303 516 -266 -206 621 -333 -450 669 -41 -519 445 -22 -408 554
2430E54n74o33J148k04q93Q30j1p00Q27p8r56R07L13j074N38M10q47N57L67j067
$$ 554 -20 -653 495 291 -602 228 217 -483 344 266 -690 217 530 -544 -6 404 -443 114 481 -586
2450e86M90P54j007J09P15p80J93O99r65K5J022p56l59Q96n51k33Q92o56m67J081
$$ -586 -96 658 -349 -240 475 -305 -112 587 -378 -353 669 -87 -446 450 -101 -334 558 -98 -565 516
2470E16l32p17Q16j49n99Q46j90q57R19J86r67N68L03q08O01K92j005N37O27r72
$$ 516 184 -533 283 134 -465 381 191 -666 253 439 -528 40 343 -465 136 428 -577 -40 587 -385
2490c85J97O31p83K38O53r36Q1R13p42k25Q11n91j54Q42o71l62R99m21n65Q16
$$ -385 -188 443 -340 -102 551 -385 -304 609 -133 -358 453 -138 -292 550 -121 -483 516 95 -470 346
2510C46k67n16Q63k91p18Q77K3q07O25J31p40O53J75r08N76M62q91L14N05p93
$$ 346 79 -437 426 135 -583 294 317 -490 135 266 -474 179 354 -554 22 484 -407 -93 412 -381
2530c81L00N72q66J33P73p33j05P54o24j09Q09o53k96R17m49m59P90l27m62Q25
$$ -381 -81 491 -375 -242 531 -202 -307 447 -177 -286 523 -130 -426 491 42 -417 373 46 -416 409
2550D09k76o34Q24q0o95O80No95O79J02q17N95K93q07M10L79p72L64M71q23K28
$$ 409 133 -501 323 243 -452 228 233 -462 217 319 -498 97 390 -417 -7 372 -400 -36 435 -388 -160
2571a60O21p32N4O46o67l5P38o34j91Q02m90l21P63m01l82P78l10n16P54j35o12
$$ -160 461 -271 -217 429 -238 -273 465 -169 -360 442 -48 -369 394 -7 -389 389 79 -437 317 182 -430
2592d30P01n8o37O40O9p14N81J75p28M72K83p47M03L73p29K88M61p27J89N63o90
$$ -430 271 213 -424 216 285 -429 152 327 -401 71 354 -393 10 383 -346 -58 403 -324 -135 428 -262
2613b62M6O23o19m3O48n57j39P17m64l18P27l40l83P00k77m68P27j48o00O45J4
$$ -262 -216 407 -212 -255 393 -164 -303 414 -50 -368 359 19 -364 336 59 -409 318 170 -430 215 229
2634B29o02N73M5o72N71K28p54L93L40o65L20L47p03K87N00p22J08N45n72N3N22
$$ 229 -373 200 245 -427 144 372 -382 11 351 -314 6 353 -350 -63 437 -285 -177 368 -204 -151 371
2655C71o11k1O83n32k33O55l48k45O14l93l28P51k64n17O32p5m70N78j07n73O32
$$ 371 -240 -261 422 -110 -343 312 -36 -281 333 -60 -388 363 99 -418 214 139 -331 247 140 -433 199
2676A99J20o98M28K45n78L57K26o70L60M41o99J11N07n41J12M27o10O1O32n48
$$ 199 319 -379 49 294 -284 73 299 -371 -11 430 -269 -158 349 -192 -80 347 -263 -202 430 -118
2696a18j76N86l61j44N47m52k32P13l05m43N84j31l43N25k10m43O22J2n90M22
$$ -118 -294 292 -69 -213 334 -118 -350 363 58 -385 199 68 -275 250 40 -403 219 231 -359 63
2716F3J33m80M10R7o21M43L43o58J77L78m72J68L40o08J43N73n42j41N43l61r1
$$ 63 196 -284 126 223 -398 45 388 -270 -93 285 -187 -19 321 -287 -144 429 -113 -254 289 -72 -163
2737a63M88m53j85O59k96l91N37j51k94M97k33m03O10k4n44M16P9m18M20J6n52
$$ -163 325 -128 -313 346 50 -341 196 45 -249 248 15 -388 222 198 -346 70 149 -269 151 167 -385
2758c85M63K28n78K01K88m23K28K45n69K06M73n16m6M50l72j2M30m51r7N83l24
$$ -385 78 306 -272 -71 217 -206 22 267 -302 -96 377 -139 -185 265 -107 -119 311 -140 -237 346 22
2779B2l10M98j89k24M82k66l47N71q0m74M09M5l81L83%m85M30J86n47K36K42m31
$$ 22 -288 210 21 -203 279 13 -334 237 157 -317 92 137 -244 139 139 -346 84 270 -277 -41 201 -230
2801b30K64J94n17K14L86m84M1L61l56M4L58m28l2M94l38j92M37k27j70M36k61
$$ -230 34 228 -289 -75 311 -173 -132 229 -127 -83 275 -153 -185 309 -29 -221 216 -11 -181 255 -6
2822fk60M95j25l64M00m2l36L86k0m40M05J22m69K92J53m27K39J96m30J63L08
$$ -6 -266 229 104 -260 140 98 -238 148 128 -312 93 215 -254 38 191 -236 3 199 -231 -68 240
2843B40m08J01L07m32J18L79m50mL91l00j19L71k38j29M08k58k01M30j62k74L97
$$ 240 -168 -67 240 -192 -74 305 -145 -149 242 -58 -177 194 -44 -173 235 -23 -224 206 44 -230 167
2864A67r4k88L76o5l35L48L5l63K88P9l71K64J44m06J95K38m05J35K70l78P4L14
$$ 167 73 -215 161 96 -239 109 144 -219 69 148 -223 41 185 -221 -26 212 -193 -58 212 -166 -92 222
2886B22l58j2L53k97n4L51k65j21L86k24j86L92j82k15L77j21k61L36l9k67K93
$$ 222 -136 -148 205 -92 -146 205 -60 -181 205 -19 -205 187 5 -210 167 46 -215 121 82 -185 108
2907A08Kl24L05N7l60K56J25l56J93J64l50J62K18l50P6K64k99J9K77l00nL18
$$ 108 110 -214 91 148 -212 44 169 -187 6 170 -180 -18 200 -150 -74 190 -109 -90 187 -113 -118 200
2929B00k60j03L35j91j46L22j66j78L56j22k63L31l1k67K90l7k79L08L3l25K18
$$ 200 -60 -163 172 -19 -165 157 -9 -187 169 47 -216 115 84 -183 107 70 -209 99 132 -193 25
2950B5J23k83J63J05l01J78J92l42P1K31k53N5J90k70M4K69k57j02K98j48j05
$$ 25 148 -135 28 133 -168 10 202 -140 -69 162 -91 -36 154 -116 -72 197 -60 -162 136 -12 -117
2971a17K45j77j17L35j26k36K81k7k16K48m6k37K93L0l17J90J29k57J51Q0k86
$$ -117 128 -49 -166 169 43 -193 88 61 -155 93 47 -190 103 133 -184 6 135 -122 29 109 -177
2992a77J92J80l23M3K29k12K7J73k63O0K65k53q4K65j34p8K12j75q5K99j35j93
$$ -177 15 195 -128 -85 144 -68 -41 132 -131 -71 194 -59 -143 122 -12 -90 122 -53 -138 161 26 -167
3014a67K36j0j67K00p2j90K64K1k85J74J05k19J37P1k69J94J64l13N0K08j97L2
$$ -167 69 59 -108 92 20 -170 94 115 -170 4 109 -110 27 98 -171 23 187 -126 -76 132 -65 -33
3036c3J52k41N5K62k49q3K50j27n4J82j77o6K76j18j94K29l0j34J83q0j54K41
$$ -33 119 -122 -67 195 -54 -137 113 -14 -68 114 -63 -129 147 29 -165 64 34 -100 83 3 -151 90
3058I0J1k49J48Q0j64J18K8k12J76J29k56M2J67j54M2J17k19M5K25k19o3K20j19
$$ 90 101 -148 0 80 -84 34 62 -150 26 155 -101 -59 108 -46 -4 113 -106 -61 164 -55 -118 102 -17
3081a7n8J77j56p0K67j14j82K15k3j36J77o4j66K33Nk27J54O6j62J18M2k14J46
$$ -17 -75 102 -54 -124 143 29 -153 62 39 -97 80 16 -150 83 88 -139 15 81 -81 37 79 -135 11
3104A1J20k28M8J43j53M0J23j97N5J83j89m7J98j25m5J67j36p5K42j06j58J98
$$ 11 131 -97 -49 94 -59 -19 104 -93 -38 145 -44 -91 107 -18 -63 104 -32 -107 135 29 -129 69
3126F9m0j28J73n0j65K11Ok21J63O5j92J28P3k26J42J13k29O2J47j81M7J45j95
$$ 69 29 -99 74 24 -141 70 76 -145 18 83 -109 19 92 -134 8 121 -108 -46 101 -80 -33 112 -83
3149h3L0J86j84l2K00j36o1J82j29o3K06j05j11J83o0j23J82m6j54J87nj91J64
$$ -83 -53 133 -51 -83 117 -19 -80 102 -27 -90 116 11 -100 83 23 -100 82 36 -118 69 64 -127 37
3172C7L5j91J42O1k02J18J11k20Q3J32k02P2J48j99K3J81j91rJ96j72m0K16j37
$$ 37 72 -119 23 84 -118 0 111 -109 -26 106 -96 -24 124 -75 -52 129 -62 -71 125 -47 -87 129 -8
3195hq6J92j11q4K18j14j22J87k9j46J85j6j70J76%j90J58R5k48J32M8j95J48
$$ -8 -94 98 -13 -97 121 7 -115 72 43 -103 82 66 -104 72 72 -118 40 135 -113 19 67 -128 20
3218B0R3k27Q9J82k56O1J51j87LJ95j92l1J87j01o4J77j17q4K10r6j44K18l6j55
$$ 20 113 -114 -25 157 -99 -38 113 -74 -71 124 -68 -99 88 -13 -77 100 -17 -101 109 13 -131 87 51 -104
3242a04J77l8j49J85pj91J57N0j69J11N9j79J14R6k22Q0J44j78L7J19j67M4J60
$$ -104 73 35 -114 71 64 -127 30 80 -89 22 81 -98 16 112 -110 -30 114 -64 -27 92 -75 -31 129
3265A29k01pJ94j37n1J64j17n9K15j35j19K09n3j38J91p4j28K07l2k00J82M1j73
$$ 129 -72 -79 115 -22 -73 91 -26 -85 130 -5 -124 85 32 -106 85 11 -117 90 58 -142 40 81 -92
3288i2J23K3j64J54O8k37J05J37j78N4J06j87O4J72k08j1J90j46k9J56j50j1J91
$$ -92 31 54 -110 44 112 -125 -20 117 -61 -7 99 -88 -24 148 -60 -71 119 -27 -56 100 -50 -61 130
3311A30j55j01K26p1j21J76r1j09K27o0j96J84L4j73J42Pj68J67O2k39J27J11
$$ 130 -25 -126 100 29 -92 84 -7 -116 111 51 -145 39 73 -100 42 49 -119 48 110 -129 -2 109
3333A09j90Q0Q9k00J02J46k23J6J91j54j0J59j66JK05j63r3K11r3q6J61j08q5
$$ 109 -81 -1 88 -112 -10 136 -87 -71 120 -34 -44 115 -51 -50 155 -8 -101 110 17 -69 92 -16 -101
3356a01K13o5j82J86Nj49J59k1j63J76L3k13J20R0j69R6O4j94J10J40k28M2J72
$$ -101 112 47 -135 51 56 -93 66 45 -118 58 91 -122 -2 88 -81 15 79 -115 -5 135 -93 -51 121
3379A21j76K3J46j83PK16j86o4K19j25p2J77j13r4K34r6j60J95j7j45J67l3j56
$$ 121 -55 -32 114 -69 -62 154 -32 -96 123 -2 -74 103 -10 -104 130 34 -126 69 52 -93 74 41 -115
3402a15J87mj99J47P2j78J18M3j84J18J18k18N3J52j78M3J26j86K4J89j78m0K02
$$ -115 72 68 -131 16 88 -90 28 71 -113 5 123 -95 -42 110 -68 -25 101 -85 -61 128 -50 -90 112
3425A12j34n0J90j40q6K31j04j30K09n9j26J75n0j50J91ok05J68N0k05J50N8k13
$$ 112 -22 -72 118 -22 -108 123 19 -111 98 39 -87 88 38 -112 79 73 -132 36 86 -119 31 89 -124
3448a24J39R2k07P6J40k07P0J34j95K8J70j75j1J83j58l2J95j44o8K05j14r8K10
$$ -124 15 107 -100 -24 116 -91 -21 113 -82 -54 116 -59 -70 113 -45 -77 118 -26 -94 111 -3 -101 109
3471A09r6j29K06n4j50K03k8j86J92J2k03J73M5k07J43P1k21J24J00k06R1J37
$$ 109 13 -116 90 36 -114 89 61 -125 67 79 -124 49 94 -113 30 101 -120 4 104 -102 -11 126
3493A26k18N2J65k07L1J70j74j7J94j62n6K13j41o2K00j11j11K02p6j39K08m9
$$ 126 -92 -40 125 -82 -51 119 -55 -72 122 -40 -96 117 -24 -86 114 3 -108 94 18 -121 87 38
3515C8j53J93j7j86J90K4k13J60N6k14J47Q4k25J03J33k19P3J43j99N2J62k21
$$ 38 -115 78 61 -125 65 89 -124 36 92 -122 25 109 -116 -13 120 -99 -26 117 -82 -30 132 -89
3537h9K0J97j82k5K00j70m5K22j43j00K29r9j26J99o6j45K19n0j88K00J8j92J66
$$ -89 -69 128 -54 -79 121 -49 -94 128 -15 -115 114 15 -111 88 22 -123 96 46 -142 58 76 -116 50
3560E0J7j79J62N6k40J36J24k24R5J15k22R5J56k27K1J97j93j2J94j89j9K32j81
$$ 50 67 -112 50 106 -134 2 126 -98 -3 112 -110 -15 141 -86 -65 132 -61 -73 121 -68 -87 145 -36
3583c6r3K46j03j09K11j24j10K33p4j96K42j7j90J77J1j95J93L3k30J55Q4k04
$$ -36 -129 117 14 -95 116 -8 -118 115 41 -155 87 70 -120 57 68 -127 66 99 -131 24 108 -96
3605i6J02R9k24J08J53k40M8J95j97LJ73j99JK32j95p5K35j24r6K11j29j05K56
$$ -96 6 105 -119 -11 142 -98 -50 145 -52 -49 124 -75 -74 158 -37 -112 123 -1 -97 114 -15 -120 136
3628A36j02j83K32l6j55K01m2j91K28Nk35J77O9k14J45O5k37J44J31k53P6J65
$$ 136 34 -149 83 47 -108 93 51 -140 88 93 -142 35 104 -110 35 100 -137 7 138 -115 -39 126
3650A26k10N2J59k18K7K16k09l8K13j46o5K22j64p6K44j19j55K35n3j60K17o1
$$ 126 -84 -32 127 -91 -64 152 -57 -95 118 -28 -93 129 -35 -111 133 14 -141 94 41 -119 98 37
3672C7j80K38j1k38J91M9k02J66M2k32J81J04k64R8J41k02P7J29k45P2K01k28
$$ 37 -143 95 84 -154 37 86 -116 50 92 -140 41 145 -119 -21 120 -82 -5 124 -121 -49 152 -76
3694g6oK04j87J7K05k01q0K86j56j57K45j02j07K30j13j41K78o5k03J95Pk42K00
$$ -76 -82 122 -65 -48 157 -44 -124 162 6 -151 94 -8 -115 115 2 -139 139 74 -129 66 73 -169 31
3717C1M6k24J81J40k97Q0J66k28J92k4j77R2J67j96M2J50k07N2J81k28k2K19j12
$$ 31 77 -147 34 174 -123 -43 123 -105 87 63 -114 -22 145 -51 -9 141 -66 -14 167 -61 -83 136 24
3740B4j28K08j45m8K41j19j66K20q5j62K72l8j72J53K4k81L16M8k99J84M9k34
$$ 24 -104 104 -41 -89 152 33 -133 87 2 -160 112 74 -98 55 79 -202 114 162 -137 47 96 -138
3762a38P7J90l04J65J82k42O1R5k10J5J87p9o0K04k07j02K61r1j75L31j63j28
$$ -138 -61 129 -175 -10 172 -70 -9 86 -124 -109 78 -1 -61 143 -64 -166 95 4 -171 160 -3 -131
3784a31K82j20k00K68l2k16K24j1k39K21P0k59J93M3k29J63J12k56J03J61k63
$$ -131 151 31 -169 99 67 -149 75 64 -175 46 116 -143 50 93 -136 27 139 -117 -14 147 -116
3805a16Q9J76k49N2J88k38K4K29k21qK28j96p2K63j54j13K52j39j46K93r7k03
$$ -116 -27 149 -100 -48 140 -98 -74 155 -66 -74 154 -42 -114 149 -5 -118 134 -5 -151 142 45 -158
3827a58K76m8k19K36%k63K60J7k51K10P3k93J41J25k49J31J93l18J18J56k81R8
$$ -158 118 70 -149 87 87 -176 84 101 -150 60 133 -160 -19 106 -143 -12 181 -137 -19 137 -144 -46
3849d6J63j88j4K45j67j08L38j86j86K92j20j16L59k92j49K84k9k40K57k5k06
$$ -46 117 -71 -85 160 -7 -115 223 37 -149 143 23 -93 266 -26 -175 109 80 -160 97 72 -134
3870a34K21M5k31J66R3l42K32J10k70J14J69l18J64J42k39L1J37k25N4K81l01
$$ -134 87 132 -99 67 160 -182 50 160 -110 4 173 -145 19 161 -78 -47 90 -135 -81 200 -101
3891a01n1K87j83q6K64k17m2L14j91j45K92j20j58K61j03j87K89m0k61K56K2k40
$$ -101 -152 135 -48 -134 130 -87 -129 185 -6 -151 141 21 -137 124 21 -166 123 83 -178 78 100 -140
3913a40K19J7k60K24R1l06J51J53k71J27J46k90J01K38l09K2K51k39qK35k47k6
$$ -140 79 96 -164 60 151 -155 -4 149 -122 5 151 -139 -38 200 -109 -87 164 -75 -83 152 -95 -121
3935a21L00k15j28L05j47j33K82j47j59L15j01k38K85k3k22K37pk59K68M9l05
$$ -121 179 -36 -164 141 -6 -139 143 -4 -163 152 51 -187 98 75 -147 90 83 -176 92 141 -164
3956a64J82J24k72J50J25l08J45K05l17P6K26k68M4K20k69KK91k50p9L01j91r5
$$ -164 18 142 -130 20 145 -163 -18 187 -130 -54 172 -96 -52 168 -101 -99 192 -58 -137 164 -27 -122
3978a22K90k09j26L23j10k11L32q9k42K78l0l09L20K7l05K35O7k72J99J00l16
$$ -122 168 -41 -167 156 46 -165 167 78 -164 114 84 -225 95 122 -183 52 119 -153 46 146 -170
3999a70J91J79l38J04K04k74Q2J92k84L2K82k73n6L01k18q0L01k27j09L39j67
$$ -170 21 200 -138 -34 170 -104 -22 170 -114 -82 200 -73 -129 172 -46 -126 175 -52 -161 178 11
4020A1j96L29j13k00L05r6k37L17k5k99K78K5k80K48P1l27K19J32l25J58J74l08
$$ 11 -185 144 31 -169 136 40 -197 120 95 -204 74 99 -181 67 138 -189 30 162 -163 -5 169 -139
4042a39J17K12l19P7K51l02K0K72k56m0K99k52q8L27k08j28L19j53j65K99j15
$$ -139 -22 190 -129 -52 199 -103 -83 189 -67 -107 192 -60 -148 179 -29 -157 162 9 -156 143 28
4063B8k16L19o8k59L00j4k71K56L1k97K47R2l23J99J35l26J76J66l20J22K11l27
$$ 28 -188 131 63 -196 104 90 -181 75 106 -191 56 148 -175 24 159 -167 9 175 -145 -23 188 -139
4085a39Q5K55l03K4K76k71l0K93k36q8L26k05j50L32j56j84L13j02k19L07n7k60
$$ -139 -54 201 -102 -78 198 -73 -103 190 -46 -134 192 -13 -163 169 13 -171 142 40 -179 128 71 -189
4107a89K87Jk78K59K9k92K47Q2l24K01J44l28J57J61l14J13K37l22N6K65k82K
$$ -189 98 99 -179 80 109 -183 64 146 -178 23 167 -161 -4 157 -157 -44 193 -129 -73 192 -90 -88
4129h8K81k86j2L03k71q2L30j65j57K95j42k04L72j15k43L25o5k52K84j6k82K78
$$ -88 193 -93 -105 198 -73 -155 175 10 -147 148 6 -198 174 59 -184 141 76 -176 108 92 -190 88
4151H8M6l20K31J21l32J95J26l21J61J94l43J01K43k90M2K36k96K9K96k64n6L00
$$ 88 134 -186 45 166 -166 29 155 -166 -5 189 -154 -53 190 -100 -58 178 -118 -89 207 -57 -113 187
4173A87k19j04K93k02j23L62j92j79K70Qk36L09o2k46J85P7l33K32J09l64K60
$$ 187 -32 -136 157 -45 -168 194 2 -177 93 101 -135 174 112 -134 51 128 -205 27 136 -228 32
4194C2J05l13J84K13l56O8K45k89N9J81k95J17K38k65l4K84k45l4K83k14o7K99
$$ 32 137 -176 8 221 -135 -67 178 -111 -52 129 -166 -49 189 -76 -110 174 -71 -105 178 -36 -103 196
4216A96j80k07L05q5j95L42j47k02L28q9k79L29Ok76K33L4l07K59J15l62J83J68
$$ 196 16 -191 114 29 -166 176 29 -173 155 66 -213 116 122 -154 79 113 -194 65 180 -182 1 169
4238A69l08J35J81l30J24K49l33J4K82k55rK63k67m5L40k36j46L30j60j42L06
$$ 169 -139 -4 177 -153 -29 220 -113 -99 183 -72 -81 182 -85 -130 210 -26 -172 158 -2 -144 162
4259A62j60k01L56q6k71L03j2k47K55rk82K77P1l36K04J35l07J77J41l41J69K21
$$ 162 2 -199 157 71 -200 103 91 -156 99 90 -192 85 156 -180 24 159 -148 29 170 -171 -2 219
4281B19l46N7K60k86L8K51l01ML25k70r7L26k05j07L14j97j46L37j44k13K97m9
$$ 219 -127 -70 190 -96 -58 193 -108 -104 221 -49 -146 180 -25 -132 182 -15 -161 176 32 -181 116 67
4303F7k52L05n3k62K89L9l22K34Q9k69J65J25l39K09J59l13J00K32l18R3K33l16
$$ 67 -185 120 67 -195 94 133 -189 45 134 -135 30 155 -184 25 184 -129 -29 203 -115 -22 211 -105
4325a05K6L16l11o7L40l03l8L26k39j14L56j88j91L42j03k28L33j00k53L12%l12
$$ -105 -79 237 -74 -141 199 -104 -142 184 -55 -169 187 -1 -192 150 47 -181 152 52 -201 111 111 -201
4347b01K68M0k92K20Q0k88J60K05l39J76J45l17J71J51k84N3K60l19P7K44l19
$$ -201 67 107 -185 35 115 -173 -13 192 -147 29 174 -143 28 179 -105 -52 208 -111 -34 210 -109
4368a09PL22k34r1K80j95n8K35j79j34K60r6j43K64m6k72L69r4k62K68P7l63K91
$$ -109 -102 220 -14 -105 175 -20 -78 157 -22 -156 104 8 -135 129 83 -189 180 86 -176 92 169 -194 97
4391I7j3k75K05J83l43J06J99l06J30K08l56J09K33k60k4L24l11oK67k60J5K41
$$ 97 84 -191 14 197 -146 -40 159 -147 -17 191 -165 -56 177 -83 -107 217 -94 -100 167 -93 -78 163
4413A63j75j41L01k07r1K80j43j92L44o8k51L04k8k26K29k4k60K59Q3l29J88J66
$$ 163 -12 -153 148 -59 -150 130 -13 -205 139 71 -180 124 96 -130 99 75 -185 74 157 -172 16 182
4435A82l25J22J90l08Q3K58l08K2K91k65n1K53k35MK73k24r8K96j77j34K87j51
$$ 182 -143 -21 169 -139 -56 202 -106 -84 207 -58 -109 144 -91 -87 186 -38 -136 160 -17 -151 136 -15
4457a5j47L31j35k24K94m1k49K69k0k47K81L3l23K30J12k90J72J17l11J75J78
$$ -15 -162 169 34 -190 104 63 -186 83 63 -184 97 130 -193 37 149 -141 31 148 -163 12 190
4478A90l25Q5K34k71M2K22k77K3K75k54p7L11k04q9K72j94j14L28j52k08L10p8
$$ 190 -135 -50 184 -87 -45 177 -100 -77 198 -56 -133 178 -26 -115 157 -37 -151 177 25 -183 127 49
4500D9k01K60p0k12K84kk98K30P5k67J95P7k92K12J42l39J19K09k81Q6J90k82
$$ 49 -152 108 38 -174 110 108 -190 40 115 -152 43 120 -172 40 182 -157 -38 171 -110 -24 166 -116
4522a16O7K57k84k7K72k11m7K55k22p5L37k05j70L09j17j66K82j17k09L24n0k81
$$ -116 -49 208 -76 -103 169 -42 -89 166 -56 -131 206 1 -169 140 23 -143 139 22 -187 137 87 -194
4544a94K62K5k57K25L9k86K34J16l31J38J72k72J24J58k98J06K26k89J1K70k39
$$ -194 68 93 -164 61 100 -186 48 164 -167 -29 143 -129 -5 153 -145 -39 187 -102 -91 179 -60
4565f0j0K41k49l9L22k14j45L11j53j39K81j51j64L19q3k53K73ok48K56ok78K61
$$ -60 -70 171 -78 -117 205 -9 -154 157 4 -135 146 -5 -169 150 67 -186 87 81 -167 89 83 -195 66
4588F6P6l04J70J18k71J65J28l09J40K12l08N1K30k51L1K23k62mK86k30q4K77
$$ 66 142 -162 8 126 -145 20 148 -161 -21 191 -117 -66 164 -87 -56 167 -95 -99 187 -43 -127 150
4610A50j71j00K64j51j51L20j14k11K82o2k14K65l2k66K82K3k85K08P6k75J95
$$ 150 -21 -121 143 -8 -159 161 47 -164 118 56 -158 107 75 -191 91 114 -171 37 113 -162 33
4631C3J02k97J61J54k87Q9J95k68O3K22k71K6K56k56k9K71k08p4K76j96j14L07
$$ 33 135 -162 -1 153 -134 -45 150 -118 -55 167 -104 -78 178 -78 -107 164 -44 -118 158 -38 -152 155
4653A55j49j52K85j12j85K72o6k17K76k6k59K51K2k69K21O3k77J90J20l03J55
$$ 155 6 -146 139 27 -158 114 48 -169 107 81 -178 73 95 -174 47 110 -167 23 143 -160 -5
4674eJ57k93J19J91k96P4K23k87L2K59k58k4K76k19o3K74j98j00K88j49j48K83
$$ -5 152 -141 -22 169 -127 -53 170 -117 -85 174 -84 -108 168 -51 -114 160 -38 -138 150 1 -147 136
4696A36j16j68K66p6k03K73m0k47K50K7k67K10N6k74K04J08k88J37J58k67R4J72
$$ 136 20 -148 118 42 -161 112 72 -175 75 102 -165 45 101 -173 31 139 -149 -12 146 -121 -27 145
4718A45k81Q1K26k78K2K46k35j8K45k17l8K78k04j23L05j62j45K81j18j81L03
$$ 145 -136 -55 171 -107 -85 161 -74 -92 153 -64 -102 176 -28 -151 154 -8 -153 128 10 -171 132
4739A32q1k38K82j1k35K25J1k47K34N6k94J83J17k58J39J32k78J26J81l01O5K26
$$ 132 51 -187 95 84 -151 74 85 -162 72 128 -166 17 134 -124 15 147 -131 -5 176 -125 -60 166
4761A66k40J7K02k57M4K65k66q8L14j52j40K94j91r2K86j32k37L35l5k34K54o2
$$ 166 -74 -57 145 -112 -68 197 -69 -157 157 5 -135 159 -32 -124 162 30 -207 128 93 -141 113 51
4783E1k43L02ok86K16N5k13J65J03k98J80J53l26J14J92k64R3J51k33P8K22k71
$$ 51 -192 110 104 -182 34 89 -124 41 144 -154 26 179 -147 -33 159 -105 -12 139 -94 -16 206 -65
4805f5o2K80j59j04K74j94j00L19j75j71K89q6j77J98o6j87K99m8k44K52K1k16
$$ -65 -127 153 -6 -110 164 -30 -130 189 14 -157 132 46 -131 67 1 -186 113 65 -179 73 94 -122
4827a22K03L5k65K04J01l19J55J82k85Q4J75k96J19K01k58oK55k03k7K13k16l8
$$ -122 81 116 -149 55 156 -163 -8 174 -111 -27 148 -148 -29 172 -86 -92 163 -40 -67 146 -70 -108
4849a08K82j88j32K84j23j37K55j33j61K95o7k43K56pk14K30ok46K31O9l10J84
$$ -108 174 -14 -146 138 15 -122 133 0 -161 134 67 -176 80 73 -141 89 83 -163 68 137 -173 11
4871A1J20k51J33J21k78J37J93k99N5K31k39J5K19k54%K81k29q8K77j74r1K57
$$ 11 131 -120 13 134 -144 -7 186 -113 -58 173 -66 -51 168 -86 -86 195 -34 -122 155 -19 -110 147
4893A47j58j32K95j14k06K73m6k03K52n2k24K54J6k66J99P4k55J76P4k61J61J56
$$ 147 -11 -143 152 38 -168 105 59 -144 108 56 -168 86 102 -164 35 109 -146 30 104 -157 4 160
4915A60k95R8J93k68Q3J95k73L8K41k37k4K48j95o0K68k10q7K96j65j50K73j06
$$ 160 -135 -37 156 -112 -29 166 -107 -69 172 -65 -89 159 -36 -96 172 -38 -125 171 6 -144 129 23
4937B3j62K54p1k12K57j2k51K43K7k47K09M8k65J88J01k83J46J38k58J02J79k82
$$ 23 -139 115 44 -168 89 77 -174 69 96 -151 58 106 -159 29 130 -153 -7 131 -127 -25 154 -128
4959a28R1J98k51J8K39k37j0K47k14o3K65j71j11K80j45j44K72j12j83K83p9k12
$$ -128 -37 161 -90 -72 167 -70 -80 167 -47 -110 155 -16 -127 153 8 -136 136 24 -159 124 45 -167
4981a67K59k5k42K39K6k55K22N5k68J82R9k74J56J33k67J14J59k64P1K16k56J2
$$ -167 92 67 -175 64 90 -165 57 112 -156 26 125 -149 7 140 -127 -13 146 -118 -47 169 -87 -75
5003g5K40k19k9K46k08n5K58j71j21K84j44j38K73j31j55K68p5k23K60pk32K28
$$ -75 165 -54 -83 163 -45 -100 158 -13 -134 150 6 -132 141 10 -145 123 48 -175 85 78 -154 74
5025G4J5k56K30N4k69J65J22k77J39J40k83J38J75k82N4K34k47J1K19k32LK48
$$ 74 89 -167 63 117 -152 13 135 -142 -3 137 -146 -8 167 -115 -61 173 -74 -63 156 -76 -73 175
5047A75k25p8K73j49j19K52j34j14K69j13k01K60l7k09K27l0k02K38Pk68K10Q1
$$ 175 -50 -128 145 -4 -123 129 -5 -119 150 37 -164 96 59 -150 77 47 -155 83 90 -178 32 113
5069A13k57J48R8k52J69J48l08R3K06k61O3J68k32N5K12k49nK57j72q5K07j60
$$ 113 -144 4 102 -150 19 167 -141 -48 158 -103 -40 128 -104 -49 163 -86 -91 166 -6 -91 116 -44
5091d4k9K43j45j56K53r3j38J99j0k23K96n2k70K01R6k15Q6J22l02K43J28l13
$$ -44 -73 170 25 -131 122 29 -109 90 80 -143 153 101 -169 32 128 -87 -1 121 -181 62 190 -123
5113a23P7J24k38J68J07k58J00K27k82nK53j79n4K19k07l3K83j92j25K82j31j29
$$ -123 -46 78 -160 8 115 -143 -43 184 -98 -103 150 -29 -83 136 -71 -104 179 -13 -138 144 13 -116
5135a16K20r9j49K70p1k26K43mk01K00jk36K23O1k73J49J33k31J08J16k58J12
$$ -116 104 5 -144 126 55 -171 72 68 -133 67 66 -170 53 114 -159 -10 123 -108 0 116 -142 -30
5157c0J98k70L3K13k02KJ95k22k3K73k09q5K63j46q9K35j43j31K87r9k21K69m2
$$ -30 168 -102 -69 144 -58 -56 139 -83 -106 167 -42 -127 136 -10 -99 136 -7 -138 149 50 -171 98 56
5180E6j96K26k7k24K52J9k67J87P8k29J57P6k57J47J44k67Q3J87k34M7J82k47
$$ 56 -140 86 59 -165 87 106 -161 26 104 -125 32 108 -149 -2 142 -125 -42 145 -89 -42 140 -107
5202a07M3K28k17m6K42j69o4K24j59r0K63j34j49K49p1j69K28o0j98K52j3k42
$$ -107 -64 164 -53 -99 143 -26 -90 134 -25 -115 148 14 -135 114 43 -126 102 42 -156 96 83 -159
5224a59K13M2k42K01M8k51J81J06k73J22J41k41Q9J59k59P0K18k55PK29k05k8
$$ -159 54 96 -146 55 103 -148 33 139 -134 -12 129 -112 -23 136 -123 -53 165 -90 -83 146 -59 -87
5246h7K24j90n1K47j62j12K55j15j40K39q7j61K46n4j99K28pk13K10K2k43J93
$$ -87 137 -53 -104 143 -19 -131 124 9 -131 108 21 -140 106 52 -147 81 74 -139 71 93 -150 43
5268D3O8k45J51J06k51J26J42k64R7J69k48O1J94k33J8K24k17l7K45j93o1K40
$$ 43 111 -134 17 123 -128 -2 140 -124 -27 142 -106 -45 149 -84 -66 158 -59 -96 149 -44 -105 135
5290A35j57j07K55j10j42K40q5j67K41o3j89K26nk16J93L4k23J87N9k39J55J34
$$ 135 -22 -129 126 16 -126 114 29 -138 103 40 -149 77 72 -144 49 83 -140 47 106 -133 22 156
5312A56k28O7J36k46R2J74k57N0K10k29OK14k13j0K32j99p7K67j50j18K38j18
$$ 156 -72 -5 131 -115 -23 151 -106 -56 154 -75 -69 145 -68 -78 154 -45 -122 145 -5 -123 115 -3
5334cj22K59j12j84K57l3j96K13k5k09K29K2k62J93Q7k29J27R0k28J22J48k74
$$ -3 -125 134 22 -162 95 62 -134 79 54 -155 74 96 -166 27 114 -115 12 102 -126 -4 144 -130
5356a30R6J85k21K1J80k08K4K14k10n3K56j65q0K19j57q3K64j43j68K69o3j78
$$ -130 -34 151 -70 -49 131 -77 -53 161 -49 -102 154 -11 -91 128 -29 -112 152 9 -159 110 47 -131
5378a31K23o5j71K42k6k50K22N6k36J63O3k33J65J09k86J33J65k29N0J55k24P1
$$ -131 92 27 -144 98 72 -178 44 100 -136 27 90 -143 22 131 -155 -22 143 -86 -36 119 -105 -34
5400c4J99k42j0K39j74o0K21j78n3K60j83j23K61r0j49K21q4j59K59o3k23K31
$$ -34 165 -77 -87 152 -22 -82 139 -39 -92 168 -15 -138 123 33 -116 105 21 -138 121 58 -165 66
5422F6J1k08J90Lk14J97O5k66J53J29k41J17J14k45J05J88k71M5K12k06mJ98k00
$$ 66 77 -131 59 62 -152 45 110 -156 -3 126 -115 2 116 -129 -24 164 -107 -62 150 -56 -60 138 -62
5445f2j1K44j95q4K50j24j09K02j04j23K49r1j97K35k1j74J93l0j88K18K5k68
$$ -62 -73 171 -24 -108 142 18 -91 111 7 -116 133 42 -155 80 59 -115 78 48 -140 78 103 -165
5467a65J72J07k33J35R3k45J36J48k74P3J92k27M8J69k22K9K27k17n8K46j55o7
$$ -165 7 114 -119 16 109 -136 0 148 -126 -53 139 -88 -40 129 -93 -64 163 -54 -112 134 -21 -88
5489h8K15j48p8K48j29j54K40o3j63K14n4j82K29%k34J90N2k15J53O2k36J54J06
$$ -88 127 -21 -99 149 20 -134 106 43 -120 94 40 -142 87 87 -147 43 95 -120 33 95 -141 13 119
5512A19k52J03J61k28O4J52k20N9J88k25JK32j97l9K16j65o4K50j59j13K46j05
$$ 119 -133 -30 131 -97 -33 119 -101 -42 146 -79 -78 154 -43 -82 134 -31 -95 155 -4 -117 129 24
5534B4j48K47r9j54K39m0k03K15Kk04J88K4k21J63P4k35J38J01k12R9J20k29Q7
$$ 24 -124 123 24 -130 109 69 -134 81 83 -121 67 91 -130 33 107 -128 10 111 -101 -2 118 -111 -24
5557b4J73k31L6J78k04JK11j95l6K28j63o8K33j51q4K27j16j31K30q3j54K18n0
$$ -24 149 -82 -46 132 -72 -71 140 -55 -91 137 -26 -94 139 -12 -96 131 15 -116 114 31 -123 95 45
5580D5j75K05Nk07J90K1k17J70O7k26J26J20k29R3J34k20O9J66k25L5J93j98k1
$$ 45 -130 75 80 -127 63 84 -133 37 104 -122 4 124 -105 -12 122 -98 -29 137 -88 -53 140 -58 -79
5603g9K03j75k8K16j72o1K28j35j03K28j15j13K22q9j68K29m0j75K00j3j88J98
$$ -79 124 -51 -79 137 -35 -96 132 -3 -106 122 7 -106 116 27 -141 88 48 -127 73 60 -128 70
5625G0J6k25J67Q7k30J18R6k21J29J25k46Q1J66k15M3J61j95K0K00j98m5K27j40
$$ 70 86 -139 28 115 -115 3 99 -122 7 132 -114 -33 133 -82 -39 122 -73 -53 147 -51 -96 131 -9
5648iq1K06j28q1K29j22j42K24m2j62J85l8j57K03k0k14J97M5j92J20N4j99J42
$$ -9 -90 116 -12 -93 136 14 -128 96 54 -108 77 39 -118 85 65 -149 48 93 -99 21 75 -124 18
5671A8J00k57J28J40k12N0J42j92N7J76k26j8K23j62l4J71j47l6K20j55j19K42
$$ 18 118 -139 -11 129 -83 -33 109 -83 -26 150 -76 -94 129 -33 -67 104 -43 -79 141 -14 -133 109
5693A09o8j33J71o0j21J99m4j91J90K0j83J39L6j83J69M6k36J36J12j91P1J00
$$ 109 41 -92 79 19 -102 97 53 -138 52 72 -111 28 64 -119 50 96 -140 -4 108 -83 -12 88
5715H8j91R6J49k41L4K09j88j7J76j75OK03j80q2K41j11j11J92r9r1K22j05j54
$$ 88 -103 -7 142 -99 -65 144 -44 -61 115 -60 -54 149 -31 -113 128 17 -94 98 -1 -92 130 25 -129
5738a29J99jj74J73j0j77J89J8k15J42J02k10R7P2j83J11J18k25N2J75j71J1J45
$$ -129 70 69 -105 68 58 -119 70 88 -127 15 117 -93 4 76 -107 4 122 -103 -51 124 -47 -36 109
5761A09j78K0J93j92m8K23j38p2J95j29o4K14j09j51K27n6j49J92n4j51K18k4
$$ 109 -69 -49 144 -48 -96 127 -11 -83 112 -17 -81 133 24 -127 100 44 -105 87 33 -118 100 76
5783G6k16J82M6j92J40L5j87J45Q9k22Q3J43j96N1J38j98N6J60j89j4J93j48m1
$$ 76 -140 42 88 -104 36 71 -116 29 118 -104 -21 122 -74 -23 115 -83 -27 133 -56 -70 123 -25 -66
5806f6J79j42m9K00j25r6K04p4j24J88o4j37J96l7j77J90J0j83J65J4j86J58N5
$$ -66 113 -29 -78 122 -3 -99 105 31 -93 95 31 -106 90 53 -124 66 76 -107 58 72 -114 44 99
5829I9k19J32R0j96Q9J21k16Q1J41k00K8J73j68j2J84j67l3J94j38p1K06j18r7
$$ 99 -120 12 102 -94 -5 116 -100 -19 122 -78 -50 123 -45 -57 127 -40 -73 121 -17 -88 118 0 -97
5852i7K06r8j17K04n7j42J82l2j59J75lj80J66L8j94J33P0k01J16R5k00R0J19
$$ -97 109 11 -106 98 41 -101 81 49 -110 65 62 -118 48 86 -108 25 95 -106 10 105 -95 -5 114
5875A14k01O2J48j97L0J75j84JJ79j61l1J84j46o4K08j29p9J82q4r8J90o8j48
$$ 114 -87 -25 123 -74 -44 131 -53 -52 127 -34 -65 119 -27 -91 117 -12 -91 91 7 -91 99 31 -117
5898a17J93k7j49J46Rj65J63J7j91J43P2j97J08Q5j85R0J17k10O5J52j87K4J66
$$ -117 76 49 -100 46 55 -110 53 70 -121 22 94 -103 5 90 -95 -5 112 -98 -33 119 -68 -44 122
5921A22j66RJ66j71k4K00j34o8J77j18p6J96r6j19J97o5j31J87n0j35J73k1j88
$$ 122 -44 -35 131 -40 -64 136 2 -66 111 -7 -83 113 17 -102 95 30 -101 86 36 -99 74 53 -135
5944a35J74M1j88J18N3j70J30P7k06Q8J26j79L1J35j76N8J44j89KJ88j45m5J78
$$ -135 39 80 -108 10 63 -107 23 100 -106 -18 108 -71 -40 95 -81 -23 121 -68 -66 122 -23 -68 110
5967A10j46k4J87j46q2K15r0j14J80q1r8J85n1j80K02Oj80J35K3j68J66L3k08
$$ 110 -36 -60 127 -19 -101 114 24 -90 90 9 -89 96 45 -135 67 73 -107 28 51 -117 49 82 -126
5990a26J27R9j81O2J01j74P8J18k01K9J86j53j7J42j27jJ76j76n9K22j18r4J82
$$ -126 1 100 -81 -19 82 -92 -14 104 -97 -68 118 -35 -52 90 -37 -38 138 -38 -97 125 7 -87 95
6013I5r1p9K05j05j47K13k3j56J46k1j46J84pk01J60O8j93J02P2j78J14J03k22
$$ 95 4 -75 130 25 -122 91 68 -88 58 37 -109 75 68 -133 27 95 -98 4 76 -102 12 115 -107
6036a07Q2J38j84L1J38j58K1J58j73k2K04j34o5J71j10p0K12j24j22K04m3j37
$$ -107 -25 113 -71 -40 98 -60 -39 119 -54 -76 128 -6 -71 100 -10 -80 132 8 -114 90 47 -90
6058i0J64m6j26J89k5j94J70L7j73J18M2j80J47O4k05J05J13j95O4J09j70N4J57
$$ -90 74 28 -98 91 66 -128 42 79 -94 24 66 -114 33 97 -108 -3 110 -85 -21 88 -82 -28 129
6081A29j99pJ98j61k4J70j46k0J83j38q8K04p1j11J72p1j09J93n7j60J70K0j69
$$ 129 -70 -77 121 -40 -64 106 -40 -60 123 -15 -103 101 30 -81 91 20 -89 104 47 -113 57 77 -92
6104i2J43K2j80J52M3j99J21R0j88Q8Q6j81Q4J19j94L2J61j73J2J63j61j1J83
$$ -92 51 73 -107 45 88 -111 10 100 -88 0 86 -95 -11 108 -86 -54 107 -66 -54 109 -52 -63 120
6127A20j52o2K14j27p5J84j03r4K00q0j34J97l5j47J68j5j64J62J7j79J31N3j73
$$ 120 -32 -94 120 -7 -82 102 -1 -95 105 25 -109 88 53 -94 74 59 -105 57 74 -105 26 79 -94
6150i4J10P8j91J00J03j90O2J28j91M7J48j82J2J67j68j2J80j46m8K02j32p7J94
$$ -94 16 94 -97 3 106 -84 -22 106 -85 -38 110 -72 -60 107 -61 -73 107 -39 -87 115 -17 -94 100
6173A00j00r3J96q7j34K18o3j38J65pj70J73J2j87J42N7j85J06Q9j97J05J06j98
$$ 100 0 -93 103 16 -118 100 37 -101 64 57 -113 60 72 -115 27 84 -101 5 94 -103 2 108 -90
6196i0O5J36j79J6J61j73J7J61j71j0J83j49o0J95j09p8J91j04j11K02p1j29J82
$$ -90 -25 111 -68 -52 109 -64 -47 114 -57 -67 116 -33 -93 102 -7 -85 106 2 -109 93 22 -107 75
6219G5m3j27J78l9j62J73L1j91J31M9j82J30O5k02J05J10j91N9J32j73N3J30j82
$$ 75 32 -95 83 44 -118 55 86 -105 26 75 -107 23 88 -114 -9 101 -90 -31 101 -72 -19 111 -71
6242g1NJ89j55k9J63j26l6J80j48p6K01q3j10J73o4j02J78n3j56J85Qj72J39J5
$$ -71 -66 123 -32 -61 102 -24 -60 120 -28 -104 97 14 -96 77 13 -89 89 36 -120 65 73 -99 40 55
6266E5j49J43K5k04J36J03j93O8J00j77Q8J11j99N2J65j80rJ55j47J3J63j55n8
$$ 55 -94 49 74 -130 6 109 -84 -16 84 -93 -5 106 -93 -41 124 -56 -65 90 -57 -44 119 -36 -94
6289i4K09j07q6J67q9q5J88p7j53K05k3j51J49mj46J62nj87J39R0j96Q6P6j63
$$ -94 115 8 -78 89 0 -85 103 26 -127 78 55 -96 53 49 -97 65 60 -127 12 102 -94 -8 68 -95
6313i5J08Q8k10O8J53j73J9J39j59J8J56j72k0J86j13o9J65j11m5J90j20j14K02
$$ -95 13 101 -109 -41 112 -61 -42 97 -62 -44 112 -60 -80 106 -7 -76 89 -22 -67 123 3 -111 91
6336I1m0j40J46k2j27J69k4j75J71L3j75J08M6j53J19O9k03Q9J33j82L5J20j55
$$ 91 51 -89 57 35 -92 77 53 -122 49 82 -93 15 61 -92 27 96 -107 -18 115 -67 -32 88 -67
6359f7L7J47j89JJ85j37l5J50j23m1J94j34q8K04p8j13J63o2j03J75m0j59J67
$$ -67 -30 117 -72 -71 114 -23 -58 92 -31 -72 122 -12 -100 104 26 -87 76 14 -89 86 46 -113 54
6382E4J6j59J20K6j55J33M7j94J15R3j71N1J01j52O4J24j81J3J69j53rJ34j23
$$ 54 70 -89 31 57 -98 35 82 -112 3 96 -75 -24 77 -75 -11 113 -68 -55 114 -39 -48 86 -37
6405c7l1J78j16p4J90j00r6J77q5r4J69o0j34J78j8j28J30J9j77J75Pk52J79J19
$$ -37 -68 110 -6 -80 110 10 -86 91 6 -88 81 21 -113 65 47 -81 49 68 -109 66 73 -179 0 119
6429A19k02O7R9j88J07Q7j72N0J43j84K1J46j48lJ70j53l4J74j16o9J76q4r1J76
$$ 119 -83 -16 83 -105 2 89 -83 -33 110 -74 -53 93 -55 -58 112 -41 -75 99 -17 -86 90 6 -85 91
6453I1p8j02J66m5j25J66l3j43J58Mj53J39K8j80J30N8j67Q2Q9j92R0J00j73N2
$$ 91 13 -89 77 32 -93 73 40 -103 55 59 -94 45 73 -107 23 81 -86 -4 85 -107 -17 83 -90 -38
6477c8J37j64J0J62j64lJ56j26l3J71j19o9J71q9q4J66o5j13J78m6j43J55oj31
$$ -38 99 -65 -55 107 -57 -60 96 -30 -63 108 -11 -80 91 2 -82 84 19 -94 84 38 -105 50 44 -87
6501h7J46mj63J29N5j77J09P6j63Q2Q2j73O9J21j79L2J31j45K7J42j67%J68j40
$$ -87 59 55 -108 21 76 -101 8 84 -79 3 85 -88 -19 102 -77 -45 86 -59 -32 110 -57 -57 111 -29
6525b9n1J68r9n5J68j16p8J91o7j19J60m3j13J51l7j46J60K6j72J23N1j60J11
$$ -29 -80 88 -11 -66 102 -14 -92 99 32 -87 73 30 -83 68 31 -115 45 71 -101 22 73 -87 24
6548B4N0j78J05J03j84M7J15j44L8J11j57PJ64j49j3J49j22k2J51j34m5J89r7
$$ 24 74 -104 1 104 -80 -33 82 -62 -24 87 -70 -63 101 -48 -61 88 -34 -56 95 -39 -84 105 8
6571Hr3J49n3r4J77o8j30J78mj65J27J5j36J25K9j86J33Q4j72N6R6j55P3R1j75
$$ 8 -85 64 11 -83 94 26 -104 74 70 -95 32 47 -89 36 65 -121 12 96 -76 -20 76 -79 -6 85 -90
6596i0L3J53j45j0J43j37RJ57j59n3J96j00q1J53p1n9J60q8j10J74l0j28J44k5
$$ -90 -57 96 -49 -59 84 -53 -44 113 -46 -99 97 -3 -84 69 -2 -61 99 11 -99 75 45 -83 61 36
6620C6j16J32Mj67J47N5j73Q1O8j49R8P0j88P8J32j77K1J23j34L6J11j52j2J79
$$ 36 -80 52 56 -111 36 91 -82 -1 67 -82 16 86 -102 -24 108 -69 -48 75 -59 -23 88 -64 -76 103
6644A03j17o2J40q8m3J55r9r7J82l7j23J45l4j08J64l7j35J37K5j44R1L7j42J15
$$ 103 -14 -76 64 -24 -67 88 -11 -108 74 37 -86 59 25 -83 81 44 -91 46 71 -73 18 55 -87 28
6668B8N6j81R5Q9j56N3R6j48M8J08j61J9J43j32k1J38j06j8J49j25o1J59n5r9
$$ 28 84 -97 -2 87 -69 -16 80 -68 -20 88 -73 -54 89 -43 -64 74 -32 -50 99 -26 -87 72 17 -82
6692h2J38l7r6J50l8j33J53J2j54J20K2j28J20K5j66J09P5j68Q3O1j38O5Q9j46
$$ -82 56 19 -77 73 35 -98 55 67 -87 33 55 -73 47 72 -94 15 90 -78 5 66 -72 -7 82 -64
6716f4L5J30j52OJ18j11j7J47j23m5J57q9p1J58p8p8J52o7r9J66l1j25J33j5j17
$$ -64 -29 101 -51 -45 73 -38 -55 92 -31 -76 81 -8 -79 79 1 -77 75 8 -91 75 44 -81 52 37 -80
6741h0J34Nj44J10M1j50J02N3j43P7P5j40M6J09j48K3J21j42J2J20j21j6J57j16
$$ -80 54 59 -85 25 66 -84 18 71 -72 5 80 -60 -14 95 -53 -30 91 -51 -39 81 -40 -56 101 -15
6765a5m6J51j05o0J59r9n5J45n1j03J46l6j13J37oj20J17Oj35J13L8j46Q6P1j51
$$ -15 -61 90 -15 -75 84 -15 -70 75 24 -79 67 31 -82 55 49 -71 46 52 -83 30 68 -78 8 79 -72
6790g2Q0O4j45N9R8j40K8J08j30J1J19j26j3J41j06l8J49q5o3J44q3p6J56n1j04
$$ -72 8 72 -73 -14 84 -56 -28 80 -50 -39 80 -46 -59 82 -24 -62 87 2 -61 83 0 -76 80 29 -75
6815g5J23k1r4J18j5j26J37K6j57J05L6j21Q2M4j47R7Q1j60M9Q6j11K5R5j49L2
$$ -75 48 27 -67 51 36 -90 47 73 -84 21 57 -64 18 62 -85 12 93 -67 -18 68 -43 -18 77 -72 -40
6840d0J42j35k7J27r2k8J30r1o1J61p1r0J42n1p5J23m8j05J47jj29J01K6j22J03
$$ -40 102 -33 -60 67 -25 -53 77 -14 -75 86 15 -75 67 16 -59 64 16 -89 58 57 -72 29 55 -67 36
6865C6Jj18R6M9j24O9O3j20N8O0j20L1P4q9l2J38q4l7O2q2NJ31l0j26J58o6o1
$$ 36 37 -81 15 64 -60 9 72 -48 10 70 -50 -19 55 -34 -66 72 -12 -49 13 -69 -64 67 37 -89 69 3 -58
6892e8J33p1q0J44k0j15J06J0j10J20j3j25J06L7j32O3O5j28Q3O4j47O2R0j35
$$ -58 75 4 -76 68 48 -67 39 49 -61 59 46 -79 27 64 -68 -5 60 -68 15 79 -68 -6 84 -51
6916e1J8J03j20L2R7j40oJ48j00l8J13q4k2J34j01o6J58n8p5J05k2r1J38l8j10
$$ -51 -33 70 -50 -18 79 -61 -67 81 -19 -57 56 -28 -50 84 -17 -83 75 17 -58 47 25 -66 72 34 -76
6941g6J17J3j11P8M1j20R1L3j42Q8O1j25L3O8r8M3O9j19J9J15j13j0J00p9j6J15
$$ -76 41 54 -57 21 62 -58 33 66 -76 12 73 -52 -19 49 -49 -6 63 -56 -37 78 -35 -45 55 -24 -40 75
6967G5j06l2J35p0o6J18n1o3J14m9q5J32rj09J09oj01J06Lj24R8O2j40M0M3r9
$$ 75 -31 -63 72 2 -64 54 3 -60 54 5 -80 52 43 -66 43 37 -64 42 45 -79 19 81 -59 -19 24 -75
6993g5P3N8j11K6J08j17RQ5r5JJ08j15j5J28o8n9J28q1l7J22o6p1J21l5q8J13
$$ -75 -2 56 -55 -29 79 -38 -29 56 -39 -38 70 -45 -60 68 0 -59 69 -12 -49 73 7 -64 57 22 -66 47
7019D7j6q8J01j0r4R6K1j17P7L4j16Q4M6j30N7P8j20L0Q4j11J3R9j05oJ08q2k9
$$ 47 31 -57 44 34 -60 36 57 -60 17 51 -65 19 65 -65 -8 70 -50 -20 64 -47 -34 65 -40 -46 62 -20 -49
7046d9J05o5l8J16p4m8J13m2o8J06l2q7J07k6q1R6Qr4Q1K1j01O0L7j00P2L3j14
$$ -49 56 -9 -47 69 -5 -53 60 18 -50 56 24 -63 44 18 -63 33 41 -53 28 49 -52 8 45 -55 17 50 -64
7073f4N4P3j05J8R7j03NQ8j11J8R4q3k1R7o4m6J05m6p0J23m3p4R5j4p3R9k0r2
$$ -64 -10 63 -42 -24 73 -30 -25 63 -48 -30 64 -19 -40 57 -7 -53 52 6 -64 59 16 -58 37 23 -50 49 29 -63
7101f3R0J2j00P9L5j07Q1J7r7O0M9j06M0O0r3L7O1j03K8Q6j01j1R5p1qQ4p1l0
$$ -63 27 39 -61 18 53 -54 27 44 -53 7 56 -50 -10 50 -43 -6 55 -48 -20 66 -35 -46 49 -22 -30 54 -17 -47
7129d7J09n9o2R5k6n6J02l8p5R6Kr5Q5J0q0O7J7r8P9L8j10L2O8q6L5M5j06L7Q1
$$ -47 62 3 -59 36 10 -46 56 18 -57 39 41 -54 31 41 -39 28 45 -53 26 64 -46 -14 54 -32 3 48 -58 -21 60
7158F0q7pQ6q4LQ2q5j6J22p2m8R8n2l9Q7m2n0J05k5r1Q1J1p2P9qq6Q2K9j09N3
$$ 60 -27 -34 52 -32 -29 53 -32 -48 74 2 -46 52 0 -39 48 6 -44 61 36 -55 26 37 -35 44 36 -50 32 61 -48 5
7188EM5q9O4K4j01N4O8j07QO9p2J9O1r4oJ15p6l7R3n3k5Q2o2l4J05k3q3Q2j4m2
$$ 5 50 -39 25 49 -52 2 70 -37 -29 40 -32 -13 48 -46 -52 63 -13 -50 43 -10 -35 47 -15 -49 56 33 -50 32 18 -24
7218b4O8k4q7R5J6r5N9K0o6Q0Rr7M9O4r0lO4p7L7N1r0J1Q6p7nO7o3qP6p3l3J08
$$ -24 44 20 -67 28 44 -51 8 28 -38 42 51 -46 3 67 -23 -26 38 -39 -2 49 -41 -30 56 -21 -26 41 -22 -30 46 -27 -60 48
7250D8m4n1Q0k0n2Q6l6o8R8Nr3O9Oo3P0Mq3O2M2j05M8M2p6M4K9q5J9P7q5OQ6q2
$$ 48 4 -47 33 13 -39 47 11 -57 41 46 -47 22 28 -35 35 39 -44 18 60 -45 3 45 -31 13 42 -43 -24 53 -32 -26 60 -22
7282b2LP1q4j8J01o6m0Q2k9l2P2l2m5R2or1P1Jo4P2%p1N4L6r3N3K9q2N6M3j01
$$ -22 -19 52 -32 -50 51 -15 -55 27 -2 -34 38 6 -39 53 47 -44 27 28 -36 36 36 -35 19 55 -38 15 44 -38 18 61 -40
7313d0L9M9q2L2L8o3RO2o7qQ5o1l0P6m5j8P1n1m4R0l9m8Q8l0o3P8ro1O6Mo4N7
$$ -40 -1 48 -34 -2 36 -27 -18 44 -23 -31 54 -7 -37 39 -6 -24 47 -4 -48 42 3 -45 43 13 -50 28 19 -42 24 28 -36 21
7345B1J7p3N1L0p8M6L8q0L2M7p7K0N8q3J5O7p3kP5o4pO9n3l0P6m1m5Q2l1m4P6
$$ 21 38 -35 16 46 -32 14 52 -28 4 51 -26 -6 52 -31 -16 51 -22 -24 51 -13 -20 49 -4 -34 42 1 -44 38 7 -37 39
7376C9k5n7Q6k5n6O2jo1O0Qo9N3K7q1M4M5q3J8P0q1L0M1q2K3O1o0mO5o5lN2m8
$$ 39 14 -43 43 18 -38 24 23 -38 22 30 -39 14 41 -40 4 49 -34 -16 54 -27 3 44 -38 -15 46 -14 -18 47 -18 -21 31 -17
7408a7j2O9l9m0P0k6l0P3m0m1Q4k2o6O3jo1O5%o8N7K1q3M5L2n8L2K8p0K5O1p9
$$ -17 -29 40 1 -39 31 5 -25 48 8 -33 51 29 -37 26 25 -36 29 29 -39 18 39 -44 1 33 -25 7 35 -35 -10 51 -28
7439b8J2N4n5lO3o1lP3n9k2O5l4k3O3m3m1R5k0o2N8om2N7k5l8O4Pq0N9Qm4L7K0
$$ -28 -16 38 -17 -20 43 -18 -21 52 -7 -29 36 2 -21 42 -1 -42 53 33 -29 29 23 -19 38 13 -25 39 46 -34 25 33 -11 26 46
7472D6q3M9L6p9K4N0o7J6L5n8OP6o0j5O4m2k1O3n6k2Q9m4l7N9ql5N4k3n9Q3ro1
$$ 46 -37 12 48 -31 -7 43 -24 -8 27 -31 -25 51 -9 -24 40 -2 -23 40 -16 -38 51 7 -30 29 21 -14 40 17 -42 41 32 -29
7504b9M7J4n2L5J4o2N6K0o2K3M1o6K0M7q2K9N9q0mO8m8jN4o7nP9m6l5O7k9k1N8
$$ -29 18 32 -20 15 29 -33 23 43 -19 4 45 -21 -1 46 -36 -7 52 -28 -32 36 -12 -13 41 -26 -31 48 2 -33 34 5 -16 42
7536D2l1m8P4jo5N2J0n4N8oo2M9L0p3L8K2n4L7J7n7K2N0p2NM1n5K9M6p0MO6m5
$$ 42 11 -37 37 36 -29 23 33 -21 37 31 -31 18 48 -25 13 35 -19 18 35 -22 0 50 -22 -17 24 -31 -2 44 -26 -22 44 -1
7568ak9O5m3j9O1m3k3P4j7n5O7j6m2N8po8O4J4p5M7J5m9L3K5o4L5L7o7J8L9o5
$$ -1 -30 35 -8 -27 34 -9 -32 42 25 -30 37 21 -21 37 30 -38 26 40 -35 12 27 -22 11 36 -28 7 44 -23 -5 34 -31
7599c1L1M4o5kP0o3pO1m6j2O7o5JO4m7j8N9n5j1O9j5n5M5K4q8R1Oj13Q6l2k7M8
$$ -31 0 44 -21 -23 47 -16 -23 38 -8 -20 47 -18 -17 47 0 -18 41 -14 -25 44 29 -26 19 43 -45 46 52 -61 25 -7 -34 14
7631A4J5o5O0rl2K2N1r5L7O1o7L5Oj05K9J42r3j1J9m4l8O0j1K4P9q5NL4m0k6P5
$$ 14 29 -36 24 15 -17 5 56 -39 -2 59 -8 27 33 -72 -43 99 6 -5 14 -30 -68 -8 -19 5 84 -1 4 38 -2 -28 47
7662D7k6n4N1mn1M9K2n8M2J0n6M0L0p5L4L2o2L5L4o8RO4o3JN4m8oO2n4j8O8n0
$$ 47 21 -33 18 14 -37 12 34 -24 18 28 -28 12 42 -33 1 33 -29 6 40 -28 -19 45 -18 -17 37 -11 -17 45 -9 -27 41 -9
7694ik2O8k8m9P7k7l7N4rm4O2rn9N0J0o0M8J7o0M0J9o4L9L0n9K5K8n5J8L8o1K3
$$ -9 -31 37 9 -40 37 10 -27 27 18 -26 36 27 -32 18 28 -32 16 33 -27 13 32 -32 7 37 -22 3 31 -24 -6 32 -29 -6
7726fN0n9kM0k5j1N1m5rO8l3m9N9k3k1N7k8m0O6Ko9M6Mm4L8Jn6N7J4o0K4L9n8
$$ -6 44 -15 -17 23 -2 -13 38 -7 -16 52 19 -30 29 6 -15 42 14 -26 40 42 -27 19 23 -21 17 18 -38 19 33 -27 -3 36 -22
7759b2K8J8n5K1M5o1LM2l3lM9m5mP0n2k9O7l4k3N8l8k6O6k2n0N7jl8M4j3n4O0
$$ -22 6 24 -31 -10 35 -26 -23 19 -14 -17 32 -13 -17 53 1 -28 39 5 -18 40 2 -24 42 20 -30 27 26 -12 32 19 -35 25
7791B5Mn9M2J7n2L8J5o6L9L6p1K0L5m8J8L4o5J7O2n3j3N4m0nN5n2j3N8l1k2N1
$$ 25 29 -30 12 29 -23 15 30 -36 3 39 -32 -12 23 -25 -7 27 -38 -21 41 -12 -25 29 -11 -16 39 -13 -26 32 1 -21 30
7822C0k7l1O6k6m6O5jn3N4j0m8N3Ro9M5K6o8L1K7m6K2J8n5K5M6m8pL8l9NM8m7
$$ 30 3 -28 38 12 -34 31 30 -23 31 21 -27 26 35 -34 11 37 -31 0 27 -19 3 21 -34 -9 37 -11 -18 20 -19 -14 34 -13
7854a3j0O8m6k7N7k4j8N1k9k0M0om9N2lm1M9ln6N5J2n9K8J5m3L7J5o4K5N1o5J7
$$ -13 -23 45 -1 -28 29 5 -13 38 9 -11 29 23 -26 26 23 -18 31 28 -28 27 39 -20 8 23 -20 17 32 -32 -7 44 -21 -4
7886dL0o1K8L5m3lN8n1j0M5k0k8M0l2k7Q2m4l7Q0o6NO4Op5P8m2j5PK2o3L8M5l4
$$ -4 26 -35 -7 28 -15 -18 40 -11 -21 24 4 -24 16 -16 -43 39 -5 -42 38 -28 -23 41 47 -28 50 8 -7 0 22 -41 -3 42 8
7919HL8m8k6K6Pl5k0O7r1K8R2j04M3M7m9k2Q0m5k2P0on7N0jo9Q0k3m3O1k9k8M3
$$ 8 46 -2 -28 -2 5 -30 -50 17 -74 -46 46 -58 -15 32 -17 -39 41 -4 -26 44 38 -19 31 30 -39 41 18 -25 36 7 -21 22
7951B2J6q4O1N0j03N2M8o1K5L8j14M7O1q2lM0m7K3M5n3ON5o2NN5m5pN1n1mN6m4
$$ 22 38 -46 15 65 -38 14 62 1 26 64 -50 -3 58 -24 -27 13 -34 -11 34 -19 -13 42 -20 -15 40 -5 -12 39 -12 -16 40 -4
7983dk0O2k0m0N6j2m8O5j3n3N1kn3N3Qo2M3K4o2L3K3o1K9L7o5K1N2n8J8L6o2J1
$$ -4 -24 38 18 -22 34 22 -26 39 26 -27 24 22 -31 22 30 -32 11 35 -27 6 29 -32 -3 34 -31 -10 42 -16 2 38 -24 -13
8015a3O3o1pN4m0j9O4m7j7P1m5l7O8j8l6N3j7n0O7j6n4M7K4o4N0%o3M7L1p0K5
$$ -13 50 -11 -18 36 -4 -23 41 -6 -23 48 3 -34 34 16 -20 33 16 -34 33 17 -37 10 34 -30 20 20 -43 4 35 -35 -10
8046a0M4o2J5M3m8J5L6n0mN3n1QN2n4j1O7m5k2O4m0j7M9k1m2P5k2m9N6j2m4M7
$$ -10 34 -28 -13 30 -18 -3 33 -17 -21 32 -19 -11 41 -13 -24 43 -2 -24 40 0 -17 32 11 -31 44 22 -27 29 17 -27 20
8077B0pm9O1%o0M2K5n7L2J5o6M7L0o3J5M3m2lN2m8MN5n9j5N9l1k3O4l8k6P3l7
$$ 20 13 -36 25 25 -35 7 32 -25 7 22 -44 3 33 -30 -15 28 -14 -17 35 -13 -9 46 -13 -28 31 0 -23 41 3 -23 50 13
8109A3m2P2j3m2N1k7m2N5ko9P1qm7M4Nn0L3L4p0K5M2o5K7M3o6K0M7o3LO5o2j1
$$ 13 -29 43 30 -12 39 12 -30 25 23 -46 25 17 -30 14 19 -31 2 36 -34 -9 33 -32 -5 38 -28 -8 39 -24 -21 44 -18 -29
8141b9P3m0k2O5m3k6N2k3l0O6l7l0O1j7m9O0on9P0j6n5O5Mm6K9jk9J9K4o9M2K4
$$ -29 44 4 -18 47 4 -22 30 7 -23 43 6 -24 37 20 -29 31 25 -34 36 20 -35 30 34 -12 17 16 -13 6 30 -39 3 27
8173B7j00K5J15q3MN2n5lO0m6rN5l7k5O6m3k4O2
$$ 27 -73 -48 67 -16 -12 40 -15 -18 42 -4 -13 42 5 -20 46 3 -21 41
8191D1
$$ Imaginary data points
##PAGE= N=2
##DATA TABLE= (X++(I..I)), XYDATA
0@%%%%%%%%%%%%%%%%%qJ6j6J6j6J6k4L2l2L5m3M9n7O5p3Q3r2J06j22J36j50J68
$$ 0 0 0 0 0 0 0 0 0 0 0 0 0 0 0 0 0 0 -8 8 -8 8 -8 8 -16 16 -16 19 -24 25 -32 33 -40 43 -49 57 -65 71 -79 89
39H9j87K07k29K54k82L12l44L80m18M59n08N59o15O80p51Q28r17J019j137J276
$$ 89 -98 109 -120 134 -148 164 -180 200 -218 241 -267 292 -323 357 -394 434 -483 536 -601 675
59F75j438J634j878K189k598L159l981N295p705J3419m8176k2464J47261j00604
$$ 675 -763 871 -1007 1182 -1416 1743 -2238 3057 -4648 8771 -39405 -61869 85392 -15212
73a5212m4793J23090p0010n1901J21407o2304o3269J13435m0421o7559J07342
$$ -15212 -60005 63085 -6925 -58826 62581 277 -62992 50443 10022 -57537 49805
84D9805m2971p4132J22941k7316j10180J17600J2522j18568Q8024L2812j14107
$$ 49805 6834 -67298 55643 28327 -81853 35747 48269 -70299 17725 50537 -63570
95f3570P2986M8976j13850M7981O3384r6890L3879N7032r5696L7276P1986j08430
$$ -63570 9416 58392 -55458 -7477 55907 -40983 -7104 49928 -45768 -8492 63494 -44936
107d4936J7138R5313r7036p950J00619q4838k5034J09561o8275n1037J04324l9970
$$ -44936 -27798 67515 -29521 -37471 63148 -21690 -46724 62837 -5438 -56475 47849 7879
119G879n7073Q7783l2667n5274R0874k7982p0451R0813j0278p9351Q3824K063
$$ 7879 -49194 38589 5922 -49352 41522 13540 -56911 33902 23624 -55727 28097 30160
131C0160q9393P9389K4412j00104N7477M6687q9901L6026M9245q1199K9573N5256
$$ 30160 -59233 20156 44568 -55536 1941 48628 -41273 -5247 43998 -37201 -7628 47628
143D7628q0856J7588O2997p4858Q594O7689p5049j638Q2185o9652k5182Q8176
$$ 47628 -33228 -15640 47357 -27501 -18907 48782 -26267 -27905 54280 -15372 -40554 47622
155D7622m9656l9862Q1644l6454m6918P9285k4653n5866P2794j2506n7717O7618
$$ 47622 -2034 -41896 39748 3294 -43624 35661 11008 -44858 27936 15430 -42287 25331
167B5331p881o3849O9288M854p5836O0427K2680p8211M7020L4598p7401L4855
$$ 25331 17450 -46399 22889 27743 -48093 12334 35014 -43197 3823 38421 -38980 -4125
179d125M6178p3686J9495N2164o4461J0437N2743o1374M719N9349n9262p021O5969
$$ -4125 42053 -31633 -12138 40026 -24435 -13998 38745 -22629 -17910 41439 -17823 -24844 41125
192D1125n1936j9280O9353m3269l1763P1454l0303m3637O6434j6791m8306N9778
$$ 41125 -10811 -30091 39262 -4007 -35770 35684 5381 -38256 28178 11387 -36919 22859
204B2859q627n1038N6433j396n5805N3021P500o0947M8347J8307o5981M0094L0962
$$ 22859 14232 -36806 19627 18231 -37574 15447 22947 -38000 10347 28654 -37327 2767 33729
217C3729o6813K8282M0748o3292J6465M6577n7560P004M9567n2216l0N2402m8833
$$ 33729 -33084 -4802 35946 -27346 -10881 35696 -21864 -14860 34707 -17509 -17539 34863 -13970
230a3970q097N7009m3335j8165N9647l5632k7695O0879k6406l7683N8875j4376
$$ -13970 -22067 34942 -8393 -26558 33089 -2543 -30238 30641 4235 -33448 25427 11051
242A1051m4150N2309n213m5822M8199J021n0093M4374J0062n3029L7997J7379
$$ 11051 -33099 19210 13997 -31825 16374 17395 -32698 11676 21738 -31291 6706 24085
254B4085n4502L3462K5757n8316K4735L7084n5653J2626M1610n0031N811M5100
$$ 24085 -30417 3045 28802 -29514 -4779 32305 -23348 -10722 30888 -19143 -13332 31768
266C1768m7427k780M9648m0716j1262M9147l5418j5481N2367l2314k5973N5344
$$ 31768 -15659 -18439 31209 -9507 -20769 28378 -7040 -22521 29846 -2468 -28441 26903
278B6903k1284l4956N0437j2141l7901M7899n441m4225M3661N608m5782L5135
$$ 26903 5619 -29337 21100 8959 -28942 18957 13516 -30709 12952 18560 -27222 7913
290G913J0332m4754L3345J5725n0098K7543K6703m9279J7291L0984m6194J2749
$$ 7913 18245 -26509 6836 22561 -27537 6 26709 -22570 -5279 25705 -20489 -7740
302g740L6677m6682K809M3673l9154o668M2160l3771r237M4901l2347j8245M8431
$$ -7740 28937 -17745 -14936 28737 -10417 -17085 25075 -8696 -17933 26968 -5379 -23624 24807
315B4807k3243k5460M4884j7872k8436M6557j2500l7807M4287j43m0742L5574
$$ 24807 1564 -23896 20988 3116 -25320 21237 8737 -29070 15217 15074 -25668 9906
327I906M864l9733L4075J0056m4929K8111J9853m2869J9743K1640m1393J8305
$$ 9906 14770 -24963 9112 19168 -25761 2350 22203 -20666 -923 20717 -20676 -2371
339b371K7868m4835Q884L6690l8178q55L5681l3720l393L9543l2425j2936M2604
$$ -2371 25497 -19338 -10454 26236 -11942 -12797 22884 -10836 -14229 25314 -7111 -20047 22557
352B2557k3162j8700L8467j9901k0131M2075j6788l0226M1795n245l3803L4882
$$ 22557 -605 -19305 19162 -739 -20870 21205 4417 -25809 15986 10741 -23062 11820
364A1820j084l4389L5041M610m1048K9376J5053l9039K0996J6206l7537K0529
$$ 11820 10736 -23653 11388 15998 -25050 4326 19379 -19660 1336 17542 -19995 534
376E34K1628m1463J2561K9940l6193M291K9469l3501K311L4518l3385p635L8573
$$ 534 22162 -19301 -6740 23200 -12993 -8702 20767 -12734 -10423 24095 -9290 -16925 21648
389B1648k4253j3785L4593k0727j4963L7385j8275k3492L7596q749k6753L2447
$$ 21648 -2605 -16390 18203 -2524 -17487 19898 1623 -21869 15727 6978 -19775 12672
401A2672n810k8032L4035q47l5371L0139R076l5162K2920J1363l4379K1981J6374
$$ 12672 6862 -21170 12865 12018 -23353 6786 15862 -19300 3620 14983 -19396 2585 18959
414A8959l7796J5393K3498l4113Q866K3965l2755O937K9039l3387j503L3740k6573
$$ 18959 -18837 -3444 20054 -14059 -5193 18772 -13983 -7046 21993 -11394 -12897 20843 -5730
427e730p739L1870k3253j0175L4425k0356j7618L4586j2437k1006L0901r208k2849
$$ -5730 -13469 18401 -4852 -15027 19398 -958 -18576 16010 3573 -17433 13468 4260 -18589
440a8589L1809m803k8819K9105L006k9859K4297O088l0707K2905J1292l3651J7388
$$ -18589 13220 8417 -20402 8703 11709 -18150 6147 12235 -18472 4433 15725 -17926 -538
453e38J7594l1558J1914J9354l0766R261K3771l0942K945K7690k7041k062K8346
$$ -538 17056 -14502 -2588 16766 -14000 -4739 19032 -11910 -8965 18725 -8316 -10378 17968
466A7968k4944n662L1321k2124j2237L2059j6003j6154L0251j2296j9070L0284
$$ 17968 -6976 -12638 18683 -3441 -15678 16381 378 -15776 14475 2179 -16891 13393
478A3393p849k3440K8208k152k5175K5347J398k7155K3599O485k9476J9247J1734
$$ 13393 5544 -17896 10312 8160 -17015 8332 9730 -17425 6174 12659 -16817 2430 14164
491A4164k8967J4803J4847k8612J1287J8718k8203O416K1969k6160K210K4088
$$ 14164 -14803 0 14847 -13765 -2478 16240 -11963 -5547 16422 -9738 -7528 16560
503A6560k4553j903K6592k2084o775K7936j8422j0953K8322j4776j4881K8239
$$ 16560 -7993 -9896 16696 -5388 -12163 15773 -2649 -13602 14720 -56 -14937 13302
515A3302j0585j8436K7252o347k1381K5747j906k3760K3363K362k5228K0720O362
$$ 13302 2717 -15719 11533 5186 -16195 9552 7646 -16114 7249 9611 -15617 5103 11465
528A1465k6609J7538J0913k6923J3172J4401k6059R599J7372k5604N400K0710
$$ 11465 -15144 2394 13307 -13616 -444 13957 -12102 -2503 14869 -10735 -5335 15375
540A5375k3559O99K2042k1029k287K3550j9592o542K5602j5857j1041K5044j2161
$$ 15375 -8184 -7485 14557 -6472 -8759 14791 -4801 -11343 14259 -1598 -12639 12405 244
553B44j3456K5150r526j7406K5098m425k0310K2202q91k0944K1212J839k3972
$$ 244 -13212 11938 2412 -14994 10104 5679 -14631 7571 6680 -14264 6948 8787 -15185
566a5185J9355P390k4876J4623J0323k3792J2512J2920k5160Q834J7690k3430
$$ -15185 4170 11560 -13316 1307 11630 -12162 350 13270 -11890 -3056 14634 -8796
578h796L459J8675k0828J481K0289k0666k902K3237j6675p629K1987j3355q859
$$ -8796 -5337 13338 -7490 -6009 14280 -6386 -9288 13949 -2726 -10355 11632 -1723 -10582
591a0582K2674j2100j3304K3781o779j6680K0751l580j6904K0624j647k0655J9562
$$ -10582 12092 -8 -13312 10469 3690 -12990 7761 4181 -12723 7901 6254 -14401 5161
604E161M117k1737J5051O300k0736J4391Q507k3489J1483J4001k2393O183J5037
$$ 5161 9278 -12459 2592 8892 -11844 2547 11054 -12435 -952 13049 -9344 -3161 11876
617A1876k0361M949J7094k1290N63K0744j7532m105J9471j4921m814K0871j4450
$$ 11876 -8485 -3536 13558 -7732 -7169 13575 -3957 -8062 11409 -3512 -8326 12545 -1905
630a905r696K2567r054j3164J9570o306j3322K0146m678j7579J9426J139j8702
$$ -1905 -11601 10966 1912 -11252 8318 2012 -11310 8836 4158 -13421 6005 7144 -11558
643a1558J5233K892j7985J5309N119k1314J2616J0673k0244P840J1255j8907P538
$$ -11558 3675 6567 -11418 3891 9010 -12304 312 10985 -9259 -1419 9836 -9071 -1533
656a533J3723k0866L346J7965j7631j104J6951j5729j559J8985j5868o566K1071
$$ -1533 12190 -8676 -5330 12635 -4996 -6100 10851 -4878 -6437 12548 -3320 -9886 11185
669A1185j0811r867J8455q773j0126J9870p511j4909J9661j701j6287J5776q2
$$ 11185 374 -9493 8962 189 -9937 9933 2422 -12487 7174 5473 -10814 4962 4880
682D880j5875J6165K147j9351J3668P540j8431R281Q071j7415R292J0544j9704
$$ 4880 -10995 5170 7317 -12034 1634 9174 -9257 24 8095 -9320 -28 10516 -9188
695i188N486J4855j6972J319J4207j5430R57J6265j5969l497J8689j1833o709
$$ -9188 -3702 11153 -5819 -4500 9707 -5723 -4766 11499 -4470 -7967 10722 -1111 -7820
708g820J6866j0202p203J8521r306j1726J8922m343j3527J5996k752j3590J6565
$$ -7820 9046 -1156 -8359 10162 856 -10870 8052 3709 -9818 6178 3426 -10164 6401
721F401p76j7068J4846M147j7051J1180N381j6551J0723P781j8441P554J1625
$$ 6401 5625 -11443 3403 7550 -9501 1679 7060 -9491 1232 9013 -9428 -1874 9751
734I751j6652L975J1834j5525L085J3863j5825o48J6121j2773l754J5431j1101
$$ 9751 -6901 -2926 8908 -6617 -3532 10331 -5494 -6142 9979 -2794 -6548 8883 -2218
747b218m953J6723j0016q563J7215o381j0496J5662m729j1428J6066k763j4315
$$ -2218 -7171 9552 -464 -9027 8188 1807 -8689 6973 2244 -9184 6882 4119 -10196
760a0196J4970J077j5115J2532K855j5397J1659N276j6796R230Q280j6147O591
$$ -10196 4774 5851 -9264 3268 6123 -9274 2385 7661 -9135 95 8375 -7772 -1181
773a181R534j5673M944J1679j5488J879J3462j3558p59J3907j2173k675J4988
$$ -1181 8353 -7320 -2376 9303 -6185 -4306 9156 -4402 -5161 8746 -3427 -6102 8886
786H886j0745n519J5487q232p573J5036o362r229J5046m222j1271J4220j600j2497
$$ 8886 -1859 -7378 8109 -123 -7696 7340 978 -8251 6795 2573 -8698 5522 3922 -8575
800h575J2984M88j3506J1921K809j4548J0211N174j4895Q374P208j4994O369R111
$$ -8575 4409 4897 -8609 3312 6121 -8427 1784 6958 -7937 437 7645 -7349 -980 8131
814H131j4646M197J0709j4022K005J2176j2989m51J3226j1473k627J3877j0043
$$ 8131 -6515 -2318 8391 -5631 -3626 8550 -4439 -4890 8336 -3137 -5764 8113 -1930
827a930m920J4497p914p134J4093n754q487J3698m071j0259J3395j467j1794J1827
$$ -1930 -6850 7647 -267 -7401 6692 938 -7549 6149 2078 -8181 5214 3747 -8047 3780
841C780P81j2240J0737K454j3369R484N109j3781P147O738j3227N863Q051j3781
$$ 3780 4561 -7679 3058 5512 -7857 1627 6736 -7045 102 6840 -6387 -524 7527 -6254
855f254L951J0493j2919J104J1186j1429j80J1939j1214k396J3581r184n124J3043
$$ -6254 -2303 8190 -4729 -3625 7561 -3868 -4048 7891 -3323 -5719 7862 -1322 -6446 6597
869F597p122n951J3211o274q289J3660l261j0192J1766j141j0122J1244j42j1951
$$ 6597 -525 -6476 6735 461 -7828 5832 2571 -7621 4145 3004 -7118 4126 3984 -7967
883g967J0620L098j2657P888M596j1844P127N663j3091N503Q650j2371K344R063
$$ -7967 2653 5751 -6906 982 5578 -6266 861 6524 -6567 -1064 7586 -4785 -2441 6622
897F622j0826J774R855j1495m00J2159r641l365J1603p750l742J2072p647o261
$$ 6622 -4204 -2430 7425 -4070 -4470 7689 -1952 -5317 6286 -1464 -5206 6866 -781 -7042
911g042J3210m678q387J1408k897q234J1518k225j0589J1399J243j1582Q604K623
$$ -7042 6168 1490 -6897 4511 1614 -6620 4898 2673 -7916 3483 4726 -6856 1748 4371
925D371j0727Q311L568j2459O950O789j1959L817P266j0604L446Q208j1587J200
$$ 4371 -6356 1955 5523 -6936 14 6803 -5156 -1339 5927 -4677 -1231 6977 -4610 -3410
939c410J0684r684j681J0010q117j840J0779q326m417J2191n538o562J0562m075
$$ -3410 7274 -2410 -4091 5919 -2198 -4038 6741 -1585 -6002 6189 651 -5911 4651 576
953E76o458J1162l567r037J1193k61r991Q830P43r461R095J708j1604P923N021
$$ 576 -5882 5280 1713 -7324 3869 3608 -6383 2447 3190 -6271 2824 4532 -7072 851 5872
968E872j1246N075N437j0360M964O664j1556K739R218r819M6Q596q645jR725r012
$$ 5872 -5374 -299 5138 -5222 -258 6406 -5150 -2411 6807 -3012 -2966 5630 -3015 -3016 6709 -2303
984b303k744J1170o256m800R674n013m704J0447m682p329J0723j580q329Q710
$$ -2303 -5047 6123 -133 -4933 4741 -272 -4976 5471 789 -6540 4183 2603 -5726 2984
998B984p56q084R193K32j0280Q260L345j0158N799L728r611N962N008j1096M079
$$ 2984 2228 -5856 3337 3569 -6711 1549 4894 -5264 535 4263 -5348 614 5622 -5474 -1395
1013a395P593r915J676P437r053J461Q608r521r82J0173p218k999R153o131l232
$$ -1395 6198 -3717 -2041 5396 -3657 -2196 6412 -3109 -4091 6082 -1136 -4135 5018 -1113 -4345
1028d345R940n736n623J0416l064o905Q858k003o978R118r84q832Q391J588r040
$$ -4345 5595 -141 -5764 4652 1588 -5317 3541 1538 -5440 3678 2694 -6138 2253 3841 -5199
1043e199O523K343q849O334L591j0077M863N863r466K892O235q969K351P329r243
$$ -5199 1324 3667 -5182 1152 4743 -5334 -471 5392 -4074 -1182 5053 -3916 -1565 5764 -3479
1058c479N13Q752p883j297Q604o984k067R362o366m074R815m460n383R122l313
$$ -3479 -2966 5786 -2097 -3394 5210 -1774 -3841 5521 -845 -4919 4896 436 -4947 4175 862
1073H62o048R169k180p491Q661j49q117P446J047q428O756K456r072N531M105
$$ 862 -5186 3983 1803 -5688 2973 2824 -5293 2153 3200 -5228 1528 3984 -5088 443 4548
1088D548q960M098N040q812L095O148q714J628P170q019J90P778p298j121Q348
$$ 4548 -4412 -314 4726 -4086 -991 5157 -3557 -1929 5241 -2778 -2588 5190 -2108 -3229 5119
1103E119o496k526Q743n417l770Q922m374n023Q909l094o070Q615j794o994Q127
$$ 5119 -1377 -3903 4840 -577 -4347 4575 201 -4822 4087 993 -5077 3538 1744 -5250 2877
1118B877k99p770P219J129q110O331K325q571N432L880q778L918M991q339K797
$$ 2877 2578 -5192 2027 3156 -4954 1377 3702 -4869 563 4443 -4335 -417 4574 -3765 -968
1133i68N758q172J598O878p579j03P317o566j062P683o150k395Q466m950l979
$$ -968 4790 -3382 -1784 5094 -2485 -2588 4729 -1837 -2899 4784 -1366 -3761 4705 -245 -4224
1148d224Q183l643m552Q049l055n682Q281j404o834P232j05o920O819O73p926
$$ -4224 3959 316 -4236 3813 758 -4924 3357 1953 -4881 2351 2246 -4674 2145 2818 -5108
1163e108O403K628q415M652L658p795M042M206q380L092N968p932J054O353o798
$$ -5108 1295 3923 -4492 160 3818 -3977 65 4271 -4109 -1017 4951 -2981 -1927 4426 -2372
1178b372M07O705o916r77Q027n551k931P491m201l124P553m109m507Q245k257
$$ -2372 -1965 4740 -2176 -3153 4874 -677 -3608 3883 -318 -3442 4111 2 -4505 3740 1483
1193A483n963O979r28n682O755o35o964O760J506p662M973K447o997M746K770
$$ 1483 -4480 2499 1571 -4111 2644 2009 -4955 1805 3311 -4351 622 3069 -3928 818 3588
1208C588q071M134M913p849J968N229o751J725N544p377N39P270o268j583O879
$$ 3588 -4483 -349 4564 -3285 -1317 3912 -2839 -1114 4430 -2947 -2408 4862 -1406 -2989 3890
1223C890m955j680P109n170l219Q102l270m816O903k008m549O840j889n989P068
$$ 3890 -1065 -2745 4364 -806 -4025 4077 807 -4009 2894 886 -3663 3177 1288 -4701 2367
1238B367L37o839N286J297o268N218J632p483M671L795p408K660M127o500K658
$$ 2367 2704 -4135 1151 2448 -3820 1398 3030 -4453 218 4013 -3395 -735 3392 -3108 -450
1253d50M506p411J522O368o467m82O144n403n37O544n799k053P697m089l621O738
$$ -450 4056 -3355 -1833 4535 -1932 -2414 3730 -1673 -2210 4334 -1465 -3518 4179 90 -3531 3207
1269C207l098l494P045k927n151P261p28o020N660J42n598N720N71o962N141K749
$$ 3207 109 -3385 3660 733 -4418 2843 2115 -3905 1755 1897 -3701 2019 2590 -4372 769 3518
1285C518o940L339L120o306L316L682p194K119N479o281K95N260n467L18N807
$$ 3518 -3422 -83 3037 -3269 47 3729 -3465 -1346 4133 -2148 -1853 3407 -2060 -1742 4065
1300D065n896j172O976m456k609O281l651k564O740l565m177P059j642n004N836
$$ 4065 -1831 -3003 3973 -483 -3092 3189 -462 -3026 3714 149 -4028 3031 1389 -3615 2221
1315B221r65m822O078n03o217N682J485o414M141J972o056M109K636o884L026
$$ 2221 1256 -3566 2512 2009 -4208 1474 2959 -3455 686 2658 -3398 711 3347 -3537 -511
1330e11M267o286J420M362n670J234N013o022j60O125m828j536N763m087j743
$$ -511 3756 -2530 -1110 3252 -2418 -1184 3829 -2193 -2353 3772 -1056 -2592 3171 -916 -2659
1345b659O169l941l059O587k472m014N867j729m165N994j146n286N714L78n702
$$ -2659 3510 -431 -3490 3097 625 -3389 2478 749 -3416 2578 1432 -3854 1860 2238 -3464
1360c464M692J057n669M499J765o338L693L109o196K475L606n857J907M287n915
$$ -3464 1228 2285 -3384 1115 2880 -3458 235 3344 -2852 -377 3229 -2628 -721 3566 -2349
1375b349P94N145n198l89N282m595j009N662m142k067N954l163l015N748k314
$$ -2349 -1555 3590 -1608 -1997 3285 -1310 -2319 3343 -799 -2866 3088 -75 -3090 2658 344
1390C44l569N674j552m317N429n46m826M963K82n227M549J143n577L936K025n726
$$ 344 -3225 2449 897 -3420 2009 1463 -3363 1600 1882 -3345 1204 2347 -3230 706 2731 -2995
1406b995L207K808n748K409L517n599J641M105n454Q00M750n076k36N156m430
$$ -2995 212 3020 -2728 -319 3198 -2401 -760 3345 -2109 -1309 3441 -1635 -1871 3285 -1145
1421a145j037N324l918j846N624l143k820N481k197l318N299j579m012N253n54
$$ -1145 -2182 3142 -776 -2622 3002 -141 -2961 2520 323 -2995 2304 725 -3287 1966 1412
1436A412m710M613M35m778M119R72n202L769K032n457K765K754n152K249L145
$$ 1412 -3298 1315 1750 -3028 1091 2063 -3139 630 2662 -2795 -30 2724 -2428 -179 2966
1451B966n374J609M165n140L46M475m407j17M625m411q68N365l704k100N185k728
$$ 2966 -2408 -799 3366 -1774 -1428 3047 -1360 -1477 3148 -1263 -2131 3234 -470 -2570 2615 -113
1467a13k373N090k508l189N443j333m136M651l67l987M355r5m701M301J283n184
$$ -113 -2486 2604 96 -3093 2350 1017 -3119 1532 1165 -2822 1533 1438 -3263 1038 2321 -2863
1483b863L032K024m617K677K215n116K231L497m986Q16L748m171N97L846m532
$$ -2863 169 2193 -2424 253 2468 -2648 -417 3080 -1906 -1090 2658 -1513 -916 2930 -1602
1498a602j19M923l826j522M639k873j537M630l060k378N330j906l511M517r86
$$ -1602 -1721 3202 -624 -2146 2493 -380 -1917 2713 -347 -2725 2605 699 -2812 1705 719
1513G19l245M430r46m156M624N38m790L317J244m171L137J324m910K857K831m903
$$ 719 -2526 1904 958 -3198 1426 1964 -2826 491 1735 -2436 701 2025 -2885 -28 2803 -2100
1529b100J342L092m070J204L184m541N16M387l865r25M076k963q39M141l272j739
$$ -2100 -758 2334 -1736 -532 2652 -1889 -1373 3014 -851 -1776 2300 -663 -1502 2639 -633 -2372
1545b372M983k185k876M233j353k585M207j460l496M546r6m153L444N05l708L433
$$ -2372 2611 426 -2450 1783 430 -2155 2052 592 -2904 1642 1546 -2607 837 1342 -2366 1067
1561A067O07m554L255K055m648J886K351l984J856K494m544J235L699m019r3L547
$$ 1067 1674 -2880 375 2430 -2218 -332 2019 -1965 -109 2385 -2159 -924 2775 -1244 -1337 2210
1577B210l272j09L740l551j026M543k507k100L915j799j932M041j874k858M337
$$ 2210 -1062 -1171 2569 -982 -2008 2535 28 -2072 1843 44 -1888 2153 279 -2579 1758
1592A758n95l478L397p6l194L477J00m043L291J385m135K204J602l724K283J868
$$ 1758 1163 -2315 1082 1006 -2188 1289 1389 -2654 637 2022 -2113 91 1693 -2031 252 2120
1608B120m361J713L021l983N85K967l431N35L268l718l33M053k877j285L660k336
$$ 2120 -2241 -528 2493 -1490 -905 2062 -1369 -834 2434 -1284 -1617 2436 -441 -1726 1934 -402
1624d02j275L903k298k241M166j142k829L411o33k697L483l89l490L321P57l669
$$ -402 -1677 2226 -72 -2313 1853 711 -2118 1293 660 -2037 1446 1057 -2433 888 1645 -2024
1640b024K429J078l442K397J412l963J925K343l712J013K436l342Q81K753l576
$$ -2024 405 1483 -1959 438 1850 -2113 -188 2155 -1557 -544 1892 -1450 -569 2184 -1392
1655a392K32L428l054n78L334k624p91L571k523j514L841j744k090L475j260k243
$$ -1392 -1160 2268 -786 -1364 1970 -654 -1445 2126 -397 -1911 1930 186 -1904 1571 311 -1932
1671a932L491q99k873L387j9l205K799N06l206K549R42l506K151J603l478J537
$$ -1932 1559 660 -2213 1174 1155 -2050 749 1255 -1951 598 1540 -1966 185 1788 -1690 -153
1687a53J961l327J126K345l284N52K794l011m7L002k713n03L195k437r81L328
$$ -153 1808 -1519 -393 1952 -1332 -780 2014 -997 -1044 1958 -755 -1258 1937 -500 -1481 1847
1703A847k050j460L383j621j910L324j115k263L184o38k641L030o5k975K698M80
$$ 1847 -203 -1663 1720 99 -1811 1513 398 -1865 1319 681 -1960 1070 1005 -1970 728 1208
1719A208l052K367Q61l218K064J468l328J418J926l070R69K149l019N53K650k858
$$ 1208 -1844 523 1384 -1834 230 1698 -1630 -212 1714 -1356 -387 1762 -1257 -704 1946 -912
1735i12j74K863k368n44K888k251r51L237j801j630L047j184j750K884j042k113
$$ -912 -1086 1777 -591 -1135 1753 -498 -1449 1788 -13 -1643 1404 220 -1530 1354 312 -1801
1751a801L073m53k683K653J80k641K405K70k848K325J003l173J691J446k849J396
$$ -1801 1272 819 -1864 789 969 -1672 733 1003 -1845 480 1483 -1690 1 1447 -1402 -6
1767fJ506l026J137K279k998K42K482k397MK433k490l56L017k041j251K902j475
$$ -6 1500 -1526 -389 1890 -1108 -866 1616 -781 -777 1656 -834 -1190 1827 -214 -1465 1437 -38
1784c8j257K720j439j647L037p08k389K481m9k181K346r7k538K489O20k961J764
$$ -38 -1295 1425 -14 -1661 1376 668 -1721 760 711 -1470 876 779 -1759 730 1350 -1611 153
1801A53J019k474J540J056k916J573J779k860M60K035k287M84K019k680J44K823
$$ 153 1172 -1302 238 1294 -1622 -49 1730 -1130 -670 1365 -922 -438 1581 -1099 -955 1868
1817A868k359p48K612j676p03K491j839j170L040j180j914K494m82j741K409o46
$$ 1868 -491 -1239 1373 -303 -1006 1485 -354 -1524 1516 336 -1578 916 434 -1307 1102 456
1833D56k219K657K90k757J865P17k278J743O20k717J742J502k831Q08J703k285
$$ 456 -1763 894 1184 -1573 292 1009 -1269 474 1094 -1623 119 1621 -1210 -402 1301 -984
1849i84P99J640k693N52K459k438l63K345j818k95K289k112o96K890j513j485
$$ -984 -185 1455 -1238 -686 1773 -665 -1028 1317 -501 -796 1493 -619 -1315 1575 62 -1423
1865a423K483r34j342K441j042j850K725k12k378K050K43k051J986K12k535J968
$$ -1423 1060 126 -1216 1225 183 -1667 1058 846 -1532 518 761 -1290 696 908 -1627 341
1881C41J069k673J127J339k245J036J381k603P51K121k380l5K061j917k4K121
$$ 341 1410 -1263 -136 1203 -1042 -6 1375 -1228 -477 1644 -736 -771 1290 -627 -651 1470
1897A470k154m56K657j629j152K346j171j029K380j248j561K646n62j977K118
$$ 1470 -684 -1140 1517 -112 -1264 1082 -89 -1118 1262 14 -1547 1099 537 -1440 678
1912F78j85j804K147j31k360K139O79k459J443Q50k163J353J056k487R98J760
$$ 678 493 -1311 836 705 -1655 484 1163 -1296 147 997 -1166 187 1243 -1244 -246 1514
1928A514k360L87J760k053L11J920k215j70K359j708p66K175j383p57K272j392
$$ 1514 -846 -459 1301 -752 -441 1479 -736 -906 1453 -255 -1021 1154 -229 -986 1286 -106
1944a06j269K494q09j646K153m87j634K167l34k039K103K74k204J659N15k109
$$ -106 -1375 1119 310 -1336 817 330 -1304 863 529 -1510 593 867 -1337 322 837 -1272
1960a272J596P41k394J322J283k315Q03J447k121O23J648k186K06K028j906k67
$$ -1272 324 1065 -1329 -7 1276 -1039 -236 1211 -910 -287 1361 -825 -619 1409 -497 -764
1976g64K025j630m86K135j468r28K296j085j289K144p33j436K092m83j713K006
$$ -764 1261 -369 -855 1280 -188 -1116 1180 95 -1194 950 217 -1219 873 390 -1323 683
1992F83q3j914J789K68k020J612N53k138J394Q77k162J109J158k139Q01J418k078
$$ 683 600 -1314 475 743 -1277 335 888 -1250 144 1021 -1141 -32 1126 -1013 -212 1206 -872
2009h72N12J622k013K06J855j846j94J978j567m93K010j401p80K145j109j174
$$ -872 -360 1262 -751 -545 1310 -536 -730 1248 -319 -812 1198 -203 -983 1162 53 -1121
2025a121K073o99j364J953m93j598J954q5j878J649L36j860J440M64j993J371
$$ -1121 952 253 -1111 842 349 -1249 705 620 -1258 391 727 -1133 307 771 -1222 149
2041A49Q87k144R46J209j910O64J261j963N25J641j904jJ771j557j80J751j578
$$ 149 1036 -1108 -162 1047 -863 -199 1062 -901 -376 1265 -639 -640 1131 -426 -606 1145 -433
2058d33l68K057j344r33K010q72j005J852q51j226K024m29j664J726L2j579J530
$$ -433 -801 1256 -88 -1021 989 117 -888 964 113 -1113 911 482 -1182 544 576 -1003 527
2075E27N3j803J584N90k071J055R40j740Q43R08j889P67J412j913J48J581j488
$$ 527 580 -1223 361 951 -1120 -65 875 -865 -22 886 -1003 -236 1176 -737 -589 992 -496
2092d96N2J488j634j30J936j407p33J822r19o95J678j053r24K040o62j456J687
$$ -496 -444 1044 -590 -720 1216 -191 -924 898 -21 -716 962 -91 -1015 1025 363 -1093 594
2109E94j72j312J563k51j578J730K63j920J196O24j584J064N51j850J055J151
$$ 594 422 -890 673 422 -1156 574 837 -1083 113 737 -847 217 768 -1082 -27 1124
2125A124j929L69J333j464K86J234j678J50J771j501n32J667r94m65J550j158
$$ 1124 -805 -436 897 -567 -281 953 -725 -575 1196 -305 -837 830 -164 -629 921 -237
2141b37o98J959p86j260J615l05j066J487m61j340J743M6j722J264L92j420J154
$$ -237 -935 1024 238 -1022 593 288 -778 709 248 -1092 651 697 -1025 239 631 -789 365
2158C65K75j705J232Q44j823N88J014j435N58R36j681M66J498j595j95J482j125
$$ 365 640 -1065 167 1011 -812 -224 790 -645 -87 849 -832 -366 1132 -463 -658 824 -301
2175c01k02J400j271m32J784r30r57J552n17q58J451n95j132J679j32j498J273
$$ -301 -503 897 -374 -806 978 48 -909 643 126 -732 719 124 -1008 671 539 -959 314
2192C14J77j265J171J38j522J236O13j661P39P83j378O89P64j603N90J230j529
$$ 314 491 -774 397 535 -987 249 862 -799 -60 723 -655 34 798 -805 -215 1015 -514
2209e14P7J233j203N2J228j338j73J588j087n90J415p44o05J415p56q94J570l42
$$ -514 -437 796 -407 -355 873 -465 -638 950 -137 -727 688 -56 -661 754 -2 -896 674 332
2227C32j202J288q1j117J241m4j357J239L85j471Q63N54j323P72O47j488O40J011
$$ 332 -870 418 337 -780 461 417 -940 299 684 -787 76 630 -693 79 726 -762 -122 889
2245H89j431K66J038j233J94J132j321k6J375j098l68J307q97m20J359q84o33
$$ 889 -542 -276 762 -471 -277 855 -466 -492 883 -215 -583 724 -173 -593 766 -118 -751
2262g51J434n63q68J262l47r24J300k66j153J287R3j255R91J92j201R72M26j369
$$ -751 683 120 -748 514 167 -757 543 277 -876 411 504 -751 240 432 -769 203 629 -740
2280g40P19P63j378M89Q86j251K68J023j232P1J172j083j74J225r55l35J265q36
$$ -740 -21 742 -636 -147 739 -512 -244 779 -453 -382 790 -293 -467 758 -197 -532 733 -103
2298a03n22J306o55p17J290m60q79J257k78r84J181j19j074J101Q4j174R53L09
$$ -103 -625 681 26 -691 599 139 -740 517 239 -745 436 317 -757 344 428 -746 207 516
2316E16j210Q00M63j242O75O97j282M00Q71j142K23R31j126Q4J124j061k16J194
$$ 516 -694 106 569 -673 2 699 -583 -183 688 -454 -231 700 -426 -342 782 -279 -495 699
2334F99q19l64J133p49m90J257n76p78J196l01q25J070k59r08J152m0j142R58
$$ 699 -120 -484 649 -100 -590 667 91 -687 509 208 -617 453 194 -714 438 398 -744 214
2352B14K25j042P78K51j110Q10M96j243N07P25j069L61O79j118L25R66j129n7
$$ 214 439 -603 175 426 -684 126 622 -621 -114 611 -458 -97 582 -536 -211 755 -374 -431
2370d31J061q21j74R60q46k30J188p31o09J133l74o54J001l94p40J169j84j032
$$ -431 630 -191 -365 595 -251 -481 707 -24 -633 500 126 -528 473 79 -661 508 324 -708
2388g08R48J41r20P95O7j003Q85L62j196N70N93r79M28N21j067M52Q28j126O7
$$ -708 240 381 -539 256 323 -680 205 567 -629 -59 534 -445 -17 504 -563 -111 717 -409 -342
2407c42R18q22J7P92r12k8J086q23m37J045m70m32Q97n36n43J142l31q77R24L
$$ -342 576 -246 -229 563 -349 -377 709 -114 -551 494 24 -408 489 -47 -590 552 221 -656 268 271
2427B71p52P94q3r06R47K43j125N93M85q96M75L83j020N51P07j098J41Q35p99
$$ 271 -481 313 230 -676 271 514 -611 -18 467 -429 46 429 -591 -40 667 -431 -290 545 -254
2446b54R1O96r20O6J013q22l54R59n15k92Q42o51l79J108m49p55R36j35o36Q14
$$ -254 -163 533 -387 -321 692 -130 -484 475 -40 -332 510 -141 -520 588 139 -616 320 185 -451 363
2466C63k30p55R60O9j009O71L13q08N62K40r67O14N66j035K34P00p74J69O19r07
$$ 363 133 -622 338 407 -602 69 382 -426 136 376 -591 23 589 -446 -212 488 -286 -117 502 -405
2486d05J46R12q44k25Q84n53k18Q18o58l25J026m53o34Q75k20n42Q03k91o72R28
$$ -405 -259 653 -191 -416 468 -85 -303 515 -143 -468 558 105 -529 346 126 -416 387 96 -576 352
2506C52l6q71P02J62p59O26J34q72O31M17r54L52N33p81L07N29q83K21P61q19
$$ 352 316 -555 147 309 -450 176 310 -562 69 486 -468 -116 417 -364 -57 472 -411 -190 571 -248
2526b48p7P80o12j18P68o51k52R24m82m78Q25l11m66Q04k99o25Q69q7p57O96N9
$$ -248 -325 455 -157 -275 493 -158 -410 514 32 -446 379 68 -398 406 107 -518 351 264 -493 203 262
2547B62p04O49R2q12O22L00q60M20M06p84L76M47q36K69O25p68P3O44o55kP01
$$ 262 -442 207 299 -513 109 409 -451 -31 375 -409 -33 414 -422 -153 472 -296 -223 421 -234 -236 465
2568D65o62j40Q11n40l08P67l99l82P98l38n24P91j56o23P08m6o55O64M8p33N97
$$ 465 -197 -337 474 -66 -374 393 -6 -388 410 72 -452 339 183 -440 268 222 -433 231 279 -454 143
2589A43K15p86M83L16p66L85M11p72K75N02p33J77N64o86N1O40o35m0O76n75j64
$$ 143 358 -428 55 371 -395 -10 401 -371 -96 406 -327 -150 414 -272 -221 419 -216 -256 420 -155 -319
2610c19P30n04k63P36l75l83P21k86m51P21j72n86O75j3o32N93O4o62N56J88p37
$$ -319 411 -93 -356 380 5 -378 343 57 -394 327 155 -431 244 231 -401 192 256 -406 150 338 -399
2631c99M28L37o88L18L58p00K77N02p50J13O05n95mN66n85m1O83n62k17P01l78
$$ -399 29 366 -322 -4 354 -346 -69 433 -317 -204 401 -194 -198 368 -217 -258 425 -137 -354 347 -31
2652c1k75O19l62l09P28k79n09O67q2n02N55q2n29O21N3p01M89K38o08L56K25
$$ -31 -306 313 -49 -358 370 91 -418 249 167 -335 220 138 -391 230 283 -418 71 309 -299 57 282
2673B82o34L96L71p32J74N21n59P3M46n90P3O16n91j81O76l84k13N46l99k33P17
$$ 282 -352 44 415 -317 -143 378 -181 -108 338 -252 -179 437 -154 -335 341 -43 -256 290 -109 -342 375
2694C75l45m51O36r9m16N20j65m25O39m9o33N02J67n35L82Q9n52M69K39o72K40
$$ 375 30 -421 215 116 -300 220 55 -370 269 220 -413 89 256 -279 103 192 -360 109 348 -324 -84
2715h4M02n09J61L10n67J90N25o07r4N88l76j11M64m37j15O42l69l93N98j28l58
$$ -84 318 -191 -30 280 -287 -97 428 -179 -273 315 -61 -172 292 -145 -260 382 13 -380 218 90 -268
2736b68M86j98l84O20o2n88M80J22m68L77L5n08M61K22o51K64L40m68J82K51n41
$$ -268 218 20 -364 256 194 -394 86 208 -260 117 152 -356 105 327 -324 -60 280 -188 -6 245 -296
2757b96K36M36n85NM89l81j4L85m44k5N68m01k82N42j76k60M40k59k97N88j37
$$ -296 -60 376 -209 -204 285 -96 -110 275 -169 -194 374 -27 -309 233 57 -203 237 -22 -319 269 132
2778A32m87M53N7m07L78km72M62J44n79K76K83m41K02K18m97K39L74n30L2M31
$$ 132 -355 98 155 -252 126 124 -348 114 258 -321 -45 238 -203 -1 217 -280 -41 333 -197 -165 266
2799B66l89K1L52m22PM94l94j82M72k13j85M00k55k17N14j73l88M36k6l38L76
$$ 266 -123 -102 250 -172 -165 329 -65 -247 225 12 -173 227 -28 -245 269 96 -292 144 118 -220 156
2820A56n6l83M15P4m82K94J80m15K46J65m54K18L16m82R2L50l63M3L34l91J3M09
$$ 156 100 -283 132 206 -276 18 198 -217 29 194 -260 -42 274 -208 -116 234 -129 -86 248 -143 -130 279
2842B79l90q2L75j95k19M09k32j38M38k13k68L92o2k98L81p9l43L89J3l87L14
$$ 279 -111 -193 182 -13 -232 177 -55 -193 245 32 -236 156 94 -204 177 98 -245 144 157 -230 84
2863H4R0l81K71J20l97K22K08m01J30K63l81R5K98l72K9L57l41n9L77k85j00L86
$$ 84 174 -207 64 184 -213 9 217 -184 -54 209 -172 -77 221 -151 -122 235 -106 -165 212 -73 -173 213
2885B13k46j64L94j74k22L71j08k80L70o7l08L41Ml29L04M3l39K59J16l50K00
$$ 213 -33 -197 197 23 -199 172 64 -216 154 87 -221 120 124 -205 99 142 -197 62 178 -172 28
2906B8J49l38J49K09l54R4K58l29M2K71k97NL07k80p7L41k17j25L22j80j58L55
$$ 28 177 -161 -12 197 -157 -63 195 -134 -92 179 -118 -113 194 -86 -163 178 -39 -164 158 -22 -180 175
2928A75j50k41L45m5k71K92j9k65K83L3l53K62J18l18J81J28l06J77J89l65R4
$$ 175 25 -216 129 84 -187 105 86 -179 104 137 -216 46 164 -154 27 155 -151 26 215 -150 -56
2949e6K48k81K5K27k81N1K80k92o3L17j90j14K56j71j03L23j59k18L07m1k16K33
$$ -56 192 -89 -64 163 -118 -67 213 -79 -142 175 -15 -129 127 -44 -147 176 17 -201 106 65 -151 82
2971H2m0k12K96j4l12K36J08k87J58R3k68J88J58l34Q7K42k47K1J81k44M5K69
$$ 82 42 -170 126 112 -200 36 144 -143 15 108 -160 28 186 -148 -61 181 -66 -45 136 -108 -63 206
2993B06k85p1L16j55j11K13j65o4K91j69j96K93l9j91J95n1j66K51qk80K29Q8
$$ 206 -79 -150 166 11 -100 113 -52 -116 175 6 -190 103 64 -127 68 17 -149 102 94 -186 43 131
3015A31k41J39N6k26J90J14l01Q7K20k18J7J56k27O4K45k85n3K64j32q9J79j42
$$ 131 -110 29 85 -141 49 163 -138 -51 169 -49 -32 124 -103 -39 206 -79 -132 132 0 -89 90 -52
3037e2m9K81j68j95K86m1j78J91o4j50K44k9k55J91R3j90J12K6j92J80J00k67
$$ -52 -101 180 12 -183 103 62 -116 75 11 -139 105 76 -179 12 105 -85 27 53 -139 41 141 -126
3059a26P5J91j87K9J14j98P6J96k29n3K33j17p4J63j53n0K56j52j58K52l7j55
$$ -126 -51 140 -47 -18 96 -102 -26 170 -59 -112 121 4 -70 93 -60 -110 146 -6 -164 88 51 -104
3081a04J69n7j52K50l3k48J87Q3j92J20L9j97J72J00k61P6J69j74L4J13j80N3
$$ -104 65 8 -144 106 73 -175 12 95 -97 23 62 -135 37 137 -124 -48 121 -53 -19 94 -86 -33
3103c3J88k15l1K26j47m8J67j41n1K21j32j44K10l8j36J66n8j35K06j4k16J76
$$ -33 155 -60 -91 135 -12 -60 107 -34 -85 136 4 -140 70 32 -104 62 4 -131 75 61 -155 21
3125B1N2j85J23N8k05J49R8k30Q6J55k03N5J45k11M9J89k16j9K24j55m9J81j46
$$ 21 73 -112 11 69 -136 13 111 -119 -33 122 -81 -26 119 -92 -43 146 -70 -89 135 -20 -69 112 -34
3148c4m9K07j17j16K02o3j37J88n6j42J92j8j85J64L2j86J41N1j98J21J03k27
$$ -34 -83 124 7 -109 93 30 -107 81 25 -117 75 57 -128 36 68 -118 23 74 -124 -3 100 -127
3170a27J05J12j84O3J43j89K6J69j78pJ88j68k9J93j23q4J97j10r0K05r4j33K30
$$ -127 -22 90 -94 -31 112 -77 -51 118 -60 -67 121 -47 -76 117 -6 -90 107 -3 -93 112 18 -115 115
3193A15q5j33J71l4j30J63Nk05J69O8j81R9O5j87Q6R8j61P1J14k22N8J79j61m4
$$ 115 30 -103 68 34 -96 67 72 -133 36 104 -77 22 87 -100 -14 84 -77 -6 108 -114 -56 123 -38 -82
3217h2K02j67k4J84j61o3K14j07r8K06r0j29K22p2j23J78o2j74K30m9j86K02L9
$$ -82 120 -47 -71 113 -48 -111 103 -4 -102 104 14 -115 107 35 -88 90 28 -146 84 35 -151 51 90
3240I0k00J17P1j79J21P6k16J00J32k03N2J31j67L5J46j90oK10j50n3J70j24l9
$$ 90 -110 7 78 -101 20 96 -120 -20 112 -91 -39 92 -75 -40 106 -84 -90 120 -30 -83 87 -37 -76
3263g6J95j37r8K12o5j36J73m6j16J91n4j87J88L6j83J26L4j67J49P0k49J22J47
$$ -76 119 -18 -116 96 31 -105 68 22 -94 97 43 -144 44 80 -103 23 57 -110 39 109 -140 -18 129
3286A29k07M4J19j67O2J48k31L1K01j53m6J59j23k5J80j58r2K28q0j27J76o4r4
$$ 129 -78 -34 85 -82 -20 128 -103 -72 129 -24 -70 89 -34 -59 121 -37 -129 99 19 -108 68 4 -90
3309i0J93p4j77K05K1j80J34K0j73J78J9k16J37J07k05P8J01j94J06J41k41M7
$$ -90 103 29 -148 57 78 -102 32 52 -121 57 76 -140 -3 104 -101 -23 78 -116 -10 131 -110 -63
3331f3K00j85j6J62j60J0J93j73q4K29r6j08J83j04q3K12r5j64K17pj71J54j5
$$ -63 137 -48 -64 98 -62 -52 141 -32 -116 113 17 -91 92 -12 -95 117 22 -142 75 68 -103 51 36
3354C6j51J86Nk20J47R0j76Q5O9j75J05J13k30O5J66j77rJ63j83M7J82j91n3K16
$$ 36 -115 71 76 -144 3 93 -83 2 71 -104 1 114 -116 -51 115 -62 -71 92 -91 -44 138 -53 -106 110
3378A10j13p9J95j30q1K24r2j71K12k8j50J60j7j65J97qk02J60O1j82J02O4j79
$$ 110 -3 -82 113 -17 -98 126 34 -137 75 47 -103 57 40 -125 72 64 -138 22 83 -99 3 67 -112
3401a12J24R7k24P7J49j85L9J27j73K8J79j92k2K07j25p8J79j18o0K05j00j38
$$ -112 12 109 -115 -38 111 -74 -35 92 -81 -53 126 -66 -88 119 -6 -84 95 -23 -83 122 22 -116
3423a16K17m2j59J90m6j68K15k8j85J67M7j98J46M4k00J42P8k27J01J26j94O4
$$ -116 101 59 -100 90 44 -124 91 63 -122 45 92 -106 40 84 -116 26 104 -123 -22 104 -90 -26
3445b6J31j96M2J74j97jJ80j47m1J84j33n7K04j27j04K23r0j14J89n5j46J93k3
$$ -26 105 -91 -49 125 -72 -73 107 -40 -81 103 -30 -87 117 -10 -114 109 19 -95 94 39 -107 86 63
3468F3j72J72J6j93J62M8k11J43O9k08J20R3k12Q3J41k18N9J58j95K6J71j88M
$$ 63 -109 63 79 -114 48 96 -115 28 97 -111 9 102 -110 -27 114 -104 -45 113 -82 -56 115 -73 -69
3491f9J98j70n7K23j41p8K06j12j07K17q9j35K00l1j71J97k1j88J91K1k00J47
$$ -69 129 -41 -98 125 -16 -94 112 0 -107 110 21 -114 86 55 -116 81 60 -128 63 84 -116 31
3513C1O1j91J41O9k28J17J18k15O6J50k06M7J56k07J8J99j88k8K06j60m7K16j49
$$ 31 92 -99 42 111 -117 0 118 -97 -31 119 -87 -40 116 -91 -73 126 -62 -90 116 -44 -91 125 -24
3536b4r8K37r9j32K23p4j49K22n7j81K10mj89J63K1j80J57O2k34J35J16k22R9
$$ -24 -122 115 16 -116 107 33 -116 106 49 -132 78 74 -115 48 69 -111 46 108 -126 9 125 -97 2
3559BJ16k10P2J44k18K7K00j85k1J89j70k0K12j77p4K39j17j17K10j03j21K43
$$ 2 118 -92 -20 124 -94 -67 133 -52 -73 116 -54 -74 138 -39 -113 126 9 -108 102 -1 -122 121
3581A21q3j75K24qk01J89Kj93K01J6k37J55J14k39J14R8k12J09J33k36N4J88j99
$$ 121 38 -137 87 79 -122 67 69 -124 77 93 -144 11 125 -114 0 98 -114 -5 128 -108 -54 134 -65
3604f5PJ72j82PK03k03n8K48j37r4K14j36r0K35j06j64K41l0j84J87j0j70K07
$$ -65 -58 114 -68 -61 142 -61 -119 129 -8 -102 112 -24 -114 121 15 -149 92 62 -122 65 55 -115 92
3627I2Lk42J85Q7k38J32P9k28J47J17k56P5J85k21L6J61k19M8K04k12l8K36j58
$$ 92 95 -147 38 125 -113 19 98 -130 17 134 -122 -47 138 -83 -47 114 -105 -57 147 -65 -103 133 -25
3650b5o7K07j40q1K50j38j50K41n1j63K02n1j66K30j9k19J94N4k25J58M8k14J56
$$ -25 -92 115 -25 -106 144 6 -144 97 46 -117 85 34 -132 98 79 -140 54 108 -117 41 89 -125 31
3673C1R4k53J13J47k22P0J47k37P0J90k44LK27j91l8K17j68n8K36j67j01K50p4
$$ 31 125 -128 -15 132 -90 -20 127 -110 -40 150 -94 -91 136 -55 -93 124 -44 -102 134 -33 -134 116 42
3696D2j60K10m4j62K24l2k36K03N7k06J53L5k39K02P2k50J37J44k40Q0J17j84
$$ 42 -118 92 48 -114 110 78 -158 45 102 -104 49 84 -155 47 119 -131 6 150 -90 -10 107 -77
3718g7J2J84j79n3K65k51o1K92k35j8K18j23j16K88q6k52K82r2j50L10j93j43
$$ -77 -65 119 -60 -113 152 -99 -160 132 -103 -121 97 -26 -142 146 60 -192 90 -2 -152 158 -35 -178
3740a78K35J5k03J93L2k42K55k9j97J59J01k46J43P1k75J88J11k48K0J86j66K6
$$ -178 57 72 -131 62 94 -148 107 78 -119 40 141 -105 38 109 -166 22 133 -115 -95 91 -75 -49
3762d9K44k64l8K82k20p2K34j49l5J66j18j41K78q9j80K57o1j86K18l9j88K01
$$ -49 195 -69 -107 175 -45 -117 117 -32 -67 99 -19 -160 118 29 -151 106 45 -141 77 38 -150 51
3784E1P1k65K35%k67K24R5k69J35J43k90P9K13k49N1J99k43jK27k07l0K46k05
$$ 51 122 -143 92 92 -175 49 144 -125 10 153 -137 -58 155 -94 -43 156 -87 -88 139 -68 -98 148 -57
3807e7n3K51j69r6K44j11j33K59j02j91K70n0k27K47j1k27K28L0k63K06Q7k84
$$ -57 -110 141 -28 -124 120 9 -124 135 33 -158 112 62 -165 82 71 -156 72 102 -161 45 132 -152
3829a52J78J11k82J27J93l17J52J73k50M1J66k32M6J59k00n9K52j86o3K97k16
$$ -152 26 137 -145 -18 175 -142 10 183 -67 -26 140 -92 -46 113 -87 -146 106 -80 -143 154 -62
3850f2q0K89j61j56K68j11j17K63j19j76K45lk39K47L2k74K82K4l22K39M6j99
$$ -62 -142 147 -14 -170 98 -13 -130 133 14 -162 83 80 -159 88 120 -154 128 152 -170 69 115 -84
3872h4M1J89k91J70J17k14j9K46k80M0K22j15r4K61k12m1J81j20k03L55p2k54
$$ -84 -43 146 -145 25 142 -72 -91 155 -125 -85 137 22 -72 189 -23 -64 117 -3 -206 149 77 -177
3894a77K83p3k00L40j39j99K26N5k54J89N5k54K18N5k91J68J45k60J08J37k60
$$ -177 106 33 -167 173 34 -165 61 116 -138 51 106 -148 70 125 -166 2 147 -113 -5 132 -128
3915a28R5K10l08M2K57k48oK29k24j8K77k22j09K99j49j58K76j34j39L05j18k31
$$ -128 -33 177 -131 -89 168 -80 -86 143 -81 -99 178 -44 -153 146 -3 -161 115 -19 -158 147 29 -202
3937b02L03k1k39K47qk50K57N2l24K14J22k89J56J22k91J58J71l18P5K43k67K5
$$ -202 101 80 -159 88 80 -170 87 139 -185 29 151 -138 18 140 -151 7 178 -140 -65 178 -89 -64
3959f4K19k55PK81k58o5K95j74j07K78j87j31L06j08k33L07n5k27K46kk53K94
$$ -64 155 -100 -93 188 -70 -135 160 -14 -121 157 -30 -161 145 37 -196 111 56 -171 75 73 -180 114
3981A14k7k80K63Q1l39K48J02l65K30J41l13J06K23k92P2K06k91M6K76k89m3L04
$$ 114 87 -193 70 151 -188 60 162 -203 27 168 -145 -39 184 -108 -36 170 -121 -75 201 -88 -131 173
4003A73k19p4K83k15j04L17j64j75L12j09j93K79p7k22L19l7k97K80M4k89K34
$$ 173 -46 -120 163 -52 -156 161 -3 -178 134 25 -168 111 34 -188 131 94 -203 77 121 -168 66
4024F6O1l25K41J21l32J56J92l20J13K17l19Q6K50l05KK82k57l9K96k46p0L27
$$ 66 127 -198 43 164 -168 -12 180 -140 -27 190 -129 -43 207 -98 -96 186 -71 -110 186 -60 -130 197
4046A97k28j28L03j46j72L12j26k00L22p6k58L01pk67K53L0k95K38R5l29K07J33
$$ 197 -31 -159 144 -2 -174 138 12 -188 134 58 -200 101 94 -173 80 110 -185 53 148 -181 26 159
4068A59l18J51J76l14J10K32l29P5K49k98K7K76k79l1L04k47p4L09k08j37L38
$$ 159 -159 -8 168 -146 -36 196 -133 -58 191 -107 -80 196 -83 -114 190 -57 -131 178 -30 -167 171
4089A71j63j77L13j26k05L21q3k37K93j1k73K60M3l00K38Q3l28K01J49l24J48
$$ 171 8 -169 144 18 -187 134 51 -186 107 96 -177 83 126 -174 64 147 -181 20 169 -155 -7
4110gJ73l04J21K01l11O0K65k96JK77k60l3L10k52r4L35j90j57L25j56j85L31
$$ -7 166 -138 -17 184 -127 -67 198 -98 -97 180 -80 -113 197 -55 -149 186 -4 -161 164 8 -177 154
4132A54j13k46L31m8k62K75j6k61K93J6l29K42J21l32J98J29l11J71J78l41J06
$$ 154 41 -205 126 78 -184 91 75 -186 107 123 -206 36 157 -175 23 152 -159 12 190 -151 -45
4153d5K43l03L7K53k90K1K83k78n9L23k12j18L09j82j44L54j77k06L17p8k33L03
$$ -45 198 -105 -68 185 -105 -84 199 -79 -138 185 -27 -145 164 -18 -162 192 15 -191 126 48 -185 118
4175A18p1k27K82j2k47K47R1l41J82J15k92K42R4l26J70J59k79M3K00k28K2K50
$$ 118 47 -180 102 90 -157 90 181 -160 22 137 -155 87 181 -145 25 184 -95 -52 148 -80 -58 192
4197A92k46l1K39k05n5K55k30r2L35j53j73L27j17k41K88r2j85L14m0l12L16M6
$$ 192 -54 -85 154 -51 -106 149 -81 -173 162 9 -164 163 46 -195 93 1 -184 130 90 -222 94 140
4219A40l06J81J21l10L06O6l86J79J93l26J26J72k87R9K45l49M4K89k64k0K66
$$ 140 -166 15 136 -174 132 198 -188 -9 184 -142 -16 156 -131 -32 213 -136 -92 197 -67 -87 179
4240A79k65k6L17k47j33L43j61j52K83j31j96L54j10k69L20j9k65K63Rk90K88
$$ 179 -86 -112 205 -42 -175 168 7 -145 138 7 -189 165 55 -214 106 87 -178 85 94 -196 92
4261I2N9l47K25J35l05J52J50l30J56K18l51P4K59k78K9K51k92LL02k68r3L38
$$ 92 151 -196 29 164 -141 11 161 -169 -13 205 -146 -72 187 -91 -62 189 -103 -100 202 -66 -159 179
4283A79j96j20L05k01j34L54j63k25L19n9k25K76m8k60L03J8l39K56Q6k87K21
$$ 179 -17 -137 168 -33 -167 187 24 -201 118 59 -166 110 62 -198 105 123 -216 40 126 -161 60
4304F0R0l25K28J43l38Q4K38l06Q7K41l34N8K84l42J3K95k22n1K64j89j23L22
$$ 60 150 -175 53 196 -142 -58 180 -126 -39 202 -132 -74 210 -132 -119 176 -46 -97 167 -22 -145 177
4326A77j74k05L75j75j78L48j23k10K53k5k49K77L4k88K60J0l31K87O4l48K27
$$ 177 3 -202 173 -2 -180 168 45 -165 88 63 -186 91 125 -163 97 107 -224 63 127 -221 6
4347FJ69l15J19J91l26R5K41k76K5K95l35l3M00k86j14L57k03j33K92j86j47L37
$$ 6 175 -140 -21 170 -156 -61 180 -96 -71 224 -111 -144 256 -30 -144 213 10 -123 169 -17 -164 173
4369A73j88j28K62q7k27L05n0k25K57Ok90K66N9l29K00J85l28J90J37l78J94K15
$$ 173 -15 -143 119 32 -195 110 60 -165 92 98 -192 74 133 -196 4 189 -139 51 188 -190 4 219
4391B19k90J2K11k75N4K76k32j12L22k98PK02j67j10M07k02j68K80j23k04L33
$$ 219 -71 -59 152 -123 -69 207 -25 -137 185 -113 -106 96 -71 -181 226 24 -144 136 13 -191 142
4412A42p4k94L02K9k38K49k1k70K47N8l44K73J02k92J18K28l45J11K11l39J16
$$ 142 68 -226 76 105 -133 116 95 -175 72 130 -214 59 161 -131 -13 215 -130 -19 192 -147 -31
4433c1K29l19O2K48k29n8K99k28q9K86k10j00K48j06j58K93j16k11K97k8k80K74
$$ -31 198 -121 -59 189 -40 -98 201 -27 -116 170 -40 -140 108 2 -156 137 21 -190 107 79 -201 73
4455G3k1k39K50M1k90K31J03k99J60J26k83J43J82l22Q9K48k90K6K34k65L7K61
$$ 73 52 -187 63 104 -186 45 148 -151 9 135 -148 -5 177 -145 -56 192 -98 -72 162 -103 -66 195
4477A95k83l6L05j99j07K74j91j09L15j62j86L17q5k13K67n7k19K84j5l05K51
$$ 195 -88 -124 181 -18 -125 149 -42 -151 164 2 -184 133 48 -165 102 45 -174 110 95 -210 41
4498D1Q8k88J87Q1k78K01J30l25J28K15k65N5J91k71P7K35k89j7K85k23o8K79
$$ 41 129 -159 28 109 -169 32 162 -163 -35 180 -85 -30 161 -110 -33 202 -87 -104 181 -42 -110 169
4520A69k21o8L21k17j74L39j13j89K67j05j82L05o1k86K93L8k82K22L3k70K37
$$ 169 -52 -120 201 -16 -190 149 36 -153 114 9 -173 132 71 -215 78 116 -166 56 89 -181 56
4541E6R4l33J70J72k89J16J61k87J20K20l08K3K63k30k1K39k32k4K96k28j23L14
$$ 56 150 -183 -13 159 -130 -14 147 -140 -20 200 -108 -85 178 -52 -73 166 -66 -90 206 -22 -145 169
4563A69j42j58K66j25j69K93q2k47K86kk49K37lk49K40O6l20K00J35k91J53J30
$$ 169 27 -131 135 10 -159 134 52 -195 91 89 -160 77 74 -175 65 131 -189 11 146 -145 8 138
4585A38k79J37J90l16O7K37k61L1K22k53RK78k43q4K92j71j07K66j56j46L08j30
$$ 138 -141 -4 186 -130 -63 174 -87 -56 166 -87 -78 200 -43 -127 165 -6 -113 153 -3 -149 159 29
4607B9k00K82n3k15K53m4k29K67J6k84K09Q6k66J82R0k85J73J56l16J11K08k80
$$ 29 -171 111 58 -157 96 52 -177 90 106 -178 31 117 -149 33 123 -162 11 167 -149 -38 170 -110
4629a10P6K15k88M1K58k71k1K75k13o9K72j94j07L06j61j57K82j05j79K72p1k20
$$ -110 -34 181 -107 -66 192 -79 -100 175 -38 -107 165 -29 -136 170 9 -148 134 29 -150 122 51 -169
4651a69K75j4k74K50L0k54K15N0k84K04J08k95J55J58k91J11J83k74P0K28k76
$$ -169 106 92 -182 68 98 -156 59 109 -175 29 137 -158 -3 155 -136 -25 158 -116 -46 182 -94
4672i4J6K56k55j7K70k27p4L02j94j23L01j56j68L04j18j82K81p4k17K77l7k50
$$ -94 -78 178 -77 -94 176 -51 -125 177 -17 -140 161 5 -163 141 23 -159 122 48 -169 108 71 -179
4694a79K52L1k59K01O6k69J85J17l00J56J56k85J10J69k75Q5K13k73L6K47k53
$$ -179 73 104 -155 46 112 -157 28 145 -155 1 157 -128 -18 151 -124 -39 174 -99 -63 184 -69
4715f9k6K51k06m8K67k01j14L06j56j56K81j24j64K93r8k34K94j4k48K31J3k45
$$ -69 -95 156 -50 -98 169 -32 -146 160 4 -152 129 5 -159 134 36 -198 96 82 -166 65 78 -167
4737a67K37N0l02K09J17k86J44J25k68J43J59k91P8K23k53J1K14k28J4K37k30
$$ -167 70 120 -182 27 144 -142 2 127 -141 2 161 -130 -52 171 -82 -71 143 -85 -71 166 -64
4758f4p6K90j73r7K53j33j39K82j31j90K69pk30K12l9j72K52Mk93K10J09k77J67
$$ -64 -140 150 -23 -120 133 0 -139 143 12 -178 91 84 -146 66 27 -145 107 111 -182 28 137 -140 27
4781B7P7k56J97Q1l05J33K48k82O6J52k16L9K55l13j1K77k02p0K37k07l5K57j83
$$ 27 104 -152 45 126 -179 -46 202 -80 -14 138 -78 -39 216 -97 -108 169 -33 -103 134 -73 -108 149 -34
4804c4j28K92j02j76K61j03k03K94n4k49K54O1k82J99M7k70K45Q1k96J32K11k66
$$ -34 -162 130 28 -148 113 10 -193 101 47 -202 52 113 -169 30 77 -193 52 133 -163 -31 180 -86
4826h6P9J67k93R4K27k98K6K88k73lK27k10l6K71k19j09K98j25j45K38j20j27
$$ -86 -7 160 -133 -39 188 -110 -84 204 -69 -72 155 -55 -91 180 -39 -148 150 25 -120 118 -2 -129
4848a29K59p3k31K58%k33K01K2k35K20N6k94J85J38k73J27J16k75J52J80l12P8
$$ -129 130 57 -174 84 84 -149 52 74 -161 59 115 -179 6 144 -129 -2 114 -161 -9 171 -141 -63
4870f3K38k38KK29k43lK73k42q6K92j60j08K53j63j23L02j32j99K85o6k07K45
$$ -63 175 -63 -61 168 -75 -78 195 -47 -133 159 -1 -109 144 -19 -142 160 28 -171 114 48 -159 86
4892H6m4k14K54Rk82K23P6k48J73P9k65J70J40k96J01J88k51N6J99k57M2K36k52
$$ 86 42 -172 82 91 -191 32 108 -140 33 112 -153 17 157 -139 -38 150 -101 -45 154 -103 -61 175 -77
4915g7k3K68j90p4K50j78r5K89j66j57K97j09j80K50p4j99K77l2k51K26L9k60
$$ -77 -100 168 -22 -96 154 -24 -119 170 4 -153 144 35 -145 105 31 -168 109 77 -174 52 91 -169
4937a69K16M9k61J96J04k79J31J54k70J06J66k59P7K03k57J6K36k24k4K43k02
$$ -169 47 96 -165 31 135 -144 -13 141 -129 -23 143 -116 -39 164 -93 -77 159 -65 -89 154 -48
4958d8o6K68j83r7K68j33j53K84j13j75K65n6k24K52j2k47K37Nk39K05O8k73J85
$$ -48 -114 154 -29 -126 142 9 -144 140 27 -148 117 61 -163 89 77 -170 67 72 -167 38 106 -167 18
4981A8J19k80J38J49k70J09J71k69Q1K00k59L0K31k21l2K51k07n5K52j91r1K70
$$ 18 137 -143 -5 144 -126 -17 154 -115 -34 166 -93 -63 168 -53 -85 166 -41 -96 156 -35 -126 144
5003A44j29j56K62r7j73K78q4k09K60k6k28K15K6k45K15N3k78J90J18k77J32J49
$$ 144 15 -141 121 24 -149 129 45 -164 96 70 -158 57 83 -162 53 106 -172 18 136 -141 -9 140
5025A40k69J26J53k75O8K34k60MK39k14k3K50k32n5K84j68j16K42j25j25K62j30
$$ 140 -129 -3 150 -125 -57 177 -83 -79 160 -54 -77 173 -59 -114 170 2 -114 128 3 -122 140 10
5047A0j77K77m4k13K15Lk10K29mk58K12Q2k62J50R7k36J52J19k82J01J91k52M7
$$ 10 -167 110 66 -147 68 71 -139 90 86 -172 40 122 -140 10 107 -129 23 142 -140 -39 152 -100 -53
5070e3J95k31L7K24k55j7K75j96q7K42j62q5K66j53j70K90p7j75K16n6j67K46
$$ -53 142 -89 -52 172 -83 -100 175 -21 -108 134 -28 -113 153 0 -170 120 43 -132 84 28 -139 107
5092A07J2k87K70Ok55J74N4k17K28O5l25J48J77k24J05J40k97R3J67k50QL44k73
$$ 107 119 -168 102 108 -147 27 81 -136 92 157 -168 -20 157 -67 38 178 -119 -26 141 -109 -101 243 -30
5115c0p6L09k17p7L06k39j18L13j43j43K32j00j50K80j02k14K53Mk32K05J0k28
$$ -30 -106 203 -14 -91 215 -24 -142 171 28 -115 117 17 -133 147 45 -169 84 88 -144 61 71 -157
5137a57K15N3k92J81J37k73J26J29k48J21J63k80O6K21k25PJ86k07LK51k28o7
$$ -157 58 111 -181 0 137 -136 -10 119 -129 -8 155 -125 -59 162 -63 -56 130 -77 -74 177 -51 -118
5159a18K69j47j08K27j40r8K54j12j98K78l1k10K26l3k09K37Qk71K09R3k60J50
$$ -118 151 4 -104 123 -17 -115 139 27 -171 107 76 -134 92 59 -150 87 95 -176 33 126 -134 16
5181A6Q2k53J66J34k89R3K13k46M2J77k22K7K30k44k7K63j82o2K21j59q5K61j43
$$ 16 98 -155 11 145 -144 -51 162 -84 -42 135 -87 -60 170 -74 -101 162 -20 -82 139 -20 -105 156 13
5204A3j58K62o6j81K32n4k03K59k1k44K17M6k38J71O4k46J67J07k68J15J74k57
$$ 13 -145 117 51 -130 102 48 -155 104 83 -161 56 102 -136 35 99 -147 20 127 -141 -26 148 -109
5226a09P5J61k51O9K07k36QK31k16k1K31j97n5K67j75j14K58j18j30K32r5j61
$$ -109 -34 127 -124 -55 152 -84 -76 155 -61 -82 149 -48 -103 164 -11 -125 133 15 -115 117 22 -139
5248a39K40m6j96K14Ok09K03J6k35J85P2k50J54J01k36J08J42k56R2J78k42N0
$$ -139 101 55 -141 73 79 -130 73 89 -146 39 111 -139 15 116 -120 -12 130 -126 -34 144 -98 -48
5270d8K05k37QK24k13l4K54j85p7K51j63j06K57j28j44K69j03j69K43o1j96K26
$$ -48 157 -80 -72 152 -61 -95 159 -26 -103 148 -15 -121 136 8 -136 133 30 -139 104 43 -153 73
5292G3Jk25K04M5k41J78P9k57J63J16k63J24J33k29Q1J79k60O5J50j52m1K21k11
$$ 73 74 -151 53 98 -143 35 114 -143 20 136 -127 -3 130 -99 -18 161 -99 -34 116 -36 -77 144 -67
$$ [...]
8191C0
##END NTUPLES=NMR FID
##END=
