##TITLE=1H_LY-17Dix.5.B
 CD3CN, 8 sc, 
 4.06.2021
##JCAMPDX= 6.0         $$ Bruker NMR JCAMP-DX V2.0
##DATA TYPE= NMR FID
##DATA CLASS= NTUPLES
##ORIGIN= UXNMR, Bruker Analytische Messtechnik GmbH
##OWNER= root
$$ XWIN-NMR		Version 3.5
$$ Fri Jun  4 12:06:14 2021 Russian Standard Time (UT+4h)  she@DPX200
##.OBSERVE FREQUENCY= 200.131506
##.OBSERVE NUCLEUS= ^1H
##.DELAY= (6, 6)
##.ACQUISITION MODE= SIMULTANEOUS
##.ACQUISITION SCHEME= undefined
##.AVERAGES= 8
##.DIGITISER RES= 18
##SPECTROMETER/DATA SYSTEM= spect
##.PULSE SEQUENCE= zg30
##.SOLVENT NAME= CD3CN
##.SHIFT REFERENCE= (INTERNAL, CD3CN, 0, 15.7039)
##AUDIT TRAIL= $$ (NUMBER, WHEN, WHO, WHERE, WHAT)
$$ ##TITLE= Audit trail, XWIN-NMR		Version 3.5
$$ ##JCAMPDX= 5.01
$$ ##ORIGIN= Bruker BioSpin GmbH
$$ ##OWNER= she
$$ F:/spectra/data/she/nmr/H-F/1/audita.txt
$$ ##AUDIT TRAIL=  $$ (NUMBER, WHEN, WHO, WHERE, WHAT)
(   1,<2021-06-04 12:05:07.31 +0400>,<she>,<DPX200>,
      <created by zg, POWCHK disabled, PULCHK disabled
       configuration hash MD5:
       00 E9 B6 7A A2 85 ED C7 34 08 36 98 17 FE 4E 26
       data hash MD5: 16K
       DC FC 83 21 FF AD 57 41 B1 15 9E A6 F7 B2 EE 8D>)
$$ ##END=
$$ 
$$ hash MD5
$$ 94 0F D3 D1 9A 36 DB 58 FE C7 A9 7A 77 36 C0 D6
##$RELAX= 
##$RELAX= 
##$RELAX= 
##$RELAX= 
##$RELAX= 
##$RELAX= 
$$ Bruker specific parameters
$$ --------------------------
##$DU= <F:/spectra>
##$EXPNO= 1
##$NAME= <H-F>
##$PROCNO= 1
##$TYPE= <nmr>
##$USER= <she>
##$AMP= (0..31)
100 100 100 100 100 100 100 100 100 100 100 100 100 100 100 100 100 100 
100 100 100 100 100 100 100 100 100 100 100 100 100 100 
##$AQSEQ= 0
##$AQ_mod= 1
##$AUNM= <au_zg>
##$AUTOPOS= <>
##$BF1= 200.13
##$BF2= 200.13
##$BF3= 200.13
##$BF4= 200.13
##$BF5= 200.13
##$BF6= 200.13
##$BF7= 200.13
##$BF8= 200.13
##$BYTORDA= 1
##$CFDGTYP= 0
##$CFRGTYP= 5
##$CHEMSTR= <none>
##$CNST= (0..31)
1 1 145 1 1 1 1 1 1 1 1 1 1 1 1 1 1 1 1 1 1 1 1 1 1 1 1 1 1 1 1 1 
##$CPDPRG= <>
##$CPDPRG1= <>
##$CPDPRG2= <>
##$CPDPRG3= <>
##$CPDPRG4= <mlev>
##$CPDPRG5= <mlev>
##$CPDPRG6= <mlev>
##$CPDPRG7= <mlev>
##$CPDPRG8= <mlev>
##$CPDPRGB= <>
##$CPDPRGT= <>
##$D= (0..31)
0 1.2 0 0 0 0 0 0 0 0.06 0 0.03 0 0 0 0 0.0002 0 0 0 0 0 0 0 0 0 0 0 0 
0 0 0 
##$DATE= 1622793906
##$DBL= (0..7)
120 120 120 120 120 120 120 120 
##$DBP= (0..7)
150 150 150 150 150 150 150 150 
##$DBP07= 0
##$DBPNAM0= <>
##$DBPNAM1= <>
##$DBPNAM2= <>
##$DBPNAM3= <>
##$DBPNAM4= <>
##$DBPNAM5= <>
##$DBPNAM6= <>
##$DBPNAM7= <>
##$DBPOAL= (0..7)
0.5 0.5 0.5 0.5 0.5 0.5 0.5 0.5 
##$DBPOFFS= (0..7)
0 0 0 0 0 0 0 0 
##$DE= 6
##$DECBNUC= <off>
##$DECIM= 32
##$DECNUC= <off>
##$DECSTAT= 4
##$DIGMOD= 1
##$DIGTYP= 9
##$DL= (0..7)
0 120 120 120 120 120 120 120 
##$DP= (0..7)
150 150 150 150 150 150 150 150 
##$DP07= 0
##$DPNAME0= <>
##$DPNAME1= <>
##$DPNAME2= <>
##$DPNAME3= <>
##$DPNAME4= <>
##$DPNAME5= <>
##$DPNAME6= <>
##$DPNAME7= <>
##$DPOAL= (0..7)
0.5 0.5 0.5 0.5 0.5 0.5 0.5 0.5 
##$DPOFFS= (0..7)
0 0 0 0 0 0 0 0 
##$DQDMODE= 0
##$DR= 18
##$DS= 0
##$DSLIST= <SSSSSSSSSSSSSSS>
$$ [...]
##$SUBNAM2= <"">
##$SUBNAM3= <"">
##$SUBNAM4= <"">
##$SUBNAM5= <"">
##$SUBNAM6= <"">
##$SUBNAM7= <"">
##$SUBNAM8= <"">
##$SUBNAM9= <"">
##$SW= 20.0188882624521
##$SWIBOX= (0..15)
0 0 2 0 0 0 0 0 0 0 0 0 0 0 0 0 
##$SW_h= 4006.41025641026
##$TD= 16384
##$TD0= 1
##$TE= 0
##$TE2= 300
##$TE3= 300
##$TEG= 300
##$TL= (0..7)
0 120 120 120 120 120 120 120 
##$TP= (0..7)
150 150 150 150 150 150 150 150 
##$TP07= 0
##$TPNAME0= <>
##$TPNAME1= <>
##$TPNAME2= <>
##$TPNAME3= <>
##$TPNAME4= <>
##$TPNAME5= <>
##$TPNAME6= <>
##$TPNAME7= <>
##$TPOAL= (0..7)
0.5 0.5 0.5 0.5 0.5 0.5 0.5 0.5 
##$TPOFFS= (0..7)
0 0 0 0 0 0 0 0 
##$TUNHIN= 0
##$TUNHOUT= 0
##$TUNXOUT= 0
##$USERA1= <user>
##$USERA2= <user>
##$USERA3= <user>
##$USERA4= <user>
##$USERA5= <user>
##$V9= 5
##$VALIST= <valist>
##$VCLIST= <CCCCCCCCCCCCCCC>
##$VD= 0
##$VDLIST= <DDDDDDDDDDDDDDD>
##$VPLIST= <PPPPPPPPPPPPPPP>
##$VTLIST= <TTTTTTTTTTTTTTT>
##$WBST= 1024
##$WBSW= 4
##$XGAIN= (0..3)
0 0 0 0 
##$XL= 0
##$YL= 0
##$YMAX_a= 76730
##$YMIN_a= -82010
##$ZGOPTNS= <>
##$ZL1= 120
##$ZL2= 120
##$ZL3= 120
##$ZL4= 120
##$ABSF1= 10
##$ABSF2= 0
##$ABSG= 5
##$ABSL= 3
##$ALPHA= 0
##$AQORDER= 0
##$ASSFAC= 0
##$ASSFACI= 0
##$ASSFACX= 0
##$ASSWID= 0
##$AUNMP= <proc_1d>
##$AZFE= 0.1
##$AZFW= 0.1
##$BCFW= 1
##$BC_mod= 2
##$BYTORDP= 1
##$COROFFS= 0
##$CY= 11.3945322036743
##$DATMOD= 1
##$DC= 2
##$DFILT= <>
##$DTYPP= 0
##$F1P= 15.9154993809931
##$F2P= -4.1035820241983
##$FCOR= 0.5
##$FTSIZE= 0
##$FT_mod= 4
##$GAMMA= 1
##$GB= 0.15
##$INTBC= 1
##$INTSCL= 1
##$ISEN= 128
##$LB= 0.24
##$LEV0= 0
##$LPBIN= 0
##$MAXI= 10000
##$MC2= 0
##$MEAN= 0
##$ME_mod= 0
##$MI= 1.114404
##$NCOEF= 0
##$NC_proc= 0
##$NLEV= 6
##$NOISF1= 3.799351
##$NOISF2= 2.8
##$NSP= 1
##$NTH_PI= 0
##$NZP= 0
##$OFFSET= 15.70392
##$PC= 1
##$PHC0= -11202.17
##$PHC1= 11.60099
##$PH_mod= 1
##$PKNL= yes
##$PPARMOD= 0
##$PSCAL= 0
##$PSIGN= 0
##$REVERSE= no
##$SF= 200.130013532006
##$SI= 16384
##$SIGF1= 3
##$SIGF2= 2
##$SINO= 400
##$SIOLD= 16384
##$SREGLST= <1H.CDCl3>
##$SSB= 0
##$STSI= 0
##$STSR= 0
##$SW_p= 3612.71676300578
##$SYMM= 0
##$S_DEV= 0
##$TDeff= 0
##$TDoff= 0
##$TI= <>
##$TILT= no
##$TM1= 0
##$TM2= 0
##$TOPLEV= 0
##$USERP1= <user>
##$USERP2= <user>
##$USERP3= <user>
##$USERP4= <user>
##$USERP5= <user>
##$WDW= 1
##$XDIM= 8192
##$YMAX_p= 0
##$YMIN_p= 0
$$ End of Bruker specific parameters
$$ ---------------------------------
##NTUPLES= NMR FID
##VAR_NAME=  TIME,          FID/REAL,        FID/IMAG
##SYMBOL=    X,             R,               I
##VAR_TYPE=  INDEPENDENT,   DEPENDENT,       DEPENDENT
##VAR_FORM=  AFFN,          ASDF,            ASDF
##VAR_DIM=   8192,          8192,            8192
##UNITS=     SECONDS,       ARBITRARY UNITS, ARBITRARY UNITS
##FACTOR=    0.0002496,     1,               1
##FIRST=     0,             0,               0
##LAST=      2.0444736,     0,               0
##MIN=       0,             -82010,          0
##MAX=       2.0444736,     76730,           0
$$ Real data points
##PAGE= N=1
##DATA TABLE= (X++(R..R)), XYDATA
0 0 0 0 0 0 0 0 0 0 0 0 0 0 0 0 0 0 -8 8 -8 8 -8 9 -16 16 -17 24 -24 32 -33 40 -48 50 -57 65 -74 83 -97 106
38 106 -121 132 -147 163 -182 203 -223 246 -272 301 -332 365 -401 443 -490 540 -595 659 -731
57 -731 814 -909 1020 -1153 1316 -1517 1779 -2129 2631 -3397 4740 -7736 27995 -44360 -74348
72 -74348 70641 40223 -70663 -14723 76730 -17770 -69659 39646 60896 -58704 -40649
83 -40649 66614 15882 -73429 12277 70819 -38916 -67622 58204 53905 -69641 -36213 72431
95 72431 10175 -70030 14291 60978 -39486 -49581 56092 33886 -64872 -13197 65720 -10285
107 -10285 -61047 34223 52166 -53721 -38984 67856 24149 -71103 -4159 68190 -15705 -56563
119 -56563 37233 43105 -52905 -25830 62942 8563 -62822 11902 57130 -30864 -45129 47951
131 47951 29786 -60724 -13570 66035 -3262 -63261 19732 52586 -36356 -38662 48146 20311
143 20311 -56986 -3626 57177 -14166 -52113 28862 39678 -42730 -24754 51915 7142 -57551
155 -57551 8363 55502 -23057 -46964 36028 33935 -45171 -16942 51077 -299 -51570 16861
167 16861 47409 -29354 -35788 40839 21868 -47122 -4158 51015 -11688 -48686 26564 42008
179 42008 -37336 -29654 45073 14583 -47961 2648 47158 -18744 -42350 30942 31853 -40414 -18575
192 -18575 45013 2478 -46285 12604 42024 -27448 -35538 37131 23975 -43839 -10955 44881
204 44881 -4469 -42825 18409 36378 -30409 -27120 38244 14784 -42123 -990 41942 -12432
216 -12432 -36958 25704 29872 -35171 -19383 41330 7654 -42223 6205 40294 -18061 -33058
228 -33058 29328 23796 -36597 -11647 40509 -1051 -39595 14091 35022 -25465 -26853 34289
240 34289 16201 -39544 -4233 40089 -9096 -37679 20293 30495 -30032 -20817 36040 8584
252 8584 -38994 3322 36590 -16104 -31784 26069 23297 -33564 -12996 37062 1133 -36992
264 -36992 10706 33334 -21379 -26561 29807 17531 -34706 -6383 36566 -4497 -33531 16097
276 16097 28127 -25566 -19802 32709 10488 -35313 799 35014 -11200 -30259 21329 22955
288 22955 -29396 -13705 34487 3639 -35628 6631 32504 -16728 -26145 25231 16943 -31937
300 -31937 -7263 34457 -3524 -33923 12909 28799 -21598 -20892 28168 10559 -33006 -674
312 -674 33752 -9132 -30923 17672 24539 -24469 -15307 29354 4787 -31694 5648 31096 -14408
325 -14408 -26578 21650 19192 -26386 -8917 29809 -1303 -30199 11110 27949 -18808 -22250
337 -22250 24540 14106 -27442 -3500 28684 -7125 -27671 16160 23801 -22981 -17253 26920
349 26920 8145 -28443 2115 27519 -12395 -24855 20412 19575 -25963 -12424 27890 2827
361 2827 -27561 7319 25059 -16761 -20918 23607 14648 -27611 -6991 28090 -2092 -25722 11757
374 11757 21764 -20099 -16495 25716 10024 -27703 -2080 26592 -6489 -22647 15328 17552
386 17552 -22360 -11254 26910 4654 -27584 2752 24893 -10587 -19627 18346 13436 -24179
398 -24179 -6683 26996 -423 -26492 7379 22366 -14460 -15988 20888 8633 -25556 -1545
410 -1545 26941 -5367 -24920 11646 19414 -17683 -12064 22599 4043 -25562 3503 25619 -9971
423 -9971 -22302 15223 15687 -19754 -7399 23200 -802 -24490 8137 23147 -13834 -18761 17899
436 17899 11633 -20739 -3010 22485 -5269 -22442 12105 20046 -16853 -14850 19711 7306 -21226
449 -21226 1143 21354 -9082 -19823 15415 16452 -19296 -10771 20891 3097 -20952 5312
461 5312 19805 -12757 -17075 18353 12728 -21329 -6618 21712 -1060 -20304 9028 17559 -15902
474 -15902 -13676 20482 8572 -22197 -2192 21300 -5189 -18699 12310 14755 -18180 -9955 21725
487 21725 4477 -22331 1674 20104 -8533 -16280 14776 11376 -19436 -5909 21673 156
499 156 -21131 5721 18061 -11581 -13412 16595 7895 -20027 -2132 21186 -3414 -19511 9025
512 9025 15670 -14094 -10284 18134 4349 -20264 1794 20335 -7180 -17620 12147 12926 -16260
525 -16260 -6949 19130 717 -20054 5273 18803 -10493 -15261 14719 9812 -17894 -3532 19341
538 19341 -3062 -19163 8719 16631 -13413 -12259 16574 6238 -18562 -23 18557 -6227
550 -6227 -17038 11346 13581 -15168 -8650 17388 2594 -18164 3567 17309 -9071 -14657 13561
563 13561 10665 -16289 -5205 17676 -568 -17157 6508 15299 -11392 -11814 15196 7387 -17056
576 -17056 -1752 17550 -3921 -16206 9307 13369 -13635 -9163 16489 4023 -17619 1548
588 1548 16839 -7151 -14660 11721 10743 -15319 -6094 16951 456 -17272 4852 15524 -9938
601 -9938 -12561 13583 7949 -16153 -2885 16766 -2688 -15918 7804 13465 -11987 -9728 14800
614 14800 5042 -15986 323 15848 -5387 -14008 10107 11243 -13244 -6951 15342 2289 -15431
627 -15431 3157 14500 -7956 -11897 12166 8580 -14639 -4125 15620 -764 -14923 5754
639 5754 12811 -10367 -9792 13691 5768 -15638 -1469 15364 -3627 -13909 8173 10716 -12537
652 -12537 -7229 15007 2779 -16089 1490 14816 -6098 -12252 10137 8423 -13490 -4265 15345
665 15345 38 -15288 4210 13511 -8014 -10004 11631 6010 -13901 -1389 15187 -2461 -14104
678 -14104 6447 11725 -9452 -7582 12334 3298 -13857 1218 14298 -4962 -12819 8226 9778
691 9778 -10829 -5512 12736 676 -13917 3576 13373 -7412 -11535 9887 7612 -12029 -3128
704 -3128 12878 -2091 -13299 6172 11966 -9616 -9554 11485 5358 -12686 -600 12805 -4338
717 -4338 -12148 8377 10359 -10996 -7108 12393 2948 -12366 2166 11947 -6490 -10265 10237
730 10237 8272 -11869 -4695 12591 735 -11674 4094 10526 -8083 -8431 11215 5942 -12466
743 -12466 -2470 12220 -1717 -10919 5932 8703 -9855 -6452 12034 3358 -12923 -254 11633
756 11633 -3922 -9828 7567 6887 -11076 -4258 12685 976 -12887 2213 11028 -5927 -8287
769 -8287 9285 4994 -11855 -1697 13025 -1254 -12077 4488 9879 -7331 -6284 10301 2933
782 2933 -11916 698 12631 -3355 -11009 6231 8336 -8446 -4398 10607 720 -11609 2690
795 2690 11421 -5289 -9588 7326 6326 -9134 -2541 10282 -1476 -11013 4436 10100 -7002
808 -7002 -8176 8361 4465 -9727 -703 9974 -3437 -9992 6319 8521 -8478 -6126 9398
821 9398 2423 -9843 1580 9647 -5212 -8712 8064 7053 -9463 -4032 10138 598 -9501
834 -9501 3585 8826 -6793 -7079 9391 5136 -10060 -1898 10087 -1349 -8934 4986 7419 -7883
848 -7883 -5478 9786 3084 -10282 -204 9476 -3163 -8101 6106 5876 -8862 -3766 9936 954
862 954 -10113 1644 8753 -4766 -6935 7155 4336 -9306 -1999 9912 -760 -9441 3529
875 3529 7922 -6111 -5508 8333 2799 -9555 167 10010 -2678 -8734 5315 6871 -7301 -3937
889 -3937 9022 1146 -9444 1854 9273 -4239 -7615 6626 5387 -8125 -2401 9185 -591
902 -591 -9248 3344 8241 -5659 -6335 7381 3656 -8604 -916 8779 -2202 -8425 4554 6876
916 6876 -6742 -4933 7893 2022 -8718 699 8401 -3595 -7518 5770 5603 -7523 -3198 8467
930 8467 450 -8480 2468 7836 -4956 -6290 7009 4230 -8108 -1396 8768 -1206 -8153 4067
944 4067 7083 -6130 -4920 7888 2525 -8528 378 8559 -2996 -7510 5417 5837 -7172 -3539
958 -3539 8142 749 -8539 1846 7905 -4364 -6668 6177 4447 -7650 -2125 8014 -824 -8031
972 -8031 3274 7006 -5547 -5527 6918 3173 -7793 -603 7831 -2129 -7300 4498 6045 -6296
986 -6296 -4086 7522 1824 -7718 977 7447 -3551 -6389 5901 5015 -7136 -2702 7914 345
1000 345 -7547 2455 6745 -4851 -5243 6853 3479 -7818 -1241 7902 -1202 -7090 3708 5643
1014 5643 -6021 -4044 7400 1917 -8053 147 7491 -2502 -6307 4576 4309 -6650 -2529 7618
1028 7618 394 -7814 1582 6873 -3657 -5271 5471 3152 -6970 -1049 7667 -957 -7357 2857
1042 2857 6165 -4460 -3989 6144 1793 -7145 513 7544 -2380 -6763 4207 5341 -5370 -2874
1056 -2874 6552 404 -7168 1928 7086 -3719 -6020 5112 4080 -6076 -1597 6666 -1060 -6919
1070 -6919 3196 6284 -4940 -5107 5782 2912 -6344 -382 6428 -2255 -6306 4151 5345 -5625
1084 -5625 -3926 6207 1771 -6276 774 6033 -3214 -5509 5038 4505 -6032 -2804 6368 671
1098 671 -6015 1911 5552 -4054 -4562 5789 3392 -6509 -1628 6481 -478 -5693 3005 4888 -5010
1113 -5010 -3684 6362 2205 -6812 -396 6339 -1729 -5264 3934 3890 -5831 -2494 6799 860 -6904
1128 -6904 805 5895 -2865 -4564 4666 2881 -6165 -1308 6762 -349 -6538 1865 5257 -3595 -3539
1143 -3539 5232 1804 -6320 -132 6625 -1354 -5989 2788 4581 -4089 -2587 5432 743 -6160 1046
1158 1046 6314 -2364 -5380 3632 3720 -4756 -1623 5710 -366 -6062 2184 5803 -3515 -4714 4400
1173 4400 2740 -5197 -511 5694 -1591 -5765 3219 5087 -4449 -3766 5083 1709 -5495 503 5503
1188 5503 -2590 -5144 4159 4272 -5007 -2716 5277 608 -5286 1539 4958 -3375 -4229 4784 3241
1203 3241 -5363 -1671 5369 -286 -4961 2333 4347 -3967 -3396 5100 2149 -5494 -532 5246 -1320
1218 -1320 -4548 3128 3565 -4592 -2414 5474 1068 -5548 533 5008 -2310 -4104 3862 2812 -5034
1233 -5034 -1382 5652 -110 -5489 1636 4587 -3222 -3386 4521 1922 -5352 -385 5546 -1103 -5043
1248 -5043 2556 3983 -3862 -2580 4806 991 -5293 595 5263 -1980 -4501 3240 3209 -4337 -1808
1263 -1808 4896 193 -5050 1343 4691 -2712 -3783 3756 2436 -4563 -948 4872 -665 -4757 2163
1278 2163 4129 -3397 -2986 4331 1606 -4843 -36 4797 -1610 -4324 2980 3444 -3967 -2060 4681
1293 4681 575 -4945 972 4649 -2355 -3836 3668 2659 -4483 -1203 4894 -342 -4767 1813 4105
1308 4105 -3131 -3128 4036 1705 -4673 -224 4798 -1216 -4483 2404 3539 -3569 -2391 4246 913 -4597
1324 -4597 596 4482 -2015 -3974 3054 2882 -3871 -1492 4356 -14 -4435 1509 4165 -2675 -3335
1339 -3335 3629 2180 -4139 -677 4364 -871 -4126 2420 3685 -3400 -2640 4094 1258 -4354 317
1354 317 4252 -1843 -3748 3172 2993 -4042 -1922 4314 454 -4289 1059 3787 -2681 -3209 3754 2228
1370 2228 -4418 -1068 4420 -398 -4115 1769 3276 -3187 -2460 4152 1453 -4444 -285 4230 -998
1385 -998 -3619 2419 2738 -3509 -1665 4370 698 -4461 484 4093 -1598 -3077 2933 2086 -3796 -853
1401 -853 4491 -164 -4272 1294 3736 -2350 -2533 3335 1204 -4109 50 4564 -1079 -4233 2107
1416 2107 3215 -3008 -1924 3676 381 -4288 878 4222 -1980 -3791 2718 2623 -3367 -1221 3793
1431 3793 -371 -4084 1605 3933 -2496 -3202 3177 2068 -3518 -502 3744 -1026 -3675 2350 3440
1446 3440 -2996 -2507 3514 1336 -3556 252 3580 -1658 -3281 2836 2803 -3459 -1830 3706 555 -3560
1462 -3560 1009 3231 -2488 -2853 3402 2069 -3930 -1093 3827 -291 -3498 1640 2788 -3052 -2204
1477 -2204 3802 1328 -4102 -324 3759 -1016 -3187 2328 2370 -3448 -1530 4057 624 -4056 458
1492 458 3592 -1532 -2659 2781 1774 -3616 -799 4090 -17 -3816 1115 3293 -2029 -2203 3097
1507 3097 1170 -3765 -129 4055 -711 -3654 1629 2796 -2522 -1633 3305 415 -3859 564 3796
1522 3796 -1572 -3374 2243 2289 -2997 -1039 3476 -349 -3845 1285 3528 -2187 -2850 2774 1640 -3259
1538 -3259 -258 3534 -1014 -3517 2056 3128 -2708 -2243 3147 1072 -3313 411 3443 -1548 -3087
1553 -3087 2540 2607 -3046 -1609 3348 465 -3228 988 3137 -2087 -2685 2913 2008 -3315 -1032 3333
1569 3333 -199 -3158 1437 2687 -2575 -2189 3242 1304 -3550 -358 3294 -932 -3006 2017 2261
1584 2261 -2990 -1555 3406 575 -3602 408 3199 -1532 -2538 2568 1751 -3306 -847 3589 -121
1599 -121 -3451 1170 3005 -2054 -2088 2956 1243 -3337 -126 3536 -710 -3133 1667 2545 -2446 -1568
1615 -1568 3119 669 -3330 407 3307 -1313 -2850 2116 2103 -2759 -1105 3157 56 -3275 866
1630 866 2919 -1959 -2405 2514 1443 -3128 -589 3178 -572 -3080 1457 2578 -2350 -1851 2828 844
1646 844 -3249 183 3152 -1134 -2687 2080 2065 -2748 -1196 3176 239 -3150 869 2973 -1649 -2294
1662 -2294 2455 1550 -2878 -502 3190 -392 -3034 1350 2627 -2066 -1795 2639 947 -3006 20
1677 20 3036 -977 -2831 1709 2203 -2361 -1370 2710 303 -3033 585 2813 -1539 -2521 2152 1699
1693 1699 -2635 -820 2836 -276 -2868 1151 2612 -1956 -2078 2513 1225 -2759 -88 2837 -811
1708 -811 -2617 1766 2170 -2371 -1503 2834 720 -2774 408 2656 -1328 -2270 2309 1759 -2664 -1068
1724 -1068 2781 177 -2574 891 2316 -1803 -1944 2478 1193 -2851 -653 2791 -327 -2450 1159
1739 1159 1922 -2098 -1476 2623 737 -2940 -80 2631 -754 -2208 1588 1632 -2345 -884 2815 287
1755 287 -2877 464 2555 -1160 -1833 1944 1079 -2495 -276 2960 -338 -2765 990 2361 -1624 -1458
1771 -1458 2281 604 -2701 215 2877 -837 -2575 1403 1966 -1846 -1077 2266 145 -2647 673
1786 673 2636 -1307 -2328 1644 1520 -2045 -727 2268 -294 -2443 1050 2309 -1624 -1907 1913 1158
1802 1158 -2095 -225 2190 -711 -2306 1510 2028 -1932 -1510 2115 799 -2139 250 2233 -1130
1817 -1130 -1970 1973 1670 -2164 -1031 2275 292 -2147 790 1955 -1642 -1577 2195 1226 -2450 -505
1833 -505 2265 -171 -2045 1070 1571 -1968 -1196 2327 649 -2510 -175 2263 -668 -1829 1407 1321
1849 1321 -2104 -866 2391 250 -2447 337 2040 -1023 -1523 1738 937 -2217 -337 2447 -98
1864 -98 -2308 742 1876 -1285 -1209 1912 517 -2321 20 2362 -556 -2103 1155 1559 -1601 -800
1880 -800 2002 88 -2365 534 2310 -1068 -1940 1495 1257 -1814 -432 2048 -411 -2260 974 2008
1896 2008 -1467 -1563 1699 878 -1905 -48 2041 -722 -2020 1277 1767 -1617 -1266 1821 501 -1910
1912 -1910 320 1895 -1007 -1710 1561 1407 -1761 -866 1929 152 -1855 642 1699 -1321 -1459 1759
1928 1759 1030 -1967 -440 1893 -288 -1736 1049 1420 -1630 -1036 1953 549 -2059 49 1894 -697
1944 -697 -1597 1299 1147 -1818 -714 2017 128 -2030 442 1776 -1033 -1353 1575 849 -1912 -322
1960 -322 2041 -200 -1900 755 1563 -1247 -1089 1660 552 -1901 10 1927 -543 -1730 1049 1338
1976 1338 -1449 -821 1753 245 -1878 331 1772 -859 -1491 1295 1051 -1605 -487 1785 -86 -1759
1992 -1759 675 1579 -1166 -1195 1569 694 -1779 -123 1815 -446 -1641 1003 1305 -1427 -832 1718
2008 1718 312 -1803 232 1714 -763 -1434 1235 1022 -1587 -523 1785 -3 -1793 515 1585
2023 1585 -983 -1206 1365 719 -1640 -188 1739 -325 -1663 750 1379 -1146 -970 1445 435 -1641
2039 -1641 98 1691 -583 -1528 997 1176 -1290 -647 1518 66 -1611 510 1583 -926 -1313 1267
2055 1267 914 -1439 -320 1544 -276 -1523 832 1387 -1219 -1062 1457 591 -1520 17 1515 -607
2071 -607 -1380 1105 1151 -1437 -819 1521 300 -1503 255 1337 -852 -1177 1280 917 -1519 -562 1541
2088 1541 57 -1433 497 1210 -1031 -947 1445 678 -1597 -301 1535 -165 -1284 714 1004 -1193
2104 -1193 -652 1564 346 -1633 40 1506 -470 -1165 944 773 -1373 -349 1642 11 -1596 366
2120 366 1349 -737 -942 1122 444 -1478 -16 1627 -341 -1550 619 1204 -937 -727 1221 167
2136 167 -1486 256 1551 -620 -1426 844 1009 -1063 -487 1236 -79 -1427 528 1445 -804 -1234
2152 -1234 1006 834 -1125 -279 1248 -303 -1308 778 1280 -1033 -1019 1177 576 -1194 11 1229
2168 1229 -562 -1185 1012 1075 -1227 -756 1294 299 -1214 274 1119 -828 -1011 1207 804 -1390 -488
2185 -488 1334 -7 -1200 502 976 -1025 -823 1317 558 -1431 -248 1301 -199 -1091 686 825
2201 825 -1136 -602 1388 329 -1427 -2 1280 -366 -972 810 669 -1189 -362 1395 113 -1349
2217 -1349 239 1178 -566 -817 974 486 -1255 -130 1416 -128 -1304 451 1028 -757 -613 1087
2233 1087 217 -1319 115 1335 -431 -1198 667 839 -944 -429 1131 -37 -1310 344 1246 -639
2249 -639 -1050 826 652 -1024 -217 1145 -231 -1212 558 1111 -806 -865 956 492 -1044 -7 1157
2266 1157 -368 -1098 710 974 -902 -666 1040 300 -1037 209 1092 -573 -969 886 818 -1020 -480
2283 -480 1086 72 -1054 376 966 -762 -813 993 542 -1143 -236 1091 -206 -1009 590 812 -952
2300 -952 -645 1080 303 -1184 -5 1067 -397 -904 720 664 -1003 -404 1146 120 -1125 240 1009
2317 1009 -526 -783 881 550 -1009 -205 1149 -43 -1046 418 921 -645 -611 955 392 -1044 -19
2334 -19 1103 -278 -989 569 787 -817 -501 983 161 -1074 137 995 -502 -879 716 570 -984
2351 -984 -341 1008 -71 -1045 360 890 -693 -724 886 411 -1035 -113 1044 -211 -944 534 772
2368 772 -794 -506 992 259 -1028 87 1040 -332 -832 666 667 -831 -340 1016 85 -1023 223
2385 223 954 -467 -725 743 472 -936 -193 1017 -125 -1027 369 853 -618 -623 781 259 -990 6
2403 6 975 -341 -967 508 710 -752 -442 851 64 -967 235 950 -529 -851 695 605 -782 -231
2421 -231 897 -94 -883 440 857 -651 -682 820 459 -816 -69 873 -247 -823 586 777 -734 -565
2439 -565 830 292 -823 70 794 -409 -744 693 594 -885 -452 857 135 -830 183 702 -569 -635
2457 -635 779 437 -943 -287 877 -44 -797 355 595 -695 -441 910 270 -970 -71 895 -191
2474 -191 -691 504 503 -749 -242 971 99 -957 107 846 -319 -571 626 370 -819 -115 973 -50
2492 -50 -939 229 768 -414 -498 630 194 -833 31 936 -200 -906 313 659 -528 -402 659 68
2510 68 -837 169 888 -364 -840 461 564 -576 -233 703 -98 -790 356 818 -499 -700 608 449
2528 449 -650 -90 720 -227 -729 522 725 -625 -542 681 286 -678 59 677 -372 -652 630 608 -716
2547 -716 -450 712 169 -676 149 614 -472 -580 678 466 -775 -320 729 40 -675 237 545 -561
2565 -561 -469 729 350 -786 -191 732 -84 -615 343 462 -624 -321 780 191 -795 11 711 -230 -533
2584 -533 496 355 -693 -181 812 33 -761 175 629 -359 -437 566 222 -721 -18 817 -116 -729 290
2603 290 568 -450 -355 604 115 -730 83 744 -243 -659 369 467 -511 -248 616 -16 -706 169 689 -344
2623 -344 -590 461 370 -564 -152 617 -119 -660 306 620 -435 -448 543 248 -591 3 619 -221 -586 418
2643 418 516 -510 -336 593 137 -578 144 589 -352 -498 517 398 -574 -191 614 -3 -571 240 507 -435
2663 -435 -411 552 285 -598 -99 594 -113 -552 302 447 -473 -340 570 160 -616 1 590 -187 -500 373
2683 373 386 -495 -257 570 71 -587 109 561 -273 -428 441 296 -546 -126 597 -39 -553 230 482 -366
2703 -366 -335 499 200 -541 8 547 -164 -487 342 420 -438 -248 544 90 -547 88 494 -284 -426 414 300
2724 300 -487 -160 533 2 -511 163 439 -350 -360 459 232 -550 -105 543 -52 -493 227 387 -395 -270
2744 -270 506 147 -540 16 532 -147 -433 301 300 -441 -171 533 69 -541 101 495 -213 -354 364 207 -466
2765 -466 -45 524 -99 -535 206 440 -296 -290 398 97 -491 42 507 -193 -497 268 370 -341 -223 401 22
2786 22 -469 145 500 -264 -437 344 337 -375 -147 417 -50 -442 204 449 -317 -399 385 270 -392 -69 409
2807 409 -133 -412 277 389 -383 -316 431 177 -404 20 376 -223 -345 375 308 -440 -226 444 76 -397 111
2828 111 344 -295 -282 437 214 -494 -135 457 -1 -358 185 298 -337 -211 463 135 -491 -34 452 -59
2848 -59 -344 220 239 -369 -141 489 71 -511 13 438 -133 -310 265 163 -408 -67 484 -27 -503 88 406
2869 406 -182 -254 304 97 -414 24 496 -113 -460 181 339 -249 -177 345 19 -403 136 460 -189 -401 251
2890 251 300 -272 -107 360 -42 -383 181 416 -261 -365 300 242 -317 -57 342 -115 -379 226 355 -307 -319
2911 -319 309 163 -340 -26 320 -172 -336 294 311 -363 -243 353 107 -339 62 320 -216 -287 341 259 -373
2932 -373 -158 373 50 -308 136 288 -268 -225 389 172 -392 -77 377 -49 -302 191 236 -308 -148 390 86
2953 86 -394 -7 338 -127 -275 225 172 -359 -115 382 13 -401 34 321 -162 -240 257 137 -358 -63 386
2974 386 -26 -382 107 308 -205 -205 297 106 -345 14 394 -65 -338 176 264 -231 -129 329 39 -347 85
2995 85 369 -154 -293 239 205 -286 -71 319 -34 -351 140 306 -216 -254 258 109 -314 -35 315 -119 -323
3016 -323 179 262 -252 -198 277 75 -319 19 316 -133 -279 215 241 -270 -133 319 48 -304 90 311 -166
3037 -166 -244 257 202 -270 -81 324 -8 -301 144 281 -197 -187 292 119 -299 -7 313 -91 -279 185 218
3058 218 -250 -147 287 34 -311 58 278 -163 -250 218 160 -285 -74 287 -45 -302 127 253 -197 -213 251
3079 251 123 -287 -26 293 -64 -254 161 241 -232 -176 273 107 -280 20 281 -110 -234 225 210 -264 -116
3100 -116 299 59 -277 60 240 -159 -183 255 130 -297 -76 300 -7 -248 105 195 -208 -153 263 71 -299
3121 -299 -18 275 -67 -225 139 143 -235 -66 287 18 -308 37 275 -88 -204 169 102 -232 -26 300 -23
3142 -23 -300 83 253 -110 -169 184 79 -236 18 293 -69 -286 108 242 -134 -135 196 30 -242 47 275
3163 275 -105 -249 148 208 -180 -96 204 -20 -228 112 249 -157 -212 170 151 -176 -55 187 -77 -204 144
3184 144 205 -209 -203 206 118 -195 -15 187 -91 -188 182 180 -216 -149 223 86 -181 19 183 -120 -164 210 158
3207 158 -227 -119 243 63 -186 37 171 -127 -130 232 131 -249 -90 227 34 -178 74 133 -165 -105 245
3228 245 71 -254 -40 206 -28 -164 100 83 -209 -52 240 15 -244 -5 201 -61 -135 114 65 -204 -20
3249 -20 250 -7 -236 40 196 -74 -122 148 40 -196 22 249 -39 -228 78 184 -92 -87 155 30 -192
3270 -192 54 230 -69 -210 93 167 -112 -75 153 -10 -185 78 199 -115 -200 119 117 -132 -50 135 -50 -185
3292 -185 93 159 -143 -156 136 78 -138 4 139 -67 -140 135 145 -146 -105 167 53 -126 25 138 -85 -114
3314 -114 165 117 -147 -70 166 33 -140 63 137 -105 -109 160 97 -170 -57 167 -10 -152 47 109 -130 -100 146
3337 146 55 -182 -36 158 -36 -136 62 96 -134 -75 155 25 -168 22 145 -49 -108 108 82 -134 -26 158
3359 158 14 -138 44 142 -68 -91 117 55 -128 -1 157 -17 -136 64 114 -90 -69 126 39 -145 3 147
3381 147 -43 -144 71 103 -110 -88 115 32 -149 9 131 -73 -138 83 81 -123 -37 144 4 -141 40 133 -61
3404 -61 -81 111 72 -118 -16 135 -20 -117 73 102 -75 -53 122 47 -120 8 129 -35 -114 67 75 -97 -46 123
3428 123 7 -129 20 135 -53 -103 78 63 -129 -47 134 -10 -143 30 116 -60 -90 93 57 -109 -2 148
3450 148 -29 -128 57 122 -74 -63 111 38 -115 26 147 -47 -105 84 108 -74 -48 112 15 -98 39 112 -70
3473 -70 -112 82 76 -86 -29 96 -8 -96 63 101 -78 -90 110 67 -102 -23 83 -30 -86 85 102 -100 -89 124
3497 124 61 -99 -4 92 -41 -83 90 83 -110 -62 133 47 -105 14 98 -56 -68 126 76 -119 -44 133 35 -90
3521 -90 28 76 -65 -48 109 31 -121 -25 116 14 -97 35 64 -67 -20 111 18 -127 -11 121 -4 -83 51
3544 51 55 -69 -17 126 16 -119 22 127 0 -67 60 46 -87 -3 127 -1 -127 35 116 -33 -62 66 38
3567 38 -94 28 124 -36 -119 47 112 -51 -66 75 10 -93 25 108 -49 -122 55 90 -45 -54 65 -1 -91 44
3591 44 106 -57 -97 69 97 -55 -36 70 -6 -71 65 108 -70 -101 80 67 -65 -27 85 -14 -88 71 88 -91 -85
3616 -85 96 63 -74 -14 85 -39 -79 95 88 -104 -64 104 44 -103 -2 84 -53 -72 97 73 -104 -50 115 35 -86
3641 -86 26 84 -65 -41 100 52 -97 -19 113 14 -73 39 63 -60 -44 104 22 -108 -11 106 -12 -83 45 43 -82
3666 -82 -21 114 14 -124 4 97 -38 -76 63 43 -101 -14 108 -11 -132 20 107 -44 -72 84 41 -97 9
3689 9 126 -33 -106 59 93 -74 -56 85 22 -94 22 118 -31 -103 71 73 -67 -40 96 10 -102 33 96 -63
3713 -63 -93 81 48 -79 -18 97 -12 -97 48 100 -66 -70 93 40 -106 -3 114 -21 -94 80 82 -84 -46 109
3737 109 22 -109 18 119 -41 -93 79 77 -96 -40 123 9 -104 40 99 -57 -71 95 70 -102 -12 103 -16
3760 -16 -98 47 93 -76 -70 90 44 -92 13 94 -30 -94 74 87 -67 -44 100 32 -90 38 103 -44 -70 88
3784 88 65 -94 -29 116 8 -101 49 97 -80 -75 100 39 -112 -3 110 -25 -101 53 85 -92 -57 106 34 -103
3808 -103 9 118 -44 -75 80 75 -99 -44 129 20 -106 18 100 -48 -58 86 58 -98 -11 126 1 -95 38
3831 38 84 -49 -37 106 35 -103 -3 120 -15 -95 41 66 -78 -31 110 7 -116 18 118 -58 -92 67 53
3854 53 -83 -11 109 -9 -122 46 110 -56 -53 80 42 -88 12 128 -22 -101 64 108 -65 -70 85 33 -81 48
3878 48 112 -42 -93 74 92 -67 -32 95 14 -74 53 96 -80 -89 86 66 -100 -36 84 -27 -77 64 62 -101 -81
3903 -81 86 46 -96 -7 74 -42 -74 89 73 -96 -47 127 38 -90 11 95 -51 -54 114 68 -96 -22 128 13
3927 13 -80 49 80 -52 -39 104 36 -104 12 111 -9 -77 38 53 -72 -27 112 11 -96 1 110 -34 -72 42
3951 42 30 -86 -14 109 -13 -117 31 101 -36 -62 75 36 -81 29 120 -22 -100 64 103 -44 -35 92 30 -81
3975 -81 30 118 -47 -82 80 85 -68 -44 79 -10 -90 46 102 -68 -94 72 65 -71 -21 84 -19 -83 56 84 -87
4000 -87 -68 73 46 -89 -9 84 -40 -65 60 76 -71 -42 94 31 -72 20 75 -43 -52 80 66 -88 -38 115 26
4025 26 -76 34 80 -52 -53 89 47 -105 -28 107 -5 -87 37 69 -63 -45 100 27 -98 -8 95 -17 -82 43
4049 43 54 -73 -34 105 16 -104 12 94 -36 -72 63 48 -74 -16 88 -3 -78 34 88 -52 -48 79 30 -80 5
4074 5 101 -10 -93 50 76 -75 -41 94 22 -102 4 90 -46 -85 74 62 -73 -17 90 -12 -101 28 89 -53
4098 -53 -72 77 52 -86 -10 99 5 -88 53 81 -65 -51 82 23 -86 -8 96 -27 -83 62 68 -68 -19 95 12
4123 12 -88 25 93 -37 -82 54 53 -77 -7 89 1 -90 34 84 -53 -72 75 40 -82 -9 96 -36 -96 38 84
4148 84 -67 -44 85 23 -84 29 100 -38 -70 78 71 -72 -29 86 6 -89 34 87 -55 -73 72 62 -83 -18 96
4173 96 -10 -82 27 66 -71 -68 83 43 -81 -19 84 -19 -65 61 80 -64 -42 83 31 -84 3 93 -31 -54 69
4198 69 60 -85 -27 109 25 -72 28 86 -52 -44 91 46 -96 -14 103 1 -80 37 74 -60 -36 79 9 -110 -16
4223 -16 84 -20 -93 36 49 -83 -33 103 7 -106 -1 102 -17 -66 52 53 -69 -23 97 3 -102 31 92 -32
4247 -32 -57 71 40 -71 -17 104 -11 -97 48 87 -59 -32 90 16 -65 12 100 -36 -66 46 52 -64 -56 73 9 -88
4273 -88 70 67 -60 -98 61 31 -59 -22 92 8 -94 39 29 -59 -64 121 4 -68 -94 92 43 -9 138 37 -107
4298 -107 -93 67 -10 -95 11 89 -45 -9 100 92 -87 -3 132 64 -80 31 52 -41 -27 80 37 -99 -13 98 8
4323 8 -81 26 50 -65 -49 91 24 -94 -1 109 -9 -64 60 57 -71 -34 112 24 -93 22 100 -9 -56 69 52
4348 52 -71 -9 96 10 -85 32 88 -44 -42 65 33 -74 1 107 -19 -84 37 72 -48 -39 77 11 -79 7 95 -39
4374 -39 -75 59 54 -65 -23 83 -6 -71 40 88 -56 -61 66 39 -70 -2 90 -12 -66 55 81 -45 -43 90 37 -64
4400 -64 11 89 -31 -68 60 66 -69 -34 81 21 -65 25 67 -28 -52 63 42 -74 -32 82 9 -78 35 72 -29 -41
4426 -41 64 35 -65 -6 81 0 -59 47 64 -39 -31 76 20 -69 21 90 -16 -46 63 63 -47 -20 79 19 -71 28 75
4453 75 -29 -53 57 36 -57 -4 72 -16 -66 39 55 -51 -42 58 31 -55 -3 75 -17 -62 43 64 -50 -23 68 17 -58
4480 -58 6 71 -19 -30 55 47 -46 -1 82 14 -46 35 63 -27 -32 70 41 -59 -2 79 -4 -55 37 54 -33 -27 66 9 -66 11 68
4511 68 -29 -53 21 29 -64 -17 59 2 -49 15 73 -14 -37 52 39 -44 -3 71 -5 -71 31 61 -24 -25 58 27 -47 22 60 -10 -37
4542 -37 41 56 -34 -22 56 9 -39 17 65 -34 -48 49 42 -30 -16 60 2 -60 21 52 -48 -47 52 17 -47 -10 41 -18 -47 48 48
4573 48 -43 -26 63 28 -36 14 54 -16 -29 54 33 -43 -16 68 22 -41 12 37 -27 -25 47 17 -67 1 61 7 -41 11 28 -26 -7
4604 -7 55 19 -42 -2 56 -7 -44 28 19 -37 -2 48 -4 -54 8 58 -11 -42 37 19 -36 -11 55 6 -50 30 57 -14 -24 44 33
4635 33 -28 14 55 -12 -47 28 47 -17 -12 34 4 -46 4 32 -13 -39 24 47 -7 -10 42 10 -32 16 42 -20 -38 24 40 -14 -1
4666 -1 51 5 -33 23 46 -19 -14 44 30 -35 5 32 -3 -16 41 34 -26 -15 41 16 -26 3 33 -13 -31 37 20 -36 -27 50 5 -28
4698 -28 2 26 -16 -23 46 26 -38 4 42 9 -20 18 28 -22 0 43 21 -22 5 49 16 -23 17 16 -16 -8 47 14 -35 15 46 -5
4730 -5 -28 23 22 -19 5 35 1 -31 16 41 -16 -18 28 20 -22 13 35 -17 -36 9 35 -14 -17 24 3 -22 9 31 7 -14 34 32 -12
4763 -12 -4 24 16 -9 29 31 -6 -14 25 31 -15 0 29 10 -21 -2 38 -11 -21 21 19 -19 -9 19 -4 -31 15 28 -19 -22 21 4 -16 1
4797 1 29 -2 -14 5 20 -20 -4 31 3 -2 18 14 16 3 49 13 3 -9 3 13 -26 51 58 12 -10 24 35 -3 -13 3 -19 11 -1
4830 -1 8 -48 -32 40 34 -66 -44 -16 -21 -60 -1 48 -15 -12 -13 24 12 39 14 42 -41 6 22 -29 -21 62 -21 -20 6 4 52 -32 -8 31
4864 31 -27 -11 37 -16 -13 0 27 23 -19 16 23 -21 -72 22 -9 -5 -4 8 -4 -25 -31 -11 -39 -5 1 14 -5 -1 10 -9 -1 21 17 -11 -23
4899 -23 16 9 -2 3 22 3 -5 29 15 -12 -3 25 24 -11 19 9 0 -8 21 21 -12 -1 17 8 -21 9 3 -19 -16 8 4 -19 -19 10 -2 -14 -5
4936 -5 17 -5 -17 11 20 -15 -12 12 2 -14 1 18 -14 -11 22 11 -18 -12 28 11 -9 12 34 -9 -8 37 11 -27 -4 30 -3 -22 6
4969 6 14 -5 -1 41 13 -25 -6 39 5 -29 11 20 -29 -11 29 6 -18 1 30 4 -17 10 -2 -22 0 34 -3 -30 14 37 -13 -11 36
5002 36 23 -14 17 45 0 -17 21 30 -14 -10 32 22 -25 22 37 -13 -30 20 31 -22 -8 36 1 -40 7 32 -20 -36 35 25 -27
5033 -27 -7 44 2 -28 25 37 -17 -18 43 38 -25 0 40 -5 -23 24 40 -21 -18 40 20 -21 16 46 -4 -23 46 28 -23 -15 45 15
5065 15 -24 18 46 -23 -22 40 22 -50 -7 49 -1 -28 16 39 -28 -15 47 16 -31 3 54 -8 -22 36 35 -31 -8 51 12 -40 17
5096 17 59 -14 -25 51 23 -29 3 46 -5 -46 16 51 -22 -20 46 27 -36 0 60 -1 -34 32 30 -31 -24 45 14 -36 14 50 -20 -33
5128 -33 39 30 -37 -8 53 14 -39 18 53 -24 -31 50 43 -43 17 53 9 -40 32 55 -30 -13 61 34 -44 0 62 -12 -39 28 41 -40
5160 -40 -21 47 9 -45 8 52 -19 -31 35 37 -50 -4 54 -7 -40 32 44 -36 -30 41 24 -44 15 52 -18 -40 33 53 -40 -21 61
5191 61 18 -46 15 71 -4 -28 52 49 -36 -4 58 1 -57 3 47 -32 -35 48 30 -55 0 64 6 -50 24 48 -35 -33 57 29 -65 9
5223 9 61 -10 -35 42 48 -43 -21 66 22 -49 18 64 -24 -44 47 29 -56 -4 73 10 -48 33 61 -23 -32 50 25 -54 9 64 -16 -58
5255 -58 35 45 -33 -39 63 16 -70 6 62 -23 -63 33 47 -54 -23 60 7 -64 12 70 -19 -46 66 43 -42 -2 65 -4 -53
5284 -53 44 76 -38 -41 60 33 -52 8 77 -8 -49 50 62 -44 -33 72 33 -54 15 65 -23 -41 53 40 -65 -18 78 6
5312 6 -62 34 68 -49 -44 61 39 -55 -5 75 3 -51 43 60 -43 -33 83 29 -68 8 70 -18 -43 57 50 -46 -12 71 20
5341 20 -72 14 64 -45 -51 49 39 -72 -28 82 -5 -77 27 67 -34 -40 73 22 -63 2 83 -12 -70 39 56 -56 -33
5368 -33 73 7 -73 13 85 -22 -62 57 61 -61 -7 75 9 -67 36 79 -25 -51 73 53 -63 5 84 -12 -64 39
5394 39 75 -52 -55 68 26 -77 3 76 -18 -73 54 74 -58 -30 76 17 -68 25 70 -30 -51 76 52 -68 -16 82
5420 82 21 -63 31 83 -46 -45 69 40 -82 4 89 -9 -69 55 70 -57 -29 80 34 -79 2 80 -13 -68 61 42 -72
5447 -72 -28 77 7 -81 20 89 -43 -58 57 51 -81 -24 100 -10 -71 46 76 -43 -40 88 33 -70 7 90 -20
5472 -20 -65 60 64 -51 -29 82 23 -78 16 99 -35 -58 66 59 -73 -9 87 7 -90 29 93 -57 -63 82 46 -83
5498 -83 -15 85 -11 -86 40 78 -59 -38 91 33 -89 18 97 -20 -64 65 77 -55 -18 114 24 -78 32 100
5522 100 -50 -63 72 53 -78 -17 91 -11 -84 44 88 -68 -56 84 32 -89 2 97 -21 -94 47 73 -73 -37
5546 -37 90 15 -90 26 89 -43 -80 66 59 -79 -21 104 7 -91 36 100 -57 -52 98 59 -81 -7 110 -1 -77
5571 -77 71 95 -66 -51 108 46 -91 4 101 -25 -74 65 65 -84 -41 97 3 -92 28 90 -43 -73 84 61 -86
5596 -86 -23 104 -1 -87 50 84 -72 -55 112 38 -102 4 106 -20 -81 74 88 -75 -34 112 23 -105 32
5619 32 107 -29 -71 85 69 -77 -6 121 7 -98 43 93 -62 -72 82 53 -91 -14 111 -31 -101 50 80 -75
5643 -75 -51 95 18 -98 20 119 -38 -80 70 79 -79 -36 103 -3 -103 42 102 -53 -69 80 71 -83 -28 103
5667 103 -11 -99 52 93 -85 -62 93 45 -87 -2 107 -31 -92 69 85 -95 -50 109 11 -92 16 99 -58
5690 -58 -81 85 70 -104 -31 110 4 -101 39 104 -66 -60 107 52 -102 -7 118 -12 -95 54 76 -85 -46 105
5714 105 35 -117 -5 106 -33 -103 76 73 -93 -30 113 10 -118 32 103 -61 -78 87 49 -114 -16 108 -19
5737 -19 -105 38 103 -74 -63 94 30 -109 6 118 -36 -107 67 80 -82 -45 116 16 -106 39 122 -45 -98
5760 -98 80 69 -87 -29 111 -4 -108 45 100 -77 -75 85 53 -116 -11 114 -25 -102 72 93 -89 -71 106
5783 106 27 -109 13 123 -37 -95 85 75 -113 -35 117 8 -109 43 99 -65 -81 107 69 -116 -24 133 -8
5806 -8 -99 63 107 -85 -66 116 40 -126 -2 127 -35 -98 85 89 -114 -40 124 13 -119 23 104 -64 -100 100
5830 100 67 -110 -22 136 1 -123 52 117 -84 -72 109 39 -117 -8 125 -23 -113 75 104 -97 -59 124 25
5853 25 -124 26 124 -47 -111 96 77 -121 -35 123 -8 -131 45 120 -71 -81 111 52 -119 -14 126 -31 -114
5876 -114 60 98 -97 -59 125 27 -130 0 138 -40 -97 96 78 -102 -34 132 14 -131 39 119 -64 -91 98
5899 98 71 -115 -18 139 -15 -126 55 117 -90 -83 114 42 -128 0 137 -52 -129 79 102 -104 -60 118 7
5922 7 -129 28 129 -70 -105 90 87 -116 -30 133 3 -123 60 115 -90 -86 114 57 -119 -15 140 -29 -117 83
5946 83 114 -100 -70 130 44 -126 5 120 -50 -123 84 77 -120 -58 140 11 -123 27 118 -92 -93 109 69 -141
5970 -141 -23 149 3 -135 50 105 -96 -60 143 40 -143 5 152 -37 -124 76 82 -111 -56 139 13 -144
5992 -144 31 131 -77 -105 101 67 -130 -18 142 -15 -152 46 122 -83 -93 97 55 -135 -4 134 -41 -144
6014 -144 78 117 -107 -74 128 20 -132 31 142 -68 -116 112 100 -106 -34 131 -6 -132 61 134 -95 -99 132
6037 132 66 -124 -8 131 -28 -117 89 120 -110 -80 138 50 -132 1 121 -67 -104 97 86 -131 -47 135 14
6060 14 -142 46 113 -82 -104 113 63 -145 -29 144 -2 -136 57 103 -107 -67 138 44 -154 5 156 -27
6082 -27 -118 81 104 -116 -46 149 22 -151 20 147 -64 -110 105 68 -140 -27 147 -13 -153 46 129 -86
6104 -86 -89 107 47 -140 4 160 -28 -134 81 110 -109 -64 140 17 -144 15 153 -62 -111 104 99 -114 -34
6127 -34 149 6 -139 57 147 -84 -104 131 74 -129 -10 146 -34 -142 69 120 -105 -103 127 41 -145 11 141
6150 141 -62 -117 112 96 -135 -65 138 20 -144 35 127 -77 -106 121 73 -136 -41 158 -16 -140 60 125 -92
6173 -92 -83 136 53 -140 -1 143 -32 -132 92 110 -121 -66 148 29 -139 29 138 -59 -118 92 81 -144 -51
6196 -51 146 -15 -168 44 118 -91 -98 121 55 -143 -18 161 -35 -141 75 122 -118 -73 157 35 -142 18
6218 18 150 -54 -113 104 104 -130 -59 162 0 -154 47 138 -80 -99 124 75 -143 -23 158 -4 -139 76 125
6241 125 -102 -79 129 41 -155 -6 142 -55 -138 87 98 -123 -57 143 9 -153 30 141 -73 -108 115 79
6263 79 -143 -14 169 -6 -145 83 131 -96 -92 131 52 -141 3 158 -40 -136 91 115 -118 -70 143 24 -153
6286 -153 33 156 -76 -130 109 93 -129 -46 137 -5 -147 54 136 -117 -117 131 68 -140 -27 142 -42 -129 88
6309 88 120 -123 -92 143 44 -146 26 139 -55 -104 118 103 -145 -59 165 17 -142 40 133 -90 -108 135 61
6332 61 -165 -36 167 -16 -155 69 122 -118 -89 150 41 -172 -1 167 -46 -124 96 92 -125 -55 158 5
6354 5 -179 30 156 -72 -132 110 66 -139 -5 170 -21 -163 75 152 -79 -99 131 54 -144 17 181 -63
6376 -63 -137 100 125 -121 -76 140 16 -158 38 151 -85 -143 120 97 -138 -35 149 -11 -148 85 145 -110
6398 -110 -116 144 75 -143 -21 147 -36 -141 94 133 -122 -80 158 45 -161 10 145 -63 -119 117 91 -143
6420 -143 -70 159 22 -153 35 133 -82 -107 140 77 -167 -39 167 -21 -154 74 122 -121 -82 172 55 -170
6442 -170 -2 181 -42 -142 104 98 -140 -54 174 15 -170 40 165 -62 -107 124 74 -153 -42 165 -16 -156
6464 -156 56 154 -120 -80 124 6 -158 27 152 -48 -162 84 136 -144 -79 138 -10 -163 38 181 -76
6485 -76 -141 110 72 -127 -57 118 -13 -160 68 126 -126 -103 130 110 -136 -58 165 -71 -153 90 87 -117 -80 162
6509 162 62 -158 43 124 -94 -90 106 96 -134 -104 182 30 -196 59 125 -95 -106 193 95 -182 -59 113 -77
6532 -77 -149 22 145 -92 -58 142 55 -149 -66 203 -36 -193 162 148 -170 11 185 37 -148 25 152 -112
6554 -112 -124 129 68 -148 -26 188 -31 -165 58 152 -112 -103 174 71 -171 -23 160 -40 -144 98 122 -148
6576 -148 -55 161 32 -170 17 158 -69 -130 121 96 -143 -43 173 -2 -171 60 144 -96 -110 148 74 -156
6598 -156 -11 172 -25 -147 80 137 -113 -85 155 36 -168 4 161 -61 -152 95 100 -156 -68 157 1 -181
6620 -181 34 159 -91 -132 124 69 -158 -48 173 -29 -172 77 141 -110 -102 144 57 -159 12 173 -45 -159
6642 -159 106 131 -135 -67 160 18 -159 31 150 -87 -138 129 103 -144 -49 155 -16 -161 78 148 -128 -122 142
6665 142 70 -148 -11 166 -38 -145 94 123 -141 -95 172 41 -160 26 163 -72 -129 142 108 -152 -57 180
6687 180 14 -162 44 144 -93 -102 158 65 -181 -25 175 -23 -157 76 121 -122 -74 164 33 -194 -4 158
6709 158 -52 -142 91 94 -132 -61 169 6 -192 42 164 -72 -133 120 83 -144 -18 182 -21 -171 82 162
6731 162 -100 -95 139 53 -161 16 184 -66 -166 106 134 -129 -74 153 14 -158 50 170 -102 -147 126 109
6753 109 -142 -59 149 -24 -163 68 142 -121 -122 144 78 -152 -19 162 -38 -137 106 132 -138 -96 158 52 -156
6776 -156 13 154 -57 -122 139 116 -156 -54 173 19 -153 40 146 -105 -95 153 85 -178 -27 177 -18
6797 -18 -148 85 133 -132 -79 161 37 -187 4 161 -50 -148 100 99 -146 -59 174 13 -180 36 164 -69
6819 -69 -126 132 86 -156 -12 172 -22 -165 76 158 -89 -101 137 54 -163 6 183 -40 -151 105 128 -129
6841 -129 -73 157 22 -161 46 165 -79 -145 122 112 -143 -48 168 -12 -162 63 144 -119 -127 140 70 -155 -8
6864 -8 160 -50 -162 95 121 -139 -95 154 44 -169 17 161 -70 -139 134 123 -148 -66 171 -1 -178 51
6886 51 159 -96 -120 148 87 -169 -11 172 -16 -164 85 132 -124 -100 150 47 -168 1 168 -65 -152 116
6908 116 132 -142 -66 159 12 -171 52 165 -101 -126 130 80 -154 -35 179 -4 -158 85 144 -128 -99 166
6930 166 63 -174 -1 167 -52 -155 100 128 -130 -84 165 17 -169 21 161 -85 -137 122 105 -163 -62
6951 -62 180 -2 -172 46 140 -97 -116 146 68 -162 -9 184 -32 -164 90 125 -129 -89 163 29 -177 16
6973 16 181 -66 -145 119 107 -142 -45 185 -4 -176 52 165 -105 -121 152 99 -151 -11 185 -30 -169 94
6995 94 166 -116 -99 147 52 -153 9 169 -54 -146 113 131 -130 -78 160 25 -146 52 160 -100 -137 135 104
7018 104 -155 -48 165 -21 -160 93 151 -136 -120 164 71 -170 -13 170 -49 -144 116 121 -165 -82 186 44
7040 44 -156 14 173 -85 -119 143 98 -170 -36 192 28 -173 50 157 -97 -87 168 64 -175 -5 200
7061 200 -29 -162 77 125 -117 -85 172 47 -180 8 188 -51 -140 88 97 -144 -16 186 -14 -210 65 176
7083 176 -91 -135 114 83 -167 22 221 -12 -146 77 176 -105 -73 121 69 -187 23 185 -76 -152 113 134
7105 134 -177 -62 168 -1 -178 44 186 -101 -120 158 74 -120 -47 166 2 -173 99 137 -130 -92 149 96
7127 96 -194 -4 147 2 -151 29 143 -144 -33 226 26 -164 21 202 -33 -119 47 103 -135 -77 149
7148 149 -29 -168 38 183 -70 -5 175 33 -135 -17 188 -77 -127 75 72 -69 -70 213 18 -197 61 152
7170 152 -55 -66 107 128 -146 -58 183 -24 -152 69 116 -121 -93 137 112 -225 9 149 -76 -195 103 141
7192 141 -85 -152 112 70 -137 19 137 -34 -184 160 117 -155 -83 194 34 -148 30 151 -122 -171 79 197
7214 197 -114 -26 283 -17 -189 101 228 -132 -132 171 49 -209 -4 148 -97 -159 120 183 -138 -55 144 1
7236 1 -159 62 139 -62 -123 139 30 -163 -59 132 -54 -197 32 182 -89 -87 143 91 -111 -85 205 3 -115
7259 -115 74 209 -128 -84 211 68 -145 36 141 -106 -133 119 62 -182 -49 129 9 -129 100 144 -165
7280 -165 -160 162 125 -227 -23 190 -25 -127 80 107 -121 -71 163 113 -173 48 165 -49 -155 88 148 -160
7302 -160 -63 141 23 -168 53 144 -123 -195 141 74 -141 -67 181 -2 -207 72 134 -60 -113 173 134 -199 0
7325 0 169 -43 -173 67 137 -110 -45 138 -28 -176 47 157 -27 -160 130 93 -108 -10 215 -4 -212 134
7347 134 149 -103 -141 145 75 -178 6 202 -16 -177 71 192 -76 -101 115 22 -155 103 109 -33 -137 111
7369 111 115 -150 -80 126 16 -184 51 93 -111 -127 192 117 -197 -42 140 -67 -73 56 108 -118 -122 135 2 -176
7393 -176 40 121 -18 -128 120 137 -201 -56 172 20 -179 32 169 -92 -109 122 70 -175 -44 193 4
7414 4 -160 65 168 -90 -91 156 51 -169 -11 176 -14 -159 123 107 -121 -52 149 23 -149 24 144 -77
7436 -77 -109 111 115 -124 -31 160 -28 -146 59 163 -90 -116 141 39 -194 -21 181 -61 -138 113 137 -127 -109
7459 -109 175 40 -184 24 182 -91 -124 140 143 -102 -70 180 13 -128 38 160 -100 -141 100 62 -134 -67
7481 -67 139 -6 -161 88 140 -122 -77 179 78 -144 1 134 -57 -99 115 120 -148 -68 177 58 -155 8
7503 8 159 -51 -88 136 68 -154 -26 176 -18 -170 66 112 -76 -75 162 24 -180 -18 171 -26 -153 44
7525 44 160 -147 -55 119 16 -166 -30 169 -75 -90 51 133 -135 1 192 -56 -168 31 184 -72 -109 130
7547 130 0 -167 33 130 -30 -144 48 86 -123 -89 108 54 -156 5 157 -23 -130 57 122 -124 -45 146
7569 146 -4 -130 38 150 -70 -106 146 99 -153 -53 168 -4 -138 28 123 -69 -136 139 54 -123 -18 171
7591 171 -80 -150 82 148 -136 -52 171 27 -164 36 256 -141 -144 86 98 1 -19 127 56 -150 52 1 -190
7614 -190 -180 174 16 -115 40 122 10 -65 79 126 -120 -63 169 52 -235 11 165 -94 -152 111 128 -160
7636 -160 -107 172 13 -198 62 121 -56 -107 172 118 -158 -17 136 -27 -168 81 114 -108 -64 138 29 -133
7658 -133 28 104 2 -123 98 97 -128 -50 179 -13 -169 6 148 -110 -119 123 80 -125 -36 145 -31 -152 83
7681 83 137 -156 -81 127 57 -149 42 163 -28 -164 82 58 -98 -79 124 47 -137 29 170 -113 -180 104 67
7704 67 -129 -61 193 43 -172 75 178 -100 -101 120 56 -112 2 162 -40 -167 91 173 -159 -130 184 44
7726 44 -83 100 102 -61 -104 108 64 -89 -75 90 90 -115 63 140 -109 -138 120 79 -195 -32 132 -104 -104 92
7750 92 185 -121 -82 95 81 -145 28 113 2 -114 109 100 -141 -112 113 125 -38 47 152 -21 -176 109 156 -93
7774 -93 37 141 25 -63 93 129 -60 -22 94 -6 -205 13 116 -54 -109 54 113 -75 -19 107 -52 -119 62
7797 62 143 -99 -42 70 37 -64 28 193 2 -214 0 179 -105 -65 70 -7 -145 55 94 -71 -176 131 170
7820 170 -121 -60 134 -42 -136 27 160 -73 -150 67 107 -138 -38 128 25 -77 148 120 -45 -122 107 101 -132
7843 -132 -38 106 -18 -109 54 103 -61 -37 188 1 -115 -3 172 -44 -82 68 171 -87 3 132 14 -137
7865 -137 101 131 -35 -62 24 103 -133 3 178 4 -111 118 102 -75 -52 130 58 -116 9 163 -29 -34 4
7888 4 91 -99 -93 144 14 -150 22 195 11 -93 74 119 -124 -75 169 11 -181 78 101 -83 -84 91 22 -125
7912 -125 3 159 -5 -66 122 121 -88 -137 128 34 -110 33 140 -82 -132 85 66 -114 -59 127 -6 -120 45
7935 45 97 -76 -137 90 15 -154 -43 123 -21 -130 28 65 -126 -81 118 25 -152 39 111 -83 -125 107 114 -91
7959 -91 -72 107 14 -112 40 110 -86 -107 110 77 -113 -4 146 -12 -127 58 104 -82 -78 129 46 -127 3
7982 3 127 -49 -115 82 108 -92 -61 124 23 -137 18 128 -66 -108 103 82 -108 -27 128 -1 -108 58 114
8005 114 -74 -82 118 59 -115 -15 120 -26 -111 69 84 -100 -61 135 28 -133 19 116 -42 -87 91 87 -122
8028 -122 -41 147 14 -127 31 124 -69 -80 116 53 -126 -9 138 -15 -116 64 104 -88 -57 116 39 -131
8050 -131 19 143 -41 -109 67 92 -92 -34 121 19 -131 43 124 -59 -93 85 67 -111 -22 129 -26 -133
8072 -133 57 126 -78 -80 100 49 -108 6 132 -46 -109 68 105 -89 -53 106 16 -114 35 117 -78 -99 98
8095 98 84 -100 -43 117 -1 -103 58 104 -90 -90 105 63 -125 -17 108 -13 -92 71 92 -98 -71 124 35 -125
8119 -125 3 122 -44 -98 96 72 -102 -43 129 23 -115 31 108 -58 -60 109 59 -107 -12 138 -13 -111 60
8142 60 97 -77 -57 123 31 -126 13 134 -30 -105 68 80 -100 -22 129 -5 -134 34 130 -53 -91 79 52
8165 52 -111 -18 129 -24 -124 42 106 -67 -82 95 45 -111 15 128 -39 -116 72 102 -84 -60 106 21 -103
8188 -103 28 122 -48
8191d8
$$ Imaginary data points
##PAGE= N=2
##DATA TABLE= (X++(I..I)), XYDATA
0 0 0 0 0 0 0 0 0 0 0 0 0 0 0 0 0 0 0 0 8 -8 8 -8 8 -8 16 -16 16 -19 24 -25 32 -33 40 -43 49 -56 62 -69 78 -87
40 -87 95 -106 118 -131 144 -160 176 -193 212 -234 260 -285 313 -347 383 -426 473 -528 592 -671
60 -671 764 -882 1032 -1233 1516 -1941 2649 -4045 7758 -37215 -82010 62735 54550 -69666
74 -69666 -29786 75154 -3493 -73593 28251 66364 -51259 -51741 62455 28859 -71443 -1839
86 -1839 72154 -26055 -70292 49795 61464 -64771 -46010 72169 23599 -71640 2244 66474
98 66474 -27134 -55153 49240 42854 -61170 -23605 66488 2143 -63599 22968 57503 -44185
110 -44185 -45579 62212 32257 -70345 -14328 70747 -5580 -62984 26678 50094 -45933 -34820
122 -34820 58785 17183 -64166 1248 60351 -21996 -52138 39377 37302 -55462 -22098 64059
134 64059 4806 -66063 11123 58310 -28629 -46340 42535 29489 -53391 -11931 57985 -5329
146 -5329 -55356 21899 46715 -35940 -32310 48075 16236 -55135 1191 57840 -15468 -51537
158 -51537 30255 41311 -40754 -25431 48904 8502 -51716 9113 50465 -23288 -42139 35538
170 35538 29206 -44484 -13203 49476 -4125 -50715 19259 45782 -32622 -36585 41473 22177
182 22177 -47325 -6334 47698 -11363 -45663 25017 37416 -36368 -25764 43058 10468 -46358
194 -46358 5025 44533 -20464 -39284 32836 30225 -40954 -17603 45054 3460 -44122 11872
206 11872 40264 -24591 -31893 35081 21517 -40399 -7662 42887 -5478 -39648 19515 33918
218 33918 -30752 -24798 38929 13856 -42181 -659 41807 -12308 -37213 23882 28611 -33587
230 -33587 -18111 38891 5155 -40792 7441 37550 -20265 -31546 30016 21511 -37724 -10635
242 -10635 40068 -2668 -39522 14828 34469 -25548 -26029 33422 14800 -38082 -2653 38330
254 38330 -9732 -34420 21602 28061 -30054 -18161 35997 7348 -37296 5039 35765 -16068
266 -16068 -30096 26156 22501 -32503 -11917 36282 1064 -35452 10405 31168 -21104 -24194
278 -24194 29594 15325 -34514 -4982 35537 -6188 -33233 16251 26727 -25823 -18647 32240
290 32240 8599 -35726 1345 34400 -11920 -29853 21044 21623 -29071 -12282 33606 1816
302 1816 -34688 8371 31850 -17432 -25167 25137 15882 -30879 -5464 34004 -4169 -32646 13740
315 13740 28272 -21170 -20072 27298 10228 -30742 688 31947 -10112 -29159 18382 23350
327 23350 -24189 -14203 28364 3735 -30391 6350 29441 -15265 -25515 21931 18432 -26376
339 -26376 -9101 28136 -2070 -28624 11784 25991 -19990 -20956 25199 12862 -28055 -3173
351 -3173 28136 -7469 -26504 16691 22481 -23583 -16255 27336 7882 -27944 2314 26585 -12205
364 -12205 -23159 20605 18102 -25925 -10915 28370 2682 -27116 7021 23957 -16155 -19221
376 -19221 23376 13465 -27098 -6146 27553 -2110 -24861 10999 20214 -19165 -14511 25025 7986
389 7986 -27754 -1068 26603 -6653 -22514 14545 16550 -21648 -10166 25938 3092 -27234
401 -27234 3875 24798 -10956 -19393 17780 12309 -23576 -5068 26681 -1968 -26378 8564
413 8564 22526 -14715 -15880 20342 8061 -24367 -126 26015 -6869 -24370 12757 19371 -17530
426 -17530 -11606 21706 3238 -24126 4669 24186 -11194 -21308 16068 15504 -19445 -7394 21768
439 21768 -1270 -22739 8907 21570 -14749 -17794 18460 11278 -20642 -3113 21482 -5266
451 -5266 -20812 12510 18381 -17667 -13899 20343 7123 -21073 1131 20534 -9228 -18651 15849
464 15849 15113 -20180 -9890 21804 2915 -21192 5088 19078 -12700 -15778 18495 11269 -21704
477 -21704 -5570 22003 -1461 -20188 8828 16839 -15493 -12469 20273 7281 -22426 -1509
489 -1509 21496 -5089 -18329 11817 13942 -17347 -8668 20903 3085 -21721 2795 19883 -8655
502 -8655 -15845 14273 10763 -18521 -4968 20990 -626 -20647 6270 17818 -11638 -13090 16322
515 16322 7363 -19455 -1241 20604 -4589 -19328 9716 15444 -14377 -10072 17852 3798 -19903
528 -19903 2302 19684 -8037 -17348 12688 12666 -16528 -6778 18799 150 -19524 6017 18158
541 18158 -11231 -14662 15163 9373 -17749 -3131 18813 -3132 -17976 8994 15579 -13390 -11233
554 -11233 16530 5766 -17905 586 18026 -6370 -16119 11558 12893 -15085 -8000 17229 2386
567 2386 -17595 3595 16426 -9088 -13731 13501 9741 -16377 -4692 17458 -1172 -17164 6615
580 6615 14881 -11719 -11512 15186 6610 -17375 -1352 17348 -4505 -16028 9499 12805 -13749
593 -13749 -8566 16329 3319 -17323 2252 16623 -7475 -14178 11966 10436 -15001 -5406 16775
606 16775 197 -16438 5459 14966 -9957 -11658 13675 7573 -15516 -2321 16184 -2840 -15061
619 -15061 7906 12813 -11830 -9216 14487 4661 -15629 382 15079 -5699 -13418 10130 10276
632 10276 -13709 -6560 15229 1620 -15579 3181 13931 -8253 -11505 12131 7797 -14956 -3748
645 -3748 15678 -1094 -14857 5930 12435 -10477 -9032 14007 5093 -15742 -622 15750 -3730
658 -3730 -13627 8292 10536 -11846 -6244 14746 2250 -15454 2212 14731 -6058 -11819 9987
671 9987 8149 -12853 -3639 14803 -562 -14880 4488 13094 -8065 -9822 10922 5379 -13327
684 -13327 -1079 14184 -3271 -13899 6545 11363 -9729 -7887 11772 2999 -13581 1427 13765
697 13765 -5696 -12755 8706 9713 -11088 -5472 12556 506 -13183 4307 12877 -7974 -10878
710 -10878 10783 7703 -12102 -2936 12966 -1815 -12479 6641 11544 -9745 -8797 11963 5247
723 5247 -12416 -330 12308 -4380 -11166 8561 9397 -11262 -6639 12353 2752 -12316 1599
736 1599 11095 -6288 -9652 9734 7161 -12167 -4426 12388 314 -11802 3733 9766 -8121
749 -8121 -7715 11078 4902 -12754 -1914 12425 -1819 -10830 5793 8430 -9416 -5539 12163
762 12163 2729 -12934 671 12240 -3948 -9644 7789 6792 -10604 -3190 12798 337 -12669
775 -12669 2979 11238 -5853 -8094 8937 4650 -11229 -1044 12485 -2097 -12081 4764 9755
788 9755 -7444 -6509 9508 2429 -11357 950 11596 -4184 -10828 6233 7979 -8394 -4585
801 -4585 9685 400 -10845 3001 10695 -5859 -9355 7737 6447 -9094 -2583 9969 -1379
814 -1379 -10046 5103 9500 -7441 -7387 9147 4494 -9527 -304 9926 -3337 -9153 6931 8117
828 8117 -8848 -5599 9970 2431 -9857 1537 9243 -5304 -8003 8236 6147 -9907 -3645
841 -3645 10150 222 -9698 3117 8156 -6650 -6562 8889 4207 -10275 -1823 9905 -1582 -8950
855 -8950 4617 6953 -7635 -4855 9460 2362 -10194 383 9552 -3219 -7878 6060 5697 -8284
869 -8284 -3044 9907 684 -9773 2212 8887 -4751 -6576 7335 4259 -8940 -1298 10006
882 10006 -1294 -9417 4126 7954 -6342 -5329 8126 2516 -9373 374 9456 -3143 -8590
895 -8590 5479 6546 -7511 -3994 8697 751 -9439 1938 8788 -4647 -7499 6522 4962
908 4962 -8169 -2393 8719 -746 -8728 3371 7715 -5727 -5973 7414 3540 -8356 -608 8720
922 8720 -2125 -7997 4816 6739 -6641 -4371 8179 1935 -8486 1101 8339 -3690 -7084 6139
936 6139 5398 -7602 -2801 8588 113 -8569 2662 7703 -5198 -6106 7066 3723 -8379 -1156
950 -1156 8588 -1786 -8216 4189 6675 -6483 -4851 7665 2083 -8514 500 8275 -3212 -7432
964 -7432 5277 5589 -7042 -3362 7921 655 -8103 2105 7636 -4450 -6310 6356 4475 -7378
978 -7378 -1861 7965 -705 -7560 3459 6850 -5387 -5055 7085 3071 -7660 -383 7718 -2254
992 -2254 -6942 4850 5812 -6618 -3939 7621 1532 -7868 1001 7168 -3771 -6106 5894 4350
1006 4350 -7527 -2491 7900 -30 -7666 2377 6335 -5006 -4945 6776 2976 -7880 -924 7867
1020 7867 -1341 -7010 3546 5347 -5658 -3399 7299 1517 -7785 641 7506 -2583 -6093 4653
1034 4653 4305 -6239 -2034 7496 87 -7595 1983 6927 -3630 -5108 5359 2910 -6716 -617
1048 -617 7465 -1479 -7280 3319 6141 -4843 -4222 5945 1577 -6982 765 7191 -2951 -6723
1062 -6723 4431 5099 -5705 -2937 6367 191 -6906 2144 6656 -4173 -5817 5434 4107 -6119
1076 -6119 -1669 6432 -978 -6408 3295 5932 -4944 -4672 6036 2977 -6237 -465 6226 -1991 -5772
1091 -5772 4267 5125 -5591 -3680 6323 1843 -6225 631 5840 -3039 -5108 5017 4012 -6292
1105 -6292 -2593 6583 618 -6170 1715 5273 -4141 -4373 5736 2933 -6749 -1374 6643 -661 -5890
1120 -5890 2824 4556 -4994 -3226 6415 1682 -6981 -43 6502 -1805 -5263 3820 3752 -5480 -2073
1135 -2073 6583 492 -6762 1129 6027 -2677 -4392 4480 2685 -5841 -938 6596 -627 -6408 2095
1150 2095 5386 -3427 -3597 4807 1630 -5882 187 6338 -1750 -5986 2995 4616 -4214 -2709 5267
1165 5267 598 -5979 1303 6003 -2939 -5407 3972 3797 -4816 -1631 5494 -590 -5820 2458 5507
1180 5507 -3929 -4524 4806 2800 -5311 -591 5554 -1580 -5376 3480 4803 -4670 -3580 5197 1714
1195 1714 -5311 498 5178 -2506 -4628 4164 3773 -5179 -2519 5426 742 -5180 1321 4694 -3244
1210 -3244 -3912 4638 2809 -5392 -1379 5417 -395 -4937 2255 4111 -3931 -3020 5145 1773 -5601
1225 -5601 -320 5309 -1422 -4588 3111 3527 -4494 -2122 5430 634 -5665 867 5095 -2444 -4042
1240 -4042 3918 2656 -4998 -1166 5524 -383 -5389 1858 4558 -3266 -3342 4350 1799 -5114 -167
1255 -167 5371 -1357 -4944 2638 3863 -3839 -2557 4673 1018 -5010 631 4908 -2059 -4284 3268
1270 3268 3135 -4178 -1676 4789 129 -4905 1434 4539 -2801 -3592 3920 2298 -4676 -792 4900
1285 4900 -796 -4607 2314 3934 -3505 -2827 4360 1314 -4889 181 4821 -1734 -4313 3055 3286
1300 3286 -4171 -2023 4725 418 -4917 1070 4508 -2519 -3691 3611 2439 -4420 -984 4781 -504
1315 -504 -4738 1824 4078 -3012 -2989 3973 1705 -4469 -144 4607 -1319 -4279 2583 3508 -3475 -2187
1331 -2187 4187 769 -4431 792 4370 -2107 -3804 3182 2806 -3920 -1449 4289 -115 -4294 1668
1346 1668 3941 -3006 -3264 3759 1954 -4291 -504 4319 -1127 -4060 2517 3381 -3704 -2546 4208
1361 4208 1211 -4369 285 4053 -1905 -3521 3281 2754 -4159 -1691 4487 371 -4316 1099 3759
1376 3759 -2510 -2833 3761 2023 -4353 -867 4430 -340 -3938 1768 3216 -2948 -2184 4033 1196
1391 1196 -4548 -66 4395 -1073 -3667 2234 2547 -3487 -1496 4205 289 -4505 780 4033 -1957
1406 -1957 -3214 2819 1941 -3787 -561 4407 -618 -4492 1521 3753 -2533 -2606 3363 1065 -3995 288
1422 288 4316 -1489 -4091 2408 3314 -2994 -1930 3630 438 -3946 1076 4106 -2029 -3591 2899
1437 2899 2701 -3349 -1270 3657 -255 -3711 1772 3639 -2705 -3030 3291 1946 -3581 -580 3568
1452 3568 -1015 -3486 2281 3045 -3251 -2406 3596 1205 -3708 168 3356 -1838 -3110 2986 2465 -3777
1468 -3777 -1636 3901 395 -3730 936 3136 -2391 -2507 3510 1816 -4021 -840 4007 -310 -3493
1483 -3493 1712 2819 -2907 -1932 3862 1135 -4088 -56 3920 -944 -3128 2192 2233 -3232 -1267 3952
1499 3952 416 -4014 554 3594 -1568 -2793 2542 1654 -3521 -681 3961 -328 -3973 1135 3227
1514 3227 -2132 -2287 2878 947 -3684 55 3854 -1127 -3684 1885 2865 -2638 -1700 3238 314 -3725
1530 -3725 868 3768 -1754 -3207 2550 2325 -3004 -926 3454 -370 -3544 1613 3447 -2373 -2696
1545 -2696 2993 1732 -3191 -286 3421 -1000 -3292 2094 2928 -2832 -2154 3235 1047 -3312 238
1560 238 3149 -1609 -2995 2511 2342 -3186 -1611 3283 422 -3325 789 2907 -2113 -2475 2932 1722
1576 1722 -3465 -918 3456 -302 -3178 1483 2646 -2543 -1913 3311 1103 -3535 -22 3475 -908
1591 -908 -2841 2107 2209 -2933 -1273 3529 410 -3535 727 3255 -1581 -2514 2557 1718 -3202 -708
1607 -708 3469 -300 -3414 1194 2841 -2110 -2103 2790 1070 -3291 -202 3278 -931 -3160 1655 2448
1623 2448 -2498 -1652 2921 528 -3250 395 3067 -1417 -2719 2219 1927 -2835 -986 3199 16
1638 16 -3163 1058 2863 -1927 -2252 2707 1400 -3051 -257 3291 -576 -2897 1693 2470 -2380 -1594
1654 -1594 3014 732 -3231 312 3148 -1224 -2676 2097 1945 -2779 -1077 3052 12 -3183 845
1669 845 2815 -1764 -2272 2385 1290 -2932 -532 3016 -569 -2995 1350 2520 -2059 -1836 2530 830
1685 830 -2938 128 2973 -1013 -2683 1877 2155 -2337 -1256 2795 313 -2837 799 2812 -1592
1700 -1592 -2324 2330 1710 -2631 -647 2842 -268 -2673 1376 2428 -2078 -1901 2679 1188 -2865 -158
1716 -158 2643 -903 -2524 1822 2023 -2482 -1475 2746 591 -2830 281 2455 -1405 -2185 2108 1495
1732 1495 -2741 -1005 2839 164 -2714 757 2197 -1735 -1703 2477 1118 -2833 -396 2834 -284
1747 -284 -2367 1291 1984 -2018 -1174 2697 618 -2932 124 2819 -787 -2196 1605 1561 -2252 -691
1763 -691 2840 -17 -2903 640 2609 -1322 -1849 1928 1001 -2503 -233 2772 -562 -2821 1128 2298
1779 2298 -1635 -1536 2030 479 -2426 315 2693 -1034 -2541 1432 2035 -1867 -1109 2173 191 -2401
1795 -2401 744 2433 -1336 -2163 1741 1650 -1960 -686 2179 -255 -2269 1096 2210 -1682 -1819 2093
1811 2093 1212 -2105 -257 2146 -695 -2051 1624 1822 -2147 -1387 2301 646 -2221 187 2061 -1239
1827 -1239 -1781 1967 1411 -2386 -923 2406 133 -2133 644 1812 -1614 -1424 2188 921 -2488 -300
1843 -300 2444 -300 -1976 1000 1552 -1804 -1071 2354 633 -2458 53 2330 -674 -1768 1372 1245
1859 1245 -2010 -681 2407 208 -2452 440 2141 -1041 -1449 1670 892 -2100 -177 2359 -330
1874 -330 -2361 865 1878 -1324 -1240 1831 407 -2197 256 2358 -865 -2163 1247 1575 -1662 -840
1890 -840 1969 -1 -2213 707 2108 -1289 -1848 1616 1234 -1852 -469 1966 -351 -2042 1019 1953
1906 1953 -1455 -1546 1770 887 -1845 -94 1895 -669 -1842 1358 1620 -1674 -1140 1916 525 -1843
1922 -1843 273 1785 -974 -1576 1596 1254 -1887 -771 1959 124 -1868 662 1614 -1367 -1262 1822
1938 1822 813 -2052 -302 2004 -348 -1765 991 1383 -1587 -934 1945 401 -2072 145 1904
1953 1904 -734 -1569 1323 1121 -1763 -592 2022 53 -2007 492 1762 -998 -1326 1484 843 -1785
1969 -1785 -255 1945 -273 -1846 811 1565 -1253 -1078 1629 535 -1833 56 1847 -599 -1654
1984 -1654 1092 1282 -1469 -770 1716 179 -1808 392 1690 -938 -1418 1379 957 -1703 -428 1831
2000 1831 -166 -1751 735 1487 -1238 -1091 1603 587 -1782 -31 1786 -501 -1587 1013 1241 -1414
2016 -1414 -758 1708 264 -1807 256 1715 -747 -1404 1175 976 -1499 -442 1705 -78 -1735 540
2032 540 1553 -946 -1175 1304 708 -1561 -165 1688 -354 -1634 808 1374 -1159 -933 1430 355
2048 355 -1587 222 1615 -724 -1478 1111 1138 -1362 -626 1502 36 -1532 560 1465 -1053 -1256 1350
2065 1350 849 -1497 -290 1523 -332 -1461 874 1272 -1295 -998 1502 559 -1524 -27 1425 -565
2081 -565 -1270 1077 1060 -1424 -753 1550 319 -1503 206 1334 -773 -1081 1275 820 -1536 -485 1604
2098 1604 87 -1417 440 1151 -956 -823 1410 516 -1621 -161 1602 -231 -1344 712 970 -1172
2114 -1172 -551 1534 177 -1662 162 1508 -563 -1168 923 682 -1332 -229 1573 -186 -1647 479
2130 479 1391 -782 -985 1080 432 -1367 66 1533 -453 -1516 731 1258 -947 -745 1161 209 -1325
2147 -1325 343 1483 -655 -1353 941 1090 -1053 -547 1201 -7 -1271 578 1324 -909 -1156 1137
2163 1137 823 -1193 -279 1220 -315 -1200 812 1137 -1149 -945 1264 535 -1286 -44 1151 -584
2179 -584 -1078 1032 905 -1337 -680 1358 249 -1294 233 1082 -785 -893 1198 701 -1391 -411 1392
2196 1392 51 -1191 454 968 -905 -686 1303 485 -1415 -151 1399 -148 -1120 610 834 -991
2212 -991 -498 1337 256 -1395 71 1289 -397 -1014 771 651 -1130 -313 1354 -28 -1406 279
2228 279 1165 -626 -866 901 376 -1246 -77 1327 -302 -1311 541 1029 -815 -639 1043 180 -1247
2245 -1247 211 1317 -485 -1146 766 886 -909 -415 1109 0 -1162 430 1215 -671 -974 917
2261 917 712 -986 -234 1133 -174 -1131 569 1069 -801 -838 973 487 -1063 -60 1069 -410 -1061
2278 -1061 734 899 -994 -674 1040 259 -1098 146 1002 -605 -923 876 679 -1100 -402 1124 31
2295 31 -1060 407 928 -770 -729 1043 484 -1134 -136 1166 -155 -962 601 806 -859 -511 1114
2312 1114 294 -1119 72 1104 -372 -871 727 683 -937 -375 1091 84 -1113 228 997 -537
2328 -537 -782 802 489 -1025 -230 1062 -148 -1073 417 884 -720 -665 897 317 -1056 -26 1036
2345 1036 -338 -965 610 745 -862 -453 1022 153 -1036 224 1001 -516 -806 807 598 -946 -253
2362 -253 1078 -20 -987 390 877 -656 -622 922 389 -1023 -73 1058 -209 -949 507 750 -754
2379 -754 -503 940 201 -1049 53 1006 -352 -863 594 587 -864 -349 961 20 -1050 229 953 -507
2397 -507 -762 694 437 -892 -123 1004 -187 -982 433 857 -623 -578 830 266 -904 108 986
2414 986 -379 -901 648 770 -719 -411 872 84 -889 276 891 -551 -784 763 596 -820 -279
2431 -279 843 -109 -857 422 791 -683 -696 783 426 -845 -125 798 -260 -781 555 660 -821 -548
2449 -548 870 299 -853 21 762 -385 -675 691 544 -874 -376 935 137 -832 198 707 -522
2466 -522 -514 846 375 -951 -157 952 -41 -773 365 610 -630 -360 887 177 -982 9 935 -194
2484 -194 -708 470 467 -718 -237 922 25 -984 130 860 -334 -657 516 341 -759 -98 899 -132
2502 -132 -954 240 782 -438 -551 594 236 -762 53 884 -280 -882 409 723 -504 -401 640 75
2520 75 -741 256 835 -425 -760 584 593 -606 -266 696 -45 -704 409 755 -566 -636 670 444 -665
2539 -665 -110 684 -221 -676 502 617 -697 -550 713 301 -711 -25 628 -321 -611 575 516 -750
2557 -750 -428 752 171 -710 87 591 -403 -515 654 421 -779 -271 781 56 -672 218 565 -472
2575 -472 -371 736 283 -793 -92 783 -98 -608 379 465 -584 -252 790 114 -793 79 722 -257 -546
2594 -546 458 316 -660 -114 782 -47 -795 188 650 -392 -481 523 212 -690 -29 728 -184 -719 306
2613 306 566 -449 -370 565 118 -678 94 727 -246 -633 412 507 -514 -261 608 33 -636 240 680 -355
2633 -355 -531 487 371 -566 -120 614 -116 -605 346 577 -465 -427 563 241 -603 2 574 -265 -564 435
2653 435 453 -561 -292 598 77 -612 110 532 -353 -475 494 344 -581 -201 602 -1 -589 219 510 -397
2673 -397 -388 529 263 -597 -78 616 -82 -538 281 449 -443 -308 556 172 -567 24 581 -204 -495 368 372
2694 372 -498 -211 582 45 -581 143 514 -314 -402 438 269 -526 -100 551 -82 -542 264 453 -405 -333 487
2715 487 169 -555 -6 522 -177 -454 372 368 -461 -244 531 86 -521 88 495 -244 -393 416 301 -498 -170
2736 -170 557 27 -520 137 444 -313 -334 453 206 -535 -72 544 -82 -495 215 374 -374 -227 495 99
2756 99 -549 28 529 -156 -437 288 279 -421 -140 507 -14 -536 151 490 -239 -358 352 190 -443 -12 517
2777 517 -102 -507 235 446 -305 -316 377 123 -445 69 494 -195 -484 290 396 -361 -251 393 43 -457
2797 -457 122 450 -278 -429 351 334 -386 -175 405 -40 -418 226 422 -343 -356 421 257 -417 -80 390 -111
2818 -111 -350 310 329 -413 -272 459 155 -429 10 363 -214 -312 369 243 -480 -174 481 66 -420 85 315
2839 315 -283 -240 409 151 -501 -90 478 -10 -409 135 280 -314 -181 439 102 -497 -14 485 -65 -369
2859 -369 208 251 -340 -103 468 23 -497 71 474 -133 -325 240 179 -351 -32 470 -68 -482 151 409 -210
2880 -210 -270 287 88 -379 71 439 -173 -449 217 358 -271 -211 302 16 -390 106 385 -241 -400 274 294
2901 294 -310 -151 326 -44 -363 179 367 -279 -347 330 256 -319 -87 336 -71 -323 236 335 -327 -282 368
2922 368 189 -340 -25 330 -138 -300 282 269 -368 -211 382 108 -340 39 284 -208 -251 321 178 -402 -129
2943 -129 375 11 -347 101 262 -254 -198 347 119 -408 -51 374 -56 -306 166 218 -293 -144 379 71 -395
2964 -395 23 368 -94 -282 221 198 -305 -87 388 14 -395 74 349 -156 -257 266 156 -326 -37 381
2984 381 -39 -374 122 305 -216 -211 283 95 -340 25 364 -120 -337 196 250 -264 -150 316 15 -343 94
3005 94 332 -184 -280 228 174 -287 -89 313 -40 -317 158 302 -221 -239 271 146 -302 -22 317 -72 -299
3026 -299 189 271 -241 -182 294 88 -314 25 322 -124 -276 215 222 -270 -134 308 19 -310 85 296 -184
3047 -184 -246 256 154 -291 -66 315 -49 -306 139 255 -223 -194 276 87 -301 -14 288 -115 -272 180 191
3068 191 -259 -118 285 21 -286 80 276 -173 -233 243 175 -256 -60 289 -22 -272 125 254 -195 -211 261
3089 261 130 -280 -41 286 -63 -249 180 230 -242 -159 284 94 -276 4 262 -114 -222 200 159 -276 -113
3110 -113 285 21 -285 44 216 -165 -173 227 102 -298 -54 289 -35 -250 112 174 -183 -103 267 56 -289
3131 -289 15 294 -56 -222 137 171 -189 -51 282 9 -290 60 285 -93 -195 161 123 -213 -27 268 -35
3152 -35 -291 93 269 -132 -196 164 86 -216 6 252 -90 -272 111 216 -177 -154 178 23 -221 59 231
3173 231 -135 -237 177 189 -174 -100 186 -7 -193 118 221 -163 -190 224 164 -175 -55 187 -28 -172 158
3194 158 205 -204 -162 218 126 -192 -35 179 -74 -167 176 162 -231 -147 231 74 -217 -24 168 -112 -170 171
3216 171 122 -245 -126 227 52 -199 24 143 -139 -126 203 83 -256 -61 245 23 -178 72 136 -137 -59
3237 -59 230 56 -236 2 240 -5 -151 86 96 -155 -29 239 6 -237 37 221 -46 -146 110 82 -162
3258 -162 0 221 -40 -249 59 200 -84 -152 114 47 -177 11 208 -67 -227 75 186 -107 -124 131 30
3279 30 -175 44 197 -90 -201 125 168 -110 -77 151 7 -145 82 183 -121 -163 152 132 -136 -34 142 -31
3301 -31 -140 103 141 -145 -130 155 84 -161 -18 140 -57 -142 113 109 -158 -107 155 55 -165 -5 133 -74 -131
3324 -131 122 104 -162 -74 169 34 -159 18 144 -86 -99 158 87 -166 -40 185 11 -143 56 130 -103 -74
3346 -74 161 69 -161 -5 161 -29 -124 74 86 -122 -48 143 11 -154 16 138 -53 -121 88 74 -129 -37 137
3369 137 -1 -144 36 121 -79 -83 111 46 -132 -12 141 -22 -135 66 127 -85 -89 124 47 -136 -1 154 -28
3392 -28 -129 77 105 -120 -65 136 26 -138 22 125 -54 -107 92 82 -110 -40 127 -7 -124 43 112 -79
3414 -79 -87 119 60 -116 -17 126 -15 -114 51 105 -67 -59 110 30 -121 -3 127 -42 -114 62 84 -102 -43 117
3438 117 3 -137 22 126 -48 -113 91 72 -115 -31 124 -19 -125 44 129 -66 -99 83 52 -104 9 114
3460 114 -24 -124 76 124 -79 -75 101 35 -96 20 121 -50 -99 94 108 -88 -46 103 11 -90 49 104 -69
3483 -69 -91 90 72 -98 -45 93 -3 -101 59 89 -88 -83 118 68 -103 -35 87 -16 -85 66 79 -115 -75 136 58
3508 58 -107 -17 110 -21 -69 93 69 -104 -55 139 54 -112 5 96 -37 -45 111 49 -118 -26 145 21 -109 14
3532 14 79 -45 -42 90 34 -127 -28 122 -2 -107 22 62 -70 -38 94 7 -120 -4 129 -12 -95 44 62 -69
3556 -69 -17 117 -4 -119 31 140 -19 -91 52 59 -76 3 125 -7 -124 44 125 -23 -74 62 34 -82 9
3579 9 111 -35 -108 64 118 -45 -71 65 16 -79 14 102 -60 -117 53 93 -56 -71 62 -1 -77 37 97 -63 -91
3604 -91 83 97 -69 -46 76 10 -83 42 102 -75 -84 93 86 -86 -28 82 -18 -67 75 81 -88 -83 101 61 -97 -14
3630 -14 79 -31 -71 70 63 -112 -70 109 52 -99 -10 75 -36 -61 93 47 -111 -43 120 28 -90 12 78 -29 -48
3655 -48 93 40 -101 -13 122 19 -82 46 75 -51 -32 106 21 -114 0 124 -22 -100 45 63 -78 -40 103
3678 103 -5 -126 12 111 -36 -91 65 61 -91 -20 110 -22 -110 38 101 -46 -73 89 39 -91 1 118 -28
3701 -28 -106 58 107 -61 -49 97 32 -91 16 109 -35 -82 72 73 -80 -38 97 16 -92 36 90 -57 -80 67
3725 67 51 -105 -31 97 -25 -100 55 91 -83 -73 97 43 -100 -2 123 -32 -101 73 97 -83 -41 103 38 -97
3749 -97 27 116 -34 -81 94 84 -86 -12 117 9 -89 37 104 -48 -72 81 49 -98 -9 102 -26 -95 62 76
3773 76 -73 -67 84 30 -110 -3 98 -36 -101 65 74 -86 -51 98 13 -101 23 92 -55 -81 94 67 -92 -29
3797 -29 109 1 -93 52 108 -62 -64 104 46 -100 -7 116 -13 -80 64 83 -89 -50 107 34 -108 1 88 -47
3821 -47 -92 61 53 -119 -52 104 3 -121 7 81 -51 -60 82 31 -117 -28 112 -11 -116 35 87 -70 -48 103
3845 103 22 -113 15 131 -20 -106 62 78 -63 -31 101 7 -119 35 121 -38 -101 64 54 -90 -8 96 -17
3868 -17 -115 47 111 -71 -89 66 30 -80 -1 90 -47 -113 64 95 -73 -71 80 22 -90 32 78 -63 -98 89 90
3893 90 -83 -28 92 10 -75 40 88 -73 -66 102 65 -85 -17 96 -16 -75 69 73 -92 -68 108 38 -113 -12 85
3918 85 -35 -73 80 50 -114 -46 117 19 -106 12 74 -42 -62 78 38 -127 -25 101 -2 -96 24 71 -62
3941 -62 -30 90 23 -118 7 121 -16 -93 48 56 -64 -21 100 0 -113 29 103 -29 -74 51 38 -78 -6 99
3965 99 -21 -105 45 102 -60 -75 61 26 -83 13 104 -40 -102 55 85 -71 -46 81 12 -79 34 98 -60 -93 78
3990 78 84 -75 -38 89 8 -82 48 81 -68 -74 75 52 -89 -25 83 -10 -61 45 72 -76 -68 90 30 -91 -5 84
4016 84 -26 -72 70 67 -77 -49 109 31 -82 8 87 -37 -67 81 66 -98 -26 110 17 -88 34 84 -60 -62 86
4041 86 40 -101 -14 91 -16 -103 38 69 -60 -41 73 23 -99 -5 94 -27 -91 50 60 -74 -26 102 1 -90
4065 -90 18 91 -47 -59 62 44 -74 -23 96 -2 -84 49 85 -45 -58 73 45 -69 8 107 -22 -77 72 80 -56
4090 -56 -40 92 8 -96 12 85 -52 -88 66 60 -79 -29 91 -10 -85 20 78 -63 -58 62 34 -83 -14 99 -2
4115 -2 -87 48 69 -58 -51 93 36 -89 14 113 -17 -76 62 71 -55 -13 92 19 -85 35 103 -32 -73 66 52
4140 52 -82 -14 88 -14 -92 31 79 -58 -74 65 26 -104 -5 85 -48 -94 54 82 -74 -74 77 25 -94 13
4164 13 88 -35 -74 73 80 -70 -44 88 28 -73 37 95 -58 -59 91 66 -69 -13 85 10 -64 59 88 -54 -49 86
4190 86 51 -82 -14 87 -17 -84 55 62 -77 -55 87 18 -97 4 82 -44 -62 68 35 -84 -28 108 19 -87
4214 -87 26 77 -49 -49 69 33 -98 -5 107 13 -78 28 84 -49 -25 90 31 -93 2 108 -16 -78 34 63 -64
4239 -64 -34 82 10 -103 19 96 -24 -73 44 42 -73 -12 113 -18 -93 41 89 -49 -82 74 25 -67 3 95 -25
4264 -25 -62 58 112 -60 -66 99 10 -67 25 109 -41 -96 49 59 -70 -9 91 33 -100 58 82 -61 -32 83 50
4289 50 -46 -49 64 -38 -93 45 91 -136 -92 100 4 -85 -40 61 -29 -116 62 77 -55 -40 123 32 -85 -6 82 -8
4315 -8 -16 63 54 -108 -35 117 10 -83 24 79 -31 -41 93 46 -96 -17 97 -5 -83 34 70 -71 -37 88 14 -99
4341 -99 0 95 -20 -84 41 40 -67 -43 74 7 -93 16 96 -26 -69 58 53 -66 -3 116 -5 -86 25 90 -33
4366 -33 -46 61 44 -69 14 91 -16 -73 57 71 -61 -39 76 8 -74 22 85 -48 -85 60 49 -65 -34 73 -13
4391 -13 -73 39 74 -59 -64 63 48 -76 -17 80 -12 -62 48 66 -54 -39 73 32 -62 21 86 -19 -51 59 51 -67
4417 -67 -37 72 26 -69 19 66 -36 -48 58 37 -76 -27 85 -5 -70 26 64 -53 -50 63 18 -80 -10 77 -12 -80 37
4444 37 59 -63 -41 76 20 -68 18 80 -29 -52 61 56 -54 -9 70 15 -61 29 74 -40 -44 58 36 -58 -5 74 -6 -68
4472 -68 26 45 -51 -35 58 15 -64 -19 54 -21 -61 38 51 -46 -20 67 14 -68 4 70 -27 -38 52 34 -59 -13 77 3 -54 17
4502 17 52 -18 -37 62 25 -65 6 72 -7 -55 39 51 -37 -15 50 9 -68 6 56 -21 -51 29 31 -44 -13 55 -4 -58 17 45 -27
4533 -27 -40 38 32 -27 2 51 -2 -53 32 65 -23 -32 53 36 -37 15 74 -18 -51 59 51 -39 -7 53 14 -38 27 52 -32 -42 54
4564 54 49 -45 -16 53 0 -47 32 35 -43 -36 53 25 -46 -11 42 -12 -40 30 35 -36 -29 53 15 -44 4 42 -6 -18 52 35 -49 -10 67
4597 67 12 -51 9 45 -17 -21 46 24 -50 5 59 -5 -47 10 22 -28 -15 57 2 -58 6 47 -7 -41 26 20 -35 -9 43 -2 -58
4628 -58 20 51 -25 -38 20 20 -42 -2 45 0 -37 19 53 -11 -13 34 17 -16 15 50 7 -36 30 54 -21 -19 31 17 -27 17 25 -31
4660 -31 -49 17 24 -25 -23 28 -10 -41 18 34 -24 -35 35 27 -33 -17 37 5 -38 24 34 -29 -25 39 21 -37 -1 48 1 -25 45 36 -11
4693 -11 -15 48 23 -25 10 47 -11 -14 30 20 -35 -16 43 10 -29 -5 28 -23 -29 19 5 -39 -17 35 -13 -40 6 19 -29 -17 27 11
4725 11 -49 13 50 -7 -27 26 36 -16 -3 43 16 -27 16 47 -2 -17 24 25 -14 0 41 -2 -20 20 40 -5 -29 30 18 -28 -8
4756 -8 21 -11 -24 6 24 -23 -25 19 10 -30 1 17 -14 -26 12 23 -21 -19 17 12 -14 7 22 -7 -21 40 20 -19 -2 33 11 -11 14
4789 14 29 -15 0 26 18 -19 13 18 0 -16 8 -2 -31 3 14 -6 -15 -2 26 7 -14 3 32 -8 -5 -15 11 21 -14 68 -19 -13 38
4822 38 47 8 20 -23 -5 5 30 -35 -73 -79 6 -46 34 12 7 -7 -35 -45 10 10 37 82 37 -15 -49 -8 -37 -42 6 -52 -73 -4 9
4855 9 54 44 -62 -21 -15 -29 32 -14 9 6 -11 22 8 -9 33 -17 -13 24 -28 31 -19 -5 -7 20 13 -19 -1 7 5 5 -25 -16 16 24 -5
4890 -5 -15 1 5 -7 9 9 -16 -18 8 19 -11 5 2 -7 -10 6 17 -15 -7 13 11 0 -4 11 5 2 8 18 -27 -11 20 21 -11 3 22 3 -4 18
4928 18 18 -8 -2 20 20 -3 -7 22 -2 -6 16 8 -23 -11 22 12 -22 -15 20 -13 -17 22 1 -33 -14 10 -2 -23 -5 23 -14 -14 22 3 -30
4963 -30 -9 31 11 -18 8 16 -6 5 35 9 -16 7 36 10 -19 22 17 -9 -7 33 16 -28 8 40 -8 -21 14 16 -26 -6 27 -11
4995 -11 -37 2 30 -11 -34 17 10 -20 2 16 -6 -31 -1 38 -12 -21 16 22 -28 5 42 -5 -21 35 43 -6 -9 33 11 -25 11 38 -9
5028 -9 -21 24 20 -22 -15 26 -5 -35 5 19 -24 -31 22 13 -38 -15 22 -5 -36 14 19 -29 -20 34 12 -30 -16 28 -6 -36 22 31 -31 -15
5062 -15 43 18 -31 7 48 -2 -19 33 41 -31 -3 44 6 -34 17 46 -16 -24 38 20 -53 -8 45 -2 -40 15 22 -35 -27 30 5 -53
5094 -53 -5 46 -8 -42 14 31 -46 -29 39 5 -50 9 48 -20 -33 30 22 -37 -6 51 6 -58 36 59 -26 -20 47 34 -39 7 60
5125 60 -9 -43 30 32 -50 -29 44 3 -54 8 37 -36 -43 35 39 -56 -21 37 -5 -50 8 46 -22 -31 40 19 -54 -12 63 4 -44 20
5157 20 34 -19 -16 50 26 -48 12 67 -19 -42 31 33 -46 -22 54 -2 -60 18 54 -26 -39 39 35 -50 -11 47 -9 -49 17 52 -37 -48
5189 -48 42 13 -59 -12 54 -19 -53 30 48 -38 -32 56 18 -45 19 66 -24 -42 53 50 -33 -6 67 13 -46 16 52 -35 -45 52 29
5220 29 -54 -11 60 10 -57 31 46 -43 -46 47 16 -57 -3 51 -11 -38 22 35 -55 -18 69 16 -52 21 60 -29 -41 41 33 -52 -7
5251 -7 67 5 -49 30 61 -33 -34 63 30 -60 6 80 -16 -54 32 47 -40 -28 68 16 -57 10 55 -26 -63 25 33 -57 -22 58 -4 -58
5283 -58 20 65 -41 -39 46 24 -50 -9 65 2 -45 42 57 -41 -32 64 24 -60 2 70 -9 -53 45 57 -46 -26 75 25 -61 9
5313 9 59 -28 -48 51 40 -65 -23 73 1 -72 13 62 -53 -48 65 23 -69 -17 70 -2 -62 35 61 -47 -30 82 20 -66 2
5342 2 77 -8 -46 51 52 -42 -22 81 6 -73 15 75 -33 -46 51 29 -56 -17 67 -14 -80 13 70 -43 -44 50 21 -71 -1 76
5372 76 -20 -78 30 56 -57 -45 69 8 -71 11 74 -20 -57 48 54 -59 -23 83 9 -62 25 82 -50 -51 69 43 -57
5399 -57 -5 81 -5 -67 37 65 -54 -41 66 18 -80 -4 70 -36 -85 44 45 -68 -46 72 14 -94 9 67 -36 -64
5425 -64 62 52 -72 -21 79 -5 -70 31 74 -57 -49 80 45 -74 -6 92 -6 -64 41 69 -52 -21 99 41 -77
5450 -77 15 79 -23 -67 51 44 -85 -33 83 6 -79 14 66 -54 -56 60 36 -85 -26 74 -15 -97 29 66 -62 -60 63
5477 63 28 -87 2 83 -23 -73 60 61 -72 -37 87 21 -91 19 97 -37 -67 60 55 -69 -27 90 7 -92 25
5502 25 79 -54 -61 66 31 -92 -14 86 -33 -93 37 65 -73 -54 77 17 -97 -4 82 -36 -79 63 54 -74 -33
5527 -33 94 2 -87 26 90 -39 -59 87 48 -77 -7 100 -3 -86 48 81 -67 -44 85 35 -81 -1 99 -37
5551 -37 -91 64 57 -74 -45 83 9 -101 7 96 -46 -81 73 66 -93 -45 82 -9 -89 44 92 -58 -67 105 50 -85
5577 -85 2 107 -8 -78 57 84 -69 -46 98 35 -92 5 103 -31 -67 67 65 -82 -46 95 13 -99 20 83 -54
5602 -54 -89 81 45 -104 -36 105 -11 -118 42 83 -78 -56 96 30 -107 2 109 -30 -90 58 67 -75 -38 111
5626 111 14 -107 31 119 -44 -76 80 58 -83 -2 114 -8 -105 48 102 -66 -67 82 45 -91 -10 100 -44 -108
5650 -108 46 81 -80 -55 77 11 -104 17 89 -49 -94 70 63 -101 -38 91 15 -98 41 93 -51 -76 85 62
5674 62 -99 -23 107 -9 -105 67 99 -70 -72 97 38 -99 -5 93 -31 -94 63 69 -100 -52 99 20 -115 15 83
5699 83 -61 -85 83 49 -116 -39 111 -9 -104 29 68 -64 -72 93 43 -111 -12 122 -20 -89 65 87 -70 -40
5723 -40 109 33 -119 17 118 -29 -94 63 70 -95 -27 118 0 -117 37 102 -62 -83 81 41 -106 -7 116
5746 116 -28 -114 45 87 -82 -64 94 32 -104 2 114 -47 -116 74 89 -101 -53 110 15 -111 31 121 -60
5769 -60 -85 91 81 -103 -23 118 -5 -104 51 104 -77 -71 95 47 -110 -2 114 -30 -102 64 82 -98 -63 107
5793 107 20 -125 9 98 -62 -103 87 68 -109 -38 117 3 -116 36 107 -67 -91 112 61 -101 -4 137 -3
5816 -3 -108 75 113 -73 -50 117 40 -117 14 131 -26 -106 81 74 -102 -36 128 10 -117 20 109 -67 -98 96
5840 96 62 -129 -39 121 -28 -119 44 101 -88 -75 113 41 -117 0 127 -32 -97 73 86 -101 -54 132 20
5863 20 -123 32 124 -50 -91 87 71 -119 -38 136 -12 -129 46 114 -80 -84 106 48 -132 -8 115 -27 -125
5886 -125 60 85 -103 -67 118 24 -126 10 122 -49 -119 73 73 -116 -42 136 0 -136 34 133 -68 -83 122
5909 122 67 -120 -4 143 -15 -124 61 118 -98 -89 107 44 -126 4 128 -63 -124 75 102 -112 -60 122 4
5932 4 -133 24 116 -77 -119 83 67 -126 -47 124 -22 -115 64 121 -90 -91 112 56 -130 -12 135 -31 -111 84
5956 84 109 -108 -56 133 50 -123 21 136 -42 -102 106 76 -132 -49 149 11 -141 30 111 -81 -92 115 53
5979 53 -147 -28 152 -18 -138 43 93 -92 -69 123 21 -149 -2 146 -43 -113 99 86 -115 -40 152 10
6001 10 -138 43 140 -55 -97 97 76 -109 -17 142 -13 -134 60 124 -95 -99 109 39 -131 5 133 -53 -135
6024 -135 77 106 -125 -75 114 14 -145 26 124 -95 -139 105 77 -126 -42 137 -5 -135 68 124 -89 -88 138
6047 138 66 -128 -7 145 -40 -109 88 108 -116 -65 164 46 -118 16 128 -60 -114 100 81 -143 -52 134
6069 134 9 -136 29 112 -82 -91 123 65 -147 -37 149 -28 -142 47 95 -99 -72 146 42 -155 2 158
6091 158 -36 -129 85 107 -119 -42 149 15 -140 42 149 -44 -94 116 77 -128 -19 161 -12 -140 60 131
6113 131 -86 -90 115 40 -141 3 137 -57 -134 71 121 -114 -70 129 12 -145 22 127 -73 -119 120 99 -126
6136 -126 -33 156 10 -126 66 133 -90 -95 134 74 -139 -12 152 -21 -125 82 117 -112 -84 140 40 -145
6158 -145 28 148 -64 -121 100 88 -139 -60 151 -6 -156 25 131 -87 -102 128 76 -137 -28 147 -22 -141
6180 -141 71 128 -103 -73 135 60 -142 4 143 -29 -128 95 106 -112 -51 151 23 -143 37 146 -63 -115
6202 -115 115 90 -131 -33 147 -23 -146 58 123 -100 -98 125 50 -144 -12 156 -41 -141 73 107 -111 -75 146
6225 146 33 -145 18 144 -63 -115 108 93 -139 -35 150 3 -145 50 139 -76 -99 128 58 -133 -20 164
6247 164 -27 -135 75 125 -94 -82 135 44 -146 12 150 -62 -137 84 98 -142 -57 147 -2 -159 30 145
6269 145 -86 -117 113 80 -146 -30 164 -13 -152 85 149 -92 -96 147 61 -123 16 150 -57 -134 88 117 -122
6292 -122 -72 132 15 -143 27 138 -88 -125 129 87 -147 -51 146 -13 -153 53 125 -114 -106 139 80 -152 -24
6315 -24 152 -51 -126 101 117 -135 -67 162 48 -155 21 156 -57 -101 126 104 -136 -43 172 12 -164 42
6337 42 137 -84 -94 145 61 -172 -21 180 -34 -159 66 102 -105 -75 144 30 -188 6 153 -62 -146 80
6359 80 86 -118 -54 152 -1 -166 46 154 -78 -130 117 78 -129 -9 172 -28 -150 83 155 -90 -82 151 57
6382 57 -147 21 156 -58 -146 109 119 -123 -74 140 3 -158 51 152 -105 -138 117 83 -148 -60 136 -26
6404 -26 -153 64 119 -121 -103 150 77 -148 -11 153 -38 -137 111 118 -131 -91 167 54 -140 30 163 -55 -110
6427 -110 138 104 -147 -42 180 16 -146 45 140 -96 -96 141 69 -170 -22 183 -16 -164 72 110 -107 -84
6449 -84 132 21 -177 -11 147 -64 -156 103 103 -126 -36 146 10 -162 24 175 -53 -111 104 78 -154 -1
6471 -1 180 -24 -141 77 154 -111 -105 141 42 -113 -42 178 -38 -149 115 129 -153 -87 148 14 -168 14 110
6494 110 -95 -151 145 107 -152 -30 167 -30 -138 99 131 -133 -134 165 73 -121 12 141 -35 -113 96 119 -132
6517 -132 -107 162 13 -172 23 174 -29 -113 147 109 -159 6 172 -14 -135 85 96 -79 -133 148 103 -130
6539 -130 -36 181 -59 -213 128 115 -90 -65 159 -13 -159 15 159 -77 -162 91 77 -132 -31 139 16 -141
6561 -141 57 159 -73 -132 141 83 -163 -23 180 -2 -154 87 137 -103 -100 160 50 -165 -5 171 -53 -155
6583 -155 97 107 -135 -80 161 19 -180 12 154 -78 -143 113 87 -153 -42 170 0 -159 52 145 -88 -104
6605 -104 153 70 -153 -13 180 -31 -155 98 143 -116 -80 165 54 -152 34 188 -62 -140 114 103 -138 -60
6627 -60 167 4 -175 40 159 -103 -135 133 73 -166 -41 164 -43 -163 82 124 -127 -111 141 40 -173 8
6649 8 173 -56 -154 105 136 -129 -71 158 34 -164 47 171 -93 -129 148 103 -155 -46 174 -1 -150 84
6671 84 142 -113 -105 154 69 -162 -15 154 -59 -144 98 109 -155 -80 163 32 -178 10 155 -82 -126 129 91
6694 91 -164 -43 187 11 -151 55 146 -86 -98 158 65 -165 -6 189 -9 -143 77 141 -107 -70 171 32
6716 32 -182 19 175 -69 -153 96 103 -132 -45 166 -3 -190 46 163 -96 -137 125 66 -150 -21 164 -38
6738 -38 -178 82 151 -123 -110 144 56 -153 20 170 -61 -155 122 130 -138 -72 163 22 -156 49 158 -91 -134
6761 -134 142 112 -141 -48 167 -9 -153 64 115 -127 -115 137 75 -162 -28 148 -42 -140 108 125 -145 -96 157
6784 157 46 -182 14 140 -75 -125 129 112 -157 -48 183 12 -162 56 151 -102 -89 162 72 -170 -13 191
6806 191 -18 -153 80 127 -124 -77 162 44 -181 26 176 -56 -145 103 98 -148 -58 169 11 -182 38 158
6828 158 -88 -131 114 81 -153 -33 177 -28 -163 83 162 -115 -92 140 58 -153 14 182 -52 -156 115 129
6850 129 -143 -76 170 29 -163 50 161 -91 -139 128 96 -151 -37 162 -15 -162 70 136 -125 -113 148 57
6872 57 -176 -19 159 -49 -151 101 123 -126 -81 166 37 -169 21 164 -70 -135 127 110 -143 -38 188 14
6894 14 -154 59 172 -91 -113 141 78 -148 -19 182 -29 -166 88 128 -134 -93 155 36 -177 1 158 -79
6916 -79 -154 115 115 -158 -68 180 9 -161 59 164 -93 -122 136 78 -163 -31 183 -24 -153 81 158 -114 -87
6939 -87 167 77 -164 9 177 -50 -139 112 124 -152 -61 172 33 -176 23 161 -81 -138 115 74 -159 -59
6961 -59 174 -24 -184 49 132 -108 -112 137 48 -177 5 184 -46 -159 90 139 -128 -70 169 37 -172 42
6983 42 190 -77 -140 126 112 -123 -43 170 0 -172 71 171 -107 -130 138 74 -152 -18 166 -47 -169 88
7005 88 137 -133 -104 139 48 -171 13 158 -71 -157 110 114 -161 -86 158 15 -172 61 146 -103 -124 156 99 -155
7029 -155 -27 181 -11 -146 104 149 -128 -100 177 57 -170 13 152 -40 -139 112 103 -165 -86 177 37 -181
7051 -181 14 149 -89 -136 127 59 -182 -64 184 -9 -187 42 136 -115 -101 154 51 -168 -8 187 -32
7072 -32 -178 95 118 -106 -80 139 1 -175 47 170 -52 -157 126 124 -132 -20 192 -10 -162 85 202 -104
7094 -104 -113 129 137 -129 -30 178 -35 -162 91 155 -147 -113 140 62 -155 12 172 -57 -163 157 131 -104 -74
7117 -74 149 8 -149 7 148 -141 -142 129 127 -194 -25 185 -19 -88 105 144 -92 -84 205 72 -121 16 127
7140 127 -82 -157 117 102 -180 -36 191 -66 -194 -2 187 -181 -39 176 86 -232 -51 215 -26 -184 78
7161 78 171 -73 -106 138 76 -153 -14 186 -58 -181 95 209 -54 40 178 7 -175 61 173 -65 -178 143
7183 143 88 -171 -10 123 -7 -190 58 163 -136 -133 228 73 -204 23 212 -57 -126 118 175 -192 -111 182
7205 182 36 -153 92 195 -22 -159 31 105 -92 -47 153 36 -167 74 170 -96 -128 149 103 -147 26 142
7227 142 7 -132 117 103 -57 -97 205 47 -233 6 157 -6 -156 136 122 -131 -106 122 -12 -183 44
7248 44 128 -117 -147 95 80 -121 -60 188 10 -160 105 198 -159 -116 139 95 -156 -22 204 -106 -124 111 177
7271 177 -181 -119 156 26 -110 35 144 -86 -125 146 75 -179 -63 168 17 -177 108 105 -101 -124 104 92
7293 92 -233 -2 182 18 -154 47 144 -136 -60 136 20 -134 5 194 -8 -143 148 85 -195 -12 142
7314 142 -39 -171 13 167 -76 -108 127 60 -155 -13 164 9 -130 71 157 -105 -122 156 7 -147 2
7335 2 154 -104 -155 67 123 -126 -95 152 -40 -211 91 250 -70 -143 117 77 -125 -63 106 63 -149 46 193
7358 193 -64 -160 135 99 -148 25 241 2 -116 127 104 -72 -145 184 -4 -221 -49 119 -50 -185 174
7379 174 135 -89 -42 129 -28 -136 14 84 -144 -106 84 62 -166 -32 189 -7 -147 131 92 -134 -109 150
7401 150 63 -153 -13 133 -61 -133 91 97 -86 -32 206 18 -111 10 113 -83 -124 156 68 -141 3 202
7423 202 13 -155 73 129 -123 -111 137 25 -190 -26 153 -28 -176 94 115 -144 -63 149 -26 -170 68
7444 68 165 -90 -155 117 113 -146 3 203 13 -151 87 149 -72 -64 123 55 -126 47 177 -41 -166 100 122
7467 122 -122 -72 107 1 -149 15 136 -55 -147 163 116 -152 -80 142 -14 -162 67 147 -103 -153 130 80
7489 80 -174 -40 136 -14 -130 25 159 -124 -80 173 7 -159 -4 187 -60 -132 160 135 -126 -29 176 19
7511 19 -132 91 193 -61 -124 144 65 -167 -51 141 -36 -169 73 122 -135 -110 136 6 -193 -23 124 38
7533 38 -148 93 178 -52 -78 186 8 -198 68 105 -61 -159 83 73 -118 0 127 53 -154 50 137 -86 -84
7556 -84 137 106 -163 -22 177 -9 -135 94 71 -107 -74 128 20 -200 -7 130 -60 -132 51 75 -149 -76
7578 -76 108 42 -151 39 134 -91 -92 121 126 -160 -10 164 -26 -175 94 174 -93 -126 96 64 -128 -13 142
7601 142 -59 -128 90 124 -108 -35 194 -31 -248 69 113 24 -191 -20 26 -206 -95 117 -36 -190 98 132
7623 132 12 -222 256 50 -157 42 116 -53 -188 82 166 -133 -66 227 95 -107 2 139 -129 -92 165
7644 165 146 -111 -41 155 22 -133 53 116 -109 -117 134 48 -147 -27 99 -7 -151 82 129 -141 -102 124 34
7667 34 -148 6 126 -58 -125 58 67 -163 -52 144 5 -166 7 118 -68 -65 136 78 -171 -15 173 -12
7689 -12 -145 99 119 -101 -75 65 24 -144 18 214 8 -136 94 70 -162 2 146 -4 -152 18 126 -78
7711 -78 -115 89 29 -169 -26 173 -39 -199 55 113 -130 -72 83 51 -117 45 118 -47 -174 103 156 -166 -111
7734 -111 103 -60 -132 27 165 -48 -85 142 120 -115 -69 145 22 -118 60 166 -85 -83 148 96 -136 27
7756 27 137 -55 -71 46 110 -147 -50 145 82 -131 -65 107 -30 -123 122 21 -127 -41 93 6 -158 77 87
7779 87 -129 -96 125 83 -98 3 189 -22 -102 17 122 -79 -88 131 5 -169 -57 130 -7 -61 34 111 -145
7802 -145 -33 127 -73 -125 58 191 -61 -108 50 56 -207 -42 115 -75 -170 118 115 -126 -106 68 38 -177 37
7825 37 192 -54 -81 86 71 -110 -58 115 36 -82 73 137 -71 -86 100 100 -149 -72 114 12 -124 56 99 -98
7849 -98 -89 134 98 -148 -4 110 -78 -95 43 58 -112 -68 197 -1 -174 -8 133 -99 -128 121 31 -154 -37
7872 -37 64 -18 -118 5 138 -82 -66 79 98 -121 -22 108 -64 -152 67 50 -54 -84 116 8 -137 15 115
7895 115 -58 -169 40 110 -132 -102 101 66 -107 4 97 -91 -117 72 64 -138 -7 145 4 -133 75 116 -63
7918 -63 -8 128 59 -158 -1 124 -40 -113 120 132 -98 -21 98 15 -98 12 85 -124 -76 120 73 -124 -65 127
7942 127 -20 -125 94 90 -96 -74 89 33 -119 -33 145 -30 -118 57 93 -60 -80 135 29 -126 31 128 -71
7965 -71 -112 115 115 -108 -29 155 1 -122 57 134 -60 -83 120 70 -116 -13 140 -7 -121 67 99 -85 -82 114
7989 114 33 -133 4 121 -62 -126 74 78 -106 -71 108 16 -135 24 111 -72 -110 104 64 -116 -28 139 5
8012 5 -119 55 111 -74 -63 133 70 -120 2 129 -29 -107 77 88 -108 -46 125 29 -138 13 117 -60 -112
8035 -112 84 53 -130 -41 121 -2 -145 28 105 -69 -79 104 41 -127 -19 123 -23 -138 53 95 -84 -65
8057 -65 111 19 -132 16 136 -45 -115 95 95 -85 -30 111 8 -118 40 123 -66 -104 86 65 -111 -31 116
8080 116 -36 -137 60 108 -101 -99 96 37 -116 -2 98 -62 -123 80 84 -114 -68 108 13 -123 30 106 -73
8103 -73 -111 99 68 -121 -45 119 -3 -111 52 109 -88 -75 124 63 -121 -12 123 -17 -89 60 88 -101 -68
8126 -68 122 32 -132 4 105 -49 -109 73 53 -120 -48 116 -11 -130 26 105 -77 -81 95 39 -121 -13 145
8149 145 -12 -122 54 97 -78 -43 117 22 -126 13 137 -36 -105 70 87 -89 -37 122 1 -115 43 124
8171 124 -56 -91 73 61 -112 -22 115 -35 -133 51 111 -85 -101 87 40 -122 -6 104 -56 -116
8191a16
##END NTUPLES=NMR FID
##END=
