##TITLE=1H_LY-17Dix.4.B
 CD3CN, 8 sc, 
 4.06.2021
##JCAMPDX= 6.0         $$ Bruker NMR JCAMP-DX V2.0
##DATA TYPE= NMR FID
##DATA CLASS= NTUPLES
##ORIGIN= UXNMR, Bruker Analytische Messtechnik GmbH
##OWNER= root
$$ XWIN-NMR		Version 3.5
$$ Fri Jun  4 10:35:04 2021 Russian Standard Time (UT+4h)  she@DPX200
##.OBSERVE FREQUENCY= 200.131506
##.OBSERVE NUCLEUS= ^1H
##.DELAY= (6, 6)
##.ACQUISITION MODE= SIMULTANEOUS
##.ACQUISITION SCHEME= undefined
##.AVERAGES= 8
##.DIGITISER RES= 18
##SPECTROMETER/DATA SYSTEM= spect
##.PULSE SEQUENCE= zg30
##.SOLVENT NAME= CDCl3
##.SHIFT REFERENCE= (INTERNAL, CDCl3, 0, 15.7039)
##AUDIT TRAIL= $$ (NUMBER, WHEN, WHO, WHERE, WHAT)
$$ ##TITLE= Audit trail, XWIN-NMR		Version 3.5
$$ ##JCAMPDX= 5.01
$$ ##ORIGIN= Bruker BioSpin GmbH
$$ ##OWNER= she
$$ F:/spectra/data/she/nmr/H-F/1/audita.txt
$$ ##AUDIT TRAIL=  $$ (NUMBER, WHEN, WHO, WHERE, WHAT)
(   1,<2021-06-04 10:34:01.93 +0400>,<she>,<DPX200>,
      <created by zg, POWCHK disabled, PULCHK disabled
       configuration hash MD5:
       00 E9 B6 7A A2 85 ED C7 34 08 36 98 17 FE 4E 26
       data hash MD5: 16K
       D3 44 0C 86 AB 51 F7 10 36 62 64 C9 5A 3F 06 81>)
$$ ##END=
$$ 
$$ hash MD5
$$ 15 0A 3D DE 95 BC 8C BD 63 7D D6 62 81 36 2F AD
##$RELAX= 
##$RELAX= 
##$RELAX= 
##$RELAX= 
##$RELAX= 
##$RELAX= 
$$ Bruker specific parameters
$$ --------------------------
##$DU= <F:/spectra>
##$EXPNO= 1
##$NAME= <H-F>
##$PROCNO= 1
##$TYPE= <nmr>
##$USER= <she>
##$AMP= (0..31)
100 100 100 100 100 100 100 100 100 100 100 100 100 100 100 100 100 100 
100 100 100 100 100 100 100 100 100 100 100 100 100 100 
##$AQSEQ= 0
##$AQ_mod= 1
##$AUNM= <au_zg>
##$AUTOPOS= <>
##$BF1= 200.13
##$BF2= 200.13
##$BF3= 200.13
##$BF4= 200.13
##$BF5= 200.13
##$BF6= 200.13
##$BF7= 200.13
##$BF8= 200.13
##$BYTORDA= 1
##$CFDGTYP= 0
##$CFRGTYP= 5
##$CHEMSTR= <none>
##$CNST= (0..31)
1 1 145 1 1 1 1 1 1 1 1 1 1 1 1 1 1 1 1 1 1 1 1 1 1 1 1 1 1 1 1 1 
##$CPDPRG= <>
##$CPDPRG1= <>
##$CPDPRG2= <>
##$CPDPRG3= <>
##$CPDPRG4= <mlev>
##$CPDPRG5= <mlev>
##$CPDPRG6= <mlev>
##$CPDPRG7= <mlev>
##$CPDPRG8= <mlev>
##$CPDPRGB= <>
##$CPDPRGT= <>
##$D= (0..31)
0 1.2 0 0 0 0 0 0 0 0.06 0 0.03 0 0 0 0 0.0002 0 0 0 0 0 0 0 0 0 0 0 0 
0 0 0 
##$DATE= 1622788441
##$DBL= (0..7)
120 120 120 120 120 120 120 120 
##$DBP= (0..7)
150 150 150 150 150 150 150 150 
##$DBP07= 0
##$DBPNAM0= <>
##$DBPNAM1= <>
##$DBPNAM2= <>
##$DBPNAM3= <>
##$DBPNAM4= <>
##$DBPNAM5= <>
##$DBPNAM6= <>
##$DBPNAM7= <>
##$DBPOAL= (0..7)
0.5 0.5 0.5 0.5 0.5 0.5 0.5 0.5 
##$DBPOFFS= (0..7)
0 0 0 0 0 0 0 0 
##$DE= 6
##$DECBNUC= <off>
##$DECIM= 32
##$DECNUC= <off>
##$DECSTAT= 4
##$DIGMOD= 1
##$DIGTYP= 9
##$DL= (0..7)
0 120 120 120 120 120 120 120 
##$DP= (0..7)
150 150 150 150 150 150 150 150 
##$DP07= 0
##$DPNAME0= <>
##$DPNAME1= <>
##$DPNAME2= <>
##$DPNAME3= <>
##$DPNAME4= <>
##$DPNAME5= <>
##$DPNAME6= <>
##$DPNAME7= <>
##$DPOAL= (0..7)
0.5 0.5 0.5 0.5 0.5 0.5 0.5 0.5 
##$DPOFFS= (0..7)
0 0 0 0 0 0 0 0 
##$DQDMODE= 0
##$DR= 18
##$DS= 0
##$DSLIST= <SSSSSSSSSSSSSSS>
$$ [...]
##$SUBNAM2= <"">
##$SUBNAM3= <"">
##$SUBNAM4= <"">
##$SUBNAM5= <"">
##$SUBNAM6= <"">
##$SUBNAM7= <"">
##$SUBNAM8= <"">
##$SUBNAM9= <"">
##$SW= 20.0188882624521
##$SWIBOX= (0..15)
0 0 2 0 0 0 0 0 0 0 0 0 0 0 0 0 
##$SW_h= 4006.41025641026
##$TD= 16384
##$TD0= 1
##$TE= 0
##$TE2= 300
##$TE3= 300
##$TEG= 300
##$TL= (0..7)
0 120 120 120 120 120 120 120 
##$TP= (0..7)
150 150 150 150 150 150 150 150 
##$TP07= 0
##$TPNAME0= <>
##$TPNAME1= <>
##$TPNAME2= <>
##$TPNAME3= <>
##$TPNAME4= <>
##$TPNAME5= <>
##$TPNAME6= <>
##$TPNAME7= <>
##$TPOAL= (0..7)
0.5 0.5 0.5 0.5 0.5 0.5 0.5 0.5 
##$TPOFFS= (0..7)
0 0 0 0 0 0 0 0 
##$TUNHIN= 0
##$TUNHOUT= 0
##$TUNXOUT= 0
##$USERA1= <user>
##$USERA2= <user>
##$USERA3= <user>
##$USERA4= <user>
##$USERA5= <user>
##$V9= 5
##$VALIST= <valist>
##$VCLIST= <CCCCCCCCCCCCCCC>
##$VD= 0
##$VDLIST= <DDDDDDDDDDDDDDD>
##$VPLIST= <PPPPPPPPPPPPPPP>
##$VTLIST= <TTTTTTTTTTTTTTT>
##$WBST= 1024
##$WBSW= 4
##$XGAIN= (0..3)
0 0 0 0 
##$XL= 0
##$YL= 0
##$YMAX_a= 94467
##$YMIN_a= -91830
##$ZGOPTNS= <>
##$ZL1= 120
##$ZL2= 120
##$ZL3= 120
##$ZL4= 120
##$ABSF1= 10
##$ABSF2= 0
##$ABSG= 5
##$ABSL= 3
##$ALPHA= 0
##$AQORDER= 0
##$ASSFAC= 0
##$ASSFACI= 0
##$ASSFACX= 0
##$ASSWID= 0
##$AUNMP= <proc_1d>
##$AZFE= 0.1
##$AZFW= 0.1
##$BCFW= 1
##$BC_mod= 2
##$BYTORDP= 1
##$COROFFS= 0
##$CY= 11.3945322036743
##$DATMOD= 1
##$DC= 2
##$DFILT= <>
##$DTYPP= 0
##$F1P= 15.9154993809931
##$F2P= -4.1035820241983
##$FCOR= 0.5
##$FTSIZE= 0
##$FT_mod= 4
##$GAMMA= 1
##$GB= 0.15
##$INTBC= 1
##$INTSCL= 1
##$ISEN= 128
##$LB= 0.24
##$LEV0= 0
##$LPBIN= 0
##$MAXI= 10000
##$MC2= 0
##$MEAN= 0
##$ME_mod= 0
##$MI= 1.114404
##$NCOEF= 0
##$NC_proc= 0
##$NLEV= 6
##$NOISF1= 3.799351
##$NOISF2= 2.8
##$NSP= 1
##$NTH_PI= 0
##$NZP= 0
##$OFFSET= 15.70392
##$PC= 1
##$PHC0= -11207.12
##$PHC1= 18.00099
##$PH_mod= 1
##$PKNL= yes
##$PPARMOD= 0
##$PSCAL= 0
##$PSIGN= 0
##$REVERSE= no
##$SF= 200.130013532006
##$SI= 16384
##$SIGF1= 3
##$SIGF2= 2
##$SINO= 400
##$SIOLD= 16384
##$SREGLST= <1H.CDCl3>
##$SSB= 0
##$STSI= 0
##$STSR= 0
##$SW_p= 3612.71676300578
##$SYMM= 0
##$S_DEV= 0
##$TDeff= 0
##$TDoff= 0
##$TI= <>
##$TILT= no
##$TM1= 0
##$TM2= 0
##$TOPLEV= 0
##$USERP1= <user>
##$USERP2= <user>
##$USERP3= <user>
##$USERP4= <user>
##$USERP5= <user>
##$WDW= 1
##$XDIM= 8192
##$YMAX_p= 0
##$YMIN_p= 0
$$ End of Bruker specific parameters
$$ ---------------------------------
##NTUPLES= NMR FID
##VAR_NAME=  TIME,          FID/REAL,        FID/IMAG
##SYMBOL=    X,             R,               I
##VAR_TYPE=  INDEPENDENT,   DEPENDENT,       DEPENDENT
##VAR_FORM=  AFFN,          ASDF,            ASDF
##VAR_DIM=   8192,          8192,            8192
##UNITS=     SECONDS,       ARBITRARY UNITS, ARBITRARY UNITS
##FACTOR=    0.0002496,     1,               1
##FIRST=     0,             0,               0
##LAST=      2.0444736,     0,               0
##MIN=       0,             -91830,          0
##MAX=       2.0444736,     94467,           0
$$ Real data points
##PAGE= N=1
##DATA TABLE= (X++(R..R)), XYDATA
0 0 0 0 0 0 0 0 0 0 0 0 0 0 0 0 0 2 -8 8 -8 8 -8 16 -16 16 -24 24 -32 33 -40 46 -50 58 -66 74 -86 97 -107
37 -107 122 -137 151 -171 187 -208 231 -255 281 -312 344 -378 417 -460 507 -557 616 -680 752
56 752 -835 927 -1038 1165 -1316 1503 -1733 2031 -2432 3001 -3876 5402 -8809 31768 -51355
71 -51355 -83412 84625 44671 -86929 -16120 94467 -20822 -85788 46127 74176 -68816
82 -68816 -49513 78669 20438 -85753 12707 81479 -43473 -74814 67341 56951 -82397
93 -82397 -35087 88032 5368 -86438 22522 77068 -49909 -63064 68231 43698 -78029
104 -78029 -18934 78570 -8508 -72011 36201 59900 -58854 -42512 75382 22670 -80642
115 -80642 1767 78562 -25706 -67039 49887 52198 -67393 -32587 78100 12139 -77978
126 -77978 11184 70702 -33034 -56185 52412 37417 -66552 -16883 72518 -4640 -69876
137 -69876 25448 58678 -45487 -43173 60021 22934 -70063 -3504 70692 -16876 -64753 34110
149 34110 50582 -49652 -32907 59795 12074 -65129 7388 62295 -25766 -52382 41743 37171
161 37171 -53321 -17755 60587 -2111 -61338 21323 56377 -36444 -43559 49471 27447 -56700
173 -56700 -7328 60298 -11437 -56932 29050 48414 -42308 -33823 51773 16077 -55730 3686
185 3686 54981 -22231 -49181 36944 37422 -48097 -22210 53700 3951 -55018 13556 50201 -30371
198 -30371 -42031 42086 28488 -50163 -13023 52049 -4787 -49894 21088 42582 -35105 -31727
210 -31727 44562 17473 -49302 -1499 49167 -14224 -43671 29271 35102 -40258 -22648 47463
222 47463 8631 -48892 7326 46558 -21367 -38554 34286 27845 -42735 -13877 47206 -828
234 -828 -46252 15827 40945 -28911 -31471 39080 19086 -45162 -5083 46131 -10063 -43310 23200
247 23200 35407 -34512 -24596 41697 10904 -45190 2883 43080 -17254 -37728 28778 28177 -37600
260 -37600 -16409 41998 2824 -42328 10825 38494 -23278 -31040 33258 20860 -39398 -8359
272 -8359 41913 -4266 -39292 17393 33622 -28210 -24449 36509 13799 -40042 -1080 40098
284 40098 -11069 -35310 22847 27595 -32262 -17328 38459 5844 -40328 6103 37599 -17858
296 -17858 -31147 27891 21445 -35735 -10598 39169 -1543 -38971 12615 33836 -23002 -25513
308 -25513 31011 14387 -36775 -3133 38103 -8307 -35512 18466 28887 -26844 -19106 32974
320 32974 7715 -36076 3897 35767 -14139 -31211 22904 23406 -29101 -12514 33497 1280
332 1280 -34473 9858 32421 -19018 -26467 26282 17722 -30643 -6382 32919 -5190 -32333 15588
345 15588 28481 -23855 -21457 29268 11547 -32049 -271 31991 -11172 -29565 20567 24000
357 24000 -27545 -16099 30864 5510 -31682 5702 29720 -16377 -25586 24561 18842 -29805
369 -29805 -10217 31415 -60 -29999 10868 26378 -20370 -20817 27221 13623 -30369 -4626
381 -4626 30246 -5144 -27019 15152 22106 -23285 -15482 28825 8041 -30443 600 28615 -9753
394 -9753 -23935 18704 17772 -25645 -10495 29503 2479 -29819 5769 26384 -14273 -20455 21928
407 21928 13025 -27663 -5259 29958 -2800 -28607 10582 23597 -18122 -16371 24339 8004
419 8004 -28329 378 29104 -8116 -26187 14985 19846 -21011 -11492 25657 2726 -27784 5637
432 5637 26944 -12665 -22642 18325 15420 -22625 -6474 25430 -2512 -25993 10383 23767 -16488
445 -16488 -18458 20803 10628 -23592 -1670 24604 -7097 -23559 14445 20146 -19593 -14129 22551
458 22551 5953 -23750 3077 23288 -11405 -20822 18049 16310 -22194 -9632 23843 1314
470 1314 -23443 7448 21313 -15210 -17491 20865 12022 -23704 -4888 23923 -3306 -22109 11374
483 11374 18544 -18176 -13627 22654 7576 -24200 -487 22914 -7308 -19702 14484 14972 -20094
496 -20094 -9301 23164 2863 -23450 3933 21027 -10828 -16826 16785 11330 -21118 -5217
508 -5217 23026 -1135 -22034 7735 18742 -13807 -13586 18853 7532 -21856 -906 22593 -5343
521 -5343 -20400 11405 16067 -16542 -10129 20387 3594 -22060 3034 21368 -9214 -18176 14501
534 14501 12911 -18645 -6496 21065 -502 -21543 6875 19423 -12545 -15314 16825 9274 -19710
547 -19710 -2696 20619 -4148 -19706 10091 16541 -14858 -11658 18157 5417 -19794 1220
559 1220 19626 -7470 -17384 12816 13518 -16533 -7918 18848 1773 -19094 4757 17823 -10393
572 -10393 -14580 15071 10111 -17823 -4177 19133 -1973 -18373 8062 15949 -13178 -11858 16878
585 16878 6541 -18823 -546 18784 -5644 -17054 10984 13407 -15402 -8713 17879 2799
597 2799 -18903 3016 17719 -8773 -15045 13271 10590 -16650 -5328 18064 -627 -17866 6317
610 6317 15867 -11210 -12309 14889 7566 -16898 -1900 17484 -3677 -16171 9030 13642 -12971
623 -12971 -9379 15859 4505 -16720 1315 16391 -6650 -14235 11505 11040 -14751 -6486 16507
636 16507 1267 -16519 4270 14975 -9509 -12184 13542 8142 -16187 -3473 16694 -2073
648 -2073 -15777 7260 13022 -12194 -9579 15357 4961 -17021 -200 16369 -5001 -14230 9718
661 9718 10650 -13674 -6479 16112 1931 -16570 2855 15247 -7309 -12064 11561 8179 -14459
674 -14459 -3458 16213 -851 -15583 5424 13532 -9174 -9611 12671 5288 -14788 -543 15612
687 15612 -3713 -14397 7645 11551 -10970 -7334 13492 2440 -15092 2190 14857 -6508
699 -6508 -13160 9718 9352 -12534 -4781 14019 -548 -14805 5062 13712 -9028 -11298 11622
712 11622 7068 -13477 -2128 14175 -3078 -13848 7544 12164 -10771 -8885 12845 4503 -13525
725 -13525 811 13509 -5554 -12131 9730 10036 -12011 -6289 13320 1994 -13025 3161 12207
738 12207 -7565 -10241 11121 7632 -12905 -3861 13274 -630 -12419 5284 10588 -9544 -8343
751 -8343 12264 5115 -13612 -1523 12949 -3047 -11518 7225 8911 -11135 -6203 13262 2630
764 2630 -13949 1057 12591 -5284 -10239 9113 7052 -12210 -3635 13818 259 -13456 3495
777 3495 11618 -7015 -8358 10540 5036 -12719 -1264 13793 -1904 -12567 5437 10213 -8358
790 -8358 -6473 11161 2791 -12670 924 12901 -4060 -11294 6917 8271 -9423 -4482 11264
803 11264 404 -12397 3009 11843 -6124 -9990 8288 6398 -10351 -2507 11322 -1844 -11767
816 -11767 5188 10537 -8022 -8179 9726 4393 -10936 -196 11319 -3891 -10823 7237 9218
829 9218 -9391 -6167 10779 2421 -10970 2038 10816 -5740 -9386 8900 7437 -10350 -4028
842 -4028 11143 380 -10611 3768 9678 -7141 -7808 9669 5381 -10811 -2124 10789 -1644
855 -1644 -9934 5215 8160 -8440 -6106 10199 3111 -11068 -85 10283 -3574 -8990 6616
868 6616 6636 -9379 -4237 10614 1106 -10833 2049 9682 -5353 -7695 8205 5083 -10169 -2077
882 -2077 11044 -921 -10359 4192 8825 -6867 -6064 9328 3299 -10429 48 10730 -2946
895 -2946 -9396 5949 7407 -8135 -4384 9849 1306 -10384 1853 9818 -4712 -8147 7072
908 7072 5567 -8912 -2655 9687 -666 -9800 3443 8523 -6176 -6706 7922 3771 -9320 -889
922 -889 9475 -2348 -8998 4955 7252 -7304 -4968 8751 2061 -9387 1094 9165 -3973
935 -3973 -7898 6538 5954 -8215 -3092 9396 271 -9248 2944 8561 -5444 -6571 7771 4250
949 4250 -8939 -1195 9463 -1700 -8790 4582 7411 -6786 -5155 8338 2353 -9178 471
962 471 8951 -3347 -7976 5621 5952 -7567 -3585 8460 539 -8898 2145 8168 -4798 -6859
976 -6859 6609 4548 -7977 -1925 8446 -1039 -8280 3671 7253 -5885 -5394 7529 3070 -8185
990 -8185 -118 8317 -2666 -7517 5324 6258 -6992 -3938 8190 1454 -8232 1580 7783 -4264
1004 -4264 -6481 6566 4758 -7925 -2419 8390 -233 -7959 3033 6830 -5621 -5319 7330 3162
1018 3162 -8361 -942 8140 -1705 -7276 4132 5577 -6471 -3841 7754 1613 -8291 573 7656
1032 7656 -2968 -6327 5156 4433 -6966 -2330 7985 181 -7972 2020 7035 -4030 -5126 6086
1046 6086 3062 -7397 -705 8075 -1383 -7560 3504 6264 -5160 -3962 6751 1540 -7668 895
1060 895 7816 -2983 -6908 4734 5062 -6148 -2627 7102 -44 -7584 2359 7157 -4363 -6019
1074 -6019 5609 3814 -6587 -1265 7025 -1434 -7075 3571 6255 -5269 -4818 6209 2586 -6672
1088 -6672 32 6708 -2565 -6304 4601 5318 -5888 -3564 6526 1295 -6514 1375 6252 -3690
1102 -3690 -5374 5591 4141 -6546 -2273 6762 -39 -6298 2645 5577 -4826 -4426 6358 2872
1116 2872 -7015 -901 6755 -1437 -5912 3792 4644 -5806 -3206 6970 1473 -7207 428 6446 -2652
1131 -2652 -5209 4679 3596 -6296 -1927 7077 149 -6937 1626 5823 -3574 -4217 5326 2458 -6552
1146 -6552 -674 6981 -995 -6430 2651 5073 -4212 -3190 5655 1267 -6523 595 6695 -2133 -5828
1161 -5828 3615 4218 -4943 -2167 6016 94 -6471 1837 6261 -3351 -5141 4516 3201 -5505 -981
1176 -981 6122 -1206 -6229 3033 5579 -4422 -4196 5295 2113 -5871 152 5961 -2376 -5641 4078
1191 4078 4698 -5145 -3059 5644 895 -5764 1308 5452 -3317 -4729 4811 3605 -5567 -1941 5725
1206 5725 -116 -5450 2223 4837 -4019 -3841 5257 2513 -5764 -754 5679 -1195 -5080 3104 4109
1221 4109 -4695 -2882 5680 1424 -5867 370 5483 -2257 -4589 3955 3338 -5273 -1812 5973 181
1236 181 -5885 1557 5116 -3305 -3904 4720 2365 -5670 -733 5937 -967 -5497 2612 4475 -4066
1251 -4066 -3047 5117 1324 -5738 365 5679 -1973 -4914 3430 3647 -4613 -2089 5287 351 -5479
1266 -5479 1337 5113 -2807 -4136 4048 2747 -4913 -1118 5327 -621 -5226 2219 4517 -3604 -3307
1281 -3307 4680 1804 -5225 -83 5235 -1663 -4754 3171 3777 -4320 -2270 5151 655 -5357 1035
1296 1035 5061 -2636 -4198 3979 2911 -4907 -1309 5321 -403 -5198 2041 4508 -3466 -3403 4466
1311 4466 1873 -5123 -242 5248 -1352 -4832 2743 3849 -3948 -2566 4696 951 -5035 702 4894
1326 4894 -2221 -4268 3415 3101 -4291 -1606 4809 -33 -4869 1634 4522 -2947 -3589 4006 2322
1341 2322 -4600 -681 4821 -1025 -4578 2651 4007 -3800 -2833 4559 1340 -4859 362 4693 -2055
1356 -2055 -4155 3489 3243 -4455 -2008 4833 418 -4782 1246 4249 -2944 -3542 4123 2443 -4836
1371 -4836 -1101 4898 -487 -4535 2012 3671 -3520 -2719 4491 1541 -4906 -225 4680 -1232 -4010
1386 -4010 2693 3027 -3913 -1843 4753 676 -4882 664 4492 -1934 -3440 3298 2250 -4291 -902
1401 -902 4889 -320 -4724 1629 4061 -2756 -2833 3812 1367 -4607 63 4889 -1339 -4530 2437 3445
1417 3445 -3475 -2059 4186 369 -4714 1031 4576 -2325 -4046 3160 2766 -3848 -1241 4244 -463
1432 -463 -4476 1814 4176 -2855 -3324 3640 2071 -3927 -385 4112 -1147 -3967 2494 3617 -3405
1447 -3405 -2615 3937 1356 -4002 390 3990 -1877 -3572 3168 2977 -3856 -1860 4157 471 -4001
1462 -4001 1206 3644 -2737 -3114 3751 2178 -4337 -1046 4249 -471 -3889 1954 3100 -3425 -2379
1477 -2379 4204 1317 -4554 -171 4166 -1308 -3532 2675 2590 -3844 -1620 4439 521 -4450 667
1492 667 3925 -1860 -2926 3141 1926 -3986 -801 4478 -183 -4170 1370 3567 -2358 -2382 3450 1250
1508 1250 -4103 -54 4364 -952 -3914 1956 2985 -2901 -1733 3678 395 -4189 721 4065 -1826
1523 -1826 -3584 2570 2382 -3379 -1059 3832 -432 -4133 1508 3732 -2533 -2996 3151 1694 -3656
1538 -3656 -243 3883 -1153 -3790 2288 3316 -3014 -2335 3515 1072 -3658 471 3747 -1702 -3306
1553 -3306 2824 2766 -3340 -1647 3703 421 -3568 1071 3417 -2230 -2850 3148 2097 -3582 -1014 3657
1569 3657 -291 -3462 1601 2941 -2791 -2300 3475 1317 -3847 -303 3598 -1092 -3245 2221 2448
1584 2448 -3237 -1615 3732 516 -3876 567 3464 -1772 -2770 2836 1886 -3559 -831 3894 -215
1599 -215 -3689 1378 3185 -2326 -2242 3227 1308 -3604 -84 3797 -870 -3340 1938 2685 -2747 -1668
1615 -1668 3405 653 -3601 491 3512 -1503 -3014 2370 2137 -3074 -1147 3403 -45 -3525 1061
1630 1061 3118 -2114 -2538 2793 1498 -3384 -522 3454 -698 -3324 1703 2732 -2602 -1904 3196
1645 3196 832 -3503 283 3426 -1337 -2934 2352 2241 -3005 -1200 3488 195 -3464 971 3228
1660 3228 -1872 -2485 2734 1663 -3189 -521 3496 -465 -3318 1483 2821 -2310 -2013 2946 1026
1675 1026 -3310 5 3316 -1062 -3075 1860 2366 -2603 -1503 3013 387 -3280 611 3104 -1625
1690 -1625 -2730 2288 1889 -2881 -907 3116 -229 -3146 1278 2866 -2125 -2248 2720 1358 -3029
1705 -3029 -198 3143 -868 -2875 1934 2495 -2600 -1680 3050 770 -3062 423 2962 -1457 -2517
1720 -2517 2399 1980 -2908 -1133 3110 153 -2991 917 2630 -1933 -2115 2672 1448 -3095 -679
1735 -679 3014 -355 -2767 1321 2212 -2278 -1633 2863 873 -3166 -113 2964 -831 -2513 1756 1804
1751 1804 -2588 -1084 3085 330 -3156 515 2809 -1345 -2113 2203 1327 -2802 -396 3214 -314
1766 -314 -3042 1142 2567 -1815 -1673 2523 786 -2945 172 3132 -901 -2819 1590 2172 -2127 -1212
1782 -1212 2597 191 -2918 689 2894 -1392 -2540 1870 1731 -2323 -792 2569 -297 -2750 1139
1797 1139 2582 -1785 -2119 2166 1277 -2425 -268 2530 -785 -2517 1595 2254 -2151 -1648 2427 790
1813 790 -2477 302 2439 -1282 -2197 2110 1831 -2478 -1081 2631 213 -2455 859 2242 -1750 -1800
1829 -1800 2444 1311 -2683 -564 2620 -330 -2317 1275 1875 -2124 -1381 2615 777 -2766 -94
1844 -94 2498 -773 -2091 1579 1483 -2316 -963 2653 324 -2671 331 2297 -1116 -1759 1836 1110
1860 1110 -2417 -476 2691 -124 -2549 791 2103 -1421 -1382 2089 689 -2478 44 2642 -618
1875 -618 -2340 1274 1794 -1762 -974 2278 199 -2533 536 2517 -1105 -2101 1606 1397 -2023 -551
1891 -551 2307 -318 -2443 980 2241 -1524 -1785 1855 1004 -2133 -165 2246 -675 -2245 1274 1949
1907 1949 -1745 -1420 1973 627 -2127 211 2111 -999 -1968 1580 1610 -1921 -1011 2093 264 -2062
1923 -2062 586 1954 -1292 -1658 1862 1242 -2068 -556 2141 -195 -1976 1018 1705 -1658 -1290 2092
1939 2092 748 -2237 -76 2110 -658 -1839 1346 1378 -1916 -893 2203 265 -2252 377 2006
1954 2006 -1071 -1608 1632 1066 -2057 -490 2216 -131 -2108 745 1799 -1303 -1296 1784 734 -2057
1970 -2057 -103 2129 -482 -1937 1066 1557 -1547 -995 1900 395 -2033 266 1979 -852 -1676 1371
1986 1371 1223 -1757 -636 1963 -22 -1980 646 1783 -1230 -1393 1668 843 -1947 -230 2000 -433
2002 -433 -1841 1035 1495 -1548 -995 1883 419 -2009 204 1914 -786 -1631 1324 1191 -1726 -620
2018 -620 1955 55 -1971 540 1755 -1056 -1363 1490 830 -1801 -258 1919 -311 -1836 812 1537
2034 1537 -1249 -1073 1591 509 -1813 83 1843 -629 -1682 1087 1290 -1457 -751 1695 104 -1809
2050 -1809 497 1738 -1003 -1460 1368 985 -1604 -384 1726 -278 -1687 881 1543 -1310 -1189 1607
2066 1607 666 -1703 4 1702 -642 -1545 1186 1293 -1523 -890 1674 344 -1666 287 1524 -912
2082 -912 -1335 1369 1009 -1664 -608 1685 48 -1607 530 1353 -1116 -1087 1527 729 -1726 -299 1674
2099 1674 -233 -1438 799 1133 -1317 -756 1681 398 -1771 59 1659 -539 -1282 1073 887 -1499
2115 -1499 -411 1779 21 -1749 446 1501 -846 -1043 1279 534 -1642 -64 1775 -360 -1686
2130 -1686 701 1301 -1078 -819 1360 192 -1656 243 1674 -681 -1537 947 1083 -1218 -552 1401
2146 1401 -64 -1582 524 1554 -884 -1319 1120 875 -1287 -280 1417 -319 -1447 830 1390 -1128
2162 -1128 -1064 1321 613 -1340 43 1384 -608 -1285 1095 1131 -1343 -752 1444 269 -1385 347 1259
2179 1259 -937 -1125 1325 828 -1536 -472 1471 -92 -1359 609 1093 -1158 -899 1445 545 -1580
2195 -1580 -185 1430 -319 -1219 828 938 -1278 -639 1525 308 -1562 85 1401 -493 -1046 984
2211 984 738 -1331 -359 1555 59 -1483 355 1289 -705 -873 1159 515 -1410 -88 1550 -251
2227 -251 -1416 606 1087 -970 -644 1272 167 -1492 207 1457 -609 -1289 861 852 -1166 -394 1322
2244 1322 -133 -1462 496 1341 -844 -1090 1044 618 -1228 -129 1332 -351 -1327 757 1199 -997
2260 -997 -881 1166 444 -1240 103 1293 -528 -1188 915 1012 -1109 -638 1241 218 -1226 330 1210
2277 1210 -742 -1043 1071 792 -1239 -418 1259 -81 -1210 532 1055 -968 -845 1219 494 -1357
2293 -1357 -132 1262 -374 -1147 774 883 -1145 -609 1298 213 -1369 144 1218 -585 -979 949
2309 949 688 -1223 -339 1357 -14 -1299 399 1127 -755 -825 1065 514 -1225 -121 1320 -211 -1188
2326 -1188 604 987 -892 -648 1155 312 -1241 79 1248 -459 -1097 777 813 -1044 -472 1186 55
2343 55 -1251 318 1133 -697 -925 966 575 -1198 -239 1233 -203 -1188 572 989 -910 -720 1117
2360 1117 346 -1243 39 1214 -415 -1054 763 813 -1030 -471 1219 148 -1234 248 1169 -553
2376 -553 -912 884 647 -1076 -238 1219 -72 -1191 419 1041 -707 -754 977 425 -1135 -48 1198
2393 1198 -308 -1126 602 901 -861 -588 1026 167 -1169 202 1131 -560 -1026 783 696 -1005 -357
2410 -357 1079 -78 -1128 461 1032 -775 -853 946 496 -1048 -89 1078 -319 -1016 692 895 -922
2427 -922 -640 1067 327 -1045 125 1024 -482 -872 852 750 -1001 -446 1085 123 -1019 292 918
2444 918 -658 -753 943 539 -1104 -299 1068 -63 -972 429 760 -817 -592 1019 306 -1151 -71
2461 -71 1046 -292 -889 604 610 -953 -358 1131 104 -1164 167 993 -465 -730 760 437 -1006
2478 -1006 -108 1172 -122 -1100 372 923 -593 -566 871 265 -1015 94 1142 -285 -1014 517 794
2495 794 -688 -427 876 66 -1014 236 1057 -463 -942 610 638 -785 -324 864 -107 -993 384
2512 384 948 -644 -814 722 470 -837 -106 858 -313 -901 597 815 -785 -611 857 308 -852
2529 -852 101 837 -472 -759 788 674 -879 -399 936 104 -843 309 775 -606 -628 878 495 -949
2547 -949 -249 908 -51 -801 411 659 -732 -522 910 307 -987 -118 881 -211 -761 486 523 -814
2565 -814 -381 938 146 -964 59 825 -351 -646 618 407 -855 -175 986 -36 -932 280 796
2582 796 -488 -500 756 257 -892 23 956 -217 -827 458 651 -620 -338 812 57 -908 190 910
2600 910 -380 -772 558 514 -710 -217 802 -100 -880 319 795 -539 -656 628 369 -747 -95 777
2618 777 -227 -819 423 699 -605 -521 705 250 -745 63 775 -356 -698 578 593 -689 -351 765
2636 765 88 -734 234 720 -475 -584 686 424 -767 -176 786 -87 -719 405 623 -628 -458 774
2654 774 251 -812 -4 768 -245 -667 486 484 -705 -328 788 91 -800 112 709 -379 -571 583
2672 583 404 -726 -189 787 -30 -770 244 664 -450 -484 644 299 -715 -66 760 -165 -696 391
2690 391 576 -556 -381 682 154 -745 82 721 -307 -623 499 452 -654 -241 717 -4 -724 251 631
2709 631 -453 -504 604 306 -716 -101 734 -149 -674 343 545 -555 -383 678 180 -731 31 709
2727 709 -239 -597 441 452 -604 -267 691 73 -730 126 676 -304 -531 490 346 -644 -153 709 -53
2746 -53 -710 230 604 -405 -453 548 225 -670 -11 710 -191 -670 351 515 -500 -320 612 86 -662
2765 -662 150 680 -339 -592 481 433 -554 -189 621 -54 -632 276 617 -433 -504 559 328 -594 -81
2784 -81 613 -167 -599 391 550 -527 -438 586 241 -598 3 568 -269 -545 451 448 -587 -337 618 122
2804 122 -593 124 536 -358 -458 539 361 -631 -212 640 16 -566 249 466 -456 -328 636 228 -683 -75
2824 -75 640 -131 -506 357 380 -538 -220 664 77 -694 67 600 -244 -442 428 264 -604 -104 679 -51 -681
2845 -681 159 550 -320 -387 460 166 -603 -10 660 -161 -645 252 487 -390 -290 507 63 -616 113 654
2865 654 -249 -591 351 424 -425 -188 522 -27 -586 246 592 -361 -500 444 323 -486 -72 531 -172 -540
2885 -540 362 510 -458 -394 493 199 -511 35 491 -265 -477 439 409 -536 -296 523 98 -513 121 448 -341
2906 -341 -411 488 315 -547 -197 534 2 -477 203 421 -389 -333 534 243 -570 -112 537 -73 -436 290 347
2927 347 -451 -232 571 128 -573 9 506 -191 -390 362 255 -507 -119 577 12 -560 132 469 -292 -318
2947 -318 442 152 -533 -9 560 -120 -528 244 393 -365 -241 451 71 -545 68 540 -202 -477 293 327
2967 327 -402 -170 477 -13 -521 152 509 -261 -415 365 264 -435 -96 483 -93 -503 233 447 -328 -339
2987 -339 409 171 -458 15 475 -185 -439 321 372 -408 -240 454 70 -458 111 443 -283 -388 382 276
3007 276 -455 -128 466 -33 -452 194 382 -356 -328 422 190 -480 -60 454 -114 -414 251 322 -400 -242 438
3028 438 107 -486 34 446 -189 -379 308 284 -406 -164 467 22 -450 124 409 -254 -311 377 216 -433 -53
3049 -53 475 -75 -422 225 367 -338 -237 426 121 -447 41 416 -194 -376 308 266 -407 -160 429 2 -458
3070 -458 118 385 -270 -325 366 211 -441 -94 436 -56 -418 190 334 -310 -241 408 142 -448 -14 444 -111
3091 -111 -372 243 289 -338 -176 443 71 -448 85 423 -181 -308 300 202 -384 -79 459 -33 -446 141 372
3112 372 -252 -266 328 107 -422 17 429 -163 -423 226 302 -331 -185 365 13 -425 94 401 -229 -374 280
3133 280 246 -345 -116 377 -47 -382 199 384 -276 -299 333 207 -344 -34 388 -112 -351 259 333 -318 -246
3154 -246 380 152 -358 37 361 -188 -319 312 270 -373 -195 385 35 -371 96 292 -273 -271 361 172 -428
3175 -428 -94 384 -53 -350 177 243 -343 -196 405 102 -438 -9 385 -112 -285 258 209 -364 -93 448 27
3196 27 -428 83 383 -155 -238 297 148 -377 -14 442 -30 -413 130 342 -205 -203 311 65 -389 33 412
3217 412 -128 -395 187 276 -274 -159 317 -12 -397 112 383 -225 -347 250 224 -315 -54 328 -91 -391 201
3238 201 351 -297 -260 321 145 -324 25 330 -157 -315 293 298 -314 -208 346 82 -319 82 309 -227 -272
3259 -272 322 242 -368 -141 363 18 -322 120 279 -265 -227 354 160 -397 -66 350 -65 -315 182 221 -315
3280 -315 -161 380 73 -394 12 335 -143 -259 242 165 -344 -68 402 -9 -364 117 324 -198 -192 298 90
3301 90 -354 21 399 -93 -338 181 260 -239 -128 337 21 -368 85 354 -149 -298 231 205 -285 -93 339
3322 339 -33 -350 132 314 -216 -271 263 151 -312 -29 325 -101 -324 195 272 -261 -185 298 82 -321 51
3343 51 308 -163 -271 260 219 -294 -102 321 -10 -308 130 279 -235 -218 298 132 -327 -30 313 -83 -303
3364 -303 167 217 -272 -145 315 69 -334 39 304 -134 -250 235 185 -290 -88 327 4 -323 98 275 -189
3385 -189 -198 251 134 -302 -42 325 -65 -300 133 246 -227 -167 285 65 -311 30 291 -131 -247 206 185
3406 185 -262 -96 298 2 -312 97 261 -196 -205 255 122 -306 -43 318 -66 -278 152 219 -233 -139 294
3427 294 65 -299 30 303 -115 -245 186 173 -258 -93 304 3 -305 79 262 -152 -206 234 120 -286 -46
3448 -46 301 -52 -304 117 238 -187 -159 242 54 -288 23 296 -114 -258 168 206 -228 -104 255 -2 -279
3469 -279 101 268 -174 -231 216 149 -249 -33 255 -71 -248 164 235 -216 -172 254 91 -263 8 248 -116
3490 -116 -236 194 196 -244 -142 246 57 -252 44 221 -152 -201 222 157 -267 -110 263 18 -233 83 200
3511 200 -183 -155 262 113 -273 -43 250 -29 -204 124 158 -215 -103 275 45 -283 22 258 -92 -185 179
3532 179 109 -232 -25 284 -15 -270 72 229 -132 -150 192 64 -259 7 274 -72 -271 94 183 -166 -117
3553 -117 202 8 -252 61 268 -101 -239 135 158 -166 -82 209 -24 -241 91 242 -136 -188 173 125 -184
3574 -184 -26 210 -62 -218 135 213 -184 -163 200 83 -193 18 196 -121 -188 170 159 -207 -110 211 21 -201
3596 -201 62 170 -165 -157 213 117 -241 -71 209 -20 -179 103 148 -167 -122 228 74 -240 -14 213 -49 -161
3618 -161 135 129 -180 -79 235 35 -229 26 201 -91 -144 150 82 -210 -37 229 -14 -232 56 167 -106
3639 -106 -107 181 28 -217 10 227 -73 -225 99 145 -163 -77 187 -15 -204 60 197 -107 -175 140 94 -188
3661 -188 -32 194 -39 -194 86 160 -119 -114 179 77 -160 -8 189 -57 -192 111 140 -156 -110 155 25 -203
3683 -203 3 178 -117 -186 124 178 -195 -43 207 25 -144 86 173 -150 -111 173 81 -164 -76 155 -103 -134
3705 -134 86 100 -164 -90 196 32 -197 28 179 -94 -142 143 108 -177 -38 208 1 -184 63 161 -115 -141
3727 -141 148 62 -190 -29 188 -49 -192 82 133 -138 -98 167 38 -198 3 175 -71 -166 124 114 -159 -71
3749 -71 187 11 -183 52 183 -90 -134 157 74 -172 -11 196 -41 -169 95 161 -140 -100 182 39 -185 29
3771 29 183 -71 -159 126 102 -172 -71 191 -13 -195 48 156 -125 -141 134 77 -183 -34 181 -32 -185 73
3793 73 143 -124 -96 153 51 -168 17 183 -57 -159 108 135 -135 -69 167 17 -158 63 177 -86 -136 125
3815 125 105 -142 -37 171 -38 -161 98 145 -153 -120 155 49 -160 2 161 -74 -149 116 119 -158 -86 169
3837 169 17 -166 42 132 -105 -126 147 94 -174 -55 166 10 -150 69 138 -116 -87 172 86 -172 -9 184
3859 184 -21 -132 96 123 -137 -65 187 41 -183 18 173 -62 -121 112 67 -159 -30 187 -11 -173 49
3880 49 135 -90 -102 140 31 -172 15 180 -51 -172 81 129 -110 -61 138 1 -172 42 170 -74 -144 114
3902 114 105 -117 -30 153 -14 -150 86 170 -94 -119 120 76 -123 -4 150 -59 -150 94 135 -136 -112 129 47
3925 47 -131 9 130 -90 -140 117 99 -147 -72 147 12 -137 54 112 -114 -109 133 74 -167 -38 153 -6 -114
3948 -114 86 88 -139 -66 175 47 -166 -5 154 -37 -102 103 82 -135 -40 176 26 -155 10 138 -64 -103
3970 -103 109 60 -154 -24 168 -14 -154 25 116 -91 -79 111 29 -145 9 166 -42 -140 81 83 -102 -40 127
3993 127 -13 -144 8 138 -85 -126 82 64 -122 -21 85 -23 -131 91 152 -154 -113 112 38 -121 10 67
4015 67 -43 -123 116 82 -104 -55 152 38 -163 47 114 -64 -126 112 18 -90 -82 170 23 -110 89 81 -130 -86
4039 -86 123 72 -126 -32 135 -19 -115 89 104 -110 -73 136 24 -132 9 111 -63 -110 106 66 -133 -32 133
4062 133 -3 -138 43 108 -91 -78 124 49 -135 -1 138 -30 -126 68 99 -101 -73 126 24 -135 21 141
4084 141 -55 -117 89 81 -123 -34 125 12 -121 33 116 -62 -92 102 63 -132 -27 130 -20 -125 50 105 -87
4107 -87 -83 111 26 -146 2 128 -56 -119 80 91 -113 -52 128 10 -140 36 122 -67 -105 110 58 -117 -17
4130 -17 140 -16 -127 59 113 -86 -68 121 38 -123 3 139 -33 -116 80 94 -101 -59 127 14 -127 18
4152 18 119 -65 -105 89 71 -113 -42 110 -9 -131 41 110 -89 -86 102 50 -121 -8 120 -34 -115 90 108
4175 108 -99 -58 125 28 -102 28 127 -61 -84 119 95 -119 -39 117 -8 -110 46 104 -82 -77 121 63 -134
4198 -134 -22 120 -23 -109 58 88 -118 -65 134 21 -149 -2 114 -50 -110 73 56 -117 -24 137 8 -137
4220 -137 35 121 -64 -76 104 46 -117 9 140 -12 -119 65 102 -85 -53 106 17 -126 34 131 -54 -123 83
4243 83 86 -106 -33 109 -23 -125 59 114 -84 -101 87 54 -112 -14 108 -48 -126 72 105 -101 -85 100 39 -117
4267 -117 9 118 -60 -101 90 86 -108 -54 123 21 -108 43 103 -78 -71 119 71 -116 -24 114 -15 -97 62
4290 62 80 -105 -73 123 28 -145 7 114 -45 -92 87 57 -124 -42 125 -6 -138 22 106 -73 -80 95 51 -122
4314 -122 -8 139 -21 -132 31 94 -76 -52 104 25 -123 19 143 -36 -113 74 90 -87 -36 125 7 -120
4336 -120 33 133 -60 -100 89 62 -104 -23 113 -32 -123 58 105 -100 -92 103 22 -121 0 120 -62 -114 100
4359 100 86 -115 -67 107 11 -112 42 114 -74 -102 114 62 -114 -36 115 2 -114 63 104 -93 -76 115 47
4382 47 -128 -19 116 -34 -106 67 80 -110 -59 124 17 -132 9 94 -65 -102 87 64 -122 -38 122 -14 -129
4405 -129 35 92 -75 -72 112 52 -124 -6 125 -26 -106 68 85 -95 -58 118 20 -122 25 136 -53 -109 89
4428 89 72 -108 -43 108 -16 -134 37 116 -73 -85 101 53 -120 -21 110 -20 -111 50 88 -85 -75 108 21 -129
4452 -129 9 120 -52 -105 81 78 -106 -37 129 6 -114 43 111 -60 -82 110 60 -117 -13 128 -24 -122 67
4475 67 91 -92 -62 105 21 -120 14 123 -56 -109 81 79 -107 -46 116 -7 -127 29 101 -64 -87 77 49 -109
4499 -109 -11 109 -18 -111 63 109 -78 -76 108 49 -108 7 118 -33 -110 89 95 -96 -52 124 26 -120 30 118
4523 118 -68 -78 102 65 -109 -31 124 -12 -117 57 107 -86 -81 109 42 -133 -16 125 -31 -102 75 73 -94
4546 -94 -54 127 21 -135 23 128 -50 -87 89 62 -113 -34 130 -3 -120 44 120 -63 -84 106 60 -112 0
4569 0 142 -19 -118 59 95 -73 -59 110 16 -134 20 130 -49 -114 86 82 -108 -32 114 -6 -136 58 127 -77
4593 -77 -94 105 68 -108 -7 124 -28 -108 82 111 -88 -75 125 39 -121 10 117 -51 -109 106 98 -106 -60 133
4617 133 20 -126 28 119 -82 -99 111 73 -126 -35 141 -13 -128 61 108 -106 -74 116 53 -131 -6 123
4639 123 -41 -122 82 81 -121 -59 137 20 -140 33 125 -58 -96 108 77 -127 -33 149 -8 -126 52 120 -84
4662 -84 -87 119 37 -141 -7 147 -34 -135 67 101 -106 -63 129 21 -148 25 140 -51 -122 94 87 -112 -33
4685 -33 132 -2 -135 53 138 -76 -95 118 57 -127 -12 133 -33 -124 84 104 -104 -70 123 41 -123 10 131
4708 131 -48 -110 105 96 -120 -41 128 0 -132 33 121 -94 -101 102 74 -129 -29 143 -13 -133 64 105 -102
4731 -102 -78 135 50 -141 -1 147 -51 -118 87 97 -117 -53 148 19 -136 44 128 -66 -107 102 68 -134 -31
4754 -31 144 -12 -127 58 126 -100 -81 135 44 -146 -3 147 -47 -140 85 105 -106 -70 129 26 -145 20
4776 20 143 -64 -113 102 79 -114 -36 154 3 -139 44 139 -88 -92 133 71 -131 -5 144 -29 -132 63 114
4799 114 -106 -89 141 33 -137 20 144 -62 -113 107 92 -134 -50 141 12 -144 40 132 -89 -103 119 64
4821 64 -146 -16 155 -17 -146 82 121 -105 -85 126 41 -150 13 147 -56 -119 101 107 -118 -48 159 14 -136
4844 -136 45 140 -70 -109 118 75 -142 -33 155 -20 -144 61 125 -101 -94 138 47 -152 -19 152 -39 -142
4866 -142 87 111 -123 -80 152 25 -145 13 141 -75 -118 114 83 -151 -52 147 0 -131 49 137 -90 -89 137
4889 137 59 -147 2 150 -30 -135 90 107 -111 -69 153 34 -150 30 156 -63 -123 110 87 -132 -45 152
4911 152 -3 -153 38 138 -88 -103 117 59 -137 -16 162 -16 -147 75 126 -108 -79 137 50 -151 12 151
4933 151 -42 -132 97 113 -118 -64 151 3 -151 46 138 -71 -110 109 82 -143 -31 153 -23 -150 59 130
4955 130 -109 -90 137 60 -146 -5 146 -53 -144 78 100 -130 -83 151 29 -149 20 142 -72 -118 113 86
4977 86 -146 -50 168 19 -150 48 134 -104 -99 134 62 -153 -17 160 -32 -130 71 113 -112 -79 158 39 -163
5000 -163 21 157 -58 -134 102 91 -133 -54 148 7 -169 44 137 -78 -124 105 72 -147 -18 151 -24 -156
5022 -156 64 126 -103 -90 135 47 -145 0 160 -41 -148 92 119 -126 -72 146 22 -161 30 155 -75 -130
5044 -130 113 95 -146 -52 144 0 -152 55 129 -106 -113 131 65 -159 -20 149 -38 -149 82 124 -123 -87 146
5067 146 31 -153 7 138 -70 -129 115 105 -132 -45 157 12 -143 47 143 -91 -111 128 70 -154 -24 161
5089 161 -21 -158 72 118 -126 -79 139 38 -168 4 155 -63 -150 82 94 -140 -72 140 4 -163 23 150
5111 150 -84 -120 111 76 -145 -35 157 -33 -157 63 136 -101 -93 144 50 -164 2 156 -40 -148 99 128
5133 128 -129 -67 159 37 -158 25 156 -74 -127 107 97 -138 -47 164 -2 -158 50 150 -97 -114 134 60
5155 60 -157 -21 166 -23 -139 85 121 -117 -87 155 49 -160 17 156 -48 -129 114 120 -130 -56 164 2
5177 2 -154 41 147 -92 -114 122 77 -148 -22 167 -25 -145 77 136 -111 -93 138 50 -154 3 150 -65
5199 -65 -147 92 106 -121 -75 136 6 -173 39 148 -83 -117 130 95 -141 -25 159 -2 -147 61 138 -101
5221 -101 -95 139 71 -157 -1 157 -44 -140 89 119 -131 -74 155 27 -162 31 147 -66 -125 115 94 -148 -50
5244 -50 155 -12 -156 55 142 -103 -111 127 62 -156 -22 171 -36 -161 71 122 -111 -76 156 36 -166 22
5266 22 160 -62 -135 100 97 -135 -48 158 -1 -168 50 156 -93 -122 135 84 -154 -20 165 -37 -163 79
5288 79 133 -108 -104 137 50 -158 9 158 -58 -147 100 121 -118 -67 158 18 -159 50 143 -73 -114 135 99 -155
5312 -155 -45 160 -9 -152 78 142 -110 -96 145 68 -152 -15 157 -55 -141 98 116 -127 -82 152 34 -159
5334 -159 35 152 -65 -114 113 92 -149 -42 167 -11 -149 55 129 -101 -77 138 70 -169 -12 162 -26 -130
5356 -130 87 117 -127 -67 157 29 -170 19 160 -58 -144 114 103 -149 -50 180 -1 -146 64 151 -102 -104 124
5379 124 76 -152 -14 163 -22 -146 65 118 -100 -109 152 35 -134 31 144 -67 -106 147 134 -136 -46 146
5401 146 11 -173 64 185 -123 -134 144 84 -111 -23 178 -48 -164 93 129 -58 -84 98 37 -136 -15 185
5423 185 -64 -149 123 82 -140 -64 128 55 -136 80 175 -83 -126 146 96 -99 -24 118 -42 -132 117 91 -31
5446 -31 -104 132 27 -178 4 220 -15 -65 51 184 -156 -69 174 -1 -106 -10 141 -38 -153 119 82 -179
5468 -179 -45 100 -19 -173 77 145 -76 -109 151 143 -180 34 189 -88 -162 89 103 -107 -62 153 30 -162
5490 -162 9 157 -64 -138 124 113 -131 -52 155 4 -158 52 139 -90 -110 127 74 -155 -39 161 -24 -148
5512 -148 81 140 -123 -90 153 47 -158 4 167 -59 -133 104 99 -145 -65 147 14 -155 45 146 -78 -116
5534 -116 121 97 -140 -23 163 -11 -146 76 145 -106 -96 143 66 -145 3 156 -42 -138 102 124 -124 -75
5556 -75 157 29 -159 23 150 -91 -137 122 90 -145 -57 152 -7 -155 57 124 -103 -113 131 59 -165 -24
5578 -24 160 -30 -148 78 126 -131 -74 155 41 -158 24 146 -63 -116 90 133 -131 -65 165 15 -153 47
5600 47 140 -72 -107 128 59 -157 -17 188 -21 -149 79 121 -103 -90 124 51 -184 1 155 -42 -141 77 107
5623 107 -144 -27 149 52 -138 51 137 -106 -108 105 87 -152 -82 133 -94 -167 145 144 -93 -102 145 42 -120 -20
5647 -20 94 -31 -149 122 119 -109 -85 132 28 -154 18 127 -73 -132 126 110 -148 -50 143 -2 -160 55
5669 55 128 -107 -101 141 80 -154 -25 158 -28 -140 77 110 -139 -80 152 49 -160 12 146 -56 -120 124 94
5692 94 -138 -51 166 16 -152 31 132 -86 -115 131 80 -149 -32 161 -12 -143 67 130 -105 -80 127 36
5714 36 -160 2 170 -39 -135 95 120 -113 -55 143 21 -151 41 150 -71 -126 117 78 -136 -36 153 -17
5736 -17 -160 68 136 -106 -112 117 52 -147 -5 161 -44 -136 74 132 -117 -87 134 34 -154 20 140 -84 -139
5759 -139 111 93 -129 -51 134 -7 -154 48 135 -91 -101 123 74 -137 -29 151 -24 -132 72 121 -126 -77
5781 -77 145 54 -143 11 155 -49 -126 108 93 -139 -50 144 17 -156 28 143 -72 -103 127 68 -146 -42
5803 -42 152 -23 -153 53 123 -110 -90 128 33 -151 -4 146 -45 -132 74 109 -113 -68 141 26 -156 22
5825 22 147 -57 -126 108 79 -115 -41 153 -1 -135 45 135 -86 -89 118 62 -139 -21 147 -30 -103 57 107
5848 107 -115 -109 135 40 -118 8 148 -75 -109 93 112 -116 -42 143 5 -207 -8 155 -43 -125 93 84 -118
5871 -118 -66 183 13 -202 91 118 -81 -82 129 121 -124 15 153 -102 -99 102 163 -126 -32 87 -68 -30 -2 113
5895 113 -81 -100 93 20 -154 -82 144 14 -216 81 142 -62 -76 144 72 -109 -17 122 -17 -80 50 94 -87
5918 -87 -57 152 11 -100 -23 143 -81 -123 145 36 -94 -60 121 -18 -121 62 116 -70 -102 106 113 -149 -21
5941 -21 140 -20 -141 58 92 -84 -80 133 36 -141 12 166 0 -129 102 73 -141 -65 142 4 -132 13
5963 13 138 -49 -110 95 62 -141 -27 152 -8 -158 50 123 -110 -58 125 55 -161 14 149 -36 -109 32
5985 32 98 -125 -55 113 33 -157 -11 117 -90 -120 56 81 -139 -44 114 -24 -199 39 134 -96 -97 90 39 -112
6009 -112 -3 132 -41 -135 75 91 -111 -77 99 25 -116 9 152 -34 -134 80 89 -115 -64 128 -4 -133
6031 -133 31 114 -94 -104 115 69 -132 -42 138 -11 -106 59 117 -90 -87 123 37 -132 -15 133 -35 -113 77
6054 77 98 -114 -64 127 24 -135 9 136 -66 -103 110 82 -118 -37 140 4 -136 46 120 -65 -89 110 57
6077 57 -133 -9 145 -25 -136 62 105 -90 -71 127 18 -147 8 139 -44 -122 87 85 -111 -41 129 7
6099 7 -136 41 141 -62 -99 113 82 -111 -23 136 -25 -128 58 112 -81 -81 115 38 -129 2 139 -45 -130
6122 -130 86 100 -98 -55 114 23 -132 25 118 -73 -110 90 86 -116 -52 128 -17 -123 47 117 -91 -91 115 52
6146 52 -124 -28 134 -29 -117 71 113 -97 -65 125 40 -136 16 128 -50 -110 97 89 -126 -52 131 1 -127
6169 -127 39 117 -64 -90 104 54 -123 -17 138 -18 -130 61 90 -92 -75 122 39 -131 2 124 -37 -109
6191 -109 93 89 -111 -41 133 21 -129 35 129 -61 -94 97 69 -111 -26 150 5 -121 62 123 -81 -79 123
6214 123 56 -123 2 131 -35 -130 74 86 -108 -67 122 17 -132 21 130 -55 -109 92 65 -108 -28 132
6236 132 -11 -124 37 113 -77 -93 107 60 -124 0 134 -13 -124 64 116 -90 -63 125 38 -123 19 119
6258 119 -46 -106 91 82 -110 -43 137 -1 -125 34 126 -80 -105 94 53 -128 -20 131 -18 -123 57 103 -91
6281 -91 -81 123 45 -127 -3 122 -43 -111 77 92 -89 -59 126 27 -115 27 111 -68 -99 99 77 -120 -54 121
6305 121 -2 -116 45 114 -85 -76 116 56 -118 -14 126 -41 -111 63 91 -106 -67 115 32 -133 3 122 -45
6328 -45 -95 90 70 -110 -37 137 3 -135 34 114 -68 -85 101 58 -121 -17 128 -6 -129 41 102 -84 -59
6351 -59 110 27 -124 10 137 -42 -117 66 97 -99 -49 116 9 -116 23 126 -64 -98 96 73 -109 -17 119
6374 119 -20 -118 49 116 -78 -91 108 39 -118 9 107 -38 -120 76 107 -101 -52 112 24 -113 21 110 -66
6397 -66 -102 108 81 -109 -62 116 5 -119 51 110 -73 -86 108 52 -128 -20 124 -23 -124 66 94 -90 -69
6420 -69 120 40 -110 -1 110 -31 -93 85 79 -105 -40 135 22 -128 26 101 -65 -78 99 60 -125 -10 138
6443 138 -5 -119 50 105 -76 -66 122 34 -132 -4 124 -40 -117 71 86 -95 -37 128 5 -120 35 128
6465 128 -68 -89 90 55 -103 -21 131 -3 -114 59 123 -73 -85 107 50 -97 -1 126 -26 -114 83 105 -86
6488 -86 -60 128 34 -110 18 113 -49 -106 92 85 -107 -36 120 12 -116 48 121 -79 -86 110 53 -119 -23 117
6512 117 -22 -109 55 95 -89 -73 119 29 -114 4 116 -25 -109 77 82 -93 -46 126 18 -115 29 111 -57
6535 -57 -87 94 62 -112 -31 126 -15 -111 45 98 -85 -69 107 29 -121 -14 121 -40 -105 70 72 -93 -50 122
6559 122 12 -120 21 107 -60 -94 99 68 -108 -36 132 -3 -120 37 106 -73 -89 105 57 -107 2 130
6581 130 -24 -114 65 105 -83 -56 117 32 -123 6 118 -49 -106 87 74 -107 -43 126 6 -115 35 121 -71
6604 -71 -77 98 58 -114 -21 123 -16 -112 42 87 -84 -66 103 28 -118 5 112 -48 -101 76 85 -118 -46 114
6628 114 8 -116 34 119 -56 -91 102 67 -104 -21 127 -8 -110 66 113 -73 -77 88 45 -100 -13 130 -44
6651 -44 -109 87 98 -80 -53 105 43 -109 29 120 -59 -81 85 71 -104 -36 123 5 -125 61 96 -58 -44 98
6675 98 54 -108 -22 127 -9 -106 74 54 -94 -63 94 16 -113 9 116 -42 -110 82 51 -83 -41 104 20 -140
6699 -140 34 107 -69 -77 102 41 -120 -37 109 3 -127 31 100 -61 -56 108 17 -115 28 119 -59 -79 87 54
6723 54 -86 -72 102 13 -86 29 101 -64 -83 78 71 -88 -28 98 -13 -99 53 125 -86 -63 97 46 -102 -10 112
6748 112 -44 -97 67 75 -81 -61 99 28 -102 22 101 -52 -84 80 78 -76 -33 111 11 -93 45 95 -64 -68
6772 -68 99 66 -94 -14 106 -9 -90 54 86 -78 -58 97 32 -105 -5 100 -46 -73 68 62 -102 -38 115 19
6796 19 -100 19 93 -45 -70 89 46 -111 -12 112 -7 -100 46 82 -67 -56 102 35 -110 9 98 -28 -76 59
6820 59 82 -65 -34 105 13 -112 21 98 -38 -77 62 65 -90 -27 96 -9 -106 44 91 -70 -68 88 53 -102 -6
6845 -6 98 -24 -98 54 81 -77 -43 93 24 -104 13 87 -46 -76 71 60 -84 -31 94 2 -102 34 102 -68
6869 -68 -75 91 43 -88 -10 100 -20 -94 55 71 -70 -59 85 24 -101 5 105 -30 -80 65 67 -76 -25 96
6893 96 20 -94 33 91 -50 -68 79 53 -91 -14 90 11 -89 31 84 -71 -55 76 30 -99 12 90 -24 -77
6917 -77 55 68 -81 -39 89 23 -89 27 93 -38 -76 68 46 -79 -38 99 -7 -88 27 89 -53 -68 73 30
6941 30 -89 -16 101 -16 -86 52 69 -67 -45 98 19 -84 7 104 -31 -87 59 54 -78 -35 91 -4 -93 21 85
6966 85 -49 -62 79 45 -91 -14 94 -21 -80 44 88 -62 -47 87 23 -127 3 110 -36 -70 62 67 -66 -27
6990 -27 93 -1 -94 24 95 -49 -66 57 59 -70 -19 77 -8 -77 40 83 -55 -59 73 38 -80 0 92 -37 -76 56
7016 56 74 -64 -46 84 17 -87 18 83 -48 -68 74 54 -75 -37 90 1 -74 35 67 -65 -56 84 30 -99 -14
7041 -14 83 -34 -73 38 54 -65 -30 87 14 -88 -6 82 -25 -71 48 52 -71 -26 97 17 -88 29 73 -40 -47
7066 -47 67 31 -86 -10 85 -20 -85 37 54 -61 -34 88 18 -93 18 87 -30 -64 66 65 -61 -9 80 -9 -72
7091 -72 38 82 -46 -64 65 37 -64 -6 84 -28 -72 52 61 -58 -41 77 19 -71 12 85 -30 -75 52 67 -66
7116 -66 -39 79 29 -69 20 65 -51 -64 70 45 -76 -20 85 11 -73 41 64 -60 -55 69 43 -78 -3 87 -7 -58
7142 -58 63 60 -56 -23 83 18 -77 12 78 -33 -47 63 39 -89 -30 89 1 -83 19 69 -44 -45 77 26 -81 -2
7168 -2 89 -15 -75 39 60 -56 -51 78 11 -78 3 82 -19 -61 49 43 -75 -30 89 -1 -79 24 89 -35 -58 53
7194 53 38 -67 -2 85 -2 -73 42 76 -48 -40 69 23 -75 9 75 -31 -63 52 57 -51 -23 77 13 -67 24 85 -41
7221 -41 -50 59 51 -72 -15 80 -7 -70 47 66 -49 -39 75 28 -71 1 79 -23 -57 50 59 -48 -22 74 13 -76 20 81
7249 81 -30 -49 50 54 -69 -23 72 1 -65 31 69 -37 -48 63 25 -74 -14 71 -18 -68 54 59 -51 -39 79 20 -79 14
7277 14 82 -21 -57 55 34 -76 -25 67 4 -67 28 67 -44 -54 65 25 -73 -5 66 -14 -57 43 57 -56 -36 63 27
7304 27 -72 19 60 -18 -78 68 16 -73 -51 83 -8 -78 40 75 -78 -72 95 74 -64 -12 80 -2 -62 41 58 -47 -23
7331 -23 67 28 -68 6 78 -21 -59 38 52 -48 -21 68 10 -75 24 63 -31 -86 18 38 -29 -27 39 -22 -64 31 66 -13 -53 86
7361 86 31 -64 1 83 -22 -46 46 50 -57 -43 61 11 -44 11 42 9 -38 72 45 -35 -34 90 -18 -66 36 41 -37 -22
7389 -22 75 18 -79 -53 63 -48 -32 70 63 -65 -51 84 26 -68 7 44 -9 -25 89 64 -67 -9 85 2 -81 20 53
7416 53 -9 -28 81 43 -52 -20 87 59 -141 27 50 -28 -62 65 6 -72 76 72 11 -94 62 34 -48 -35 54 2 -30
7443 -30 40 33 -26 -140 63 66 -53 -2 56 -16 -70 42 70 -30 -55 55 24 -55 2 64 -26 -63 50 57 -50 -24 63 16
7471 16 -57 19 62 -23 -56 56 46 -52 -27 76 1 -55 28 60 -46 -38 65 21 -65 -9 71 -22 -45 27 41 -45 -37 57 22
7500 22 -69 9 68 -27 -51 49 33 -66 -19 61 -1 -58 22 61 -29 -37 57 38 -44 2 77 -6 -52 19 50 -34 -22 56 20 -65
7530 -65 7 61 -24 -49 41 46 -46 -14 60 -3 -71 24 62 -34 -56 43 32 -55 -15 68 -10 -53 26 49 -44 -33 59 16 -59 7 61
7561 61 -18 -56 40 57 -45 -21 61 10 -49 15 50 -38 -43 47 45 -62 -16 52 -4 -48 33 63 -32 -40 50 24 -62 -3 61 -8 -53
7592 -53 37 58 -39 -28 48 -16 -62 5 56 -29 -43 34 38 -44 -28 56 -2 -47 29 53 -40 -41 49 30 -52 1 58 -16 -46 44 50 -33
7624 -33 -22 62 29 -49 -1 53 -20 -43 50 35 -40 -30 47 9 -55 19 68 -31 -28 49 45 -40 -8 53 7 -47 31 55 -45 -30 56
7655 56 32 -57 -1 63 -8 -48 42 36 -52 -24 54 13 -53 16 50 -28 -31 34 32 -38 -11 68 3 -47 18 50 -36 -28 41 21 -52 2
7687 2 58 -16 -55 38 43 -35 -13 66 22 -44 16 59 -15 -42 38 28 -33 -15 54 -1 -47 24 41 -38 -38 37 17 -55 -6 46 -13 -41
7719 -41 40 44 -42 -32 57 12 -48 4 48 -18 -45 35 27 -45 -14 58 4 -54 19 53 -35 -29 49 20 -49 -2 62 -11 -37 20 33 -36
7751 -36 -29 56 26 -50 -9 52 -9 -39 35 26 -38 -16 54 6 -57 10 39 -18 -33 41 19 -41 -10 62 -3 -56 18 46 -26 -27 44 15
7783 15 -49 5 59 -15 -39 24 32 -24 -18 46 5 -50 15 64 -20 -40 38 26 -28 -6 50 -5 -37 30 60 -33 -37 45 11 -39 2 51
7815 51 -20 -50 35 35 -37 -33 32 8 -45 7 41 -30 -47 38 22 -42 -14 46 3 -37 20 34 -32 -34 37 32 -41 -2 50 -17 -34 27
7847 27 35 -32 -16 51 17 -50 0 57 -19 -36 46 23 -47 -25 55 -10 -74 21 41 -23 -26 44 15 -41 6 55 -4 -50 17 30 -43
7878 -43 -21 44 2 -42 18 57 -13 -38 28 35 -30 -11 49 -8 -54 9 48 -26 -30 27 16 -45 -6 48 -9 -50 34 33 -29 -29 48 9
7910 9 -47 14 54 -9 -30 34 34 -28 -21 54 -1 -39 17 38 -22 -26 43 25 -53 1 41 2 -43 17 41 -30 -22 43 7 -48 -2 35 -4
7943 -4 -37 15 33 -31 -20 34 3 -46 8 48 -17 -37 34 23 -40 -6 43 -8 -43 20 38 -21 -23 41 21 -38 2 34 -17 -38 27
7974 27 30 -31 -28 46 6 -47 7 44 -24 -29 31 23 -40 -3 43 -6 -37 30 26 -21 -33 50 16 -40 2 43 -7 -47 21 33 -36 -27 50
8007 50 2 -43 -8 36 -13 -33 24 23 -41 -9 55 5 -35 16 42 -23 -34 30 13 -34 5 46 -6 -41 19 42 -38 -23 46 3 -44
8038 -44 6 49 -18 -40 24 28 -27 -16 43 7 -48 3 34 -35 -27 22 15 -39 -10 41 -4 -37 26 31 -31 -19 34 8 -44 5 34 -15
8070 -15 -39 32 36 -37 -15 35 9 -40 9 39 -33 -31 34 29 -43 -21 40 2 -36 10 25 -38 -22 40 25 -27 4 41 -22 -33 32 26
8102 26 -42 -12 35 5 -50 3 35 -16 -24 29 14 -46 -12 52 9 -52 18 38 -14 -21 36 12 -40 10 34 -6 -37 19 29 -30 -19
8133 -19 43 4 -37 6 46 -12 -37 27 17 -31 -10 32 -7 -55 16 40 -22 -31 30 18 -37 -7 19 -7 -30 21 34 -31 -11 40 13
8164 13 -29 -1 42 -18 -35 25 21 -33 -10 51 3 -36 7 35 -23 -32 34 31 -29 -12 34 -7 -34 31 29 -28 -25
8191b5
$$ Imaginary data points
##PAGE= N=2
##DATA TABLE= (X++(I..I)), XYDATA
0 0 0 0 0 0 0 0 0 0 0 0 0 0 0 0 0 0 0 -5 8 -8 8 -8 8 -14 16 -16 17 -24 25 -32 33 -40 42 -49 56 -62 69 -79 87
39 87 -97 107 -119 132 -145 161 -178 196 -216 236 -260 289 -317 350 -386 428 -476 529 -591 664
59 664 -752 858 -988 1158 -1383 1700 -2180 2976 -4546 8734 -41870 -91830 74193 61106
73 61106 -84731 -32868 92649 -4392 -90628 33023 81417 -59660 -62745 73761 35712
84 35712 -83869 -3798 83860 -28518 -79401 56698 66594 -75807 -46962 86549 20562
95 20562 -87840 8801 82917 -36646 -70226 60502 54538 -74002 -31418 79630 5835
106 5835 -75748 23065 66924 -47898 -51387 68545 33255 -78994 -10593 80813 -13672 -73553
118 -73553 38182 60040 -59619 -42836 73739 22413 -79445 -858 74943 -22681 -64501
129 -64501 42867 46818 -60675 -27620 70301 5800 -72630 14818 64807 -36115 -51703 53211
141 53211 33138 -66030 -13242 71412 -6798 -68587 25914 58558 -42150 -41956 55581 22825
153 22825 -63004 -1843 65044 -16457 -57786 34501 45675 -47817 -27489 57875 8003 -61525
165 -61525 12239 59892 -29156 -50592 43512 35970 -53706 -17597 59066 -2365 -59568 20425
177 20425 53217 -36414 -41920 47421 25045 -54645 -6496 55687 -13590 -53054 29817 43687
189 43687 -43303 -30422 51350 13074 -55137 4797 53105 -22413 -46700 36813 35764 -46683
201 -46683 -20921 51879 4305 -51372 13364 46979 -28338 -37387 40642 25154 -47305 -9324
213 -9324 50124 -6199 -46738 22236 39987 -35136 -29102 44592 15968 -48708 -613 48342
225 48342 -14551 -43131 28108 33456 -39182 -21263 45416 6412 -47535 8257 43952 -22875
237 -22875 -36877 34240 25356 -42946 -12480 46022 -2711 -45423 16784 39801 -29296 -30412
249 -30412 38579 17905 -44047 -4024 44760 -10123 -40770 23516 33517 -33483 -22378 40511
261 40511 9905 -42531 4241 41070 -17148 -35018 28836 26431 -36672 -14616 41345 2167
273 2167 -41065 10971 36872 -23109 -29361 32821 19343 -38847 -7589 40516 -5164 -38324
285 -38324 16999 31663 -28050 -22826 35718 11565 -40099 -14 39386 -12228 -34952 23009
297 23009 26463 -32322 -16237 37919 4525 -39644 7203 36955 -17991 -30044 27324 20180
309 20180 -34238 -8685 38090 -2539 -37214 13701 32780 -22798 -24199 30348 13632 -34844
321 -34844 -1734 36518 -9111 -33883 18866 27791 -26221 -18146 31624 6886 -34436 4400
333 4400 33862 -14727 -29913 22923 22389 -28854 -12344 31980 414 -33119 10508 30727 -20135
346 -20135 -25444 26839 16714 -31075 -6078 32296 -5630 -31151 16150 27125 -24443 -20361
358 -20361 29624 11057 -31565 116 31048 -11205 -27910 20878 22560 -27543 -14698 31104
370 31104 5296 -30983 5551 28475 -15840 -23792 24254 17481 -29211 -9263 30738 -160
382 -160 -28923 10241 24756 -19517 -18967 26460 11867 -30147 -3852 29921 -5172 -26568 14343
395 14343 20963 -22549 -14286 27976 6524 -30167 1596 28496 -10064 -23684 18252 16820 -25156
408 -25156 -9189 29251 1215 -29759 6710 26482 -14426 -20187 21461 12244 -26671 -3751
420 -3751 29176 -4326 -28095 11678 23401 -18101 -15800 23597 7120 -27052 1590 27801
432 27801 -9321 -25195 15680 19353 -20636 -11048 24273 1921 -26015 6654 25263 -13677
444 -13677 -21497 18847 14776 -22395 -6196 24341 -2821 -24354 11009 22168 -17309 -17455 21331
457 21331 10244 -23355 -1433 23744 -7410 -22320 15002 18827 -20467 -13228 23292 5607
469 5607 -23878 3107 22570 -11558 -19616 18351 14962 -22651 -8661 24091 841 -23271 7406
482 7406 20501 -15013 -16261 20755 10729 -23824 -4153 23863 -3400 -21501 11058 17515 -17529
495 -17529 -12215 22007 6185 -23640 528 22546 -7390 -19089 14000 14229 -19183 -8296 22460
508 22460 2109 -22835 4454 20659 -10852 -16324 16540 10642 -20648 -4230 22561 -2267
520 -2267 -21848 8408 18451 -14146 -13264 18633 6862 -21562 -287 21998 -6231 -20113 11901
533 11901 15688 -16772 -9842 20093 2955 -21608 3762 20740 -9801 -17647 14806 12511 -18443
546 -18443 -6067 20377 -673 -20391 7205 18420 -12649 -14263 16752 8705 -19105 -2034
558 -2034 19987 -4365 -18697 10332 15702 -14835 -10838 17940 4922 -19183 1530 18687 -7696
571 -7696 -16407 12923 12518 -16690 -7284 18671 1067 -19038 5027 17316 -10823 -14144 15163
584 15163 9258 -18155 -3662 18962 -2653 -18212 8371 15377 -13414 -11240 16847 5816 -18636
597 -18636 129 18556 -5982 -16580 11197 13019 -15102 -7993 17655 2444 -18102 3609
609 3609 17147 -8829 -14189 13307 10131 -16028 -4735 17463 -849 -16974 6511 15138 -11137
622 -11137 -11651 14613 7033 -16516 -1647 16725 -4082 -15529 9164 12746 -13386 -8966 15764
635 15764 3854 -16814 1432 15850 -7050 -13797 11617 10215 -15156 -5976 16612 691 -16479
648 -16479 4669 14538 -9862 -11409 13999 7380 -16404 -2579 16984 -2360 -15428 7498 12645
661 12645 -11766 -8543 15208 4313 -16506 552 16223 -5028 -13738 9598 10286 -13120 -5782
674 -5782 15594 1327 -16132 3178 14771 -7365 -11740 10990 7463 -13955 -2963 15350 -1712
687 -1712 -15335 5653 13072 -9479 -9663 12235 4821 -14555 -162 15117 -4483 -14260 8168
700 8168 11396 -11269 -7189 13392 2104 -14558 2932 14503 -7127 -12656 10515 9420 -12594
713 -12594 -4583 14040 -406 -14049 5561 13306 -9224 -10598 12059 6924 -13232 -1801 13706
726 13706 -3203 -12903 7838 11261 -11040 -8319 12819 4222 -13343 524 12646 -5530 -11411
739 -11411 9433 8958 -12323 -5977 13151 1575 -13086 2852 11491 -7634 -9637 11019 6751
752 6751 -13228 -3476 13421 -724 -12371 5174 10288 -9321 -7547 12475 4560 -13761 -791
765 -791 13510 -3032 -11327 7400 8790 -10736 -5298 13405 2129 -13779 1680 12788 -5201
778 -5201 -10005 8927 6770 -11744 -3105 13497 -343 -13429 3642 11517 -6971 -8486 9775
791 9775 4552 -12169 -988 12888 -2666 -12412 5428 9822 -8340 -6548 10326 2328 -12069
804 -12069 1304 12256 -4698 -11152 7241 8317 -9411 -4497 10960 339 -11638 3681 11408
817 11408 -6633 -9449 9058 6491 -10319 -2199 11335 -1797 -11094 5785 10274 -8350 -7763
830 -7763 10275 4457 -10929 -150 11024 -3968 -10200 7465 8525 -9796 -5891 10818 2190
843 2190 -11053 1642 10139 -5645 -8924 8462 6600 -10502 -3951 10820 181 -10566 3392
856 3392 9048 -7014 -7264 9444 4651 -10828 -1658 10811 -1737 -9719 5166 7919 -8081 -5412
870 -5412 10234 2789 -10806 534 10465 -3649 -8689 6936 6530 -9225 -3526 10860 663
883 663 -10798 2636 9771 -5532 -7497 8217 4737 -10015 -1637 10711 -1549 -10249 4444
896 4444 8468 -7172 -6034 9021 2770 -10349 210 10167 -3411 -9189 5878 6863 -8173 -4230
910 -4230 9348 942 -9916 2060 9274 -4893 -7712 7136 5317 -8682 -2319 9554 -704
923 -704 -9314 3772 8311 -6136 -6109 8213 3636 -9098 -417 9455 -2511 -8584 5390 7080
937 7080 -7416 -4546 8947 1725 -9431 1357 9023 -4277 -7678 6684 5442 -8501 -2802
950 -2802 9276 -304 -9294 3128 8131 -5836 -6437 7586 3728 -8933 -992 9142 -1991 -8615
964 -8615 4503 7020 -6705 -4857 8095 2079 -8773 848 8660 -3496 -7588 5816 5841 -7330
978 -7330 -3230 8354 503 -8401 2460 7928 -4793 -6333 6879 4382 -7904 -1590 8386 -1252
992 -1252 -7969 4112 6992 -6244 -5154 7699 2738 -8325 31 8061 -2992 -7246 5455 5635
1006 5635 -7402 -3694 8229 1067 -8330 1586 7396 -4451 -6182 6534 4265 -7998 -2117 8335
1020 8335 -391 -7813 2917 6465 -5376 -4736 7244 2788 -8126 -504 8123 -1716 -7052 4117
1034 4117 5455 -6091 -3350 7639 1317 -8064 958 7664 -2982 -6117 5128 4137 -6807 -1872
1048 -1872 7862 -352 -7935 2491 7027 -4369 -5211 5955 2742 -7329 -333 7824 -2015 -7521
1062 -7521 3863 6042 -5528 -3939 6646 1237 -7486 1213 7442 -3462 -6723 5024 4996 -6154
1076 -6154 -2573 6845 -118 -7128 2571 6760 -4485 -5610 5862 3823 -6446 -1255 6773 -1304
1090 -1304 -6544 3698 5933 -5300 -4487 6324 2533 -6551 58 6460 -2560 -5837 4744 4819 -6189
1105 -6189 -3285 6737 1168 -6602 1342 5964 -3829 -5092 5647 3661 -6831 -1981 6948 -258
1119 -258 -6418 2600 5274 -4915 -3982 6482 2350 -7242 -581 6900 -1531 -5875 3712 4433 -5563
1134 -5563 -2757 6814 1053 -7118 755 6502 -2564 -5040 4519 3368 -6008 -1538 6887 -159 -6812
1149 -6812 1836 5868 -3424 -4152 4994 2230 -6168 -305 6725 -1402 -6397 2882 5092 -4321 -3245
1164 -3245 5508 1122 -6340 878 6443 -2674 -5845 3937 4229 -5063 -2141 5840 -148 -6266 2154
1179 2154 5977 -3807 -4994 4904 3210 -5631 -993 5976 -1279 -5842 3304 5247 -4685 -3939 5447
1194 5447 2023 -5725 242 5677 -2352 -5132 4144 4240 -5273 -2832 5712 937 -5632 1177 5172
1209 5172 -3171 -4381 4724 3237 -5607 -1683 5781 -220 -5437 2159 4621 -3974 -3534 5269 2174
1224 2174 -5877 -583 5728 -1319 -5091 3147 4002 -4679 -2591 5725 1009 -6026 680 5579 -2440
1239 -2440 -4560 4053 3155 -5261 -1541 5893 -119 -5802 1799 5050 -3383 -3801 4651 2196 -5519
1254 -5519 -485 5795 -1194 -5394 2712 4319 -4074 -2915 4998 1229 -5458 514 5373 -2100 -4686
1269 -4686 3463 3477 -4541 -1950 5189 249 -5344 1441 4951 -2929 -3957 4212 2606 -5021 -962
1284 -962 5294 -800 -5056 2473 4332 -3785 -3068 4760 1464 -5317 188 5286 -1864 -4712 3333
1299 3333 3592 -4503 -2136 5161 425 -5362 1217 4899 -2811 -4030 4014 2657 -4871 -1070 5241
1314 5241 -579 -5115 2061 4400 -3375 -3241 4379 1796 -4908 -112 5043 -1473 -4626 2882 3772
1329 3772 -3877 -2362 4626 813 -4877 881 4780 -2320 -4110 3538 3017 -4349 -1524 4770 -154
1344 -154 -4746 1872 4343 -3285 -3497 4211 2093 -4794 -528 4802 -1250 -4497 2794 3717 -4081 -2708
1360 -2708 4683 1213 -4878 385 4531 -2143 -3940 3594 3029 -4551 -1798 4950 344 -4768 1279
1375 1279 4166 -2777 -3169 4119 2192 -4728 -873 4895 -461 -4368 1998 3568 -3315 -2420 4431
1390 4431 1294 -4886 3 4770 -1292 -4018 2615 2856 -3861 -1598 4638 259 -4913 942 4426
1405 4426 -2244 -3540 3274 2057 -4291 -669 4790 -749 -4814 1872 4029 -2990 -2810 3843 1204
1420 1204 -4508 370 4737 -1683 -4370 2791 3489 -3499 -2001 4141 441 -4413 1287 4449 -2335
1435 -2335 -3772 3300 2795 -3790 -1181 4169 -405 -4113 2026 3862 -3008 -3181 3721 1972 -4055
1450 -4055 -495 3998 -1194 -3845 2530 3277 -3600 -2498 4027 1163 -4166 316 3787 -2065 -3458
1465 -3458 3272 2663 -4145 -1688 4333 300 -4127 1200 3512 -2727 -2765 3901 1897 -4434 -745 4446
1481 4446 -519 -3846 2054 3106 -3272 -2070 4264 1125 -4481 104 4293 -1225 -3444 2538 2442
1496 2442 -3619 -1342 4315 309 -4392 764 3913 -1880 -3021 2908 1782 -3877 -671 4263 -491
1511 -491 -4250 1423 3469 -2474 -2420 3275 1018 -4008 155 4171 -1327 -3911 2211 3031 -2997 -1739
1527 -1739 3643 298 -4029 1021 4020 -2039 -3392 2905 2420 -3380 -934 3844 -448 -3835 1792
1542 1792 3650 -2663 -2854 3320 1769 -3583 -269 3753 -1099 -3554 2304 3076 -3131 -2242 3558 1058
1558 1058 -3677 307 3494 -1730 -3198 2713 2471 -3454 -1639 3636 342 -3611 928 3186 -2255
1573 -2255 -2672 3159 1812 -3739 -850 3781 -386 -3461 1685 2884 -2762 -2042 3564 1112 -3829
1588 -3829 42 3759 -1129 -3100 2364 2395 -3206 -1338 3818 336 -3817 830 3516 -1846 -2726 2849
1604 2849 1803 -3448 -694 3757 -414 -3637 1409 3044 -2391 -2215 3107 1143 -3573 -111 3577
1619 3577 -1052 -3342 1922 2581 -2783 -1701 3260 527 -3538 551 3349 -1629 -2877 2473 2033
1634 2033 -3138 -1009 3491 -77 -3408 1248 3097 -2163 -2336 2964 1416 -3356 -244 3541 -778
1649 -778 -3185 1898 2644 -2685 -1726 3306 718 -3501 411 3404 -1427 -2882 2346 2108 -3006 -1119
1665 -1119 3364 7 -3467 973 3080 -1938 -2467 2626 1486 -3206 -552 3319 -591 -3266 1448
1680 1448 2730 -2283 -1994 2809 937 -3199 104 3232 -1144 -2956 1999 2357 -2593 -1391 3061
1695 3061 378 -3132 805 3077 -1699 -2557 2502 1869 -2856 -754 3147 -321 -3022 1461 2743
1710 2743 -2295 -2105 2869 1281 -3080 -181 3034 -964 -2778 1940 2256 -2720 -1612 3018 631
1725 631 -3111 345 2790 -1484 -2417 2316 1762 -2970 -1106 3073 155 -2946 822 2489 -1840 -1947
1741 -1947 2614 1271 -3058 -487 3137 -341 -2738 1330 2192 -2159 -1413 2931 730 -3141 130
1756 130 3063 -892 -2457 1813 1748 -2495 -831 3080 48 -3180 745 2860 -1487 -2157 2174 1207
1772 1207 -2788 -312 3053 -586 -3064 1226 2506 -1904 -1747 2344 658 -2820 233 2933 -1097
1787 -1097 -2794 1628 2151 -2129 -1285 2463 237 -2672 760 2721 -1475 -2381 2025 1745 -2294 -740
1803 -740 2530 -239 -2524 1257 2462 -1874 -1958 2351 1276 -2442 -235 2487 -794 -2324 1736 2041
1819 2041 -2328 -1486 2579 662 -2578 302 2351 -1355 -2040 2120 1555 -2639 -995 2666 99 -2507
1835 -2507 773 2078 -1753 -1651 2401 1082 -2752 -469 2662 -331 -2320 1183 1800 -1963 -1202 2544
1851 2544 655 -2680 21 2545 -701 -2018 1507 1468 -2131 -766 2634 214 -2651 464 2364
1866 2364 -1102 -1740 1774 1033 -2320 -312 2592 -338 -2549 930 2080 -1531 -1411 2011 566 -2464
1882 -2464 165 2556 -865 -2374 1356 1764 -1838 -996 2170 108 -2412 669 2374 -1276 -2048 1693
1898 1693 1425 -1993 -585 2216 -257 -2268 1002 2147 -1513 -1698 1890 1060 -2045 -206 2142 -613
1914 -613 -2067 1329 1821 -1776 -1328 2020 659 -2091 168 2017 -954 -1833 1595 1464 -2010 -931
1930 -931 2133 181 -2087 597 1850 -1367 -1527 1905 1029 -2217 -430 2218 -287 -2008 1016 1628
1946 1628 -1660 -1150 2102 595 -2254 63 2162 -725 -1828 1377 1351 -1877 -774 2171 181 -2195
1962 -2195 444 1987 -1044 -1558 1573 1021 -1950 -430 2129 -184 -2063 784 1769 -1327 -1294 1738
1978 1738 694 -1992 -67 2038 -554 -1855 1126 1484 -1570 -927 1891 316 -1998 346 1918
1993 1918 -943 -1598 1466 1143 -1832 -535 2008 -90 -1948 748 1699 -1307 -1249 1747 710 -1970
2009 -1970 -100 1995 -508 -1794 1072 1424 -1547 -914 1868 331 -1985 237 1876 -813 -1586 1279
2025 1279 1105 -1659 -536 1881 -30 -1906 573 1717 -1048 -1319 1442 810 -1706 -203 1849 -357
2041 -357 -1775 894 1517 -1276 -1018 1614 443 -1760 218 1811 -746 -1624 1203 1252 -1501 -714 1677
2058 1677 50 -1730 587 1643 -1125 -1391 1471 929 -1674 -348 1708 -338 -1642 920 1419 -1388
2074 -1388 -1120 1621 610 -1701 -32 1598 -613 -1430 1177 1187 -1528 -815 1695 345 -1659 243
2090 243 1498 -830 -1209 1379 927 -1639 -508 1741 56 -1563 518 1316 -1069 -953 1521 565
2106 565 -1765 -175 1739 -296 -1497 781 1067 -1308 -646 1653 193 -1804 196 1646 -639 -1298
2122 -1298 1063 782 -1483 -294 1726 -159 -1771 530 1522 -894 -1080 1222 517 -1527 25 1696
2138 1696 -465 -1622 823 1353 -1064 -824 1335 257 -1487 319 1601 -714 -1461 1017 1136 -1202
2154 -1202 -580 1368 -15 -1446 587 1436 -995 -1249 1247 850 -1341 -292 1372 -355 -1363 865
2170 865 1220 -1254 -975 1410 521 -1428 23 1324 -668 -1201 1149 979 -1455 -671 1530 205 -1438
2187 -1438 352 1224 -906 -994 1324 725 -1532 -364 1535 -54 -1336 588 1093 -1054 -775 1444
2203 1444 487 -1566 -106 1510 -266 -1226 760 904 -1183 -545 1473 218 -1554 140 1407 -541
2219 -541 -1092 949 687 -1304 -291 1500 -91 -1517 423 1267 -797 -894 1117 386 -1412 10 1487
2236 1487 -435 -1415 744 1093 -1019 -635 1236 115 -1423 324 1423 -688 -1239 952 884 -1139
2252 -1139 -376 1311 -110 -1325 597 1293 -870 -1047 1111 688 -1193 -167 1283 -325 -1254 743
2268 743 1118 -1021 -831 1200 448 -1245 59 1220 -557 -1132 930 916 -1201 -621 1250 149 -1268
2285 -1268 292 1130 -785 -969 1099 668 -1323 -335 1310 -130 -1229 575 1008 -973 -750 1246
2301 1246 420 -1347 -24 1315 -358 -1086 795 853 -1085 -497 1330 176 -1330 232 1251 -567
2317 -567 -974 926 694 -1152 -304 1296 -67 -1268 409 1104 -750 -832 1028 480 -1231 -127 1241
2334 1241 -294 -1198 606 951 -945 -666 1118 250 -1256 123 1187 -532 -1062 836 740 -1103 -423
2351 -423 1221 25 -1224 383 1108 -737 -853 1034 552 -1183 -146 1269 -202 -1130 622 958
2367 958 -890 -621 1157 323 -1233 66 1225 -387 -1034 736 791 -990 -439 1153 72 -1227 246
2384 246 1115 -589 -930 822 568 -1097 -263 1149 -161 -1215 428 1003 -757 -782 930 361 -1118
2401 -1118 8 1153 -382 -1097 691 880 -888 -521 1070 157 -1095 300 1114 -608 -925 903
2417 903 714 -973 -279 1103 -98 -1035 535 975 -812 -774 1017 499 -1079 -105 1043 -321 -967
2434 -967 667 807 -964 -619 1031 277 -1081 58 945 -499 -858 798 622 -1072 -452 1091 111
2451 111 -1040 246 868 -637 -683 935 452 -1098 -187 1129 -89 -967 468 769 -755 -466 1096
2468 1096 250 -1141 56 1117 -287 -857 645 596 -887 -251 1105 -5 -1160 242 1029 -494
2484 -494 -753 728 410 -966 -110 1074 -206 -1116 398 889 -624 -637 767 245 -972 90 1046
2501 1046 -363 -1022 530 799 -705 -490 832 103 -921 265 985 -519 -875 702 666 -767 -271
2518 -271 879 -92 -870 478 884 -688 -713 848 475 -858 -95 866 -286 -787 656 741 -841 -543
2536 -543 926 250 -904 95 804 -477 -714 757 558 -943 -383 935 89 -883 220 707 -590
2553 -590 -593 833 412 -971 -220 947 -46 -826 360 637 -651 -436 911 281 -966 -42 920 -194
2571 -194 -737 491 534 -730 -285 931 90 -964 156 879 -385 -640 616 371 -841 -110 939
2588 939 -126 -920 343 762 -554 -524 713 195 -872 76 922 -305 -860 470 635 -647 -372 753
2606 753 59 -856 219 848 -422 -724 591 521 -692 -233 768 -83 -811 339 772 -516 -612 677
2624 677 404 -728 -95 760 -205 -746 474 663 -633 -462 732 233 -765 73 740 -356 -655 598
2642 598 513 -734 -307 795 53 -755 258 667 -531 -544 725 366 -797 -119 813 -122 -718 397
2660 397 569 -615 -400 755 214 -806 13 763 -252 -648 488 490 -664 -306 771 94 -785 146
2678 146 732 -346 -560 554 394 -690 -179 763 -40 -729 274 659 -455 -481 637 272 -730 -29
2696 -29 750 -195 -677 417 533 -584 -332 698 122 -726 123 687 -364 -580 543 422 -664 -214
2714 -214 727 -31 -722 231 601 -465 -480 616 279 -716 -85 718 -142 -656 343 538 -524 -364 651
2733 651 183 -727 37 719 -209 -601 413 446 -569 -248 685 49 -720 157 684 -311 -535 477 332
2752 332 -599 -114 703 -99 -690 274 619 -428 -429 548 192 -651 42 674 -253 -649 414 514 -521 -324
2772 -324 595 51 -651 168 626 -384 -570 488 415 -575 -211 617 -45 -612 283 599 -458 -484 568
2791 568 353 -584 -114 597 -130 -564 356 505 -528 -401 613 249 -608 0 574 -238 -495 458 411 -606
2811 -606 -280 644 103 -605 117 520 -366 -413 549 267 -683 -163 669 -31 -579 247 441 -457 -301 625
2831 625 139 -696 -11 661 -142 -523 349 351 -517 -164 663 21 -697 111 630 -245 -470 391 278 -530 -85
2852 -85 654 -77 -671 197 578 -321 -396 447 175 -564 24 634 -176 -635 304 519 -385 -319 475 71 -556
2873 -556 151 592 -317 -562 411 422 -462 -199 511 -51 -538 277 542 -419 -461 487 307 -507 -77 506 -151
2894 -151 -496 362 452 -505 -370 529 193 -533 8 473 -243 -446 425 359 -543 -288 537 102 -526 91 450
2915 450 -304 -368 484 291 -565 -179 562 26 -486 194 401 -369 -283 524 189 -566 -46 551 -98 -450 287
2936 287 326 -439 -181 567 71 -573 63 511 -206 -394 362 231 -495 -85 548 -68 -570 170 447 -318
2956 -318 -327 405 135 -516 -11 546 -142 -520 247 408 -344 -257 446 71 -491 90 528 -204 -464 324 346
2977 346 -381 -159 473 15 -488 174 491 -273 -396 376 268 -419 -84 468 -97 -463 253 405 -375 -318
2997 -318 421 149 -482 6 436 -208 -425 329 322 -437 -222 440 39 -472 111 421 -296 -359 394 249 -464
3018 -464 -127 467 -30 -423 204 386 -309 -269 437 184 -455 -12 480 -97 -401 272 343 -360 -213 446 105
3039 105 -461 53 447 -196 -373 313 266 -425 -143 449 -33 -463 146 388 -301 -315 370 173 -461 -58 429
3060 429 -130 -415 245 328 -361 -221 423 76 -446 59 432 -190 -344 344 279 -383 -130 453 34 -403 138
3081 138 394 -242 -281 376 204 -431 -80 462 -39 -404 182 336 -295 -236 397 107 -461 -14 427 -122 -390
3102 -390 229 257 -351 -159 408 12 -459 73 410 -216 -333 291 167 -395 -41 431 -88 -424 194 370
3122 370 -273 -234 348 102 -384 66 433 -170 -382 270 328 -310 -174 368 21 -371 134 401 -240 -357 316
3143 316 266 -348 -112 369 -46 -378 181 341 -309 -311 349 193 -373 -70 351 -117 -346 248 285 -360 -227
3164 -227 396 117 -381 27 338 -173 -272 340 225 -405 -127 423 37 -365 132 295 -259 -214 393 147 -429
3185 -429 -44 442 -43 -338 187 245 -300 -143 404 53 -450 10 394 -117 -315 216 184 -334 -73 410 -15
3206 -15 -434 83 374 -178 -277 263 130 -346 -9 409 -84 -414 178 344 -231 -218 296 76 -363 71 396
3227 396 -165 -370 244 295 -285 -139 336 -12 -346 162 398 -259 -311 310 221 -325 -60 322 -97 -323 241
3248 241 314 -317 -250 349 154 -331 10 323 -161 -296 281 257 -353 -186 363 98 -336 60 299 -198 -255
3269 -255 305 189 -371 -124 378 16 -330 118 260 -259 -204 356 123 -389 -27 379 -56 -298 197 217 -306
3290 -306 -116 375 23 -392 72 354 -146 -253 250 159 -334 -39 391 -55 -369 147 300 -221 -190 297 78
3311 78 -346 36 367 -120 -340 190 263 -260 -158 305 23 -349 82 341 -180 -287 227 203 -297 -90 320
3332 320 -48 -329 147 297 -226 -248 275 140 -309 -10 325 -115 -290 216 242 -272 -160 326 63 -317 80
3353 80 302 -167 -243 275 170 -308 -77 332 -30 -284 117 229 -226 -191 304 99 -338 -17 320 -95 -290
3374 -290 181 213 -268 -144 309 54 -333 42 301 -144 -266 213 169 -295 -90 317 -6 -314 96 276 -181
3395 -181 -191 267 133 -289 -15 314 -66 -274 181 235 -231 -139 300 60 -297 55 295 -152 -235 229 168 -287
3417 -287 -80 306 -13 -300 105 241 -210 -185 267 105 -308 -9 297 -80 -284 157 207 -241 -137 278 35
3438 35 -304 26 292 -108 -232 198 161 -244 -71 305 14 -281 83 282 -143 -193 225 127 -253 0 303
3459 303 -57 -279 154 254 -204 -138 243 49 -275 42 269 -149 -259 187 187 -242 -102 242 -23 -267 111
3480 111 254 -189 -211 231 138 -266 -45 253 -68 -238 158 214 -214 -169 264 101 -245 5 235 -88 -211
3501 -211 190 190 -240 -123 275 72 -232 41 219 -119 -181 229 135 -273 -84 270 3 -244 82 184 -189
3522 -189 -141 243 85 -290 -16 263 -53 -219 124 148 -223 -69 272 13 -283 53 259 -90 -183 173 98
3543 98 -223 -16 270 -40 -277 94 233 -123 -136 187 60 -226 26 261 -81 -251 120 197 -154 -125 177
3564 177 14 -230 49 238 -122 -233 148 168 -177 -85 206 -20 -211 109 223 -171 -201 198 135 -195 -16
3585 -16 197 -76 -181 165 179 -201 -131 225 67 -201 29 193 -114 -151 197 148 -230 -96 224 14 -185 62
3607 62 161 -160 -130 188 75 -240 -63 217 -20 -190 88 145 -184 -107 214 55 -254 -30 205 -62 -165 125
3629 125 106 -192 -58 235 15 -243 38 212 -63 -139 171 89 -194 -8 238 -36 -215 87 171 -132 -114 186
3651 186 27 -202 32 223 -79 -207 122 130 -188 -93 175 -28 -193 92 182 -108 -198 121 107 -168 -75 171
3673 171 -73 -197 78 167 -152 -133 211 75 -187 -61 160 -44 -185 129 143 -154 -151 176 11 -219 -33 118
3695 118 -125 -122 157 78 -257 -11 171 -54 -203 75 135 -160 -133 164 62 -199 -20 188 -64 -178 104 106
3717 106 -189 -82 189 17 -192 21 174 -94 -144 139 97 -184 -49 199 -4 -184 55 170 -108 -112 167
3738 167 79 -184 -18 199 -33 -181 96 133 -148 -97 168 26 -189 15 177 -90 -158 117 98 -177 -65 169
3760 169 -21 -192 56 152 -128 -121 165 66 -192 -21 196 -41 -175 100 142 -147 -76 186 36 -176 46 182
3782 182 -67 -137 138 112 -160 -54 183 6 -176 58 165 -106 -121 139 65 -161 -21 173 -38 -179 88
3803 88 143 -127 -108 151 33 -181 16 170 -90 -175 104 115 -147 -65 156 -12 -170 70 164 -130 -139 135 87
3826 87 -150 -28 163 -41 -152 105 141 -143 -104 172 56 -164 13 151 -73 -136 135 115 -159 -74 166 27
3848 27 -167 30 129 -100 -119 148 60 -178 -44 174 12 -157 56 122 -104 -82 160 49 -189 -10 175 -29
3870 -29 -127 83 100 -142 -40 166 18 -182 28 179 -70 -119 102 66 -147 -14 182 -29 -177 70 147 -98
3892 -98 -96 128 28 -155 19 165 -68 -161 103 131 -122 -78 134 15 -148 48 175 -68 -144 108 120 -118 -38
3915 -38 135 -23 -141 73 152 -107 -127 137 99 -124 -7 126 -48 -128 108 112 -141 -100 142 42 -147 17 123
3938 123 -85 -110 128 87 -162 -64 154 9 -136 35 107 -114 -96 153 57 -168 -36 169 -13 -129 86 107
3960 107 -122 -55 164 32 -167 5 160 -30 -107 97 81 -114 -28 171 16 -163 20 147 -59 -105 112 65
3982 65 -136 -17 156 -31 -154 56 140 -106 -79 114 19 -148 32 149 -83 -148 80 91 -120 -23 108 22 -106
4005 -106 45 103 -81 -75 144 88 -127 -1 146 -29 -104 72 122 -126 -92 133 44 -116 29 125 -87 -71 73
4028 73 119 -207 10 188 -30 -141 -40 104 -90 -138 120 56 -120 -54 124 -11 -139 51 105 -98 -82 126
4050 126 60 -127 -9 138 -21 -108 93 101 -108 -42 142 30 -138 26 145 -49 -87 109 80 -126 -22 148
4072 148 -10 -137 44 112 -98 -89 116 37 -135 -18 118 -39 -133 61 93 -108 -67 116 26 -133 13 117 -50
4095 -50 -108 86 83 -106 -35 135 7 -126 53 128 -58 -93 106 59 -131 -5 129 -14 -113 72 105 -94 -57 126
4119 126 44 -136 19 132 -50 -110 88 75 -120 -53 129 -13 -151 31 114 -70 -106 81 44 -138 -25 126
4141 126 -34 -135 55 118 -90 -87 115 35 -121 9 135 -42 -117 70 104 -89 -50 120 20 -115 39 130 -65
4164 -65 -103 104 79 -105 -32 126 -15 -116 54 104 -106 -92 120 45 -133 6 122 -63 -121 86 88 -128 -75 119
4188 119 8 -137 19 107 -72 -92 107 72 -126 -29 133 8 -117 53 101 -68 -66 116 52 -136 -12 146 -16
4211 -16 -103 63 78 -87 -38 134 16 -140 19 117 -47 -104 82 55 -126 -18 133 -16 -138 40 102 -84 -75
4234 -75 92 23 -128 6 133 -42 -135 77 103 -79 -46 114 1 -114 33 137 -74 -112 88 86 -109 -32 121
4257 121 -16 -105 74 117 -87 -82 111 59 -106 -15 113 -40 -114 71 94 -102 -81 119 34 -108 16 101 -65 -101
4281 -101 93 77 -119 -50 121 9 -114 50 99 -85 -76 121 51 -125 -9 138 -6 -90 65 79 -95 -48 139
4304 139 21 -134 18 127 -47 -88 86 62 -118 -26 131 -18 -142 31 103 -65 -83 89 34 -136 -14 135
4326 135 -36 -126 52 100 -85 -64 101 28 -116 19 136 -43 -110 85 89 -93 -37 112 2 -118 45 129 -79
4349 -79 -96 92 55 -104 -13 123 -35 -113 77 103 -104 -81 105 34 -123 14 111 -67 -111 81 79 -129 -61 106
4373 106 8 -121 29 102 -78 -93 91 59 -114 -43 118 1 -107 53 105 -85 -69 130 51 -110 -10 133 -18
4396 -18 -114 71 91 -100 -51 126 19 -129 19 117 -70 -97 90 59 -123 -34 118 -27 -130 43 95 -79 -77 106
4420 106 40 -131 5 128 -49 -119 72 89 -97 -61 114 24 -123 26 123 -55 -94 94 72 -107 -23 124 0
4443 0 -118 52 111 -80 -80 106 44 -117 -7 126 -41 -115 59 86 -97 -67 101 13 -132 10 119 -61 -112 84
4467 84 69 -119 -37 118 -2 -129 41 108 -70 -78 98 54 -118 -8 132 -26 -109 74 94 -83 -59 121 36 -112
4491 -112 18 121 -51 -105 82 79 -97 -48 119 2 -124 26 103 -72 -105 94 50 -119 -36 97 -20 -120 54
4514 54 103 -96 -74 99 34 -110 2 117 -36 -94 80 83 -113 -45 117 26 -112 27 116 -60 -72 115 73 -121
4538 -121 -22 126 -7 -116 56 113 -77 -64 117 44 -129 10 121 -38 -109 69 87 -105 -53 120 22 -134 13
4561 13 124 -53 -104 87 68 -103 -27 132 -1 -144 43 120 -62 -79 103 46 -118 0 134 -24 -114 80 96
4584 96 -92 -52 116 7 -133 28 126 -66 -127 82 80 -109 -41 117 -9 -127 43 107 -97 -104 101 55 -129 -26
4608 -26 119 -42 -115 69 95 -105 -81 121 46 -131 5 123 -56 -94 97 98 -114 -50 137 23 -117 46 118
4631 118 -70 -83 110 82 -132 -23 131 -8 -130 51 94 -96 -70 120 31 -143 -7 122 -57 -125 81 75 -126
4654 -126 -57 133 7 -142 26 136 -53 -104 102 66 -132 -21 150 -19 -145 62 122 -84 -79 116 50 -125
4676 -125 -2 139 -24 -121 80 105 -103 -63 126 26 -137 37 132 -81 -118 92 78 -126 -44 126 -19 -137
4698 -137 46 114 -95 -99 112 54 -137 -19 136 -38 -135 77 100 -99 -64 139 41 -131 19 139 -58 -120 102
4721 102 84 -123 -37 147 23 -134 41 132 -85 -91 117 61 -141 -32 142 -24 -136 54 109 -107 -79 130 30
4744 30 -146 -1 137 -54 -131 69 84 -127 -54 143 13 -151 29 138 -72 -101 107 69 -129 -27 157 -1
4766 -1 -137 53 107 -95 -84 125 40 -140 8 152 -48 -131 84 106 -130 -64 127 13 -149 10 131 -84 -124
4789 -124 106 74 -134 -51 137 -15 -148 43 130 -102 -111 117 57 -141 -23 147 -36 -129 77 112 -112 -65 137
4812 137 41 -135 15 142 -62 -108 108 87 -112 -45 148 3 -154 52 133 -93 -108 109 57 -137 -26 146
4834 146 -38 -146 68 115 -118 -84 135 27 -148 16 146 -72 -126 101 93 -122 -58 149 7 -144 55 150
4856 150 -72 -99 130 72 -131 -23 156 -6 -141 76 122 -95 -89 144 47 -154 -5 158 -53 -142 91 92 -137
4879 -137 -71 143 10 -170 26 131 -88 -111 112 69 -150 -43 147 -21 -143 57 125 -106 -93 137 39 -141
4901 -141 -7 162 -42 -137 92 112 -106 -69 153 17 -156 18 158 -66 -128 111 85 -127 -33 145 -16 -152
4923 -152 46 137 -94 -111 114 46 -157 -18 150 -35 -160 68 115 -113 -94 130 29 -147 15 144 -52 -134
4945 -134 113 104 -136 -64 155 2 -142 44 141 -90 -112 120 82 -135 -35 151 -13 -136 74 124 -115 -91 141
4968 141 53 -147 -18 155 -58 -138 91 104 -144 -91 149 15 -160 23 142 -72 -121 108 81 -154 -50 153
4990 153 -10 -162 48 134 -96 -100 144 62 -141 -11 168 -23 -129 87 124 -110 -68 152 34 -155 18 152
5012 152 -64 -123 99 94 -137 -48 158 -13 -166 35 125 -96 -126 114 67 -148 -33 152 -34 -155 57 137 -103
5035 -103 -103 136 52 -155 2 156 -51 -147 96 116 -123 -69 157 27 -142 35 157 -79 -124 132 94 -147 -43
5058 -43 159 5 -146 64 135 -112 -110 136 52 -158 -19 144 -53 -151 80 110 -129 -83 155 26 -161 10 152
5081 152 -73 -122 104 94 -147 -57 162 8 -154 61 144 -90 -110 138 78 -145 -13 160 -19 -147 74 122
5103 122 -111 -78 145 39 -162 8 155 -57 -140 99 94 -137 -62 153 4 -158 31 145 -88 -124 124 73
5125 73 -156 -38 151 -24 -153 68 132 -112 -98 140 53 -153 -9 160 -41 -131 92 124 -130 -61 147 29
5147 29 -161 37 146 -75 -127 114 95 -147 -39 164 -6 -161 64 132 -113 -104 141 53 -155 -23 156 -39
5169 -39 -145 70 125 -124 -77 143 39 -161 7 152 -66 -130 102 98 -130 -48 160 -1 -152 56 146 -82 -98
5192 -98 138 81 -138 -22 159 -29 -153 80 126 -118 -97 148 43 -152 1 153 -65 -142 99 99 -144 -66 145
5215 145 1 -167 40 148 -83 -122 127 95 -159 -36 158 -10 -154 69 125 -109 -103 141 64 -155 6 173
5237 173 -43 -128 105 124 -126 -66 157 43 -157 22 147 -68 -120 116 73 -153 -43 163 -9 -173 58 129
5259 129 -99 -104 132 55 -163 -18 162 -38 -161 91 127 -118 -77 151 31 -159 19 169 -64 -132 115 101
5281 101 -136 -42 164 15 -152 59 149 -81 -117 144 75 -134 -15 166 -44 -158 81 132 -124 -102 151 36
5303 36 -157 12 154 -75 -128 108 102 -151 -64 154 11 -157 46 144 -93 -118 132 88 -148 -28 176 -14 -147
5326 -147 75 136 -114 -73 154 64 -150 6 172 -46 -128 108 116 -130 -71 160 20 -159 40 144 -75 -118 131
5349 131 80 -145 -41 160 -18 -173 42 138 -99 -93 135 52 -156 3 159 -33 -149 94 112 -112 -65 156
5371 156 13 -146 24 176 -67 -96 149 89 -112 -62 148 -15 -152 57 164 -94 -89 134 51 -146 -11 145
5393 145 -78 -151 48 118 -143 -115 147 42 -175 -1 151 -64 -146 115 112 -136 -107 140 -1 -138 60 135 -53
5416 -53 -94 142 75 -128 -8 178 -13 -175 68 121 -153 -71 145 69 -160 20 207 -49 -107 51 47 -159 -101
5439 -101 132 7 -158 -18 174 -121 -115 172 105 -231 -37 101 -88 -183 85 122 -105 -188 110 51 -207 -1
5461 -1 160 -84 -124 105 93 -154 -112 102 -12 -94 13 162 -75 -97 133 68 -117 -82 156 -3 -189 61 130
5484 130 -100 -117 132 75 -125 2 134 -38 -152 83 119 -136 -84 146 22 -173 9 138 -74 -126 106 95
5506 95 -136 -48 150 8 -156 57 155 -85 -107 138 73 -143 -9 167 -34 -140 87 140 -110 -78 152 41
5528 41 -158 9 153 -62 -138 105 98 -135 -61 150 1 -172 44 153 -91 -130 121 66 -161 -17 156 -20
5550 -20 -154 63 118 -109 -101 141 64 -161 14 165 -47 -134 98 114 -134 -69 161 29 -154 31 147 -77 -120
5573 -120 125 94 -144 -43 153 -10 -161 50 124 -119 -106 133 59 -164 -24 145 -41 -136 86 110 -69 -55
5595 -55 164 25 -154 8 140 -60 -129 112 92 -129 -30 178 14 -150 65 155 -84 -106 111 42 -178 -24
5617 -24 162 -43 -115 70 119 -94 -71 138 45 -169 -22 179 -70 -143 88 75 -165 -80 128 82 -161 58 136
5640 136 -98 -98 81 8 -133 -11 115 -10 -130 68 141 -109 -64 112 68 -140 11 152 -39 -129 95 120 -127
5663 -127 -75 150 23 -144 25 135 -82 -113 112 104 -155 -54 165 -6 -145 53 131 -115 -108 140 72 -163 -28
5686 -28 154 -21 -147 81 111 -124 -74 164 24 -167 16 161 -49 -115 120 97 -136 -42 166 19 -144 43
5708 43 142 -70 -102 119 70 -143 -18 160 -20 -157 70 122 -101 -89 150 35 -159 14 151 -58 -147 82
5730 82 98 -140 -71 138 1 -158 39 156 -99 -137 100 90 -140 -40 165 -20 -168 63 137 -95 -93 147 71
5753 71 -137 3 159 -41 -130 111 111 -126 -78 148 36 -138 21 146 -76 -121 105 90 -140 -54 139 -9 -151
5776 -151 37 124 -105 -111 121 49 -149 -41 142 -33 -148 73 110 -118 -103 137 33 -164 11 146 -42 -110
5798 -110 92 101 -130 -54 155 9 -147 31 152 -69 -111 114 66 -133 -23 144 -15 -154 64 113 -99 -87
5820 -87 125 36 -161 -12 141 -50 -141 70 106 -119 -63 126 6 -160 5 151 -73 -116 92 88 -162 -55 136
5843 136 3 -136 37 142 -89 -82 155 82 -156 -46 147 -39 -174 119 86 -142 -43 148 -10 -177 22 143
5865 143 -87 -132 75 78 -97 -39 97 -48 -194 28 127 -105 -111 64 104 -93 10 191 -31 -172 84 120 -21
5888 -21 -114 173 120 -178 -30 122 -22 -109 143 95 -158 -23 129 -4 -111 47 193 -60 -120 93 49 -159
5910 -159 1 149 -50 -145 57 96 -93 -110 90 16 -119 -61 121 -84 -169 75 79 -156 -33 149 52 -101 4
5933 4 116 -96 -146 91 68 -112 -60 150 12 -121 54 100 -86 -80 126 67 -141 -21 157 -4 -126 51 95
5956 95 -113 -64 151 24 -149 2 126 -51 -83 91 83 -130 -40 133 -18 -126 34 129 -51 -115 99 58 -133
5979 -133 -29 123 -10 -169 35 102 -99 -98 116 64 -106 -29 169 -53 -92 111 106 -105 -47 123 26 -131 24
6002 24 122 -62 -101 68 82 -139 -87 132 -53 -121 28 121 -113 -125 107 43 -115 5 123 -44 -119 72 100 -101
6026 -101 -77 122 36 -134 12 132 -53 -110 98 96 -114 -51 135 14 -122 32 108 -70 -88 113 68 -138 -38
6049 -38 129 -13 -142 55 96 -107 -81 112 52 -142 -22 116 -54 -127 65 81 -114 -56 132 13 -145 18
6071 18 122 -54 -99 90 67 -122 -28 145 -2 -120 46 118 -75 -83 121 47 -130 -5 153 -20 -127 72 96
6094 96 -103 -69 114 11 -146 14 127 -53 -135 74 76 -127 -52 109 -5 -141 23 108 -92 -118 96 62 -122
6117 -122 -34 119 -21 -130 67 114 -92 -91 113 49 -115 -6 135 -51 -114 95 103 -116 -57 135 28 -138 30
6140 30 127 -72 -113 90 74 -135 -48 128 -11 -129 51 116 -111 -92 119 39 -143 -21 127 -40 -124 62 93
6163 93 -120 -68 128 31 -141 12 136 -59 -99 90 81 -112 -41 133 3 -134 42 114 -73 -85 107 59 -129
6186 -129 -18 137 -28 -138 63 95 -97 -75 112 10 -134 2 132 -55 -110 80 88 -117 -51 127 8 -137
6208 -137 37 121 -84 -102 109 53 -125 -16 131 -15 -120 58 111 -99 -79 125 44 -127 0 141 -32 -117
6230 -117 79 96 -107 -67 131 17 -135 20 118 -56 -108 90 68 -132 -46 119 -6 -138 34 97 -86 -89 101
6253 101 47 -125 -7 121 -37 -126 57 90 -94 -72 112 33 -125 12 138 -57 -110 104 82 -113 -39 125 3
6276 3 -122 43 121 -75 -104 89 66 -125 -30 133 -23 -120 57 97 -105 -86 105 24 -125 -7 111 -60 -115 76
6300 76 85 -125 -66 118 23 -118 22 105 -56 -91 106 68 -118 -34 129 -7 -120 54 90 -81 -82 108 36 -133
6324 -133 -10 130 -28 -118 67 91 -104 -64 106 9 -133 9 117 -63 -101 76 66 -117 -41 121 -12 -135
6346 -135 34 110 -72 -96 101 39 -136 -21 129 -23 -141 48 105 -76 -68 106 32 -117 7 122 -48 -125 76
6369 76 82 -101 -47 118 1 -124 38 120 -84 -113 90 59 -109 -39 107 -27 -134 57 95 -105 -98 96 36 -123
6393 -123 -6 113 -49 -114 75 91 -108 -65 110 22 -135 30 110 -57 -102 108 73 -118 -47 120 12 -111 39
6416 39 102 -74 -86 113 60 -114 -25 130 -21 -101 65 89 -99 -59 112 19 -142 -6 104 -46 -100 82 65 -119
6440 -119 -49 122 -10 -142 25 103 -77 -85 97 35 -120 -10 133 -15 -121 58 102 -73 -60 118 33 -119 2
6463 2 126 -44 -115 78 75 -91 -44 120 1 -129 25 115 -65 -109 73 65 -126 -37 111 -14 -132 51 98 -85
6487 -85 -100 99 36 -134 -6 122 -48 -107 77 96 -91 -54 124 16 -108 36 122 -52 -89 97 84 -111 -32
6510 -32 122 8 -114 43 96 -77 -81 112 61 -122 -15 118 -40 -109 48 87 -99 -69 112 16 -135 4 101
6533 101 -51 -105 73 76 -120 -43 120 16 -122 32 105 -57 -96 83 66 -104 -19 121 -7 -117 63 105 -90
6556 -90 -67 114 40 -130 -2 110 -46 -105 61 73 -105 -53 110 14 -128 27 106 -64 -96 94 65 -120 -41 118
6580 118 -6 -125 52 101 -74 -77 114 47 -125 -14 128 -28 -107 64 85 -91 -56 113 28 -111 28 128 -39
6603 -39 -84 89 74 -104 -29 123 -3 -121 32 91 -70 -95 89 41 -120 -25 114 -38 -124 47 80 -90 -71 105
6627 105 21 -121 16 114 -44 -104 67 77 -105 -47 118 2 -116 39 112 -59 -104 96 68 -95 -33 115 -16
6650 -16 -109 75 63 -82 -80 106 40 -110 1 111 -42 -99 77 80 -92 -70 102 32 -121 10 105 -108 -91 75
6674 75 67 -113 -29 78 -4 -113 63 114 -64 -59 118 28 -120 24 110 -31 -74 58 67 -80 -62 115 41 -143 45
6699 45 117 -66 -91 39 70 -96 -28 98 -32 -138 -10 76 -42 -65 72 42 -108 -38 90 -37 -109 33 80 -97
6723 -97 -64 81 5 -108 -13 119 -60 -102 66 73 -89 -45 113 8 -103 52 116 -51 -82 84 52 -79 -25 100
6747 100 -15 -103 54 90 -87 -79 84 46 -110 -6 92 -40 -93 61 77 -90 -71 94 12 -105 8 81 -62 -89
6771 -89 81 64 -102 -46 94 0 -87 32 89 -67 -71 96 36 -103 -23 104 -23 -87 54 85 -81 -47 113 39 -104
6796 -104 -1 101 -36 -78 71 49 -108 -41 107 -4 -122 14 91 -63 -83 71 39 -116 -14 102 -26 -108
6818 -108 32 89 -75 -64 86 22 -108 15 101 -36 -92 60 80 -77 -34 100 16 -96 35 99 -48 -76 81
6841 81 56 -84 -15 95 -15 -100 49 76 -62 -74 84 20 -107 -9 91 -41 -94 61 71 -77 -53 88 7 -103
6865 -103 9 89 -45 -81 73 57 -98 -25 94 2 -79 31 87 -50 -56 87 48 -95 -21 101 -19 -87 39 65
6889 65 -72 -55 83 25 -91 -5 81 -43 -72 52 57 -78 -34 84 -5 -104 17 73 -60 -74 74 38 -103 -17 82
6914 82 -20 -89 44 79 -73 -53 99 39 -84 2 107 -27 -76 53 63 -69 -30 93 12 -90 13 97 -44 -68
6938 -68 71 53 -86 -31 89 -5 -91 25 73 -67 -76 61 31 -100 -3 104 -29 -93 50 61 -72 -42 81 15 -92
6963 -92 7 91 -40 -74 64 58 -73 -30 92 4 -88 25 82 -48 -49 72 41 -90 18 108 -27 -84 46 69 -65
6988 -65 -55 73 17 -91 8 77 -54 -99 47 48 -82 -47 75 -2 -91 27 72 -63 -81 63 48 -83 -31 71 -22
7013 -22 -92 43 86 -56 -47 95 35 -79 2 79 -30 -81 56 63 -82 -41 83 17 -88 19 78 -43 -66 64 42
7038 42 -86 -43 77 -13 -96 18 66 -75 -55 73 20 -99 -10 81 -31 -80 43 48 -66 -35 87 11 -89 20 87
7063 87 -20 -62 76 56 -65 0 90 -2 -82 23 87 -48 -46 63 26 -78 3 86 -12 -76 43 59 -60 -44 65 9
7089 9 -87 0 82 -46 -89 58 41 -67 -32 72 -4 -86 23 59 -65 -66 68 33 -74 -5 87 -18 -77 64 85 -54
7115 -54 -46 78 36 -70 3 78 -28 -72 61 59 -72 -36 76 4 -72 13 63 -49 -68 56 40 -85 -38 78 -23 -88
7141 -88 26 55 -66 -48 71 21 -91 -16 71 -13 -64 51 50 -77 -35 77 6 -87 16 78 -36 -59 58 45 -68
7166 -68 -18 92 -4 -81 15 63 -40 -50 61 27 -79 -3 86 -28 -77 39 55 -64 -44 69 4 -72 7 78 -31 -71
7192 -71 49 46 -68 -32 76 -12 -84 31 66 -55 -69 61 36 -67 -13 73 -16 -72 37 77 -60 -38 70 28 -70 6
7218 6 72 -36 -59 50 57 -71 -24 81 2 -86 17 59 -57 -65 54 32 -80 -22 63 -21 -83 25 48 -57 -42 65
7244 65 17 -85 -1 75 -29 -68 43 46 -64 -31 74 17 -71 23 63 -34 -46 66 27 -54 -15 75 -8 -75 37 52 -46
7271 -46 -48 67 30 -72 -10 76 -31 -78 38 42 -63 -31 81 -7 -78 6 68 -48 -69 48 38 -67 -17 85 7 -67
7297 -67 25 77 -32 -34 65 33 -66 13 76 -1 -55 33 49 -29 -42 59 29 -79 6 63 -44 -3 26 69 -73 -65 57 7
7325 7 -60 26 51 -35 -54 57 23 -75 -4 76 -12 -61 40 62 -43 -28 68 13 -66 5 72 -21 -53 33 25 -83 -14 85 -10
7354 -10 -45 16 89 -11 -71 58 33 -63 -53 67 -31 -65 49 80 -69 -30 40 20 -85 -15 61 -36 -62 48 30 -90
7380 -90 -31 22 -21 -75 -7 72 -30 -65 63 32 -63 -46 65 -41 -63 14 30 -53 -21 103 40 -76 -11 103 -22 -52
7406 -52 29 36 -43 -52 62 -12 -101 45 78 -105 -49 87 5 -2 10 89 -38 -102 8 55 -23 -6 0 31 -28 -58 81 -25
7434 -25 -50 22 41 15 -11 45 48 -44 -12 108 -5 -8 67 77 -28 -65 43 -1 -56 34 76 -63 -40 48 42 -61 -16 59 -20
7463 -20 -63 34 64 -59 -40 56 16 -55 -3 56 -32 -60 43 43 -71 -38 58 17 -62 22 66 -31 -44 63 36 -66 -14 73
7491 73 9 -58 32 58 -31 -28 66 28 -58 -2 60 -17 -55 34 40 -56 -29 69 10 -67 3 67 -24 -38 35 27 -62 -27 68 -3 -62 22
7523 22 67 -48 -55 46 22 -66 -7 61 -3 -53 35 61 -37 -15 59 15 -53 14 77 -14 -42 40 44 -41 -18 56 2 -54 23 47
7553 47 -43 -57 47 29 -63 -17 55 -21 -71 19 47 -48 -40 54 19 -60 2 46 -30 -56 35 42 -51 -14 54 17 -54 15 63 -24 -37
7584 -37 57 25 -45 -11 63 -5 -59 32 60 -38 -45 56 21 -78 0 57 -19 -62 19 32 -54 -37 47 0 -61 4 47 -40 -59 34
7614 34 25 -60 -10 57 -22 -65 15 43 -38 -35 44 20 -45 13 66 -3 -51 42 54 -37 -26 66 17 -45 7 52 -21 -42 41 37 -48 -29
7646 -29 55 -1 -68 8 43 -41 -48 32 26 -68 -17 55 3 -50 22 46 -34 -29 49 12 -65 2 52 -7 -43 38 44 -36 -7 76 23 -56
7678 -56 32 61 -13 -34 37 29 -39 3 58 -3 -47 26 50 -25 -26 51 17 -50 4 43 -28 -41 19 44 -42 -32 48 8 -51 11 57
7709 57 -26 -49 33 29 -49 -13 48 3 -51 26 59 -28 -31 58 29 -29 -3 50 -11 -49 52 42 -38 -18 55 20 -40 12 50 -6 -31
7740 -31 49 32 -45 -25 46 -6 -49 1 35 -37 -26 49 19 -57 -12 51 -1 -49 25 36 -41 -30 39 15 -59 9 56 -19 -33 34
7770 34 36 -30 -20 52 9 -47 10 55 -9 -30 35 27 -36 0 65 -3 -51 25 53 -26 -30 40 5 -47 4 54 -22 -46 21 26 -45 -7
7802 -7 48 -4 -54 13 46 -35 -45 41 32 -39 -2 48 -8 -36 25 52 -30 -27 52 29 -37 -7 50 -14 -42 33 41 -41 -16 43 8 -45
7834 -45 3 45 -24 -40 43 24 -54 -25 39 -10 -53 8 33 -45 -26 40 18 -45 -2 54 -13 -37 22 24 -38 -11 58 6 -37 53 45
7865 45 -4 -32 44 31 -39 -9 58 3 -46 9 35 -21 -34 38 3 -58 0 54 -14 -30 31 28 -52 -31 34 0 -55 7 37 -31 -43
7896 -43 34 22 -40 -15 33 1 -46 12 36 -31 -38 44 26 -39 2 47 -8 -36 40 44 -33 -21 46 19 -44 7 50 -28 -31 38 32 -42
7928 -42 -27 41 3 -52 8 28 -33 -30 36 20 -50 -18 35 -20 -40 19 44 -27 -19 44 2 -36 -2 28 -12 -41 23 36 -30 -10 44
7959 44 0 -36 21 45 -18 -23 29 29 -45 -8 47 -1 -47 15 33 -39 -26 34 4 -35 -1 33 -15 -50 26 16 -42 -27 29 -7 -48
7990 -48 8 37 -25 -37 29 19 -40 -15 27 -19 -39 8 39 -23 -25 39 26 -45 4 49 -5 -45 34 41 -37 -10 38 16 -45 -2 29
8021 29 -17 -48 22 13 -43 -14 43 -10 -43 12 24 -31 -36 14 5 -55 3 32 -12 -52 20 30 -30 -13 37 -2 -35 10 52 -15 -27 32
8053 32 30 -29 -6 47 25 -35 26 60 -12 -17 35 22 -24 -6 38 -11 -47 19 24 -27 -26 39 16 -47 -5 45 -15 -44 30 28 -51 -32 43
8086 43 -7 -35 17 34 -22 -28 42 25 -31 3 42 4 -30 24 34 -22 -17 41 20 -37 7 45 -7 -34 22 26 -20 -22 37 6 -42 3
8118 3 36 -18 -28 27 10 -39 -8 42 -9 -41 -1 22 -24 -28 28 2 -50 -2 49 -10 -38 29 35 -21 -7 43 1 -42 15 42 -15 -22
8150 -22 32 23 -29 -3 36 6 -34 26 38 -17 -38 32 18 -32 -14 23 -17 -38 26 23 -25 -22 29 7 -33 6 28 -34 -25 22 24 -35 -19
8183 -19 39 9 -28 17 36 -19 -20 35
8191C5
##END NTUPLES=NMR FID
##END=
