##TITLE=1H_LY-17Dix.3.B
 CD3CN, 8 sc, 
 2.06.2021
##JCAMPDX= 6.0         $$ Bruker NMR JCAMP-DX V2.0
##DATA TYPE= NMR FID
##DATA CLASS= NTUPLES
##ORIGIN= UXNMR, Bruker Analytische Messtechnik GmbH
##OWNER= root
$$ XWIN-NMR		Version 3.5
$$ Wed Jun  2 13:37:11 2021 Russian Standard Time (UT+4h)  she@DPX200
##.OBSERVE FREQUENCY= 200.131506
##.OBSERVE NUCLEUS= ^1H
##.DELAY= (6, 6)
##.ACQUISITION MODE= SIMULTANEOUS
##.ACQUISITION SCHEME= undefined
##.AVERAGES= 8
##.DIGITISER RES= 18
##SPECTROMETER/DATA SYSTEM= spect
##.PULSE SEQUENCE= zg30
##.SOLVENT NAME= CD3CN
##.SHIFT REFERENCE= (INTERNAL, CD3CN, 0, 15.7039)
##AUDIT TRAIL= $$ (NUMBER, WHEN, WHO, WHERE, WHAT)
$$ ##TITLE= Audit trail, XWIN-NMR		Version 3.5
$$ ##JCAMPDX= 5.01
$$ ##ORIGIN= Bruker BioSpin GmbH
$$ ##OWNER= she
$$ F:/spectra/data/she/nmr/H-F/1/audita.txt
$$ ##AUDIT TRAIL=  $$ (NUMBER, WHEN, WHO, WHERE, WHAT)
(   1,<2021-06-02 13:36:14.87 +0400>,<she>,<DPX200>,
      <created by zg, POWCHK disabled, PULCHK disabled
       configuration hash MD5:
       00 E9 B6 7A A2 85 ED C7 34 08 36 98 17 FE 4E 26
       data hash MD5: 16K
       6C CB 14 08 84 44 56 AE 46 56 31 08 56 D4 4B 81>)
$$ ##END=
$$ 
$$ hash MD5
$$ 9C 68 6A 19 78 27 D3 9C AE 17 30 D9 8F 22 DD 15
##$RELAX= 
##$RELAX= 
##$RELAX= 
##$RELAX= 
##$RELAX= 
##$RELAX= 
$$ Bruker specific parameters
$$ --------------------------
##$DU= <F:/spectra>
##$EXPNO= 1
##$NAME= <H-F>
##$PROCNO= 1
##$TYPE= <nmr>
##$USER= <she>
##$AMP= (0..31)
100 100 100 100 100 100 100 100 100 100 100 100 100 100 100 100 100 100 
100 100 100 100 100 100 100 100 100 100 100 100 100 100 
##$AQSEQ= 0
##$AQ_mod= 1
##$AUNM= <au_zg>
##$AUTOPOS= <>
##$BF1= 200.13
##$BF2= 200.13
##$BF3= 200.13
##$BF4= 200.13
##$BF5= 200.13
##$BF6= 200.13
##$BF7= 200.13
##$BF8= 200.13
##$BYTORDA= 1
##$CFDGTYP= 0
##$CFRGTYP= 5
##$CHEMSTR= <none>
##$CNST= (0..31)
1 1 145 1 1 1 1 1 1 1 1 1 1 1 1 1 1 1 1 1 1 1 1 1 1 1 1 1 1 1 1 1 
##$CPDPRG= <>
##$CPDPRG1= <>
##$CPDPRG2= <>
##$CPDPRG3= <>
##$CPDPRG4= <mlev>
##$CPDPRG5= <mlev>
##$CPDPRG6= <mlev>
##$CPDPRG7= <mlev>
##$CPDPRG8= <mlev>
##$CPDPRGB= <>
##$CPDPRGT= <>
##$D= (0..31)
0 1.2 0 0 0 0 0 0 0 0.06 0 0.03 0 0 0 0 0.0002 0 0 0 0 0 0 0 0 0 0 0 0 
0 0 0 
##$DATE= 1622626574
##$DBL= (0..7)
120 120 120 120 120 120 120 120 
##$DBP= (0..7)
150 150 150 150 150 150 150 150 
##$DBP07= 0
##$DBPNAM0= <>
##$DBPNAM1= <>
##$DBPNAM2= <>
##$DBPNAM3= <>
##$DBPNAM4= <>
##$DBPNAM5= <>
##$DBPNAM6= <>
##$DBPNAM7= <>
##$DBPOAL= (0..7)
0.5 0.5 0.5 0.5 0.5 0.5 0.5 0.5 
##$DBPOFFS= (0..7)
0 0 0 0 0 0 0 0 
##$DE= 6
##$DECBNUC= <off>
##$DECIM= 32
##$DECNUC= <off>
##$DECSTAT= 4
##$DIGMOD= 1
##$DIGTYP= 9
##$DL= (0..7)
0 120 120 120 120 120 120 120 
##$DP= (0..7)
150 150 150 150 150 150 150 150 
##$DP07= 0
##$DPNAME0= <>
##$DPNAME1= <>
##$DPNAME2= <>
##$DPNAME3= <>
##$DPNAME4= <>
##$DPNAME5= <>
##$DPNAME6= <>
##$DPNAME7= <>
##$DPOAL= (0..7)
0.5 0.5 0.5 0.5 0.5 0.5 0.5 0.5 
##$DPOFFS= (0..7)
0 0 0 0 0 0 0 0 
##$DQDMODE= 0
##$DR= 18
##$DS= 0
##$DSLIST= <SSSSSSSSSSSSSSS>
$$ [...]
##$SUBNAM2= <"">
##$SUBNAM3= <"">
##$SUBNAM4= <"">
##$SUBNAM5= <"">
##$SUBNAM6= <"">
##$SUBNAM7= <"">
##$SUBNAM8= <"">
##$SUBNAM9= <"">
##$SW= 16.9725357007746
##$SWIBOX= (0..15)
0 0 2 0 0 0 0 0 0 0 0 0 0 0 0 0 
##$SW_h= 3396.73913043478
##$TD= 16384
##$TD0= 1
##$TE= 0
##$TE2= 300
##$TE3= 300
##$TEG= 300
##$TL= (0..7)
0 120 120 120 120 120 120 120 
##$TP= (0..7)
150 150 150 150 150 150 150 150 
##$TP07= 0
##$TPNAME0= <>
##$TPNAME1= <>
##$TPNAME2= <>
##$TPNAME3= <>
##$TPNAME4= <>
##$TPNAME5= <>
##$TPNAME6= <>
##$TPNAME7= <>
##$TPOAL= (0..7)
0.5 0.5 0.5 0.5 0.5 0.5 0.5 0.5 
##$TPOFFS= (0..7)
0 0 0 0 0 0 0 0 
##$TUNHIN= 0
##$TUNHOUT= 0
##$TUNXOUT= 0
##$USERA1= <user>
##$USERA2= <user>
##$USERA3= <user>
##$USERA4= <user>
##$USERA5= <user>
##$V9= 5
##$VALIST= <valist>
##$VCLIST= <CCCCCCCCCCCCCCC>
##$VD= 0
##$VDLIST= <DDDDDDDDDDDDDDD>
##$VPLIST= <PPPPPPPPPPPPPPP>
##$VTLIST= <TTTTTTTTTTTTTTT>
##$WBST= 1024
##$WBSW= 4
##$XGAIN= (0..3)
0 0 0 0 
##$XL= 0
##$YL= 0
##$YMAX_a= 105301
##$YMIN_a= -97392
##$ZGOPTNS= <>
##$ZL1= 120
##$ZL2= 120
##$ZL3= 120
##$ZL4= 120
##$ABSF1= 10
##$ABSF2= 0
##$ABSG= 5
##$ABSL= 3
##$ALPHA= 0
##$AQORDER= 0
##$ASSFAC= 0
##$ASSFACI= 0
##$ASSFACX= 0
##$ASSWID= 0
##$AUNMP= <proc_1d>
##$AZFE= 0.1
##$AZFW= 0.1
##$BCFW= 1
##$BC_mod= 2
##$BYTORDP= 1
##$COROFFS= 0
##$CY= 11.3945322036743
##$DATMOD= 1
##$DC= 2
##$DFILT= <>
##$DTYPP= 0
##$F1P= 15.9154993809931
##$F2P= -4.1035820241983
##$FCOR= 0.5
##$FTSIZE= 0
##$FT_mod= 4
##$GAMMA= 1
##$GB= 0.15
##$INTBC= 1
##$INTSCL= 1
##$ISEN= 128
##$LB= 0.24
##$LEV0= 0
##$LPBIN= 0
##$MAXI= 10000
##$MC2= 0
##$MEAN= 0
##$ME_mod= 0
##$MI= 1.114404
##$NCOEF= 0
##$NC_proc= 0
##$NLEV= 6
##$NOISF1= 3.799351
##$NOISF2= 2.8
##$NSP= 1
##$NTH_PI= 0
##$NZP= 0
##$OFFSET= 15.70392
##$PC= 1
##$PHC0= -11560.53
##$PHC1= 10.60099
##$PH_mod= 1
##$PKNL= yes
##$PPARMOD= 0
##$PSCAL= 0
##$PSIGN= 0
##$REVERSE= no
##$SF= 200.130013532006
##$SI= 16384
##$SIGF1= 3
##$SIGF2= 2
##$SINO= 400
##$SIOLD= 16384
##$SREGLST= <1H.CDCl3>
##$SSB= 0
##$STSI= 0
##$STSR= 0
##$SW_p= 3612.71676300578
##$SYMM= 0
##$S_DEV= 0
##$TDeff= 0
##$TDoff= 0
##$TI= <>
##$TILT= no
##$TM1= 0
##$TM2= 0
##$TOPLEV= 0
##$USERP1= <user>
##$USERP2= <user>
##$USERP3= <user>
##$USERP4= <user>
##$USERP5= <user>
##$WDW= 1
##$XDIM= 8192
##$YMAX_p= 0
##$YMIN_p= 0
$$ End of Bruker specific parameters
$$ ---------------------------------
##NTUPLES= NMR FID
##VAR_NAME=  TIME,          FID/REAL,        FID/IMAG
##SYMBOL=    X,             R,               I
##VAR_TYPE=  INDEPENDENT,   DEPENDENT,       DEPENDENT
##VAR_FORM=  AFFN,          ASDF,            ASDF
##VAR_DIM=   8192,          8192,            8192
##UNITS=     SECONDS,       ARBITRARY UNITS, ARBITRARY UNITS
##FACTOR=    0.0002944,     1,               1
##FIRST=     0,             0,               0
##LAST=      2.4114304,     0,               0
##MIN=       0,             -97392,          0
##MAX=       2.4114304,     105301,          0
$$ Real data points
##PAGE= N=1
##DATA TABLE= (X++(R..R)), XYDATA
$$ [...]
1293d309N148K365o805M140K634p040L893M004p496K317N157o630J304N243o629
1308b704P58O419o328r94O848n027j776O639m728k502P380l804m158P113k189
1323I47m607O512j698n237O663m23o338N716J101o283M821J589o605M466K934
1338C558p040L039M057o443K089M342o435J505N411o319K4O028n330q35O065m999
1354a283j605O687m301k912O723l114l587O468k548m305O635j482n310O093k43
1369A916n633N453N50o042M979J675o463L974K762o292L079L418o312K246M349
1384C659o151J077N051n555Q2N406n091q05N855m493j819O082l711k684O177k945
1400A35l485O136k067m248N930j174m826N627k59n356N143O66n738M594J607o050
$$ y = [-4309, 839, 3204, -3601, 539, 3173, -3867, 26, 4030, -3466, -1149, 4008, -2622, -1318, 3925, -2704, -1946, 4473, -1855, -2849, 3999, -1028, -2804, 3835, -893, -3395, 3985, 181, -3977, 3136, 947, -3660, 2852, 1154, -4083, 2580, 2157, -4181, 1535, 2636, -3647, 1174, 2763, -3842, 624, 3558, -3482, -443, 3614, -2829, -740, 3602, -2833, -1328, 4083, -2236, -2212, 3816, -1514, -2349, 3716, -1283, -2888, 3799, -502, -3414, 3309, 195, -3392, 3076, 528, -3777, 2858, 1376, -3934, 2159, 1916, -3717, 1736, 2286, -3756, 1223, 2898, -3565, 409, 3171, -3121, -42, 3376, -2936, -690, 3659, -2492, -1415, 3636, -1919, -1837, 3569, -1522, -2327, 3528, -965, -2784, 3298, -413, -3097, 3080, 135, -3350, 2786, 719, -3529, 2401, 1227, -3599, 2028, 1769, -3587, 1556, 2222, -3516, 1078, 2685, -3365]
1416c365L856K561o106K964L341n995K155M024n845J174M762n353J13N126m841
1431a429p12N509m298j741N804l359k665N631k613l226N693j928m080N543q22
1446A307m627N001q7m918M756O94n520M167J833n574L320K352n582K918L110n840
1462b690J969M069n390R32M288n035M33M861m871p27N382l918j643N201l350k111
1478b600N526k816l279N504j501l797M837r36m033M910k51m908M423J038m973
1493b856L513J448m995L404K213n540K458L310n095J524L402m902J272M118n084
1508a810J07M866m192p71M652l826j115N208l521k383N377k236k964M769j798
1523C63l191N067j175m299M654K37m423L769N99m450L747J365n135K874K534m740
$$ y = [-3365, 491, 3052, -3054, -90, 3251, -2744, -589, 3435, -2410, -1236, 3526, -1827, -1714, 3412, -1429, -2141, 3368, -930, -2671, 3133, -226, -2891, 2740, 127, -3099, 2594, 666, -3414, 2129, 1307, -3320, 1681, 1594, -3324, 1432, 2126, -3394, 773, 2606, -2968, 352, 2704, -2878, 40, 3150, -2690, -721, 3348, -2042, -1110, 3178, -1857, -1424, 3437, -1434, -2161, 3221, -697, -2340, 2861, -489, -2600, 2926, 110, -3169, 2335, 834, -2963, 1874, 938, -3095, 1815, 1564, -3344, 1079, 2117, -2856, 657, 2105, -2890, 514, 2727, -2813, -355, 2955, -2140, -616, 2786, -2116, -844, 3274, -1810, -1703, 3163, -1029, -1800, 2852, -974, -2089, 3119, -402, -2785, 2592, 356, -2608, 2161, 363, -2828, 2239, 1064, -3235, 1419, 1656, -2767, 1002, 1601, -2849, 898, 2263, -2872, 2, 2536, -2204]
1539b204J971K624m635J795L404m899O43M187m076j60L985l892l54M644l782j562
1555b311M920k674k134M512k401k393M945j873l526M691o23l718M019l43l886
1570b795M152M44m689L405J576m442K598J769m440K430K613m766J339L357m043
1585a492N93L327l960L12M050l839q58M346k890j369M067k710j693M561k216k753
1601b524M396j204k955L980j000l293M225k40m108L622P50l971L035R34m142K952
1617D57J774m549K025K564m054J354K683m052R79L441l940j00L795l173o16L662
1633B250k974j035M137k520k009M066j603k345L780j348k700L965o90l413L553
1648A114J48l453L138L76l674L079J100m081K396J822l881J845K087l925J516
$$ y = [-2204, -233, 2391, -2244, -449, 2955, -1944, -1301, 2886, -1190, -1350, 2635, -1257, -1611, 3033, -749, -2311, 2609, -65, -2199, 2313, -88, -2481, 2464, 591, -2935, 1756, 1133, -2585, 1434, 1091, -2795, 1357, 1801, -2888, 517, 2093, -2349, 249, 2018, -2422, 8, 2621, -2145, -806, 2551, -1492, -899, 2428, -1532, -1220, 2830, -1009, -1867, 2479, -411, -1780, 2287, -423, -2116, 2445, 229, -2524, 1872, 668, -2287, 1693, 693, -2600, 1625, 1385, -2723, 899, 1649, -2322, 713, 1647, -2495, 457, 2231, -2318, -293, 2271, -1783, -429, 2254, -1798, -819, 2622, -1318, -1418, 2377, -796, -1412, 2250, -724, -1759, 2378, -142, -2151, 1915, 312, -2033, 1747, 399, -2301, 1664, 974, -2439, 1114, 1262, -2191, 947, 1323, -2351, 728, 1828, -2253, 143, 1965, -1916, -71, 2016, -1909, -393]
1663c93K726l931P04L181l504J56L307l286l47L702k899j166L811k213j678L701
1679A871j779k122L770j212k713L582n28l007L253j2l279L010N76l513K566J167
1695A630l567K116J623l634J705K112l643J198K549l515O53K912l288J13L142
1710B106k996l91L373k683r86L560k196j521L516j714j947L531j239k470L425
1725A368n84k799L061o8k961K825M13l258K439J116l341J884J530l288J562J929
1741A828l369J029K463l133M49K596k916J71K889k840m63L234k326j018L131j982
1757b57j261L299j753j884L384j069k267L042o85k417L058k67k947K747N41l020
1773a756K166Q33k972K040J279l313J509J981l059Q56K066k839O56K462k944l1
$$ y = [-393, 2333, -1598, -894, 2287, -1217, -1061, 2246, -1040, -1387, 2315, -584, -1750, 2061, -152, -1830, 1871, 92, -2030, 1740, 528, -2185, 1397, 869, -2138, 1115, 1103, -2176, 834, 1410, -2103, 463, 1630, -1937, 179, 1802, -1832, -127, 1985, -1658, -460, 2089, -1426, -773, 2139, -1149, -1036, 2106, -890, -1281, 2092, -591, -1577, 1983, -213, -1734, 1782, 68, -1879, 1652, 413, -2057, 1368, 784, -2015, 1046, 978, -1983, 842, 1255, -2003, 436, 1552, -1789, 95, 1625, -1663, -101, 1828, -1541, -512, 1951, -1182, -733, 1863, -1053, -882, 2007, -833, -1296, 1938, -388, -1406, 1725, -257, -1518, 1781, 28, -1856, 1528, 459, -1808, 1234, 549, -1868, 1190, 923, -2024, 723, 1264, -1756, 410, 1243, -1729, 311, 1590, -1723, -214, 1767, -1292, -436, 1630, -1209, -553, 1909, -1035, -1066]
1789a066K899k342o04K701k068p25K992j986j451L197j274j829K811j004j888
1804a637K992p41k524K818O1k619K302K47k617K394O50l144J915J449k933J270
1820a17J496k796J232J927l037N35K501k508p5K365k284j92K740k245r86K982
1836A538j477j401K616j262j448K866j054k143K793k38k307K302r4k312K437K88
1852A104k854K053J028k701J500J067k680J571J507k992R31K091k583M04K007
1867A453k437K87K442k460m64K729j794q74K474j619j025K795j376j723K737o16
1883E29j928K319m24j996K435l2k533K092O35k445J660P49k506J661J204k774
1899a354J093J702k434O78J666k451O09K111k472o8K407j983m01K271j884n91
$$ y = [-1066, 1833, -509, -1113, 1588, -480, -1205, 1787, -199, -1650, 1547, 273, -1556, 1255, 251, -1637, 1355, 614, -1910, 908, 969, -1650, 652, 899, -1718, 676, 1326, -1818, 97, 1546, -1387, -117, 1379, -1417, -185, 1742, -1295, -760, 1741, -767, -842, 1523, -761, -953, 1787, -458, -1444, 1538, 61, -1340, 1276, 14, -1434, 1432, 378, -1765, 1028, 790, -1517, 785, 691, -1621, 816, 1104, -1750, 303, 1331, -1370, 130, 1197, -1483, 88, 1595, -1397, -466, 1625, -958, -554, 1453, -984, -697, 1745, -715, -1179, 1550, -244, -1118, 1356, -263, -1288, 1507, 131, -1592, 1145, 529, -1399, 920, 496, -1500, 935, 903, -1630, 462, 1097, -1348, 312, 1061, -1445, 216, 1420, -1354, -261, 1441, -993, -315, 1351, -1100, -491, 1620, -852, -920, 1487, -496, -897, 1374, -510, -1101]
1915a101K606j654j237K606j044j457K370q98j627K519m76k162K221J66k166J872
1931E38L26k284J803Q17k541J329J266k327R70J362k372Q12J797k388K21K077
1947A406k018r4K055j946l10K354j780q26K412j320j064K291j156j322K435p99
1963C18j745K267k96j866K037q3k037J975L58k286J614Q07k256J307J036k274
1979a124J024J395k263N84J694k067K51J823j955q0K056j768m69K168j499p83
1995a013K192j242j063K222r66j369K185o37j592K095l24j806J976mj982J814
2011D86L40k102J558P06k158J258R76k136J001J269k178O56J616k031K44J740
2027A245j827n1J906j706m21K066j374p77K005j109r97K085r00j360K086m65j596
$$ y = [-1101, 1505, -149, -1386, 1220, 176, -1281, 1089, 191, -1436, 1083, 607, -1555, 666, 832, -1334, 538, 864, -1420, 383, 1200, -1341, -12, 1254, -1073, -103, 1259, -1113, -301, 1496, -892, -671, 1406, -612, -706, 1349, -597, -907, 1447, -333, -1159, 1253, -67, -1131, 1160, 4, -1318, 1117, 318, -1427, 840, 544, -1322, 715, 632, -1405, 570, 928, -1358, 256, 1063, -1193, 114, 1150, -1124, -100, 1295, -968, -384, 1310, -757, -506, 1317, -638, -718, 1338, -430, -899, 1269, -230, -1013, 1179, -63, -1126, 1096, 130, -1239, 946, 309, -1283, 812, 488, -1318, 658, 654, -1328, 486, 826, -1276, 282, 988, -1170, 88, 1064, -1072, -71, 1198, -980, -324, 1292, -739, -495, 1245, -582, -633, 1273, -433, -854, 1212, -162, -939, 1066, -43, -1040, 1045, 145, -1215, 871, 406, -1190]
2044a190J845k05j656J832Jj926J682M62j994J338O60j959J238R07k130R29J336
2061A170j982N03J400j851L90J610j874m0J906j552m31J824j321n62J951j203
2077f2j010K024o95j273J759m70j333J832k87j737J714K69j785J312L92j725J329
2094B54O27j996J040J093j858O38J113j751O42J340j909K16J692j552j54J562
2110I97j407j94J764j422o69J949r21r58J692p69r81J834o16j440J748m6j507
2127i46J353P1j482J431L12j839J136Q42j689P41Q28j600P52J088j803L55J460
2144A010j470J1J302j371M7J557j448m31J749r95o87J531q81o87J717q25j135
2161a006J711l30j232J405k31j242J514l0j608J283M91j532R15N14j484R42P93
$$ y = [-1190, 655, 450, -1206, 626, 627, -1299, 383, 845, -1149, 189, 849, -1110, 128, 1035, -1095, -166, 1170, -812, -309, 1091, -760, -370, 1240, -634, -674, 1232, -320, -751, 1073, -248, -810, 1141, -62, -1072, 952, 257, -1016, 743, 273, -1060, 772, 485, -1252, 462, 731, -1054, 258, 650, -1075, 254, 881, -1115, -75, 1018, -840, -202, 911, -840, -198, 1142, -767, -551, 1141, -411, -565, 997, -410, -604, 1160, -262, -931, 1018, 97, -861, 831, 62, -919, 915, 299, -1141, 607, 561, -946, 407, 478, -1004, 427, 739, -1100, 36, 878, -811, -70, 758, -842, -90, 998, -805, -450, 1010, -460, -449, 853, -518, -471, 1086, -362, -793, 956, -39, -726, 805, -76, -763, 954, 129, -1006, 705, 375, -857, 548, 317, -925, 589, 559, -1049, 234, 725, -807, 108, 622, -862, 80, 873]
2178H73j717N76J160j459K49J100j361K16J337j411k36J540j021m65J375r28n00
2195f72J556q57q99J572m57j002J359l83j045J462j92j361J278K02j337J050K46
2212E20j375J093N06j578P66Q48j416N11Q50j374M21J107j392M4J289j126j67
2229d73J223j042l00J420r11o64J431n85p93J297m85q87J385k95j143J235Qj158
2247g37J072J19j255J070L47j381Q30N95j313O58O48j341N91Q86j360K89J055
2264G73j200R0J074j127o1J250j013l75J294p72n40J268o56o91J308m44r19J232
2282D91j82j035J117k0j105J038J97j202Q74M02j243P31N55j262O04P10j247M10
2300a67Q61j184K37R53j100N0J051j008j22J149r20l30J211p57n06J193n92o29
$$ y = [873, -844, -268, 892, -567, -318, 782, -579, -363, 974, -437, -673, 867, -154, -619, 756, -172, -672, 884, 27, -872, 700, 243, -759, 600, 217, -828, 634, 442, -919, 359, 561, -776, 274, 520, -855, 238, 744, -834, -68, 780, -636, -125, 725, -649, -228, 879, -513, -469, 820, -306, -473, 750, -292, -592, 828, -83, -747, 684, 99, -694, 603, 118, -769, 616, 321, -822, 413, 421, -737, 335, 454, -801, 269, 616, -765, 65, 660, -653, 5, 653, -688, -97, 789, -571, -282, 773, -427, -337, 737, -390, -451, 799, -214, -589, 705, -67, -607, 661, 5, -686, 622, 178, -741, 491, 309, -726, 391, 371, -734, 304, 501, -701, 173, 575, -668, 63, 618, -644, -40, 670, -577, -167, 694, -490, -253, 700, -400, -350, 701, -307, -429, 720, -200, -530, 681, -76, -582, 611, 19, -610]
2318f10J195m37q20J147k08r50J037k1j004R61J68j146Q43M01j163O23N30j110
2336e64N38O55j160L48Q44j060J17Q89r57M4R74r47j92J136p80l64J044o53m18
2355e06J119o10o23J153l55p72R91k09p89J014j07r98R54J92j042P26K66r82P03
2374A25M13j147N38O89j048K41P17r35K15Q26r98k2J017p88k58R36o93k51J018
2393E95o65n14J112l99o47R21l17o05R92k64q52R65L9q95P52Q5q62Q00J90j054
2413f23O73M86r81M11M73r18M45O11j040J96Q58q35n1P79p60k9R12p88l21J031
2433E29n09m71Q71m32m47R68l99p31R79o8p71P34m5p26Q34M1r51P23L29r12N18
2454F4L10q59N65M39j028L60O80q42J39O07q04J79P74q77q4R05o35k38P80n68
$$ y = [-610, 585, 148, -672, 475, 267, -683, 354, 333, -671, 290, 458, -688, 155, 556, -607, 16, 546, -564, -26, 629, -531, -183, 661, -399, -282, 607, -350, -306, 668, -279, -471, 665, -115, -479, 565, -88, -506, 613, 3, -620, 533, 178, -594, 397, 188, -601, 413, 306, -692, 262, 454, -588, 138, 404, -578, 125, 538, -609, -71, 618, -430, -189, 528, -407, -192, 634, -364, -386, 631, -157, -415, 521, -172, -423, 595, -70, -584, 528, 129, -518, 403, 86, -519, 473, 209, -643, 322, 361, -534, 218, 303, -559, 241, 431, -623, 50, 536, -445, -34, 439, -479, -34, 577, -463, -267, 591, -244, -295, 484, -276, -305, 607, -181, -502, 529, 20, -451, 420, -12, -459, 509, 110, -621, 358, 290, -481, 253, 208, -518, 316, 357, -594, 129, 458, -454, 64, 374, -485, 80, 519, -509, -149, 531, -311, -172, 435, -369, -190, 584, -293, -377, 528, -107, -345, 435, -133]
2474a33k46Q96n30n13R15k32o05P50j88n90Q37r9q20P44J77p93N55J83p69N91
2494A30L07r21M43N01q01K70M78q01K93O21q57P7P48o90o0O88o47p1P92o26k90
2515d16Q41m14l88P61l77m36Q28k61o37P60l5o48O36Mo84O61J47q01N13L36p58
2536c68L79L65p60L42N12q01J63O20o94O7O08o79J1P20o57j49P35m95k38P22m68
2557f5l13P98l82m48P50k30n15O95j53n80O99l1o85O10J48p08N05K17p25M50L44
2578C81p43L05M58p07K02N24o94J08O02o41l3O52n48j37O71m88k16P06m28l31
2598c57P25l33m12P08k42m85O87j48n50O45m0o20O01P1o61N33J59o78M63K56p02
2619c80L46M01o77K18M65o41J38N38o50L0O26n45j31O42m65j86O67m34l01O99
$$ y = [-133, -379, 517, -13, -526, 389, 157, -448, 302, 114, -476, 361, 262, -558, 186, 363, -430, 125, 308, -461, 130, 437, -484, -41, 460, -341, -71, 407, -394, -101, 520, -337, -260, 488, -202, -262, 426, -221, -292, 500, -126, -416, 425, 11, -377, 384, 7, -429, 399, 138, -499, 261, 226, -422, 214, 218, -466, 195, 342, -459, 54, 390, -368, 11, 376, -384, -42, 470, -331, -168, 452, -242, -175, 433, -246, -235, 485, -172, -321, 414, -81, -319, 403, -65, -378, 420, 38, -410, 340, 110, -405, 290, 137, -443, 256, 225, -460, 150, 298, -410, 95, 312, -413, 37, 381, -362, -57, 401, -306, -104, 420, -274, -166, 436, -205, -238, 414, -134, -271, 400, -88, -304, 402, -26, -357, 368, 35, -377, 331, 89, -396, 291, 143, -407, 238, 198, -422, 179, 250, -411, 122, 281, -397, 66, 322, -380, -34, 367, -310, -92, 373, -268, -130, 408, -242, -212, 414, -131, -262, 380, -85, -271, 396, -38, -339, 360]
2639C60k92m20O34j89m44O47j56n47O27J8o06N12Q5n95N16J24o76M49K83o58L10
2660a8L20o23K90L99o81J61N46n78lN38n21j8N86n25j63O69l68k96N87k93k99
2681b90O34k66m45O26o4n27N07pn03N35L1o27M72K34o32L45K27n71L54K88o50
2702c29K30M45n68R8M12n35J33M90n91k8O05m32j61N20l75j44N96l77l21O27j80
2723A15l99N10j49l69N56r0n57N21J11n39L69J15n04L96K10o31K90L65n46J57
2743f9L21n00J95L94n85M8N21m50o1M48m22k4N48m58j92N83k73k69M88k54k51
2764b62N82k36m19N44l7m31M16k2m27M80M4n75L84K27n10K45K17m93K76L00n73
2785b70J45M25m68L8L88m46M7M65m66r4N21l16j71M49l07j68N32l02k96N32j52
$$ y = [360, 68, -352, 282, 93, -351, 296, 140, -407, 220, 238, -368, 144, 229, -366, 150, 274, -402, 47, 330, -328, -18, 302, -321, -31, 368, -313, -152, 394, -184, -187, 351, -170, -188, 398, -127, -290, 379, 11, -285, 302, 9, -290, 344, 78, -367, 259, 195, -332, 175, 168, -335, 200, 231, -396, 76, 310, -322, 23, 250, -321, 33, 321, -329, -99, 346, -222, -124, 288, -247, -114, 376, -215, -243, 362, -70, -231, 289, -86, -230, 366, -11, -332, 295, 115, -284, 226, 77, -292, 264, 174, -383, 138, 249, -290, 79, 194, -310, 86, 296, -335, -45, 320, -226, -69, 252, -248, -53, 341, -244, -196, 325, -125, -186, 262, -160, -184, 364, -94, -286, 297, 24, -245, 243, -11, -262, 320, 84, -335, 209, 172, -259, 157, 135, -292, 188, 232, -343, 41, 268, -242, 3, 220, -273, 3, 303, -270, -125, 300, -168, -130, 258, -188, -141, 324, -142, -236, 285, -31, -202, 247, -60, -228, 304, 2, -294, 238, 86]
2806H6l23M48j32l44M95p2m59M34O7m36L28Q9m50L58J57n26K49K94m67J51K94
2827B41m64J34L76m68K1M40l82o7M12l49r3M74l23k02M78k04k61M52j79k85M79
2848B30j39l72M50m1l56L82j6l86L87O4m52L02J52m28K57J90m56K16K57m40J14
2869h5L28m05O3L37l83%M04l39r3M06k82j35M10k33k00M12j61k58M02j22k89L89
2891A66p3l17L58%l51L16N1l78K97J05l87K49J50m00K16K03l98J58K45l79J02
2912f7K59l42N7L12l45lL46k86q2L52k38j29L67k14j76L65j25k23L13q1k52L28
2934A36m4l03L07N0l35K39Q4l22K49J10l62J94J80l38J30J79l05J19K21l40O7
2955h4K85k98mK79k75NK99k82q2L48j84j45L02j66j36L23j51k32L33l4k63K56
$$ y = [86, -237, 211, 79, -265, 230, 158, -301, 133, 200, -236, 92, 181, -269, 89, 246, -280, -31, 263, -204, -53, 241, -223, -89, 287, -181, -160, 280, -102, -169, 243, -106, -199, 275, -48, -250, 228, 24, -237, 215, 36, -249, 230, 91, -281, 169, 128, -228, 154, 138, -248, 139, 203, -249, 53, 205, -223, 34, 224, -232, -16, 241, -199, -85, 243, -162, -99, 238, -145, -145, 259, -80, -173, 233, -49, -184, 226, -7, -207, 205, 44, -214, 188, 66, -223, 166, 93, -224, 134, 134, -217, 99, 150, -228, 69, 174, -213, 36, 186, -214, 2, 205, -193, -35, 210, -169, -67, 192, -150, -93, 219, -126, -129, 217, -69, -151, 201, -37, -166, 201, -13, -189, 176, 51, -172, 141, 60, -192, 136, 92, -211, 96, 146, -189, 50, 134, -188, 61, 171, -191, 3, 183, -155, -25, 154, -151, -32, 189, -151, -84, 201, -97, -101, 178, -97, -92, 207, -75, -157, 191, 7, -138, 164, -2, -138, 185, 34, -198, 135, 101, -162, 94]
2977I4k0k37K72Rl22K43J13l17J70J30k93J71J56l31J10K36k97N3K00k64P0K50
2999A96l04k3L12k31p0K72k08m1L04k26j49L28j16j73K69j20j66L00p9k68K82
3020H9J2k48K08J2k46K38P1l26J76J66k74J02J40k65J22J91k99M4K50k17k3K15
3042A38k29RK61k27q7K86j36j18K38j51j15L00j37j96K81m5j96K24n7j97K64j1
3064I9k81K14Q1k40J54N8k42J79J18k89R9J88k34N1J67k30N8K15k40l2K57j74
3086b4n3K08j59p5K72j66j38K67q4j51K11p6j69K71o6k20K29J2k11J89J5k32K15
3109F5N8k79J60J17k42J13J07k39J16J73k64M1K09k03JK02j97k1K41j81q9K42
3131A30j27j13K36j13j32K47p9j93K36k6k02K14j7j94K06K6k42J77P0k30J50P7
$$ y = [94, 74, -163, 109, 118, -204, 39, 152, -165, 5, 135, -158, 13, 169, -162, -52, 184, -113, -60, 140, -124, -54, 196, -108, -131, 181, -50, -120, 152, -56, -97, 207, -19, -168, 160, 44, -129, 140, 20, -146, 154, 75, -193, 89, 101, -147, 61, 73, -173, 65, 136, -190, -14, 152, -122, -20, 120, -145, -23, 168, -131, -87, 163, -54, -77, 138, -91, -82, 179, -48, -135, 151, 15, -103, 135, -16, -131, 169, 32, -164, 117, 72, -124, 100, 43, -154, 110, 99, -182, 32, 113, -127, 27, 85, -157, 22, 140, -149, -50, 138, -96, -45, 122, -108, -50, 165, -75, -107, 150, -24, -77, 131, -28, -103, 169, 3, -135, 132, 48, -103, 108, 32, -137, 134, 68, -152, 77, 89, -122, 67, 82, -150, 65, 123, -156, 4, 121, -121, -8, 99, -140, -24, 149, -115, -74, 135, -68, -67, 135, -62, -83, 158, -23, -112, 130, 3, -110, 126, 13, -119, 128, 49, -144, 92, 66, -136, 78, 61, -133, 73, 99, -143, 34, 104, -126, 24, 101]
3153A01k32J35J29k54Q9J57k37P2J64k24L4K19k19j0K15j74m6K24j51q9K39j28
3175A4j33K32p5j57K30o2j81K25k0k02J82K8k18J81N8k27J39J02k49J22J25k30
3197a16Q9J57k38P5J65k21L9J84k15J3K07j80m3K24j61p4K33j47j08K46j11j43
3219a25K45p7j62K15l4j99K07J8k19J75M3k16J58P7k33J21J27k21P9J32k07P2
3241b4J64k22J9K01j84j5J90j80j9K13j88n4K33j36r6K07j10j06K38j00j59K25
3263I7m6j80K02k2j81K03J0k27J85O3k21J22P8k07J25J23k45P6J71k04K5J69j98
3286h2L3J95k06l0K15j26p5J91j29p0K20j30j28K36p8j38J91o2j36K14m2j98K01
3309F6K4k14J61K7j92J67O4k39J25J30k14P2J33k14P3J59k23K1K10j70j8J66j64
$$ y = [101, -131, 4, 133, -121, -32, 125, -112, -40, 124, -100, -66, 153, -66, -76, 139, -35, -81, 143, -8, -97, 142, 14, -119, 113, 38, -119, 111, 49, -132, 93, 73, -129, 53, 81, -137, 44, 102, -125, 14, 116, -133, -11, 114, -116, -27, 130, -108, -33, 132, -89, -50, 134, -81, -68, 139, -41, -84, 140, -21, -95, 138, -9, -117, 129, 18, -125, 120, 43, -119, 96, 62, -137, 70, 88, -131, 44, 87, -129, 29, 106, -127, -6, 121, -100, -21, 111, -96, -24, 140, -82, -63, 138, -46, -61, 129, -51, -70, 143, -45, -99, 134, -2, -98, 109, -1, -107, 131, 31, -128, 97, 51, -129, 73, 51, -130, 73, 83, -144, 41, 104, -117, 5, 83, -124, 1, 124, -121, -45, 126, -78, -53, 116, -82, -49, 146, -60, -90, 125, -1, -76, 115, -14, -84, 136, 6, -122, 114, 36, -102, 89, 27, -109, 105, 63, -135, 66, 90, -124, 37, 64, -128, 39, 103, -136, -11, 119, -95, -23, 110, -104, -31, 128, -95, -74, 136, -34, -52, 114, -50]
3332e0j7K13j55r4K26r9j18J97r7j03K16p0j68J93j1j84J75oj72J85K8k30J62
3355B1P5k05J21Q2k26J35J22k42P2J71j92K1J64j90K1J97j96l4K22j41o8K01j33
3378bq7K30j17j44K13m7j49J74l2j57J95j7j94J65O1k05J40M2j95J42R2k39J01
3401c0J24j85N5J34j96N8J71k11PJ88j57k3J80j60k3K02j45j00K24q1j23J96p9
3424B6j31K03m9j62J83j0j69J56Rj84J66M4k05J23R2j93Q8J00j91Q5J24k01M8
3447d8J56j69J2J68j70rJ71j43m8J96j26o6J92j14r4K09q9j37J99n4j41J76j9
3470E2j57J66Oj84J46M4j90J29O0j86J06R0j80P4J20j75L9J38j59MJ60j58nJ70
3494A10j42l6J90j43n6J86r8q8J75p2j19J82n8j29J73k8j46J53J1j70J46L8j75
$$ y = [-50, -67, 146, -9, -103, 123, 24, -94, 103, 6, -97, 119, 49, -119, 74, 63, -121, 54, 48, -124, 61, 89, -141, 21, 96, -109, 12, 94, -132, 3, 125, -117, -45, 126, -66, -45, 119, -71, -50, 147, -49, -83, 139, -2, -70, 131, -2, -89, 141, 24, -120, 93, 46, -103, 71, 39, -118, 77, 60, -134, 31, 92, -113, 27, 69, -126, 16, 108, -131, -30, 94, -91, -36, 98, -98, -40, 131, -80, -73, 115, -42, -65, 115, -45, -68, 134, -11, -111, 113, 32, -91, 105, 26, -105, 98, 49, -113, 70, 60, -109, 47, 56, -128, 38, 82, -123, 0, 92, -101, -13, 87, -104, -19, 105, -96, -48, 108, -61, -49, 119, -51, -60, 111, -32, -80, 116, -10, -76, 116, 2, -92, 117, 28, -109, 90, 36, -105, 71, 52, -105, 61, 67, -117, 29, 73, -117, 12, 72, -114, -8, 82, -98, -24, 96, -79, -40, 98, -61, -57, 103, -55, -60, 110, -32, -68, 122, -21, -77, 109, 11, -77, 98, 26, -93, 89, 31, -98, 75, 47, -99, 54, 65, -105, 41, 79, -96]
3517i6J07O1j71J03P9j82P3J22j74L9J37j65K4J50j59rJ64j23m4J71j15n5J72
3540A09r9j01J90o7j33J89n4j28J66j3j62J51K9j73J28M0j74J35N4j89J01Q9j68
3563h0O2J06j63N0J08j64M2J43j55j1J61j42j5J71j23p0J91r5q8J64p9q8J58m9
3587C4j30J66rj60J40Oj48J54J2j66J18N4j56Q4P6j83J11Q4j93P7J23j61K8J25
3611H6j43K1J51j57k3J72j25m7J53j01n0J62q3j00J73n3j12J45l3j21J55j7j47
3634i4J38J8j62J26L0j48J18M9j71R3Q8j58N5J05j64N4J27j75K7J39j39JJ33j18
3658b8k4J58j23n9J81r3r2J74r3p7J70n6j26J51k0j28J33qj30J29L0j70J01O9
3682F9j58Q5O8j40O7Q7j60N0J22j48L5J04j31RJ50j42k2J52j17l2J50j14m5J64
$$ y = [-96, 11, 72, -99, 4, 83, -99, -26, 96, -78, -39, 98, -67, -43, 107, -52, -61, 103, -20, -64, 107, -8, -63, 109, 10, -91, 99, 32, -101, 88, 34, -94, 72, 59, -103, 48, 77, -96, 32, 72, -102, 33, 87, -102, -1, 88, -80, -18, 88, -75, -25, 83, -81, -39, 104, -51, -62, 99, -43, -58, 113, -10, -80, 111, 16, -72, 92, 13, -75, 83, 34, -96, 70, 61, -99, 41, 47, -101, 53, 65, -101, 17, 71, -85, -1, 75, -108, 3, 87, -106, -29, 94, -67, -39, 86, -57, -36, 115, -42, -65, 107, -18, -65, 88, -13, -63, 99, 16, -84, 89, 36, -76, 69, 36, -85, 70, 53, -94, 44, 62, -100, 26, 56, -92, 26, 75, -96, -3, 85, -73, -18, 87, -77, -23, 104, -71, -44, 95, -44, -43, 90, -28, -52, 106, -17, -76, 105, 12, -80, 94, 1, -76, 94, 38, -88, 63, 43, -85, 48, 40, -90, 39, 69, -101, 0, 69, -89, -4, 64, -76, -9, 78, -82, -32, 90, -58, -23, 81, -50, -41, 109, -33, -55, 97, -20, -52, 98, -16, -61, 103]
3706A03r6p4J54o0j00J48m9j12J56k1j38J30J3j46J24L1j59J12N4j61P8Q2j45
3729g6N7R6j42L3J22j48RJ46j18k7J44j27k3J60j07o2J43p0q2J46o7r0J53m5j08
3754h3J53l6j28J44oj35J28K5j52J07N7j64R7O6j51O0P9j41N8J03j45K9J17j33
3778e1LJ23j19%J29j06l7J62r0p0J39p0q7J56n2j11J48m4j12J27rj31J39lj32
3803i8J23K4j42J09L6j38Q5P3j47N8R0j35L3J02j33K1J23j20j3J36j13k1J37r5
3827em3J33p0p1J44o5q4J34n1r7J31k1j20J21Lj28J03K7j31R7N0j45Q2O6j27N2
3853a5P9j32M4R7j26K5J10j30J2J23j20j0J38j08m5J37o2p5J33o1p7J32m4j02
3877g7J32k5j16J22lj18J11J1j26R5N2j35P0O2j38O8Q1j33M6R9j31K0J10j08P
$$ y = [103, 7, -67, 87, 27, -73, 75, 26, -86, 70, 49, -89, 41, 54, -92, 32, 63, -96, 16, 70, -91, -13, 69, -76, -19, 77, -65, -32, 90, -58, -49, 97, -21, -48, 96, -31, -54, 106, -1, -63, 80, 10, -72, 74, 7, -83, 70, 25, -83, 70, 34, -94, 50, 44, -91, 37, 62, -90, 17, 74, -90, 7, 73, -78, -18, 61, -80, -22, 81, -64, -35, 82, -51, -48, 75, -44, -44, 85, -21, -58, 104, 14, -56, 83, 13, -74, 82, 30, -81, 67, 23, -89, 38, 29, -102, 37, 34, -98, 25, 49, -93, 16, 52, -86, -1, 72, -75, -17, 73, -62, -29, 73, -60, -39, 84, -36, -49, 87, -26, -47, 90, -5, -48, 85, 15, -56, 88, 23, -61, 73, 22, -75, 56, 35, -85, 36, 39, -89, 14, 41, -90, 7, 57, -88, -6, 60, -67, -15, 64, -68, -24, 73, -53, -28, 82, -48, -36, 87, -33, -43, 95, -13, -58, 79, 17, -58, 75, 14, -63, 69, 25, -77, 55, 30, -86, 36, 33, -85, 26, 37, -89, 6, 58, -77, -7, 55, -83, -15, 66, -67, -21, 78, -53, -33, 77, -31, -24]
3902b4J16j21k0J27q3m1J29q2o0J40o6p7J28l2j05J29l0j03J23jj30J03L1j31
3926h0R3L8j30Q4N5j36N3Q4j28M3Q7j26M1J02j22J1J17j07k1J19r2l7J29p8n2
3951e3J30o4p5J21m5p9J24l5j04J16J2j19R3K3j19R3L4j23O9P2j42N7P2j23M9
3976a6R5j37K6J09j07JJ10j06j2J26r3l9J32q1o0J27n5o6J17n1q8J38l1j13J15
4001D1pj14J11K1j36J00L8j41Q9N3j30O4O8j31L7J03j17J8J06j19J0J12j04j3
4025d1J18q6l6J15o8n1J21o0o7J22l6q6J04j0j01J16j1j19J10Jj14Q3M3j22P3
4050bN8j34O3P3j28M7R3j24K4J03j23J0J09r9j3J18q1m1J17p8m4J23n3p4J20m3
4076B1q1J06j3r5J19j4j21J08Pj11Q3K8j21Q2M8j27O9O2j24M5R0j07K6Q3j09K0
$$ y = [-24, 92, -29, -49, 78, -5, -46, 83, 1, -59, 81, 15, -62, 66, 34, -71, 58, 28, -75, 48, 47, -83, 20, 51, -80, 13, 51, -79, 5, 60, -76, -23, 61, -67, -24, 63, -63, -22, 80, -42, -31, 86, -21, -42, 77, -15, -52, 77, -1, -53, 77, 13, -62, 59, 14, -65, 59, 24, -80, 36, 48, -71, 22, 45, -74, 19, 53, -70, -1, 71, -71, -14, 58, -65, -16, 79, -58, -32, 77, -30, -29, 81, -25, -37, 89, -4, -43, 89, 8, -52, 75, 20, -46, 71, 20, -68, 70, 39, -74, 41, 34, -80, 31, 52, -84, 16, 54, -87, 2, 55, -75, -11, 57, -74, -37, 66, -51, -33, 73, -46, -36, 76, -28, -41, 77, -9, -45, 70, 2, -49, 72, 12, -55, 67, 31, -55, 49, 39, -62, 54, 43, -76, 34, 35, -79, 4, 47, -75, -2, 56, -78, -15, 58, -70, -23, 70, -54, -30, 73, -50, -40, 69, -30, -43, 75, -6, -47, 70, -8, -52, 71, 18, -56, 64, 21, -60, 46, 33, -62, 57, 43, -78, 30, 37, -74, 9, 37, -84, -2, 46, -81, -12, 50, -74, -29, 61, -46, -20, 63, -46, -26]
4102b6J04r8j9J09q4l0J25q2m2J21o7o0J14l7p8J12l3r6J17nj08R5Oj00Q8J8j15
4129g1Q5M4j27N7O6j29N7P8j27L9J01j23RJ08r7qJ16q9k9J19q7l9J19o6n8J20
4155F8n4o8J16l5r0J16k9r3J09or7Q0K7j15P7M5j22P2M9j17M0Q8j14L1P9j03J1
4182c5R9j00oJ15q3l8J11o5l7J12o8n5J13m1p1J11m1p2J04k9q7J01or9P6K1j01
4209g1Q0L2j11O3N4j13N1N9r8L6O5j05K7Q0q3%R8q0j9J02q5k1J11n9n4J03m6n1
4237c5R5l6p1R7j9p1O5Mq5Q0J6j04P1L4j01N4N6j10N0M8r4M1O8r4J4P9q1kQ9p5
4267a7j7R1p0k8R4o5l1R6m1o8J12l1o6Q6oq1P5Jr9R4J3r9O4K9q3M3M5r6M2N9j04
4298e8K8P2p7MP9q4OQ9p8j5R2o5l0J08o3m8R7l8n6Q7l5o1Q8j8p3P7K0r7P5J3r5
$$ y = [-26, 78, -20, -39, 70, -14, -44, 81, -1, -43, 78, 11, -49, 65, 28, -50, 62, 29, -67, 50, 45, -63, 32, 38, -62, 26, 44, -71, 14, 58, -69, -12, 54, -75, -18, 60, -67, -28, 73, -50, -41, 67, -30, -38, 78, -11, -40, 79, -8, -47, 72, 6, -52, 68, 14, -54, 62, 27, -63, 53, 24, -69, 40, 34, -63, 17, 44, -71, 6, 51, -71, 1, 50, -67, -27, 61, -53, -22, 57, -46, -35, 64, -36, -42, 73, -10, -48, 63, -2, -39, 73, 5, -50, 63, 22, -49, 62, 21, -51, 53, 24, -63, 38, 32, -67, 9, 30, -71, 9, 41, -70, -7, 47, -66, -15, 44, -54, -18, 47, -58, -31, 49, -34, -34, 64, -16, -35, 67, -18, -39, 72, 13, -41, 62, 16, -35, 60, 24, -47, 50, 31, -40, 25, 29, -56, 24, 40, -64, 7, 41, -60, -6, 50, -60, -10, 38, -56, -15, 53, -41, -27, 52, -29, -31, 58, -17, -34, 57, -13, -41, 53, -12, -43, 53, 12, -56, 56, 25, -41, 45, 39, -42, 33, 34, -65, 29, 42, -57, 7, 36, -47, -4, 41, -55, -13, 46, -58, -30, 42, -35, -31, 48, -36, -30, 59, -19, -34, 58, -7, -37, 71, 8, -40, 57, 19, -37, 50, 15, -46, 42, 24, -49, 28, 48, -49, 26, 39, -56]
4329e6O8L6r6M0N3r8M3N6q2K3O2r9J8Q1p7qQ6o1k1Q7n6l4R2m0m3Q1k9n1Q0k8o2
4360c5Q7k7o3O5Lp6P6Nq1O4L0r0M7M8j00L7N0q3L2N4p8J2P0q3RP6p1j5Q7n9j6
4391b5Q6n6l6Q3m2m5Q7l1m6O4nq4P0K7q4M8J0o2M4L1q2N3L1q6L8M6p3K0O1q2Q
4422c2P8q5J2O3o6j7Q6n5j7P8m7k8Q3m9l8Q8l1m8P2j0o5O4qo5P2%q0O1J2p4N4
4453HJ8o8L6L8p1K2N8q2K2N5o2J0O0o1oO9m8l4P5m2j7P2n5k7P2k3m5P3k3m8O5
4484D1Jq6P8jp2N5L0p9M8J8p7N5K8p9K6N1q3K6O5q5J4P5p2%O7o3qR1o4k1P1l6
4516A4l0O2l2m5Q3l3m5O9j2p1O6ko6O7J2q6O3L7r2M7K0p2L9N2r3L3N1p0J8N0o9
4547c5PP0o1oP7n6j5O4m8k0O7l6l6Q1l7l9O4k3n5P2Pq4O3Lo1O1J1p2M5L0q5M5
$$ y = [-56, 12, 48, -48, -8, 45, -53, -10, 46, -36, -13, 49, -50, -32, 49, -28, -36, 50, -11, -32, 55, -1, -35, 57, 17, -26, 55, 26, -25, 55, 27, -35, 52, 25, -38, 27, 30, -46, 30, 35, -46, 18, 48, -42, 5, 53, -47, -10, 40, -43, -11, 43, -35, -23, 47, -36, -27, 49, -22, -37, 50, -9, -25, 61, 5, -31, 52, 10, -35, 52, 21, -25, 39, 34, -50, 20, 47, -37, 11, 21, -41, 3, 34, -48, 5, 36, -50, -12, 34, -39, -19, 42, -40, -32, 46, -39, -27, 36, -30, -47, 39, -16, -33, 45, -2, -30, 53, 4, -34, 54, 23, -25, 47, 37, -28, 36, 28, -37, 35, 35, -45, 16, 28, -46, 8, 26, -42, -6, 32, -39, -17, 41, -41, -19, 36, -26, -16, 44, -17, -23, 46, -2, -36, 39, -3, -20, 52, -3, -30, 42, 19, -26, 47, 24, -24, 41, 42, -44, 34, 33, -39, 16, 46, -33, 15, 33, -44, 11, 39, -40, -14, 37, -46, -20, 45, -40, -26, 49, -23, -23, 44, -19, -27, 64, 0, -21, 50, 14, -16, 46, 14, -31, 52, 19, -26, 43, 31, -40, 26, 24, -42, 25, 37, -49, 14, 51, -41, 6, 26, -46, -7, 45, -48, -15, 36, -34, -16, 34, -35, -28, 42, -19, -25, 52, -4, -19, 45, -3, -23, 44, 8, -28, 53, 16, -23, 41, 18, -37, 35, 42, -42, 21, 24, -37, 24, 35, -37, 8, 38, -47, -2]
4579bL3n9K3M5q1K7M1o6J6P2p4mO6n8lO8n9lO1l7k1N9l0m1P3k5m1O2k0m7N9k0
4611A4n0N3Jo0N6Nn5L9K0o6M4K9p0K0N1o0J9M6n5MN0n1j8P0m6pN4l7k4P1l9k9
4643b1O6k0m6O1j4n4O5j8m6N5Po7N0jm6L8J4o4M4K7o7L5M0p2K4M2n9J2N9n2JM2
4675C5n1qO9m3k5N6l8j9O4l6j9O2k8l6N2j8n4O1Mn4L6Rn2M2J1o5L8L8p4M1K7o0
4707c5K8M5n7J4L9n9RN9n7KO2m2k0O0l8l1O5k7l0M8j5m1O1j6m5N2j3n0N6qn1N0
4739A5jm7M2J5o1M2J9o3K7L9n5J3L8m4K3L3n2J0N3n2j1N5m3j5O4l4j8N5l4l5N1
4770B9k0l5N8j7m2L8jl2L9mm3L6Jl5K8J8m5K9J2l9J7L1m3J6L2m7J3L3l9QM2m2
4802djL9j8k7M6k3k6O2k8l7N0j9k8M0ql4L8j4m1M7kl2L2Km4M1J7n5K1K2l5J3L5
$$ y = [-2, 31, -28, -5, 40, -41, -14, 27, -39, -23, 49, -25, -29, 37, -21, -24, 44, -15, -18, 43, 6, -15, 44, 14, -27, 46, 21, -20, 42, 22, -25, 34, 14, -36, 17, 18, -42, 14, 19, -36, 3, 23, -43, 1, 30, -40, -20, 31, -29, -10, 36, -19, -15, 35, -16, -34, 36, -10, -17, 37, 0, -24, 47, 8, -21, 45, 25, -21, 40, 26, -28, 37, 19, -27, 28, 35, -32, 18, 17, -29, 9, 23, -41, 3, 30, -37, -2, 38, -34, -10, 32, -27, -15, 44, -8, -7, 35, -16, -24, 45, 2, -23, 33, -5, -24, 40, 4, -15, 47, 19, -17, 35, 17, -37, 24, 28, -26, 10, 19, -33, 9, 20, -45, -7, 31, -43, -2, 25, -35, -7, 38, -19, -5, 34, -25, -16, 43, -14, -12, 50, 8, -12, 48, 10, -21, 44, 17, -13, 35, 20, -21, 40, 24, -21, 31, 18, -32, 24, 16, -35, 15, 14, -33, 9, 24, -37, 5, 24, -39, -12, 27, -28, -15, 23, -21, 2, 35, -17, -7, 46, -6, -17, 38, -5, -20, 44, 10, -8, 47, 13, -22, 29, 9, -26, 32, 15, -27, 11, 10, -22, 17, 13, -30, 6, 7, -28, 0, 18, -27, 2, 14, -25, -8, 23, -20, -4, 28, -19, -6, 27, -12, -4, 38, -4, -5, 34, 16, -11, 35, 12, -14, 48, 20, -17, 33, 14, -14, 26, 18, -16, 22, 8, -33, 14, 12, -20, 12, 14, -30, 11, 28, -27, -6, 16, -19, -6, 29]
4835B9m6JN1m2lL9l8MM1l6ML3l6lM3l1j4M7k3l1L2j3l1L8jl1K6kl2L5Pm4K7J1
4869A1l2K9K0m6J7K0l4J8K7l3LL5m0JL5l6%M4l3j3M8k9j0M1m3j7M1j2l5M4j6k8
4901b3M5k0k6L6nm4M7rm3L1K0l9L1J6l9L2Ql5L8J5m7K1K7l6oM5m4RL3l7lN1l9
4934A0j3L3k2rL2j7l1L6j6k2L1ql7M5j4l1M3pk8K5Kl0K6L2n0K3K0l9L6J2m1K0
4966A1L0l7OL3l4oL8n1RL5l9nM2m1KL5l4j5M1j9j8L7k0k3L7j4k1K9Jl5L9ol0L0
5000GJ7n1L3J7l7K7K1l0J7J0k7PL4n3J8L6n4NK9l2lL7m1j2M5k9j9N0l1j6M4l3
5032a4k0M9j9k4L3Ql4L5qk7L9Pm6L2K7m8L1K0n6L0K7m8J2L3m3PK4m5MM5l6j4M3
5065B4k7k5M3k3j9M1m1oN0j9l1M9k6j6M2j0l9M1Nl3L0J3m3L0J1m6L0K1l7J7K2
$$ y = [29, -17, -16, 35, -7, -10, 29, -9, -5, 36, 0, 4, 37, 1, -2, 41, 10, -4, 43, 20, -11, 21, 8, -23, 15, 14, -17, 9, 7, -25, 10, 17, -27, 0, 11, -21, 8, 28, -18, -1, 19, -15, 3, 30, -3, 0, 35, -5, -4, 31, -5, -5, 39, 6, -7, 41, 12, 2, 43, 0, -17, 24, 12, -23, 21, 5, -23, 22, 2, -24, 12, 7, -37, 10, 1, -42, -11, 9, -30, 1, 17, -22, 10, 18, -17, 21, 36, -11, 10, 37, 1, -5, 40, -4, 5, 38, 1, -2, 49, 10, -3, 30, 8, -1, 31, 14, -17, 19, 3, -19, 12, 4, -33, 12, -2, -33, 10, 3, -25, 0, 2, -28, -2, 30, -20, 3, 23, -16, 20, 32, -9, 11, 41, 4, 10, 43, 9, 3, 41, -10, -1, 34, -5, -10, 32, -9, -7, 28, -6, -21, 20, 1, -17, 20, 0, -23, 14, 0, -21, 8, 9, -26, 13, 7, -23, 7, 24, -27, 6, 23, -14, 13, 34, 4, 21, 31, 4, 11, 45, -8, 10, 46, -8, -3, 26, -6, -9, 28, -13, -25, 20, -9, -28, 22, -9, -25, 19, -14, -34, 15, -4, -28, 5, 13, -21, 14, 6, -21, 18, 25, -21, 11, 38, -10, 21, 41, -15, 15, 42, -6, 6, 39, -4, 3, 27, -18, -14, 31, -5, -19, 24, -3, -28, 15, -8, -27, 14, -27, -33, 17, -2, -33, 16, -10, -26, 16, 6, -33, 8, 13, -20, 10, 23, -20, 10, 21, -25, 5, 26, -11, 6, 28]
5096B8m0J9J7k9j6M7m4NN1n0j2L9l9j0N4k9j7M1k3k8N6j5m0N3Pn3N1j2k9M2%n5
5128c1L6J5l5L0K6o2K7L2m8K1L2n3J2K9m7QM6m6j2M2m1NL4m0nL9l6qM5k3k6M5
5160A1lm1N5j0l3M6nm3M3Om8L6K5n3K5K8n5K1L0n5K4K9n7J6M2n7NM7m0j3M7l6
5192a3j7N4l2l0N3l0k7O4k6k7N0j2l7M7jm5M3Qn0M0K2n2L8J8n2K3K5m8J5L5n0
5223a4RL4n6J0L9m7KM2l8rN2l5l0O6k7l7O1k7l3O1j6m5O0%o1N6Pm8N5Mn6L5K8
5256D2n4K2L4m8J1L8o1jM3m3JM9m6pN2m6j5O0m0k7N9m2j7N9j9l6N4po0O6Mo1N0
5289A4K1n9M4J3o2M9K1o0L2L5o5J5M0m7J0L8n8RN7n8k4O4l3l0O0m0k3N9k8m0O2
5320A6j7l0N7j2n7P0mn5N1J4o2M5K3p2M3L1o2L1L0o4K4M9p0OO1n0qN9n2j1N2n2
$$ y = [28, -12, 7, 24, -5, -21, 26, -18, -13, 38, -12, -24, 15, -24, -34, 20, -9, -26, 15, -8, -36, 20, 5, -35, 18, 25, -28, 23, 11, -18, 24, 24, -31, 5, 20, -15, 15, 41, -21, 6, 38, -10, 11, 43, -10, 2, 31, -16, -8, 38, -8, -20, 22, -19, -14, 20, -20, -25, 14, -22, -30, 15, -8, -34, 11, 8, -33, 22, 12, -21, 25, 20, -23, 20, 26, -22, 14, 39, -14, 11, 39, -16, 5, 35, -20, 4, 33, -24, -8, 34, -23, -18, 29, -11, -24, 23, -13, -30, 24, -8, -38, 15, -15, -42, 22, -4, -31, 19, 7, -30, 17, 16, -29, 14, 22, -28, 12, 34, -18, 20, 38, -14, 9, 34, -14, 1, 36, -14, -5, 29, -27, -17, 22, -25, -23, 19, -19, -28, 24, -11, -41, 25, -2, -39, 22, -5, -38, 23, 7, -38, 22, 22, -39, 17, 24, -24, 31, 35, -21, 14, 42, -12, 10, 44, -4, 7, 45, -16, -17, 26, -17, -16, 33, -13, -20, 32, -14, -29, 31, -9, -36, 23, -19, -36, 23, 4, -32, 22, 15, -45, 21, 25, -36, 14, 35, -24, 20, 33, -29, 20, 41, -19, 13, 48, -17, -2, 38, -9, 1, 39, -19, -10, 47, -11, -35, 29, -4, -34, 26, -14, -37, 22, -6, -46, 16, -1, -31, 26, 14, -43, 27, 23, -32, 19, 33, -29, 16, 39, -33, 10, 41, -21, 10, 40, -24, 0, 49, -21, -15, 46, -4, -12, 47, -5, -16, 36, -16]
5352a6k3O4l1m2O7k6m2P2k7n8Q2on4O0jn6N1J5o5N1L0p3M2K3o2K8M4o5J5M7p1
5383b7J8M5m8rO7n5j7O7n6k1O3m2k1N8l1m0P7k8n7P7j3m6N4J6p5N6J0n1M4J8n6
5414b3L9K9q0M4N1p4J2M5o5PO4p1mO0n4j6P6n5j8P0m9l8Q0l3m3P1k3n4P4j6m7
5445d1N4Qo7O1J1p9P2J8p1N0L1p2L2M3p4K9N0q0QP1o4kN7n6j0O3n0l6P8l8m0P9
5477C5l8m1P4k7o0Q5j3o5O9Qp2P4Rq6N8L0o9L6M0q5N4L6q0K4N9q2J5O7o6%O9o1
5509ck2O6m9l0P3m5l4P5m0n0R0l1n6Q0j4o4P7%p8P6J4q2O7K9r1M5M1p5L7M5o7
5540a6K1N4q6K5N9o6pP5p4JN9m9j9O7m3m8R2m1n7P9l2n0P5rp1P2Mp3P6J1p3O2
5572A8K1p9N0L9q4M3M0p1J8O2q1LP7p4MP2o6k2Q6o2k3P4n8k5Q2l5n9P6k1n9P3
$$ y = [-16, -39, 25, -6, -48, 19, -7, -49, 23, -4, -62, 20, 14, -40, 20, 19, -37, 14, 29, -36, 15, 45, -28, 14, 37, -25, 3, 47, -18, -3, 44, -27, -9, 36, -12, -21, 46, -9, -26, 41, -15, -36, 27, -15, -36, 22, -9, -49, 28, 0, -57, 20, 7, -39, 15, 31, -44, 12, 22, -29, 15, 33, -23, 16, 45, -35, 9, 60, -14, -2, 43, -22, -15, 49, -22, -26, 34, -20, -36, 40, -15, -33, 37, -12, -50, 30, -3, -46, 25, 2, -52, 22, 6, -41, 13, 21, -46, 15, 26, -53, 19, 37, -34, 16, 47, -25, 7, 50, -24, 5, 55, -25, -17, 54, -10, -12, 45, -11, -21, 42, -8, -44, 34, -4, -44, 35, -3, -44, 30, 3, -57, 28, 15, -50, 19, 27, -45, 29, 38, -48, 10, 40, -29, 7, 47, -38, 16, 52, -28, -4, 55, -27, -12, 55, -11, -11, 58, -3, -25, 41, -8, -38, 35, -10, -44, 31, -9, -59, 31, 0, -56, 24, 10, -54, 23, 23, -55, 21, 35, -47, 20, 49, -42, 3, 44, -31, 6, 51, -16, 5, 59, -27, -2, 57, -9, -16, 59, -15, -14, 45, -4, -23, 44, 1, -47, 45, 4, -53, 26, -6, -56, 19, 10, -61, 11, 15, -58, 18, 29, -44, 18, 39, -40, 10, 49, -35, 8, 48, -23, -5, 57, -24, -21, 56, -18, -14, 58, -8, -30, 56, -6, -29, 45, -13, -38, 44, 9, -50, 26, 5, -54, 19]
5603A9j1o6P7jp0O3K3p6N4L0q4O2M1q2K5N6p5K6N4q2J5P7q5k0Q6o2k2P9o2l1R4
5634E2n6m1Q9l6o4R0k2o4Q3kq0O6Qp9P0K1q5N8L1q0M6M7p8L7M1q2K9O5q3J8N8
5665E7o9nQ7q9j0R1p3l0R2n5l9Q1l6m9P8j4p7Q3j3o6Q6Lr6R3J4r0N0L8q7N2L6
5696D3q3L4O7q9K3N6p3J0P4p5j3Q2n7k8P8n0l2Q6n4n5R9l0o4Q7l3o1Q0rp8Q7Q
5727C0r5P7J5p3N2L5r5O2M9r9N2M3q5K0Q7j02J3Q2p4j9Q4o8j8Q5o1l9J01m6o1
5756d8R1l3n7Q5k7p2Q2Mq9P5J7r2P7K5j06P0M2q8L9N4q1L5N3r0J7Q4q1NP7p9L
5787hQ0p9l0R9o0l9Q7n0m2R8n0o2R9j4r0Q5kp3Q1qr4Q1K1q6N4L2r3O5N8j00L9
5818aN7q1J1R0r9RP9p8k2J06p7j4P2o5l3J12o3o5J05m1o7J06k7q1J01j8p2O5J6
$$ y = [19, 8, -58, 19, 18, -52, 11, 34, -42, 12, 42, -42, 20, 61, -21, 4, 60, -15, 11, 65, -17, -2, 75, -10, -30, 56, -6, -28, 51, -11, -42, 52, -4, -45, 44, 8, -56, 34, 12, -52, 31, 29, -51, 15, 23, -56, 14, 35, -50, 8, 39, -41, 5, 52, -26, 11, 52, -30, -1, 64, -19, -1, 57, -12, -17, 70, -19, -29, 62, -11, -41, 51, -4, -43, 38, 2, -47, 31, 17, -60, 23, 10, -56, 30, 33, -63, 30, 44, -46, 4, 42, -45, 7, 43, -40, -6, 61, -28, -5, 51, -22, -12, 62, -13, -26, 56, -1, -29, 49, -1, -33, 53, -1, -56, 43, 13, -51, 36, 3, -58, 22, 13, -65, 22, 30, -65, 12, 27, -46, 6, 41, -54, 8, 57, -42, 10, 53, -32, -12, 75, -27, -14, 68, -6, -25, 59, -9, -27, 58, -3, -42, 59, 13, -48, 43, 10, -47, 38, 11, -61, 21, 25, -64, 11, 28, -64, 13, 38, -68, 2, 44, -44, -5, 49, -32, 3, 56, -34, -17, 67, -14, -9, 68, -11, -8, 72, -7, -37, 62, 2, -37, 50, 0, -42, 56, 6, -56, 43, 29, -61, 24, 22, -51, 30, 22, -72, 9, 30, -56, -2, 30, -63, 2, 60, -40, -1, 56, -25, -14, 76, -23, -14, 65, -13, -35, 71, -6, -20, 52, -13, -46, 66, 3, -62, 43, 2, -65, 41, 14, -67, 34, 16, -56, 9, 25]
5847B5q0O7K3j02Q0K8r8N8N3r7L5O8r4K5P9j02J8R0q4j9J05p9j7R5p3l4R2n8m0
5876c6R0m3o4R9l1p2R2j9q5R9mr1P8K1q6O5L6j02N0N3q6J9O2r0K2R5r9NR7p9j7
5907b1Q1o6j8Q8o7l5J08o1m8Q9m3n8R6k9q3J03k6p5R0J3j07P6K2r2O3M7j06N7
5935bN1r2M7M2q7L0Q1r0J2Q4q0rQ0p6j7R1n9m6R5l9m3P9m2o1R8k4q0Q8kq9Q5k
5967B3r4Q2K4j05P3K7q8O2M1j02M7P0r8L5O7q5J0Q1r4NR9q8j6Q0m8m5R6n0n6R7
5997E0l2p5Q8jq4R1j8q9J04Rj00O8K7r9P0J9q4N5N8j00L9N6q9L6N7r6J3J04r9
6026b2qR2o9j9R4p0l4J13o6m8R4m5o5J01l8o8R1j1q8Q2J1q3P5J3j00O7M7r8M7
6055eM3q1L7O0j04L1P1p8J3O7q0LR8q0l1J02p0l2J01n2n1R6n1n8R8l0o6Q6j6p1
$$ y = [25, -55, 12, 35, -67, 13, 41, -57, 1, 54, -43, -8, 60, -34, -9, 70, -32, -14, 76, -8, -27, 78, -1, -18, 77, 4, -30, 62, 4, -36, 54, 11, -53, 46, 15, -57, 35, 16, -69, 30, 26, -65, 13, 34, -52, 13, 49, -53, -3, 50, -36, -17, 45, -45, -23, 72, -27, -22, 75, -4, -21, 60, -6, -24, 64, -3, -38, 70, 9, -39, 50, 7, -51, 45, 16, -67, 36, 10, -65, 25, 38, -69, 7, 29, -63, 0, 47, -59, -2, 49, -43, 4, 46, -41, -11, 70, -20, -8, 76, -4, -13, 67, -9, -26, 65, 6, -40, 55, 16, -27, 52, 10, -51, 47, 23, -57, 31, 29, -60, 25, 23, -71, 11, 35, -70, 3, 30, -58, 4, 45, -57, -10, 60, -38, -3, 64, -21, -11, 70, -24, -19, 80, -8, -24, 56, 8, -37, 59, 9, -47, 50, 18, -57, 31, 30, -54, 37, 19, -70, 34, 43, -57, 11, 38, -61, 9, 28, -56, -1, 57, -43, -4, 52, -37, -1, 56, -40, -27, 77, -22, -30, 62, -7, -26, 68, -2, -36, 77, 11, -37, 57, 12, -53, 48, 10, -58, 33, 22, -66, 16, 27, -56, 19, 32, -68, -1, 46, -52, -5, 38, -43, -6, 54, -50, -19, 52, -26, -13, 54, -26, -23, 75, -5, -36, 66, -4, -36, 65, 13, -38, 58, 7, -51, 47, 17, -49, 37, 21, -50]
6085e0O8Pr6Q3J6q8O1M1j08O8M7j02M7O0r4K5P3r4J4Q8r0jR9q0l5J04n6m1J04
6114G0n1o2R5l9n7P9k8o1Q8rq7Q3np3O2K4q5N5M8j02M4N3r4M9N1q7K0Q2q0oQ4
6145F1p5j4R4q5j4Q9n8l6J00m4n5J03o2n1Q6k3p2R9pq9P3J8r0P4J7j01P0L0j08
6174g0O4N4j08N0N8q6K3P6r7J8P6p8rJ01q4j4R7o8l1Q6m5n8R8l5o2R1j3q3R2j2
6204C1q7Q7Qq4N9J7q9O4M5j08N7M2j06N4N7j02L6Q9r7PP6o7j1Q7p4j7R6o8l8R5
6234E9m6l6P8m6n6R9k8p8R0j0q0Q9j3q6Q0J2q9N7M1r7N5M7r8M5O3r3J6P1q6J5
6264b5P9q1nR1m8l8Q7n6l2R2o4m3J04l8o5Q7k3o9Q4rr3R7jq1N8J0p4O9K0r2N5
6295dL8q4L6N7q6L5N6q5LQ8p2j2Q4p0rQ1o6l4R5m8m8J01m5n2J00k9p6Q9j3q9P4
$$ y = [-50, 18, 25, -71, 12, 28, -60, 1, 42, -66, 2, 49, -53, -6, 54, -40, -15, 58, -36, -22, 66, -24, -25, 74, -6, -41, 63, 7, -34, 70, 19, -43, 52, 13, -44, 35, 7, -54, 34, 25, -62, 21, 16, -57, 5, 29, -56, -1, 47, -55, -11, 42, -52, -3, 48, -39, -19, 63, -17, -23, 61, -14, -28, 66, -19, -33, 56, -2, -38, 62, 18, -37, 66, 4, -47, 39, 16, -56, 43, 36, -53, 20, 38, -52, 22, 39, -62, 8, 38, -70, -6, 48, -60, -10, 48, -38, -15, 61, -36, -18, 58, -20, -29, 72, -12, -26, 71, 3, -28, 58, 13, -45, 53, 18, -44, 47, 34, -49, 43, 31, -56, 31, 39, -45, 14, 31, -58, 6, 51, -57, 0, 42, -64, -10, 47, -55, -19, 70, -27, -20, 56, -11, -22, 65, -9, -26, 70, 2, -36, 59, 13, -23, 55, 9, -47, 52, 24, -54, 36, 26, -54, 35, 22, -64, 16, 28, -61, -4, 37, -60, -5, 42, -56, -11, 52, -41, -25, 46, -40, -25, 54, -27, -32, 59, 11, -27, 60, 4, -28, 64, 0, -43, 61, 23, -42, 45, 22, -47, 37, 28, -65, 32, 31, -50, 8, 18, -56, 13, 33, -59, -4, 34, -50, -14, 43, -43, -8, 48, -37, -34, 54, -18, -30, 54, -16, -25, 56, -10, -44, 51, 3, -45, 56, 11, -41, 59, 30, -46, 43, 30, -59, 15]
6326A5J4p2P1J0j03O7L0q8M0M4o6K8N2r8M8O3q2jP5p4NQ8p6j8R4n8l1P8n5l2Q6
6357E4m1m5P8j3p2O8Lp3O7jp7O5L4j08O5J6p6N5N0j11N9M4q0K2O0p9J4P6q3QP6
6388E5n8l0R5n4l6Q4m2m5R1l9n9Q2l1n0P5rp4O4K1r2P5Qp8N0M0q6M4N1j01L8N2
6419D1q7L2O7q2J1O7p2jP8o9k3R9n8l2R7o2l3Q4m4m9Q6k1o6P4j0p6Q3qo5O5Nq4
6451e3N9L0r6N7M0q3M2M8q1QP6p6OP7p4qQ9p5k3Q8n4l0R3n0m3Q6l5m7R3l6p0R3
6483E1j9p2P6%q0N5K0p9O6J3r1O6K8q4L8N3r4L9O6q2NO9p6RO2n0j2P0m8k9Q8m7
6515A1m8R5m1n7R5k8o3O5Pp5P9pq2O7K8q8N1L5r3M5L5q2L7O0r5K7O4p5J6P6r0
6546c1J1P9o9j5P5n3k5Q4n7l4Q6k2o2Q6l1n6P6j7p9R0Or0O8J9q1O4J3r7O4L7r0
$$ y = [15, 29, -43, 28, 38, -65, 2, 32, -56, -16, 28, -38, -10, 42, -56, -8, 55, -27, -28, 47, -27, -22, 66, -10, -28, 66, 8, -23, 55, 0, -32, 54, 13, -32, 46, 33, -39, 29, 32, -41, 26, 25, -52, 13, 47, -61, 4, 20, -56, -1, 49, -62, -3, 41, -39, -17, 43, -36, -22, 54, -29, -21, 55, -3, -33, 62, 8, -28, 56, 14, -31, 60, 21, -38, 44, 13, -37, 38, 29, -45, 19, 40, -52, 23, 31, -47, 3, 43, -43, 1, 52, -49, -11, 41, -46, -14, 53, -29, -18, 49, -23, -24, 54, -15, -38, 61, 3, -29, 68, 6, -27, 57, 13, -36, 50, 29, -37, 37, 27, -49, 34, 26, -39, 26, 31, -53, 6, 36, -60, -3, 37, -46, -4, 44, -37, -29, 47, -29, -23, 54, -20, -28, 61, -14, -37, 51, -3, -33, 60, 10, -33, 53, 18, -29, 64, 28, -42, 51, 32, -40, 36, 36, -44, 11, 31, -48, 18, 31, -60, 6, 34, -50, -12, 41, -53, -14, 52, -30, -25, 44, -32, -23, 39, -11, -23, 47, -1, -30, 58, 11, -37, 58, 17, -40, 55, 27, -36, 29, 36, -39, 40, 33, -49, 18, 46, -42, 9, 44, -49, -4, 31, -51, -14, 46, -49, -22, 42, -33, -17, 59, -31, -20, 59, -10, -25, 50, -3, -28, 56, -1, -35, 51, 29, -33, 53, 22, -34, 42, 25, -54, 36, 42, -48, 20, 39, -42, 22, 35, -62, 2, 39, -51]
6577e1M7L9q6L6N6r3K0P7p6nQ1p3j1R0p9jQ6n1l6Q4l5n4R0l8o1R1k5o8P8J5p9
6608c2O3%r4Q2K0r2N4M3r0M7M5q8K6O1q2J7N1o5MQ2r3LR1o7j6Q1n4j5Q3o6l9R9
6640E9m4n2P6k2n7Q6j2q1P3Pp7O3K2q7N6K1p6L2O1r0K1N8q3K7O9r2K1P4q4MQ6
6671E9p5j8R2o4l2Q7m3m3R3l2n2Q6m5n4R8k0q6Q6Kr1Q0Mq6O5K6q6N0K9q1L2O1
6702D2q6K1O9p2mP4p5JQ5p1j7R1o6l1R8n1m2R5m6m9Q6k2o2P4j5p1Q1Kq6O8J8r2
6734e3O7K4q7M6M0q8L0O5q0J2P3r3K0P6p5nP6p4lQ0n4j9Q3n6m5J04n0m0P5l0n7
6765c8P2qp3Q4qp1P0J5q8N7K1p8N0M1j00N0M9r4L1N8p0NP3p6lQ2o8k7J03p5j9
6796c5R6o2l8Q8l4n4R6k5o7Q3j8p1P6Oq8P2K1q4N4K4p9M5M6j13N2O0r5L2O3r6
$$ y = [-51, -4, 35, -51, -15, 41, -52, -32, 45, -31, -36, 45, -28, -39, 51, -28, -29, 57, 6, -30, 54, 19, -35, 55, 17, -44, 47, 22, -46, 32, 47, -32, 31, 31, -63, 19, 39, -53, 1, 44, -46, 1, 46, -42, -16, 45, -37, -20, 31, -34, -30, 52, -41, -38, 53, -14, -30, 51, -3, -18, 65, -1, -40, 59, 15, -37, 39, 17, -40, 46, 34, -47, 26, 33, -44, 19, 41, -46, 10, 31, -45, -13, 48, -42, -21, 37, -46, -19, 50, -42, -21, 53, -31, -27, 59, -16, -34, 58, -6, -38, 49, 6, -37, 56, 24, -28, 58, 13, -41, 57, 37, -49, 37, 39, -52, 28, 32, -54, 11, 37, -49, 1, 30, -51, -19, 42, -44, -23, 46, -26, -30, 44, -31, -30, 55, -16, -33, 58, -8, -39, 59, 8, -34, 61, 15, -34, 52, 30, -32, 42, 27, -44, 37, 39, -47, 21, 39, -53, 14, 38, -49, -3, 37, -51, -21, 44, -36, -24, 49, -44, -24, 52, -23, -28, 48, -26, -29, 51, -3, -22, 61, 5, -40, 64, 14, -26, 49, 19, -38, 34, 26, -47, 37, 29, -42, 28, 43, -45, 12, 33, -45, 5, 46, -54, -4, 45, -49, -18, 40, -30, -25, 48, -28, -31, 51, -17, -44, 59, -16, -35, 61, -1, -39, 49, 15, -39, 57, 32, -35, 48, 30, -41, 35, 41, -47, 25, 46, -38, 16, 40, -39, 6, 52, -61, -9, 51, -44, -12, 51, -45]
6826d5J6Q3r0LP4n0k4Q5o7j5R2n4n3R5l2n3R1k9o8R4k1p4Q0lp3O7J9j02O8K6q6
6857d6M9K9p8L6N2r0L2P0q8kQ2p8J2P2q6kQ7o0l4R1n3l8Q8l8n7J12l9o4Q7j4o4
6888c2Q2k2p6P4K0r2N3L3r1N9L8j01N0N1j01L0P3r0J1Q4q9MR0p3j3R0p8j5R0n5
6918Dm3R2m2o1R3j7o8Q9k1p0Q9Lj01Q1Rq4P4K2r4N0M1r4M2N1r3L2N6q9L3O6q4
6949c4jP9o9oP9p1j8R9o0m7J06m7n0R6l5o5J01k3p8R5nq8P6J0q7P0J9r3N4L8r3
6980d8N8L2r5L5O5r8J1Q4q8MQ6q1j6J09p1l2J04o1m4J08n9l6Q8j5q6R9j2q2R7
7009E6pq8O4J9r4P3L1r8O5K8j02N4M6r1L1O6q9J7Q1j01%R3q9LQ5p6j6R2o2k1R2
7040F2n7m7R7k3o4Q9k2p3Q2oq7R5J1j04P3K1q5M0M6r7M7M3q3L8N0q5NQ3r6J8P6
$$ y = [-45, -29, 54, -36, -33, 41, -9, -33, 52, -15, -30, 62, 8, -45, 50, 18, -35, 56, 27, -41, 53, 32, -42, 38, 35, -38, 29, 48, -54, 14, 40, -46, 3, 32, -46, -10, 42, -48, -16, 54, -34, -36, 46, -32, -20, 52, -34, -36, 51, -9, -43, 48, -5, -43, 45, 7, -50, 62, 23, -41, 46, 32, -32, 50, 28, -48, 26, 46, -46, 7, 40, -51, 8, 46, -55, -5, 46, -55, -25, 48, -42, -31, 53, -36, -32, 58, -15, -28, 62, -16, -31, 59, 4, -39, 53, 11, -50, 43, 26, -42, 47, 26, -44, 45, 48, -53, 28, 37, -47, 27, 49, -45, 5, 46, -48, -6, 45, -48, -16, 40, -49, -16, 50, -34, -35, 44, -25, -31, 48, -23, -41, 58, -2, -49, 57, 10, -40, 56, 21, -44, 57, 34, -44, 51, 46, -42, 34, 44, -43, 27, 46, -47, 7, 45, -48, 10, 42, -53, -18, 47, -51, -40, 44, -44, -40, 46, -35, -51, 58, -13, -45, 59, -2, -46, 62, 3, -33, 55, 40, -46, 53, 41, -41, 56, 49, -39, 25, 44, -50, 23, 54, -44, 21, 49, -53, 1, 47, -44, -13, 53, -36, -19, 62, -39, -39, 54, -35, -32, 53, -23, -39, 53, -9, -30, 62, 5, -42, 55, 32, -32, 57, 35, -38, 44, 38, -49, 46, 57, -47, 26, 47, -38, 2, 48, -49, -2, 41, -42, -4, 46, -39, -34, 49, -47, -29, 47]
7071D7q4JP8n3k8J02p6l6J06m7n6R6l1o5R9k3p3Q7%r0Q5J5r2O8K0r3M9N1j14N1
7101fN2r1K8P0r4J3R4j04LQ0o4k1J00p2k5R1n2m6R8m4n6J00l6o4R4j1q0R2Lr1
7131c9P9Mq6P5J6q3M8M4r8N1L8r8M8M7q3J7O8q6J0P6q0oR3p2l2J05n4m3R5m2m9
7162c7J03l2p7R3j9p1P9Kq6Q4J3j02P5L5j04N6M1r6M9N1r6L5N7r2K7N6q5J1Q7
7191E7q0j5Q7p2k0Q9o4l8J09n0m3Q6k3o4Q4j7p5R6j5q6R3J3r8O1M2j06P5L0r4
7220c8L8N7q9L4N3j00K6P7r8J0P9q0JP9p2k8R5n3l5R0m2n3R6k6o9J01k0q2J00
7249E1rp6P2J3j06P9L5q7M4N0r9L3N2r9L3P8j04K1P3q5jQ9r1kR2p6k5Q8n6l6R0
7280D1m9n7J09l4o2R9j3p8P7Mq9R0J0q2N7K6r3O7M1j01M1O3j05J7Q6r5NP8q6k
$$ y = [47, -37, -36, 42, -11, -39, 63, -13, -49, 57, 10, -46, 50, 19, -46, 53, 30, -43, 44, 44, -46, 39, 54, -38, 30, 50, -43, 6, 57, -57, -6, 46, -45, -17, 53, -41, -28, 66, -38, -35, 45, -19, -40, 60, -12, -37, 54, 2, -44, 54, 10, -46, 54, 18, -46, 48, 37, -43, 49, 52, -39, 40, 44, -42, 33, 49, -34, 14, 58, -40, 11, 49, -49, -1, 46, -37, -20, 48, -38, -28, 48, -32, -38, 55, -17, -49, 56, 2, -41, 54, 12, -37, 66, 34, -43, 50, 31, -40, 39, 41, -45, 39, 52, -50, 25, 60, -44, 12, 53, -43, 6, 57, -39, -4, 53, -39, -12, 44, -41, -30, 57, -23, -38, 49, -23, -43, 46, -18, -56, 53, 3, -40, 46, 23, -41, 43, 26, -49, 47, 32, -54, 39, 52, -46, 15, 57, -49, 26, 56, -38, 0, 57, -32, 2, 55, -45, -19, 58, -40, -30, 49, -31, -30, 49, -23, -51, 44, -9, -44, 46, 4, -49, 47, 21, -48, 53, 33, -49, 51, 42, -34, 38, 51, -55, 24, 59, -28, 16, 66, -33, 0, 52, -47, -14, 64, -40, -19, 54, -31, -32, 57, -34, -36, 56, -20, -45, 43, -13, -49, 41, -8, -65, 44, 10, -52, 47, 34, -44, 33, 37, -52, 38, 48, -34, 23, 49, -44, 23, 64, -37, 4, 67, -38, -21, 65, -30, -25, 53, -33, -35]
7310c5R5r5rR0o8k8R8n9l3R8m9n3R7l7n6Q7l1o0R2Mq1N7K5r1O0M1r5M7M7r1M2
7341IN4r9L4P0j08J6Q7r7rQ7o5k3R9o3n0R9n5m5J09n4m8R7l6n3Q8j4q5Q5Op9Q1
7372C8Nq2O8L5j03O0M7j01L9N2r1L0O7r5J8Q1r4%Q0q7j1R5p3k3R4n7n4J11n0n6
7402e7R7k1o5R7l1p1R8or0Q5Rr7Q8L0j00M7M1r5M0N7r7M5O2j06J7R4r0qR1r0q
7433c4R4o5k8Q9o1m8R8m7n9J09k9q3J03j2o7P6mq6R8J8j02O8L7r8N9M2j08O0N0
7462G0j07L0O8q9J9O1p9JQ2q1k4R6o6j9Q8o3m5J14n1n9J04m6o4J04k0q0Q9Oq7
7491d8P3K6r7P2K1r4O2M7j02L8P0r4L5N9j11L1Q2j01RP2o8j5R4p0l5J01o7l7J00
7520E3n1m8J00m1p1J04k3o9P7Op8P4Nr2P9K9j04P2L4r2N5M5r4L0P1r3PP4q9LQ3
$$ y = [-35, 60, -35, -44, 46, -22, -50, 48, -11, -44, 54, 5, -48, 49, 12, -44, 43, 12, -48, 44, 48, -33, 24, 49, -42, 18, 59, -36, 11, 58, -33, 9, 63, -36, -2, 68, -40, -24, 63, -34, -43, 44, -21, -44, 55, -8, -58, 41, -14, -59, 50, -4, -52, 45, 9, -44, 44, 30, -55, 30, 36, -43, 38, 43, -39, 29, 64, -39, 21, 68, -33, 6, 58, -33, -3, 64, -31, -13, 68, -26, -26, 54, -33, -44, 51, -22, -45, 49, -8, -62, 49, -1, -57, 40, 19, -46, 51, 20, -51, 47, 41, -49, 36, 45, -52, 36, 66, -34, 13, 54, -41, -1, 56, -41, 4, 66, -40, -23, 71, -19, -27, 64, -26, -34, 60, -5, -33, 56, -5, -53, 45, -2, -61, 48, 19, -64, 39, 27, -40, 36, 32, -54, 44, 62, -40, 28, 65, -33, 26, 68, -40, 20, 70, -37, -7, 61, -28, -9, 52, -27, -26, 56, -25, -49, 47, -19, -38, 50, -13, -58, 56, 5, -54, 50, 4, -60, 44, 24, -56, 33, 39, -48, 25, 51, -46, 26, 47, -47, 15, 62, -40, -2, 68, -26, 9, 68, -43, -12, 70, -31, -22, 50, -18, -33, 61, -9, -44, 57, -10, -47, 53, 2, -46, 54, 13, -58, 46, 23, -46, 31, 37, -41, 33, 38, -54, 25, 54, -50, 22, 56, -36, 19, 64, -30, 0, 71, -22, -15, 59, -30, -27, 56]
7551E6q4pQ3o8l9R6n5l1R6o4l9J03m4o1R5k7n2Q1kp6P8Qr8P6K2q7N4M3r7N6N9
7582G5j01L2O1r4J9P0q6LR0r9j0R6p5l0J04o9l9J00n4n5J01l9n7R1k0p5R6J3r8
7611e0R0Qr4Q0K4q7P1J3r0M5O3j06K9O0r0L0N7q8OQ8q2oQ6p6k5R6o0m3J03n9m6
7642e3R2m0n7J00k5p2Q9qp8R6j0p6P1K7j01P2K8r1N4M7j01L7N3q4K2P7r5MQ4q9
7672b7j2R9p5k9J00o6l5R3n0m1Q1k9n8Q8k2o9R1j0p6P1K6q9O5K0r1O6N0j07M4
7701HN8j02M7N4q1K0O9r6MQ0p8j8R3q2j8R8p0k9Q8m9n5J01l4o6Q6jp9Q7qp8J02
7732E1j9r1P8K8q1N6L0r9N9N2r2L8N9r6J7P2q2nR5r2j2Q9p3j1P7o4l4R3n4m4R6
7763D1m0o2R0k2p1J07pq6P8Qq0P4K1r4O7L0r0M6O0j02L3O0q5J9O8r4QR3r2oQ4
$$ y = [56, -28, -35, 48, -20, -59, 37, -18, -49, 47, -17, -56, 47, 3, -58, 37, 10, -42, 39, 37, -39, 39, 47, -51, 25, 47, -40, 14, 57, -40, 16, 75, -26, 6, 67, -27, -8, 62, -24, -21, 69, -30, -40, 56, -19, -49, 55, -14, -53, 47, -7, -62, 39, 0, -57, 34, 14, -61, 35, 48, -50, 40, 48, -46, 34, 58, -29, 42, 55, -35, 10, 73, -33, -4, 56, -34, -4, 53, -35, -29, 59, -23, -29, 57, -19, -44, 52, -8, -51, 52, -7, -53, 39, -1, -58, 42, 17, -55, 34, 26, -52, 44, 34, -42, 29, 56, -45, 27, 55, -36, 18, 65, -36, 1, 54, -30, -8, 69, -26, -22, 62, -27, -39, 60, -15, -44, 56, -10, -45, 48, -2, -43, 38, 9, -49, 39, 17, -52, 39, 29, -47, 24, 50, -39, 26, 46, -45, 21, 71, -36, 8, 66, -36, 11, 65, -16, 4, 73, -23, -19, 61, -17, -35, 58, -24, -42, 56, -14, -43, 45, -4, -59, 42, 8, -58, 28, 27, -52, 35, 27, -51, 51, 32, -59, 19, 47, -34, 22, 52, -47, 12, 64, -28, 10, 69, -27, -10, 62, -20, -25, 70, -22, -34, 55, -18, -29, 48, -16, -50, 43, -11, -55, 41, 1, -61, 29, 7, -64, 43, 36, -50, 28, 36, -44, 30, 51, -43, 24, 54, -36, 10, 70, -32, 1, 61, -24, -5, 63, -31, -23, 70, -22, -28, 56]
7794E6p5k4R7o0m0Q7m7m5Q3l9n7J06k5q3J00j4o9P7lp0P4K2r7O2L5r4O6L1q6M9
7824A7M8r9L1O0q0PP7q5lR1p3k9R3o3l5R0n7m4R7l8p5J06k7p1R1op9Q9Oq3O8J8
7856D2r0P2L1r0N0N6j03L8N9r1J4P3q4PP8p9qP4o4k2P6o0k5Q6n2m2R9l8o4Q5k1
7887Gn0P5oq8Q8ko1O1K3r7O8L5r7N7M8r6N0M5q7L1O0p9J5O2p0oP8o9k9Q4o3k5
7919c8R2o5m3J00n0n2R7k3p0Q2rp8Q7J2q9P0J7q1N8L0q7N7L6r4M9N1q0J9O7q3
7949a8J1P6r5LR1q1k2R4p2l0R2n8m6R1m3n7R9l7n3Q7j8o2Q3mp7O8K7q9O3L1r1
7980c7N8L6q4M9L8p7J6N9p7K0P1q3oQ4q0j8R3o8l7Q5m5m3Q2m2n4J00l1o0Q0j2
8010A7o3O7Nr4R0J3p8N5K7q5O3L3q4M3N0q7L6N2r1K6O0q1%R4p7qP2n7k6P9o1l0
$$ y = [56, -19, -43, 54, -6, -46, 41, -6, -51, 32, -7, -64, 42, 17, -66, 34, 20, -49, 28, 25, -45, 29, 51, -46, 16, 51, -43, 23, 54, -32, 17, 65, -34, -3, 57, -23, -16, 61, -24, -27, 64, -9, -38, 55, -8, -43, 47, -10, -54, 43, 5, -70, 36, 9, -62, 29, 23, -56, 33, 39, -44, 24, 42, -48, 24, 55, -35, 15, 71, -32, 6, 65, -26, -12, 61, -23, -16, 62, -17, -25, 49, -15, -37, 39, -21, -46, 40, -12, -54, 45, 7, -57, 28, 7, -43, 32, 26, -62, 26, 24, -37, 24, 47, -50, 18, 53, -44, 13, 61, -35, 15, 60, -27, 4, 64, -15, 0, 62, -8, -14, 64, -5, -34, 50, -13, -38, 54, -11, -54, 46, -4, -56, 41, 18, -52, 30, 21, -57, 30, 42, -47, 23, 40, -41, 17, 47, -40, 17, 53, -41, 8, 59, -21, -2, 65, -18, -7, 69, -26, -23, 68, -13, -35, 59, -13, -43, 49, -9, -55, 36, -7, -64, 35, -2, -55, 32, 14, -48, 35, 31, -46, 22, 49, -40, 23, 54, -37, 21, 57, -27, 22, 60, -17, -1, 58, -19, 1, 72, -11, -17, 67, -13, -31, 62, -6, -43, 42, -3, -46, 36, -6, -60, 40, 9, -51, 29, 17, -46, 21, 26, -68, 22, 35, -43, 12, 39, -46, 17, 50, -34, 9, 59, -28, 8, 60, -31, -5, 55, -26, -26, 68, -9, -17, 55, -2, -28, 51, -10, -40]
8042d0Q5m0m9Q1l7n0Q3j6p2P4Kp0O4J8q1P1J7r2O1M2q4L7N3p6K7N6r3L2O4q3j
8073a7P9p1pP1o1l3Q7n8m4R2m4m2Q9l8o0Q2Mq1P3Pp2P6mp1M6M3r0M8N0r4N7M4
8105F1r2L2O0q2J7P0p4lP8q1j2R1o9l0P4m6l4Q1m5n8R0k2o1P5kp0P8np7Q0J4r0
8137e2O5K8r4P3K4p9L9N1p3K1N4q4J5P6q4qR0o9j4P4o1k0Q7o9l7R4m6m4P1k0o1
8168e3R3k4q1Q5Nq1P5J1q1Q3K5r2M8M2r1L8O1j02L9O7r4K9N8
$$ y = [-40, 45, 5, -44, 37, 0, -50, 33, 17, -55, 19, 21, -49, 15, 33, -48, 23, 40, -52, 9, 51, -33, 4, 57, -19, 8, 64, -29, 3, 67, -16, -17, 62, -9, -16, 55, -6, -39, 48, -10, -54, 38, -6, -48, 41, 3, -57, 25, 29, -52, 21, 28, -44, 32, 28, -43, 3, 46, -44, 4, 54, -40, 17, 61, -31, 1, 61, -21, -4, 66, -8, -11, 67, -14, -26, 65, -4, -34, 40, -6, -40, 41, -4, -62, 28, 6, -55, 20, 18, -52, 26, 21, -56, 24, 38, -52, 13, 41, -53, 20, 44, -35, 4, 55, -18, 3, 57, -27, -12, 64, -20, -28, 62, -7, -21, 53, -8, -28, 59, -10, -47, 47, 1, -43, 28, 8, -53, 40, 16, -65, 20, 25, -56, 19, 30, -51, 32, 57, -35, 13, 55, -36, 2, 63, -39, 0, 67, -27, 2, 60]
8191F0
$$ Imaginary data points
##PAGE= N=2
##DATA TABLE= (X++(I..I)), XYDATA
0@%%%%%%%%%%%%%%%%Qj6J6j6J6j6K4l2L2m0M8n0N8o8P7q9J01j12J26j42J59j79
38i5K00k22K48k76L05l36L72m13M55n01N53o06O64p33Q09q94R91j098J218j358
58g17J523j718J956k249K620l110L783m769O347r243J6097n7515k4438J76734
72A05301j30211m8228J59175r7356o5990J60733q3221q3137J52407n4674r5606
83h0807J44600m5822j05187J49699k4135j35740J40785J3220j44992J13480L7847
94F2948j45298R5712N9633j46971O7733Q0786j33509M6091Q4152j27802L7315
105a9210R9396j31077J4276J18674j17769j1051J25113j04678l0796J34956q7396
116i562n8970J33803n8834p3495J21486m2215q0305J18781k7839r5086J11980
$$ y = [0, 0, 0, 0, 0, 0, 0, 0, 0, 0, 0, 0, 0, 0, 0, 0, 0, 8, -8, 8, -8, 8, -8, 16, -16, 16, -24, 24, -26, 32, -36, 41, -48, 53, -59, 67, -75, 84, -95, 105, -117, 131, -145, 160, -176, 196, -217, 238, -263, 290, -316, 348, -385, 424, -470, 521, -577, 641, -717, 806, -912, 1044, -1205, 1415, -1695, 2088, -2681, 3666, -5577, 10520, -46995, -71433, 105301, -24910, -73138, 86037, -11319, -77309, 83424, 203, -82934, 69473, 14799, -80807, 63793, 17971, -87216, 62483, 38348, -97392, 43393, 56613, -88379, 25101, 62948, -82350, 13362, 72995, -73976, -6243, 74543, -58966, -12875, 71277, -56525, -19210, 80186, -50891, -36615, 82059, -35710, -46761, 78352, -26326, -57122, 77834, -9562, -68532, 65271, 6437, -67058, 54428, 12213, -68092, 50689, 22850, -72236, 39744]
127C9744o778j02523J01276Q183j10694R3561K9956j20273P3534N3179j15443
138e6278N1542O4016j09267L7179P6158j05078J8154Q5561r4614L567R0091q8689
150b7658r381J00452q0507l0637J05787o2977m6692J03588m8698n9530J02893
161D6640l2162p3345R5677j4077p9356Q6401k387q4992Q1368J2610r2885P0014
173A3506K9048r4722N7115M2156r5479M4133N6499r3454K6565O7160q4956J1812
185b0617P2135p7960l98P8324p0156j4470Q2175n9855k6797Q3875n0264l9035
197d3043Q6083l7592n2256Q3277k3033o1218P7682j0232o7775P1756K283p3323
209d7391O4080J4433p6804N5721K5963p9618M6028L8051q0061L4530M8802p8155
$$ y = [39744, 32966, -69557, 31719, 39902, -70792, 22769, 52725, -67548, 5986, 59165, -56278, -4736, 59280, -49987, -12808, 63350, -41728, -23574, 61987, -32627, -29060, 61031, -27658, -37039, 63413, -17094, -47731, 58056, -4921, -51613, 51975, 3277, -56253, 46640, 14478, -58867, 36810, 22733, -56623, 29778, 27391, -57601, 23767, 36377, -56508, 13506, 42554, -52168, 4947, 47103, -48376, -4243, 52256, -41198, -14633, 52527, -32429, -20617, 51518, -26442, -26840, 51484, -18672, -33142, 49033, -10822, -37619, 46256, -4008, -43043, 43040, 5448, -46808, 36469, 13436, -47782, 29900, 19668, -48107, 23649, 25932, -47391, 16689, 31122, -45682, 10039, 36002, -43616, 2412, 40463, -39598, -5068, 43734, -34421]
221c4421K1866N7698p3544R120O4394o6749k870O8762n9414j4580P1940n0204
233h002k5659P2645m0667l5188P2812l0749m5273P1216j8626n3709O6073p094
245A7779n8862O1052L534o4545N4048J5619o7038M4713K5010o7265L7343L3868
257C5256o9069K7715M4488o6681J5879N0893o2357O732N7047n8633m887O2715
269C9098n0285j6262O3095m2032k3503O4713l5262l3958O5240k3830m2343O0763
281B5434j4222m6942N8118n521n4260N3271O964n7437M4205J5066n7771L8818
293E723K3306o0826L0234L3778n8771J9554L8716n5600J3352M5118n4957K785
305a7588N2332m8160p810N3435m2014j4206N6641l7134k4729N8573k6631l2485
$$ y = [-34421, -12555, 45143, -28401, -19281, 45113, -21636, -24506, 44256, -15158, -29738, 42202, -8002, -33661, 38984, -1683, -36871, 35941, 5192, -40081, 31135, 12509, -41200, 24873, 17779, -41083, 19969, 23503, -41042, 13006, 28625, -38413, 6300, 31310, -35955, 1388, 35256, -33813, -6098, 38390, -28291, -12412, 38481, -23876, -17144, 39903, -18730, -23617, 39098, -11187, -27449, 35646, -6386, -29889, 34824, -438, -34396, 30844, 7014, -35329, 25434, 11212, -35730, 22388, 16867, -37393, 15878, 22842, -34595, 9610, 24676, -33095, 5723, 29029, -31797, -1563, 32215, -26556, -7002, 31714, -23886, -10534, 34584, -20373, -17588, 34744, -13416, -21226, 32209, -9805, -24011, 32630, -4504, -29233, 29340, 2709, -29776]
317b9776N4883j9498l6824N4835j2230m5191N1648m53m8916M4050O535n0172M0696
330I587J4565n4672L2693K5018n2633K3250K8968n0703J8630L5578n1424Q636
342a2507M3059m5101p78M3755m0844n847M8240l7628j6157N1073k8298k3358M8316
355B3925k2941k7410N0162j7010l6560M8193n988m0173M2163o16m2218M0944O561
368A9032m8153L4789J6952m7331K6585K0716m6692K3106K7540m8427J3989L5070
380B7176m3138N477L5981m0031J379M0917l8241q431M4477k9980j5236M2559k5502
393b593j9120M4827k0754k7761M4168j1061l1787L9557o388l4389L9433l3m0684
406b6585L5058R332m1320K8560J3379m1778K5916J9803m4410J8570K7159m1260
$$ y = [-29776, 25107, 5609, -31215, 23620, 11390, -33801, 17847, 17394, -31522, 12528, 19063, -31109, 9587, 24152, -30520, 2173, 27191, -25442, -2192, 26776, -23927, -5297, 30281, -21143, -12507, 30552, -14549, -15327, 28428, -12416, -18263, 29977, -7651, -23808, 27265, -1033, -24391, 23925, 984, -26426, 23736, 6726, -29834, 18359, 12371, -27802, 14361, 13745, -28473, 12471, 19032, -29121, 5668, 22620, -24711, 1874, 22590, -24102, -996, 26544, -21883, -7894, 27176, -15962, -10485, 25496, -14535, -13156, 27761, -10480, -18911, 25566, -4414, -19650, 22909, -2593, -21713, 23114, 2360, -25401, 18767, 7706, -24081, 15476, 9088, -25301, 14132, 14099, -26585, 8473, 17805, -23515, 5045, 18424, -23354, 2562, 22365, -22045, -3475, 23684, -17576]
418a7576J1343K9458l9430P083L4593l8349j560L8717l1903q090L8123k8100j2300
431a7991M0598k3924k0013M0703j5951k4592L7754j1052k7878L7395n163l3369
443b3483L3999K634l4914K9385P016l6432K6863J3020l9020K1082J9636l7693
455a7907J5210K3074l7043J0826K8199l6250L736L2256l2275k097L3756k9444
467g959o954L6564k5747j3769L7332j9660j8466L6183j5000k2574L5797r427k7301
480b0981L3378l048k9720L0196J784l2077K7423P624l4108K2647J3155l3918J7889
493B44J7197l3768J3568K1757l3176P946K5631l1038K796K8425k8852k281L1079
506A9528k5786p767L2554k1737j2550L3114j7575j7129L3110j2788k1362L2095
$$ y = [-17576, -6233, 23225, -16205, -9122, 25471, -12878, -14438, 24279, -7624, -15714, 22409, -5691, -17991, 22607, -1317, -21330, 19373, 3422, -21170, 16584, 5532, -22346, 15049, 9886, -23483, 10516, 13150, -21764, 7621, 14637, -21795, 5068, 18088, -20932, 150, 19786, -17907, -2697, 20377, -16666, -5840, 22359, -13891, -10155, 22101, -10174, -12271, 21485, -7959, -14913, 21651, -4096, -17865, 19467, -193, -18659, 17524, 2524, -20050, 15747, 6320, -20981, 12397, 9349, -20371, 9825, 11609, -20468, 6955, 14579, -19529, 3118, 16273, -17645, 244, 17441, -16327, -2759, 18998, -14178, -6232, 19399, -11639, -8843, 19582, -9270, -11551, 19528, -6258, -14025, 18529, -3208, -15758, 17356, -219, -17348, 15762, 2974, -18388, 13707]
518A3707p743k4973L0294k459k7770K7506K641k9577K4273P407l0951K0454J2387
531A5196l1195J5730J6428l0469J1466K0046k9738O597K3644k7558J444K5602
543A7193k4922k525K7496k2697p395K9325j8662j2122K9113j4727j5359K9242
555A3960j1277j9628K8904o007k2871K6433j885k4512K5041J970k7511K2475P661
568A2753k8457J7860J1210k7900J5016J4598k8803J0745J9265k7160N405K1116
580A5648k4882K274K3373k3837k689K5998j9860p441K5468j6452r873K6275j4112
593a10j4511K6819q860j7991K4478n278j9413K4106k204k3115K2501L432k4443
606a4589J8529O347k4390J7062R584k6613J3560J4776k5665Q597J6640k4190O267
$$ y = [13707, 5964, -19009, 11285, 8826, -18944, 8562, 11203, -18374, 5899, 13306, -17645, 2809, 15196, -15999, -269, 16159, -14310, -2844, 17202, -12536, -5939, 17705, -9853, -8409, 17193, -7729, -10254, 17242, -5455, -12850, 16475, -2187, -14309, 14804, 77, -15282, 13960, 2683, -16945, 11959, 5952, -16919, 9514, 7629, -16883, 8158, 10128, -17383, 5092, 12753, -15704, 2156, 13366, -14534, 482, 15080, -13723, -2978, 16287, -10873, -5468, 15648, -9234, -6960, 16413, -7424, -10113, 15885, -3975, -11416, 14052, -2400, -12273, 14002, -110, -14621, 12198, 3338, -14653, 9825, 4547, -14866, 9240, 7036, -16079, 6422, 9854, -14589, 3940, 10287, -14103, 2959, 12543, -14070, -510, 14266, -11399, -2802, 13838, -10352, -4085]
619d085J9399k4316J510K2739k0894l103K2505j8330n213K4109j6679j0229K5203
632A2616j1484j3734K3014q434j5083K3308n729j9166K2142k53k0581J8682K220
645G518k0915J7992N422k3687J4870J0554k2968J0588J2093k2326R216J5199k3478
658i922M811J9021k0735N49J9169j9066j219K1488j8243o266K3154j3633r659
671a0551K1608j1309j1232K2731q917j5797K2081l537j7439J8999j275j8058J8738
684F042J817k1046J5938O792k0550J2080Q258k0226J1057J1386k1763P011J5266
697A2062j9483L146J5608j8262J682J7992j8073k779K0113j4428o062J9310j2634
710a808p725K0841j0824j2083K0921o281j4089J8772m199j5169J8972j447j8358
$$ y = [-4085, 15314, -9002, -7492, 15247, -5647, -8750, 13755, -4575, -9788, 14321, -2358, -12587, 12616, 1132, -12602, 10412, 1978, -13105, 10203, 4474, -14692, 7450, 7197, -13384, 5298, 7518, -13397, 4595, 10017, -13670, 1200, 11754, -11214, -626, 11467, -10859, -1643, 13556, -9922, -5111, 13910, -6825, -6276, 12893, -6173, -7392, 14096, -4147, -10413, 12741, -892, -10551, 11057, -252, -11484, 11247, 2330, -13467, 8614, 5077, -12362, 6637, 5362, -12696, 6042, 7859, -13187, 2751, 9543, -11007, 1073, 9331, -10895, 162, 11548, -10215, -3204, 12062, -7421, -4275, 11333, -6929, -5247, 12745, -5328, -8107, 12006, -2422, -8484, 10826, -1808, -9533, 11308, 484, -11599, 9322, 3041, -11048, 7724, 3525, -11644, 7328, 5881, -12477]
723a2477J6972L164j8679J3766N147j8800J2557Q146k0212R163J1754j8766N718
736b547J2775j7895L939J5126j7615J10J7165j4909l021J7168j3181m979J8443
749A0579j1505q583J8825q165j0760J7859o159j2420J8083l671j5207J6877kj6233
763a0482J4746K223j7036J3572N060j8310J1048Q157j8007Q337J0027j7722O206
776b181J2408j7306K941J4284j5521J40J5145j4055k290J6369j2339n326J6903
789I172r794p692J6721p667r774J6699n223j1938J5899k535j3417J4750j73j4679
803i651J3609K428j5845J1834M988j6367R921P286j6611P796R464j6406N461J1370
817I277j5833L024J3040j4817L74J4314j3289k084J5182j1680m663J5813r465
$$ y = [-12477, 4495, 7659, -11020, 2746, 7893, -10907, 1650, 9796, -10416, -1253, 10501, -8265, -2547, 10228, -7667, -3728, 11398, -6217, -6107, 11058, -3851, -6872, 10296, -2885, -7864, 10579, -926, -9509, 9316, 1151, -9609, 8250, 2091, -10329, 7754, 4083, -11124, 5753, 5751, -10482, 4264, 6487, -10549, 3023, 8083, -10227, 821, 8978, -9029, -692, 9335, -8387, -2181, 10227, -7079, -4138, 10146, -5375, -5235, 9910, -4145, -6435, 9934, -2405, -7731, 9172, -622, -8314, 8407, 740, -9034, 7665, 2442, -9496, 6403, 3868, -9549, 5201, 5028, -9651, 3958, 6386, -9459, 2375, 7363, -9004, 917, 8203, -8408, -612, 8852, -7554, -2093, 9277, -6556, -3532, 9508, -5309, -4935, 9379, -3910, -5994, 9188, -2492, -7155, 8658, -807]
830h07p038J5641p236q819J5399n202j0845J4958k439j2479J3493k1j3277J2353
844C681K063j4439J0881M748j4979Q712O695j4798P111Q541j5232M893J0880j4386
858e629K185J1899j3188M82J3059j2611k082J4531j0590m726J4346q662o120J4717
872G611p253q606J4860m330j0473J3326k185j0987J2806n06j2852J1771K589j3501
886g730R388M315j3261Q321N994j4212O347Q681j3485L544R455j2496K493J0808
900H162j2669qJ2748j0882k705J2617r305l685J3387q617o325J4148n868q295
914g297J2896m133q921J3012k735j1197J2444M97j2091J0144K007j1963R604L658
928E925j3370P848O546j2920N115P392j2099M204Q890j2533J677J0942j0781q10
$$ y = [-807, -7845, 7796, 560, -8259, 7140, 1938, -8907, 6051, 3612, -8867, 4626, 4605, -8672, 3681, 5744, -8695, 2186, 6934, -8045, 667, 7362, -7436, -325, 8216, -7016, -2123, 8757, -5629, -3444, 8455, -4733, -4251, 8808, -3803, -5885, 8646, -1944, -6670, 7676, -986, -7106, 7611, 358, -8248, 6612, 2282, -8191, 5135, 2950, -8037, 4769, 4263, -8589, 3182, 5771, -7730, 1658, 5973, -7288, 1033, 7027, -7185, -838, 7843, -5642, -2098, 7357, -5139, -2646, 8162, -4507, -4515, 8233, -2649, -5354, 7263, -2042, -5727, 7660, -957, -7282, 6866, 998, -7297, 5599, 1466, -7455, 5557, 2822, -8375, 4069, 4566, -7525, 2619, 4626, -7337, 2267, 5925, -7445, 403, 6949, -5971, -856, 6536, -5563, -1359, 7531, -5002, -3325, 7617, -3164, -3974]
942c974J0773r586j685J1838r171m327J2843o594o271J1771n270o910J2385m061
956A761r377J2068j136j0272J0304K7j0491J0298J664j2339Q787M602j2030O443
970C09N357j1672N780P037j2396L444R180j0878J123R143j0108L49J0533r816
984b615k405J1565p379m186J0660o304m828J1478n339p351J1433k566q323J0026
998C866j592q804J0267r6j0685R113K658j0682P211L367j0743O925N100j1820
1012e915M907P346j0854K858P697j0364K059R123j0361m16J0378q359k179R928
1026E848p438l071J0765o520n447J0994m041o673R872k919p296J0038j521q995
1040f404R182P96r333P740J795r579P297L362j0587N719N386j0136M084O104r972
$$ y = [-3974, 6799, -2787, -4472, 7366, -1805, -6132, 6711, 117, -6154, 5617, 347, -6563, 5822, 1761, -7616, 4452, 3316, -6956, 3348, 3375, -7116, 3182, 4846, -7493, 1294, 5896, -6134, 309, 5666, -6006, -226, 6811, -5585, -2141, 7039, -3839, -2716, 6427, -3681, -3332, 7201, -2615, -5020, 6545, -834, -5020, 5640, -664, -5492, 5986, 647, -6704, 4729, 2163, -6160, 3866, 2274, -6530, 3737, 3641, -7044, 2069, 4727, -5955, 1256, 4623, -6120, 805, 5905, -5915, -1008, 6338, -4516, -1658, 6039, -4325, -2266, 6857, -3504, -3920, 6458, -1901, -4080, 5848, -1590, -4661, 6104, -416, -5863, 5131, 1090, -5583, 4289, 1370, -5926, 4112, 2591, -6404, 2778, 3574, -5759, 1981, 3776, -5803, 1494, 4856, -5731, -12, 5374, -4762, -678, 5426, -4546]
1055d546L190P439j0082J309Q805q936l81R044q182j553R912p333l548J0269n563
1070a56m920R940m360n955J0008l007p481R473j029q192Q462L39q764P681J881
1085C920r419O444L554r459N109M725r491L942O027r404K419P118q850R80P934
1100E549q220m07Q619p433j927R119o401l283R480n309m708R559l984n914R360
1115D100k610o983Q941j127p846Q189L70q425P316J760r003O295L421r170M836
1130F4M624q971L619N640q847K324O836q298O74P446p487m68Q026o926j973Q724
1146E007n716l481Q670m558m345Q752l763n666Q873k151o724Q118r15p204P753
1161B650J64q229P118K065q654N635L149q457M953M154r032L717N816q562J935
$$ y = [-4546, -1356, 6083, -3999, -2690, 6115, -2821, -3202, 5842, -2340, -3893, 6019, -1314, -4862, 5407, -156, -5076, 4864, 504, -5451, 4557, 1550, -5931, 3542, 2513, -5679, 2783, 3122, -5642, 2039, 3920, -5499, 945, 4499, -4960, 149, 4874, -4617, -675, 5352, -4052, -1633, 5485, -3365, -2385, 5549, -2671, -3078, 5541, -1892, -3819, 5300, -1101, -4384, 5096, -213, -4921, 4638, 654, -5260, 4100, 1490, -5493, 3448, 2321, -5525, 2664, 3034, -5391, 1925, 3685, -5318, 977, 4398, -4772, 64, 4688, -4283, -664, 4976, -3871, -1547, 5289, -3009, -2335, 5111, -2376, -2844, 5182, -1744, -3717, 5007, -709, -4190, 4480, -78, -4423, 4329, 566, -5100, 3773, 1622, -5102, 3016, 2101, -5103, 2650, 2814, -5415, 1703, 3768, -4886, 749, 3898, -4559, 394, 4548, -4484, -767, 5049, -3513, -1578]
1176a578O363p732J051P022p629n54Q120o296k249P889n192k875Q196m693m447
1191d604Q624k918n683P668j761n854P612j046p175P294Q90p708N901J864p585
1206d481N599K722q568M611M648q264K885N097p695K420N884q069R22P319o935
1221a905r01P201n945j411P750n674l186Q349l886m478P527k821m723P646k189
1236A354o215P456j51o825O062P60o770N916J648p833N027L493p689L473L931
1251C637p301L242M841p928J824O329p000K05O318o302j92P034o281j901P874
1266D399m735l190P308l956l600P739l247n239P617j317n911O427n11n996O447
1281B235M68p225N535K360p159M127K875o961L850L882p584K440N316o717J030
$$ y = [-1578, 4785, -2947, -1896, 5126, -2503, -3057, 5063, -1233, -3482, 4407, -785, -3660, 4536, -157, -4604, 4020, 1102, -4581, 3087, 1326, -4528, 3084, 2038, -5137, 2157, 3047, -4661, 1240, 3104, -4481, 1118, 3840, -4728, -117, 4531, -3733, -848, 4249, -3446, -1026, 4858, -3211, -2289, 5030, -1905, -2806, 4395, -1550, -2961, 4789, -885, -4071, 4278, 392, -4086, 3441, 620, -4103, 3543, 1354, -4861, 2595, 2444, -4381, 1681, 2441, -4329, 1587, 3235, -4598, 429, 3922, -3767, -294, 3637, -3664, -422, 4419, -3509, -1685, 4644, -2356, -2151, 4167, -2135, -2327, 4707, -1574, -3475, 4399, -336, -3526, 3782, -174, -3774, 3965, 718, -4521, 3096, 1779, -4132, 2295, 1784, -4212, 2235, 2703, -4522, 1013, 3373, -3786, 341, 3216, -3745, 105, 3987, -3597, -1157, 4159, -2558, -1528]
1296a528N330o312O66O227o335r57P082n034k158O712m445k548P331l938m140
1311d047P386k304m820O571j650n161O799p26o454O121J067o593M930J629o620
1326c872M661K693p251L439M134o758K115M419o435J612N334o423P6O186n326
1341a396j092O096m800j619O649m354l013O918l005l863O448k334m338O576j495
1356A378n381O189j11n805N411N73o063N151J573o681M253K815o575L197L465
1371C389o473K482M317o413J290N162n773J93N450n281o65N964m695j822O280
1386C405l734k777O159k922l461O137k066m286N937j062m906N548j30n428N099
1401A513Q07n846M509J734o035L816K552o169L035L379o105K189M118n969J271
$$ y = [-1528, 3802, -2510, -1844, 4383, -1952, -2909, 4173, -861, -3019, 3693, -752, -3300, 4031, 93, -4047, 3339, 1035, -3785, 2786, 1136, -4025, 2774, 2048, -4406, 1715, 2782, -3811, 1119, 2748, -3872, 789, 3482, -3769, -330, 3804, -2954, -839, 3580, -2855, -1243, 4091, -2332, -2256, 3930, -1396, -2488, 3608, -1192, -2811, 3838, -516, -3529, 3389, 384, -3479, 2969, 635, -3703, 2873, 1378, -4003, 2186, 2075, -3730, 1681, 2254, -3809, 1342, 2915, -3766, 487, 3302, -3273, -76, 3389, -3084, -602, 3715, -2698, -1408, 3754, -2019, -1826, 3624, -1657, -2322, 3642, -1053, -2875, 3405, -329, -3106, 3053, 131, -3330, 2807, 741, -3545, 2392, 1330, -3576, 1972, 1842, -3586, 1513, 2320, -3526, 983, 2717, -3318, 498, 3050, -3119, -84, 3295, -2810, -621, 3497, -2472, -1201]
1416a201M810n596K32N271n026o67N608m473j597N924l658k596N864k786l273
1431c164N816k008m061N660r12m733N071K0m980M665P45n478M198J833n712L278
1447B38K556n580K714L170n762J948M126n478Q47M449n029L01M899m919o35N540
1463C385m147j746N446l377k185N570k965l146N750j810l927N131r70m112M977
1478A874l93m904M665R57n184L580J595m985L272K139n475K610L312n261J422
1493g76L618m795J076M053m993J34M936m240r81M773l631j215N077l555k260N561
1509B782k424l142M979j743l267N063j326m230M972L5m654L967O43m485L844J144
1525B158n228L268K499n070K030K816m629J753L280m957Q53M268m279k75M137
$$ y = [-1201, 3609, -1987, -1755, 3516, -1510, -2177, 3431, -1042, -2639, 3285, -373, -2969, 2895, 109, -3164, 2652, 644, -3417, 2243, 1331, -3402, 1669, 1689, -3291, 1374, 2119, -3359, 839, 2672, -3040, 238, 2794, -2786, -72, 3098, -2664, -716, 3410, -2068, -1221, 3228, -1801, -1500, 3399, -1520, -2155, 3385, -762, -2508, 2938, -439, -2624, 2946, -19, -3165, 2585, 775, -3152, 1979, 1009, -3103, 1874, 1481, -3423, 1242, 2199, -2985, 595, 2190, -2795, 477, 2616, -2859, -249, 3063, -2198, -776, 2842, -1953, -877, 3176, -1817, -1683, 3253, -987, -1968, 2805, -826, -2041, 3036, -519, -2779, 2782, 358, -2784, 2195, 452, -2815, 2248, 922, -3308, 1664, 1699, -2955, 1012, 1655, -2830, 1014, 2158, -3070, 198, 2697, -2373, -343, 2473, -2156, -403, 2877, -2080, -1227, 3041, -1238, -1513, 2624]
1540B624l728m84M525l734j555N073k670k413M558k107k480M788j893l490M870
1555A884o59l949M070j56l913M104L22m720L649J605m712K638J906m481K527K431
1571B546m934J679L478m406O27L472l962L74L957m015o98M528l030j523M156k576
1587c27j712M486k300k729M558j163l199L926p54l246M046k74m070L686Q48m136
1603b360K928J118m105K914J728m656K163K708m281J305K775m035J116L314m171
1618a539J36L951l410o63L806l038r67M205k752j965M319j756k446L853j328k641
1634b235L981q25l436L683K06l591L037N67l653K965J127m128K378J974l933J704
1650a79K160l835J490K686m003P33L300l525L0L362l245l32L726l045j121L986
$$ y = [2624, -1104, -1588, 2937, -797, -2352, 2721, 51, -2362, 2196, 89, -2391, 2397, 504, -2986, 1884, 1225, -2724, 1346, 1190, -2723, 1381, 1703, -3017, 632, 2237, -2475, 163, 2069, -2412, 115, 2546, -2388, -709, 2769, -1637, -1010, 2462, -1500, -1126, 2831, -1184, -1882, 2646, -384, -1907, 2249, -327, -2039, 2447, 147, -2582, 1976, 813, -2386, 1540, 786, -2460, 1586, 1312, -2758, 928, 1776, -2360, 568, 1686, -2419, 495, 2223, -2433, -270, 2438, -1843, -538, 2237, -1798, -682, 2632, -1539, -1403, 2548, -862, -1525, 2281, -757, -1724, 2481, -271, -2236, 2083, 327, -2119, 1734, 406, -2235, 1746, 921, -2515, 1168, 1374, -2217, 820, 1387, -2266, 699, 1826, -2302, 76, 2050, -1883, -179, 1981, -1854, -364, 2322, -1681, -948, 2352, -1173, -1143, 2219, -1026, -1358, 2368, -677, -1798, 2188]
1666B188k386j669L830j944k063L944j427k725L753o03l067L327p5l262L116M99
1682A436l618K675J228l693K121J675l665J694K150l658J116K632l454N37K929
1697B105l224L4L211k983n06L457k636j074L617k217j570L623j751j992L581j292
1713C83k428L505p04k834L211j17l088K966M00l370K621J041l482K062J506l378
1729a706J636J883l408J138K451l243M29K732k889NK943k767n09L272k348j117
1745a498L222j901j360L256j680j886L403j050k378L070n44k474K958k73k903
1760b038K886M44l173K332Q74l089K111J196l346J713J918l245R48K159k900O62
1776e48K402k992J33K949k555o14K889k088q03K976j991j396L251j309j951K859
$$ y = [2188, -198, -1867, 1963, 19, -2044, 1900, 473, -2252, 1501, 898, -2169, 1158, 1083, -2179, 937, 1436, -2182, 493, 1721, -1972, 149, 1824, -1841, -147, 2003, -1655, -539, 2093, -1361, -824, 2105, -1119, -1085, 2126, -857, -1363, 2094, -542, -1616, 2001, -216, -1786, 1837, 86, -1906, 1675, 383, -2045, 1460, 756, -2078, 1133, 1016, -2072, 894, 1294, -2076, 545, 1586, -1896, 166, 1672, -1706, -70, 1813, -1595, -457, 1994, -1249, -820, 1912, -977, -972, 1971, -796, -1305, 1967, -381, -1498, 1724, -177, -1537, 1719, 39, -1847, 1556, 506, -1872, 1198, 654, -1820, 1138, 865, -2038, 848, 1292, -1881, 451, 1325, -1764, 347, 1543, -1803, -90, 1828, -1417, -469, 1690, -1210, -548, 1854, -1138, -1005, 1944, -611, -1225, 1664, -424, -1227, 1749, -242, -1638, 1613, 304, -1647, 1212]
1792A212q35j952K854o96k491K890Q4k810K301M77k666K249O48l097J995J433
1808A596l056J279J606k775J194J846l080O98K557k710q9K496k290j68K659k372
1824f09p83L086j703j429K733j247j422K817j139k083K906k87k450K329O7k304
1840a518K320K34k805K138J060k868J451J236k603J410J468k962R84K166k681
1855i70K87K131k364K49K383k546l16K830j994r20K592j611r72K748j524j615
1871a612K880p51k007K426m21j997K479j82k526K300O06k600J641Q41k431J602
1887B48J105k757J178J743k554N82J806k353M95K087k467o6K512k013n57K332
1903A321j773o14K564j712j208K725j104j562K426q42j611K528n82k162K390Q7
$$ y = [1212, 377, -1575, 1279, 583, -1908, 982, 1066, -1744, 557, 1034, -1632, 617, 1265, -1832, 163, 1596, -1460, -181, 1425, -1350, -156, 1690, -1390, -692, 1865, -845, -934, 1562, -728, -896, 1763, -609, -1392, 1694, -9, -1438, 1295, 48, -1374, 1443, 304, -1779, 1127, 840, -1610, 719, 786, -1518, 802, 1036, -1769, 369, 1429, -1439, 12, 1248, -1355, 55, 1523, -1439, -455, 1711, -970, -683, 1448, -916, -667, 1716, -830, -1146, 1684, -310, -1230, 1362, -249, -1221, 1527, 3, -1612, 1268, 517, -1490, 936, 515, -1482, 997, 815, -1711, 589, 1195, -1405, 236, 1077, -1354, 248, 1353, -1404, -226, 1517, -1037, -455, 1351, -1002, -507, 1580, -887, -953, 1559, -454, -1011, 1321, -452, -1066, 1498, -214, -1422, 1303, 199, -1363, 1063, 221, -1390, 1138, 556, -1606, 784, 871]
1919H71k258J936L18k266J900O65k602J505J279k460R61J395k344Q18J758k439
1935i63K84K147k076j75K088j880l12K331j806q53K486j279j191K298j045j341
1951a287K415q16j778K356k72j968K052m8k050K037K93k347J738P95k314J315
1967A21J012k288J142J331k376P13J711k176K93J838k010oK049j846m43K213j497
1984b19q17K186j231j080K247r49j405K211n76j675K079k56j816J936O4k016J778
2001D61M05k125J545P27k200J288J016k213J030J293k204O95J577k100L09J772
2017A276j914J8J912j785l41K099j509p62K122j174r97K092r35j303K115n40j598
2034a224J906j90j694J793N4j916J671M89k052J299P72j956J134R48k106R35J354
$$ y = [871, -1387, 549, 867, -1399, 501, 1166, -1436, 69, 1348, -1112, -151, 1244, -1100, -282, 1476, -963, -679, 1468, -608, -783, 1305, -575, -887, 1444, -362, -1215, 1271, -8, -1199, 1099, 54, -1287, 1128, 312, -1466, 890, 618, -1350, 702, 654, -1396, 641, 934, -1413, 325, 1120, -1194, 121, 1133, -1155, -13, 1318, -1058, -345, 1366, -810, -517, 1321, -689, -695, 1354, -492, -935, 1278, -219, -1036, 1150, -81, -1161, 1086, 137, -1268, 943, 367, -1308, 771, 515, -1301, 635, 699, -1317, 461, 866, -1259, 286, 1013, -1187, 101, 1117, -1096, -66, 1227, -977, -282, 1295, -805, -496, 1276, -638, -620, 1292, -493, -834, 1265, -244, -1006, 1116, -58, -1055, 1037, 102, -1201, 914, 374, -1224, 682, 492, -1202, 591, 645, -1271, 400, 889, -1163, 136, 908, -1048, 86, 1034, -1072, -137, 1217]
2051A217k068N11J483j861L12J627j889K1J947j654m52J906j348n70J943j277
2067a52q97K097q50j321J913n09j351J842l50j669J799J71j839J389M37j745J275
2084B40O16j982J113J098j936O06J206j722N21J343j859K27J737j633k38J675
2100A012j360k80J744j416o30K011j003j026J761p11j000J786o74j376J878j53
2116E63j606J471Q5j517J475K12j835J315P73j817P93Q89j606P61J010j831M70
2133c95J502j592n2J434j331n8J525j428m05J825j031p93J564p86p18J641q07
2150I5j122J789l31j369J435j24j256J469p9j593J417M28j632R86N48j510R90
2167A41O78j742P27J170j570K53J138j352K38J274j469j22J591j135n15J453r04
$$ y = [1217, -851, -340, 1143, -718, -406, 1221, -668, -647, 1300, -354, -806, 1100, -248, -818, 1125, -152, -1049, 1048, 198, -1123, 790, 281, -1070, 772, 422, -1247, 552, 723, -1116, 273, 710, -1035, 240, 856, -1126, -13, 1085, -851, -245, 961, -761, -240, 1103, -756, -529, 1208, -425, -663, 1012, -348, -628, 1116, -300, -930, 1081, 78, -948, 813, 102, -898, 888, 214, -1162, 716, 563, -1043, 428, 513, -1004, 471, 683, -1152, 163, 936, -881, -88, 801, -805, -44, 966, -865, -395, 1107, -485, -537, 897, -434, -492, 1033, -395, -800, 1025, -6, -799, 765, -21, -739, 902, 95, -1027, 762, 431, -938, 497, 373, -883, 586, 507, -1086, 331, 759, -873, 113, 661, -849, 141, 819, -923, -196, 974, -596, -343, 795, -557, -319, 955, -514, -636, 955, -180, -695, 758, -146]
2184a46n12J533q94q80J631m55j103J362k74j061J399j94j367J352K38j458J041
2201B12L40j345J030M88j591Q40Q51j481M91Q91j350M48J061j486J36J351j231
2218c45j64J265j063k44J389j008n91J498o65q02J315m72q63J374l27j177J310
2235D30M8j253J063J82j220J037L37j425Q63O42j349O01P25j304N24Q93j362K61
2253c07J107j216L9J103j116m6J256j104l17J340q40n32J282o88o41J338n37q99
2271g78J291k26j031J149n8j097J095J45j246R51L91j252P23N56j250O01P38j254
2289e52L80Q93j193J83J010j104J3J104j027j75J175r01l42J192p36n21J210n97
2307A2o51J213m48q28J185k43r55J099n7j010J000R5j111Q98L30j171O96N13j125
$$ y = [-146, -658, 875, -19, -899, 732, 277, -826, 536, 262, -799, 600, 406, -961, 391, 629, -829, 212, 552, -793, 237, 725, -866, -26, 825, -656, -165, 726, -624, -176, 885, -601, -465, 886, -345, -509, 756, -307, -551, 838, -170, -761, 737, 72, -730, 585, 113, -750, 624, 297, -880, 430, 478, -775, 288, 470, -750, 287, 624, -801, 62, 704, -645, -44, 681, -623, -99, 794, -568, -307, 800, -416, -377, 726, -390, -436, 820, -284, -601, 739, -101, -633, 649, -39, -680, 658, 121, -778, 513, 287, -744, 405, 347, -750, 345, 490, -756, 195, 586, -666, 57, 613, -637, -36, 702, -552, -172, 721, -472, -289, 721, -383, -370, 734, -293, -468, 707, -194, -536, 656, -80, -601, 609, 12, -639, 574, 126, -702, 483, 240, -715, 384, 327, -683, 317, 412, -699, 199, 529, -642, 54, 567, -558]
2326e58N39O47j170L82Q55j123J33R34r62oJ000r48j73J123q05m02J108o13n02
2345e41J116n61o53J154l36q27J043j60q36R89j03r78R92J53j083P60L17j011
2363e65P01L76j114N72O53j094K91P46r66K40P85j028P1J010q74k47R90o69k91
2382d13R83o67m68J120m39p07R82k45o81R66k32q61R93N3r77P61J71q71P41K07
2402D16j038O96M85j041M04N51r21M14O01j051K68Q48r13m1Q27p56k6Q78q29k45
2422d73J065n97m96R26m01m80R31m01o97J008j07q24P71J4p49Q01M6r46P51L61
2442E03r81M70M16q43M84M41j000M06O88r15J14O81p81J45P22q77l9R47o95k75
2462c89Q06n32k44Q65n70m65R84l15o37Q03j84n85Q13j47p94Q08J55q46N74K17
$$ y = [-558, -19, 628, -542, -160, 695, -428, -295, 639, -323, -329, 671, -277, -450, 673, -132, -534, 574, -39, -541, 575, 14, -639, 515, 179, -648, 395, 235, -601, 388, 285, -693, 299, 452, -631, 129, 446, -565, 136, 512, -602, -30, 623, -471, -180, 566, -400, -160, 625, -403, -332, 678, -196, -443, 547, -122, -413, 570, -97, -565, 555, 116, -591, 391, 146, -535, 431, 199, -662, 331, 384, -593, 168, 339, -532, 209, 416, -622, 74, 559, -482, -78, 473, -448, -34, 567, -484, -216, 632, -281, -322, 505, -251, -277, 601, -228, -473, 592, -5, -501, 425, 24, -456, 475, 74, -623, 385, 278, -546, 225, 239, -510, 291, 337, -609, 142, 503, -478, -8, 408, -435, 49, 490, -510, -104, 584, -331, -217, 464, -317, -172, 550, -327, -366, 581, -114, -389, 417, -115, -359, 506, -64, -529, 455, 140, -497, 306, 122, -463, 350, 203, -591, 217, 372, -474, 100, 317]
2482C17p49N60K88r16M65N57q74K32N65p80K29O10q40Q3P88p05j41P38o08j05
2502b86P79o31l12R06m35m44P73l39m30Q10l10o08Q23p4o82O59J8o73O64J10q14
2523d96N73L22p90L80L80p44L65M67q19K10O34p14K7O36o34k8P08o36j84P75m82
2544e0k99P31m30l17P73l67m93P75j92n60O98j18n95P09l5p03O33J31p01N16K02
2565C08p08M74L08p70L49M65p27K11M98o83J32N94o63j8O60n58j47O66m81k34
2585c24P17m09l62P15k95m29O91k11n08O76j11n80O46j3o28N80R7o72N26J90o81
2606c85M47K59o92L54L88o98K66M59o75J46N42o45M9O11n68j14O50m84j77O56
2626C89m36k93P08l23m18O71j98m69O37j35n57O38%o15N23J12o03M76J53o66M49
$$ y = [317, -432, 128, 416, -500, -35, 522, -352, -120, 445, -335, -106, 504, -336, -253, 535, -170, -311, 427, -181, -286, 493, -138, -450, 456, 21, -423, 350, 11, -419, 391, 81, -527, 296, 222, -460, 199, 217, -456, 208, 318, -496, 77, 399, -391, -11, 369, -375, -10, 457, -362, -152, 482, -232, -205, 431, -203, -231, 477, -159, -343, 432, -50, -349, 382, -48, -365, 408, 41, -452, 323, 131, -429, 269, 151, -444, 265, 230, -473, 160, 291, -410, 106, 308, -400, 74, 382, -388, -39, 426, -301, -90, 408, -275, -143, 451, -212, -230, 430, -128, -275, 391, -90, -324, 393, -16, -378, 337, 42, -387, 304, 93, -415, 261, 150, -430, 216, 203, -425, 155, 252, -420, 106, 296, -385, 62, 321, -371, -17, 371, -327, -61, 398, -277, -131, 411, -234, -185, 426, -142, -256, 394, -90, -267, 389, -47, -340, 368, 45, -373, 298, 100, -369, 268, 133, -424, 214, 214, -401, 122, 234, -369, 107, 260, -406, 43]
2647D3L06o82K88L77o30K52M06o65J79N43o32K3N54n19k3N75n45j31O70m07l02
2668c20O33l01l02O24k97m21O73j26n36N39nm95N11K6o07M99K13o44L22K83n62
2689b93L15K93o38K41M65o23P3M87n16P5M89n67k6O13m66j81N51l60j63N79m05
2710e7k83O59k14m27N45j29l84N46j30n21N67Q1n75L89J38n11L97J59o14L55L56
2731C47n93J57L62m84J57L77n62P2N33m84j03M97l76q0N19m41j92O12k84l16N05
2752B23k04k67N31k38l97N83n6m79M42j0m17M64J5n42M27K10n57K59K32m75K71
2773A5K79n83J76M50n02PM11m12L0M57m75j00N57l48k02M78k73j96N15k83l19
2794c18N60j32l89M45q4l46M63o6m64M60Q5m89L51J17m59L52J52n37K96K91n07
$$ y = [43, 349, -333, -45, 332, -298, -46, 360, -305, -126, 417, -215, -192, 362, -157, -180, 395, -150, -281, 389, -18, -320, 313, 12, -290, 334, 37, -384, 289, 163, -373, 166, 161, -334, 177, 203, -404, 95, 308, -336, -14, 269, -293, 22, 315, -323, -82, 383, -240, -167, 320, -196, -121, 368, -199, -225, 388, -78, -259, 292, -68, -231, 348, -57, -340, 319, 105, -322, 223, 94, -290, 256, 126, -395, 172, 253, -322, 67, 205, -306, 91, 250, -364, -9, 347, -246, -89, 273, -211, -54, 323, -239, -167, 366, -118, -221, 276, -100, -180, 339, -102, -294, 318, 34, -282, 223, 19, -248, 283, 45, -352, 231, 175, -304, 138, 128, -289, 175, 190, -352, 75, 285, -272, -13, 219, -256, 15, 294, -289, -113, 337, -165, -158, 253, -159, -129, 328, -147, -247, 310, -38, -240, 238, -35, -231, 284, 1, -318, 242, 110, -279, 166, 82, -264, 199, 133, -331, 129, 214, -275, 76, 193, -266, 86, 238, -299, -3, 288, -219]
2815b19J62K99m50J44L60m87L5M47l92p9M33l53r8M81l34k02N01k14k72M38j79
2836B1k68M55j22l82M53pm11L77L1l98L51J01m64L09J78m58K60J92m48K21K66
2857B57m64J33L32m21O9L36l84J6L95l81o8M25k98j46M26k56j92M38j95k66M18
2878A74j11k98L86m6l56L82ql61L29Q0l94K74J29l96K39J90m08J89K26m05J43
2899d2K66l71P8K94l51K3L28l27l8L63l07p9L61k39j22L56k19j85L89j45k55L78
2921A56q3k89L54n2l03L16L7l39K62Q2l33K33J23l65J97K08l61J12K24l15Q9K48
2943B01l43N5K93l01j7K95k55m1L03k61j00L56j91j69L17j45j64L30j52k11L43
2964A43o3k63K64nk49K74J4l22K55J20l39J70J34k81J67J42l30J22K48l10L8K31
$$ y = [-219, -57, 242, -208, -64, 296, -191, -156, 291, -101, -180, 253, -100, -198, 283, -51, -253, 248, 34, -238, 200, 21, -247, 208, 86, -296, 157, 150, -261, 116, 147, -251, 100, 201, -263, 46, 224, -234, 26, 218, -230, -9, 257, -207, -74, 258, -163, -94, 242, -142, -126, 269, -112, -180, 245, -53, -199, 227, -29, -221, 217, 22, -244, 174, 63, -235, 151, 105, -251, 131, 123, -238, 91, 171, -223, 51, 180, -216, 23, 213, -195, -6, 220, -185, -42, 224, -147, -69, 225, -126, -103, 225, -102, -140, 223, -84, -163, 198, -41, -163, 193, -26, -211, 178, 33, -222, 156, 73, -216, 138, 86, -217, 99, 136, -203, 59, 141, -192, 41, 164, -201, -4, 204, -157, -45, 179, -136, -47, 201, -142, -87, 206, -95, -112, 183, -72, -113, 190, -71, -171, 185, -6, -175, 142, -3, -167, 163, 11, -200, 143, 80, -183, 81, 76, -173, 101, 115, -207, 48, 168, -171, -1, 133, -148, 19, 161, -169, -47, 201, -109, -71, 160]
2986A60k56K7K54k82l3L33k28j10K93j84r3K88k00j44L29j12k10K79p9j78K90
3007A44r7k53L03J9k76K08L9k42K28N6l15K06J49l07J09J59k58J18J73l03N9K60
3029A79k41l8K47k12j6K58k43q4L11j36j60K52j26j25K83j38j93L01m6k22K24
3050G5k4k04K56qk85K47P3k62J58Q4k47J72J13l11J30J92k46L3J79k31O2K07k63
3073a00rK72j98o9K21j58n9K46j51j58K87p9j85K20o1j53K49o3k23K41L6k41J73
3096C8M4k24K04O1k77J61J32k57J04J31k33J05J63k76O7K07k16j0K04k01j3K34
3118A48k06o9K61j39j18K42j19j19K37q8j83K50l3j93J86J0j99K04K1k41J72Q5
3140A09k35J36R7k33J34J35k75R6J76k32M9J70k16K8K01k21k0K37j87m8K27j59
$$ y = [160, -96, -69, 185, -97, -130, 203, -25, -135, 158, -26, -119, 169, -31, -175, 154, 42, -168, 111, 32, -146, 144, 47, -206, 97, 116, -160, 48, 87, -155, 73, 129, -186, 20, 169, -138, -29, 130, -128, -10, 163, -140, -81, 179, -62, -100, 147, -65, -81, 177, -66, -150, 161, 25, -135, 117, -9, -134, 149, 11, -182, 119, 73, -149, 75, 51, -153, 103, 95, -190, 57, 130, -132, 26, 110, -137, 35, 148, -163, -33, 159, -87, -54, 125, -106, -44, 163, -100, -109, 163, -35, -104, 117, -41, -100, 146, -5, -163, 124, 45, -140, 80, 19, -134, 115, 52, -171, 70, 106, -135, 38, 82, -142, 62, 123, -154, 7, 139, -118, -14, 117, -116, -11, 152, -124, -57, 150, -66, -76, 128, -73, -86, 148, -58, -127, 134, -5, -123, 119, 0, -119, 118, 30, -153, 97, 64, -129, 57, 67, -132, 72, 93, -148, 24, 109, -126, 10, 107, -126, 8, 143, -132, -36, 140, -92, -43, 127, -89, -61, 140, -81, -101, 136, -51, -99, 128, -31]
3162c1q2K47j43j26K45r0j55K33n7j82K26k7k06K02L1k17J80N2k29J50R0k20J08
3185aJ28k44J00J54k31N0J77k16J1K16k05k3K20j91n5K38j69p5K40j38j19K49
3207A16j05j53K43p5j71K35l4k03K23Jk13J93L4k20J56P9k34J37J21k35P9J54
3229A28k25P0J59k28M4J95k00k1J98j69l2K03j67p4K37j21j23K25r6j19K23r4
3251A3j62K50m7j80J96j1j87J91J6k27J87O6k29J45Q5k17J24J09k38R6J57k27
3273i0M2J50j73K3J76j89k6K21j60p7K04j26q0K28j30j26K31o7j57K01m6j45K07
3296I1l6j94K00L7k22J60N4j88J36O3k25J28J29k29Q6J26k03P6J46k19K6K02j93
3319d9k5J87j48l3K05j69q2K26r9j16J86p5j13K05o7j70K11mj91J68J2j83J83
$$ y = [-31, -113, 134, -9, -135, 110, 20, -135, 98, 41, -141, 85, 58, -148, 54, 85, -132, 48, 100, -129, 21, 111, -109, -1, 127, -117, -17, 137, -94, -44, 133, -83, -72, 144, -61, -84, 136, -55, -110, 128, -41, -116, 124, -14, -133, 116, 11, -142, 101, 26, -145, 90, 56, -147, 76, 77, -136, 57, 91, -129, 27, 106, -128, 9, 130, -105, -26, 128, -97, -27, 132, -96, -52, 143, -57, -78, 120, -49, -81, 122, -45, -119, 118, -3, -126, 99, 3, -116, 107, 13, -149, 101, 54, -126, 70, 59, -128, 63, 79, -148, 39, 105, -124, 21, 106, -111, 13, 122, -116, -20, 137, -90, -48, 102, -71, -48, 128, -61, -87, 134, -26, -103, 101, -25, -105, 123, -7, -133, 98, 31, -126, 75, 29, -116, 91, 55, -139, 61, 98, -124, 36, 90, -98, 38, 101, -124, 4, 133, -96, -10, 116, -87, -11, 135, -84, -58, 144, -49, -74, 113, -35, -68, 137, -32, -114, 112, 13, -103, 83, 8, -105, 100, 33, -137, 74, 70, -121, 47, 59, -124, 59]
3342E9K1k18J66P8k10J05R6j96J05J19k43Q0J71k03K6J39j70K0J83j90l1K16j41
3365a8q9K09j14q2K15j11j41K27n7j51J82l1j66J98nk06J83N0k11J37O0j89J34
3388B4Q5k25R8J46k05N1J32j82M2J58j96QJ95j66l6J80j49l9K13j51r7K20r2j18
3412a04J96p9j24J93l7j75J99Lj90J69K7j81J46M3k09J41Q8j96Q7J00j80P3J30
3435A20j95M1J61j78JJ63j61j9J81j43n7K01j23q1J93j02r6J91p2j29J97n6j49
3458a12J82k4j59J70Pj80J56M3j90J24P2j84R0J02j89O2J31j77L9J40j64PJ53
3481I9j46j5J68j42m0J81j21q1J82q3r5J78o6j21J78m6j44J77j2j58J53J4j74
3504a14J57L1j69J19O7j91J04P5j77R0J05j80N2J33j68PJ56j69J0J62j42l7J58
$$ y = [59, 80, -138, 28, 106, -104, 1, 97, -99, 6, 125, -118, -38, 133, -70, -44, 95, -75, -55, 128, -62, -93, 123, -18, -107, 102, -12, -94, 121, 10, -131, 96, 39, -112, 70, 39, -127, 71, 66, -140, 43, 93, -118, 19, 79, -110, 24, 109, -116, -18, 128, -77, -26, 106, -76, -34, 124, -72, -64, 131, -35, -71, 109, -40, -79, 134, -17, -114, 106, 14, -104, 92, 13, -111, 82, 45, -130, 69, 72, -118, 51, 78, -103, 43, 86, -123, 18, 106, -90, -3, 97, -83, -10, 120, -75, -34, 127, -51, -50, 113, -48, -67, 114, -29, -86, 115, -8, -89, 104, 2, -94, 97, 25, -104, 93, 37, -112, 70, 46, -113, 57, 64, -116, 40, 83, -107, 17, 89, -95, -5, 97, -92, -30, 101, -76, -37, 103, -61, -54, 99, -47, -62, 106, -36, -76, 105, -16, -97, 85, 2, -93, 85, 19, -102, 76, 30, -114, 63, 51, -107, 46, 60, -114, 43, 74, -95, 24, 91, -100, 4, 79, -98, -8, 97, -83, -31, 102, -66, -59, 97, -72, -62, 100, -42, -79, 79]
3527G9r8o8J76r1r8J90p0j26J69l2j24J64l2j54J68J8j67J25M1j70J17N8j74R7
3551bR2j73P2J08j71N2J20j81L6J52j62j0J59j31k5J57j25o0J86r7r1J73p8q7
3575h6J73p2j27J73j1j46J44Oj59J55J9j79J40O4j82Q8P6j60Q1R6j86O6J28j62
3599f1J4J42j48%J52j51j8J69j27o2J71j11m9J73j07q4J84p0j14J57k6j17J39
3622E6j4j48J57K3j59J09M2j56J16M9j73J00R2j63N4J09j61M6J14j65K7J51j48
3645d2j8J46j22j1J37j10n6J76j01q6J64p9q9J66n3j20J60rj38J29lj26J35J1
3669F1j55J14O2j64Q5O8j41P5Q0j74P1J10j53K9J07j21jJ44j35k4J50j16m5J50
3693G7r9n9J65r1q9J61m8j09J38k0j14J38j8j37J44K5j58J15L5j52J16N7j65R2
$$ y = [79, -19, -87, 89, -2, -100, 90, 20, -106, 63, 31, -93, 71, 39, -115, 53, 71, -96, 29, 70, -100, 17, 75, -99, -2, 90, -83, -11, 97, -74, -22, 98, -83, -47, 105, -57, -67, 92, -39, -64, 93, -32, -92, 94, -3, -94, 79, 1, -86, 87, 15, -112, 61, 50, -96, 48, 54, -105, 50, 69, -110, 30, 94, -88, 0, 76, -84, -3, 93, -93, -27, 101, -61, -47, 95, -53, -53, 99, -52, -70, 99, -28, -90, 81, -30, -79, 94, -13, -97, 87, 17, -97, 60, 34, -83, 56, 42, -106, 51, 74, -85, 24, 66, -90, 26, 75, -98, 2, 94, -69, -15, 94, -67, -21, 93, -72, -45, 106, -42, -60, 86, -36, -47, 90, -20, -76, 100, -1, -87, 77, -2, -91, 75, 22, -98, 62, 53, -85, 44, 41, -85, 50, 61, -94, 20, 82, -82, 3, 71, -70, 5, 85, -89, -18, 92, -61, -32, 75, -46, -47, 97, -38, -62, 88, -28, -73, 77, -22, -81, 84, -7, -96, 65, 17, -92, 46, 26, -88, 50, 32, -105, 39, 64, -94, 21, 56, -96, 20, 77, -88, 4]
3717DQ4j62O2R6j52L7J15j49J9J36j30pJ36j22l4J51j09n8J63q2q1J52o5q0J47
3742G1m6j17J48j8j30J32J0j41J27K8j51J02M2j47J02N4j58R4P0j37M9R9j37J2
3766d2J22j36OJ35j17l5J60j12m6J52j05o2J70q4p7J40m9j06J47j8j18J30mj44
3790i3J30J7j33J09L1j46R8M9j44Q0Q5j45M7R1j48L8J16j38J7J25j37nJ39j17
3814c4m1J60j09m9J50q7p4J51o1q9J42l7j09J33j6j09J19Rj24J04K6j30Q8M9j42
3839h0R0O2j46O3Q7j32K5J02j21J7J14j20j0J20j10lJ15r6m2J37q3o4J35o0p6
3864g6J38m4r2J20mj20J17Mj13J02K0j26R9M5j47Q0P2j39N7Q0j33L8J00j33J8
3889c7J07j14OJ11j05k2J32r3n1J26o6m5J13o1q5J46m1r9J28k0j05J18jj18J24
$$ y = [4, 88, -74, -12, 84, -68, -31, 84, -65, -46, 90, -40, -47, 89, -33, -67, 84, -25, -83, 80, -2, -83, 69, 4, -76, 71, 25, -92, 56, 38, -92, 40, 50, -91, 36, 64, -87, 15, 57, -90, 12, 66, -92, 2, 72, -65, -16, 83, -54, -42, 80, -56, -50, 85, -32, -67, 93, -19, -65, 87, -18, -80, 90, 6, -71, 69, 20, -86, 61, 43, -75, 55, 51, -93, 37, 54, -79, 30, 61, -85, 13, 62, -82, -2, 83, -62, -15, 76, -72, -34, 82, -56, -39, 86, -51, -56, 83, -34, -75, 85, -24, -73, 77, -10, -84, 67, 6, -83, 59, 22, -87, 46, 30, -79, 40, 49, -75, 29, 55, -75, 13, 62, -80, 10, 72, -74, -11, 76, -56, -31, 71, -50, -33, 81, -39, -49, 71, -39, -42, 73, -23, -65, 72, -11, -75, 60, 0, -76, 62, 18, -74, 46, 42, -78, 39, 43, -70, 32, 52, -74, 25, 70, -77, 3, 75, -64, -7, 73, -60, -22, 78, -55, -37, 70, -44, -38, 73, -32, -54, 78, -15, -66, 60, -6, -51, 62, 1, -84, 62, 21, -78, 50, 30, -75, 43, 42, -76, 48]
3914D8J1j39J00L2j19Q2N0j34N6Q9j29L2R8j27K6J00j17MJ11r4m2J29q6m2J28
3939F7q4n9J41o2p2J23m1q6J30k5j17J29oj09J01K4j22R1L7j40Q4P0j41O6O1j17
3965e7M0Q9j23J4J20j17j1J17j13JJ17j07m1J42q0o2J32o4p3J39m9q5J28k5j06
3990g4J16jj10R9J8j26J07L4j29P0N6j14O2N9j22M5Q8j33K3J06j33K1J14j08k0
4015e2J27j04l1J30q4m8J26o4o1J22m7q9J24j7r4J02Lj14J05Nj10Q3M6j17O5N2
4041E8j26O8O1j15M3Q4j18K7R2j12RJ10j13j6J15r3l1J25q4m9J26o6o4J26m9p7
4067f9J23l5j04J22J5j21J02Pj03R2K8j18P0N9j25O4N5j32N1Q0j08K3Q9j05lJ12
4093F9r7pR5r0k7J16p7l9J19o5o4J26n5p1J20l0r8J15j6r1J04Lj00Q3L4j09P3
$$ y = [48, 59, -80, 20, 52, -67, 15, 65, -69, -13, 76, -53, -21, 77, -50, -24, 76, -41, -37, 74, -20, -62, 67, -19, -61, 67, -17, -76, 65, 3, -69, 54, 13, -73, 57, 32, -85, 44, 38, -71, 30, 54, -68, 23, 60, -80, 4, 74, -67, -1, 60, -57, -17, 72, -51, -37, 83, -34, -45, 72, -41, -40, 77, -30, -71, 71, -9, -71, 61, -3, -76, 63, 14, -71, 57, 32, -74, 42, 41, -69, 30, 48, -78, 29, 63, -66, 4, 60, -54, 8, 67, -55, -10, 78, -55, -32, 74, -59, -38, 76, -32, -52, 75, -29, -60, 70, -14, -62, 64, 0, -61, 61, 14, -75, 49, 32, -62, 40, 43, -71, 34, 39, -71, 12, 58, -59, 6, 58, -68, 0, 61, -54, -11, 73, -45, -18, 74, -38, -29, 81, -32, -48, 67, -26, -57, 68, -16, -65, 61, -5, -69, 57, 8, -69, 54, 19, -85, 37, 52, -69, 33, 40, -63, 29, 57, -61, 9, 68, -57, 7, 62, -70, -19, 61, -47, -24, 65, -40, -43, 69, -28, -35, 60, -30, -57, 59, -18, -57, 62, -3, -67, 59, 4, -67, 53, 23, -75, 40, 24, -67, 37, 40, -60, 23, 57, -52, 21]
4120B1L9j24N7Q2j33O0P2j19J7R9j20RR9r2nJ03q1l7J19q7m9J29n8o8J22m9p6
4147g0J18j5j10J15j4q8R0J3j10J00K7j15Q0M3j16N3O7j23M6P6j13K2R2j13K7
4172a8Q0j03KJ02r0l1J25q0m4J08n5n4J15m6p4J18m1p5J06j1r1R7Lj04R0J9j00
4199e2O7L5j17P5M7j05L9P0j07L9O6r5J4Q3r6J3Q0p9j7R9q4k0R8n5o6J15m6o1
4227f0J08m9o1J01j4q3R2oq6P7J6q5O9L6j12N3N5j03M2N6r1L5O8q8RP6q2KQ4q4
4257b5j2Q5o5k9J04n5n1R7l3p2R7l5o7J01j5p5P2Mp3P7J1r2P2J8q8O2M0j00M7
4286@N4r3J7P5q4J1P6r3KQ8q1j8R4o3k3Q9o2m1R8m2o5R3k3o5R0j6p8Q3Kq0P5J3
4318C3q1N9L1q8N0M9r7L3O0r1L4O8r4J1P5q5lR1p7j2P9o6j9R2n9m0Q4m2n6J00
$$ y = [21, 60, -64, -7, 75, -58, 2, 74, -45, -28, 71, -49, -40, 59, -33, -38, 65, -16, -53, 66, -21, -70, 59, 1, -67, 55, 6, -70, 48, 33, -77, 38, 24, -64, 26, 39, -71, 29, 56, -59, 21, 64, -52, 1, 68, -55, -9, 67, -46, -24, 68, -45, -18, 62, -41, -39, 63, -27, -58, 67, -13, -57, 51, -4, -58, 57, 11, -63, 55, 14, -61, 45, 34, -57, 40, 43, -61, 29, 48, -52, 15, 50, -67, 8, 55, -50, -11, 59, -48, -9, 57, -38, -24, 59, -37, -24, 56, -23, -40, 59, -25, -45, 53, -2, -68, 47, 1, -60, 48, -1, -62, 39, 25, -58, 34, 28, -58, 19, 35, -50, 19, 55, -57, -4, 51, -52, -10, 46, -45, -10, 58, -30, -21, 55, -27, -25, 59, -25, -37, 48, -17, -46, 58, 3, -48, 49, 16, -56, 41, 6, -61, 40, 25, -50, 22, 26, -47, 30, 41, -51, 21, 39, -49, 13, 53, -47, 0, 54, -39, -22, 53, -31, -20, 56, -37, -35, 53, -28, -46, 48, -15, -38, 51, -11, -52, 46, 4, -61, 32, 9, -56, 34, 18, -60, 23, 25, -55, 20, 33, -48, 11, 42, -46, 4, 53, -44, -11, 49, -42, -8, 60, -34, -23, 52, -33, -36, 55, -22, -34, 45, -21, -40, 52, -7, -47, 37, -5, -61, 39]
4348C9l0p0R0j0p4P0Qq2P7J6q3O8J9q5N2K8p3L6O0r4L1O1r1J9O9p4jP6p4mO4m8
4380a0l7R7o2l0P7l7o1R6pp3P7j9p0P6Mo1N6J6q4O0M0q8M8M0r0M2N4r3K0O7q1
4411c3J0Q0p1rP0p4rP9o3k2Q2m2m9Q8m2l6P6l0n7Q2k8n6O6J1p5P6Kp3O6K0p7M2
4443DM1q6L3M9p4K7N6p4J7N2p0J0P6q3qQ3o7k8P7l8l1P3m4n4R8l0n9P9k1n2P3
4474B9po6O5J2q5P6Pp0N4K6p5J8N7q8M2M6q4L3N4p9J2P2p4lO0o3kP7o7j8Q3m8
4506fm5Q9n3k3O8k5o0Q2k2n3O7%o3O3J5p5M6L8p7M3L5p2L0L7p2K8M2o3J1N5p5
4537c5J6O8o7j0O0m8k3P2l8k8O6l7m2Q1l4l8O6k1n1O5Jo8N6J8p8O3Po3M7K7o8
4568c6L5M0p6L2M3p2K7N6q6J1O8o4%N1n4nO8n1k9P7l1l8O7l2l4O9k3n9O8mn6O4
$$ y = [39, 9, -61, 29, 19, -55, 15, 23, -59, 18, 34, -49, 19, 38, -47, 5, 33, -40, -4, 56, -38, -7, 54, -37, -18, 51, -23, -24, 52, -22, -26, 38, -10, -47, 50, -12, -42, 35, -2, -63, 33, 26, -47, 30, 11, -59, 17, 21, -40, 16, 32, -52, 8, 48, -40, 8, 48, -42, 0, 54, -39, -19, 48, -33, -23, 57, -14, -23, 47, -27, -36, 43, -20, -42, 40, -2, -51, 37, -5, -41, 35, 5, -52, 30, 2, -54, 12, 23, -52, 24, 26, -47, 19, 39, -38, 4, 45, -41, -8, 41, -33, -6, 50, -24, -7, 45, -25, -15, 61, -22, -30, 53, -14, -42, 35, -3, -34, 39, -5, -59, 39, 9, -50, 29, 8, -44, 29, 22, -44, 21, 33, -52, 24, 31, -39, 15, 41, -34, -16, 41, -47, -5, 41, -43, -10, 44, -35, -23, 49, -25, -28, 32, -31, -33, 44, -23, -41, 42, -6, -51, 38, -15, -38, 30, 5, -55, 27, 5, -48, 19, 19, -44, 19, 34, -41, 5, 43, -34, 9, 44, -28, 2, 39, -33, -5, 37, -26, -15, 40, -35, -19, 49, -18, -28, 32, -16, -39, 33, -5, -33, 33, -4, -46, 35, 1, -37, 29, 8, -43, 22, 23, -45, 11, 29, -49, 14, 21, -42, 5, 32, -36, -1, 39, -37, -5, 38, -34, -7, 49, -37, -26, 42, -22, -22, 29, -25, -30, 38, -13, -42, 35, 4, -34, 33, 1, -33, 36, 13, -46, 22, 18, -38, 26]
4600B6jp0P6%o3M6J9o3K6L7o9M1K8o2K1M4o2J6M9o1RN3o6%N9n5j4O1m3j2N2k2
4632@l0N1k1m9P3k7l5O0jn1N3Po3M9J8o6M8J3p1M6K1n5L6L1o6J9L3m2KN3n1j3
4664b8O5n3j2O0m2k2P0m2k6N7l4k4O1k7l5N0j4l2M4Jn7O2No7M9J6o1N3K1p3M3
4695HK8o3J0M7o5J7N8n9nO1o0j1O9m8j6O1m5j4N1k4k5M9k1l6M7j6k7N7j8m3M5
4726A2Jn7N8J0n2L1K8o7L5L1o9L7L3n8K1L4m9PM2n4NN6n5j2N8l8pM4l9k0N9k8
4758ck7N3j8n6O8k2k9M4Om9M2On4M5Rn7M2L0n2K2K2n3K8K9o1K5M0m8KL0l3j2N3
4791B2m7j0N4k8k6N2k2k1M9k7m3O6j6l0L8kl9M8mm6M2Ol9L0Lm2L7J6m5K6K7m5
4823a6RJ9l2J4K5m3J2K9l5qL9l0j3N9l2k6N3k1k1M2k0l0M5om5N3lm7L8Pm6M4K
$$ y = [26, 25, -45, 31, 31, -32, 14, 33, -30, -4, 33, -36, 5, 33, -29, -8, 36, -26, -10, 39, -22, -13, 40, -26, -26, 33, -22, -36, 25, -18, -30, 22, 0, -30, 21, 0, -49, 24, -3, -38, 22, 21, -30, 23, 30, -33, 16, 34, -32, 16, 29, -42, 4, 25, -30, 6, 37, -29, -10, 23, -19, -17, 36, -15, -28, 37, -16, -28, 32, -10, -32, 38, -4, -30, 27, -7, -31, 30, 3, -32, 18, 4, -28, 16, 17, -40, 22, 27, -40, 9, 25, -36, 17, 38, -35, 8, 36, -27, -17, 30, -35, -18, 40, -19, -24, 37, -23, -34, 35, -13, -29, 32, -13, -27, 24, 0, -25, 24, 3, -33, 14, -2, -29, 28, 10, -33, 12, 13, -44, 14, 24, -28, 3, 31, -36, -1, 30, -39, -2, 31, -27, -6, 28, -21, -14, 28, -26, -21, 35, -20, -32, 26, -12, -19, 25, -14, -34, 25, -3, -30, 23, 5, -51, 17, -5, -34, 10, 16, -33, 9, 15, -39, 6, 15, -42, 0, 30, -22, 0, 22, -31, -3, 26, -35, -10, 30, -18, -16, 14, -19, -31, 22, -25, -35, 19, -9, -35, 17, -5, -26, 23, -4, -47, 19, 3, -27, 11, 9, -30, 18, 14, -32, 10, 16, -23, 7, 10, -32, 5, 21, -24, 2, 29, -16, -7, 12, -20, -6, 19, -24, -12, 17, -18, -26, 13, -17, -30, 29, -3, -29, 24, 3, -18, 24, 4, -26, 19, 13, -32, 21, 18, -29, 9, 16, -30, 14, 16]
4856A6m4L9J3m4K6J1m5J9K8l5J2K4l4LK8l0JL6l6LL8l5j3N2l6j6M9m3j6M9j0l8
4888b8M6j1k8M6j2m3M7Pm9M0Om9L8Ol4K8K7o3K1K1m0J7J8l0jN1m5%L6l2oM2m3
4921a7j0N0k9j6M5k3j7M6k4l0M9j3k7M0j3l5M9j0l9M3Jm6L6%m2L7Ql8K2J9o0L0
4953a4K1l1K1K5m7K1J9l4PM2m2PL3m2nM6k6k3N1l1j6M2nm1L8j1l2M0Jm0M0j0l6
4986c2L9J2n1M1qk7K6J6m6K0K7m4J6K5m3K1L4m7J1J9k4mM9m9NM0l8KL6l3j5M2
5018B0k6j7M2j8l1N5k0l4N3j6l4L6jm0L2J1m7L7J5n1L1J8l7J3K7l2J0K9m0OL7
5049B8m4J1L2l8rM5k4k8M8k8k0N2k5k5N1j8m5N8k1j5L8j4m7M9jm6M0Ol2J9J6m9
5081c6L8K0n2K4K7n4K0M2l9oN0l8qM1l7j0M7l4rL9l1rM1k6j2L8l1k3L8km5M5%
$$ y = [16, -28, 11, 24, -20, 6, 17, -28, -9, 19, -16, -4, 20, -14, -11, 17, -13, -12, 24, -12, -9, 29, -6, -19, 33, -3, -19, 30, -13, -29, 20, 10, -28, 18, 7, -21, 25, 13, -30, 17, 24, -25, 15, 21, -28, 10, 16, -18, 10, 37, -26, -5, 16, -24, -7, 11, -19, -20, 31, -14, -14, 22, -10, -16, 26, -17, -27, 23, -6, -22, 23, 0, -17, 29, 5, -25, 24, 11, -16, 24, 11, -24, 25, 15, -24, 19, 20, -26, 10, 10, -32, 5, 13, -25, -3, 16, -44, -14, 7, -24, -3, 22, -25, -4, 15, -19, -12, 30, -12, -5, 28, -14, -19, 27, 1, -22, 29, -2, -18, 24, 19, -22, 16, 5, -27, 13, 14, -26, 14, 4, -32, 7, 19, -32, 9, 1, -26, 0, 16, -30, -10, 17, -27, -11, 14, -29, -8, 26, -21, -10, 9, -15, -19, 30, -19, -14, 26, -12, -10, 26, -7, -22, 20, -6, -23, 19, 1, -30, 25, 5, -29, 24, 8, -26, 10, 9, -31, 1, 12, -35, 2, 17, -34, -3, 15, -22, -9, 18, -14, -4, 25, -15, -9, 28, -16, -5, 27, -11, -20, 25, 1, -27, 21, -7, -27, 25, 0, -25, 26, 8, -37, 21, 0, -15, 23, 9, -38, 11, 10, -36, 4, 10, -22, -3, 13, -36, 2, 22, -30, -6, 21, -33, -13, 29, -10, -16, 34, -4, -12, 29, -8, -18, 29, -5, -14, 25, -6, -15, 26, 0, -12, 26, -5, -28, 10, 8, -37, 8, 8]
5114Hl9M1Nn6N2J0l9K2Ol7J8L2n1K5L1l2nM1n2KN6n9ON3m1j4M4m3qM9k3l0N8j6
5148A4l7L3j2l6O0j5m2M5Qm5M0On7M9J0n4L9K8n9K5K5m4J4L8n7J3M0m6KM6m7m
5180b0N1m9j4N9k8j8M6k2l2M6om4M5km6N3j6l9M7Om7L9J0m2J9J8l6K4K8n3K1L0
5212B8l7QL4m7LM0m1nM6l0k0M7k6k7N4j6l6N9k8m4N2j4m1N4Jo0N2J1n9M8J6n3
5244c1K3K9n4K3L7n3J3L9m4RL6m7KN7m3qM1l5j1N7l8k2N3k8l4N2j1m8M9Nn4N9
5276B3nn9M5K6p5M4K6o1M1K2o3K1N3n3QM4o1LP2o7%N5n7qO6m7k2O1l2l5O3k6l8
5309c6N4j4m0N5mo4O4Lo8O0J3n8M1J2n4L5L3o2K2M3p4K6M1o0J4N0m5kN0n0%O1
5341D6n5k2P4m4k2N3k4l4O4l2m0O9k4m8M5J0n9O8pn2L2K8o1L4L4p7L6L0n2K4M8
$$ y = [8, -31, 10, 15, -41, 11, 21, -18, 4, 10, -27, -9, 23, -28, -3, 28, -4, -9, 32, -20, -18, 38, -21, -15, 38, -3, -17, 27, -16, -24, 25, 2, -28, 30, 14, -23, 10, -2, -38, 22, 7, -35, 10, 18, -27, 13, 19, -38, 11, 21, -33, 6, 34, -25, 0, 25, -19, -5, 33, -24, -11, 29, -17, -15, 31, -16, -20, 31, -18, -32, 27, -1, -19, 27, 5, -27, 19, 13, -31, 14, 12, -34, 19, 3, -36, 11, 17, -30, 9, 19, -23, -4, 14, -22, 2, 30, -23, -2, 28, -9, -1, 33, -14, -11, 29, -12, -17, 29, -1, -21, 26, 0, -27, 27, 11, -25, 34, 6, -38, 14, 0, -41, 13, 14, -46, 6, 17, -42, 6, 22, -31, -8, 21, -33, -10, 27, -26, -13, 26, -18, -9, 27, -20, -18, 39, -4, -12, 29, -6, -17, 40, 2, -20, 33, 5, -29, 23, 12, -36, 13, 18, -36, 23, 18, -41, 4, 30, -45, -1, 25, -36, 5, 27, -36, -15, 38, -15, -7, 37, -24, -21, 51, -16, -16, 39, -18, -26, 40, -7, -29, 32, 0, -35, 28, 2, -36, 18, 4, -36, 19, 15, -49, 15, 18, -50, 10, 23, -35, 6, 18, -36, -1, 32, -30, -8, 35, -39, -13, 28, -32, -18, 32, -13, -15, 35, -15, -15, 46, -9, -31, 43, -1, -23, 30, 6, -28, 36, 4, -36, 33, 9, -39, 6, 16, -43, 25, 18, -34, -2, 26, -35, -1, 33, -44, -8, 22, -30, -6, 42]
5372D2p2RN3n2MN2n5rP3n0l4P5l9k9P5l6n4O8j3n1O3oo0O8j4n6O1J1o4M9J9q1
5404e3M8K8o1K8M9p2J9M7o0%N6n3KP0o0j5N9m2j6P7n9l6Q8m3m9P3j4n6Q0k2p1
5435e8Q1Lp9O2Qp0N3J8n7L2L9q1L5M2p8L6M9p5J6O6o2j2P6o0lO8n9k1P6m1m1P8
5467D1l2n4Q4k9n0P2j1o2O1ko3N5J8p6N3L4q2L9L4q0M1M8p4K0N8p3K1M9o8NO8
5498D5o0j5Q2n1l2P1m1l4P9m2n1R2k3q4Q6j1n5O5mp2P6J6r2O0K1o8M0K7q1M6O0
5529E0j00L0N9p6J9N7p1PP0o0pP0o1k4Q4n0l5Q2l8m6P1j9n1Q2k5o2O4Lp4O7J1
5560B7p9N7L2q6M4M1p6L2N7q3K4O5r9K9N8o6mP5p6mQ7p0k2Q4n6l7Q5l0m3O7j6
5591A7o4P7j9o0O7Op1N3K2p8N5J9q3N1N3q9M1M0q0K2O4p1PP1p0pP3o1j3Q2o6k8
$$ y = [42, -30, -21, 32, -20, -16, 36, -19, -28, 45, -5, -39, 36, -3, -32, 43, 7, -47, 21, 8, -43, 20, 14, -46, 22, 8, -48, 13, 24, -40, 9, 28, -53, -5, 23, -38, -10, 39, -33, -14, 33, -27, -27, 29, -24, -22, 48, -12, -27, 32, -10, -26, 51, -8, -44, 44, 1, -48, 25, 11, -45, 35, 13, -58, 23, 26, -53, 9, 17, -53, 0, 18, -39, -7, 32, -49, -14, 28, -50, -14, 35, -40, -24, 42, -20, -32, 44, -16, -19, 49, -10, -31, 45, 4, -37, 41, 9, -45, 39, 10, -40, 32, 21, -41, 20, 18, -45, 10, 28, -48, 5, 39, -43, -4, 30, -50, -9, 39, -35, -15, 43, -30, -9, 40, -28, -23, 45, -15, -30, 52, 1, -31, 40, -1, -35, 44, 2, -49, 43, 20, -64, 22, 11, -44, 21, 17, -55, 21, 37, -55, 5, 26, -42, -2, 25, -56, -10, 50, -50, -20, 39, -37, -18, 39, -32, -25, 45, -15, -22, 48, -13, -37, 47, -3, -38, 44, 6, -40, 31, 12, -39, 43, 18, -44, 20, 23, -51, 16, 27, -52, 5, 37, -49, -5, 36, -40, -8, 49, -34, -10, 55, -44, -15, 43, -23, -27, 48, -28, -32, 55, -15, -37, 47, -9, -46, 39, 9, -34, 33, 17, -47, 30, 11, -49, 18, 24, -47, 6, 28, -50, 5, 24, -59, -8, 45, -44, -3, 37, -43, -21, 43, -28, -21, 50, -20, -27, 46, -15, -28, 54, -12, -40]
$$ [...]
8191A
##END NTUPLES=NMR FID
##END=
