##TITLE=1H_LY-17Dix.2B
 CD3CN, 8 sc, 
 2.06.2021
##JCAMPDX= 6.0         $$ Bruker NMR JCAMP-DX V2.0
##DATA TYPE= NMR FID
##DATA CLASS= NTUPLES
##ORIGIN= UXNMR, Bruker Analytische Messtechnik GmbH
##OWNER= root
$$ XWIN-NMR		Version 3.5
$$ Wed Jun  2 09:47:37 2021 Russian Standard Time (UT+4h)  she@DPX200
##.OBSERVE FREQUENCY= 200.131506
##.OBSERVE NUCLEUS= ^1H
##.DELAY= (6, 6)
##.ACQUISITION MODE= SIMULTANEOUS
##.ACQUISITION SCHEME= undefined
##.AVERAGES= 8
##.DIGITISER RES= 18
##SPECTROMETER/DATA SYSTEM= spect
##.PULSE SEQUENCE= zg30
##.SOLVENT NAME= CDCl3
##.SHIFT REFERENCE= (INTERNAL, CDCl3, 0, 15.7039)
##AUDIT TRAIL= $$ (NUMBER, WHEN, WHO, WHERE, WHAT)
$$ ##TITLE= Audit trail, XWIN-NMR		Version 3.5
$$ ##JCAMPDX= 5.01
$$ ##ORIGIN= Bruker BioSpin GmbH
$$ ##OWNER= she
$$ F:/spectra/data/she/nmr/H-F/1/audita.txt
$$ ##AUDIT TRAIL=  $$ (NUMBER, WHEN, WHO, WHERE, WHAT)
(   1,<2021-06-02 09:46:13.45 +0400>,<she>,<DPX200>,
      <created by zg, POWCHK disabled, PULCHK disabled
       configuration hash MD5:
       00 E9 B6 7A A2 85 ED C7 34 08 36 98 17 FE 4E 26
       data hash MD5: 16K
       22 05 CC 31 73 31 D4 26 85 50 82 49 0F 53 45 01>)
$$ ##END=
$$ 
$$ hash MD5
$$ 73 D5 84 F5 67 F7 B0 29 31 A0 87 85 F8 60 3A 87
##$RELAX= 
##$RELAX= 
##$RELAX= 
##$RELAX= 
##$RELAX= 
##$RELAX= 
$$ Bruker specific parameters
$$ --------------------------
##$DU= <F:/spectra>
##$EXPNO= 1
##$NAME= <H-F>
##$PROCNO= 1
##$TYPE= <nmr>
##$USER= <she>
##$AMP= (0..31)
100 100 100 100 100 100 100 100 100 100 100 100 100 100 100 100 100 100 
100 100 100 100 100 100 100 100 100 100 100 100 100 100 
##$AQSEQ= 0
##$AQ_mod= 1
##$AUNM= <au_zg>
##$AUTOPOS= <>
##$BF1= 200.13
##$BF2= 200.13
##$BF3= 200.13
##$BF4= 200.13
##$BF5= 200.13
##$BF6= 200.13
##$BF7= 200.13
##$BF8= 200.13
##$BYTORDA= 1
##$CFDGTYP= 0
##$CFRGTYP= 5
##$CHEMSTR= <none>
##$CNST= (0..31)
1 1 145 1 1 1 1 1 1 1 1 1 1 1 1 1 1 1 1 1 1 1 1 1 1 1 1 1 1 1 1 1 
##$CPDPRG= <>
##$CPDPRG1= <>
##$CPDPRG2= <>
##$CPDPRG3= <>
##$CPDPRG4= <mlev>
##$CPDPRG5= <mlev>
##$CPDPRG6= <mlev>
##$CPDPRG7= <mlev>
##$CPDPRG8= <mlev>
##$CPDPRGB= <>
##$CPDPRGT= <>
##$D= (0..31)
0 1.2 0 0 0 0 0 0 0 0.06 0 0.03 0 0 0 0 0.0002 0 0 0 0 0 0 0 0 0 0 0 0 
0 0 0 
##$DATE= 1622612772
##$DBL= (0..7)
120 120 120 120 120 120 120 120 
##$DBP= (0..7)
150 150 150 150 150 150 150 150 
##$DBP07= 0
##$DBPNAM0= <>
##$DBPNAM1= <>
##$DBPNAM2= <>
##$DBPNAM3= <>
##$DBPNAM4= <>
##$DBPNAM5= <>
##$DBPNAM6= <>
##$DBPNAM7= <>
##$DBPOAL= (0..7)
0.5 0.5 0.5 0.5 0.5 0.5 0.5 0.5 
##$DBPOFFS= (0..7)
0 0 0 0 0 0 0 0 
##$DE= 6
##$DECBNUC= <off>
##$DECIM= 32
##$DECNUC= <off>
##$DECSTAT= 4
##$DIGMOD= 1
##$DIGTYP= 9
##$DL= (0..7)
0 120 120 120 120 120 120 120 
##$DP= (0..7)
150 150 150 150 150 150 150 150 
##$DP07= 0
##$DPNAME0= <>
##$DPNAME1= <>
##$DPNAME2= <>
##$DPNAME3= <>
##$DPNAME4= <>
##$DPNAME5= <>
##$DPNAME6= <>
##$DPNAME7= <>
##$DPOAL= (0..7)
0.5 0.5 0.5 0.5 0.5 0.5 0.5 0.5 
##$DPOFFS= (0..7)
0 0 0 0 0 0 0 0 
##$DQDMODE= 0
##$DR= 18
##$DS= 0
##$DSLIST= <SSSSSSSSSSSSSSS>
$$ [...]
##$SUBNAM2= <"">
##$SUBNAM3= <"">
##$SUBNAM4= <"">
##$SUBNAM5= <"">
##$SUBNAM6= <"">
##$SUBNAM7= <"">
##$SUBNAM8= <"">
##$SUBNAM9= <"">
##$SW= 16.9725357007746
##$SWIBOX= (0..15)
0 0 2 0 0 0 0 0 0 0 0 0 0 0 0 0 
##$SW_h= 3396.73913043478
##$TD= 16384
##$TD0= 1
##$TE= 0
##$TE2= 300
##$TE3= 300
##$TEG= 300
##$TL= (0..7)
0 120 120 120 120 120 120 120 
##$TP= (0..7)
150 150 150 150 150 150 150 150 
##$TP07= 0
##$TPNAME0= <>
##$TPNAME1= <>
##$TPNAME2= <>
##$TPNAME3= <>
##$TPNAME4= <>
##$TPNAME5= <>
##$TPNAME6= <>
##$TPNAME7= <>
##$TPOAL= (0..7)
0.5 0.5 0.5 0.5 0.5 0.5 0.5 0.5 
##$TPOFFS= (0..7)
0 0 0 0 0 0 0 0 
##$TUNHIN= 0
##$TUNHOUT= 0
##$TUNXOUT= 0
##$USERA1= <user>
##$USERA2= <user>
##$USERA3= <user>
##$USERA4= <user>
##$USERA5= <user>
##$V9= 5
##$VALIST= <valist>
##$VCLIST= <CCCCCCCCCCCCCCC>
##$VD= 0
##$VDLIST= <DDDDDDDDDDDDDDD>
##$VPLIST= <PPPPPPPPPPPPPPP>
##$VTLIST= <TTTTTTTTTTTTTTT>
##$WBST= 1024
##$WBSW= 4
##$XGAIN= (0..3)
0 0 0 0 
##$XL= 0
##$YL= 0
##$YMAX_a= 56616
##$YMIN_a= -57933
##$ZGOPTNS= <>
##$ZL1= 120
##$ZL2= 120
##$ZL3= 120
##$ZL4= 120
##$ABSF1= 10
##$ABSF2= 0
##$ABSG= 5
##$ABSL= 3
##$ALPHA= 0
##$AQORDER= 0
##$ASSFAC= 0
##$ASSFACI= 0
##$ASSFACX= 0
##$ASSWID= 0
##$AUNMP= <proc_1d>
##$AZFE= 0.1
##$AZFW= 0.1
##$BCFW= 1
##$BC_mod= 2
##$BYTORDP= 1
##$COROFFS= 0
##$CY= 11.3945322036743
##$DATMOD= 1
##$DC= 2
##$DFILT= <>
##$DTYPP= 0
##$F1P= 15.9154993809931
##$F2P= -4.1035820241983
##$FCOR= 0.5
##$FTSIZE= 0
##$FT_mod= 4
##$GAMMA= 1
##$GB= 0.15
##$INTBC= 1
##$INTSCL= 1
##$ISEN= 128
##$LB= 0.24
##$LEV0= 0
##$LPBIN= 0
##$MAXI= 10000
##$MC2= 0
##$MEAN= 0
##$ME_mod= 0
##$MI= 1.114404
##$NCOEF= 0
##$NC_proc= 0
##$NLEV= 6
##$NOISF1= 3.799351
##$NOISF2= 2.8
##$NSP= 1
##$NTH_PI= 0
##$NZP= 0
##$OFFSET= 15.70392
##$PC= 1
##$PHC0= -11568.78
##$PHC1= 18.80099
##$PH_mod= 1
##$PKNL= yes
##$PPARMOD= 0
##$PSCAL= 0
##$PSIGN= 0
##$REVERSE= no
##$SF= 200.130013532006
##$SI= 16384
##$SIGF1= 3
##$SIGF2= 2
##$SINO= 400
##$SIOLD= 16384
##$SREGLST= <1H.CDCl3>
##$SSB= 0
##$STSI= 0
##$STSR= 0
##$SW_p= 3612.71676300578
##$SYMM= 0
##$S_DEV= 0
##$TDeff= 0
##$TDoff= 0
##$TI= <>
##$TILT= no
##$TM1= 0
##$TM2= 0
##$TOPLEV= 0
##$USERP1= <user>
##$USERP2= <user>
##$USERP3= <user>
##$USERP4= <user>
##$USERP5= <user>
##$WDW= 1
##$XDIM= 8192
##$YMAX_p= 0
##$YMIN_p= 0
$$ End of Bruker specific parameters
$$ ---------------------------------
##NTUPLES= NMR FID
##VAR_NAME=  TIME,          FID/REAL,        FID/IMAG
##SYMBOL=    X,             R,               I
##VAR_TYPE=  INDEPENDENT,   DEPENDENT,       DEPENDENT
##VAR_FORM=  AFFN,          ASDF,            ASDF
##VAR_DIM=   8192,          8192,            8192
##UNITS=     SECONDS,       ARBITRARY UNITS, ARBITRARY UNITS
##FACTOR=    0.0002944,     1,               1
##FIRST=     0,             0,               0
##LAST=      2.4114304,     0,               0
##MIN=       0,             -57933,          0
##MAX=       2.4114304,     56616,           0
$$ Real data points
##PAGE= N=1
##DATA TABLE= (X++(R..R)), XYDATA
0@%%%%%%%%%%%%%%%%%Qj6J6j6J6j6K4l2L2m0M8m9N7o8P7q9J04j15J25j42J63j84
$$ 0 0 0 0 0 0 0 0 0 0 0 0 0 0 0 0 0 0 8 -8 8 -8 8 -8 16 -16 16 -24 24 -25 32 -36 41 -48 56 -59 66 -76 87 -97
39i7K04k28K53k79L10l43L78m18M64n12N64o21O85p54Q28r16J014j121J244j385
$$ -97 107 -121 132 -147 163 -180 198 -220 244 -268 296 -325 360 -394 434 -482 532 -589 655 -730
59g30J549j745J981k268K629l105L759m711O253r282K4708n9153J5406Q0874q2443
$$ -730 819 -926 1055 -1213 1416 -1689 2070 -2641 3612 -5670 19038 -40115 -24709 56165 -26278
74b6278J0874N3552o3739P236O5400o8444m720O3592n2539p600O6161o5721j5781
$$ -26278 -15404 38148 -25591 -18355 47045 -21399 -26119 37473 -15066 -22666 43495 -22226 -38007
87c8007R0712n1678n3730Q5693j8373n3790O2780j3608m9813O5659o260n9365
$$ -38007 52705 1027 -52703 32990 14617 -39173 23607 9999 -39814 25845 19585 -39780
99c9780N4339N558n3940N2854K434o6532N9639K6492q2507L5273M6973o6430J8044
$$ -39780 14559 20117 -33823 19031 21465 -45067 14572 41064 -41443 -6170 40803 -25627 -7583
112g583M2261o1416J6047N0578n9308Q48N2025m8379p73N1084n4203p295O8582
$$ -7583 34678 -26738 -10691 39887 -19421 -18573 33452 -14927 -15700 35384 -18819 -26114 42468
125D2468m7565l1689O7569k6364l6486N7689k0956l9257N8195j0639m6880M8826
$$ 42468 -5097 -36786 30783 4419 -32067 25622 4666 -34591 23604 12965 -33915 14911
137A4911j189m3107M6063j837n1464N0034J4261o1764L5286K8200n5500K4390
$$ 14911 13722 -29385 16678 14841 -36623 13411 27672 -34092 1194 29394 -26106 -1716
149a716L0517n4083J8695L9299n0945O003M0542m3063M051M1091m6870j921N3038
$$ -1716 28801 -25282 -6587 32712 -18233 -12230 28312 -14751 -10700 30391 -16479 -18400 34638
162C4638m2423j8054N4637k9657k4421N0976k4236l0386N1420j4190l6601M4680
$$ 34638 -7785 -25839 28798 -859 -25280 25696 1460 -28926 22494 8304 -28297 16383
174A6383p000l6066M2853m737m2325M3897O440m9358L4973J6941m7687K7252K2131
$$ 16383 9383 -26683 16170 11433 -30892 13005 19445 -29913 5060 22001 -25686 1566 23697
187B3697m7510K0384K9147m4538J1611L1637m0170P761L3870m1052K039M1325
$$ 23697 -23813 -3429 25718 -18820 -7209 24428 -15742 -7981 25889 -15163 -13124 28201
199B8201l7846q209M4245l0980j5515M4255k4971k1500M3788j8138k6282M1320
$$ 28201 -9645 -17854 26391 -4589 -20104 24151 -820 -22320 21468 3330 -22952 18368
211A8368j2643k9364M0280p781l4379L8933o80l8812L5584P210m1769K9834J4499
$$ 18368 5725 -23639 16641 8860 -25519 13414 12734 -26078 9506 16716 -25053 4781 19280
224A9280m2065K3150J9797m0411J7983K3993l9828J2068K8708l7499N992L1819
$$ 19280 -22785 365 20162 -20249 -2266 21727 -18101 -6033 22675 -14824 -8832 22987
236B2987l5582M90L6497l2851q018L9385k5824j4667L7447k0909j7678L8403j6761
$$ 22987 -12595 -12105 24392 -8459 -16477 22908 -2916 -17583 19864 -1045 -18723 19680 2919
249B919k4146L7477r310k7506L3939n387k9986L4476N02l6661L0034J0158l6567
$$ 2919 -21227 16250 6940 -20566 13373 7986 -22000 12476 12978 -23683 6351 16509 -20058
262b0058K2933J3064l5774K1075J8143l8165J4435K4611l4306Q080K4824l3166
$$ -20058 2875 15939 -19835 1240 19383 -18782 -4347 20264 -14042 -5962 18862 -14304
274a4304O262L0786l3571l374L5257k5612r781L2375k2153j1436L5260j9496j9708
$$ -14304 -8042 22744 -10827 -14201 21056 -4556 -14337 18038 -4115 -15551 19709 213 -19495
287a9495L5004j0526k2044L0285q866k3616L3069l684l1702K8863O522l0873K1765
$$ -19495 15509 4983 -17061 13224 4358 -19258 13811 10127 -21575 7288 13810 -17063 4702
300D702P486l0658K2474J3252l5244J5267K0489l0677R496J9589l0641R175K6129
$$ 4702 12188 -18470 4004 17256 -17988 -2721 17768 -12909 -3413 16176 -14465 -5290 20839
313B0839l2292o24L0714k4216n399K7623k3319o685L2761k1125j6141L2648j1795
$$ 20839 -11453 -12077 18637 -5579 -10978 16645 -6674 -13359 19402 -1723 -17864 14784 2989
326B989j7826K7941j1494j9306L2094o297k7948K7356L291k5902K1647K696k7028
$$ 2989 -14837 13104 1610 -17696 14398 8101 -19847 7509 10800 -15102 6545 9241 -17787
339a7787K3887R356l2726J5819J6852k7130J0746J4821k8252J1301K2168l0243
$$ -17787 6100 15456 -17270 -1451 15401 -11729 -983 13838 -14414 -3113 19055 -11188
351a1188J331K6310k2312k176K3165k3195l175K9999k1197j3631K9490j1788j4195
$$ -11188 -9857 16453 -5859 -8035 15130 -8065 -11240 18759 -2438 -16069 13421 1633 -12562
364a2562K5178j2809j5756L0314q136k4670K6021J015k2365K1206k96k4169K4000
$$ -12562 12616 -193 -15949 14365 6229 -18441 7580 8595 -13770 7436 7140 -17029 6971
377F971O495k9912J6182J3488k4405J1876J1050k6045J3269J8345k8710L829K2366
$$ 6971 13466 -16446 -264 13224 -11181 695 11745 -14300 -1031 17314 -11396 -7567 14799
390A4799k1422Q06J9611k2496J29K5951k1328r366K6156j3008j0194K2732j4206
$$ 14799 -6623 -5817 13794 -8702 -8573 17378 -3950 -13316 12840 -168 -10362 12370 -1836
403a836j1862K7861j0318k0196K4896k281j9085K1014k923k0900K3529K816k6196
$$ -1836 -13698 14163 3845 -16351 8545 6264 -12821 8193 5270 -15630 7899 10715 -15481
416a5481J7480Q960k2661J4029Q047k4381J4676J4329k6914P009J8360k1447M005
$$ -15481 1999 10959 -11702 2327 10374 -14007 669 14998 -11916 -4907 13453 -7994 -3989
429c989J6876k2176K816K2072k1153m818K2958j4934o669K1129j4820q939K4778
$$ -3989 12887 -9289 -6473 15599 -5554 -10372 12586 -2348 -9017 12112 -2708 -11647 13131
442A3131j1320j5416K2764n379j5523K0563m813j7856K1974O1k2042J7641N161
$$ 13131 1811 -13605 9159 3780 -11743 8820 4007 -13849 8125 8186 -13856 3785 8946
455H946k0573J4995O046k2320J4246J1213k3800Q810J4454k1063O256J5095k1634
$$ 8946 -11627 3368 9414 -12906 1340 12553 -11247 -2437 12017 -9046 -2790 12305 -9329
468i329M054J9254k0360j728K0347j6347m071K0158j5204p034K2206j1964j1516
$$ -9329 -5275 13979 -6381 -8109 12238 -4109 -8180 11978 -3226 -10260 11946 -18 -11534
481a1534K1179p982j2779K0325o169j5585K0426j852j8348J7489J895j8408J5448
$$ -11534 9645 1663 -11116 9209 3040 -12545 7881 6029 -12319 5170 7065 -11343 4105
494D105M066j9694J3780P897k0672J0397J0727k0082P921J2951k0108N053J5702
$$ 4105 8171 -11523 2257 10154 -10518 -121 10606 -9476 -1555 11396 -8712 -3659 12043
507A2043j8962J314J7261j7038j587J8504j5249m808J9470j2798p906K0035j0242
$$ 12043 -6919 -5605 11656 -5382 -6969 11535 -3714 -8522 10948 -1850 -9756 10279 37
520C7j0863J9851o849j3385J8786l874j5044J7792r47j7043J6052K742j7749J3325
$$ 37 -10826 9025 2176 -11209 7577 3703 -11341 6451 5504 -11539 4513 7255 -10494 2831
534B831N111j8143J1936P823j9201Q808J1123j8056N646J2210j7319M062J4413
$$ 2831 7942 -10201 1735 9558 -9643 -835 10288 -7768 -2122 10088 -7231 -3169 11244
547A1244j7334L78J6628j4632k811J6337j3016m432J8128j1844q594J8794p647
$$ 11244 -6090 -5712 10916 -3716 -6527 9810 -3206 -7638 10490 -1354 -9948 8846 1199
560A199j0620J6765o052j1510J8018m084j5391J6729R83j5883J3291K299j5856
$$ 1199 -9421 7344 1292 -10218 7800 3716 -11675 5054 6037 -9846 3445 5744 -10112
573a0112J3469M958j8623J0269R473j6959O563R489j6383O408J2276j7508J728
$$ -10112 3357 8315 -10308 -39 9434 -7525 -962 8527 -7856 -1448 10828 -6680 -4952
586d952J5270j3830j397J3780j2817j687J6148j2562o685J7450p814q623J4770
$$ -4952 10318 -3512 -4909 8871 -3946 -5633 10515 -2047 -8732 8718 904 -7719 7051
599G051o984q857J7028n503j3617J5881j12j3498J2490j36j3445J4134K425j7301
$$ 7051 67 -8790 8238 2735 -10882 4999 4887 -8611 3879 3743 -9702 4432 6857 -10444
613a0444J1070P352j5483P554O954j5372Q147J0162j7395L450J3349j3435P06
$$ -10444 626 7978 -7505 49 7003 -8369 -222 9940 -7455 -4005 9344 -4091 -3385
626c385J1542j3285Q41J4864j3435m761J6098q328o384J3499q216o616J6230o710
$$ -3385 8157 -5128 -4287 10577 -2858 -7619 8479 151 -6233 7266 -950 -7566 8664 1954
640A954j1650J5028j557j1228J2079k099j1620J4221P74j5742J0886N592j3597
$$ 1954 -9696 5332 3775 -7453 4626 2527 -9093 5128 5902 -9840 1046 6638 -6959
653f959P957M566j4154R277Q207j6674M614J1413j2982K419R670j3550K886J3466
$$ -6959 998 5564 -8590 687 8894 -7780 -3166 8247 -4735 -2316 7354 -6196 -3310 10156
667A0156j4007k757J4662r117l922J2398r757m185J5770q450r627J4854l391r177
$$ 10156 -3851 -6608 8054 -1063 -4985 7413 -2344 -6529 9241 791 -8836 6018 2627 -6550
681f550J2156m166r729J4397j296j3933J1365L188j1921Q774K052j2694J0370
$$ -6550 5606 1440 -8289 6108 4812 -9121 2244 5432 -6489 2285 4337 -8357 2013
694B013N625j5541O066Q937j2255L940P432j2802M514J0949j3703m04J2557r651
$$ 2013 7638 -7903 -1837 7100 -5155 -1215 6217 -6585 -2071 8878 -4825 -5229 7328 -2323
708b323j645J0853j0301j980J4195r483o867J3881n110p036J1795n641p653J4069
$$ -2323 -3968 6885 -3416 -5396 8799 -684 -7551 6330 1220 -5816 5979 338 -7315 6754
722F754l457j1607J1986O14j0702R793L69j1507J0785L359j3971P488O385j1905
$$ 6754 3297 -8310 3676 4290 -6412 3381 3750 -7757 3028 6387 -7584 -96 6289 -5616
736e616N563N814j2378N647Q698j3152J870J0478j0439K26R814j0449n25J2201
$$ -5616 -53 5761 -6617 -970 7728 -5424 -3554 6924 -3515 -3289 6525 -3924 -4449 7752
750G752r726m133J2411o807m889J1504o685n914J3062m945q979J2023j879r185
$$ 7752 -1974 -6107 6304 -503 -5392 6112 -573 -6487 6575 1630 -7349 4674 2795 -6390
764f390J0620j215j0154J0852J145j1893Q808L526j1391P339M296j1963O523O636
$$ -6390 4230 3015 -7139 3713 4858 -7035 1773 5299 -6092 1247 5543 -6420 103 6739
778F739j2277L849Q129j0881K178Q659j0568P58J0256r746j758J0844p968l145
$$ 6739 -5538 -1689 6440 -4441 -2263 6396 -4172 -3414 6842 -2904 -4662 6182 -1786 -4931
792d931J0947p099m694J1579n447o556J1117l500p608J0567k140q735J0230k76
$$ -4931 6016 -1083 -5777 5802 355 -6201 4916 1416 -6192 4375 2235 -6500 3730 3454
806C454r856R161J511j0492Q088L121j0888O736M732j1032N372O065j0942L779
$$ 3454 -6402 2759 4270 -6222 1866 4987 -5901 835 5567 -5465 -93 5972 -4970 -1191
820a191P472j0508J922Q523r707M30R449r072j592J0287p526l218J0155o309m224
$$ -1191 6281 -4227 -2305 6218 -3489 -3059 6390 -2682 -4274 6013 -1513 -4731 5424 -885 -5109
835e109J0499n265o198J0598l016p374R501j643p926R355k20r542Q510K069r646
$$ -5109 5390 125 -6073 4525 1509 -5865 3636 1993 -5933 3422 3202 -6340 2170 4239 -5407
850e407O732K892r628O463M436j0835M690O588r871K565O779r307K296P949r727
$$ -5407 1325 4217 -5411 1052 5488 -5347 -657 5931 -3940 -1375 5404 -3903 -1607 6342 -3385
865c385j54R623p767k023Q818o903k300R927o610m876J0409l744o085Q663k934
$$ -3385 -3539 6084 -1683 -3706 5112 -1791 -4091 5836 -774 -5650 4759 1015 -5070 3593 659
880F59n950R433k093q339Q779Q73q417O699J218q142P238K500j0055N461N249
$$ 659 -5291 4142 2049 -6290 2489 3362 -5055 1644 2862 -5280 1958 4458 -5597 -136 5113
895E113q835L197M778q440L717O289r684J261Q380p680p48P301p057m93Q842p333
$$ 5113 -3722 -525 4253 -4187 -470 5819 -3865 -2604 5776 -1904 -2652 4649 -2408 -2901 5941 -1392
911a392l468R645m359m572P960m048m391R318l441p281Q899j27p369O672j35p094
$$ -1392 -4860 4785 426 -4146 3814 -234 -4625 4693 1252 -6029 2870 2743 -4626 2046 1911 -5183
927e183P670J207r351O002M064q238L831L510p964M542N257r404J888P277p186
$$ -5183 2487 3694 -5657 345 4409 -3829 2 3512 -4452 90 5347 -4057 -2169 5108 -2078
942b078K00O132p039N84P899p469k399Q818m637l348P253m728l289Q965m038o236
$$ -2078 -1878 4254 -2785 -2201 5698 -1771 -4170 4648 11 -3337 3916 -812 -4101 4864 826 -5410
958e410Q486j021o153O679j374o163Q024L5q615O351K824p495M567K253p641N275
$$ -5410 3076 2055 -4098 2581 1207 -4956 3068 3103 -5512 839 3663 -3832 735 2988 -4653 622
974F22M156r052K684O091o932J336M948p196J697P052p560j382P854m817k168
$$ 622 4778 -4274 -1590 4501 -2431 -1095 3853 -3343 -1646 5406 -2154 -3536 4318 -499 -2667
989b667O436n093k114Q262m535n051P890j770m925O500k213n247P856q28p609
$$ -2667 3769 -1324 -3438 4824 289 -4762 3128 1358 -3567 2933 720 -4527 3329 2501 -5108
1004e108O376J768o641M922J133p067N802L045q599L540M932o988K319M229p297
$$ -5108 1268 3036 -3605 1317 2450 -4617 1185 4230 -4369 -829 4103 -2885 -566 3663 -3634
1019c634K558O171p749k23P058n394j000O039n578j180P645n147l806P648k705
$$ -3634 -1076 5095 -2654 -2877 4181 -1213 -2213 3826 -1752 -2932 4713 -434 -4240 3408 703
1034G03m091O504k761m483P489j544o404O388N47n958N257M84o376N705K061p685
$$ 703 -3388 3116 355 -4128 3361 1817 -4587 1801 2348 -3610 1647 2131 -4245 1460 3521 -4164
1050d164M000L776o746K941L714o977K760N137p295Q41O098n925o3N863n874p01
$$ -4164 -164 3612 -3134 -193 3521 -3456 -696 4441 -2854 -2013 4085 -1840 -1903 3960 -1914 -2615
1066b615P031n292k641P168l683l305O715l250l954P191k209n388O570o21n579
$$ -2615 4416 -876 -3517 3651 -32 -3337 3378 128 -3826 3365 1156 -4232 2338 1717 -3862
1081c862N835Q5o091N516J372o778M421K637o576L582L244o733K905M270o714
$$ -3862 1973 2058 -4033 1483 2855 -3923 498 3135 -3441 141 3385 -3348 -443 3827 -2887
1096b887J725N029o227P05N569n780l09O142n187j479O415m418k397O715l648
$$ -2887 -1162 3867 -2360 -1655 3914 -1866 -2175 3967 -1220 -2699 3716 -702 -3099 3616 -32
1111c2l415O710k745m225O586j765n015O233n94n570N529L85n840N082J293o482
$$ -32 -3447 3263 518 -3707 2879 1114 -3901 2332 1738 -3832 1697 2082 -3758 1324 2617 -3865
1127c865M370K666o492L212L329o281K591M020o386J531N067n698K10N206n183
$$ -3865 505 3171 -3321 -109 3220 -3061 -470 3550 -2836 -1305 3762 -1936 -1726 3480 -1703
1142a703k52N763n030j631O461l779k784O043l112l010O293k650m379O236r32
$$ -1703 -1955 3808 -1222 -2853 3608 -171 -2955 3088 -24 -3034 3259 609 -3770 2466 1534
1157A534m923N362n07n022N506L13o323M809K313o240L366K444n901L491L250
$$ 1534 -3389 1973 1466 -3556 1950 2263 -4060 749 3062 -3178 188 2632 -3269 222 3472
1172C472o761K176M793n809P21M547n305O99N399n633j133O366l869k264N476
$$ 3472 -3289 -1113 3680 -2129 -1408 3139 -2166 -1467 3932 -1701 -2834 3532 -337 -2601 2875
1187B875l447k102O228l391l950O468j262m502N047r84m252N713m60n954N036
$$ 2875 -572 -2674 3554 163 -3787 2681 1419 -3083 1964 980 -3272 2441 1981 -3973 1063
1202A063J716n720L491J599n365M113K369o818K773M289n692J257L684n297J706
$$ 1063 2779 -2941 550 2149 -3216 897 3266 -3552 -779 3510 -2182 -925 2759 -2538 -832
1217h32M639o078j65N927m275j400M931m001j045O046m157l173O394j931l725
$$ -832 3807 -2271 -2436 3491 -784 -2184 2747 -1254 -2299 3747 -410 -3583 2811 880 -2845
1232b845M970j781l351N845j410n282N318Q74n107L791P06m884M508J581o389
$$ -2845 2125 344 -3007 2838 1428 -3854 1464 2338 -2769 1022 1728 -3156 1352 2933 -3456
1247c456L196L493n377J778K827n177K413L975o127N27N285m491n97M406m333
$$ -3456 -260 3233 -2144 -366 2461 -2716 -303 3672 -2455 -1928 3357 -1134 -1731 2675 -1658
1262a658k74N598m537k364O014k503k819M905k595k745N948j997m698N398J42
$$ -1658 -1932 3666 -871 -3235 2779 276 -2543 2362 -233 -2978 2970 973 -3725 1673 1815
1277A815m502M048q8m461M824R61n927L466K691n035K320K213n079K807L469n905
$$ 1815 -2687 1361 1273 -3188 1636 2597 -3330 136 2827 -2208 112 2325 -2754 53 3522 -2383
1293b383Q94M619m329JL833m423K11N118m559j770N532k799k205M640k964k244
$$ -2383 -1489 3130 -1199 -1198 2635 -1788 -1577 3541 -1018 -2788 2744 -55 -2260 2380 -584 -2828
1309b828N759k302m100N189m79l879M216p09m075M971L68n491L793J989m786K814
$$ -2828 2931 629 -3471 1718 1239 -2640 1576 867 -3208 1763 2131 -3360 433 2422 -2364 450
1325D50J693m987L091K961n648J449L984m428O26L499m552O04M721m555j198N096
$$ 450 2143 -2844 247 3208 -2440 -991 2993 -1435 -809 2690 -1862 -1258 3463 -1092 -2290 2806
1341B806l094j706M498l096j878N349k609l395N100j140l463M399j082l780M847
$$ 2806 -288 -1994 2504 -592 -2470 2879 270 -3125 1975 835 -2628 1771 689 -3091 1756
1356A756j45m848M059J129m572L295J188m755L343K208n286K238L115m704J473
$$ 1756 1611 -3237 822 1951 -2621 674 1862 -2893 450 2658 -2628 -390 2725 -1979 -506
1371e06L188m652J062M025m559j76M495l662q48M365l425j352M821k911k378M872
$$ -506 2682 -1970 -908 3117 -1442 -1618 2877 -785 -1633 2732 -693 -2045 2776 -135 -2513 2359
1387B359j949k916M530j399l374M496o34l951M108J81m236L705Q16m508L283J566
$$ 2359 410 -2506 2024 625 -2749 1747 1113 -2838 1270 1451 -2785 920 1736 -2772 511 2077
1403B077m699K686K247m678K055K847m587J360L317m376P44L791m182l8M254l692
$$ 2077 -2622 64 2311 -2367 -312 2535 -2052 -692 2625 -1751 -1007 2784 -1398 -1436 2818 -874
1419h74q47M339l140j393M495k703k192M663j833k866M263j296l089M294p65l830
$$ -874 -1721 2618 -522 -1915 2580 -123 -2315 2348 515 -2351 1912 616 -2473 1821 1056 -2774
1435b774M072L05m160L282Q29m034L057J326m456K506K353m294J487K617m016
$$ -2774 1298 1603 -2557 725 1554 -2480 577 1903 -2553 -47 2306 -1988 -501 2116 -1900
1450a900J410L146m479N56L966l663m88L719l207n59M147l258j536M589k182k310
$$ -1900 -490 2656 -1823 -1267 2699 -964 -1452 2267 -940 -1499 2648 -610 -2146 2443 261 -2049
1466b049L965j722k290M265j460l389M185p3l629L172J69l405L399N82m379K845
$$ -2049 1916 194 -2096 2169 709 -2680 1505 1432 -2197 975 1144 -2261 1138 1720 -2659 186
1482A86J983m037J675J896l690J893K421m355R41L507l488p6L030l153J74L659
$$ 186 2169 -1868 -193 1703 -1987 -94 2327 -2028 -1087 2420 -1068 -1144 1886 -1267 -1093 2566
1498B566l551j075M318k204j811L490j983j524M087k023k859M214m97l100L133
$$ 2566 -985 -2060 2258 54 -1757 1733 -250 -1774 2313 290 -2569 1645 1148 -1952 1181
1513A181m64k827L666r8m098L163J491l765J914J250l391K381J791m363J383L102
$$ 1181 717 -2110 1556 1458 -2640 523 2014 -1751 163 1413 -1978 403 2194 -2169 -786 2316
1529B316l444K83K565l149O49L215l604p09L966k230j373L093k132j039L846k232
$$ 2316 -1128 -845 1720 -1429 -780 2435 -1169 -1878 2088 -142 -1515 1578 -554 -1593 2253 21
1545B1k472M011o74k683K958p38k400L619m59l669L179J012l352K120P49l186
$$ 21 -2451 1560 886 -1797 1161 423 -1977 1642 1183 -2486 693 1705 -1647 473 1222 -1964
1561a964K663J349m192J695K624l356P18K111l196J085K828l665k03L547k458
$$ -1964 699 2048 -2144 -449 2175 -1181 -463 1648 -1548 -463 2365 -1300 -1503 2044 -414
1576d14q24K846k401o40L638k387k031L724r75k178K867j064k050L505p04l234
$$ -414 -1238 1608 -793 -1433 2205 -182 -2213 1511 536 -1642 1225 161 -1889 1616 912 -2322
1592b322L053N98k936K241L56k943K708J059l806J779K076l101J102J669l153
$$ -2322 731 1329 -1607 634 990 -1953 755 1814 -1992 -213 1863 -1238 -136 1533 -1620
1607a620J416K461l611K24L097k605k83K592k613k37L349k551j484L439j384j667
$$ -1620 -204 2257 -1354 -1130 1967 -638 -921 1671 -942 -1179 2170 -381 -1865 1574 190 -1477
1623a477K879j464j778L504j000k840L041J56k629K376N0k727K700P36l452J896
$$ -1477 1402 -62 -1840 1664 664 -2176 865 1021 -1608 768 818 -1909 791 1527 -1925 -29
1639b9J648k941J324J440l025J453K148l349M75K686k601M0K377k610J2K966k569
$$ -29 1619 -1322 2 1442 -1583 -130 2018 -1331 -856 1830 -771 -731 1646 -964 -952 2014 -555
1656e55r55L169j739j288K881j670j479L273j272k267L036m52k327K614l15k490
$$ -555 -1510 1659 -80 -1368 1513 -157 -1636 1637 365 -1902 1134 682 -1645 969 654 -1836
1672a836K755K70l042K199J021k885J672J231k924J508J696l080R28K166k748
$$ -1836 919 1189 -1853 346 1367 -1518 154 1385 -1539 -31 1665 -1415 -487 1679 -1069
1687a069M86K244k590M7K635k399n39K838j966r96K847j650j353K916j300j754
$$ -1069 -583 1661 -929 -882 1753 -646 -1185 1653 -313 -1309 1538 -112 -1465 1451 151 -1603
1703a603K909r02k078K786m32k376K562J8k559K326M66k794K029J000k845J570
$$ -1603 1306 404 -1674 1112 680 -1696 866 884 -1675 651 1117 -1677 352 1352 -1493 77
1719G7J318k802J328J667k938Q65K203k669K12K305k350m7K500k285o29K851j757
$$ 77 1395 -1407 -79 1588 -1350 -485 1718 -951 -739 1566 -784 -831 1669 -616 -1245 1606 -151
1736a51j183K663j395j304K795j249j888K867m96k210K337j74k103K364K1k644
$$ -151 -1334 1329 -66 -1370 1425 176 -1712 1155 659 -1551 786 612 -1491 873 894 -1750
1752a750K216Q42k720J540J025k522J581J253k949J157K002k606M05J888k304
$$ -1750 466 1308 -1412 128 1153 -1369 212 1465 -1484 -327 1675 -931 -526 1362 -942
1767i42M64K170k572k27K760j891q95K373j556p93K657j640j572K896p09j926
$$ -942 -478 1692 -880 -1107 1653 -238 -1133 1240 -316 -1109 1548 -92 -1664 1232 523 -1403
1783a403K213n00j688K463m10k500K359O69k528J522O93k225J769Q80k881J359
$$ -1403 810 310 -1378 1085 675 -1825 534 1203 -1325 197 890 -1335 434 1314 -1567 -208
1799b08J789k492N48J544k209Q17J891k709N1K595j895o17K050j660l15K472j969
$$ -208 1581 -911 -363 1181 -1028 -211 1680 -1029 -978 1617 -278 -895 1155 -505 -820 1652 -317
1816c17j241K858r01j641K102q02j310K499p80k256K433L72k255J556K74j917
$$ -317 -1558 1300 399 -1242 860 58 -1252 1247 467 -1789 644 1016 -1239 317 591 -1326
1832a326J962M87k775J552J533k384P06J246k082J072J549k676L45K336j912l41
$$ -1326 636 1123 -1652 -100 1433 -951 -245 1001 -1081 -9 1540 -1136 -791 1545 -367 -708
1848g08J809j754L8K268k112q85K703j119j315K025j048r80K460j117j909K471
$$ -708 1101 -653 -615 1653 -459 -1344 1359 240 -1075 950 -98 -1078 1382 265 -1644 827
1864H27p3j957J747j40j732K149J01k579J776J094k258J023Q58k066J386J216
$$ 827 754 -1203 544 404 -1328 821 922 -1657 119 1213 -1045 -22 836 -1230 156 1372
1880A372k640P10J989k043P3J619j877K90K080k149n57K451j332q86J948j298
$$ 1372 -1268 -558 1431 -612 -539 1080 -797 -507 1573 -576 -1133 1318 -14 -900 1048 -250
1896b50p15K385j296j566K396m05j635J812m42j534K186j89k245J845O21k041
$$ -250 -965 1420 124 -1442 954 549 -1086 726 284 -1250 936 747 -1498 347 968 -1073
1912a073J315M80k010J582R27k495R40J553k014M65J337j959N73J798k144j80
$$ -1073 242 722 -1288 294 1221 -1274 -334 1219 -795 -330 1007 -952 -379 1419 -725 -905
1928i05K141j519m69J830j491n14K286j369j249K252o45j349J856o58j380K184
$$ -905 1236 -283 -752 1078 -413 -927 1359 -10 -1259 993 348 -1001 855 197 -1183 1001
1944A001l58k006J896K85j890J510K77j957J627P01k316J141J191k014P94J115
$$ 1001 643 -1363 533 818 -1072 438 715 -1242 385 1086 -1230 -89 1102 -912 -118 997
1960I97k044P83J550k144J97J872j752j21J763j661k52K077j514q27K131j035
$$ 997 -1047 -264 1286 -858 -661 1211 -541 -662 1101 -560 -812 1265 -249 -1076 1055 20
1976B0j014J973q94j216K123n97j627J962j03j741J712Q2j837J619M41k037J358
$$ 20 -994 979 85 -1131 992 395 -1232 730 627 -1114 598 680 -1157 462 903 -1134 224
1993B24Q08k048J051J028k049Q34J324k048M95J560j925J84J739j764j24J845
$$ 224 1032 -1016 35 1063 -986 -152 1172 -876 -381 1179 -746 -562 1177 -587 -711 1134
2009A134j598l81J996j432p40K087j096j065K008p86j223J999n66j561J955j25
$$ 1134 -464 -845 1151 -281 -1021 1066 -30 -1095 913 127 -1096 903 337 -1224 731 606
2025F06j760J666J75j791J562M19k034J344R21k031Q71J058j876P97J251k044
$$ 606 -1154 512 687 -1104 458 877 -1157 187 1108 -923 -52 1006 -870 -73 1178 -866
2041h66M50J689j836o4J670j556r6J800j640n39K116j179r59J845q96r04J948
$$ -866 -416 1273 -563 -627 1043 -513 -609 1191 -449 -988 1128 -51 -1010 835 -61 -965 983
2058I83r09j368K119l11j651J619n0j511J688P5j958J573P17j959R76P86j716
$$ 983 74 -1294 825 514 -1137 482 432 -1079 609 684 -1274 299 1016 -943 33 819 -897
2075h97J065R55k133P07J591j820P9J419j516K00J576j798k73K037j240q04J660
$$ -897 168 1123 -1010 -303 1288 -532 -453 966 -550 -350 1226 -572 -845 1192 -48 -852 808
2092H08j010o05J890j127j210K096m07j475J520k71j207J755k88j834J732N19
$$ 808 -202 -807 1083 -44 -1254 842 435 -1040 480 209 -998 757 469 -1365 367 886
2108H86j834J062M91j570J292O45k134R85J385j798L07J123j551N87J368j968
$$ 886 -948 114 605 -965 327 972 -1162 -177 1208 -590 -283 840 -711 -124 1244 -724
2124g24J5J948j348n70J507j119l06J787j360r90K084n63j281J483m67j017J781
$$ -724 -709 1239 -109 -679 828 -291 -597 1190 -170 -1160 924 361 -920 563 96 -921 860
2141H60n21j679J776L52j697J065K83j404J382L96k024J134J137j739M94R03j501
$$ 860 339 -1340 436 788 -909 156 439 -965 417 813 -1211 -77 1060 -679 -185 718 -783
2158g83P78J144j979K53J733j386k79J326j229k2J631j506o67J990p64j027J458
$$ -783 -5 1139 -840 -587 1146 -240 -519 807 -422 -444 1187 -319 -986 1004 240 -787 671
2175F71o70q10J760p07j463J768Q9j521J176Q6j328J439K26j905J182R37j687
$$ 671 1 -809 951 244 -1219 549 638 -883 293 379 -949 490 716 -1189 -7 930 -757
2192g57O55P76j514Q41R94j876M18J495j442j4J219j337J37J547j540m42J822
$$ -757 -102 674 -840 1 995 -881 -463 1032 -410 -424 795 -542 -405 1142 -398 -840 982
2209I82r44p29J456q63o27J714q53j194J733k41j267J350k10j227J517Jj695J269
$$ 982 38 -691 765 -98 -725 989 136 -1058 675 434 -833 517 307 -920 597 598 -1097 172
2227A72N89j533Q50N47j514R92Q13j794N80J225j477K31J128j407K32J393j481
$$ 172 761 -772 78 625 -889 103 916 -878 -298 927 -550 -319 809 -598 -366 1027 -454
2244d54k51J603j043m71J423r97n01J643r24r51J650m72j049J391l73j093J513
$$ -454 -705 898 -145 -616 807 -190 -691 952 28 -923 727 255 -794 597 224 -869 644
2261F44j59j427J295K36j395J071L11j444J072N93j651P58R09j484N02R55j439
$$ 644 485 -942 353 589 -806 265 576 -868 204 797 -854 -96 813 -671 -169 786 -653
2278f53L78J188j437K9J361j204k13J382j099l92J527r41o99J526o71q71J447
$$ -653 -275 913 -524 -495 866 -338 -551 831 -268 -660 867 -74 -773 753 82 -789 658
2295F58m84r88J430k91j185J329k5j294J202K30j400J043M19j430R07O03j492
$$ 658 174 -814 616 325 -860 469 444 -850 352 582 -818 225 644 -786 121 724 -768
2312g68P11Q53j454M68R82j341K77J108j338L1J336j157k81J342r60m03J391q99
$$ -768 -57 796 -658 -190 792 -549 -272 836 -502 -471 865 -292 -573 769 -191 -594 797 -102
2330a02o60J505n98r29J338l61r32J323k71j209J301J38j332R85L13j220R78L58
$$ -102 -762 743 145 -784 554 193 -739 584 313 -896 405 543 -789 196 509 -711 267 625
2348F25j488Q84P97j447M70Q35j250M98Q61j418K71J248j208j54J152r78r2J235
$$ 625 -863 21 818 -629 -159 676 -574 -76 785 -633 -362 886 -322 -476 676 -302 -394 841
2366H41j120m37J530p39p85J247m90o40J279n75j009J435o8j222J006J11j048
$$ 841 -279 -716 814 75 -710 537 47 -593 686 111 -898 537 469 -753 253 364 -684
2383f84J090J02j419J035O52j407N37O49j144O55O72j462M37J156j240l3J016
$$ -684 406 508 -911 124 776 -631 -94 555 -589 66 738 -724 -287 869 -371 -404 612
2400F12r71Q7J107j235k35J464q26o00J126o18m03J266p94q14J453k36j062R94
$$ 612 -359 -272 835 -400 -635 829 3 -597 529 -89 -492 774 -20 -834 619 383 -679 315
2418C15j08q32J157j73j269J159M18j281O43M02j048Q23M55j466O11J022j218
$$ 315 207 -625 532 359 -910 249 667 -614 29 431 -617 206 661 -805 -194 828 -390
2435c90Q6Q33r74L00R44j288n8J372r01m50J037p02k20J200r09o65J424l67q97
$$ -390 -304 529 -445 -145 799 -489 -547 825 -76 -526 511 -191 -411 789 -120 -785 639 272 -625
2454f25R83k71o49J184l67j130J221K42j183P28K19r53R19K63j366P41Q05j189
$$ -625 358 87 -562 622 255 -875 346 588 -595 133 352 -601 318 581 -785 -44 761 -428
2472d28K43O69r67M29P98j295R6J231r33k87R62p67j21J111r40n09J341m60p61
$$ -428 -185 484 -483 -54 744 -551 -455 776 -157 -444 518 -249 -370 741 -199 -708 633 173 -588
2491e88R97l81n80J165m21r93J175R6j052P77J00q91R38J65j238P86N93j129M43
$$ -588 409 28 -552 613 192 -801 374 470 -582 195 295 -596 342 507 -731 55 648 -481 -38
2510c8N20r95N24O77j236K44J008r56o6Q48q58J4J007r36l34J182n94n45R92m94
$$ -38 482 -513 11 688 -548 -304 704 -252 -318 530 -328 -314 693 -243 -577 605 11 -534 458 -36
2530c6n15J118m58q16J101q4q94Q73m4q60R57Q4j116Q08M24j044N45M42j018N74
$$ -36 -551 567 109 -707 394 310 -584 289 245 -615 342 426 -690 118 542 -502 43 485 -533 41
2550D1N91j141L44Q02r67J26P74r24R7R49r51j96J056p02l31R58o05m22J058n24
$$ 41 632 -509 -165 637 -330 -204 570 -354 -257 692 -259 -455 601 -101 -432 526 -79 -501 557 33
2570C3o44J038k53p47R34j62q25R44L3r92Q01K53r70O62L38j008O05N06j044M03
$$ 33 -611 427 174 -573 361 199 -626 318 351 -641 160 413 -557 105 443 -565 40 546 -498 -95
2590i5O66r72K57P41r41J15Q49q98l4R08p84j77R52p02l20R74n67m63R88m44o00
$$ -95 571 -401 -144 597 -344 -229 620 -278 -312 596 -188 -365 587 -115 -435 539 -28 -491 497 53 -547
2611e47R81k77p25Q88j04p69Q33pq85Q09J99r51O24L47r24N43M38r85M26O57r48
$$ -547 434 157 -568 320 216 -553 280 273 -612 197 396 -555 69 416 -508 35 473 -512 -86 571 -377
2632c77J84P03q22J31P55q74l1R61p38l01Q96n40l09Q99n78m72J036l66o61Q39
$$ -377 -193 510 -312 -181 574 -300 -331 630 -108 -409 487 -53 -362 537 -41 -513 523 157 -504 335
2652C35j94o11Q58k09p99Q93J23r29O11K36p89O24K25r73N87N59r67K47O00p85
$$ 335 141 -470 388 179 -620 273 396 -533 78 314 -475 149 374 -599 -12 547 -420 -173 427 -358
2672c58K78O05r49J24R15p62k33Q04n56j33Q10o85l58J053m13o26Q14k29m93Q52
$$ -358 -80 525 -424 -300 615 -147 -380 424 -132 -265 545 -140 -498 555 142 -484 330 101 -392 460
2692D60l42p19R37M4q80O15J33o79O83Q1r57O82M59r46L09M68p35M02M37r55K89
$$ 460 118 -601 336 380 -500 115 248 -431 252 333 -624 58 517 -429 -120 348 -387 15 452 -503 -214
2713b14P88q10o9O72o01L6P42q02k05J019m96m96P61l33l33Q44m70o20R89o5p95
$$ -214 574 -236 -305 367 -234 -198 544 -258 -463 556 60 -436 325 -8 -341 503 33 -587 402 337 -458
2734d58O52Oo06P43l7r11P48L72r09L65L54p08M96L28r77L98P03q26J4O03o43
$$ -458 194 200 -406 337 300 -611 137 509 -400 -35 319 -389 107 435 -542 -144 559 -267 -253 350 -293
2755b93J66O38q64n7R37n66l41O93m25j73P96n95m66R87k13o64O62j19m72P54
$$ -293 -127 511 -353 -410 527 -39 -380 313 -112 -285 511 -84 -550 437 224 -440 222 103 -369 385
2775C85j77p81P93K21q36M64K15o74N78K27r46M69O00q27J31N10o70K49N55q61
$$ 385 208 -573 220 441 -395 69 284 -390 188 415 -531 -62 538 -289 -158 352 -318 -69 486 -375
2795c75N4Q42o40k24O86n22j06P62o32l35R17l30n15O81k32m09P74k66o64P92
$$ -375 -321 521 -119 -343 343 -179 -285 477 -155 -490 427 97 -418 263 31 -378 396 130 -534 258
2815B58P6p49N51J19o66O32J49q64N35M32q02K73M20o83K92N06q22J30P14o72
$$ 258 334 -415 136 255 -411 221 370 -494 41 473 -329 -56 364 -319 -27 479 -343 -213 501 -171
2835a71r9O59n77p0P23o11k65Q20m08l96P24l36l96P61k71n79P58m9o22O07Ko21
$$ -171 -270 389 -188 -258 465 -146 -411 409 1 -395 329 -7 -403 358 87 -492 266 217 -405 202 204 -417
2857d17O24Q6p37N35K84p36L98L18p08L43M38p49J93N74o75N8O04o34l0O76n95
$$ -417 207 293 -444 91 375 -361 37 355 -353 -10 428 -321 -128 446 -229 -171 433 -201 -231 445 -150
2878a50j69P27m79k80P25l98l73P39k88m82P13j60n45O69p6o11O24O0o61N42J62
$$ -150 -319 408 -71 -351 374 -24 -397 342 54 -428 285 125 -420 249 173 -438 186 246 -415 127 289
2899B89o86M72K70p04L61L71o86K69M22o71J74N44o60L8O03n66o3O31n38j68P13
$$ 289 -397 75 345 -359 2 373 -313 -44 378 -293 -119 425 -235 -197 406 -160 -223 408 -130 -298 415
2920D15m56l09O80l16l55O57k76m59O99j16n86N83L2n71N32O8o56N37K21o99L65
$$ 415 -41 -350 330 14 -341 316 40 -419 280 164 -422 161 193 -378 154 222 -434 103 324 -375 -10
2941a0L16o18L23L38p03K56N25o57M7N32n30L6N29o01m6P04m88k60O09l39k27
$$ -10 306 -312 11 349 -354 -98 427 -230 -183 349 -181 -145 384 -217 -263 441 -47 -307 302 -37 -264
2962b64O13l77l68P21j72n38N46k6m49N43q1o01O08J58o83L67K63n57L62K43p07
$$ -264 349 -28 -396 325 153 -385 161 135 -314 229 148 -453 155 313 -370 -3 260 -297 65 308 -399
2983c99L28N06o69N9M84m99R8M67o43K1O85m88k59N91l28j62N71m41l08P30k13
$$ -399 -71 435 -234 -175 309 -190 -92 375 -268 -247 438 -50 -309 282 -46 -208 363 -78 -386 344 131
3004A31m84N29q2l78N49j55n53O23J29o54L69J81m79L92J55o60L73M19o48J07
$$ 131 -353 176 94 -284 265 110 -443 180 309 -345 24 205 -274 118 273 -387 -14 405 -243 -136
3024a36M20m92J75M17o58L9O71n04k06N32l46q2N54m81k77P22k28m56N07j22l28
$$ -136 284 -208 -33 384 -274 -235 436 -68 -274 258 -88 -170 384 -97 -374 348 120 -336 171 49 -279
3045b79N64j99n26O35Q1n98L70J09m40M47P9o47M01L84o26J46L48m71K28L47o40
$$ -279 285 86 -440 195 276 -322 48 157 -283 164 243 -404 -3 381 -245 -99 249 -222 6 353 -287
3066b87R8O02n03j33M78l72l8N39n09k21O98k70l96N05j72k70N56k26n18O33L9
$$ -287 -189 413 -90 -223 255 -117 -155 384 -125 -346 352 82 -314 191 19 -251 305 79 -439 194 233
3087B33n64M06O1m40M77N2o32M49L11o18J99K86m79K85L11o46J79N06n13l9M42
$$ 233 -331 75 136 -304 173 225 -407 42 353 -265 -66 220 -259 26 337 -309 -130 376 -137 -176 266
3108B66m16L0M85n11j38O24l12l00N04k44k32N66k89m14O21o2m88M40pm32M84
$$ 266 -150 -120 365 -146 -284 340 28 -272 232 -12 -244 322 33 -381 240 178 -310 130 123 -309 175
3129A75J6n71M50K12n58K68K38n20L07K91o15J97M56n43N0M30m70N0M73m85q8
$$ 175 191 -380 70 282 -276 -8 230 -290 17 308 -307 -110 346 -197 -147 283 -187 -137 336 -149 -237
3150b37N66l79j89N12l13k17N57k92l29N67j49l88M79q2m11M98l4m98M59R5n17
$$ -237 329 -50 -239 273 -40 -257 300 8 -321 246 97 -291 188 106 -305 193 159 -339 120 215 -302
3171c02L72J66n30L12K52n52K44L39n41J70L73n19Q0M60m88k3M93m14j06N15l69
$$ -302 70 236 -294 18 270 -282 -38 301 -240 -70 303 -216 -136 324 -164 -187 306 -108 -214 301 -68
3192f8j84N38l01k59N28k28l08N20j57l90N12o1m30M52km54M14J06n26L55K01
$$ -68 -252 286 -15 -274 254 26 -282 238 81 -309 203 142 -288 164 162 -292 122 228 -298 57 258
3213B58n09K80K40n32K33L46n34J04M11m72M0M28m70j3N21m17j60M99k91j96N02
$$ 258 -251 29 269 -263 -30 316 -218 -114 297 -175 -135 293 -177 -190 331 -86 -246 253 -38 -234 268
3234B68l04k57N56j93l91M95q0l64M58q1m29M82M7n02L58J43m52L13J65n26L12
$$ 268 -36 -293 263 70 -321 174 94 -270 188 107 -322 160 207 -295 63 206 -246 67 232 -294 18
3255A8K94n15J36L20m22J40L00m86Q4M71m54r9M54l02r9M28l67j71N67k65l23
$$ 18 312 -203 -67 253 -169 -29 271 -215 -131 340 -114 -213 241 -61 -160 268 -99 -270 297 32 -291
3276b91M61j21k82M33j59l84N27J8n14L65J06l91L37P5n02L60K60n18J57K95l91
$$ -291 170 49 -233 200 41 -343 184 202 -312 53 159 -232 105 180 -322 38 298 -220 -63 232 -159
3297a59J60K66n08J37M57m57o8M00k93l9L82m10j10N52k73k98M24j45k13M28k37
$$ -159 1 267 -241 -104 353 -104 -172 228 -65 -104 278 -132 -242 310 37 -261 163 18 -195 233 -4
3318dl25N24k6m53L53N9l54L60%m83M02K35n28J95K51m08K31K26n32J93M32m79
$$ -4 -329 195 169 -284 69 128 -226 134 134 -349 53 288 -240 -45 206 -202 29 255 -277 -84 348 -131
3340a31k7L88l28K9L69m35q0N42l05k56M25j89j67M31k89k92N40r4m02L68j1l11
$$ -131 -158 230 -98 -69 300 -135 -215 327 22 -234 191 2 -165 266 -23 -315 225 131 -271 97 86 -225
3362b25L71k7m81M43J54m84K04K11l82K60J91n50K60L80n29Q0L19l39J10K89m26
$$ -225 146 119 -362 81 235 -249 -45 166 -216 44 235 -315 -55 325 -204 -124 195 -144 -34 255 -171
3383a71j3M59l57j41M49k39j67M68l21k45N08j21l59M08q9k85L97r9m00M29R0
$$ -171 -184 275 -82 -223 226 -13 -180 288 -33 -278 230 109 -250 158 69 -216 181 82 -318 111 201
3404B01m49K60J34l79L04J22m95K66L02m64R8K87l64J27L09m47M1M37l65j07M07
$$ 201 -248 12 146 -233 71 193 -302 -36 266 -198 -100 187 -177 -50 259 -188 -147 290 -75 -182 225
3425B25k88r1M39l23k13N04j83l05M16j14k79M13j08l83M35K7m09L14Q4l93L15
$$ 225 -63 -154 285 -38 -251 253 70 -235 181 67 -212 201 93 -290 145 172 -237 77 161 -232 83
3446H3J04m52K72K24m43J49K61l97J46K94m34P1L79l77l4L70l06o4L93k97j50
$$ 83 187 -265 7 231 -212 -63 198 -199 -53 241 -193 -122 257 -120 -154 216 -90 -154 239 -58 -208
3467b08M41k34k04M15j84k42M20j22l22M08m1l66L70K4l84L08R8m03K75J60m34
$$ -208 233 -1 -205 210 26 -216 204 82 -240 168 127 -239 131 155 -229 79 177 -226 49 209 -225
3488b25K43K10m38J57K83m12J01L08l79L1L54l51l4L69k88q5L67k62j46M14k08
$$ -225 18 228 -210 -53 230 -182 -81 227 -152 -121 233 -118 -152 217 -71 -156 211 -51 -197 217 9
3509Ik34M06j33k59L72r9k85L73k6l55L33N8l68K79R4l97K72J87m43J76K50l65
$$ 9 -225 181 48 -211 161 62 -223 150 124 -231 102 160 -208 71 165 -232 40 227 -216 -40 210 -155
3531a55J32K30l93R9L39l81l1L69k84n1L35l08q8M22k46k20L85j31k10L72j67
$$ -155 -23 207 -186 -87 252 -129 -160 209 -75 -126 209 -99 -187 235 -11 -231 154 23 -187 185 18
3552A8k55M06o1l37L13L8l00K84J8l70L00J66m20J69K09l35J62J91l94J39L16
$$ 18 -237 169 108 -229 84 122 -178 106 124 -246 54 220 -200 -31 178 -157 5 196 -198 -59 257
3573B57l82qL22k68j0L00l23n9M14k44k04L61j57j57L49j94k36M26o6l54L01L4
$$ 257 -125 -133 189 -79 -89 211 -112 -171 243 -1 -205 156 -1 -158 191 -3 -239 187 121 -233 68 102
3595A02k74K94k9l53L41J27m06J83J69l01J85J22l66J62K95l75QK91k82N8K58
$$ 102 -172 122 93 -260 81 208 -198 -15 154 -147 38 160 -206 -44 251 -124 -116 175 -107 -49 209
3616B09l47j6M19k81j68L35j65j13L19k17k05M31j05l21L14qk43L05o7l37L55
$$ 209 -138 -154 265 -16 -184 151 -14 -127 192 -25 -230 201 96 -225 89 81 -162 143 76 -261 94
3637I4R5l92J92J42k86K05J12l88K10K61l72L4K56k75Q1K35l53RL84k78j35L13
$$ 94 189 -203 -11 131 -155 50 162 -226 -16 245 -127 -93 163 -112 -31 204 -149 -140 244 -34 -169 144
3659A44j76p7L10k55j50M01j30k70L03n4k09L19j00k99L51O1l58K11R3k72K33
$$ 144 -32 -109 201 -54 -204 197 67 -203 100 46 -163 156 56 -243 108 169 -189 22 115 -157 76
3680G6P6l94K44K26l72O8K22k73R9K30l67N6L47l04p8K95k19m0L09k69j28L86
$$ 76 152 -242 2 228 -144 -76 146 -127 -28 202 -165 -109 238 -66 -144 151 -68 -108 201 -68 -196 190
3702A90j49k25K85q5j77L30j31k68L38K1l18K40M7k66K55M7l55K37J90l58J12
$$ 190 41 -184 101 16 -161 169 38 -230 108 129 -189 51 98 -168 87 134 -221 16 206 -152 -40
3723d0J97k95J22K10l69Q8L16l10m0K90k39l1K95k57j16L61j71j97L12j22j67
$$ -40 157 -138 -16 194 -175 -87 229 -81 -121 169 -70 -101 194 -63 -179 182 11 -186 126 4 -163
3744a63L18j22k57L41j8k99K67K2k65K59L4l10K38J20l24J52J61l02J45J83l20
$$ -163 155 33 -224 117 99 -200 67 89 -176 83 117 -193 45 165 -159 -7 154 -148 -3 180 -140
3765a40P5K55k94K1K71k85%K86k60o5L17k04j33L16j64j62L22j21k14L10p2k50
$$ -140 -65 190 -104 -83 188 -97 -97 189 -71 -136 181 -23 -156 160 -4 -166 156 35 -179 131 59 -191
3787a91L04k1k77K75K4k85K26P1l12K09J42l22J39J80k91R9K00l01P3K43k77j4
$$ -191 113 92 -185 90 114 -171 55 126 -186 23 165 -157 -18 162 -129 -30 170 -131 -58 185 -92 -106
3809a06K84k50k8K74k46o6L23j97j65L18j30j62K89j13k08L22n4k80K74L1k76
$$ -106 178 -72 -100 174 -72 -138 185 -12 -177 141 11 -151 138 25 -183 139 85 -195 79 110 -166
3830a66K34K9k93K50J04l33J54J80k94J36J48l07J21K39l22J3K75k48jK53k62
$$ -166 68 97 -196 54 158 -175 -21 159 -135 1 149 -158 -37 202 -120 -107 168 -80 -81 172 -90
3851i0l3L17k15j39K97j29j46K84j57j62L31q8k60K67J3k35K47k6k68K70Q3l37
$$ -90 -123 194 -21 -160 137 8 -138 146 -11 -173 158 70 -190 77 90 -145 102 76 -192 78 161 -176
3873a76J69J45k66J54J15l18J64K19l22K1K59k50L4K17k91J8L19k56j09K96j54
$$ -176 -7 138 -128 26 141 -177 -13 206 -116 -95 164 -86 -52 165 -126 -108 211 -45 -154 142 -12
3894a2r6K56j85j43L41j05k47K69k3j96K54p4k47L19L6l18J81J12k39J78N5k98
$$ -12 -108 148 -37 -180 161 56 -191 78 55 -141 113 39 -208 111 147 -171 10 122 -117 61 116 -182
3916a82J91J92l17N3K20k51P4J78l10O0L05k67q4K67j57n9K45k32q8L55j61k23
$$ -182 9 201 -116 -63 157 -94 -20 158 -152 -92 213 -54 -138 129 -28 -87 158 -74 -162 193 32 -191
3938a91K88o8j57K66j22k19L22%l00K06P2k32K11K5k91K30J47l24J09J70k39J10
$$ -191 97 29 -128 138 16 -203 119 119 -181 25 97 -135 76 101 -190 40 187 -137 -28 142 -97 13
3960A3J45l00R4K63k79l3K41j97oK35k55p0L40j90j63K79j11j44K78j39k13L43
$$ 13 158 -142 -48 215 -64 -97 144 -53 -59 176 -79 -149 191 1 -162 117 6 -138 140 1 -212 131
3982A31m7k76K52Ok21K50j5l01K65J16l05J41J25k46J46J27l05J22K37k91K3K22
$$ 131 84 -192 60 66 -155 95 80 -221 44 160 -145 -4 121 -125 21 148 -157 -35 202 -89 -66 156
4004A56k29K3K35k79k6L08k03j31K75j54r9K80j68j73L25q8k28K52l6k00K66l6
$$ 156 -73 -50 185 -94 -120 188 -15 -146 129 -25 -124 156 -12 -185 140 52 -176 76 40 -160 106 70
4026G0k85K73Q3l15J79J05k58J73J25l20J48K05l01O9K07k46M5K25k75JK82k22
$$ 70 -215 58 141 -174 5 110 -148 25 150 -170 -22 183 -118 -49 158 -88 -43 182 -93 -92 190 -32
4048c2p6K65j84q5K80j91j33L04j27j85K71q1j88K61n4k31K52J9k65K17P6k82
$$ -32 -108 157 -27 -112 168 -23 -156 148 21 -164 107 26 -162 99 45 -186 66 85 -180 37 113 -169
4070a69J93J04k95J67J52k99J16J84k69P3K09k72M3K58k74j1K67k15q2K84j76
$$ -169 24 128 -167 0 152 -147 -31 153 -116 -43 166 -106 -63 195 -79 -90 177 -38 -120 164 -12
4091a2j07K76j63j43K97j15j97K75n8k17K55k7k46K58K0k79K12P7k66J76J03k89
$$ -12 -119 157 -6 -149 148 33 -164 111 53 -164 91 64 -182 76 96 -183 29 106 -160 16 119 -170
4113a70J53J64k93Q6K14k59N6K12k72L2K67k56n2K83j87q0K67j94j15L14j48k01
$$ -170 -17 147 -146 -60 154 -105 -49 163 -109 -77 190 -66 -118 165 -22 -102 165 -29 -144 170 22 -179
4135a79K97o0j90K53p1k22K81Nk84K16O4k54J99N3k89K16J20l05J03J86k44Q5
$$ -179 118 58 -132 121 50 -172 109 114 -170 46 110 -144 55 108 -181 35 155 -150 -47 139 -105 -20
4157b0J57k63P4K37k69l2K58j87l5K30k11q3L17j63j75K81q2j58K58j15j84K94
$$ -20 137 -126 -52 185 -84 -116 142 -45 -80 150 -61 -144 173 10 -165 116 34 -124 134 19 -165 129
4179A29k1k80K21M9k23K00J4k66K18J29l18J12J67k37J10J33k80R9K31k84j2K48
$$ 129 108 -172 49 98 -125 75 89 -177 41 170 -148 -36 131 -106 4 137 -143 -44 187 -97 -109 139
4201A39j97j2K24k34l7L05j90j50K59j00j16K41j46j73L14l7k60K21K3k01K14
$$ 139 -58 -70 154 -80 -117 188 -2 -152 107 7 -109 132 -14 -187 127 90 -170 51 74 -127 87
4222H7j8k53K47R5l15J39J36k37J45R8k88J33K24k83jK24k11K9K10k58j0K98k13
$$ 87 69 -184 63 158 -157 -18 118 -119 26 124 -164 -31 193 -90 -91 133 -78 -49 161 -97 -107 191 -22
4245b2j24K65j29q1K24j49j44K96p1k23K24oj79K15l7k47K55O9k89J59Q9k12J47
$$ -22 -146 119 -10 -91 133 -16 -160 136 65 -158 66 60 -119 96 59 -188 67 136 -153 6 95 -117 30
4268C0Q4k84J55J97k86L7J93k08N0J84k54PK82k11r6K43j50o0K31j67j22K97j04
$$ 30 114 -170 -15 182 -104 -67 126 -82 -32 152 -102 -95 187 -24 -120 123 -27 -87 144 -23 -145 152 48
4291D8j99K34m5j70K35m5k41K54M4k72J79O4k14J70Q2k82J57J59k70O3J61k12
$$ 48 -151 83 38 -132 103 58 -183 71 115 -157 22 86 -128 42 124 -158 -1 158 -112 -49 112 -100
4313a00O2J96k70K6K55k15o1K35j70n4K41j79j09K93j20j76K49p3j60K43o8k24
$$ -100 -38 158 -112 -86 169 -46 -107 128 -42 -96 145 -34 -143 150 30 -146 103 30 -130 113 45 -179
4335a79K80j0k42J97M5k34J97O3k74J75J29k73R1J60k39Q5J65k56N9K16k33j2
$$ -179 101 91 -151 46 91 -143 54 117 -157 18 147 -126 -35 125 -114 -29 136 -120 -61 155 -78 -90
4357i0K30j93l3K38j91q2K69j45j30K53j08j43K49q7j89K57l4k28K37Ok43K18
$$ -90 140 -53 -86 152 -39 -121 148 3 -127 126 18 -125 124 37 -152 105 71 -157 80 86 -157 61
4379F1M5k55J78Q9k62J43J41k62J00J58k53O5J97k38L4K18k31k2K32j82n4K47
$$ 61 106 -149 29 118 -144 -1 140 -122 -22 136 -117 -52 145 -93 -59 159 -72 -94 138 -44 -98 149
4401A49j81q6K57j39j47K43n9j74K38n9j88K32Nk40K09L2k30J92L7k47J80J23
$$ 149 -32 -118 139 0 -147 96 37 -137 101 42 -146 86 91 -149 60 92 -138 54 91 -156 24 147
4423A47k76J15J51k45P4J70k66R3K05k41j1K33k09k7K42k17n4K87j84j46K92j25
$$ 147 -129 -14 137 -108 -34 136 -130 -37 168 -73 -84 149 -60 -87 155 -62 -116 171 -13 -159 133 8
4445Hj21K18r8j52K75o3k25K19J2j93J95J1k36J87R9k89J25J43k02Q5J06k58J32
$$ 8 -113 105 7 -145 130 67 -158 61 73 -120 75 86 -150 37 136 -153 -28 115 -87 -2 104 -154 -22
4468b2J91k71J4K20j88k9K23k29oK72k03j15K64j09j18K37j48j28K79q4k16K31
$$ -22 169 -102 -88 132 -56 -85 138 -91 -97 175 -28 -143 121 12 -106 131 -17 -145 134 50 -166 65
4490F5Mj88J99l0k22K46M9k80J55J13k28J48O7k58J66J62k91N3K01k21O3J65k52
$$ 65 69 -119 80 50 -172 74 123 -157 -2 111 -117 31 98 -160 6 168 -123 -70 131 -90 -27 138 -114
4513a14K7K78k40q5K51j34o0K27j86j11K99j09k04K45m6j60K36p5k18K67M4k95
$$ -114 -87 191 -49 -134 117 -17 -77 150 -36 -147 152 43 -161 84 38 -122 114 39 -179 88 132 -163
4535a63J73Q7k24J66N3k59J74J79l03L6J97j97O2J78k77L1K65k35o6K42j52o1
$$ -163 10 97 -127 39 92 -167 7 186 -117 -81 116 -81 -19 159 -118 -87 178 -57 -123 119 -33 -94
4557i4K45k08q1L02j56j61K42n2j43K29j05j78K78j5k60J88P1k31J83L5k51J97
$$ -94 151 -57 -138 164 8 -153 89 37 -106 123 18 -160 118 103 -157 31 102 -129 54 89 -162 35
4579C5J13k81R3J86k27P9J26k60N6K41k61J7K07k05k2K67k13q4K97j72j61K83
$$ 35 148 -133 -40 146 -81 -2 124 -136 -80 161 -100 -83 124 -81 -103 164 -49 -133 164 -8 -169 114
4601A14j06j46K33r8j86L22k6k53J97Nj72J95j0k43K12Q2k40J24J40k45J28J17
$$ 114 8 -138 95 -3 -189 133 107 -146 51 56 -116 79 69 -174 38 120 -120 4 144 -101 27 144
4623A44l28J38J74k45N1K25k70J3K39k23N1J64j21j80L18j50k02L27j52q2K26
$$ 144 -184 -46 128 -117 -66 159 -111 -98 141 -82 -31 133 12 -168 150 0 -202 125 -27 -109 117
4644A17j02j62K45j1k03K18l8j97J72P7k57J49J19k55J48J24k76J19J68k54N9
$$ 117 15 -147 98 87 -116 102 64 -133 39 116 -141 8 127 -128 20 144 -132 -13 155 -99 -40
4665d0J94k45L4K05k31j7K56k07p8K71j73r5K57j42j41K67j06j75K75o3j95K38
$$ -40 154 -91 -57 148 -83 -100 156 -51 -129 142 -31 -126 131 -11 -152 115 9 -166 109 46 -149 89
4687H9j9k30K32J9k53K14O7k73J70J15k56J44J25k70J00J98k74N8K09k44K5K07
$$ 89 70 -160 72 91 -162 52 119 -154 16 131 -125 19 144 -126 -26 172 -102 -44 165 -79 -54 153
4709A53k26j2K53k14q5K64j56r8K56j57j36K89j00k01K67m7j97K28l0k25K48L8
$$ 153 -73 -85 168 -46 -131 133 -23 -121 135 -22 -158 131 31 -170 97 50 -147 81 51 -174 74 112
4731A12k81K02Q2k42J65P9k71J62J54k90Q2J99k35L7J99k61M1K55k49n5K66j72
$$ 112 -169 33 115 -127 38 117 -154 8 162 -128 -46 153 -82 -45 154 -107 -66 189 -60 -115 151 -21
4753b1p6K45j92q6K86j51j72K57n1j79K41p6k05K75rk71K12O9k37J89L9k55K05
$$ -21 -97 148 -44 -130 156 5 -167 90 39 -140 101 25 -180 95 86 -185 27 96 -141 48 87 -168 37
4776C7J26l14J08J88k48Q6J61k76Q6K36k64k7K49j78m0K25k16o6L17j84j55K55
$$ 37 163 -151 -43 145 -103 -17 144 -132 -46 190 -74 -101 148 -30 -70 155 -61 -127 190 6 -149 106
4798A06q0j38K44j23j74K96m6k62K20M9k20J96Kk60K33J00k98J31J47k25J01J27
$$ 106 26 -112 132 9 -165 131 85 -177 43 92 -128 68 70 -190 43 143 -155 -24 123 -102 -1 126
4820A26k83J28K14k74k0K50k08J4K04k39k6K94j98j32K74j27j06K49j54j49L02
$$ 126 -157 -29 185 -89 -109 141 -67 -53 151 -88 -114 180 -18 -150 124 -3 -109 140 -14 -163 139
4841A39o3k42K35Lk02K23l2k43K44P5k94J49J23k33J45R4k78J49J88k85J8K27
$$ 139 76 -166 69 72 -130 93 61 -182 62 137 -157 -8 115 -118 27 121 -157 -8 180 -105 -87 140
4863A40k11K4J97k56J2K77k14j01K53j35p9K20j57j22L01q9k24K52m8j83K73m7
$$ 140 -71 -47 150 -106 -94 183 -31 -132 121 -14 -93 127 -30 -152 149 60 -164 88 40 -143 130 83
4885H3k58L13pl35K40O5k33K02M9k90J84J49k70O1J87k21M9J76k47J4K76k26p8
$$ 83 -175 138 131 -204 36 101 -132 70 119 -171 13 162 -108 -47 140 -81 -32 144 -103 -89 187 -39 -117
4908a17K64j81o2K40j78j21L02j21j78K45o9j64K50m8k28K59J7k61J86P2k49J91
$$ -117 147 -34 -96 144 -34 -155 147 26 -152 93 24 -140 110 62 -166 93 110 -151 35 107 -142 49
4930D9O9k80J71J51k95J06J70k47P4J84k56K9K36k23l7K49k07n7K67j89j04K85
$$ 49 118 -162 9 160 -135 -29 141 -106 -32 152 -104 -75 161 -62 -99 150 -57 -114 153 -36 -140 145
4952A45j35j61K61q6j78K57m9k14K47k0k28K16L7k47K01P0k65J60J22k66J17J62
$$ 145 10 -151 110 24 -154 103 54 -160 87 67 -161 55 92 -155 46 116 -149 11 133 -133 -16 146
4974A46k62P8J90k54N0K16k42nK55k24m4K53j90q1K57j54j21K60j06j68K52o8
$$ 146 -116 -38 152 -102 -52 164 -78 -83 172 -52 -96 157 -33 -114 143 -11 -132 128 22 -146 106 38
4996C8j78K30l2k21K39Nk44K03N6k39J77P5k56J55J34k72R5J64k29P1J61k41M6
$$ 38 -140 90 58 -163 76 81 -163 40 96 -143 34 109 -147 8 142 -130 -35 129 -100 -29 132 -109 -63
5019f3K44k50k5K33j72n8K27j77q0K75j55j48K62q2j49K24p7j85K53l1k26K03
$$ -63 181 -69 -94 139 -33 -91 136 -41 -121 154 -1 -149 113 31 -118 106 29 -156 97 66 -160 43
5041D3L4k12J73M3k36K00R1k80J15J57k23P3J47k45P6K10k49j3K32j88j6K04k10
$$ 43 77 -135 38 81 -155 45 136 -144 -29 128 -95 -22 125 -120 -44 166 -83 -96 136 -52 -68 136 -74
5064g4l4K77j83j33K64r4j29K22j25j43K90p6k30K24J9j98J96j1k23K26O6k81
$$ -74 -108 169 -14 -147 117 23 -106 116 -9 -152 138 62 -168 56 75 -123 73 62 -161 65 131 -150
5086a50J40J29k16J12Q6k44J30J95k76J9K01j82J3J75k20lK61k03r0K34j16p9
$$ -150 -10 119 -97 15 101 -143 -13 182 -94 -75 126 -56 -43 132 -88 -91 170 -33 -123 111 -5 -84
5108h4J96j40j02K75r7k12K41k6j65K07o2j99K43L3k52J57Q4k14J41O3k42J66
$$ -84 112 -28 -130 145 48 -164 77 51 -114 93 31 -168 75 108 -144 13 97 -117 24 87 -155 11
5130A1J53k71M7J91k06N8J60k48N3K20k16o2K29j38o0K14j85p2K80j36j62K23
$$ 11 164 -107 -60 131 -75 -17 143 -105 -52 168 -48 -110 119 -19 -79 135 -50 -122 158 22 -140 83
5152H3n2j37J98p1j79K53ok40J86M6j88J45K8k28J81J22k69R1J53k02Q6J19k48
$$ 83 31 -106 92 21 -158 95 89 -151 35 81 -107 38 66 -162 19 141 -128 -37 116 -86 0 119 -129
5175a29R0K18k43k0K18j67k8K05k07m4K67j54j25K22q4j14K07r6j64K62m5k12
$$ -129 -39 179 -64 -84 134 -33 -61 144 -63 -107 160 6 -119 103 19 -95 112 16 -148 114 69 -143
5197a43J97J1j88J89Mk31K04O4k45J29J18k13J10R6k30R6J74k24J8J90j92L0J79
$$ -143 54 65 -123 66 70 -161 43 107 -138 -9 109 -104 6 102 -128 -32 142 -82 -64 126 -66 -36 143
5220A43k07j7K34j70q6K28j28j01K33j25j21K40q2j76K13l1j69K11l4k09K04M3
$$ 143 -64 -81 153 -17 -103 125 -3 -104 129 4 -117 123 41 -135 78 47 -122 89 55 -154 50 93
5242I3k32J53O5k11J42R8k37J05J50k28O3J51k03M6J80k19J2K06j84l4K16j61
$$ 93 -139 14 79 -132 10 108 -129 -24 126 -102 -39 112 -91 -45 135 -84 -72 134 -50 -84 132 -29
5264b9o2K15j32q3K08r2j35K20p8j63K35m4j90K06Jk06J86K7k02J53P1k31J25
$$ -29 -91 124 -8 -91 117 25 -110 110 32 -131 104 60 -130 76 77 -129 57 84 -118 35 106 -125 0
5287@J00k30J17J34k37O9J69k02K7J74k01RK08j96l6K09j41o7K06j34q6K32j01
$$ 0 100 -130 -13 121 -116 -47 122 -80 -53 121 -80 -71 137 -59 -95 114 -27 -94 112 -22 -108 124 23
5310B3j53K32n8j55J98m4j67K11rk10J80M6k09J44N9k28J55J05k48R0J58k05M9
$$ 23 -130 102 44 -111 87 43 -124 87 78 -132 48 94 -115 29 88 -140 15 120 -128 -38 120 -85 -36
5333c6J47k23P0J88k22oK03j68l3J94j65n1K41j43j27K33o6j26J97r1j45K42m0
$$ -36 111 -112 -42 146 -76 -82 121 -47 -80 114 -51 -102 139 -4 -131 102 36 -90 107 16 -129 113 73
5356G3k21J92M4j93J58J6k16K04O8k51J29J05k04R3J04k29R7J85k42J0J95j71
$$ 73 -148 44 88 -105 53 69 -147 57 125 -126 3 108 -96 -3 101 -128 -31 154 -88 -78 117 -54
5378e4pJ76j94j0K46j82j03K17p4j01J89j17j15K54o7k05K05J9j73J78l8j84K07
$$ -54 -61 115 -79 -89 157 -25 -128 89 15 -86 103 -14 -129 125 58 -147 58 77 -96 82 44 -140 67
5401F7N3k53J45R3j83J03P2k17J26J47k49L7J74j75K7J60k31L2K27j98o8K22j26
$$ 67 120 -133 12 105 -78 25 97 -120 6 153 -96 -59 115 -60 -33 127 -104 -72 155 -43 -111 111 -15
5424a5p1J96j41q7K46q5j82K03j6j46J87m9j86K38J1k50J64P1j78J27M2k11J42
$$ -15 -86 110 -31 -118 128 43 -139 64 48 -98 89 40 -146 92 103 -147 17 88 -90 37 79 -132 10
5447A0J27k48P0J57j84M6J40k05K6K23k11n1K14j40m1J76j65n7K51j23j54K17
$$ 10 137 -111 -41 116 -68 -22 118 -87 -61 162 -49 -100 114 -26 -67 109 -56 -113 138 15 -139 78
5469G8m9j35J97p2j63K34pk22J69L8j81J67K3k17J65J02k51R6J40k01Q6J13k13
$$ 78 29 -106 91 19 -144 90 83 -139 30 68 -113 54 77 -140 25 127 -124 -28 112 -89 -3 110 -103
5492a03O5J92k20j8K04j57k0J83j73o1K47j42j08K11r0j14K03q9j53K49m6j99
$$ -103 -38 154 -66 -84 120 -37 -57 126 -47 -108 139 -3 -111 100 10 -104 99 10 -143 106 60 -139
5514a39J81K0j78J73Ok05J89O6k41J24J15k16R9J08k25J00J64k33K8J84j92KJ89
$$ -139 42 62 -116 57 63 -142 47 113 -128 -4 111 -105 -6 102 -123 -23 141 -92 -64 120 -72 -70 119
5537A19j80l1K20j52q1K20j24j01K22j14j16K22o6j66K05j7j87K00jk11J75N7
$$ 119 -61 -92 128 -24 -105 115 -9 -110 112 -2 -118 104 38 -128 77 60 -127 73 72 -139 36 93
5559I3k20J48Q1k21J12J09k16R6J32k09N6J72k19K5J87j91k3K12j72m3K20j56
$$ 93 -127 21 102 -119 -7 102 -114 -18 114 -95 -39 133 -86 -61 126 -65 -88 124 -48 -91 129 -27
5581b7q0K12j05j19K13q4j31K10m3j82K08j3j77J66K6j98J62N3k19J40R1k02R5
$$ -27 -107 105 0 -119 94 10 -121 89 46 -136 72 59 -118 48 74 -124 38 91 -128 12 103 -99 -4
5604dJ03k06R4J36k20L5J86k01J4J76j90OK03j78o0K19j27p7J98j34q1K21r0j60
$$ -4 99 -107 -13 123 -97 -62 124 -77 -63 113 -77 -71 132 -46 -106 113 -14 -91 107 -27 -108 113 23 -137
5628a37K29m2j65K01l9j78K15Nk22J65O7k00J18O9k09J43J09k38P5J57k01M9J36
$$ -137 92 50 -115 86 47 -131 84 89 -133 32 99 -101 17 86 -123 20 129 -109 -34 123 -78 -29 107
5651A07k04L6J89k02l5K15j32n5J83j56n6K44j32j38K22n2j41J94p6j45K40l2
$$ 107 -97 -61 128 -74 -109 106 -26 -81 102 -54 -110 134 2 -136 86 34 -107 87 11 -134 106 74
5673G4k14J75M9j89J55K1k13J98O4k38R4J40j98Q3R6k13Q4J87k39nJ93j40k8J66
$$ 74 -140 35 84 -105 50 71 -142 56 120 -118 -24 116 -82 1 97 -116 -32 155 -84 -89 104 -36 -64 102
5697A02j72j8K28j49j25K30p5j17J96j06j25K50o6k05K09Qj66J65qj97J90N9k45
$$ 102 -70 -88 140 -9 -134 96 21 -96 100 -6 -131 119 53 -152 57 65 -101 64 56 -141 49 108 -137
5720a37J27J20j98J11P3k18J22J45k43M0J75j67J3J42j99K3K17j81q4K22j12p2
$$ -137 -10 110 -88 23 96 -122 0 145 -98 -58 117 -50 -37 105 -94 -71 146 -35 -119 103 -9 -81
5742h1J84j42p8K44q5j80K05k4j31J56l8j58J96K2k25J62N1j66J15M4j99J37J11
$$ -81 103 -39 -117 127 42 -138 67 43 -88 68 30 -128 68 90 -135 27 78 -88 27 71 -128 9 120
5765A20k27O7J46j79M8J18j85L8K02k03m6K03j29m2J79j53o1K36j32j25K04m9
$$ 120 -107 -40 106 -73 -25 93 -92 -54 148 -55 -101 102 -27 -69 110 -43 -104 132 0 -125 79 30
5787C0j23J84p7j43K11lk01J64L5j63J26L1j93J67O5k18Q1J31j91P8J11k05O0
$$ 30 -93 91 14 -129 82 79 -122 42 77 -86 40 71 -122 45 110 -108 -27 104 -87 -9 102 -103 -43
5810d3J74j99PJ75j57j1J58j58l8K29j45j07K14r2j07J92q6j24K12n2j65J88j5
$$ -43 131 -68 -61 114 -43 -54 104 -54 -92 137 -8 -115 99 7 -100 92 6 -118 94 42 -123 65 50
5833E0j59J75Kj82J64M7k09J33Q3j92J03Q9k03R3J22j96L6J52j73J0J74j81qJ80
$$ 50 -109 66 68 -114 50 97 -112 21 104 -88 15 104 -99 -6 116 -80 -44 108 -65 -55 119 -62 -70 110
5857A10j39o3J89j26p8K02j07r5J96p2j41K04l7j63J97j6j79J65J5j72J60M1k00
$$ 110 -29 -92 97 -29 -107 95 -12 -107 89 17 -124 80 43 -120 77 61 -118 47 62 -110 50 91 -109
5880a09J25R0j89Q1J07j94Q0J45k08K3J66j71JJ60j63qJ84j59p6K11j21p6J97
$$ -109 16 106 -83 -2 105 -89 -9 136 -72 -49 117 -54 -53 107 -56 -64 120 -39 -115 96 -25 -101 96
5903I6j02j07K10p3j48J98l2j51J70k3j53J83J6k05J55N6j75J04P6j92J10J04
$$ 96 -6 -113 97 24 -124 74 42 -109 61 38 -115 68 84 -121 34 90 -85 19 95 -97 13 117
5925A17k15P6J53j86K2J48j89L7J62j80l0J88j17o3J60j16o7K05r8j34J96l4j43
$$ 117 -98 -22 131 -55 -33 115 -74 -37 125 -55 -85 103 -14 -77 83 -33 -100 105 7 -127 69 35 -108
5948a08J74m4j43J93k0j93J62O3j70J14L2j71J44Q8k27P6J47j70L6J08j77O9J69
$$ -108 66 22 -121 72 52 -141 21 84 -86 28 60 -111 33 121 -106 -30 117 -53 -17 91 -86 -17 152
5971A52k12j4J90j34m2J53j34l6K07j43j16K22p3j06J65p4j24K12m8j75J56L9
$$ 152 -60 -74 116 -18 -60 93 -41 -77 130 -13 -129 93 20 -86 79 5 -119 93 45 -130 26 65
5993F5j64J40Nj77J76O3k25J01J17j71O5P9j69Q6J46k14MJ93j58qJ52j66jK05
$$ 65 -99 41 46 -131 45 108 -117 -16 101 -70 -5 74 -95 -9 137 -77 -73 120 -38 -46 106 -60 -61 144
6017A44j63r5K11q4r7J80j15r3K19p3j80J89Lj54J49j3j63J92M3k32J09J11j71
$$ 144 -19 -114 97 13 -84 96 -19 -112 107 34 -146 43 46 -108 41 28 -135 57 100 -132 -23 88 -83
6040h3R7P5k03R6J47j99K5J60j48J2J17j69PK22k04k0J75q8p2J58j25p4K52r8
$$ -83 14 89 -114 -18 129 -70 -45 115 -33 -21 96 -73 -66 156 -48 -68 107 19 -53 105 -20 -94 158 60
6064F0j89J75j8j89K48j38q9K30l9j44J27R1k04J08R3k45J44J28k89R9J14j10
$$ 60 -129 46 28 -161 87 -51 -140 90 51 -93 34 125 -79 29 122 -123 21 149 -140 -41 73 -37
6086c7J4J18k00O6J69j88k2J83j21n0J73j45m7J94j06j11J86o1j02J69o1j37K05
$$ -37 -23 95 -105 -39 130 -58 -80 103 -18 -68 105 -40 -87 107 1 -110 76 15 -87 82 21 -116 89
6109H9k4j88J61K5j55J32K5j86J45P1k00J02R9j82Q0R4j82O6J48j86J2J64j65
$$ 89 65 -123 38 63 -92 40 65 -121 24 95 -105 -3 96 -86 -6 88 -94 -28 120 -66 -54 110 -55
6132e5nJ67j52k9J85j28q0J88r6q7J69o7j24K03n5j56J75pj42J51Jj65J48L9j91
$$ -55 -60 107 -45 -74 111 -17 -97 91 -5 -92 77 10 -114 89 34 -122 53 46 -96 55 56 -109 39 78 -113
6157a13J27P5j90R8J05j90P1J12j70M5J38j86J4J76j67oJ53j24m1J82j35p2J94
$$ -113 14 89 -101 -3 102 -88 -17 95 -75 -30 108 -78 -64 112 -55 -61 92 -32 -73 109 -26 -98 96
6180I6r3j13J84o7j12J84n2j48J77Qj64J41K1j69J45N3k05J19R5j82P5R7j84R0
$$ 96 3 -110 74 7 -105 79 27 -121 56 64 -100 41 62 -107 38 91 -114 5 100 -82 -7 90 -94 -4
6204dJ08j88L8J51j51j4J52j52mJ81j62n6J98r6q6J62q9q1J92q4j37J86j2j52
$$ -4 104 -84 -46 105 -46 -60 92 -60 -64 117 -45 -101 97 1 -85 77 -12 -93 99 15 -122 64 52 -100
6228a00J48j0j52J72%j73J33N7j61R7N9j73J16R4k00O9J26j54J8J14j39K3J59
$$ -100 48 38 -114 58 58 -115 18 75 -86 11 70 -103 13 107 -93 -24 102 -52 -34 80 -59 -36 123
6251A23j81k9J85j09n9J48j14l6J75j02j16J77l8j10J37m1j15J74j1j81J50L8
$$ 123 -58 -87 98 -11 -70 78 -36 -72 103 1 -115 62 24 -86 51 10 -105 69 58 -123 27 65
6273F5j49J03L5j66J45O6k02P1J25j55M6R3j54O0J39j80j4J85j32l7J48j33k6
$$ 65 -84 19 54 -112 33 99 -103 -32 93 -62 -16 77 -77 -17 122 -58 -72 113 -19 -56 92 -41 -67
6296f7J84j17j15J90n8j00J47p2q7J84k8j91J61J9j25J09kj43J54N6k13R7J13
$$ -67 117 0 -115 75 17 -83 64 -8 -95 89 61 -130 31 50 -75 34 32 -111 43 99 -114 -17 96
6319I6j60N8P5j66Q1J39k00J6J54j21j0J19j38JJ81j47q6J93q0q4J51q4p3J78
$$ 96 -64 -6 69 -97 -16 123 -77 -61 93 -28 -38 81 -57 -56 125 -22 -108 85 5 -79 72 -12 -85 93
6343I3o3j50J61jj31J42l1j32J73J1j88J16Q8j58P8N2j61J01J12j93L3J46j48
$$ 93 30 -120 41 40 -91 51 20 -112 61 72 -116 0 88 -70 8 60 -101 0 112 -81 -48 98 -50
6366e0J6J18j51K1J69j67n3J64q5m0J45j06p2J96q2j30J73l2j23J58n7j25J75
$$ -50 -34 84 -67 -46 123 -44 -97 67 -18 -58 87 -19 -91 105 23 -107 66 34 -89 69 12 -113 62
6389F2Qj77J25M8j50J01M8j69J06R2j88O7J19j47L4J10j67M5J45j57k8J69j26
$$ 62 70 -107 18 66 -84 17 65 -104 2 94 -94 -27 92 -55 -21 89 -78 -33 112 -45 -73 96 -30
6412c0l7J52j21l8J69j04r3J76n0j12J57n2j26J79k8j55J58J3j52J22L0j61J22
$$ -30 -67 85 -36 -74 95 -9 -102 74 24 -88 69 17 -109 70 42 -113 45 58 -94 28 58 -103 19
6435A9O7j80P7Q8j49N6R6j54O1J26j64LJ54j40j1J46j27l4J75j28n6J67q8r5J57
$$ 19 86 -94 -17 71 -78 -22 74 -80 -19 107 -57 -54 100 -40 -51 95 -32 -66 109 -19 -75 92 4 -91 66
6460F6n2j14J65m0j20J47j7j45J43J6j44J12L7j57J19M2j53Q5Q6j58O4R7j64N5
$$ 66 14 -100 65 25 -95 52 35 -110 33 49 -95 17 54 -103 16 58 -95 -10 76 -82 -18 79 -85 -30
6484c0J22j59RJ62j30l0J44j19l9J68j11p7J78p3r8J45m8j03J56l6j52J71Jj53
$$ -30 92 -67 -58 104 -26 -56 88 -31 -70 98 -13 -90 88 15 -83 62 14 -89 67 31 -121 50 51 -102
6508a02J28J2j52J34M3j67J02Q7j62O1Q3j51P6R8j82L6J53j36j3J36j26mJ42j26
$$ -102 26 38 -114 20 63 -104 -2 85 -77 -16 67 -84 -8 90 -92 -56 97 -39 -52 84 -42 -46 96 -30
6532c0o3J78p3r0J47p4p7J64p0j29J72j4j29J29j1j33J39J8j79J22P6j57Q2N3
$$ -30 -93 85 12 -78 69 -5 -82 82 12 -117 55 41 -88 41 30 -103 36 54 -125 -3 73 -84 -2 51
6556E1j44J04Q2j84M0J32j36MJ25j38K5J45j61k7J61r7m3J22r0l6J63q9j14J70
$$ 51 -93 11 93 -91 -51 81 -55 -51 74 -64 -39 106 -55 -82 79 -18 -61 61 -29 -65 98 9 -105 65
6580F5j6j28J39k5j33J59j0j71J49M3j41P6L5j36J11O6j80N4J24j28J8R0j37M3
$$ 65 49 -79 60 35 -98 61 51 -120 29 72 -69 7 42 -94 17 83 -97 -43 81 -47 -29 61 -76 -33
6604c3J39j70k4J72j01m0J18j02l0J68r3j05J61l4j03J36n4r6J82m1j57J38M7
$$ -33 106 -64 -88 84 -17 -57 61 -41 -71 97 4 -101 60 26 -77 59 5 -91 91 50 -107 31 78
6627G8j40R1Rj33J24N0j69O3J02j38N0P0j44O0J28j74kJ50j09k5J24j17j0J56
$$ 78 -62 29 38 -95 29 79 -90 -27 75 -63 -13 57 -87 -27 101 -73 -75 75 -34 -59 65 -52 -62 94
6651I4j10p5J60n9o8J23p8o8J63n1j33J41J0j21J21k5j15J45K7j78J00O6j42P0
$$ 94 -16 -91 69 10 -58 65 -13 -81 82 31 -102 39 49 -72 49 24 -91 54 81 -97 3 69 -73 -3
6675cN7j43Q1R5j71M1J28j29J0R8j24QJ39j30m8J69q5n8J28q1p0J66o9r8J42k9
$$ -3 54 -89 -8 87 -84 -43 85 -44 -34 64 -60 -52 87 -43 -91 78 -7 -65 63 -18 -88 78 9 -89 53 24
6701B4j05J32k5j22J46Mj50J10M7j35R7L9j53R7P4j66P1Q7j36M6R1j41L5J23j46
$$ 24 -81 51 26 -96 50 54 -96 14 61 -74 23 62 -91 6 80 -86 -15 72 -64 -18 73 -68 -33 90 -56
6726e6oJ46j20k3J31j08n0J72q0j03J62o5r2J50m4j06J42rj37J30Oj21J02L0j41
$$ -56 -62 84 -36 -59 72 -36 -86 86 6 -97 65 0 -92 58 14 -92 50 41 -96 34 40 -81 21 51 -90
6751i0J06M9j48O7R3j38M2R2j36M3J00j38L1J02j28qJ40j07m0J58j14m5J41q4
$$ -90 16 65 -83 -16 77 -61 -19 73 -63 -20 80 -58 -27 75 -53 -61 79 -28 -68 90 -24 -69 72 -12
6775a2o4J45o3q9J30l4j02J37k4j17J30J0j23J03K4j40J07M7j62R0Q8j38L9Q7
$$ -12 -76 69 6 -83 47 13 -89 48 24 -93 37 47 -76 27 51 -89 18 65 -97 -7 81 -57 -18 69
6799F9j37N6J00j47NJ31j02k4J09r9pJ24j07n2J59p1p5J27o0p1J38o0j03J43j0
$$ 69 -68 -12 88 -59 -54 77 -25 -49 60 -39 -46 78 -29 -81 78 7 -68 59 -1 -72 66 6 -97 46 36
6824C6j01Q0Oj11J34Pj41R2O1j27N2O8j29O7Q0j51L7J20j27jR7j04J4J26j32k6
$$ 36 -65 15 21 -90 44 51 -90 2 63 -64 -12 56 -73 -6 74 -77 -40 80 -47 -48 49 -55 -41 85 -47 -73
6850g3J50q0o7J26o8n3J49q0r8J45j2j18J11j3r2J18qj35J11M5j29P0K9j13R9
$$ -73 77 -3 -70 56 -12 -65 84 4 -94 51 39 -79 32 19 -73 45 37 -98 13 58 -71 -1 28 -85 14
6875A4N3j56N7J01j17K5P2j05L0J02j23k2J40q5n2J19q0l6J43q7q3J44k1j00J05
$$ 14 67 -89 -32 69 -48 -23 49 -56 -26 76 -47 -69 71 -14 -66 53 -27 -63 80 -7 -90 54 33 -67 38
6900C8l0q8J39j8j40J14L3j14Q1J5j09R9M6j45O3R2j40M5O4j09M1J09j49KJ36
$$ 38 8 -80 59 41 -99 15 48 -66 15 30 -79 20 66 -79 -16 76 -64 -19 45 -64 -23 86 -63 -61 75
6925G5j01j0R2j06lJ35j07p2J61n5o6J03n3o8J41l7j22J29J5j16R6rj01J10L6
$$ 75 -26 -36 56 -50 -53 82 -25 -97 64 9 -57 46 -7 -75 66 29 -93 36 51 -65 31 22 -79 31 67
6950F7j62R8O6j24N4M6j19O7Q7j52L5J08j01kR0j06PJ12j02m0J22o0n0J06o7m5
$$ 67 -95 3 69 -55 -1 45 -74 -7 80 -72 -37 71 -30 -32 58 -48 -41 71 -31 -71 51 -9 -59 47 -20 -65
6976f5J26m9r5J13pr0R0mj01J16J1j31J04L4j05O6K5j15P0Q0j43L9R0j07L0P1
$$ -65 61 12 -83 30 23 -67 23 19 -82 34 45 -86 18 52 -53 13 38 -77 -7 73 -70 -31 59 -48 -18 53
7002E3j10K0J05j08k2J27p9l8J05q2l1J20n1q9J28l0r6J20l3q9J22j5j19J10K0
$$ 53 -57 -37 68 -40 -62 65 -14 -52 53 -29 -60 60 9 -80 48 18 -78 42 9 -80 42 27 -92 18 38
7027C8j12Q3L0j10Q1M5j19N8O5j19L8Q7j21K2J06j16KR7q9j5J20r4m0J21p3n3
$$ 38 -74 9 39 -71 10 55 -64 -6 59 -60 -22 65 -56 -34 72 -44 -42 55 -34 -49 71 -23 -63 58 -15 -68
7053f8J21n9n8J14m4q3J11j8j01J11Kj03J01J0j01Q1L3j16P3M5j26O7N9j21M7
$$ -68 53 -6 -64 50 6 -77 34 16 -85 26 28 -75 26 36 -65 16 49 -67 6 51 -75 -8 51 -70 -23
7078b3Q0j05J2R8j05LR7r9mR4p9l4J27o3p6J12k9p3J13m4p4J15k1r5J06J1j08
$$ -23 57 -48 -36 62 -43 -40 57 -42 -46 48 -31 -65 62 -1 -77 35 6 -67 46 2 -72 43 22 -73 33 44 -64
7105f4Q5Or7R3K9j24O9O7j13L3O2j03M6P2j21J7J05j05mQ8p9MR7r5l6J18n7m6
$$ -64 21 27 -70 23 52 -72 -3 64 -49 -16 46 -57 -11 61 -60 -43 62 -43 -47 41 -38 -34 63 -32 -68 50 -7 -53
7133e3R2n1m5J11m1j00J26or1P5lp4R7Rj25Q4N8j20O5M2j04M9O7j27L6J05j15
$$ -53 39 -12 -57 54 13 -87 39 33 -58 17 14 -60 37 46 -79 5 63 -57 8 50 -54 -5 62 -65 -29 76 -39
7160c9JO9q1J7R5j00k3J22q0k6P6n2l2J07n6p7J22qr2Q0k3n5R6jj23R8M4j17P0
$$ -39 -38 31 -50 -33 62 -38 -61 61 -19 -45 31 -21 -53 54 -2 -79 43 35 -57 23 0 -55 41 40 -83 15 59 -58 12
7189A2K7q8O5M1j25M7Q6r8J6O5r6K8R3j21pJ09o7l3Q8o5k1J16q9o1J17l0o5R0
$$ 12 39 -49 16 57 -68 -21 65 -33 -17 48 -48 -20 73 -48 -55 54 -13 -46 42 -23 -44 72 -17 -78 39 9 -56 34
7217C4m2n3J01j8j00J13Nr6O9K2j00R6K3j31O7O8r6K3O0j02M8Q1j15MJ03p6k6
$$ 34 -8 -61 40 22 -78 35 40 -56 13 35 -65 31 54 -77 -10 58 -38 -15 45 -57 -9 72 -43 -39 64 -12 -38
7244c8Q5q6lJ06p6n8J07l9m5Q5n6l9J06m6r0J05J0r0Q1jp7Q4J6j17P7M4r2M4L9
$$ -38 47 -39 -42 64 -12 -70 37 -2 -47 38 -18 -57 49 3 -87 18 28 -62 19 18 -59 25 41 -76 1 45 -47 -3 36
7273C6r5O2O8j27K2R3r5J0Q3j01J7R1j00k4J07n1m4Q8o1l9J12n2p0J00k9o1P5
$$ 36 -59 3 71 -56 -34 59 -36 -26 57 -44 -27 64 -36 -60 47 -4 -48 40 -21 -60 52 0 -70 30 1 -60 15
7300A5lq8J05Mj16R5L0j03P2L4j08P7L4r5K8P6r8K5P7j16K7Q4j00%R7q3j3J08
$$ 15 12 -76 29 33 -83 12 42 -61 11 45 -63 14 48 -47 -19 57 -41 -16 61 -55 -28 56 -44 -44 53 -30 -43 65
7328F5r8j5J01n8n2J02m2o5R7k7p5J00j1j04J04jq5Q7Jr1P2M1j13O0O6j14L6P2
$$ 65 -33 -48 53 -5 -57 45 3 -62 35 8 -67 33 22 -82 22 21 -64 23 24 -67 5 46 -67 -7 59 -55 -19 53
7356E3j07L2Q6j01K0Q3r9nJ03r0j5Q7o7l2J03o5l8R6m8n9J15n5o6J15l6p7R1P
$$ 53 -54 -22 64 -37 -17 66 -33 -38 65 -25 -40 47 -20 -52 51 -14 -52 44 -4 -63 52 -3 -69 46 10 -67 24 31
7384C1r7Q7Mq5Q1J1r6O3N1j13O1M2p3J9P0j08J7R6j00J0Q0p6pQ3q8k3J19o9m8
$$ 31 -66 21 25 -60 21 32 -64 -1 50 -63 -2 40 -33 -14 56 -52 -35 61 -39 -29 51 -25 -32 51 -37 -60 59 -10 -58
7413e8Q9l4n8R6m5o5J12j5q7Q9j7p1R8jj10R2M3j17O1L6r4M9P4j26L4Q6j04J6
$$ -58 31 -3 -61 35 -10 -75 37 22 -65 24 7 -64 34 33 -77 15 58 -59 2 38 -56 -7 67 -59 -25 61 -43 -27
7441b7O9o8NJ04j51K4J17n9m9P5l2l6R0r5k9Q9k3p9N7Oo5J61k5j20J13%l9l6M8
$$ -27 42 -26 -21 83 -68 -44 73 14 -35 40 8 -28 62 -33 -62 27 4 -75 -18 -12 -77 84 59 -61 52 52 13 -23 25
7470B5p8P0L9j17N0O2r1K6N5r3L8P9j20MJ08p3j9P3p0kQ4q3l8J20m0o8R0k8o6
$$ 25 -53 17 56 -61 -11 51 -40 -14 41 -52 -14 65 -55 -51 57 -16 -35 38 -32 -34 50 -33 -71 49 9 -59 31 3 -63
7499f3R9k9q4R8J6r7Q0J0r0R5J2j17P5M7j03M0M8r3N1O2j07K4Q7r3j2Q9q0oR5
$$ -63 36 7 -77 21 37 -60 20 30 -60 35 47 -70 5 52 -51 -11 37 -56 -5 57 -50 -26 61 -32 -44 45 -35 -41 54
7528E4r6k2J22n0n4Q1m7l6Q6k6p9J01j6q3Q3no9Q6mr8Q0M0r4M7M5j02O9M1j16
$$ 54 -42 -64 58 8 -46 35 -12 -48 38 12 -67 34 18 -65 18 13 -56 30 26 -72 8 48 -46 1 46 -56 13 54 -62
7557f2K7Q9q7JP6q5J1R3j08j4J10p5k3Q0n9k9J02n3o9J02k1o2P5j5o9J06k7q7
$$ -62 -35 54 -33 -32 44 -41 -30 63 -45 -59 51 -24 -47 33 -26 -55 47 -6 -75 27 6 -56 19 4 -65 41 14 -73
7585g3Q3L0r5O3K9r4O8L2j01M4O1r4K9N8r0K6P9r6pJ01p9j1Q6p4k3R9o5n0J08
$$ -73 10 40 -55 8 37 -57 11 43 -58 -14 47 -47 -18 40 -50 -24 55 -41 -48 53 -26 -37 49 -25 -48 51 -14 -64 44
7614D4m3o4J00m1o1J03k6p5Q1%p8P4J6q7N9L2r5O2M2j03N4O1j14M3O8q8J1O9p8
$$ 44 1 -63 37 -4 -65 38 12 -63 18 18 -60 14 30 -57 2 34 -61 1 43 -60 -6 55 -59 -16 52 -36 -25 44 -34
7643c4MQ2q2j3R1o5l9J03o5l7J02m9n4Q5k1q0J04j8q5Q5J0r5Q0J4r3Q1K4q8N2
$$ -34 -30 52 -30 -43 48 -17 -56 47 -18 -55 47 -2 -56 29 8 -72 32 14 -71 14 24 -71 9 23 -70 11 35 -53 -1
7672aM1q8L4N7r3L8O2r0J6P9q9%Q0p6mR8q7k8R0m6n8R7l2n2Q9l0p1R6j7p7P5R
$$ -1 40 -48 -14 43 -50 -12 50 -40 -24 55 -34 -34 46 -30 -34 64 -23 -51 39 -7 -65 32 0 -52 37 7 -64 32 15 -62 13 22
7704B2r1Q9Nr8P8L6j01N0M8q5M3N8j02K4Q3r7J4O5p3J2P3r3oJ00p3k9Q3n7l0R3
$$ 22 -69 20 25 -73 5 41 -60 -10 38 -47 -4 54 -48 -24 59 -38 -24 41 -32 -20 53 -40 -46 54 -19 -48 35 -22 -52 41
7734D1m6n8J03k3p9Q6k1o2R4k1q3Q0K8r4M3M3q8O6L0r9M7O9q9J8N2q4L5O2r4n
$$ 41 -5 -63 40 17 -62 24 3 -59 35 14 -69 11 39 -55 -12 31 -57 9 39 -60 -13 56 -33 -15 37 -47 -12 50 -44 -49
7764d9J05o9k8P5m8j4P2q3k5R7l0o7Q3j6n6R2m1p2R3J5r7O5J3p4P6J0r5N8O6r9
$$ -49 56 -13 -41 34 -14 -28 44 -39 -64 33 3 -64 19 3 -53 39 -2 -74 19 34 -63 2 15 -59 17 27 -68 -10 56 -43
7794d3K1N4q9M7N1r4K5Q7r0j4P9n2lP5q6j9R9n6m1O9l4m3R5m5o9R7pp3O2Oo4P3
$$ -43 -22 32 -57 -10 41 -53 -28 59 -31 -45 34 -18 -21 54 -32 -51 48 -8 -49 20 -14 -57 38 -7 -76 21 14 -59 3 9 -55 18
7826A8kq8P6K0q1N2L0o9M7M9j09L4P7q5LP3r0L1O8q8k0J03n1l2Q2o1l1Q0m1n5
$$ 18 16 -72 4 24 -57 -5 25 -44 3 52 -57 -23 54 -31 -28 45 -45 -14 54 -34 -54 49 -2 -34 48 -13 -44 36 -5 -60
7856f0R5k6n3O9k9n4Q8k2p8P2J6o2M1K3q0O6L0r3L5O5q3L4M2p6M2M5p6nQ5o7j7
$$ -60 35 9 -44 25 -4 -58 30 8 -70 2 18 -44 -3 20 -60 6 36 -57 -22 43 -40 -6 36 -40 2 47 -29 -34 51 -16 -33
7887c3O5n1rQ1p1k6P8m0l7O8k7n7P6k0o8Q7on7M8Kn7P6kp5N4L5p9L9L1o7L5N4
$$ -33 32 -19 -28 53 -18 -44 34 -6 -43 25 -2 -59 17 -3 -71 16 10 -47 1 3 -54 22 20 -55 -1 34 -45 -6 25 -42 -7 47
7919D7q4J4O3p3J0O2o7%Q1p2k5Q5n2k5P7n2l0P7l0o0P4k2m9P4j1p4O9J1p1N0J4
$$ 47 -37 -23 40 -33 -23 39 -28 -28 53 -19 -44 41 -11 -36 41 -11 -41 36 6 -54 20 -2 -51 23 12 -62 7 18 -53 -3 11
7950A1o4N0K7o9L2M2p3L2M1p6L4N4o7JO8o2j0O8o1nO8n4k7P6l7l7O3l1l8O5j7
$$ 11 -53 -3 24 -45 -13 29 -44 -12 29 -47 -13 41 -26 -25 43 -19 -29 39 -22 -27 41 -13 -40 36 -1 -38 25 -6 -44 21 4
7981Do1P3ko1P2j4o8O3K1q6M6L5p9M8M0q0L1N8p1J8M5p1K8N4p5%P4n8j5O8m2k7
$$ 4 -57 16 14 -47 25 11 -57 6 27 -59 -13 22 -57 -9 31 -49 -18 40 -31 -13 32 -39 -11 43 -32 -32 42 -16 -31 37 -5 -32
8013c2P6n0k9P2j9p0P0qm5O5k8n8O6J0p5M3K6m9L9J3p3N7L3o9J6M9o0K4M3p1O
$$ -32 44 -6 -35 37 18 -52 18 10 -35 30 2 -56 10 20 -55 -12 14 -35 4 17 -56 1 34 -35 -19 30 -30 -6 37 -34 -28
8044b8P1o5k0O9m4LN7o1k3Q2l3o0P6k1l8O7k6n5O4%o0M8J6m6M1np1O7L3q3K6L0
$$ -28 43 -22 -42 27 -17 -14 43 -18 -41 41 8 -52 24 3 -35 32 6 -49 15 15 -45 3 19 -27 14 9 -62 5 38 -45 -19 11
8076A1m3L4K5p8L2O1o4j3O3n0ON0o9%Q3m8m9O8k4k3O6m5m2Q3j7n5N7j2l8M8Oq0
$$ 11 -32 2 27 -51 -19 42 -22 -35 28 -22 -16 34 -35 -35 48 0 -49 19 -5 -28 38 -7 -49 34 17 -38 19 7 -31 17 23 -57
8108e7O6J9o9L7K2n6L8L2p4L2M8n7KM5n3J2M1o3OQ1o4k8P5m9j0N7m2l6P5j7n0
$$ -57 9 28 -41 -4 18 -38 0 32 -42 -10 38 -19 -17 28 -25 -13 28 -35 -29 52 -12 -40 35 -14 -24 33 -9 -45 30 13 -37
8139c7M7j1m9O8j8o1P9%n6L4L1o4L9J9o9L7M1p4L1M0o7L3N1p7KO9n5j5N7m0j4
$$ -37 10 -1 -50 18 0 -61 18 18 -38 -4 27 -37 2 21 -48 -11 30 -44 -13 27 -40 -7 44 -33 -31 38 -17 -32 25 -15 -29
8170b9O8m4m0Q1k5n2O6k1l7N8k1n4O8nn7N0%m5N3%n8
$$ -29 39 -5 -45 36 11 -41 25 4 -33 25 4 -50 18 13 -44 6 6 -39 14 14 -44
8191d4
$$ Imaginary data points
##PAGE= N=2
##DATA TABLE= (X++(I..I)), XYDATA
0@%%%%%%%%%%%%%%%%%%Lj1J6j6J6j6J6k3L1l2L3m1M8n2O0o7P6q8R7j07J22j37
$$ 0 0 0 0 0 0 0 0 0 0 0 0 0 0 0 0 0 0 0 3 -8 8 -8 8 -8 8 -15 16 -16 17 -24 24 -28 32 -35 41 -47 50 -57 65 -72
40g2J51j67J84k03K24k47K75l03L32l65M01m43M88n40N97o60P35q19R19j036J178
$$ -72 79 -88 96 -107 117 -130 145 -158 174 -191 210 -233 255 -285 312 -348 387 -432 487 -549 629
61F29j353J575j869K269k857L793n507R573l4493j7577J02433o2301l2902P3817
$$ 629 -724 851 -1018 1251 -1606 2187 -3320 6253 -28240 -45817 56616 -5685 -38587 35230
75C5230m1410k7607P4706m4206l8008P3584k6353m1444O8190l1911m6302Q5908
$$ 35230 -6180 -33787 40919 -3287 -41295 32289 5936 -35508 32682 771 -45531 40377
87D0377j8525p9785P6589J7840p6798M6744K1867o3923M5429K4115p0101L4345
$$ 40377 21852 -57933 18656 36496 -40302 6442 28309 -35614 9815 33930 -36171 -1826
99a826L6400o1626K6737L2629o6922L0534N2122p8424N054P1072n7310j5107O0942
$$ -1826 34574 -27052 -315 32314 -34608 -4074 48048 -30376 -25322 45750 -11560 -26667 34275
112C4275m5535j4533O2911m2623k7609O2608k8327k9911N6471k9420l3481O8215
$$ 34275 -11260 -25793 37118 -5505 -33114 29494 1167 -28744 27727 -1693 -35174 33041
124C3041k1879n5463O3993K249n7713M7832Q257n4401M4801J5792n8754L3962
$$ 33041 11162 -44301 19692 21941 -35772 12060 20317 -34084 10717 26509 -32245 1717
136A717K5338n2046K6881K3805n4782K8425L6947o1933J1790M9707n0980j614
$$ 1717 27055 -24991 1890 25695 -29087 -662 36285 -25648 -13858 35849 -15131 -16745
148a6745M8113m4287o459N2164l9307j8325N1350k8120k0709M7653k8375k4693
$$ -16745 31368 -12919 -19378 32786 -6521 -24846 26504 -1616 -22325 25328 -3047 -27740
160b7740N5683k2284l9564N4031o875m4070M5391j51m5550M2574Q830m9206L3450
$$ -27740 27943 5659 -33905 20126 13251 -30819 14572 14421 -31129 11445 20275 -28931 4519
173D519J6338m5607K8263J7963m7849K7012K7461n1881J6087L6843m6264O131
$$ 4519 20857 -24750 3513 21476 -26373 639 28100 -23781 -7694 29149 -17115 -10984
185a0984L9021m1997p15M2852l6585r477M2786k9400j3482M1753k7336j8142M6084
$$ -10984 28037 -13960 -14675 28177 -8408 -17885 24901 -4499 -17981 23772 -3564 -21706 24378
198B4378k2176k7743M5776j2919l3418M2154n525l6834L8650J660l9337L3552
$$ 24378 2202 -25541 20235 7316 -26102 16052 10527 -26307 12343 14003 -25334 8218
210H218P547l9825K9789J2203m1978K6141J9029m3470K0317K5800m3271J2808
$$ 8218 15765 -24060 5729 17932 -24046 2095 21124 -22346 -2029 23771 -19500 -6692
222f692L1410m0331N150L4693l5768q00L6186l2512o599L8460k7884j2710L8941
$$ -6692 24718 -15613 -10463 24230 -11538 -12338 23848 -8664 -15263 23197 -4687 -17397 21544
235B1544k3292j7636M0318j8590k4845M0317j0218l0168L5602l722l0998L3333
$$ 21544 -1748 -19384 20934 2344 -22501 17816 7598 -22570 13032 9310 -21688 11645
247A1645M84l5078L0367Q140l6498K4376J2450l5966K2190J7212l9686J6456K6028
$$ 11645 12129 -22949 7418 15558 -20940 3436 15886 -20080 2110 19322 -20364 -3908 22120
260B2120l7322P441K7855l3111M528L0367l3138j966L5083k7494r070L3376k3210
$$ 22120 -15202 -7761 20094 -13017 -8489 21878 -11260 -13226 21857 -5637 -14707 18669 -4541
273d541j0541L5896k2073j9024L8320j2673k4987L2705p128k4692L2229m446l0697
$$ -4541 -15082 20814 -1259 -20283 18037 5364 -19623 13082 5954 -18738 13491 9045 -21652
286b1652L0486M847l1994K3136P384l0471K3319J1315l6037J8130K1049l3475
$$ -21652 8834 13681 -18313 4823 12207 -18264 5055 16370 -19667 -1537 19512 -13963
298a3963Q804K1534k9615Q283K4741l2163J176L1043k5922n954K8427k2610o075
$$ -13963 -5159 16375 -13240 -4957 19784 -12379 -11203 19840 -6082 -12036 16391 -6219 -12294
311a2294L1860k2943j4867L5127j3433k0063K9351j0134j9465L1418p903k7221
$$ -12294 19566 -3377 -18244 16883 3450 -16613 12738 2604 -16861 14557 6654 -20567
323b0567L0057K126k8271K2584L581k6730K4275P427l3379J8834J7124k9929J0615
$$ -20567 9490 11616 -16655 5929 9510 -17220 7055 14482 -18897 -63 17061 -12868 -2253
336b253J6145k7522J1638K0458l1459L715K7459k4270l170K3722k1987k268K8256
$$ -2253 13892 -13630 -1992 18466 -12993 -9278 18181 -6089 -9259 14463 -7524 -9792 18464
349A8464k2993j1487L1455j3513j5812K5777j1796j5034K9692r848k4183K8283
$$ 18464 -4529 -16016 15439 1926 -13886 11891 95 -14939 14753 4905 -19278 9005
361I005P14k4460K1088Q59k3242K4000M422l0523J9135J4059k7206J1644J2526
$$ 9005 9719 -14741 6347 7206 -16036 7964 12386 -18137 998 15057 -12149 -505 12021
374A2021k5674J3385J7233k9922N550K3985k2974o44K0148k1431R63K4873k3263
$$ 12021 -13653 -268 16965 -12957 -7407 16578 -6396 -7040 13108 -8323 -7360 17513 -5750
387e750p974K8399j4424j1908K3283j3103j1169K7050j1834j9563K6506k347k0330
$$ -5750 -13724 14675 251 -11657 11626 -1477 -12646 14404 2570 -16993 9513 7166 -13164
400a3164K0334k173j9670K3400J069k6715J9680R776k4721J3319R194k3701J4654
$$ -13164 7170 4997 -14673 8727 9796 -16919 2761 12537 -12184 1135 10329 -13372 1282
413A282J3342k7652Q297J9462k2665L052J7440k1644L475K1691k3106l963K5214
$$ 1282 14624 -13028 -4731 14731 -7934 -4882 12558 -9086 -5611 16080 -7026 -10989 14225
426A4225j6176p860K1710j4779q030K4760j3322j4882K4619n880j6542K0420m545
$$ 14225 -1951 -9811 11899 -2880 -10910 13850 528 -14354 10265 4385 -12157 8263 3718
439C718j7005K2081j232k2382J9078N429k1523J4734O080k1664J4896J0078k4556
$$ 3718 -13287 8794 7562 -14820 4258 9687 -11836 2898 8978 -12686 2210 12288 -12268
452a2268R893J5087k1503N619J5029k0993M457J8802k1225j294K1371j6879m528
$$ -12268 -2375 12712 -8791 -3172 11857 -9136 -4679 14123 -7102 -8396 12975 -3904 -8432
465h432K0431j5659o264K2875j3672j1606K2790q341j3603K0574o243j5282K0972
$$ -8432 11999 -3660 -9924 12951 -721 -12327 10463 2122 -11481 9093 2850 -12432 8540
478H540k807j8764J8609J822j9039J6010L726k0171J4868P644k1632J0931J1203
$$ 8540 5733 -13031 5578 7400 -11639 4371 8097 -12074 2794 10438 -11194 -263 10940
491A0940k0239P667J2625j9714N394J5446j9305J397J7554j7097j607J8580j5740
$$ 10940 -9299 -1632 10993 -8721 -3327 12119 -7186 -5789 11765 -5332 -6939 11641 -4099
504d099m538K0146j3467q051K0331j0372j0568J9959p672j2997J9527m510j5299
$$ -4099 -8637 11509 -1958 -10009 10322 -50 -10618 9341 1669 -11328 8199 3689 -11610
517a1610J8346j266j7256J6878K221j8565J4379N389j9061J2229P863j9456R470
$$ -11610 6736 5470 -11786 5092 7313 -11252 3127 8516 -10545 1684 9547 -9909 -439
530d39J1037j8941O050J2821j7781L878J4480j7286N06J6913j5140l003J6884
$$ -439 10598 -8343 -2293 10528 -7253 -3375 11105 -6181 -5675 11238 -3902 -6905 9979
543I979j2907m518J7671j1958p885J9062q415j0866J7271n663j1665J7359m122
$$ 9979 -2928 -7446 10225 -1733 -9618 9444 1029 -9837 7434 1771 -9894 7465 3343
556C343j4821J6971N18j6395J3875K466j5946J3547M304j8643J1621R047j8190
$$ 3343 -11478 5493 6011 -10384 3491 5957 -9989 3558 7862 -10781 840 9887 -8303
569h303P008J0292j6533O318J1639j7785K936J5590j5305j522J4926j2887j965
$$ -8303 -1295 8997 -7536 -1218 10421 -7364 -4428 11162 -4143 -5665 9261 -3626 -5591
582e591J6057j3306n915J8357q915r250J5527o475q833J6260n987j2799J6673
$$ -5591 10466 -2840 -8755 9602 687 -8563 6964 489 -8344 7916 1929 -10870 5803
595E803o72j4526J2750R61j3513J3536J980j7123J2024P328j6464P403P529j4638
$$ 5803 5131 -9395 3355 4316 -9197 4339 6319 -10804 1220 8548 -7916 -513 7016 -7622
609g622P829R061j7388M808J3705j4980L34J2633j2946N85J4398j4225l697J7067
$$ -7622 207 9268 -8120 -3312 10393 -4587 -4253 8380 -4566 -3981 10417 -3808 -7505 9562
623I562r608o968J4181p968o196J5769p930j0848J6396k205j2524J2373j069j1462
$$ 9562 -46 -7014 7167 -801 -6997 8772 842 -10006 6390 4185 -8339 4034 2965 -8497
637h497J3637N9j5550J2138N467j4753P851N180j3401R021P032j6595N647J1818
$$ -8497 5140 5199 -10351 1787 7254 -7499 352 5532 -7869 1152 8184 -8411 -2764 9054
651I054j3753J505J0326j2464K501J2604j4351j975J5640r977m896J2883r006
$$ 9054 -4699 -3194 7132 -5332 -2831 9773 -4578 -6553 9087 -890 -5786 7097 -1909
664a909l980J5117r306q979J5918l738j0343J2190l278r484J4208k273j4128J2969
$$ -1909 -5889 9228 -78 -9057 6861 3123 -7220 4970 1692 -7792 6416 4143 -9985 2984
678B984L257j3478Q891K854j2430J0280M759j5722P112R376j3107L295P962j2132
$$ 2984 6241 -7237 1654 4508 -7922 2358 7117 -8605 -1493 7883 -5224 -1929 6033 -6099
692f099M526J0327j4339K94J3592j0350k648J1214r428j765J3338j0075o251J4636
$$ -6099 -1573 8754 -5585 -5291 8301 -2049 -4697 6517 -2911 -4676 8662 -1413 -7664 6972
706F972n312p878J1656m835p359J3669m078j1734J3039Q11j1738R653P77j1067
$$ 6972 1660 -6218 5438 603 -6756 6913 2835 -8899 4140 4951 -6787 2866 3643 -7424
720g424J0959K391j4300Q626O661j2757N237O269j2020N707Q371j3781K326J1300
$$ -7424 3535 5926 -8374 252 6913 -5844 -607 5662 -6358 -651 7720 -6061 -3735 7565
734G565j0957l40J0061j0120j85J1840j0424l745J3179o967n642J1454n963n878
$$ 7565 -3392 -3732 6329 -3791 -3976 7864 -2560 -6305 6874 -93 -5735 5719 -244 -6122
748f122J2705n065r086J2380j567r706J0388r70r892J1040N92j2301R473L860
$$ -6122 6583 1518 -7568 4812 3245 -6461 3927 2957 -6935 4105 4697 -7604 1869 5729
762E729j1911P082M471j1724O689O338j2697M281Q579j1423K197Q809j0874J263
$$ 5729 -6182 900 5371 -6353 336 6674 -6023 -1742 6837 -4586 -2389 6420 -4454 -3191
776c191J0394j0507j546J1372q272l259J0984p133m441J1675n825o718J1550l533
$$ -3191 7203 -3304 -4850 6522 -1750 -5009 5975 -1158 -5599 6076 251 -6467 5083 1550
790A550p787J0677k182q805J0493l94j0135R280J704j0507P927L063j0855O955
$$ 1550 -6237 4440 2258 -6547 3946 3552 -6583 2697 4401 -6106 1821 4884 -5971 984
804I84M739j1277N247O378j1049L691P604j0716K056Q770j0013L08R596r171j312
$$ 984 5723 -5554 -307 6071 -4978 -1287 6317 -4399 -2343 6427 -3586 -3278 6318 -2853 -4165
819d165J0326p971l143J0682o576m479J0743n320o202J0866l327p572R987j699
$$ -4165 6161 -1810 -4953 5729 -847 -5326 5417 97 -6105 4761 1434 -6138 3849 2150
833B150q112R489n64r289Q893J722j0087P134L208r838O238M325j0503M813O470
$$ 2150 -5962 3527 2963 -6326 2567 4289 -5798 1336 4544 -5294 944 5269 -5234 -421 6049
848F049j0270K725P070r284J998P888r748J68R770q231k172R313o738k622R720
$$ 6049 -4221 -1496 5574 -3710 -1712 6176 -3572 -3404 6366 -1865 -4037 5276 -1462 -4084 5636
863E636o652m565J0719m275o453R331k722o301R415k279q339R473N95r134P045
$$ 5636 -1016 -5581 5138 863 -5590 3741 1019 -5282 4133 1854 -6485 2988 3583 -5551 1494
878A494J733q236O909K260r921O091N077r660L407N404q404L355O022r629J631
$$ 1494 3227 -5009 1900 4160 -5761 330 5407 -4253 -846 4558 -3846 -491 5531 -4098 -2467
893b467Q522q055j085P723o629p00Q310p422k826R987n041n049Q450l596m481
$$ -2467 6055 -2000 -3085 4638 -1991 -2691 5619 -1803 -4629 5358 317 -4732 3718 122 -4359
908d359Q901l721o871R426n96p927P034K63p012P485O21r226O864L905r082L954
$$ -4359 4542 821 -6050 3376 2780 -5147 1887 2150 -4862 2623 3244 -5982 882 4787 -4295 -341
924c41M073p819M345M730r437K672P410q000qO631o689N07P449p720j873R250
$$ -341 3732 -4087 258 4988 -4449 -1777 5633 -2367 -2375 4256 -2433 -1926 5523 -2197 -4070 5180
940E180n172l892P555m115l226Q391m432n742R045j344o790O750p78o020P646
$$ 5180 8 -3884 3671 -444 -3670 4721 289 -5453 3592 2248 -4542 2208 1430 -4590 3056
955C056l38q460O994K802q202M431K714p296N213L534r229L541O316p802J092
$$ 3056 2718 -5742 1252 4054 -4148 283 2997 -4299 914 4448 -4781 -1240 5076 -2726 -1634
970a634N522o903J625O647p939p78Q408n471k583O760m829j922P983n104m654
$$ -1634 3888 -3015 -1390 5257 -2682 -3460 4948 -523 -3106 3654 -1175 -3097 4886 -218 -4872
985d872Q561k038n576O420j661m905P447j274p402O910J763p192M726J543o681
$$ -4872 3689 1651 -3925 2495 834 -4071 3376 2102 -5300 1610 3373 -3819 907 2450 -4231
1000d231N576K539q580M012N169p317J837M439o790K533N701p971K88P533n962
$$ -4231 1345 3884 -4696 -684 4485 -2832 -995 3444 -3346 -813 4888 -3083 -2795 4738 -1224
1015a224j405O382n436j019P536n707l511Q238k983m453O486k597m119P380k155
$$ -1224 -2629 3753 -1683 -2702 4834 -873 -4384 3854 871 -3582 2904 307 -3812 3568 1413
1030A413o358P122N56o581N260P45o246N734J670p724M446L812o953K717L653
$$ 1413 -4945 2177 2733 -3848 1412 2157 -4089 1645 3315 -4409 37 3849 -3104 -387 3266
1045C266o567K863M762p451J083O369o047m11N908n601n95O810n603k388P496
$$ 3266 -3301 -438 4324 -3127 -2044 4325 -1722 -2133 3775 -1826 -2421 4389 -1214 -3602 3894
1060C894l837l429O657l273l718P216k546n392O973o21n868N867M4o017N820R95
$$ 3894 57 -3372 3285 12 -3706 3510 964 -4428 2545 1924 -3944 1923 1967 -4050 1770 2765
1076B765p010M914K620o782L646L182o711L031M182o871J720N269o186N42N543
$$ 2765 -4245 669 3289 -3493 153 3335 -3376 -345 3837 -3034 -1314 3955 -2231 -1689 3854
1091C854n817j90O185n399j419O580m464k421O635l641l296O673k739m273O488
$$ 3854 -1963 -2153 4032 -1367 -2786 3794 -670 -3091 3544 -97 -3393 3280 541 -3732 2756
1106B756j638m942O245p08n691N815L55o133N243J364o506M496K474o610L441
$$ 2756 1118 -3824 2421 1713 -3978 1837 2192 -3941 1302 2666 -3840 656 3130 -3480 -39
1121c9L329o377K624M031o476J715N112o068L31N509n354m04N783n029j379O427
$$ -39 3290 -3087 -463 3568 -2908 -1193 3919 -2149 -1818 3691 -1663 -2067 3716 -1313 -2692 3735
1137C735m065k698O110l044l062O133k639m187O418j173n144N473j90n115N252
$$ 3735 -330 -3028 3082 38 -3024 3109 470 -3717 2701 1528 -3616 1857 1667 -3448 1804
1152A804K25n998N042J830o301L624K469n903L383L039o620K539M739o122O30
$$ 1804 2029 -3969 1073 2903 -3398 226 2695 -3208 175 3214 -3406 -867 3872 -2250 -1620
1167a620M866n225N57N156n707n90O449m499k212N833l406k183N992l492l630
$$ -1620 3246 -1979 -1422 3734 -1973 -2563 3886 -613 -2825 3008 -398 -2581 3411 -81 -3711
1182c711O657j543m784N297p05m317N443o74n696N500J451o147L605J950n274
$$ -3711 2946 1403 -3381 1916 1211 -3106 2337 1663 -4033 1467 2918 -3229 376 2326 -2948
1197b948L733K139o477L025M226o024J052M138n058J367M395o067J95O150m755
$$ -2948 785 2924 -3553 -528 3698 -2326 -1274 2864 -2194 -827 3568 -2499 -2304 3846 -909
1212i09j613N300l730j163N611m290k674O672k320m052N245j488l431N648j657
$$ -909 -2522 2778 -952 -2115 3496 -794 -3468 3204 884 -3168 2077 589 -2842 2806 1149
1227A149n146N843O44n626L955J084m755M269J122o192L725L368n836J700L285
$$ 1149 -3997 1846 2490 -3136 819 1903 -2852 1417 2539 -3653 72 3440 -2396 -696 2589
1242B589m954K086L664o064Q77N462m824r20M662l957k87N151m736j899O307k838
$$ 2589 -2365 -279 3385 -2679 -1802 3660 -1164 -2084 2578 -1379 -1666 3485 -1251 -3150 3157 319
1258C19l235N063k118k681N574k314m435N877j16m931M258J32m359M785M54n904
$$ 319 -2916 2147 29 -2652 2922 608 -3827 2050 1934 -2997 1261 1393 -2966 1819 2273 -3631
1274c631M121K628n513K258K478m816K694L051n969J395M755m803j62M088m187
$$ -3631 490 3118 -2395 -137 2341 -2475 219 3270 -2699 -1304 3451 -1352 -1514 2574 -1613
1289a613K65M800m833j427N805k979k539M647k501k111N350k598l827N603o12
$$ -1613 -1348 3452 -1381 -2808 2997 18 -2521 2126 -375 -2486 2864 266 -3561 2042 1430
1304A430m319M245l94l928M885K4n480M205J965n075K693J821m694L159K510n797
$$ 1430 -2889 1356 962 -2966 1919 1943 -3537 668 2633 -2442 251 2072 -2622 537 3047 -2750
1320b750J896M138m808M96L676m427P38M451m852q16N322l353j862M488k937j678
$$ -2750 -854 3284 -1524 -1028 2648 -1779 -1041 3410 -1442 -2258 3064 -289 -2151 2337 -600 -2278
1336b278N198k866l300N368j122l799M307p89l620M742l84m856M309J225m793
$$ -2278 2920 54 -3246 2122 1000 -2799 1508 719 -2901 1841 1457 -3399 910 2135 -2658
1351b658L158J355m606L311K069n379K370L312m850J246L273m534J186L920m804
$$ -2658 500 1855 -2751 560 2629 -2750 -380 2932 -1918 -672 2601 -1933 -747 3173 -1631
1366a631K5M666l910r15M443l439j230M861l142k346N042j988k990M523j479l244
$$ -1631 -1606 3060 -850 -1765 2678 -761 -1991 2870 -272 -2618 2424 436 -2554 1969 490 -2754
1382b754M620q53m036M348K25m359L640Q51m439L304J552m726K673K318m667J983
$$ -2754 1866 1013 -3023 1325 1550 -2809 831 1682 -2757 547 2099 -2627 46 2364 -2303 -320
1398c20K843m595J401L403m475O54L907m124j11M218l720q33M448l217j429M573
$$ -320 2523 -2072 -671 2732 -1743 -1089 2818 -1306 -1417 2801 -919 -1752 2696 -521 -1950 2623
1414B623k780k170M736k086k817M472j274l234M267p89l720M103J71m149L379
$$ 2623 -157 -2327 2409 323 -2494 1978 704 -2530 1737 948 -2772 1331 1502 -2647 732
1429G32R12m144L074J332m510K656K339m578J643K765m065J252K989m146O16L846
$$ 732 1644 -2500 574 1906 -2604 52 2391 -2187 -544 2221 -1844 -592 2397 -1749 -1133 2713
1445B713l866m01L974l241o80M066l233j403M594k306k456M138j547k451M144
$$ 2713 -1153 -1554 2420 -821 -1501 2565 -668 -2071 2523 217 -2239 1899 352 -2099 2045
1460B045j484l215M370l44l852L446L16l563L356M94m283L130J806m360J863K114
$$ 2045 561 -2654 1716 1372 -2480 966 1282 -2281 1075 1569 -2714 416 2222 -2138 -275 1839
1476A839l733J802K258m324J250L524l846j27L349l047k1L451l443q33M370k472
$$ 1839 -1894 -92 2166 -2158 -908 2616 -1230 -1357 1992 -1055 -1076 2375 -1068 -1901 2469 -3
1492cj975L684j743j638L838k036k630M349o61l387L235j17k875L404k28l877
$$ -3 -1978 1706 -37 -1675 2163 127 -2503 1846 1185 -2202 1033 916 -1959 1445 1217 -2660
1508b660L454J271m068K063J463l392K291J563m318J795L076l873K74K821l028
$$ -2660 794 2065 -2003 60 1523 -1869 422 1985 -2333 -538 2538 -1335 -1061 1760 -1268
1523a268O02K942l726k43M121k710j506L393j964j101L596k336k190M212q90k948
$$ -1268 -666 2276 -1450 -1693 2428 -282 -1788 1605 -359 -1460 2136 -200 -2390 1822 932 -2016
1539b016L042m49k350L338o06l508L463R57l737K087J093l056K426J119m059K008
$$ -2016 1026 577 -1773 1565 959 -2549 914 1871 -1866 221 1314 -1742 684 1803 -2256 -248
1555b48K584l662O67K308l020J022K575l800J76L756k846j012L083k224o13L387
$$ -248 2336 -1326 -659 1649 -1371 -349 2226 -1574 -1398 2358 -488 -1500 1583 -641 -1254 2133
1571B133k642j660L993j300k400L028r31j963L379r42l128L383N52l268K200O19
$$ 2133 -509 -2169 1824 524 -1876 1152 221 -1742 1637 695 -2433 950 1502 -1766 434 1053
1587A053k798K556P86l742K089K107l360R61J868k926J258K264l598L96L236k752
$$ 1053 -1745 811 1597 -2145 -56 2051 -1309 -348 1520 -1406 -148 2116 -1482 -1086 2150 -602
1603f02n18K707k401k09L157k773j248L710j597j880K946j331j613L335j261k699
$$ -602 -1120 1587 -814 -1023 2134 -639 -1887 1823 226 -1654 1292 -39 -1652 1683 422 -2277
1619b277L349K9k867K448J09k622K777M37l499K249J635l176J287J510k878J469
$$ -2277 1072 1101 -1766 682 791 -1831 946 1383 -2116 133 1768 -1408 -121 1389 -1489 -20
1635b0J954l405O42K817k726j33K473k470k0K904k673r24L353j756j467K826j499
$$ -20 1934 -1471 -829 1988 -738 -871 1602 -868 -888 2016 -657 -1581 1772 16 -1451 1375 -124
1652a24j358L126j419k204L198m61k484K614k14k458K745J44l102K432R87k990
$$ -124 -1482 1644 225 -1979 1219 758 -1726 888 674 -1784 961 1105 -1997 435 1422 -1568
1668a568J734J144k897J690J583l217J042K279k837L55K326k615J77K663k602
$$ -1568 166 1310 -1587 103 1686 -1531 -489 1790 -1047 -692 1634 -981 -804 1859 -743
1683g43n01K971k056r59K818j682j261K918j382j760K913p90k163K717l76k367
$$ -743 -1244 1727 -329 -1288 1530 -152 -1413 1505 123 -1637 1276 486 -1677 1040 664 -1703
1699a703K567K2k621K366M78k795K079R23k903J681J349k877J296J700k878Q85
$$ -1703 864 886 -1735 631 1109 -1686 393 1316 -1587 94 1443 -1434 -138 1562 -1316 -431
1715d31K131k746L35K347k469jK531k395m57K868j993j092K788j447j316K713
$$ -431 1700 -1046 -711 1636 -833 -834 1697 -698 -1155 1713 -280 -1372 1416 -31 -1347 1366
1731A366j251j734K849o27k261K484j11k251K346N3k603K301P53k832J605J135
$$ 1366 115 -1619 1230 603 -1658 826 715 -1536 810 863 -1740 561 1314 -1518 87 1222
1747A222k511J411J231k813J212J961k769M12K108k311K95K146k527o6K770k122
$$ 1222 -1289 122 1353 -1460 -248 1713 -1056 -644 1464 -847 -552 1594 -933 -999 1771 -351
1763c51q67K530j563q05K516j680j335K956r34k046K417l89j794K366m49k359
$$ -351 -1218 1312 -251 -1056 1460 -220 -1555 1401 467 -1579 838 449 -1345 1021 572 -1787
1779a787K505M72k685J674P87k217J649P65k765J525J755k712M97J804k130N92
$$ -1787 718 1190 -1495 179 966 -1251 398 1163 -1602 -77 1678 -1034 -537 1267 -863 -271
1795b71J774k588K47K614k174o75K294j592m20K319j952j030K931j122j761K242
$$ -271 1503 -1085 -838 1776 -398 -1073 1221 -371 -791 1528 -424 -1454 1477 355 -1406 836
1811H36o23j358K327r05k058K663J41k474J724M38j946J842L35k638J783J424
$$ 836 213 -1145 1182 277 -1781 882 1023 -1451 273 711 -1235 607 942 -1696 87 1511
1827A511k608P20J419j984R27J390k634N90K388k215m05K043j600j19K059k060
$$ 1511 -1097 -377 1042 -942 -15 1375 -1259 -669 1719 -496 -901 1142 -458 -577 1482 -578
1843e78o79K759j279j454K119q30j043K261j154j783K667j45k247J792J35j725
$$ -578 -1257 1502 223 -1231 888 58 -985 1276 122 -1661 1006 861 -1386 406 541 -1184
1859a184J970n1k437J994R82k452J050J026j996J269J075k640R38K032k273RJ774
$$ -1184 786 735 -1702 292 1274 -1178 -128 898 -1098 171 1246 -1394 -456 1576 -697 -688 1086
1876A086j765K75J876k229k78K553j559j016K062j115p65K227j350j452K533m53
$$ 1086 -679 -404 1472 -757 -1035 1518 -41 -1057 1005 -110 -875 1352 2 -1450 1083 630
1892F30j860J861k35j532K061l09k205K053O11k251J276O52j907J468P62k458
$$ 630 -1230 631 396 -1136 925 616 -1589 464 1075 -1176 100 752 -1155 313 1075 -1383
1908a383J132J569k189M19J442j887O12J656k254K1K233j657n63J888j376m37
$$ -1383 -251 1318 -871 -452 990 -897 -285 1371 -883 -862 1371 -286 -849 1039 -337 -774
1924g74K111j487j099K378p51j463J903n78j346K124m73j969K027L01k016J435
$$ -774 1337 -150 -1249 1129 378 -1085 818 240 -1106 1018 545 -1424 603 904 -1112 323
1940C23L77j846J575N65k305J239J250k118O92J236j960P37J488k197K57J949
$$ 323 700 -1146 429 994 -1311 -72 1178 -940 -248 988 -972 -235 1253 -944 -687 1262
1956A262j790k00J783j605j98K042j642p53K249j091j104J983q56j133K094o99
$$ 1262 -528 -728 1055 -550 -748 1294 -348 -1101 1148 57 -1047 936 80 -1053 1041 342
1972C42j610K042j45j754J698P2j788J688L28k079J415Q61k091J000J040k023
$$ 342 -1268 774 629 -1125 573 645 -1143 545 873 -1206 209 1070 -1021 -21 1019 -1004
1988a004Q65J280k049N02J582j921J55J725j753r9J890j615m65K023j353p63K045
$$ -1004 -139 1141 -908 -406 1176 -745 -590 1135 -618 -717 1173 -442 -907 1116 -237 -1000 1045
2005A045j086j026K030q16j264K021n75j523J969j96j773J754J65j815J556L68
$$ 1045 -41 -1067 963 147 -1117 904 329 -1194 775 579 -1194 560 725 -1090 466 834
2021H34j982J398Q00k078J008J078j940P61J235k018N12J650j901j6J728j549
$$ 834 -1148 250 1050 -1028 -20 1058 -882 -121 1114 -904 -392 1258 -643 -659 1069 -480
2037d80j60J747j574m65K094j293r76J976q38r97J875q52j298K095l60j697J704
$$ -480 -640 1107 -467 -932 1162 -131 -1107 869 31 -966 909 57 -1241 854 494 -1203 501
2054E01L0j556J602L2j851J665O13k106J096R00j776R83Q95k035Q30J471j959
$$ 501 531 -1025 577 609 -1242 423 1036 -1070 26 926 -850 133 1028 -1007 -177 1294 -665
2071f65J55J547j542J43J509j777j62K062j419q29J816r18o97J749j111j034K118
$$ -665 -510 1037 -505 -362 1147 -630 -792 1270 -149 -978 838 -80 -777 972 -139 -1173 945
2088I45n38j586J650j28j294J624k47j733J779M46j996J117O75j568J162N46k004
$$ 945 407 -1179 471 343 -951 673 426 -1307 472 918 -1078 39 714 -854 308 854 -1150
2105a150J107J304j991L41J304j509M48J264j905J87J939j571n74J655j078l24
$$ -1150 -43 1261 -730 -389 915 -594 -146 1118 -787 -600 1339 -232 -806 849 -229 -553
2121e53J649j402p56K151p79j383J603l29j042J638n62j551J895K28j872J180
$$ -553 1096 -306 -1062 1089 310 -1073 530 201 -841 797 235 -1316 579 807 -1065 115
2137A15M34j412J258L10j944J277J133j941M25J117j410O00J044j880M03J743
$$ 115 549 -863 395 705 -1239 38 1171 -770 -345 772 -638 -38 1006 -874 -471 1272
2153A272j609l44J528j157j02J497j514m99K068r59j095J549n59q02J623q02j294
$$ 1272 -337 -681 847 -310 -412 1085 -429 -928 1140 181 -914 635 76 -726 897 95 -1199
2170a199J939p7j676J261J86j302J372P4j802J368Q51j833O32R02j417P54Q87
$$ -1199 740 663 -1013 248 434 -868 504 578 -1224 144 995 -838 -206 696 -721 33 920
2187I20j863N24J584j605j33J385j231K6J433j506l32J884j046q24J500p57o31
$$ 920 -943 -419 1165 -440 -573 812 -419 -393 1040 -466 -798 1086 40 -784 716 -41 -672
2204f72J621r14j109J860k95j409J370r1j195J455j29j634J459M98j664Q97N86
$$ -672 949 35 -1074 786 491 -918 452 361 -834 621 492 -1142 317 815 -849 48 634
2221F34j456R50P07j790P05J259j584J82J174j346K42J320j551j36J686j145n45
$$ 634 -822 128 835 -955 -250 1009 -575 -393 781 -565 -323 997 -554 -690 996 -149 -694
2238f94J470r21n22J586r45r25J711m48j137J387k98j098J487k28j444J439K52
$$ -694 776 -145 -667 919 -26 -951 760 312 -825 562 264 -834 653 425 -1019 420 672
2255F72j513J054L72j408J057N21j644Q12R24j522M78R72j433M22J155j532R2
$$ 672 -841 213 585 -823 234 755 -889 -77 847 -675 -197 775 -658 -236 919 -613 -521
2272e21J430j249k18J364j083l43J485j008o45J567p02q71J446m80j003J472k97
$$ -521 909 -340 -558 806 -277 -620 865 -143 -788 779 77 -794 652 172 -831 641 344
2289C44j252J391Nj337J200K05j379J091L79j469R14O36j468O95Q47j464M73J017
$$ 344 -908 483 488 -849 351 556 -823 268 647 -822 92 728 -740 -45 802 -662 -189 828
2307H28j398K61J146j336N2J305j213k12J371j024m00J375q96o12J498o53q96
$$ 828 -570 -309 837 -499 -447 858 -355 -567 804 -220 -620 755 -141 -753 745 92 -804
2324h04J383l68r91J327k64j163J359M3j375J099L11j282R43M00j433Q74P50j481
$$ -804 579 211 -780 547 283 -880 479 522 -853 246 557 -725 218 618 -815 59 809 -672
2342f72M95R16j261L80R03j375K81J263j317j56J278r83j92J188j048l43J478
$$ -672 -177 739 -522 -142 761 -614 -333 930 -387 -543 735 -248 -440 748 -300 -643 835
2359H35q40p67J333m68p21J247n49r41J470j81j264J124J50j077J007O1j300J117
$$ 835 -5 -772 561 93 -628 619 70 -871 599 418 -846 278 428 -649 358 419 -881 236
2377B36N21j470O22P18j162N46O67j410N25J149j381l8J143r52nJ042j187j45
$$ 236 757 -713 -91 627 -535 11 678 -732 -207 942 -439 -477 666 -286 -291 751 -436 -581
2395e81J459r39o51J276n50n28J175p25p53J488l14j154J103j7q78J073j95j178
$$ -581 878 -61 -712 564 14 -514 661 -64 -817 671 357 -797 306 289 -589 484 289 -889
2413h89J253L12j394P02N28j055P17M02j355P03R36j356J54R46r68K14Q53j256
$$ -889 364 676 -718 -16 512 -543 174 576 -779 -76 860 -496 -342 604 -364 -150 703 -553
2431e53P9J367j022n03J152o08l14J086q66n53J461m76r87J083j61p11J077l58
$$ -553 -474 893 -129 -632 520 -88 -402 684 -182 -735 726 250 -737 346 185 -526 551 193
2449A93j055J298J58j291P78L42r46Q13J87j286Q65P40j320K98P69r71L91O92
$$ 193 -862 436 594 -697 81 423 -523 290 477 -809 56 796 -524 -226 543 -428 -37 655
2467F55j260K71J178j076k82J015o90j39R95r40l90J391n86q28J073k76o18J059
$$ 655 -605 -334 844 -232 -514 501 -189 -328 667 -273 -663 728 142 -686 387 111 -507 552
2485E52m34r15J248L2j143Q25J85q95Q72J20j213Q85O06j252L97O44r58M68N97
$$ 552 118 -797 451 483 -660 165 350 -545 327 447 -766 119 725 -527 -130 514 -444 24 621
2504F21j211L48J004j065p4R16q16lR38r75k43J241o87n83J014m44m83J046n21
$$ 621 -590 -242 762 -303 -377 539 -277 -280 658 -317 -560 681 -6 -589 425 -19 -502 544 23
2523B3p52J189j57r52R05Oq35R04M5j079Q59M18j107N46M72r88N64N40j162M09
$$ 23 -729 460 303 -649 256 262 -573 331 376 -703 156 574 -533 13 485 -503 61 601 -561 -152
2543a52Q60j042R3Q13r00P7R11r60j44J081p33l79R79o07l80J050n80o44J113
$$ -152 708 -334 -241 572 -328 -251 660 -300 -444 637 -96 -475 504 -103 -483 567 -13 -657 456
2562D56l04p55R23j55p63R42o3r52Q66K19r89O76L35r88O24M81j065M36O74r91
$$ 456 152 -603 320 165 -598 344 281 -671 195 414 -575 101 436 -552 72 553 -512 -76 598 -393
2582c93K32P35r28J48Q39r17n6R46p78k10R52o89l39J008n77n03R96m08o15R73
$$ -393 -161 574 -354 -206 633 -284 -340 606 -172 -382 570 -119 -458 550 -27 -530 466 58 -557 416
2602D16k98p05R29j29q09Q60Oq80Q04J83r57O63L46r35N30M36r53M41O26r80K35
$$ 416 118 -587 342 213 -596 264 270 -610 194 377 -580 83 429 -506 24 460 -493 -52 574 -406 -171
2623a71P26q53R8P65q48j4R09p62k56R28n72l35Q86n51m47J016l97p00R24j49
$$ -171 555 -298 -200 565 -283 -297 612 -150 -406 522 -50 -385 501 -50 -497 519 122 -578 346 197
2643A97o94Q29j61p82Q93O8r55O81K68q20N86K36r21O02N14j004K76O54p78K09
$$ 197 -497 332 171 -611 282 350 -605 76 344 -476 110 346 -575 27 541 -463 -187 467 -311 -102
2663a02N80q81J84Q63q59j68Q71n86j78P84o70k73J021m95o23Q73k02n37P83l04
$$ -102 478 -403 -219 644 -215 -383 488 -98 -276 508 -162 -435 586 91 -532 341 139 -398 385 81
$$ [...]
8191b8
##END NTUPLES=NMR FID
##END=
