##TITLE=1H_LY-16.Dix.1B
 CD3CN, 8 sc, 
 1.06.2021
##JCAMPDX= 6.0         $$ Bruker NMR JCAMP-DX V2.0
##DATA TYPE= NMR FID
##DATA CLASS= NTUPLES
##ORIGIN= UXNMR, Bruker Analytische Messtechnik GmbH
##OWNER= root
$$ XWIN-NMR		Version 3.5
$$ Tue Jun  1 10:38:38 2021 Russian Standard Time (UT+4h)  she@DPX200
##.OBSERVE FREQUENCY= 200.131506
##.OBSERVE NUCLEUS= ^1H
##.DELAY= (6, 6)
##.ACQUISITION MODE= SIMULTANEOUS
##.ACQUISITION SCHEME= undefined
##.AVERAGES= 8
##.DIGITISER RES= 18
##SPECTROMETER/DATA SYSTEM= spect
##.PULSE SEQUENCE= zg30
##.SOLVENT NAME= CDCl3
##.SHIFT REFERENCE= (INTERNAL, CDCl3, 0, 15.7039)
##AUDIT TRAIL= $$ (NUMBER, WHEN, WHO, WHERE, WHAT)
$$ ##TITLE= Audit trail, XWIN-NMR		Version 3.5
$$ ##JCAMPDX= 5.01
$$ ##ORIGIN= Bruker BioSpin GmbH
$$ ##OWNER= she
$$ F:/spectra/data/she/nmr/H-F/1/audita.txt
$$ ##AUDIT TRAIL=  $$ (NUMBER, WHEN, WHO, WHERE, WHAT)
(   1,<2021-06-01 10:37:21.87 +0400>,<she>,<DPX200>,
      <created by zg, POWCHK disabled, PULCHK disabled
       configuration hash MD5:
       00 E9 B6 7A A2 85 ED C7 34 08 36 98 17 FE 4E 26
       data hash MD5: 16K
       CD 75 69 20 86 BC 01 19 BA 88 21 0D C9 4A D2 A0>)
$$ ##END=
$$ 
$$ hash MD5
$$ FD 93 5A 04 DC 57 79 D2 42 67 8B F4 0A CB EF 18
##$RELAX= 
##$RELAX= 
##$RELAX= 
##$RELAX= 
##$RELAX= 
##$RELAX= 
$$ Bruker specific parameters
$$ --------------------------
##$DU= <F:/spectra>
##$EXPNO= 1
##$NAME= <H-F>
##$PROCNO= 1
##$TYPE= <nmr>
##$USER= <she>
##$AMP= (0..31)
100 100 100 100 100 100 100 100 100 100 100 100 100 100 100 100 100 100 
100 100 100 100 100 100 100 100 100 100 100 100 100 100 
##$AQSEQ= 0
##$AQ_mod= 1
##$AUNM= <au_zg>
##$AUTOPOS= <>
##$BF1= 200.13
##$BF2= 200.13
##$BF3= 200.13
##$BF4= 200.13
##$BF5= 200.13
##$BF6= 200.13
##$BF7= 200.13
##$BF8= 200.13
##$BYTORDA= 1
##$CFDGTYP= 0
##$CFRGTYP= 5
##$CHEMSTR= <none>
##$CNST= (0..31)
1 1 145 1 1 1 1 1 1 1 1 1 1 1 1 1 1 1 1 1 1 1 1 1 1 1 1 1 1 1 1 1 
##$CPDPRG= <>
##$CPDPRG1= <>
##$CPDPRG2= <>
##$CPDPRG3= <>
##$CPDPRG4= <mlev>
##$CPDPRG5= <mlev>
##$CPDPRG6= <mlev>
##$CPDPRG7= <mlev>
##$CPDPRG8= <mlev>
##$CPDPRGB= <>
##$CPDPRGT= <>
##$D= (0..31)
0 1.2 0 0 0 0 0 0 0 0.06 0 0.03 0 0 0 0 0.0002 0 0 0 0 0 0 0 0 0 0 0 0 
0 0 0 
##$DATE= 1622529441
##$DBL= (0..7)
120 120 120 120 120 120 120 120 
##$DBP= (0..7)
150 150 150 150 150 150 150 150 
##$DBP07= 0
##$DBPNAM0= <>
##$DBPNAM1= <>
##$DBPNAM2= <>
##$DBPNAM3= <>
##$DBPNAM4= <>
##$DBPNAM5= <>
##$DBPNAM6= <>
##$DBPNAM7= <>
##$DBPOAL= (0..7)
0.5 0.5 0.5 0.5 0.5 0.5 0.5 0.5 
##$DBPOFFS= (0..7)
0 0 0 0 0 0 0 0 
##$DE= 6
##$DECBNUC= <off>
##$DECIM= 32
##$DECNUC= <off>
##$DECSTAT= 4
##$DIGMOD= 1
##$DIGTYP= 9
##$DL= (0..7)
0 120 120 120 120 120 120 120 
##$DP= (0..7)
150 150 150 150 150 150 150 150 
##$DP07= 0
##$DPNAME0= <>
##$DPNAME1= <>
##$DPNAME2= <>
##$DPNAME3= <>
##$DPNAME4= <>
##$DPNAME5= <>
##$DPNAME6= <>
##$DPNAME7= <>
##$DPOAL= (0..7)
0.5 0.5 0.5 0.5 0.5 0.5 0.5 0.5 
##$DPOFFS= (0..7)
0 0 0 0 0 0 0 0 
##$DQDMODE= 0
##$DR= 18
##$DS= 0
##$DSLIST= <SSSSSSSSSSSSSSS>
$$ [...]
##$SUBNAM2= <"">
##$SUBNAM3= <"">
##$SUBNAM4= <"">
##$SUBNAM5= <"">
##$SUBNAM6= <"">
##$SUBNAM7= <"">
##$SUBNAM8= <"">
##$SUBNAM9= <"">
##$SW= 16.9725357007746
##$SWIBOX= (0..15)
0 0 2 0 0 0 0 0 0 0 0 0 0 0 0 0 
##$SW_h= 3396.73913043478
##$TD= 16384
##$TD0= 1
##$TE= 0
##$TE2= 300
##$TE3= 300
##$TEG= 300
##$TL= (0..7)
0 120 120 120 120 120 120 120 
##$TP= (0..7)
150 150 150 150 150 150 150 150 
##$TP07= 0
##$TPNAME0= <>
##$TPNAME1= <>
##$TPNAME2= <>
##$TPNAME3= <>
##$TPNAME4= <>
##$TPNAME5= <>
##$TPNAME6= <>
##$TPNAME7= <>
##$TPOAL= (0..7)
0.5 0.5 0.5 0.5 0.5 0.5 0.5 0.5 
##$TPOFFS= (0..7)
0 0 0 0 0 0 0 0 
##$TUNHIN= 0
##$TUNHOUT= 0
##$TUNXOUT= 0
##$USERA1= <user>
##$USERA2= <user>
##$USERA3= <user>
##$USERA4= <user>
##$USERA5= <user>
##$V9= 5
##$VALIST= <valist>
##$VCLIST= <CCCCCCCCCCCCCCC>
##$VD= 0
##$VDLIST= <DDDDDDDDDDDDDDD>
##$VPLIST= <PPPPPPPPPPPPPPP>
##$VTLIST= <TTTTTTTTTTTTTTT>
##$WBST= 1024
##$WBSW= 4
##$XGAIN= (0..3)
0 0 0 0 
##$XL= 0
##$YL= 0
##$YMAX_a= 35161
##$YMIN_a= -36123
##$ZGOPTNS= <>
##$ZL1= 120
##$ZL2= 120
##$ZL3= 120
##$ZL4= 120
##$ABSF1= 10
##$ABSF2= 0
##$ABSG= 5
##$ABSL= 3
##$ALPHA= 0
##$AQORDER= 0
##$ASSFAC= 0
##$ASSFACI= 0
##$ASSFACX= 0
##$ASSWID= 0
##$AUNMP= <proc_1d>
##$AZFE= 0.1
##$AZFW= 0.1
##$BCFW= 1
##$BC_mod= 2
##$BYTORDP= 1
##$COROFFS= 0
##$CY= 11.3945322036743
##$DATMOD= 1
##$DC= 2
##$DFILT= <>
##$DTYPP= 0
##$F1P= 15.9154993809931
##$F2P= -4.1035820241983
##$FCOR= 0.5
##$FTSIZE= 0
##$FT_mod= 4
##$GAMMA= 1
##$GB= 0.15
##$INTBC= 1
##$INTSCL= 1
##$ISEN= 128
##$LB= 0.24
##$LEV0= 0
##$LPBIN= 0
##$MAXI= 10000
##$MC2= 0
##$MEAN= 0
##$ME_mod= 0
##$MI= 1.114404
##$NCOEF= 0
##$NC_proc= 0
##$NLEV= 6
##$NOISF1= 3.799351
##$NOISF2= 2.8
##$NSP= 1
##$NTH_PI= 0
##$NZP= 0
##$OFFSET= 15.70392
##$PC= 1
##$PHC0= -11199.48
##$PHC1= 9.000993
##$PH_mod= 1
##$PKNL= yes
##$PPARMOD= 0
##$PSCAL= 0
##$PSIGN= 0
##$REVERSE= no
##$SF= 200.130013532006
##$SI= 16384
##$SIGF1= 3
##$SIGF2= 2
##$SINO= 400
##$SIOLD= 16384
##$SREGLST= <1H.CDCl3>
##$SSB= 0
##$STSI= 0
##$STSR= 0
##$SW_p= 3612.71676300578
##$SYMM= 0
##$S_DEV= 0
##$TDeff= 0
##$TDoff= 0
##$TI= <>
##$TILT= no
##$TM1= 0
##$TM2= 0
##$TOPLEV= 0
##$USERP1= <user>
##$USERP2= <user>
##$USERP3= <user>
##$USERP4= <user>
##$USERP5= <user>
##$WDW= 1
##$XDIM= 8192
##$YMAX_p= 0
##$YMIN_p= 0
$$ End of Bruker specific parameters
$$ ---------------------------------
##NTUPLES= NMR FID
##VAR_NAME=  TIME,          FID/REAL,        FID/IMAG
##SYMBOL=    X,             R,               I
##VAR_TYPE=  INDEPENDENT,   DEPENDENT,       DEPENDENT
##VAR_FORM=  AFFN,          ASDF,            ASDF
##VAR_DIM=   8192,          8192,            8192
##UNITS=     SECONDS,       ARBITRARY UNITS, ARBITRARY UNITS
##FACTOR=    0.0002944,     1,               1
##FIRST=     0,             0,               0
##LAST=      2.4114304,     0,               0
##MIN=       0,             -36123,          0
##MAX=       2.4114304,     35161,           0
$$ Real data points
##PAGE= N=1
##DATA TABLE= (X++(R..R)), XYDATA
$$ [...]
$$ plain form
1311 -482 -1902 2075 -142 -1849 2102 -83 -2562 1868 937 -2251 1333 980 -2098 1307 1161 -2428
1327 -2428 935 1779 -2156 351 1729 -1943 409 2060 -2178 -441 2271 -1625 -788 2172 -1243
1342 -1243 -779 2210 -1387 -1477 2281 -665 -1546 2035 -533 -1639 2181 -266 -2161 1976 365 -2223
1358 -2223 1472 555 -2015 1618 883 -2425 1051 1253 -2256 730 1489 -2014 673 1711 -2225 78
1374 78 2086 -1769 -286 2062 -1547 -463 2252 -1352 -925 2275 -1024 -1332 2066 -691 -1365 2194
1390 2194 -411 -1806 1874 -160 -2024 1690 276 -1998 1553 524 -2245 1243 897 -2209 985
1405 985 1185 -2158 724 1522 -1981 473 1708 -1974 25 1890 -1706 -161 2118 -1430 -506 2055
1421 2055 -1398 -917 2238 -945 -1260 2088 -578 -1425 1933 -393 -1670 1869 -42 -1933 1588 367
$$ packed form
1311d82j420L977k217j707L951k185k479M430r31l188L584l53l078L405j46l589
1327b428L363Q44l935K507J378l672K352J651m238J737K712l896Q37K960l415
1342a243M64K989l597r0L758k946q81L581k568j106L820k447j895M137j611k588
1358b223L695r17k570L633p35l308L476K02l509K986P59l503K687J038l936K303
1374G8K008l855J483K348l609J084K715l604M27L200l299l08L398k757o74L559
1390B194k605j395L680k034j864L714j414k274L551j029k769L488l46l106L194
1405I85K00l343K882P98l503K454J235l682J999J865l596J545K279l548R24K561
1421B055l453M81L155l183l15L348k666q47L358k326j277L539j911j891L521j221
$$ plain form
1437 367 -1822 1482 491 -2136 1209 918 -2174 855 1300 -1900 576 1287 -2036 303 1676 -1816
1453 -1816 -102 1716 -1555 -158 1847 -1583 -515 2151 -1266 -1069 2022 -710 -965 2015 -688
1468 -688 -1398 2007 -245 -1640 1715 115 -1523 1625 90 -1964 1536 699 -2098 929 887 -1850
1484 -1850 840 1026 -2038 552 1440 -1908 -17 1405 -1527 177 1601 -1747 -310 2001 -1318
1499 -1318 -784 1816 -909 -646 1876 -1016 -1127 2094 -404 -1457 1595 -233 -1241 1755 -186 -1739
1515 -1739 1735 461 -1930 1033 575 -1566 1218 674 -2042 917 1279 -1864 277 1186 -1529 438
1531 438 1290 -1878 -18 1866 -1370 -625 1454 -1100 -371 1671 -1274 -865 2024 -660 -1310 1488
1547 1488 -422 -973 1748 -470 -1527 1797 290 -1646 1157 381 -1317 1340 328 -1859 1234
$$ packed form
1437C67k189L304r91k627L345k91l092L029M45l200K476P11l323K339J373l492
1453a816J714J818l271J397K005l430J068K666l417J97L091k732k55K980k703
1468f88p10L405k252j395L355j600j638L148j535k054L500q37k797L027m2k737
1484a850K690J86l064K590Q88l348J891J422k932J704J424l348J437K311l319
1499a318N34K600k725K63K522k892j11L221k498j053L052j828j008K996j941j553
1515a739L474j274k391K963m58k141K784n44k716K959L62l143K141R09k715J967
1531D38Q52l168J860J884l236P45K079k554P29K042k945M09K889k684o50K798
1547A488j910n51K721k218j057L324j507j936K803p76j698K657j012k187L093
$$ plain form
1562 1234 1075 -1778 522 938 -1527 662 1060 -1864 292 1621 -1519 -371 1306 -1204 -129 1469
1578 1469 -1418 -576 1837 -859 -972 1464 -623 -779 1633 -686 -1266 1787 23 -1467 1201 143
1594 143 -1243 1309 148 -1621 1252 716 -1649 734 713 -1448 827 868 -1756 510 1356 -1497 31
1611 31 1257 -1263 47 1365 -1386 -315 1640 -982 -610 1408 -877 -621 1569 -817 -1040 1638
1627 1638 -307 -1241 1282 -135 -1180 1328 10 -1471 1191 438 -1422 914 495 -1392 922 731
1643 731 -1586 616 1099 -1377 292 1074 -1316 215 1261 -1351 -130 1400 -1099 -344 1311 -1027
1659 -1027 -463 1487 -899 -833 1478 -514 -944 1320 -398 -1005 1397 -179 -1278 1262 172 -1280
1675 -1280 1068 280 -1326 1009 546 -1454 711 808 -1331 468 845 -1340 354 1050 -1347 70
$$ packed form
1562A234j59k853K300M16k465K189L98k924K156J329l140J148J677k510J075J598
1578A469k887Q42K413k696j13K436k087j56K412k319n80L053j764j490K668j058
1594A43j386K552j161j769K873n36k365K383k1k161K275M1k624K266Q46k853J528
1611C1J226k520J310J318k751J071J955k622L72K018k285K56K190k386k23K678
1627A638j945r34K523j417j045K508j318j481K662p53j860K336m19j887K314j91
1643G31k317K202M83k476J669P82k390J531J046k612J221J530k499P55J655k338
1659a027N64J950k386O6K311j992m30K264j718o07K402j576j099K540j090j452
1675a280K348p88j606K335m63k000K165R7k139J799L77k185J694O96k397J417
$$ plain form
1691 70 1206 -1177 -142 1248 -1061 -311 1360 -883 -559 1355 -666 -693 1321 -520 -819 1354 -350
1708 -350 -1024 1297 -121 -1163 1197 92 -1271 1025 305 -1284 866 501 -1335 685 690 -1324 478
1725 478 840 -1247 338 958 -1272 117 1189 -1112 -188 1213 -903 -299 1221 -853 -513 1323
1741 1323 -635 -778 1207 -432 -779 1226 -371 -1011 1246 -58 -1172 1015 170 -1073 968 245
1757 245 -1271 881 611 -1262 545 669 -1118 542 738 -1282 384 1071 -1201 -60 1011 -961
1773 -961 -47 1072 -1039 -332 1283 -772 -654 1104 -527 -549 1144 -592 -813 1301 -183 -1018 1007
1790 1007 -2 -911 1031 53 -1130 1009 459 -1200 576 458 -1022 688 528 -1280 513 909
1806 909 -1173 98 836 -955 180 900 -1138 -81 1236 -823 -421 990 -684 -327 1123 -743
$$ packed form
1691G0J136k383J035J390k309P50J671k243L24J914k021k7K014j841k99K173j704
1708c50o74K321j418j042K360j105j363K296p20j589K150l65j836K020Nk014J802
1725D78L62k087J585O20k230J389J072k301R24J401k116O04J520k074L40J836
1741A323j958j43J985j639l47K005j597o40K257j304j114K187q45j243K041p23
1757B45j516K152k70j873J807J24j787J660J96k020J666O87k272J141J071j972
1773i61R14J119k111P07J615k055J18J758j631k2J693j736k21K114j484q35K025
1790A007j009r09J942r78j183K139n50j659J776j18j480J710j60j808J793L96
1806I09k082J271P38j791J135P20k038J057J317k059M02J411j674L57J450j866
$$ plain form
1822 -743 -624 1319 -314 -911 914 -207 -724 1039 -209 -1044 1045 234 -1106 670 266 -948 788
1839 788 327 -1270 654 851 -1071 207 674 -904 335 768 -1119 128 1162 -857 -259 881
1855 881 -746 -104 1047 -897 -500 1252 -444 -743 900 -335 -581 993 -449 -936 1108 86
1871 86 -980 745 69 -889 847 153 -1170 778 662 -1051 321 538 -872 457 612 -1136 226
1888 226 993 -887 -97 853 -741 -13 886 -954 -322 1179 -530 -525 922 -448 -479 969 -486 -721
1906 -721 1107 -93 -850 812 -45 -766 883 -8 -1067 797 354 -1026 534 416 -911 513 432
1923 432 -1141 339 786 -900 131 755 -833 71 815 -888 -116 1030 -655 -326 930 -516 -312
1940 -312 1000 -514 -587 988 -283 -655 929 -131 -695 866 -123 -939 769 157 -885 664 239
$$ packed form
1822g43J19J943j633n97J825j121n17J763j248q35K089q11j340J776m04j214J736
1839G88m61j597J924J97j922J278M67j578J239M33j887J247J034k019N98J140
1855H81j627O42J151j944L97J752j696k99J643j235k46J574j442m87K044j022
1871H6j066J725o76r58J736o94j323J948j16j713J372K17j410J329J55j748J362
1888B26P67j880P90R50j594P28Q99j840O32J501j709NJ447j370l1J448j455k35
1906g21J828j200p57J662q57p21J649q91j059J864m43j380J560j18j327J424q1
1923D32j573J480M47j686J031O24j588R04P44j703P72J146j685L29J256j446K04
1940c12J312j514p3J575j271l72J584j060n64J561r89q16J708o12j042J549m25
$$ plain form
1957 239 -948 577 349 -996 464 534 -935 316 600 -888 252 770 -899 -37 789 -754 -105
1974 -105 883 -634 -203 907 -631 -432 909 -413 -485 926 -308 -626 905 -130 -736 812 8
1991 8 -790 731 123 -806 712 284 -890 512 316 -928 459 518 -902 311 596 -931 85 654
2009 654 -821 14 739 -780 -107 801 -649 -200 837 -613 -381 889 -417 -451 935 -236 -558
2026 -558 813 -201 -678 853 55 -708 709 115 -768 621 190 -864 563 395 -894 351 490
2043 490 -790 305 524 -908 128 668 -782 -8 736 -639 -67 712 -749 -238 906 -482 -390
2060 -390 792 -377 -401 809 -371 -575 882 -131 -719 695 31 -562 741 10 -848 644 299
2077 299 -815 470 431 -676 438 358 -905 325 662 -779 48 593 -664 73 641 -777 -126 805
$$ packed form
1957B39j187J525k28j345J460P0j469J251K84j488J140N18j669Q62Q26j543O49
1974a05R88j517M31J110j538J99J341j322p2J411j234l18J531j035o06J548q04
1991Hp98J521o08r29J518m28j174J402j96j244J387N9j420J213K85j527J016N69
2009F54j475Q35P25j519O73R08j450M49J037j450K32J270j306l4J386j171l22
2026e58J371j014m77J531p98p63J417n94q83J389m31j054J427j68j289J245J39
2043D90j280J095K19j432J036N40j450P74P44j375N72P79j461N11J144j388R2
2060c90J182j169k4J210j180k04J457j013n88J414o64n93J303p31q58J492l45
2077B99j114J285l9j107J114q0j263J230L37j441Q27N45j257P37N68j418O51R31
$$ plain form
2095 805 -632 -378 694 -419 -224 775 -533 -503 834 -264 -599 713 -84 -478 755 -145 -743 777
2113 777 209 -744 489 242 -625 572 280 -818 455 524 -810 131 493 -615 277 581 -825 -24
2131 -24 744 -636 -223 654 -480 -143 714 -588 -387 834 -297 -518 607 -270 -421 771 -207 -649
2149 -649 769 68 -741 465 109 -560 652 176 -804 485 411 -728 272 371 -619 375 478 -815
2167 -815 168 733 -595 -79 540 -562 1 710 -590 -222 792 -390 -440 550 -342 -288 771 -340
2185 -340 -623 725 -31 -635 496 -19 -538 627 36 -740 584 365 -671 300 250 -626 430 408 -740
2204 -740 284 623 -637 -15 469 -556 117 619 -654 -133 728 -447 -288 587 -413 -254 668 -412
2222 -412 -458 747 -106 -526 509 -145 -522 614 -28 -637 607 209 -670 355 185 -596 436 299
$$ packed form
2095H05j437K54J072j113J95R99j308L0J337j098l35J312p97l94J233r00n98J520
2113G77n68r53J233k47q67J197k92j098J273O9j334R41L62j108Q92L04j406Q01
2131b4P68j380M13Q77j134L37Q57j302K01J221j131k21J125q77j51J192r78m42
2149f49J418p01q09J206l56o69J212m76r80J289p4j139J000R9r90R94J03j293
2167h15R83N65j328N16O19j102N63P09j300L68J014j182n0R90q92N4J059j111
2185c40k83J348p56o04J131n15n19J165n91p76J324k19j036R71n0q76J056k2j148
2204g40J024L39j260O22M84j025O73N02j273N21Q61j175J59Q75j000J59R22j080
2222d12m6J205q53m20J035o54l77J136o42o09J244l98q79J025j70p81J032j37
$$ plain form
2240 299 -722 283 483 -627 126 458 -594 109 497 -642 6 687 -473 -142 574 -469 -216 640
2258 640 -380 -288 711 -233 -413 579 -189 -452 608 -106 -559 560 40 -585 490 102 -624 395 170
2277 170 -667 352 375 -579 240 386 -630 122 457 -564 89 554 -522 -43 581 -481 -139 590 -420
2296 -420 -260 583 -316 -286 639 -232 -435 537 -184 -457 570 -45 -473 557 31 -587 437 129 -556
2315 -556 410 220 -583 336 341 -573 215 382 -565 109 412 -550 84 564 -488 -111 492 -450 -164 545
2335 545 -369 -228 615 -279 -373 534 -171 -346 543 -169 -454 569 20 -503 449 79 -511 386 106 -565
2355 -565 415 312 -559 213 261 -542 203 332 -574 152 499 -509 -38 458 -407 -26 476 -480 -164 601
2375 601 -286 -273 509 -227 -273 501 -282 -394 619 -22 -483 407 -8 -439 417 13 -533 432 224 -550
$$ packed form
2240B99j021J005K00j110P53L32j052P03L88j139O48O81j160L31P16j043K53Q56
2258F40j020R2R99r44j80R92p68k63J060p14m53J119n20o25J075l88p26J019k25
2277A70q37J019K3r54Q19J46j016P52L35j021O53M65j076M79O24j062L42P29j010
2296d20J60Q43q99L0R25q71k03R72p21k73J027o15m28J030n26o18J024l08o85
2315e56R66j90q03R19Nr14P88J67r47O74L03r62O34M80j052L77O03r42K86P09
2335E45r14J41Q43q94r4R07p05j75Q89p12k85J023n49n23R52l70n90Q97k80o71
2355e65R80j03q71P72M8q03P45J29r06P26L47j008M71M96q65L81N02r56L16P65
2375F01q87J3P82p36m6P74p83j12J013o41m61Q90m15m31Q56m04n46R65k08p74
$$ plain form
2395 -550 247 240 -441 290 248 -603 194 472 -469 46 425 -397 50 393 -514 -61 584 -327 -217 450 -289
2416 -289 -181 494 -326 -338 564 -118 -437 414 -34 -344 461 -81 -524 446 159 -488 312 189 -431 307
2436 307 177 -576 255 407 -474 79 333 -407 113 390 -503 -19 503 -369 -142 434 -290 -67 489 -370
2456 -370 -281 528 -157 -317 434 -112 -276 469 -148 -441 461 90 -441 320 71 -410 380 124 -536 251
2476 251 282 -475 136 273 -409 192 334 -528 10 443 -354 -57 389 -334 -16 477 -377 -208 523 -191
2496 -191 -255 393 -193 -225 478 -165 -392 448 -20 -394 325 -14 -335 419 51 -511 296 214 -423 202 192
2517 192 -396 241 253 -489 119 388 -384 7 309 -376 41 429 -398 -118 466 -272 -217 375 -235 -151 454
2538 454 -227 -319 441 -76 -333 365 -53 -311 410 -4 -415 363 138 -399 241 131 -378 284 199 -431 199
$$ packed form
2395e50P97po81P31m2q51P97K78r41N15L79q22M47L43r07M53O45r11J10O67p39
2416b89J08O75q20j2R02o82l19Q51m48l10Q05n42m43R70k87o47Q00j23o20P38
2436C07j30p53Q31J52q81N53K54p40N20K77q93M84N22q72K27N76p24K23N56q59
2456c70Q9Q09o85j60P51n46j64P45o17k93R02l71n31P61k49m81P90k56o60P87
2476B51L1p57O11J37o82O01J42q62N38M33p97K97M46p23L18M93q54J69P31p14
2496a91o4O48n86l2P03o43k27Q40m68l74P19l39l21P54l68n62Q07q2o37O25j0
2517A92n88O37J2p42O08K69p72L91L02o85M17L88q27K80N84p38N5N92o10Q4O05
2538D54o81r2P60n17k57O98m18k58P21m14m11P78k25n37O40j10n09O62q5o30O30
$$ plain form
2559 199 271 -424 91 281 -382 79 342 -385 -33 387 -335 -111 363 -288 -134 389 -254 -214 433 -147 -269
2580 -269 385 -102 -302 385 -27 -327 366 36 -393 301 96 -382 273 151 -388 236 205 -408 172 276
2600 276 -391 94 300 -344 62 332 -344 -12 366 -313 -99 368 -253 -112 369 -254 -208 381 -172 -273
2620 -273 341 -102 -287 345 -72 -328 364 37 -372 265 83 -317 285 129 -375 246 228 -373 137 254
2640 254 -317 137 273 -369 71 351 -329 -52 316 -274 -57 319 -294 -140 385 -221 -226 314 -159 -209 338
2661 338 -151 -296 376 -33 -339 272 10 -274 297 30 -367 279 178 -353 160 175 -306 178 215 -377 116
2682 116 325 -322 -4 278 -267 41 303 -314 -65 383 -228 -169 307 -171 -137 342 -199 -246 369 -71 -287
2703 -287 263 -73 -249 308 -61 -363 297 90 -341 159 98 -280 230 125 -380 177 280 -298 61 232
$$ packed form
2559A99P2o95N15J90o63M61K63p27L52M20p22K24M74o51J54N23o43M0O47n80j22
2580b69O54m87k00O87m12l00O93l30m29O94k05m78O55j22n39O24l1o13N80J04
2600B76o67M85K06o44M06K70o76L32L78o79K14M67o21J41M81o23M6N89n53j01
2620b73O14m43j85O32m17k56O92l27m09O37j82m00O02j56n04O21j8o01N10J17
2640B54n71M54J36o42M40K80o80K77L68n90K17L76o13J54N25o06nN40m73n0N47
2661C38m89j45O72m09l06O11k62k84N71k67l97O46j01n31N13J5m81M84L7n92M93
2682A16K09o47L18K82n45L08K62o17K49M48o11N9M76m78L4M79n41m7O15m40k16
2703b87N50l36j76N57l69l02O60k07m31N00o1l78N10j05n05N57J03n78L59J71
$$ plain form
2723 232 -251 108 274 -335 -4 372 -226 -99 276 -188 -59 324 -251 -182 359 -116 -241 263 -101 -213
2743 -213 307 -99 -315 308 46 -313 186 43 -258 254 63 -354 208 200 -298 106 176 -259 159 221 -340
2764 -340 52 323 -248 -33 249 -218 2 296 -251 -111 348 -135 -164 264 -123 -147 314 -113 -262 303 -1
2785 -1 -269 211 -7 -246 254 31 -339 191 138 -289 125 106 -284 173 170 -338 86 248 -257 14 207 -244
2807 -244 38 278 -256 -57 311 -159 -101 255 -169 -94 308 -160 -199 299 -59 -209 242 -55 -227 264 -18
2828 -18 -302 216 70 -268 163 53 -280 187 124 -311 112 200 -263 43 172 -254 70 244 -265 -9 271
2849 271 -198 -47 230 -183 -59 279 -171 -139 285 -96 -165 238 -95 -178 263 -50 -228 242 24 -240 191
2870 191 29 -240 207 93 -264 157 140 -252 111 153 -259 87 171 -261 42 219 -236 -12 211 -217 -52
$$ packed form
2723B32m83L59J66o09L31L76n98J27L75m64J29L83n75O9N41m75j25N04l64j12
2743b13N20m06k16O23k62l59M99j43l01N12j91m17N62qm98M04P0m35M18O2n61
2764c40L92K71n71K15K82m67K20K94n47J40M59m83k9M28l87k4M61m27j49N65l04
2785ak68M80k18k39N00k23l70N30n3m27M14j9l90M57ln08M24J62n05K71J93m51
2807b44K82K40n34J99L68m70N8L56m24P5M02m68l9M98l58j50M51k97j72M91k82
2828a8k84N18j46l38M31j10l33M67o3m35M23Q8m63L06J29m26L24J74n09K56K80
2849B71m69J51K77m13J24L38m50L2M24l81o9M03l33q3M41l13j78M70k18k64M31
2870A91j62k69M47j14l57M21j7l92L63M2m12L46Q4m32L03J77m55K24K23m28J65
$$ plain form
2891 -52 236 -192 -76 267 -163 -118 244 -119 -152 237 -92 -166 239 -64 -203 230 -8 -219 187 17 -220
2912 -220 183 67 -239 155 105 -252 105 122 -224 108 165 -238 54 206 -219 4 196 -190 -19 210 -193
2933 -193 -56 249 -135 -115 206 -118 -106 226 -101 -149 241 -44 -209 172 -14 -162 196 -1 -222 195 79
2954 79 -216 127 81 -190 138 105 -223 119 178 -208 34 140 -179 40 180 -199 -2 218 -156 -85 164 -132
2976 -132 -49 198 -147 -122 230 -56 -157 176 -51 -146 185 -46 -186 213 50 -190 141 40 -173 140 64
2997 64 -203 130 135 -196 39 112 -168 80 145 -210 19 199 -145 -18 159 -139 -17 168 -174 -76 227 -68
3019 -68 -121 156 -80 -93 187 -89 -172 199 8 -183 113 9 -144 148 11 -218 137 106 -171 81 83 -152
3041 -152 93 97 -211 53 174 -140 6 133 -139 29 159 -167 -39 200 -91 -75 138 -88 -50 175 -120
$$ packed form
2891e2K88m28J16L43m30M5L62l63l3L89l29p4M05l03j39M33k38k11M06j70k37
2912b20M03j16l06L94n0l57L57J7l46L32N7m03K92J52m25K23J92l86J71K29m03
2933a93J37L05l84K0L21l24J2L32l27m8L90k85j65L81j86j48L58j97k21M17j16
2954G9k95L43m6k71L28l3l28L42N9l86K42J06l19K19J40l79J97K20l74P1K49k96
2976a32Q3K47l45K5L52k86j01L33k27r5L31k31j40L99j63k40L31j01k13L13p6
2997F4k67L33Nl31K35P3k80K48O5l55K29J80l44J27J77k98J22J85l42R8L03k95
3019f8n3K77k36j3K80k76q3L71j91j91K96j04j53K92j37k29L55l1k77K52Kk35
3041a52K45Ml08K64J21l14J46J27k72J68J30l26J28K39k91J6K13k26L8K25k95
$$ plain form
3062 -120 -128 182 -21 -125 136 -24 -115 148 -30 -177 145 55 -158 100 42 -148 123 81 -177 81 124 -160
3084 -160 23 116 -136 57 135 -167 -32 154 -106 -40 139 -94 -44 149 -127 -113 173 -41 -96 133 -55 -107
3106 -107 157 -40 -147 138 11 -145 105 16 -129 128 42 -168 74 78 -129 63 92 -133 55 112 -157 14
3128 14 140 -102 -3 116 -103 -14 154 -106 -72 128 -67 -73 136 -70 -79 148 -49 -134 123 -22 -116 118 -19
3151 -19 -118 125 21 -146 94 60 -124 79 51 -131 84 91 -139 35 98 -125 26 112 -115 7 137 -126 -44
3174 -44 116 -98 -48 116 -84 -84 137 -66 -100 126 -37 -113 113 -30 -111 118 12 -120 105 29 -127 93 48
3197 48 -115 96 69 -117 60 86 -121 44 91 -116 16 102 -106 2 109 -109 -23 113 -99 -48 119 -74
3219 -74 -48 124 -75 -92 114 -38 -91 101 -16 -97 103 -21 -119 98 31 -120 75 33 -94 88 52 -125 64
$$ packed form
3062a20qL10k03j04K61j60r1K63j78j47L22r0k13K58n8j90K71m2k58K58M3k84
3084a60J83R3k52J93P8l02J35J86k60O6J79k33N0J93k76J4K86k14n5K29j88n2
3106a07K64j97j07K85j27j56K50q9j45K57q6k10K42Mk07J92K9k25J88N7k69J71
3128A4J26k42R9J19k19Q9J68k60L4K00j95oK09k06rK27j97q5K57j45r4K34j37
3151a9r9K43j04j67K40l4j84K03k8j82K15Pk30J74O3k23J51Q6k27J22J30k63Q2
3174d4J60k14N0J64k00%K21k03l4K26j63p6K26j43q1K29j06j32K25p6j56K20m5
3197D8j63K11k7j86J77K6k07J65M7k07J32Q6k08J08J07k18Q6J36k12N1J67j93
3219g4K6J72j99j7K06j52n3J92j17q1K00j24r8K17o7j51J95m2j27J82l6j77J89
$$ plain form
3242 64 70 -119 37 86 -79 54 105 -122 0 109 -85 -21 105 -76 -13 102 -85 -59 121 -56 -81 77 -48
3265 -48 -62 117 -40 -100 97 -5 -117 64 2 -73 101 17 -121 81 57 -100 55 62 -89 56 82 -109 43
3288 43 115 -86 -16 77 -75 5 106 -109 -35 109 -73 -75 87 -59 -32 106 -63 -88 114 -13 -90 68 -21 -75
3312 -75 98 -4 -110 93 44 -109 45 19 -84 85 64 -104 46 84 -90 6 68 -71 39 96 -105 -16 109
3335 109 -62 -29 70 -74 -34 93 -75 -68 111 -28 -87 51 -39 -75 99 -14 -95 88 29 -98 47 -1 -76 80
3359 80 20 -119 55 83 -75 24 43 -78 45 78 -91 19 107 -61 -15 61 -62 -2 101 -71 -35 104 -30 -61
3383 -61 67 -34 -45 85 -30 -88 83 16 -76 74 -1 -79 77 13 -92 64 52 -72 37 38 -85 58 43 -82
3407 -82 19 82 -74 -2 72 -66 6 69 -81 -27 82 -48 -21 73 -64 -50 81 -50 -63 78 -18 -61 57 -12 -74
$$ packed form
3242F4Oj89J56M9j65J33N1k27J22J09j94O4J26j81O3J15j87K6J80j77k5J58j25
3265d8j4J79j57o0J97j02j12J81o2p5J74q4j38K02k4j57J55Pj51J45K6j91J52
3288D3P2k01P0R3j52Q0J01k15P4J44j82kJ62j46K7J38j69k5K02j27p7J58q9n4
3312g5J73j02j06K03m9j53J54k6j03J69k1j68J50L8j74R6O2j39J10N7k01Q9J25
3335A09j71L3R9j44M0J27j68PJ79j39n9J38r0l6J74j13q1J83n9j27J45m8p5J56
3359H0o0j39J74K8j58R9J9j21J23L3j69J10Q8j68M6P6j23O0J03j72L6J39j34l1
3383f1J28j01j1J30j15n8J71o7r2J50p5p8J56o4j05J56j2j24J09Jj23J43j5j25
3407h2J01O3j56P2P4j38P2O3j50N4J09j30K7R4j37J4J31j31j3J41r6m3J18o9o2
$$ plain form
3432 -74 70 -13 -88 50 15 -81 51 29 -80 51 43 -78 38 52 -78 30 44 -71 11 54 -66 3 82 -53 -5
3457 -5 69 -61 -18 81 -41 -37 65 -35 -47 76 -33 -60 72 -29 -65 66 0 -63 64 11 -73 51 28 -67 41
3482 41 34 -52 39 43 -62 35 56 -64 4 51 -65 -2 61 -61 -8 58 -59 -27 54 -57 -23 63 -38 -48 56 -37 -53
3509 -53 63 -7 -55 62 1 -59 60 12 -61 54 7 -70 50 33 -66 41 37 -57 29 45 -67 20 60 -58 8 51 -53
3536 -53 5 52 -67 -22 55 -37 -34 53 -42 -32 55 -46 -60 58 -20 -48 45 -14 -43 51 -12 -55 51 23 -54 38 25 -57 46
3565 46 16 -66 39 45 -50 11 37 -44 9 49 -68 -9 58 -40 -11 41 -44 -15 43 -53 -49 48 -34 -42 42 -29 -46 60 -29 -60
3595 -60 51 3 -43 37 17 -30 45 11 -55 39 46 -37 33 23 -46 31 37 -54 11 52 -45 -16 29 -51 -1 42 -55 -25 36 -40 -36
3626 -36 32 -37 -23 54 -38 -53 50 -1 -46 36 -14 -35 50 -5 -61 34 18 -39 29 9 -43 37 16 -60 24 41 -41 12 20 -56
$$ packed form
3432g4J44q3p5J38l5r6J32k2j09J31qj21J16J4j30J08J4j15Q2M3j20O9P9j35M8
3457eP4j30M3R9j22MJ02j00j2J23j09k7J32j01l6J31o6o3J27n3q4J24k3r5J08
3482D1pq6R1Mj05R7K1j20O8M7j16O3O3j22N3O6j17L2Q1j11L4Q6j01j0J04r3j6
3509e3J16p0m8J17o1o0J19m8p3J15m7p7J20j7r9J07mr4Q6J6j12Q7M0j18O6M3j04
3536e3N8M7j19M5P7r2LQ7r5J0Q7j01j4J18p8k8R3n9k9R4o3m3J06k8p7R2j3q2J03
3565D6l0q2J05Or5O1K6q1N3M0j17N9O7r8K9N2q5K9N8r6MR7q2qQ4p1j7J06q9l1
3595f0J11m8m6Q0k0m7P5l4o6R4Pq3P0j0o9P7Or1O5M1r7K9M5q0N0M3r7L0O1p6M
3626c6O8o9J4P7r2j5J03n1m5Q2n0k1Q5n5n6R5j6n7O8k0n2Q0k1p6Q4J7q2N3Qp6
$$ plain form
3656 -56 13 31 -54 -8 37 -35 -17 32 -47 -9 44 -50 -37 40 -20 -28 27 -31 -30 52 -17 -50 38 -4 -36 24 1 -43 42 15 -44
3687 -44 33 37 -34 26 23 -43 25 35 -53 9 33 -41 -6 24 -52 -10 32 -59 -24 33 -39 -22 28 -41 -22 39 -24 -39 49 -16 -29
3718 -29 32 -14 -27 45 -5 -44 35 13 -31 25 5 -43 30 14 -61 26 22 -45 22 22 -47 5 33 -52 -7 20 -42 -6 19 -51 -15
3749 -15 33 -31 -32 41 -37 -30 29 -27 -24 44 -23 -33 49 -7 -35 39 -1 -36 39 5 -39 35 18 -43 21 19 -51 11 14 -41 16 30 -45
3782 -45 4 35 -49 -3 15 -47 -9 32 -39 -25 30 -37 -20 38 -28 -15 41 -28 -31 37 -15 -33 43 0 -28 43 9 -25 40 7 -43
3813 -43 34 16 -47 37 17 -49 18 22 -51 6 26 -46 12 26 -58 -6 26 -52 -21 35 -43 -15 39 -39 -36 40 -23 -27 40 -14 -20 57
3845 57 -20 -38 43 -11 -25 45 7 -30 38 -3 -46 31 10 -51 18 21 -42 34 21 -56 21 33 -34 -5 35 -45 -2 9 -55 -4 65
3876 65 -23 -18 51 5 3 48 -38 -31 76 -4 -39 39 3 -36 42 -20 -37 56 8 -57 23 -13 -61 24 13 -97 -11 12 -64 -1 29
$$ packed form
3656e6O9J8q5M6M5p2J8M9p9L8N3r4J3P7o0qN5n8JQ2o9l3Q8m2l2O0k3m4Q5k7n9
3687d4P7Mp1O0lo6O8J0q8O2K4p4L5L0p6M2M2r1L5N7p2J7N0o9J9O1o3j5Q8o5j3
3718b9O1m6j3P2n0l9P9k2m4N6k0m8P3j6p5Q7mo7O7%o9N2K8q5M5K7o2L6K5p0L6
3749a5M8o4jP3p8PN9n6LO8o7j0Q2n6k8P4m0l5P5l4m4P4j7o1O4kp0O2Ln5N7J4p5
3782d5M9L1q4M6J8o2L8M1p1J4N5o7J7N8o6J3N6o9lO8n2j8P6m3k8P1l4l4O5l3n0
3813d3P7j8o3Q4k0o6O7Mp3N7K0p2N8J4q4N2L2p8L1N6p8K8N4p8LP6o3mO7n4oP7
3845E7p7j8Q1n4j4P0l8l7O8m1m3P7k1o1O9Lo3P6j3p7P7J2o7K9M0q0M3J1o4N1O9
3876F5q8NO9m6kM5q6PJ07q0l5P8l6l9P8o2j7R3m8o5Q0l6m8Q5j1j10Q6K3p6O3L0
$$ plain form
3907 29 -58 17 63 -63 -3 13 -38 5 29 -86 30 31 -59 -19 65 -28 -7 78 -24 -8 43 7 -45 49 5 -22 12 33 -45
3936 -45 54 -20 -61 55 4 -44 4 -6 -71 16 41 -49 -15 34 -58 -18 16 -68 9 31 -40 -9 38 -26 -22 45 -32 -14 53 -32
3966 -32 -34 59 -10 -42 44 -10 -24 66 -6 -56 37 12 -57 12 -30 -96 71 60 -71 4 26 -56 21 14 -64 10 29 -61 -2 44
3996 44 -51 -9 31 -52 -8 46 -40 -20 69 -37 -32 53 -21 -37 66 -8 -48 56 9 -39 43 0 -52 45 6 -63 31 18 -69
4025 -69 23 23 -66 14 37 -72 5 42 -62 -1 39 -57 -12 59 -49 -12 49 -37 -54 67 -20 -33 59 -28 -35 62 -7 -26 60
4054 60 11 -35 62 14 -54 48 16 -63 35 23 -65 32 17 -73 36 37 -68 14 45 -56 2 37 -56 -5 56 -46 -5 58
4082 58 -42 -18 69 -20 -27 57 -23 -37 69 -12 -41 64 -3 -47 58 13 -52 48 12 -61 34 18 -52 32 19 -65 29 34 -76
4111 -76 5 33 -60 5 54 -62 -4 53 -46 -15 76 -37 -14 62 -38 -28 72 -22 -33 71 -17 -48 62 -7 -54 61 2
$$ packed form
3907B9q7P5M6j26O0J6n1M3K4j15J16Jr0M0Q4r3K1Q5j02J6N1l6n2R4m4k7L4K1p8
3936d5R9p4m1J16n1m8M8j0o5Q7K5r0L4M9r2M0L4q4P7K2p1L1M7o4MO7p7J8O7q5
3966c2kR3o9l2Q6n4j4R0p2n0R3k5o9O9m2o6J67j1j31P5K2q2P7pp8P4J9r0N9M6
3996D4r5M2M0q3M4N4q6K0Q9j06NQ5p4j6J03p4m0J04m7m8Q2m3n2R7l9o9R4j3q7
4025f9R2%q9Q0K3j09P7L7j04O1M0r6M5P1j08L7O1q6j7J21q7j3R2q7pR7o9j9Q6
4054F0m9m6R7m8o8J02l2p9R8j2q8R7j5r0J09Jj05Q2L1j01N8L5r3N1O1j02M1O3
4082E8j00K4Q7q9pQ4q0j4J06q1k9J05o7m4J05m5o5J00l6p3R5j6p0Q4j3q4R4Nj10
4111g6Q1K8r3O5M9j16N8N7r9L1R1j13K3P6j00J0J00r4j1J04q8l1J10o9m7J15n9
$$ plain form
4138 2 -69 51 11 -61 45 9 -72 40 36 -74 21 40 -61 10 45 -66 0 53 -61 -21 63 -52 -10 63 -38 -15 71
4165 71 -24 -35 76 -14 -38 72 -12 -42 70 -4 -54 58 8 -64 46 4 -75 45 28 -65 27 28 -72 15 47 -59 11
4192 11 53 -105 17 68 -96 0 69 -63 -29 99 -30 -86 76 4 10 117 -17 -28 91 -4 -49 64 2 -43 72
4217 72 5 -58 69 23 -73 40 23 -75 31 22 -99 23 45 -83 13 30 -66 4 49 -84 -12 78 -48 -24 65 -47
4243 -47 -14 77 -34 -39 83 -23 -55 71 -4 -36 71 -14 -76 69 13 -71 56 22 -64 40 10 -81 32 33 -73 16
4269 16 28 -74 18 48 -77 11 75 -65 -8 61 -56 -21 57 -66 -34 82 -27 -40 78 -28 -36 83 -23 -63 80
4294 80 2 -45 66 -2 -62 59 22 -71 55 27 -75 30 33 -76 40 52 -88 9 52 -72 6 58 -61 -4 56 -79
4320 -79 -21 79 -45 -37 74 -32 -23 79 -35 -41 73 -11 -54 66 -7 -58 72 0 -76 57 26 -75 47 34 -60 31
$$ packed form
4138Bp1J20m0p2J06l6q1J12mj10R5J9j01P1L5j11O6N3j14M0Q4j15M2P3j01K3Q6
4165G1r5j1J11r0k4J10q4l0J12p4n0J12n0p2J10m2p9J20j7r3R2Jj00Q7L2j06P0
4192A1M2j58J22N1j64R6O9j32L4J28j29n6J62p2OJ07j34j1J19r5m5J13o2m5J15
4217G2o7o3J27m6r6J13j7r8J06rj21J22K2j28R6J7r6P0M5j33P2R0j26K4Q9j12
4243d7L3R1j11nJ22j06l2J26p5l2J07q5o2J45n6q4J27l4q6J04l0r1J13Jj06Q9
4269A6J2j02R2L0j25Q8O4j40N7O9j17L5P8j23L2J16j09j3J18j06qJ19j06m0J43
4294H0p8m7J11o8o0J21l7r3J26k8j02J05Lj09J16J2j40R7M3j24P8N2j19N7O0j35
4320g9N8J00j24QJ11j06RJ02j14oJ14q4m3J20p3n1J30p2p6J33l1j01J22j3r4R1
$$ plain form
4346 31 29 -79 25 42 -82 13 45 -67 11 59 -71 -8 71 -58 -33 62 -50 -22 78 -40 -29 71 -34 -35 85
4371 85 -17 -52 74 1 -71 71 12 -69 56 10 -76 49 31 -88 29 37 -89 8 45 -78 11 52 -59 14 54 -81
4397 -81 -21 62 -67 -22 57 -57 -25 59 -41 -50 81 -32 -57 75 -19 -42 75 -10 -60 72 10 -68 57 18 -74 48
4423 48 26 -78 30 45 -92 20 43 -71 5 44 -86 -2 57 -75 -15 64 -55 -14 66 -53 -27 69 -35 -35 73
4448 73 -19 -36 72 -21 -67 77 -5 -69 61 6 -59 51 12 -69 47 16 -84 35 47 -73 24 45 -86 3 48 -80
4474 -80 -11 67 -64 -10 61 -65 -23 81 -59 -36 63 -32 -26 86 -23 -47 86 -12 -70 64 -1 -56 61 -5 -77 54
4500 54 20 -84 39 15 -80 42 29 -91 39 52 -96 5 48 -72 -3 59 -72 -4 70 -77 -44 76 -47 -18
4524 -18 76 -56 -39 83 -15 -55 77 -17 -50 76 -10 -63 88 14 -85 55 14 -68 54 24 -75 53 36 -91 5 36
$$ packed form
4346C1kj08J04J7j24R5L2j12P8M8j30O3P9j29K5R5j12K8J00j18J1J00j05jJ20
4371H5j02l5J26p3p2J42n9q1J25m6q6J25j8j19J17Qj26R7L7j23Q9M1j11P3M0j35
4397h1O0Q3j29M5P9j14L2Q4j00rJ31j13k5J32r4k3J17q5n0J32o2p8J25l9r2J22
4423D8k2j04J08J5j37J12K3j14P6L9j30Q4N9j32O0P9j19M1Q0j19K6R6j04%J08
4448G3r2j7J08r3m6J44q2o4J30n5o5J10l9q1J16l1j00J19J2j20R7K1j31Q9M5j28
4474h0O9P8j31N4P1j26M2J04j40K3R9r5OJ12j09k4J33r8n8J34o5n5J17o6p2J31
4500E4l4j04J23k4r5J22j3j20J30J3j48J01M3j20O9O2j31O8P4j47L3J20j23K9
4524a8R4j32J7J22r8m0J32r4l3J26q6n3J51p4r9J40m1q2J22l0r9J28j7j27R6L1
$$ plain form
4550 36 -73 22 36 -95 2 62 -74 -16 48 -68 -14 63 -72 -33 79 -42 -43 74 -34 -36 73 -28 -49 90 3
4575 3 -67 73 6 -54 70 10 -79 64 30 -74 39 31 -82 30 30 -85 20 50 -88 -8 50 -82 -4 74 -78 -24
4601 -24 76 -56 -40 72 -47 -31 81 -50 -53 87 -13 -49 76 -4 -62 79 -3 -75 70 25 -63 55 14 -72 57
4626 57 43 -91 36 52 -83 19 53 -86 10 55 -88 -7 67 -61 -22 71 -59 -22 82 -43 -36 86 -35 -53 75
4651 75 -28 -56 82 -1 -76 65 8 -83 66 9 -61 60 23 -91 55 42 -83 30 42 -82 26 50 -91 0
4675 0 60 -74 -18 70 -70 -21 67 -62 -23 86 -61 -43 84 -28 -45 90 -32 -59 84 -12 -65 73 6 -79 65
4700 65 14 -72 67 23 -87 53 39 -80 30 49 -87 28 50 -92 14 66 -77 -7 69 -73 -19 64 -68 -34
4724 -34 79 -52 -51 82 -26 -43 86 -26 -59 86 -8 -60 66 8 -68 67 10 -84 57 37 -81 36 43 -75 35
$$ packed form
4550C6j09R5J4j31R7O0j36N8O4j16N4P7j35L9J12j21jJ17j08kJ09j01k1J39q7
4575Cp0J40o7o0J24o0q9J43l4j04J13qj13J12%j15J05L0j38Q0N8j32P8P8j52N4
4601b4J00j32J6J12j19J6J12j31lJ40j00l6J25q0n8J41q2p2J45m5q8J18m1q6J29
4626E7j4j34J27J6j35J02L4j39R6M5j43Q1P4j28L9R3j30L7J04j25PJ22j21j8J28
4651G5j03k8J38q3p5J41n7r1J49n7p0J21l7j14J46j3j25J13J2j24J08K4j41R1
4675@O0j34N6Q8j40M9Q8j29L9J09j47J8J27j12j7J35j22k7J43r6n3J38o7q5J44
4700F5n1q6J39m4j10J40j4j19J10J9j36J15K2j42J06N2j43P0P6j42N4Q3j32L4
4724c4J13j31JJ33j08j7J29j12l3J45r4n2J26n8p6J35n7r4J41k0j18J17Pj18J10
$$ plain form
4749 35 29 -93 26 63 -83 -2 72 -73 -3 67 -79 -22 91 -50 -38 79 -40 -36 76 -51 -55 94 -25 -66 79
4774 79 -11 -60 83 -2 -79 79 30 -77 45 30 -83 46 37 -94 41 57 -89 9 49 -74 12 64 -84 0 89
4799 89 -63 -22 81 -42 -18 77 -49 -38 102 -20 -52 72 -20 -42 86 -20 -71 86 17 -81 55 22 -68 55
4823 55 23 -89 49 59 -91 34 46 -78 27 57 -91 5 75 -72 -19 57 -49 -12 74 -63 -30 88 -39 -46 74
4848 74 -29 -28 82 -27 -63 88 3 -63 74 18 -66 66 14 -80 65 45 -70 29 44 -79 39 46 -82 32 73
4873 73 -85 -1 60 -70 6 75 -74 -20 96 -54 -35 73 -47 -38 84 -28 -46 92 0 -49 80 4 -52 89 3
4898 3 -69 80 24 -64 51 38 -76 47 51 -89 32 54 -78 7 57 -67 5 65 -81 -20 77 -58 -23 79 -54
4923 -54 -27 79 -46 -45 84 -15 -53 76 -12 -58 86 -9 -62 75 26 -77 68 27 -68 54 37 -81 48 43 -69
$$ packed form
4749C5oj22J19L7j46Q1P4j45P0P0j46N7J13j41J2J17j19MJ12j27mJ49j19m1J45
4774G9r0m9J43q5p7J58m9j07J22j5j13J29rj31J35J6j46R8M0j23Q6N2j48Q4Q9
4799H9j52M1J03j23K4R5j26J1J40j22l2J24r2k2J28j06n1J57o9r8J36l3r0J23
4823E5l2j12J38J0j50J25J2j24J05L0j48R6P0j47N3P6j06L7Q6j37L3J18j27pJ20
4848G4j03JJ10j09l6J51q5o6J37n6q4J32n2r4J45k0j15R9J5j23J18Pj28J14M1
4873G3j58Q4O1j30P6O9j49N4J16j50J9J08j20RJ22j12j8J38r2m9J29p6n6J41q6
4898Cp2J49n6q8J15j3j14J23Mj40J21K2j32Q5N0j24P2O0j46O1R7j35L5J02j33
4923e4K7J06j25JJ29r9l8J29q8m6J44r5n3J37m9j03J45m1r5J22j7j18J29nj12
$$ plain form
4948 -69 35 53 -69 24 69 -75 6 65 -62 -15 75 -65 -24 86 -59 -37 89 -40 -42 81 -19 -45 83 -10 -69
4973 -69 75 -2 -59 67 14 -74 62 28 -78 59 45 -75 49 47 -71 34 49 -71 13 57 -83 -7 80 -78 -13
4998 -13 75 -59 -23 75 -48 -37 97 -32 -46 89 -15 -48 94 3 -62 70 5 -76 64 15 -61 70 25 -75 55
5023 55 54 -66 31 43 -64 26 52 -73 18 79 -69 -3 80 -65 -18 72 -70 -31 92 -52 -36 78 -28 -34 78 -35
5049 -35 -52 84 -9 -64 67 9 -50 76 13 -67 57 38 -72 32 39 -59 43 48 -92 20 66 -72 4 72 -55 3
5075 3 62 -73 -15 86 -64 -35 62 -38 -38 71 -42 -53 89 -22 -73 68 -1 -42 74 9 -70 73 28 -71 46
5100 46 33 -55 66 42 -74 42 55 -74 9 61 -64 14 51 -76 -8 76 -58 -26 55 -50 -18 70 -61 -42 86
5125 86 -34 -70 67 -16 -41 68 -18 -71 66 18 -72 49 26 -60 62 19 -73 41 51 -78 14 42 -59 24 55 -75
$$ packed form
4948f9J04J8j22R3M5j44Q1N9j27M7R0j40M1J10j45K2J26j29kJ23j00k6J28r3n9
4973f9J44p7n7J26n3q8J36l4j06J37j4j20J24kj18J05J5j20Q4M4j40P6Q7j58O5
4998a3Q8j34L6R8j23J1J34j29j4J35j04l3J42r1o5J32o5q1J40m9p6J31m5j00J30
5023E5jj20R7J2j07R0K6j25R1O1j48O6Q3j45M7R0j42L9J23j44J6J14j06oJ12j13
5049c5j7J36r3n5J31n8n9J26o3q0J24j9j10J04Pr8J02Nj40J12M6j38P6O8j27N8
5075CN9j35N8J01j50K9R7j00%J09j13j1J42j11n1J41o9m1J16o5p9J43m5r9J17
5100D6j3q8J21k4j16J16J3j29Q3N2j25P8L7j27O8Q4j34L2Q1j05L2Q8j31J9J28
5125H6j20l6J37q3k5J09q6n3J37m8r0J21k3q6J22m3r2J14J0j29R2K8j01Q3L1j30
$$ plain form
5151 -75 -4 65 -62 -14 65 -61 -13 56 -64 -44 71 -48 -41 68 -29 -41 77 -36 -59 73 -3 -62 53 0 -60 65
5177 65 26 -73 57 46 -61 44 38 -52 46 44 -73 25 61 -61 -5 58 -62 -3 57 -59 -18 76 -46 -33 53 -35 -40 64
5205 64 -40 -60 66 -10 -53 59 -5 -61 58 -5 -76 57 39 -72 44 24 -61 40 36 -62 29 52 -61 14 60 -61
5231 -61 11 63 -54 -2 75 -51 -18 61 -42 -28 75 -42 -47 62 -22 -44 70 -12 -65 65 2 -64 61 21 -61 58
5257 58 16 -69 52 22 -68 41 38 -55 23 45 -60 22 57 -54 -1 62 -50 -11 69 -55 -27 69 -36 -32 65 -36 -44 64
5285 64 -29 -57 59 -7 -46 53 -3 -70 64 15 -61 52 16 -62 46 32 -65 48 54 -63 26 53 -61 13 60 -56 2
5312 2 50 -61 -15 62 -48 -20 67 -47 -27 79 -18 -34 58 -28 -48 62 -10 -48 75 15 -56 55 10 -54 56 30 -66
5339 -66 42 41 -63 22 44 -49 17 37 -62 10 70 -47 -7 58 -53 -17 52 -61 -29 65 -33 -39 52 -22 -35 70 -23 -43
$$ packed form
5151g5P1O9j27M8P9j26M8O9j20K0J15j19PJ09r7j2J18j13k3J32p6n9J15n3o0J25
5177F5l9r9J30j1j07J05or0R8kj17R8L6j22N6O3j20N9O0j16M1R4j22J3Q6q8nJ04
5205F4j04k0J26p6m3J12o4n6J19o3p1J33j8j11J16k0q5J01mr8R1K3j13P5M6j21
5231f1P2N2j17N2P7j26L3P9j03J4J03j17nJ09q4k2J14q2n3J30o3o6J25m0q2J19
5257E8m2q5J21l0r0J09lr3P8K2j05Q2L5j11N3O3j12L9Q0j24K8R6j05MR7j01qJ08
5285F4r3k8J16o6l9R9n6o7J34m9p6J13l6p8J08j4r7J13Oj17Q9K7j14P4M7j16N8
5312BM8j11M6P7j10K8Q7j14K0J06r7j6R2q6k0J10p2l8J23o0p1J11m5o4J10k6r6
5339f6J08jj04Q5K2r3O6K0r9P2O0j17M0O5j11L6O9j13L2R4r8oR1p4j3J05r3k0
$$ plain form
5367 -43 76 3 -45 53 14 -49 54 15 -56 53 36 -57 29 37 -47 28 32 -73 19 69 -58 -7 57 -50 -8 60 -59 -14
5395 -14 67 -35 -30 49 -33 -22 55 -38 -57 65 -6 -58 48 -6 -43 51 0 -58 66 40 -67 34 31 -51 46 40 -73 39
5423 39 50 -67 9 42 -45 15 52 -74 -30 65 -45 -16 51 -40 -26 60 -51 -37 71 -18 -58 49 -18 -46 54 -17 -60
5450 -60 54 21 -55 41 27 -49 45 30 -71 30 52 -64 20 46 -56 21 46 -61 1 62 -47 -11 38 -49 -15 58 -53
5477 -53 -44 72 -33 -45 58 -21 -46 49 -23 -68 50 0 -54 36 10 -59 43 19 -63 43 28 -62 25 34 -43 31 53 -61
5505 -61 11 55 -46 -1 57 -36 -9 56 -54 -30 56 -48 -31 51 -31 -33 55 -24 -62 56 -3 -54 36 -5 -53 57 6 -65
5533 -65 42 14 -61 39 35 -57 41 34 -57 24 50 -56 5 56 -46 5 51 -43 -3 59 -48 -28 53 -40 -38 55 -27 -40 64
5562 64 -24 -48 66 -10 -57 53 -9 -65 61 11 -51 51 34 -59 38 45 -47 44 40 -63 20 51 -62 -4 51 -43 5 59
$$ packed form
5367d3J19p3m8R8l9o3J03l9p1J09j7r3Q6Qq4P5Mj05R2N0j27N1O4j07M2O8j19M5
5395a4Q1j02NP9q2J1P7r3j9J22p1n2J06n4l7R4n1n8J24k6j07J01lq2R7oj13J12
5423C9J1j17P6L3q7O0L7j26M4R5j10K9O7r1J4Q6j11J4J08q9m0J07o7k8J00p1m3
5450f0J14l3p6R6j4p6R4j5j01J01K2j16Q4K6j02P7K5j07O2O1j09L6M9q7L4P3j11
5477e3RJ16j05j2J03p9k5R5p2m5J18n0n4R0k6o9J02k4q2J06j5r0Q7Rp7P4K2j14
5505f1P2M4j01M5N8r3K7O5j10K4Q6j04J7Q2q2kQ8p9l8J18n9n1R0m1m8J10n1p1
5533f5J07k8p5J00mr2R8pr1Q1K6j06O1N1j02N1M6r4M0O2j07K0Q1r3KR3q2j3J04
5562F4q8k4J14p6m7J10o2n6J26n0o2J02j7r3R7Pr2R1mj03Q3L1j13N8N5r4M8N4
$$ plain form
5590 59 -51 -9 67 -47 -18 58 -23 -31 57 -31 -41 62 -18 -51 49 -3 -50 59 5 -75 50 13 -60 38 17 -57 45
5617 45 34 -56 40 48 -58 17 52 -52 9 54 -58 9 65 -45 -16 56 -29 -12 52 -45 -31 46 -19 -44 50 -17 -38 51 -14
5646 -14 -51 58 1 -52 43 7 -56 46 29 -58 37 44 -60 20 40 -47 27 41 -52 9 63 -48 -17 51 -40 -10 49 -55
5674 -55 -21 64 -34 -31 45 -22 -34 51 -23 -57 56 -4 -63 43 6 -45 40 6 -69 34 33 -53 20 19 -35 33 31 -57 14 62 -41
5705 -41 -6 46 -36 3 46 -45 -4 64 -23 -29 44 -23 -18 47 -42 -56 61 -8 -51 31 -11 -41 55 -3 -56 45 25 -52 29 31 -44
5736 -44 39 33 -67 26 55 -38 15 42 -45 13 54 -49 -1 64 -30 -7 47 -29 -10 54 -38 -35 59 -13 -34 34 -19 -48 51 -10
5766 -10 -50 42 6 -46 37 8 -44 40 11 -59 34 39 -49 23 36 -38 25 48 -48 3 51 -46 -7 48 -33 -8 50 -43 -22 61 -21
5797 -21 -23 44 -18 -35 43 -9 -47 43 -1 -47 35 9 -42 41 4 -59 31 33 -52 30 22 -38 27 40 -37 16 44 -34 3 46 -30 13
$$ packed form
5590E9j10M2P6j14K9P6q1qQ8q8j0J03q0l3J00n2m7J09n4q0J25l7p3R8k1p4J02
5617D5j1r0R6Qj06P5L5j04O1M5j12O7N6j10K9P2q5J7O4r7J4P7o5k5R4o7k1Q9o5
5646a4l7J09n7n3R5l6o3J02j7q7R5Pj04Q0K0q7P4J4r3O1N4j11L1O8r1L0N9j04
5674e5L4Q5r8LP6o7j2Q5p4l4J13o0n9J06l7n1Q5l4p5J03jq6P3jn4O8kq8P1M8j03
5705d1L5N2q2L9M3r1M1O8q7oP3o7NO5q9j4J17o9m3Q2m2l0R6n8n3J01k0p7Q1Kp5
5736d4Q3oj00R3K9r3N3K7q7N8M1j03M8O5r4K3N4p6J9O4r2LR4p2k1O8n3k9R9o1
5766a0m0R2l6n2Q3k9n2Q4k9p0R3Nq8P2J3p4O3K3r6N1M8r7L9N5q1K5N8r3K1Q3q2
5797b1kO7o2j7P8n2l8R0m4m6Q2k6n1Q3l7o3R0Kq5Q2qo0O5J3p7N3K8p8L7M3p6M3
$$ plain form
5829 13 58 -38 -16 45 -18 -13 51 -19 -22 55 -18 -33 45 -7 -44 47 1 -37 41 8 -36 37 12 -54 25 26 -47 26 32 -43 22 40
5861 40 -33 9 54 -31 13 51 -30 -8 50 -27 -2 53 -25 -21 52 -22 -42 51 -24 -41 38 -10 -37 40 -4 -36 29 7 -47 41 15
5892 15 -47 27 27 -47 24 32 -49 12 39 -48 -3 50 -32 10 49 -28 -6 55 -22 -11 44 -16 -9 43 -20 -35 49 -10 -44 40 -2 -32
5924 -32 36 -4 -58 39 13 -52 27 18 -33 32 29 -56 22 33 -31 8 42 -34 19 45 -38 -3 45 -28 -14 55 -17 -14 48 -27 -21 48
5956 48 -13 -34 27 -15 -31 35 -11 -41 37 5 -47 22 9 -28 31 13 -38 22 21 -40 25 36 -40 19 43 -38 11 44 -33 -11 44
5987 44 -20 -2 52 -29 -22 43 -26 -18 36 -18 -24 40 -18 -42 37 -1 -40 27 0 -35 29 23 -47 21 15 -34 16 12 -36 10 26 -44 11
6020 11 40 -35 -4 34 -20 7 39 -45 -9 51 -16 -18 32 -17 -22 27 -17 -31 27 -5 -44 22 -1 -42 29 -1 -47 26 26 -46 25 5
6052 5 -41 17 32 -61 3 36 -30 18 10 -48 13 45 -34 6 40 -12 -13 44 3 -13 28 -19 -44 41 2 -51 23 -11 -39 25 -13 -64
$$ packed form
5829A3M5r6K2O1o3NO4p0lP7p3j5P8n2l7R1m6l8P8l3m4P3k5o6P9Jp3P3Op5O5J8
5861D0p3M2M5q5M4L8q1K2N8p7K5N5p8MP3p4k0R3p5j7P9m8k7P7m4l2O5k2n4Q8k6
5892A5o2P4%p4P1Qq1O1K7q7M5N3q2M2L9p7K2O1p7J1N5o0PN2o3j5Q4n9l4Q4m2l0
5924c2O8m0n4R7k6o5P9rn1O5lq5P8J1o4L9L4p6N3K6q3L5M8p3J4O9p2LO2p5OO9
5956D8o1k1O1m2j6O6m6l0P8l2n2O9j3l7N9j8n1O0jo1O5J1p6N9K4q1M9L3p7K2N5
5987D4o4J8N4q1PO5o9QN4n4oO4n8k4P9l8l9O7k7l5O4op0O8om9N0mm8M6J6p0N5
6020A1K9p5L1L8n4K7L2q4L6O0o7kN0m9nM9m4j4N8l2l9O6k3m1P1l0m6P3%p2P1k0
6052Em6N8J5r3O4L3o6M8qn8O1L2p9M0L4n2jN7m1j6M1m7k5Q5l9n3P4l4k8O4l8n1
$$ plain form
6084 -64 51 10 -40 -13 9 -39 17 7 -66 7 26 -44 -1 25 -38 -1 19 -31 -19 43 -36 0 41 -17 5 59 -42 -24 35
6113 35 -34 -33 29 -27 -22 50 0 -50 21 10 -36 22 -8 -40 14 8 -55 0 24 -37 -4 19 -38 7 32 -24 8 31 -16 -3 38 -26
6145 -26 7 40 -22 -4 30 -27 -45 32 -10 -27 16 -13 -33 25 -1 -44 24 -7 -40 15 0 -33 11 2 -39 8 15 -46 1 19 -33
6176 -33 9 20 -33 -2 31 -27 -16 33 -17 -8 45 -21 -20 30 -23 -27 36 -10 -33 30 -2 -42 20 -1 -35 14 2 -40 18 6 -40 20
6208 20 11 -41 2 14 -31 8 17 -45 6 28 -34 -5 27 -22 8 28 -34 -14 42 -12 -15 39 -11 -11 29 -14 -37 37 -4 -28 17 -2
6240 -2 -22 22 -13 -36 8 5 -36 2 16 -30 10 16 -33 1 24 -37 -11 22 -27 -2 21 -22 -11 38 -19 -17 29 -14 0 29 -14 -17 37
6273 37 -5 -27 17 -3 -21 22 -16 -41 19 -4 -45 7 -4 -38 22 4 -38 -5 23 -34 -12 21 -33 -1 30 -26 -9 39 -19 -9
6303 -9 28 -13 -6 30 -22 -11 35 7 -18 32 -12 -20 21 5 -27 23 3 -27 9 19 -33 0 -3 -36 36 16 -25 -25 -15 -44 -27 12 -26
$$ packed form
6084f4J15m1n0K7K2m8N6j0p3P3J9p0M3K6o3L7K0n0J2O2p9L6M1n8K2N4j01J8N9
6113C5o9JO2n6NP2n0n0P1j1m6N8l0l2N4oo3N5K4o1L3K3n7M5K5n6L2K3m7J3M1o4
6145b6L3L3o2J8L4n7j8P7m2j7M3k9k0N8k6m3O8l1l3N5j5l3M4rm1M7Po1M7J8n2
6176c3M2J1n3L1L3n8J1M9n0RN3o6JN0n3mO3m6k3O3l2m0O2k1l4M9j2m2N8j2m6O0
6208B0rn2M3J2m5L9Ro2N1K2o2K9L2m9L0K0o2K0N6n4lN4n0%M0m3k3P4m1k4M5j9
6240bk0M4l5k3M4lm1L8J4m6M0Om9L4K3o1K6L3m9K5K3m3J1M9n7KM6m3J4K9m3lN4
6273C7m2k2M4k0j8M3l8k5O0k3m1N2j1l4O0j8m2L3K8n7K2L3n4L2L1n6J7M8n8J0
6303iL7m1PL6n2J1M6k8k5N0m4qM1j6l2N0k0l0L6J0n2L3ll3P2k0m1%J0k9J7L9l8
$$ plain form
6336 -26 -15 53 -31 -1 21 -29 -14 20 -18 -24 51 -10 -15 5 27 -38 18 11 -43 36 3 -42 47 1 -4 33 -41 -89 -23 -8 -13 -22 -73
6369 -73 -45 -28 26 -65 47 19 -19 33 23 30 -12 -8 -27 36 78 -5 -13 58 19 15 37 -11 -30 -18 -6 -15 43 2 -39 0 -4 -56 28
6402 28 -17 -67 26 -17 -25 -5 -7 -40 -4 41 -28 3 1 -26 -24 39 -27 -26 21 -18 0 28 -24 -21 4 -6 -36 25 -11 -15 23 20 -33 18
6436 18 17 -19 20 -4 -41 26 7 -45 -1 -20 -59 4 35 -28 3 3 -60 -10 35 -30 -28 10 -16 8 0 -24 -21 41 -14 -4 54 -2 -62
6469 -62 -4 18 -38 11 -3 -5 52 7 -36 -38 59 -43 -27 36 -3 -42 16 -51 24 -28 -71 -6 -50 -42 -30 -9 -70 0 106 11 -2
6500 -2 -19 4 1 29 13 1 -42 -35 -36 32 31 16 -19 31 -55 43 -26 48 11 -6 92 -30 73 -52 0 -10 11 -70 -80 -56 13
6531 13 71 -60 8 66 -14 10 -13 -25 -11 -47 26 37 -38 34 -18 47 -15 -44 -12 82 6 28 38 -26 45 85 -17 -14 -10 -37
6561 -37 -9 37 2 -11 -1 -41 -3 33 -57 4 18 14 -9 15 -28 -14 5 -33 4 25 -5 -7 19 -3 -6 25 9 -25 25 -1 -17 19
$$ packed form
6336b6J1O8q4L0K2n0J5L4l8oP5o1nK0K2o5N6pn4P9l3m5Q9m6nL7p4m8O6J5nrn1
6369g3K8J7N4r1J12k8l8N2j0Pm2Mj9O3M2q3qP1l9mK2m8j9J2J2rN8m1m1L9mn2Q4
6402B8m5n0R3m3qK0kl3L6M5o9L1kk7KO3o6JM7l9J8K8n2LK5j0l0O1l6mL8ln3N1
6436A8jl6L9k4l7O7j9n2M4j9l9O3L1o3L1%o3N0M5o5KL8k6K4qk4LO2n5J0N8n6o0
6469f2N8K2n6M9j4kN7m5m3kR7j02J6O3l9l9N8o7P5n2m3O5m4QJ2K1o1P0J06r5j3
6500bj7K3lK8j6j2m3PjO8jj5l5N0q6R8o9P4l7j7R8j22J03j25N2j0K1q1j0K4O9
6531A3N8j31O8N8q0K4k3j2J4l6P3J1p5P2n2O5o2k9L2R4p6K2J0o4P1M0j02LMk7
6561c7K8M6l5j3J0m0L8L6r0O1J4mk3K4m3J4J9l8L7K1l0kK6k2lL1j6l4N0k6j6L6
$$ plain form
6593 19 12 -4 10 9 -28 11 21 -38 -12 1 -25 -6 16 -26 -7 18 -28 -10 12 -11 -9 17 -19 -16 23 -5 -14 16 -10 -4 25 2 -23
6626 -23 10 10 -14 12 20 -28 21 18 -27 22 20 -12 8 9 -24 8 16 -24 -14 9 -24 -12 7 -23 -20 8 -20 -10 9 -11 -24 16 -12 -20
6660 -20 14 -3 -25 15 9 -12 17 0 -17 17 11 -27 9 14 -22 9 1 -10 9 24 -26 7 28 -17 -10 18 -24 -1 16 -20 -23 22 -19
6693 -19 -26 9 -18 -27 19 -10 -27 7 -12 -20 10 2 -18 20 -8 -19 -2 13 -24 5 8 -23 8 25 -15 -1 19 -22 -13 6 -18 -12 18 -18
6727 -18 -6 8 -17 -15 13 -22 -15 17 -25 -24 4 -2 -23 18 -2 -21 18 4 -11 16 16 -6 19 7 -26 9 11 -16 8 23 -25 0 15
6760 15 -26 -13 7 -22 -11 8 -30 -15 13 -24 -28 12 -6 -25 13 -12 -27 20 -17 -24 14 3 -22 19 -7 -24 17 1 -29 9 14 -15
6792 -15 12 16 -22 -7 22 -7 -4 18 -14 -8 18 -31 -14 12 -26 -28 10 -25 -20 10 -23 -25 12 -5 -31 7 -2 -19 5 -4 -23 12 7 -31 14
6827 14 6 -19 6 14 -34 -4 21 -23 -6 14 -15 -5 24 -15 -2 13 -18 -7 16 -17 -15 0 -18 -28 22 -12 -31 12 -4 -24 20 -1
$$ packed form
6593A9pj6J4jl7L9J0n9K6J3k6J9K2m2J9K5m6J8K2k3KK6l6LL9k8rL0k6OK9k3k5
6626b3L3%k4K6Qm8M9lm5M9kl2K0Jl3L2Qm0J0K3l3J2J9l0LK8k8J0J9k0j3M0k8q
6660b0L4j7k2M0ok1K9j7j7L4ol8L6Nl6L1qj1J9J5n0L3K1m5PK8m2K3J7l6lM5m1
6693a9pL5k7rM6k9j7L4j9qL0qk0L8k8j1J7J5l7K9Ll1L1J7m0J4K0m1RJ9k4OL0l6
6727a8J2J4k5KK8l5PL2m2JK8ok1M1k0j9L9j4j5K7%k2K5j2l3L5Kk7K4J5m8K5J5
6760A5m1J3K0k9J1J9l8J5K8l7mM0j8j9L8k5j5M7l7pL8j1k5M1k6j7M1j6l0L8Nk9
6792a5K7Ml8J5K9k9LK2l2OK6m9J7K6l8kL8l5NL0l3kL7j7k6L8rj7K4rj9L5nl8M5
6827A4qk5K5Qm8L0K5m4J7K0k9J0K9l9J3J5l1J1K3l3KJ5j8j0N0l4j9M3j6k0M4k1
$$ plain form
6859 -1 -37 0 12 -34 7 6 -19 16 15 -22 9 19 -23 2 20 -23 -2 17 -29 0 12 -10 -20 12 -17 -17 12 -20 -24 6 -25 -27 12
6892 12 -14 -24 1 -14 -34 10 1 -38 5 0 -27 10 6 -28 8 7 -15 1 11 -19 6 16 -21 -2 21 -15 -7 10 -26 -4 19 -17 -28
6925 -28 20 -11 -21 8 -18 -21 4 -13 -32 -1 -13 -35 10 -6 -17 12 2 -32 -5 22 -26 -2 13 -24 14 23 -20 3 26 -17 3
6956 3 18 -15 -7 12 -11 -18 20 -11 -20 13 -33 -27 13 -19 -36 1 -5 -38 11 -6 -28 16 -2 -43 14 16 -23 12 10 -32 4 14 -20 9
6990 9 25 -14 8 27 -10 1 31 -7 -3 23 -7 -5 21 -14 -9 21 -4 -20 12 -20 -31 12 -22 -24 6 -6 -27 6 -2 -30 17 10 -14 14
7024 14 20 -19 8 19 -22 13 20 -26 8 28 -16 -7 24 -18 -6 23 -7 -25 22 -4 -18 20 -10 -17 20 -5 -25 14 -8 -16 -6 0 -28
7057 -28 12 4 -23 6 22 -28 9 14 -30 11 27 -19 14 26 -21 0 31 -12 6 18 -15 -15 15 -8 -13 32 -11 -12 22 -6 -24 19 -3
7090 -3 -30 12 -6 -29 22 7 -31 6 -1 -33 10 4 -30 5 21 -25 -2 18 -17 10 25 -15 -1 31 -10 -6 25 -10 -10 17 -9 -32 26
$$ packed form
6859al6L7J2m6M1jk5L5jl7L1J0m2K5J8m3K1J9m6K9J2k2j0L2k9%K9l2mL0l1kL9
6892A2k6j0K5j5k0M4rl9M3nk7L7ml4L6jk2J6J0l0K5J0l7J9K3l6QJ7l6K2K3l6j1
6925b8M8l1j0K9k6lK5j7j9L1j2k2M5j6j1K9j0l4K7K7m8K4J5l7L8Rm3K3K3m3K0
6956CJ5l3QJ9k3pL8l1rL3m6OM0l2j7L7ol3M9j7k2M4j8m1N7Kl9L5km2L6J0l4K9
6990IJ6l9K2J9l7J1L0l8MK6l0KK6l5NL0k5j6L2l2j1M3l4kL0j2k1L3qk8M7pk4K8
7024A4Ol9K7J1m1L5Pm6L4K0m4RL1m2J2K9l0j8M7k6j4L8l0pL7k5k0L9k2qJ0Ok8
7057b8M0qk7K9J6n0L7Nm4M1J6m6L3J2m7K1L1m3J8J2l3%L0k3nM5m3jL4k8j8M3k2
7090ck7M2j8k3N1j5l8L7pl2M3ol4L5J6m6K3K0l5K7J5m0J4L2m1ML1l5%K7k6k3N8
$$ plain form
7123 26 -8 -28 12 -9 -32 21 2 -30 18 0 -36 3 11 -26 10 10 -31 3 22 -22 1 12 -23 7 25 -11 3 28 -17 -7 28
7154 28 -15 9 32 -6 -15 30 0 -17 29 4 -11 18 -11 -25 16 -6 -26 9 3 -21 15 3 -37 8 5 -27 13 12 -29 1 13 -35
7186 -35 -1 30 -17 -8 20 -13 11 44 -17 -3 36 7 -7 22 -12 -8 37 2 -23 26 3 -36 15 6 -22 9 7 -35 7 5 -27 3 13
7219 13 -26 9 12 -26 1 33 -20 -1 23 -30 1 28 -21 -1 30 -16 -12 28 -18 -11 32 -5 -19 28 3 -12 22 -6 -28 22 6 -35
7251 -35 20 9 -22 11 8 -33 7 17 -35 3 21 -24 0 14 -32 -1 28 -15 -3 32 -8 -1 32 -12 -7 43 -11 -21 28 3 -19 29
7283 29 -6 -28 28 -2 -34 19 6 -26 9 10 -35 10 8 -38 -3 13 -27 0 18 -24 0 30 -17 -10 30 -13 -6 33 -21 -16 34 0 -5
7316 -5 40 -5 -5 28 4 -22 30 1 -32 21 17 -24 19 5 -25 22 9 -28 20 17 -35 13 8 -22 6 27 -22 3 37 -9 -8 33 -20
7349 -20 -7 38 -20 -5 32 -2 -11 31 1 -14 33 10 -9 32 12 -25 23 8 -29 9 4 -28 9 4 -25 8 15 -36 -1 21 -21 7
$$ packed form
7123B6l4k0M0k1k3N3j9l2M8j8l6L9Ql7L6%m1L4J9m4K3J1l5L0J8l6J4K5m5J0L5
7154B8m3K4K3l8rM5l0j7M6k5j5K9k9j4M1k2k0L5ok4L6j2m0M5ll2M0jm1L0J2m8
7186c5L4L1m7RK8l3K4L3o1J4L9k9j4K9l4MM5l5k5M9k3l9N1rk8L1km2M2kl2L0J0
7219A3l9L5Ll8K7L2n3J9K4n3L1K7m9K0L1m6MM0m6PM3l7j4M7k5j5L4k8k2N0j6m1
7251c5N5j1l1L3lm1M0J0n2L8J8m5K4J4m6L1K9m3J2L5m0PL3m4NN0n4j0M9k5k2M8
7283B9l5k2N6l0l2N3j3l2L5Jm5M5km6L5J6m0K7J8m2K4L0m7PM0m3PL9n4NN0l4n
7316eM5m5%L3k4k6N2k9l3N3mm1M3j4l0M7j3l7M8ln2M8nl0K8K1m9K5L4m6JM1n3
7349b0J3M5n8J5L7l4rM2l0j5M7k3j9M1k0l7M8j5l7L8nl2L7nk9L3Pn1L5K2m2K8
$$ plain form
7381 7 19 -23 2 31 -18 -2 36 -16 1 45 -3 0 41 -10 -19 32 -1 -20 19 9 -28 34 8 -25 14 0 -22 6 10 -28 3 18
7413 18 -31 1 12 -23 4 20 -38 5 31 -20 -6 28 -18 6 30 -9 -4 35 -4 -10 30 -9 -10 38 1 -30 26 -2 -28 28 -1 -22
7445 -22 24 11 -41 9 10 -28 6 4 -41 -2 13 -39 -14 16 -19 -15 18 -32 -14 17 -21 -4 40 -16 -3 32 -10 -6 41 -2 -17 34
7477 34 12 -11 30 -8 -20 26 9 -23 11 15 -31 7 9 -36 11 18 -36 -17 17 -21 11 25 -28 -1 25 -34 -13 22 -13 -9 37 -17
7509 -17 -10 34 -14 -14 37 5 -10 41 3 -11 29 20 -21 34 15 -25 23 1 -35 15 18 -41 -6 16 -41 -1 18 -38 0 14 -33 -11
7541 -11 29 -31 -1 30 -20 -10 51 -18 -17 44 1 -14 35 -4 -20 37 5 -26 35 14 -17 29 2 -21 32 18 -34 12 10 -24 10
7572 10 18 -33 -2 28 -29 -9 19 -25 -3 22 -26 -20 27 -21 -25 35 -2 -16 31 -5 -22 39 -8 -24 34 8 -21 38 5 -18 28 13
7604 13 -26 18 20 -24 16 25 -35 13 25 -31 -4 28 -43 -5 23 -27 -10 25 -37 -21 27 -15 -11 34 -16 -15 40 5 -18 27 9 -24
$$ packed form
7381GJ2m2K5K9m9J6L8n2J7M4m8LM1n1rN1l3j9L9j0l7O2k6l3L9j4k2K8Ml8L1J5
7413A8m9L2J1l5K7J6n8M3K6n1J4L4m6K4K4l9NL9l9oM0l9jM8l7l1N6k8k6N6k9k1
7445b2M6j3n2N0Jl8L4km5L9J5n2K5L0l5ML3n0J8L1l8J7M4n6J3L5m2MM7m3j5N1
7477C4k2k3M1l8j2M6j7l2L4Mm6L8Km5M7Pn4J9L4l8L2J4n3K7K6n9K1L5l5MM6n4
7509a7PM4m8%N1l2j5N1l8j4M0rm1N5j9m0M8k2l6N0Ln9L5K2n7M0J9n6L8J4m7K2
7541a1M0o0L0L1n0J0O1o9JO1m3j5M9l9j6N7l2l1O1k1l1M6k7k3N3j4n2M6kl4L4
7572A0Qn1L1L0n7K0K8m4K2K5m8OM7m8mO0l7j4M7l6j7O1m7j6N8k6k9N9l3k3M6j5
7604A3l9M4Km4M0Ro0M8J2n6K7L2p1L8K8n0J7L5o2J6M8m2MM5n0JN5l5k3M5j8l3
$$ plain form
7636 -24 29 -3 -29 41 15 -22 19 23 -31 20 15 -28 16 20 -36 -10 13 -40 2 22 -31 -6 24 -34 -15 29 -32 -23 19 -17 -21 29 -1
7669 -1 -24 32 -6 -32 64 -26 -21 1 -30 -16 26 11 4 24 15 -14 44 114 -56 19 23 -50 31 10 -45 -24 84 3 12 -4 -67 -11
7701 -11 98 -41 -16 55 -44 -26 56 32 -56 -11 16 -23 22 26 21 99 27 -105 41 -26 -80 7 10 -24 19 24 -45 6 34 -50
7731 -50 -11 11 -42 -10 17 -45 -27 24 -32 -22 30 -27 -21 38 -24 -26 27 -7 -32 30 -5 -20 41 7 -31 23 17 -26 15 6 -28 29
7763 29 16 -37 9 18 -26 3 17 -35 4 27 -43 -12 31 -27 -17 27 -36 -29 30 -31 -35 25 -17 -29 25 -11 -38 35 4 -34 27 14
7795 14 -29 22 3 -39 30 15 -30 10 17 -18 15 20 -38 7 38 -38 -9 29 -36 -13 28 -44 -19 39 -34 -30 26 -25 -24 23 -29 -20 39
7828 39 -12 -28 32 -6 -17 43 4 -33 43 19 -35 28 34 -21 17 18 -42 12 30 -43 2 19 -36 0 26 -42 -13 30 -36 -29 28 -22
7860 -22 -24 27 -36 -31 31 -15 -31 23 -9 -31 22 -5 -38 34 7 -32 24 6 -24 21 14 -52 25 25 -44 11 22 -39 4 35 -39 -7
$$ packed form
7636b4N3l2k6P0k6l7M1Mn4N1nm3M4Mn6K6K3n3M2K0n3K5L0n8J9M4o1RM2l6mN0l0
7669ak3N6l8k6R6r0NK2l1J4M2j5pK0rk9N8P0j70P5Mp3Q1k1n5K1J08q1Rj6o3N6
7701a1J09j39K5P1r9J8Q2k4q8M5K7l9M5MnP8p2j32J46o7n4Q7Ll4M3No9N1K8q4
7731e0L9K2n3L2K7o2J8N1n6J0N2n7ON9o2kN3l4k5O2l5j5O1l4l8N4om3M1rl4N7
7763B9j3n3M6Rm4K9J4n2L9K3p0L1M3n8J0M4o3PN9o1mO0m2j2N4l6k7P3l1l8O1j3
7795A4m3N1j9m2O9j5m5M0Pl5L3Nn8M5L1p6K9L8o5K3M1p2K5N8p3MN6n1JM7n2RN9
7828C9n1j6O0l8j1O0l9l7P6k4n4O3On5L8Jo0N4J8p3M5J7n5L6K6o8K9M3o6PN7n0
7860b2kN1o3NO2m6j6N4l2k2N3k7l3P2k7l9N6j8l0M5po6P7%o9N5J1o1M3L1p4L2
$$ plain form
7892 -7 37 -49 -21 28 -29 -24 33 -34 -27 40 -28 -44 31 -20 -32 40 -12 -37 37 3 -33 28 -2 -15 31 12 -34 22 18 -32 5 13 -39
7925 -39 0 23 -43 1 40 -40 -12 31 -40 -17 35 -37 -14 28 -34 -22 34 -31 -35 34 -16 -31 25 -25 -36 38 5 -25 28 14 -38
7956 -38 26 20 -42 17 24 -40 22 29 -37 15 26 -37 8 35 -44 -4 38 -29 -18 30 -42 -19 37 -47 -38 26 -23 -27 35 -17 -35 34 -5
7989 -5 -41 35 3 -37 29 8 -27 35 29 -42 27 29 -30 16 19 -31 25 32 -37 0 42 -31 -7 24 -49 -20 37 -33 -29 25 -21 -35 25
8022 25 -33 -23 36 -18 -48 30 -1 -42 29 3 -41 46 15 -52 23 34 -28 23 27 -36 34 32 -44 17 34 -34 -2 26 -41 -6 40
8053 40 -28 -22 25 -27 -29 22 -43 -25 45 -18 -37 37 -2 -37 25 -12 -35 45 10 -34 37 18 -30 28 16 -22 30 33 -45 17 49 -23
8085 -23 16 33 -35 8 43 -36 -18 37 -34 -21 34 -41 -23 30 -26 -36 31 -28 -39 37 -19 -43 47 -8 -49 33 8 -48 24 7
8115 7 -39 34 22 -39 10 25 -29 23 27 -36 18 45 -31 -5 40 -36 8 38 -42 -15 40 -23 -38 26 -30 -30 17 -34 -35 38 0 -30
$$ packed form
7892gM4q6K8M9n7NN7o7PO7o8j6P5n1j2P2n2k5P4l4l6O1l0j3M6j9m6N6mn0L7Qn2
7925c9L9K3o6M4L9q0K8M3p1K3N2p2K3M2o2J2N6o5mO9n0j5N6n0j1P4l3l0N3j4n2
7956c8O4oo2N9Po4O2Po6N2J1o3M5K7p9M0M2o7J1M8p2K3N6q4RO4m9mO2n2j8O9l9
7989el6P6l2m0O6k1l5O2op1O9Kn9M6Ln0N6Po9L7M2p3K4L1p3K9N7p0MN4m6j4O0
8022B5n8J0N9n4l0P8l1m1P1k6m4Q7l1o7P5J1o2N1Mo3P0kp6O1J7o8L2K8o7L5M6
8053D0o8OM7n2kN1o5J8P0o3j9P4l9l5O2l7k3Q0l5m4P1j9m8N8j2l8N2Lp8O2L2p2
8085b3L9J7o8M3L5p9J8N5p1J3N5p5J8N3n6j0O7n9j1P6n6k4R0n5m1Q2k5n6P2j7
8115Gm6P3j2o1M9J5n4N2Mo3N4K7p6K6M5p6M4L0q0K7N5o3j5O4n6%M7n1jP3l8l0
$$ plain form
8147 -30 23 -5 -35 29 1 -45 24 25 -32 29 26 -26 28 29 -32 21 41 -46 -6 30 -25 3 28 -36 -14 50 -34 -27 42 -24 -15 44 -22
8180 -22 -36 46 -21 -32 27 -11 -40 30 -3 -39 30
$$ packed form
8147c0N3k8l0O4k8m6O9Jn7O1ln2N4Jo1N3K0q7M0L6n5K8K5o4K2O4q4PO9o6RN9o6
8180b2j4Q2o7j1N9l8k9P0l3l6O9
8191C0
$$ Imaginary data points
##PAGE= N=2
##DATA TABLE= (X++(I..I)), XYDATA
$$ plain form
0 0 0 0 0 0 0 0 0 0 0 0 0 0 0 0 0 0 0 0 0 0 1 -8 8 -8 8 -8 8 -9 16 -16 16 -17 24 -24 26 -32 33 -40 42 -49 54 -58
42 -58 65 -73 81 -89 98 -107 118 -131 144 -158 175 -193 211 -234 263 -294 331 -373 427 -492 578
63 578 -692 852 -1093 1489 -2270 4302 -19788 -36123 35161 3200 -23555 15315 -2558 -11912
77 -11912 26047 -11373 -27050 30704 6329 -33624 18502 13417 -27039 13056 14266 -24051 10987
90 10987 10939 -26441 12996 18208 -30158 6552 29149 -23402 -9279 21265 -12150 -1548 17089
103 17089 -20276 -487 30244 -20339 -17220 30367 -4951 -18832 18539 -5141 -12848 22374
115 22374 -6031 -18986 22906 -815 -24608 18025 5820 -23080 14933 9970 -22196 9090
127 9090 8730 -20317 11284 11235 -24463 8228 19804 -21661 -1221 19499 -13900 -1800 14834
$$ packed form
0@%%%%%%%%%%%%%%%%%%%%JrJ6j6J6j6J6j7K5l2L2l3M1m8N0n8O5p3Q2r1J03j12
42e8J23j38J54j70J87k05K25k49K75l02L33l68M04m45M97n57O25p04Q00r19J070
63E78j270J544j945K582l759O572k4090j6335P1284l1961k6755L8870j7873r354
77a1912L7959l7420j5677N7754k4375l9953N2126n085m0456M0095J210l8317L5038
90A0987m8l7380L9437N212m8366L6710K2597n2551J4123L0544l3415J0602J8637
103A7089l7365J9789L0731n0583L119M7587l5318j3881L7371k3680p707L5222
115B2374k8405j2955M1892k3721k3793M2633j2205k8900L8013m963l2166L1286
127I090l60k9047L1601m9l5698L2691J1576m1465K0440K0720l3399J2100J6634
$$ plain form
140 14834 -16453 -492 21958 -15199 -8053 22384 -9952 -12317 18391 -6716 -10952 19356 -5172
153 -5172 -14366 18064 -2757 -16684 17715 1231 -19616 14495 6260 -18187 10755 7017 -16775
166 -16775 10045 6696 -20345 9009 13910 -18697 2991 14470 -16175 36 13684 -15286
178 -15286 -233 17005 -14253 -4860 17497 -10792 -7033 16969 -8515 -9186 16335 -5697 -9658
191 -9658 16711 -3702 -11986 16001 -2030 -15645 14900 3831 -15010 11337 4592 -15049 9427
204 9427 5149 -15989 8813 8492 -16619 5382 10565 -15520 3019 11970 -15099 39 13165
217 13165 -13508 -1497 15562 -11151 -4681 14813 -9605 -6987 14656 -6535 -6803 15167 -5859
230 -5859 -9950 15004 -3013 -12092 13843 104 -13168 11879 2610 -13190 10287 4285 -13810
$$ packed form
140A4834l1287J5961K2450l7157P146L0437l2336k365L0708k5107m236L0308k4528
153e172r194L2430k0821j3927L4399j6484k0847L4111q235k4447K8942l738k3792
166a6775K6820l349k7041K9354M901l2607K1688J1479l0645J6211J3648k8970
178a5286J5053J7238l1258R393K2357k8289L759K4002k5484o71K5521k2032l961
191i658K6369k0413q284K7987j8031j3615L0545j1069j8841K6347o745j9641K4476
204I427m278k1138K4802l21k5111K2001N183k6085J8539Q951k7069J5138J3126
217A3165k6673J2011J7059k6713O470J9494k4418K618K1643k1191k68K1970k1026
230e859m091K4954j8017r079K5935j3739j3272K5047r269j5800K3477o002j8095
$$ plain form
243 -13810 7916 5055 -14022 7896 8680 -14205 4441 9889 -13598 1610 10479 -12215 1139
256 1139 12623 -12135 -2725 13587 -9285 -4787 12498 -8376 -5753 13659 -6818 -8052 14149
269 14149 -3728 -10103 11663 -2716 -10363 12822 490 -11938 10801 2835 -12197 8562 3633
282 3633 -12200 8772 6377 -13666 5340 8925 -11356 2956 7738 -11760 2486 10038 -11787
295 -11787 -403 12013 -9217 -3082 10256 -9128 -3633 12817 -7204 -6701 12451 -4202 -7630
308 -7630 10720 -3720 -7987 12038 -1753 -10693 10512 1591 -9846 8996 1277 -11571 8892
321 8892 4415 -12679 6178 7326 -10575 3640 5788 -11290 3821 8959 -11097 444 9894
334 9894 -8614 -701 9117 -9014 -1503 11595 -8023 -5475 11365 -4051 -5229 9830 -4875
$$ packed form
243a3810K1726k861j9077K1918P84k2885J8646N448k3487J5208Q869k2694J3354
256A139J1484k4758R410J6312k2872M498J7285k0874K623J9412k0477j234K2201
269A4149j7877o375K1766j4379p647K3185j2332j2428K2739p966j5032K0759m929
282C633j5833K0972k395k0043J9006L585k0281J4312M782j9498J4246P552k1825
295a1787J1384J2416k1230O135J3338j9384N495J6450k0021N03J9152j6653l428
308g630J8350j4440m267K0025j3791q940K1205q921j1437J8842p719j2848K0463
321H892m477j7094J8857J148j7901J4215K148j7078J5111N138k0056J1541R450
334I894j8508P913R818j8131P511J3098j9618K548J6840j5416j178J5059j4705
$$ plain form
347 -4875 -6832 10977 -2635 -9119 9599 407 -8082 8137 -866 -9898 9477 2844 -11704 6182
361 6182 5259 -9616 4891 4748 -10437 4817 7542 -10983 1074 8562 -7721 1178 7631 -9450
375 -9450 -66 10315 -8584 -3820 10436 -4891 -3911 8809 -5884 -5127 10832 -3548 -7962 8904
389 8904 -845 -6707 8094 -1545 -7908 9446 1016 -10505 6513 3787 -8190 5740 3201 -9621
403 -9621 5459 5683 -10428 2412 7138 -7984 1806 6273 -9226 1201 9004 -8624 -2335 8898
417 8898 -5956 -2471 8345 -6151 -3288 10108 -4950 -6426 9099 -2076 -5664 8578 -2124
430 -2124 -7021 8962 -129 -8756 7012 2006 -7683 5976 1877 -8571 6011 4136 -9421 3525
444 3525 5236 -8396 2803 5881 -8583 1792 7592 -8129 -925 7616 -6180 -1003 7746 -6319
$$ packed form
347d875j957J7809j3612o484J8718r192q489J6219r003r032J9375o633j4548J7886
361F182r23j4875J4507j43j5185J5254K725j8525J2057P488j6283Q899O453j7081
375i450R384J0381j8899M764J4256j5327R80J2720j4693P57J5959j4380m414J6866
389H904r749n862J4801r639o363J7354q430j1521J7018k726j1977J3930k539j2822
403i621J5080K24j6111J2840M726j5122R790M467j5499J0427P803j7628O289J1233
417H898j4854L485J0816j4496K863J3396j5058j476J5525j1175l588J4242j0702
430b124m897J5983r091q627J5768n006r689J3659m099j0448J4582j875j3557J2946
444C525J711j3632J1199L078j4464J0375N800j5721P204Q541j3796N177Q749j4065
$$ plain form
458 -6319 -2242 8882 -5335 -4375 8654 -3667 -4993 8422 -3022 -6265 8664 -972 -7456 7002
472 7002 238 -7285 6520 1165 -7754 6177 2778 -8393 4540 3846 -7976 4043 5065 -8316
486 -8316 2516 6487 -7581 636 6700 -6607 -245 6912 -6351 -1375 7755 -5359 -2873 7554
500 7554 -4662 -3894 7866 -3609 -5012 7962 -2161 -6164 7180 -837 -6561 6764 462 -7070
514 -7070 6039 1627 -7328 5345 2693 -7724 4401 3850 -7798 3303 5050 -7451 1989 5777
528 5777 -7199 466 6435 -6187 -518 6708 -5663 -1529 7207 -4959 -2882 7396 -3681 -3711
542 -3711 7117 -2942 -4531 7366 -1742 -5949 6504 -207 -6070 5729 322 -6502 5731 1559
556 1559 -7626 4335 3095 -6992 3346 3361 -7093 3084 4817 -7375 1279 5909 -5988 361
$$ packed form
458f319M077J1124j4217R60J3029j2321j326J3415j1444l243J4929r636o484J4458
472G002o764p523J3805n355q919J3931l399j1171J2933o94j1822J2019J022j3381
486h316J0832L971j4068Q217O064j3307O362P157j3263M976R130j3114K486J0427
500G554j2216P68J1760j1475j403J2974j0123m003J3344q017n724J3325o302p532
514g070J3109m412q955J2673k652j0417J2125n51j1648J1101J747j2501R440L788
528E777j2976P665N969j2622N669P226j2371M134Q736j2166K077J0278j1077l0
542c711J0828j0059j589J1897r108m207J2453o711n863J1799n407o824J2233m172
556A559r185J1961j240j0087J0338J5j0454J0177J733j2192Q654M630j1897O349
$$ plain form
570 361 5685 -5908 7 7093 -5541 -2241 7250 -3616 -2836 6405 -3444 -3226 7214 -2629 -5187
585 -5187 6455 -805 -5102 5540 -880 -5688 6205 669 -7274 4548 2598 -6242 3323 2262
599 2262 -6349 3687 3753 -7136 1810 4959 -5743 1058 4535 -6098 1000 6317 -6131 -1517
613 -1517 6771 -3957 -2123 5764 -3929 -2277 6911 -3226 -4260 6442 -1362 -4066 5725 -1614
627 -1614 -4738 6611 -105 -6473 5036 1802 -5566 3834 1418 -5941 4073 2902 -6773 2165
641 2165 3868 -5592 1572 3522 -6136 1454 5272 -6135 -816 5665 -4277 -1070 5250 -4412 -1567
656 -1567 6523 -3501 -3407 6024 -1829 -3070 5654 -2232 -3968 6611 -647 -5506 5084 707 -4814
671 -4814 4504 503 -5662 4671 2286 -6464 2547 3048 -5211 2342 2861 -5995 2016 4571 -5853
$$ packed form
570C61N324j1593N915P086j2634L300R491j0866P80R241r849K18J0440r843k558
585e187J1642p260m297J0642o420m808J1893n536p943J1822j950q840R565j061
599B262q611J0036O6j0889Q946L149j0702O801L477j0633P098N317j2448M614
613a517Q288j0728J834P887r693J652R188j0137j034J0702p804k704R791p339
627a614l124J1349o716o368J1509l234p368R400k416p359J0014j171r675Q938
641B165J703r460P164J950r658P590L818j1407N319O481r942L207O320r662K845
656a567Q090j0024R4R431p853j241Q724p886j736J0579p258m859J0590m377n521
671d814R318m001o165J0333k385q750R011N01q259P553N19q856Q011K555j0424
$$ plain form
686 -5853 -83 4710 -4327 -67 4481 -4923 -803 6065 -3866 -2771 5335 -2460 -2436 5157 -2792 -3283
702 -3283 6214 -1278 -4808 4727 -86 -3929 4685 -273 -4970 5043 1577 -5780 3225 2406 -4768
717 -4768 3051 2234 -5730 2798 4121 -5627 635 4079 -4442 475 3846 -4919 -17 5277 -4345
732 -4345 -2005 4799 -3119 -1848 4833 -3250 -2718 5704 -1940 -4047 4744 -619 -3537 4381 -720
747 -720 -4168 4893 794 -4866 3688 1461 -4621 3371 1753 -5176 3206 3279 -5396 1356 3513 -4517
763 -4517 1013 3550 -4657 529 4416 -4405 -686 4623 -3685 -1227 4667 -3576 -2049 5349 -2374
778 -2374 -3005 4769 -1610 -3384 4346 -1108 -3619 4541 -181 -4251 3840 438 -4410 3616 1168
793 1168 -4794 3143 2176 -4788 2332 2877 -4498 1578 3076 -4473 1104 3857 -4078 441 4193 -3994
$$ packed form
686e853N770M793r037M260M548r404M120O868r931J095Q106p795K4P593p949m91
702c283R497p492l530R535m813l843Q614m958m697J0013l466p357R005q19p174
717d768P819q17p964Q528J323r748O262L444q521M917L371q765M902N294r622
732d345K340O804p918J271O681q083N32Q422p644k107Q791n363k918P918n101
747g20l448R061m099n660Q554k227o082P992j618o929Q382P3q675O752K157q030
763d517N530K537q207N186L887q821L719N309q308K458N894q243J527P398p723
778b374o31P774o379j774P730n454k511Q160m722m070Q091l402m848Q026k448
793A168n962P937r67o964P120N45p375O076J498p549N577K753p935M519L752q187
$$ plain form
809 -3994 -605 4395 -3488 -1210 4693 -2941 -1999 4630 -2428 -2761 4509 -1669 -3281 4212 -1077 -3612
825 -3612 4252 -192 -4187 3620 513 -4363 3153 1286 -4151 3018 1974 -4599 2028 2621 -4213
840 -4213 1545 3045 -4141 998 3690 -3995 -36 4024 -3338 -714 3790 -3212 -949 4568 -2684
855 -2684 -2113 4265 -2007 -2523 4051 -1604 -2725 4555 -877 -3905 3735 181 -3665 3200 270 -3909
871 -3909 3331 1157 -4449 2462 2036 -4067 1701 1854 -4230 1861 3212 -4209 439 3484 -3459 -141
887 -141 3289 -3248 -89 4220 -2996 -1535 4057 -1895 -1546 3642 -2220 -1977 4449 -1444 -3207 4006
903 4006 -187 -3245 3016 -527 -3456 3647 650 -4094 2600 1338 -3760 2023 1156 -3934 2444
918 2444 2426 -4422 986 3161 -3350 520 2787 -3623 284 3723 -3241 -825 3906 -2133 -1093 3151
$$ packed form
809c994L389N000p883K278N903p634R42O629p058l33P270o178j612P493n289k535
825c612P864m444l995P807l107m876P516j867n437P169j044o573O627N93o834
840d213N758J500p186N139K692p685L959M060p362K624M504p002K263N517p252
855b684N71O378o272n16O574n655j121P280n432l028P640l554l846O865k930m179
871c909P240k174n606O911m26o103N768J53o084O091J351p421M648L045o943L318
887a41L430o537L159M309p216J461N592n952L49N188n862K43O426n893j763P213
903D006m193l058O261l543k929P103k997m744O694j262n098N783q67n090O378
918B444j8o848N408K175o511L870K267o410L907L439o964K416M731o039J040M244
$$ plain form
934 3151 -2704 -1368 4323 -1779 -2589 3836 -723 -2687 3158 -823 -2878 3694 58 -3717 2827
949 2827 995 -3120 2510 663 -3826 2475 1763 -4007 1586 2574 -3293 994 2060 -3865 795 3265
965 3265 -3444 -293 3312 -2707 -451 3150 -2951 -933 3951 -2233 -2072 3563 -1091 -1668 3411 -1451
981 -1451 -2559 3661 -470 -3143 3151 489 -2742 2752 109 -3620 2688 1425 -3660 1592 1695
996 1695 -3093 1558 1670 -3620 1262 2615 -3589 85 2805 -2662 383 2988 -3216 -633 3578
1011 3578 -2406 -1458 3348 -1462 -1130 3180 -2019 -2011 3752 -941 -2762 2955 -360 -2395 3039 -307
1027 -307 -3104 3020 697 -3631 1824 1287 -2704 2041 1326 -3421 1537 2089 -3366 715 2431 -2672
1043 -2672 697 2429 -3207 45 3292 -2574 -1037 2900 -1969 -923 3055 -1940 -1406 3402 -1504
$$ packed form
934C151n855J336N691o102q10O425m559j964N845l981k055O572l636l775O544
949B827j832m115N630j847m489O301p12n770N593R88n867M287J066n925M660K470
965C265o709L151L605o019K256L601o101K018M884o184J61N635m654n77N079m862
981a451j108O220m131k673O294k662l231N494k643l729O308j263n085N252J03
996A695m788M651J12n290M882J353o204L674K720n467L045K605o204K583M211
1011C578n984R48M806m810L32M310n199QN763m693j821N717l315k035N434l346
1027c07k797O124k323m328N455n37l991M745p15m747M958N52n455M081J716n103
1043b672L369J732n636L252L247n866J537L937m869J046L978m995N34M808m906
$$ plain form
1058 -1504 -2381 2863 -762 -1900 3146 -669 -2678 3038 69 -3167 2420 871 -2783 2107 929
1073 929 -3103 1919 1628 -3199 1122 1779 -3006 914 2205 -2870 566 2655 -2900 -500 2689 -2239
1089 -2239 -545 3017 -1929 -1065 2971 -1709 -1563 3037 -1138 -1808 2946 -813 -2142 2971 -254 -2559
1105 -2559 2513 70 -2881 2265 752 -2690 2086 956 -3161 1523 1367 -3102 1252 1999 -2814
1120 -2814 705 2073 -2753 382 2492 -2588 -279 2684 -2124 -515 2869 -1860 -933 2913 -1778
1135 -1778 -1732 2949 -827 -1682 2721 -704 -2134 2540 -374 -2503 2424 347 -2497 2096 469 -2728
1151 -2728 2129 1087 -3127 1319 1542 -2661 1088 1751 -2569 874 2004 -2928 3 2400 -2156
1166 -2156 -26 2414 -2335 -488 2821 -2112 -1322 2842 -1226 -1420 2516 -1115 -1507 2910 -627 -2297
$$ packed form
1058a504q77N244l625j138N046l815k009N716k969l236N587j549l654M890j178
1073I29m032N022k91m827M321O57m785L920J291n075L436K089n555K400L189m928
1089b239J694L562m946Q64M036m680J46M600m175o70M754l759j329N113l225k305
1105b559N072k443k951N146j513l442M776j130m117M684j56m469M354P47m813
1120b814L519J368m826L135K110n080K309K963m808J609L384m729R27L846m691
1135a778M6M681l776q55M403l425j430M674k914k129M927k077k844M593j627l197
1151b728M857j042m214M446K23m203L749O63m320L443J130m932K931K397m556
1166b156K130K440m749J847L309m933P90M164m068j94L936l631l92M417l537j670
$$ plain form
1182 -2297 2322 -76 -2085 2313 151 -2258 2468 642 -3044 1503 1273 -2375 1352 1191 -2679
1197 -2679 1183 1818 -2825 292 2046 -2225 113 1831 -2432 198 2775 -2291 -1031 2490 -1578
1212 -1578 -955 2466 -1451 -1052 2969 -1114 -2124 2386 -285 -1688 2263 -499 -2087 2616 252
1227 252 -2700 1848 856 -2317 1459 644 -2511 1770 1668 -2749 559 1708 -2202 493 1632 -2320
1243 -2320 592 2436 -2433 -644 2347 -1592 -557 2110 -1882 -827 2788 -1362 -1670 2427 -723
1258 -723 -1621 2071 -940 -1785 2763 -47 -2432 1923 355 -2122 1769 386 -2267 2027 1178 -2656
1274 -2656 1085 1500 -2122 966 1365 -2525 766 2186 -2300 -99 2159 -1801 -342 1804 -2029
1289 -2029 -432 2619 -1528 -1232 2222 -1171 -1283 2215 -1108 -1579 2604 -427 -2149 2024 97 -1838
$$ packed form
1182b297M619k398k009M398k162k409M726j826l686M547k30l648L727j61l870
1197b679L862O35m643L117J754m271K338J718m263K630K577n066J260L521m068
1212a578O23L421l917L99M021m083j010M510k671j403L951k762j588M703k364
1227B52k952M548r92l173L776q15l155M281j02m417L308J149l910K695J139l952
1243b320K912J844m869J789K991l939J035K667l992J055L615m150l08M097l150
1258g23q98L692l011q45M548k810k385M355j568k477L891j383k653M294q49l834
1274b656L741M15l622L088L99l890L291J420m486K201K258l960J459K146l833
1289b029J597L051m147K96L454l393j12L498l323m71M183l031j722M173j927j935
$$ plain form
1305 -1838 1895 -39 -2280 1958 765 -2294 1489 1009 -2211 1244 1016 -2600 1096 1969 -2271 274
1321 274 1820 -1951 190 1863 -2065 -117 2359 -1707 -748 2222 -1289 -755 2231 -1469 -1445 2448
1337 2448 -703 -1719 2124 -305 -1730 1859 -409 -2148 1980 400 -2180 1499 542 -2113 1490
1352 1490 769 -2422 1253 1419 -2299 700 1625 -1904 660 1683 -2225 139 2101 -1794 -196 2175
1368 2175 -1515 -479 2095 -1630 -951 2369 -1067 -1340 2115 -760 -1470 2074 -554 -1827 1967 -119
1384 -119 -2062 1700 340 -1938 1610 517 -2266 1252 916 -2174 1064 1310 -2049 741 1423 -2141
1400 -2141 406 1761 -1937 64 1920 -1749 -233 2100 -1504 -578 2079 -1365 -925 2198 -935
1415 -935 -1114 2179 -696 -1466 1948 -489 -1662 2031 -12 -1957 1680 332 -2021 1362 516 -2090
$$ packed form
1305a838L733j934k241M238j193l059L783m80l220L455k28l616L696Q73m240K545
1321B74J546l771K141J673l928J948K476m066R59K970l511N34K986l700K4L893
1337B448l151j016L843k429j425L589k268j739M128j580k580L679r57k655L603
1352A490p21l191L675J66l718K999R25l529K564J023l908K364J962l895J598K371
1368B175l690J036K574l725O79L320l436k73L455k875p10L544k628j273L794k086
1384a19j943L762j360k278L548j093k783L518l36l090L238K46l359K790O82l564
1400b141K547J355l698K001J856l669J516K333l604R26K657l444M40L123l133
1415i35j79L293k875p70L414k437j173L693k043j945L637j348k353L383q46k606
$$ plain form
1431 -2090 1210 858 -2187 872 1245 -1947 592 1257 -2060 370 1708 -1873 2 1978 -1526 -366
1447 -366 1851 -1422 -506 2147 -1143 -936 2035 -779 -1021 1944 -775 -1331 2073 -430 -1794 1830
1463 1830 184 -1692 1514 111 -1968 1459 612 -2069 1092 976 -1838 831 901 -2014 793 1464
1479 1464 -2028 138 1655 -1570 -19 1615 -1620 -282 1910 -1390 -803 1868 -859 -711 1771
1494 1771 -1065 -1081 2088 -562 -1515 1790 -48 -1357 1614 -151 -1662 1763 421 -1959 1156 695
1510 695 -1600 1139 616 -1973 1034 1175 -2074 302 1351 -1521 320 1234 -1865 75 1794 -1592
1526 -1592 -571 1686 -1049 -435 1613 -1260 -730 2084 -752 -1344 1622 -263 -1002 1614 -439 -1390
1542 -1390 1849 128 -1843 1223 485 -1393 1219 303 -1838 1228 971 -1947 484 1105 -1434 533
$$ packed form
1431b090L300l52l045L059L73l192K539O65l317K430J338l581J875J976l504J160
1447c66K217l273R16K653l290K07K971k814k42K965k719n56L404k503j364L624
1463A830j646j876L206j403k079L427q47k681L161j16k814K669P0k915K807O71
1479A464l492K166J517l225J551J634l235J338K192l300N87K671k727J48K482
1494A771k836j6L169k650r53L305j838j309K971j765j511L425j342k380L115m61
1510F95k295K739n23k589L007J41l249K376J049k872J841R14l099J940J719l386
1526a592J021K257k735O14K048k873N30K814k836n92K966j885p39K616k053r51
1542a390L239j721j971L066p38j878K612r16k141L066k57k918K431O21k539J967
$$ plain form
1558 533 947 -1791 476 1617 -1696 -301 1513 -1179 -153 1466 -1408 -432 1926 -1039 -1115 1568
1574 1568 -526 -846 1490 -734 -1171 1791 -188 -1578 1311 181 -1286 1282 85 -1611 1390
1589 1390 744 -1791 704 910 -1377 697 834 -1612 623 1318 -1607 22 1318 -1246 37 1302
1605 1302 -1464 -235 1697 -1156 -760 1512 -788 -722 1446 -823 -951 1659 -404 -1267 1336 -166
1621 -166 -1144 1384 -82 -1443 1380 430 -1571 912 621 -1374 842 688 -1562 659 1052 -1468
1637 -1468 268 1071 -1316 222 1198 -1401 -83 1485 -1126 -445 1373 -919 -489 1456 -866 -776
1653 -776 1554 -539 -974 1348 -385 -1005 1399 -258 -1320 1308 165 -1387 1007 275 -1343 983
1669 983 450 -1520 783 796 -1434 502 879 -1345 418 1079 -1348 115 1283 -1132 -158 1252 -1017
$$ packed form
1558E33M14k738K267J141l313J395J814k692J026J619k874R76K358k965p6K683
1574A568k094l20K336k224m37K962j979j390K889j130j467K568j197j696L001
1589A390o46k535K495K06k287K074J37k446K235O95k925J629J296k564J283J265
1605A302k766J229J932k853L96K272k300O6K168k269j28K610k063q63K603j502
1621a66r78K528j466j361K823r50k001K483k91j995K216j54k250K221L93k520
1637a468J736Q03k387J538R76k599J318J568k611O81J818k292M30J945k322R0
1653g76K330k093m35K322j733o20K404j657j062K628j143j552K394p32j618K326
1669I83n33j970K303J3k230J936L77k224J763O61k427J463J168k415R74J410k269
$$ plain form
1686 -1017 -268 1357 -947 -550 1426 -721 -776 1336 -555 -899 1334 -343 -1121 1225 -89 -1175
1702 -1175 1099 75 -1224 1054 278 -1335 940 514 -1370 749 699 -1381 534 903 -1286 336
1718 336 999 -1234 109 1133 -1139 -126 1205 -992 -303 1231 -921 -497 1353 -715 -771 1292
1734 1292 -399 -850 1203 -297 -980 1212 -63 -1164 1038 209 -1119 940 250 -1253 900 525
1750 525 -1362 597 729 -1189 444 722 -1264 328 1032 -1218 -50 1085 -942 -80 1068 -1011
1766 -1011 -201 1309 -888 -615 1251 -492 -587 1152 -536 -790 1278 -268 -1083 1040 46 -956 922
1783 922 -31 -1119 1021 322 -1311 664 553 -1066 587 562 -1180 543 903 -1233 100 958 -896
1800 -896 156 922 -1078 -10 1226 -956 -462 1123 -611 -406 1025 -758 -589 1298 -449 -959
$$ packed form
1686a017P49J625k304L97J976k147n5K112j891l44K233j677p78K346j314j086
1702a175K274j024j299K278p76j613K275m26j884K119n0k080J915L69k189J622
1718C36O63k233J343J024k272J013J331k197O89J534k152M24J850k068n6K063
1734A292j691m51K053j500o83K192j275j101K202q29j328K059o90j503K153l75
1750E25j887J959J32j918J633K78j986J592P04k250J168J135k027Q62J148k079
1766a011Q10J510k197K73J866j743r5J739j688k54K068j546q15K123r94j002J878
1783I22r53j088K140o99j633J975j11j619J653k5j742J723L60k136J333Q58j854
1800h96J052P66k000J068J236k182M94J585j734K05J431j783J69J887j747n10
$$ plain form
1816 -959 995 -190 -769 1012 -227 -990 1145 155 -1250 706 398 -915 729 333 -1150 707
1832 707 735 -1194 257 783 -920 285 732 -1133 173 1169 -966 -346 967 -651 -208 958 -809
1849 -809 -366 1259 -566 -812 970 -296 -567 1017 -431 -864 1190 10 -1115 762 196 -872
1865 -872 730 86 -1088 845 555 -1170 362 576 -936 429 600 -1116 347 1034 -1006 -158 914
1882 914 -663 -37 885 -859 -204 1207 -604 -578 977 -378 -502 912 -523 -690 1173 -137 -978
1899 -978 788 -11 -841 763 -32 -984 851 321 -1121 495 421 -904 518 441 -1086 453 796 -988
1917 -988 140 815 -809 65 781 -902 -31 1100 -670 -337 930 -551 -389 931 -538 -525 1077
1934 1077 -300 -768 888 -115 -724 838 -117 -901 826 177 -927 675 282 -935 539 291 -1029
$$ packed form
1816i59J954j185n79J781j239p63K135r90j405J956l08j313J644l96j483J857
1832G07K8j929J451N26j703J205M47j865J306R96k135O20J313j618M43J166j767
1849h09M43J625j825k46J782j266k71J584j448m33K054j180j125J877n66j068
1865h72J602o44j174J933k90j725J532K14j512J365J71j716J463O87k040Q48J072
1882I14j577O26R22j744O55J411j811K6J555j355j24J414j435j67J863j310q41
1899i78J766p99q30J604p95r52J835n30j442J616p4j325J422p7j527J539L43j784
1917i88J128O75j624Q74P16j683Q71J131j770L33J267j481J62J320j469J3J602
1934A077j377m68J656j003o09J562r55p84J727o49j104J602l93j217J474k48j320
$$ plain form
1951 -1029 489 598 -944 282 616 -927 165 696 -901 49 850 -791 -126 870 -663 -179 939
1968 939 -630 -433 963 -390 -476 956 -266 -593 873 -228 -750 861 14 -781 738 87 -899
1985 -899 646 242 -962 497 374 -943 376 487 -884 288 578 -920 109 674 -800 90 828
2002 828 -737 -110 844 -687 -278 906 -492 -344 893 -421 -472 896 -294 -572 829 -229 -680
2019 -680 846 -19 -752 754 118 -854 566 188 -845 587 418 -875 363 461 -853 272 523
2036 523 -850 189 690 -829 -34 762 -662 -147 708 -704 -256 880 -502 -378 846 -369 -467
2053 -467 749 -386 -532 934 -112 -682 744 31 -647 692 46 -764 701 259 -877 495 417
2070 417 -720 392 315 -910 320 623 -829 95 667 -667 -29 566 -777 -49 862 -621 -339 770
$$ packed form
1951a029J518J09j542J226L34j543J092N31j597R50Q01j641O65R96j533M84J118
1968I39j569J97J396j353q6J432j222l27J466j101n22J611q47p95J519o51r86
1985h99J545m04j204J459j23j317J319J11j371J172K90j498J029N65j474Q90P38
2002H28j565O27R54j531M09J184j398J48J237j314n1J368j190k78J401j058m51
2019f80J526q65p33J506o36r72J420l78j033J432j69j293J238R8j314J125K51
2036E23j373J039N01j519P95P96j424N15Q55j412M48J136j382J24J224j215r8
2053d67J216j135j46J466j046n70J426p13o78J339o46q10J465m42j136J372p8
2070D17j137J112p7j225J230L03j452R24N72j334O38N95j343P28R11j483K82J109
$$ plain form
2088 770 -415 -297 738 -478 -437 887 -279 -643 759 -18 -507 672 -165 -739 734 142 -792 563
2106 563 287 -670 472 193 -834 506 534 -827 182 567 -621 194 532 -774 79 733 -711 -219
2124 -219 737 -425 -126 674 -630 -378 831 -369 -548 716 -156 -469 649 -261 -632 780 36 -753
2142 -753 520 152 -579 597 139 -777 536 409 -831 251 498 -550 335 442 -799 167 667 -687
2160 -687 -68 618 -512 -20 604 -671 -191 828 -458 -472 616 -278 -310 695 -335 -549 747 -116
2178 -116 -703 538 56 -481 628 -22 -775 568 303 -769 294 349 -590 352 333 -763 303 620
2196 620 -702 -23 520 -510 117 610 -632 -63 761 -519 -346 633 -297 -194 675 -427 -439 741
2214 741 -212 -580 564 -94 -499 577 -98 -645 629 166 -746 313 193 -611 411 288 -693 353
$$ packed form
2088G70j185J18J035j216M1J324j166l64J402p77m89J179q37n74J473n92r34J355
2106E63k76r57J142k79j027J340K8j361J009L85j188Q15L38j306Q53O54j444M92
2124b19R56j162K99Q00j304K52J209j200j79J264q72l13J118r10l71J412p44p89
2142g53J273l68p31J176m58r16J313j27j240J082K47j048Q85J07j241R66N00j354
2160f87O19O86j130M92O24j275M80J019j286j4J088q94l2J005j030k14J296q63
2178a16n87J241m82n37J109o50p53J343k65j072J063N5r39R42j9j096J066L17
2196F20j322O79N43j030O27M93j242N69Q24j280J73R79r30J03Q69j102j2J180
2214G41r53l68J144o58m05J076o75n47J274m63r12J059j20q04J022j23r81J046
$$ plain form
2232 353 457 -720 100 492 -521 156 538 -615 10 686 -497 -199 615 -408 -212 622 -395 -280
2250 -280 734 -264 -475 558 -223 -478 606 -92 -527 586 9 -654 441 119 -576 440 196 -664
2268 -664 374 337 -642 248 374 -631 147 442 -588 100 593 -530 -83 525 -496 -164 609 -380 -194
2287 -194 642 -338 -312 630 -242 -388 602 -152 -474 577 -25 -486 527 17 -603 409 125 -582 411
2306 411 235 -598 319 254 -667 211 388 -573 144 440 -560 60 520 -500 -74 543 -426 -146 563 -362
2326 -362 -166 629 -316 -380 555 -186 -377 563 -110 -432 538 -50 -572 443 99 -506 398 100 -578 401
2346 401 265 -609 244 307 -551 173 347 -533 182 491 -537 -43 468 -441 -32 507 -432 -98 595 -381
2366 -381 -310 534 -220 -281 491 -255 -361 595 -69 -481 441 4 -459 394 16 -491 504 209 -606 242 268
$$ packed form
2232C53J04j177Q20L92j013O77L82j153O25O76j183K98Q14j023J96Q34j017J15
2250b80J014r98k11J033p81k55J084o98m35J113n77o63J095l22o95J016k44q60
2268f64J038l7r79Q90J26j005P78K95j030O88M93j123M47O08j021L32P73r89J86
2287a94Q36r80K6R42q72j46R90p54l22J051o02m61J013n10o20J012k84p07R93
2306D11j76q33R17o5r21Q78J77r61P17K96j000O20M60j020M26O17r69K80P09r25
2326c62J96P95r45o4R35p41j91R40o73l22R70n88n22J015l44o05R04k98o78R79
2346D01j36q74Q53O3q58P24J74q80P15L09j028M94N11r09M09N39r39L34O93r76
2366c81P1Q44p54o1P72p46j06R56o64m12R22m37m63Q53l78n07R95k95q15Q48K6
$$ plain form
2387 268 -485 236 265 -529 221 413 -560 11 436 -418 13 389 -496 -35 585 -369 -219 506 -259 -222 447
2408 447 -299 -254 624 -136 -439 440 -54 -369 432 -89 -476 484 119 -571 291 200 -443 260 121 -564 274
2429 274 383 -523 85 372 -432 52 350 -490 50 552 -385 -155 472 -272 -110 468 -344 -241 564 -189
2449 -189 -345 457 -82 -292 434 -170 -442 488 58 -478 327 100 -429 310 68 -535 329 299 -504 133
2469 133 291 -413 177 298 -526 68 456 -419 -74 425 -312 -46 419 -402 -190 528 -208 -273 434 -145
2489 -145 -240 443 -204 -382 506 13 -423 345 39 -333 386 24 -502 337 198 -479 185 219 -392 230 206
2510 206 -537 113 374 -436 -11 340 -344 24 362 -411 -73 493 -273 -202 410 -197 -137 454 -230 -302 476
2531 476 -85 -365 379 1 -297 378 -28 -436 347 124 -442 244 143 -391 240 164 -477 195 291 -448 54
$$ packed form
2387B68p53P21K9p94P50J92r73N71M25q54M31L76q85M61O20r54J50P25p65L7O69
2408D47p46M5Q78p60l03Q79m94l15Q01n21l87R60l65o90Q62r1o43P03j39o85Q38
2429B74J09r06O08K87q04M84K98q40N40N02r37K30O27p44J62N78q12J03Q05p53
2449a89j56Q02n39k10P26o04k72R30m30n36Q05k27n29P39k42o03Q64l0q03O37
2469A33J58p04N90J21q24N94L88q75L45M99p37K66M65q21K12P18p36o5P07n79
2489a45r5O83o47j78Q88m93m36P68l06l72P19l62n26Q39j39o77O64L4o11O22k4
2510B06p43O50K61q10M25L51o84L68L38p73L38N66p66P1O12o07O0N91o84p2P78
2531D76n61k80P44l78k98O75m06m08P83k23n66O86j01n34O31p6o41O72R6p39N02
$$ plain form
2552 54 297 -361 78 322 -389 -4 387 -353 -106 399 -254 -109 405 -263 -215 425 -178 -277 392 -102 -281
2573 -281 375 -70 -339 375 29 -403 303 98 -374 278 149 -397 222 207 -422 157 272 -377 94 295
2593 295 -364 37 313 -376 -30 361 -320 -113 372 -252 -143 377 -238 -203 390 -172 -260 395 -86 -267 358
2614 358 -71 -319 369 22 -362 297 99 -351 256 117 -385 240 197 -409 126 257 -334 96 255 -373
2634 -373 50 336 -348 -57 359 -253 -78 346 -276 -117 409 -215 -223 369 -131 -210 332 -133 -262 377 -53
2655 -53 -347 289 30 -308 279 35 -365 274 132 -399 177 192 -302 178 186 -343 149 312 -343 15 315
2676 315 -258 3 295 -313 -43 389 -244 -189 327 -152 -146 319 -211 -224 378 -99 -326 274 -20 -259 275
2697 275 -38 -328 308 87 -361 196 119 -287 207 103 -374 198 254 -359 46 250 -249 86 234 -332 31
$$ packed form
2552E4K43o58M39K44p11L85L91p40K47N05o53J45N14o68M8O40o03r9O69m94j79
2573b81O56m45k69P14l46m32P06k05m72O52j29n46O19j5o29N79J15o49M71K01
2593B95o59M01K76o89L46L91o81K07M85o24J09N20o15L5N93n62q8O55m81j81O25
2614C58m29k48O88l47l84O59j98m50O07j39n02O25m3o06N35J31n91M30J59o28
2634c73M23K86o84K91M16o12J75M24o22J59N26o24qN92n00p9N42m65j29O39m30
2655e3k94O36k59l38N87k44m00O39j42n31N76J5m94M80Qn29M92J63o55L58L00
2676C15n73K61K92o08K70M32o33N5N16m79OM65n30j3O02m77k27O00k94k39N34
2697B75l13k90O36k21m48N57p7m06M94j04m77N72N6o13M05K04m99L35J48n66L63
$$ plain form
2718 31 350 -281 -115 313 -170 -69 298 -243 -140 397 -139 -261 281 -48 -206 277 -103 -288 325 28
2738 28 -350 199 63 -280 201 44 -369 207 187 -369 74 193 -261 109 189 -330 74 312 -288 -42 273
2759 273 -198 6 291 -258 -87 369 -153 -178 288 -92 -148 281 -150 -247 328 -28 -288 213 16 -257 236
2780 236 5 -337 222 122 -333 106 141 -277 141 151 -331 84 260 -277 8 227 -223 28 256 -265 -49
2801 -49 330 -176 -123 261 -141 -92 317 -159 -177 322 -62 -235 234 -34 -192 268 -26 -291 245 70 -286
2822 -286 151 78 -270 164 100 -335 109 181 -285 25 173 -244 66 226 -278 -17 287 -211 -85 244 -173
2843 -173 -49 287 -165 -127 305 -97 -172 260 -67 -170 270 -57 -232 265 15 -258 193 25 -244 198 59
2864 59 -289 147 107 -290 85 135 -258 79 164 -267 31 224 -223 -6 232 -194 -35 245 -190 -68 282
$$ packed form
2718C1L19o31J66M28m83J01L67n41J03N37n36j22N42l29j58M83l80j85O13k97
2738B8l78N49j36l43M81j57m13N76k0n56M43J19m54L70Q0n19M04K38o00K46L15
2759B73m71K04K85n49J71M56n22k5M66l80n6M29m31r7N75l56k60N01j97k73M93
2780B36k31l42N59j00m55M39L5m18M18J0m82M15J76n37K85K19m50K51K28n21K16
2801d9L79n06N3L84m02M9M09m76j8M99l84j73M69k68j58M60k94k65N36j75l56
2822b86M37p3l48M34o4m35M44P2m66L10J48m17L10J60n04K61L04m98J26L29m17
2843a73J24L36m52L8M32m02p5M32l27j03M40l27j75M97k50k73M51j68k69M42j39
2864E9l48M36m0l97L75N0l93L37Q5m31K98J93m47K17K38m26J59K80m35J22L50
$$ plain form
2885 282 -150 -128 261 -110 -137 261 -74 -168 243 -46 -205 228 0 -217 203 38 -230 192 53 -242 158
2906 158 98 -263 98 131 -230 99 160 -243 45 186 -239 -10 204 -189 -21 206 -203 -77 248 -153 -110
2927 -110 246 -95 -123 240 -89 -144 247 -38 -201 191 0 -175 190 4 -211 190 64 -262 122 104 -204
2948 -204 105 95 -246 83 151 -231 14 161 -195 12 167 -206 13 212 -184 -81 191 -125 -56 211 -121
2969 -121 -101 237 -65 -169 188 -27 -139 186 -41 -186 200 25 -223 127 49 -182 125 43 -219 141 130
2990 130 -233 26 128 -182 51 135 -200 30 201 -178 -37 173 -125 -25 171 -162 -65 222 -94 -123 168
3011 168 -76 -109 186 -75 -141 211 3 -193 120 14 -143 148 13 -201 154 89 -203 59 85 -160 77
3032 77 78 -220 56 172 -176 -24 146 -133 -4 141 -161 -28 212 -112 -94 154 -88 -57 173 -98 -112 210
$$ packed form
2885B82m32K2L89l71k7L98l35r4M11k89j59M33k28k17M20j65k68M22j39k95M00
2906A58o0l61L61L3l61L29O1m03K88J41m25K29K14l93J68K27m09J26L25m01M3
2927a10L56l41k8L63l29n5L91k85j63L92j91j75L65j86k15M01j26l26L84j8l08
2948b04L09j0l41L29O8l82K45J47l56K07J55l73K19J99l96J03K72l16O9K67l32
2969a21K0L38l02j04L57k15j12L25k27j45L86j75k48L50p8k31L07q2k62L60j1
2990A30l63K59J02l10K33Q4l35K30J71l79J41K10k98J00J96l33R7K87l16k9K91
3011A68k44l3K95k61o6L52k08j96L13j06j57K91j35k14L55o5k92K62K6k45K37
3032G7Jk98K76J16l48J52J70k79J29J45l02J33K40l24J8K48k42L1K30k71j4L22
$$ plain form
3054 210 -38 -149 126 -7 -118 135 -39 -188 162 64 -165 89 56 -149 88 37 -204 88 129 -171 6
3075 6 117 -132 34 120 -158 3 180 -117 -51 156 -88 -27 152 -128 -73 184 -48 -96 146 -32 -107 142 -43
3098 -43 -138 159 18 -154 93 19 -142 126 38 -177 88 79 -156 60 92 -134 64 84 -168 14 149 -102 -4
3121 -4 131 -110 -20 141 -121 -56 148 -76 -77 140 -64 -72 160 -42 -133 150 -1 -130 121 3 -122 121 5
3144 5 -163 84 63 -138 68 62 -147 68 71 -159 45 104 -129 14 103 -115 15 124 -117 -28 133 -90 -43 143
3168 143 -68 -49 143 -74 -91 140 -21 -85 139 -16 -115 123 -1 -131 97 33 -127 78 41 -126 89 58
3190 58 -145 47 68 -139 33 114 -105 24 107 -108 13 119 -111 -18 124 -97 -42 119 -70 -58 117 -66
3212 -66 -80 128 -39 -82 123 -14 -98 105 -26 -124 100 22 -126 75 37 -122 74 48 -127 70 73 -130 19
$$ packed form
3054B10k48j11K75j33j11K53j74j49L50r8k29K54l3k05K37n1k41K92M1l00J77
3075FJ11k49J66Q6k78J61J77k97O6K07k44O1J79k80N5K57k32m8K42j78p5K49j85
3098d3r5K97j41j72K47p4j61K68q8k15K65rk35K16L2k26J98K0k52J82J35k51R8
3121dJ35k41R0J61k62O5K04k24jK17k04qK32k02r1K83j51j29K51j18j25K43j16
3144Ej68K47k1k01K06ok09K15Lk30K04N9k33J43Q9k18J30J09k41Q9J61k23M7J86
3168A43k11J9J92k17j7K31j61o4K24j55r9K38j24j30K28o4j60K05l7j67K15l1
3190E8k03J92K1k07J72Q1k19J29Q3k15J21J06k30R3J42k21N5J61j89J2J75j83
3212f6j4K08j67m3K05j37q4K03j31r8K24p8j48K01l8j59J96k6j75J97Lk03J49
$$ plain form
3235 19 79 -103 32 85 -129 5 116 -102 -22 114 -69 -18 91 -102 -51 126 -58 -78 109 -27 -61 102 -53
3258 -53 -95 114 -9 -119 68 13 -94 85 7 -121 64 50 -126 44 76 -96 40 57 -131 23 99 -100 -11
3281 -11 92 -71 11 95 -89 -10 128 -68 -71 94 -35 -39 104 -68 -86 109 -27 -108 75 -3 -81 79 -30 -130
3305 -130 76 35 -123 41 29 -76 59 29 -119 66 78 -102 -3 68 -63 39 85 -106 -10 111 -68 -44 93
3328 93 -44 -27 98 -82 -57 107 -34 -80 75 -26 -58 87 -28 -96 100 14 -120 30 2 -72 73 17 -119
3351 -119 56 62 -105 14 54 -74 32 57 -99 13 102 -63 -23 81 -51 5 96 -66 -33 124 -38 -74 81
3374 81 -28 -38 95 -37 -73 90 -3 -94 54 2 -76 63 1 -105 56 47 -96 27 32 -88 28 40 -95 25
3398 25 80 -83 -4 61 -58 23 88 -61 -4 100 -37 -30 75 -32 -32 87 -36 -52 91 -15 -65 62 -14 -64 63
$$ packed form
3235A9O0j82J35N3k14J34J11k18Q0J36j83N1J09j93N1J77j84k0J87j36l4J63j55
3258e3m2K09j23j10J87n5j07J79p8j28J85j4j76J70L2j72J36J7j88J54P6j99Q9
3281a1J03j63Q2Q4j84P9J38j96lJ65j29mJ43j72j8J95j36q1J83p8p8J60j09j00
3305a30K06m1j58J64j2j05J35l0j48J85J2j80R9P1j31J02M6j91R6J21j79K4J37
3328I3j37J7J25j80K5J64j41m6J55j01l2J45j15o8J96q6j34J50k8p4J45n6j36
3351a19J75Oj67J19M0j28J06K5j56J12Q9j65M0J04j32N6R1j62L3J57j62l6J55
3374H1j09j0J33j32l6J63r3r1J48n2p8J39o2j06J61rj43J23Nj20J16J2j35J20
3398B5N5j63P9O5j19Q1O5j49N7J04j37PJ05j07%J19j23j6J43j06n0J27p6n0J27
$$ plain form
3423 63 -15 -72 58 15 -91 40 18 -88 36 36 -92 31 47 -92 4 51 -80 16 59 -73 9 83 -40 0 74
3448 74 -53 -12 80 -44 -33 87 -19 -42 65 -24 -50 73 -14 -60 67 4 -71 60 6 -75 43 14 -83 45 35
3473 35 -73 24 36 -80 11 47 -78 6 59 -67 -8 68 -55 -8 72 -50 -18 80 -39 -18 78 -31 -39 69 -25 -48
3499 -48 67 2 -48 64 -15 -77 37 -9 -71 40 -4 -74 39 20 -66 31 34 -70 13 36 -66 12 49 -58 9 43 -50
3526 -50 -7 61 -51 -5 76 -36 -30 52 -34 -33 58 -30 -31 60 -18 -51 52 -13 -52 43 -20 -74 46 16 -67 28 17 -55 37 17
3556 17 -64 43 47 -57 16 35 -44 23 48 -56 6 67 -34 -2 60 -19 -6 60 -42 -26 70 -12 -44 46 -8 -29 51 -26
3584 -26 -53 54 -12 -63 29 -3 -51 37 1 -69 35 29 -61 15 17 -46 20 18 -64 22 51 -38 1 44 -38 8 52 -51 -11 62
3614 62 -25 -33 53 -20 -12 55 -38 -42 53 -7 -47 29 -8 -41 35 -15 -55 37 20 -51 16 9 -40 35 12 -57 21 44 -55 5 30 -35
$$ packed form
3423F3p8n7J30m3j06J31k2j06J24%j28J23J6j39R6M7j31R6M3j32Q2P4j23M0P4
3448G4j27M1R2j24J1J20j06k3J07q9k6J23q7m6J27o3p5J31n4q1J18k9r7J28j0
3473C5j08R7J2j16R1L6j25Q4N3j26N9P6j23M7Q0j22L2R8j19K1R6j09qJ08r4k3
3499d8J15o5n0J12p9o2J14m6o2J11m4p0J13j9q6R7Lj04Q3K3j02P8L7j07O7L4r3
3526e0M3O8j12M6Q1j12OQ2q6JR1q8jR1p8l3J03o5l9R5o3n4J20l0q3R5j1p2R2k0
3556A7q1J07Mj04P3J9p9O7K5j04O2O1j01L2O2p9J3O6j02J6R6q2l2R0n4k1Q0p7
3584b6k7J07o6n1R2l2m8Q8l6p0J04or0P6Ko3O6kq2Q6K9q9L9M3q2M6M4j03M0P3
3614F2q7qQ6p3QO7r3mR5o0m0P6l7l3P6n0m0R2j7p1O7pm9P5k3o9P8K3r9O0K5o5
$$ plain form
3646 -35 6 47 -48 0 66 -28 -11 48 -26 3 50 -45 -32 50 -21 -32 31 -16 -30 43 -23 -52 46 -3 -47 13 -6 -30 42 -1
3676 -1 -63 27 27 -54 10 12 -36 27 31 -52 17 42 -48 5 32 -33 4 40 -40 -14 57 -24 -27 33 -15 -16 36 -25 -33 48 -19 -50 30 -18
3710 -18 -43 36 -17 -62 34 3 -38 31 6 -31 31 15 -45 18 34 -35 12 31 -42 13 30 -35 6 50 -27 -4 44 -36 -17 30
3740 30 -37 -26 42 -28 -32 30 -22 -38 38 -27 -31 28 -17 -48 23 -3 -40 32 12 -39 30 21 -33 23 19 -40 25 29 -33 23 36 -45 26
3773 26 33 -32 -8 34 -31 -3 43 -27 -14 28 -27 -35 39 -22 -18 40 -22 -30 32 -25 -37 34 -18 -39 36 -1 -32 36 12 -49 30 12
3805 12 -40 25 12 -50 34 26 -54 22 30 -34 16 25 -51 14 33 -41 -12 37 -35 -15 41 -35 -18 44 -36 -36 24 -23 -32 33 -23 -43 42
3838 42 -1 -41 36 10 -36 40 9 -46 37 18 -43 35 19 -40 23 32 -44 18 39 -54 13 13 -51 3 39 -46 -14 36 -42 -30 44
3869 44 -27 -25 51 -34 -28 46 -14 -31 52 17 -29 40 -1 -49 57 44 -46 24 15 -31 54 43 -31 23 50 13 16 48 -41 39 33 -42
$$ packed form
3646c5M1M1r5M8O6r4J7N9p4K9M7r5J3Q2p1j1O3m7j4P3o6k9R8m9m4O0j9k4P2m3
3676ao2R0%q1O4Km8O3Mq3O9K5r0N3K7o5L7L6q0K6P1q1lO0m8jN2o1qQ1o7l1Q0m8
3710a8k5P9n3m5R6l1m1O9k5l7O2j6o0O3J6o9M7J9p3N5J7o5M1M4p7K3M8q0J9M7
3740C0o7J1O8p0mO2n2j6P6o5mN9m5l1P1k6l7P2k0n1O9rn4N6mn9O5Mo2N6J3q1P1
3773B6Po5K4M2o5K8M6p0J3M2n5qP4o1MN8o2qO2n7j2P1n2k1P5l7l1O8k4o1P9j8
3805A2n2O5j3o2Q4qq0P6Qo4N0Rp6O5J9p4K9M9p2K0N6p6J7O2q0%O0m7rO5n6k0Q5
3838D2m3m0P7k6m6P6l1n5Q3j9o1P8j6n9O3Rp6O2K1r3O7%o4N4L6q5L2N0p8J2P4
3869D4p1KP6q5OP4o0j7Q3l5m6O9m1m8J06j3r0P0rm6Q5j1p4N4K7l7LL2q9Q0op5
$$ plain form
3901 -42 3 15 -47 -23 39 -31 -17 93 -37 -35 61 -51 -64 56 -54 -79 59 -8 -31 24 -15 -61 29 11 -41 33 6 -66
3929 -66 35 35 -51 35 28 -73 42 -11 -91 32 31 -52 -1 3 -32 4 5 -61 -20 61 -33 -3 39 -39 -20 46 -37 -33 47 -13 -34
3960 -34 46 -16 -40 59 6 -43 59 20 -44 40 12 -38 38 30 -63 24 29 -29 20 56 -37 27 33 -50 41 45 -92 19 52 -47 -19
3991 -19 38 -57 -38 66 -40 -38 39 -26 -28 60 -17 -42 52 3 -39 53 16 -39 56 24 -54 44 34 -56 27 33 -54 29 38 -53 19
4022 19 42 -60 0 35 -60 -14 50 -43 -17 56 -35 -23 51 -35 -29 63 -41 -47 67 -26 -38 68 28 -47 66 15 -54 62
4050 62 22 -56 45 32 -50 32 46 -61 33 52 -66 15 35 -62 3 42 -57 -6 45 -52 -19 56 -51 -23 49 -46 -32 63
4078 63 -23 -48 59 -20 -32 56 0 -52 63 7 -59 52 7 -63 42 23 -55 45 38 -44 39 43 -63 17 42 -60 17 53
4106 53 -57 -2 56 -55 -18 62 -50 -32 59 -55 -47 60 -32 -51 55 -15 -43 64 -10 -53 71 6 -66 53 25 -61
$$ packed form
3901d2M5J2o2K4O2p0J4J10j30KR6j12j3J20j10k5J38o7k3N5l9m6R0j8n2P4k7p2
3929f6J01%q6Q6pj01J15n3q0J23jq3N1Ml5L6Jo6M1Q1r4L0M2p8J9O6q3MQ0o0k1
3960c4Q0o2k4R9n3m9J02l9o4Q4k8n0P6qr3Q7Nn8M9L6r3O4Oq3R1Mj37J11L3r9K8
3991a9N7r5J9J04j06KP7o5kQ8p7k5R4m9m2R2l7n5R5l2p8R8j0r0Q3Oq7Q3Rr1P2
4022A9K3j02O0L5r5M6O4r3K6P3r1J2P4q6OR2j04oJ14r3j2J06m0p5J13n1o9J16
4050F2m0p8J01j3q2Q2J4j07R4J9j18Q1K0r7O5L9r9N1N1r7L3P5j07K8P2r5J4R5
4078F3q6k5J07p9j2Q8n6n2J15n6o6J11m5p0J05j9p8J00pq2Q3Mj06Q0K5j02P7L6
4106E3j10N5N8j11L7Q0j12J8R1j14QJ07r2j9J06p0k8J07p4m3J24o5p2J19k8q6
$$ plain form
4132 -61 44 31 -66 40 45 -77 26 43 -55 20 49 -63 7 53 -60 -12 56 -48 -21 61 -53 -31 79 -37 -48 51
4158 51 -34 -47 59 -24 -52 81 -3 -53 68 17 -50 68 21 -61 68 38 -66 44 33 -65 33 49 -64 28 54 -68
4184 -68 -9 33 -57 -9 64 -59 9 85 -46 -27 85 -50 -10 74 -49 -108 68 -71 -21 46 5 -92 64 -19 -88 83
4210 83 36 -61 42 30 -73 44 27 -72 35 58 -74 10 55 -60 22 59 -76 -5 74 -65 -19 65 -50 -28 61 -45
4236 -45 -45 87 -17 -57 66 -12 -55 63 -20 -58 74 15 -73 57 23 -62 53 17 -76 52 39 -75 33 47 -60
4261 -60 32 50 -73 14 67 -63 -19 57 -60 -16 67 -57 -36 78 -42 -50 75 -32 -42 59 -27 -61 84 -4 -57 73
4287 73 9 -57 63 20 -73 67 39 -69 33 35 -63 44 38 -78 33 67 -71 3 60 -48 -5 55 -71 -31 69 -53
4313 -53 -34 71 -36 -36 73 -44 -56 84 -13 -54 66 -4 -39 75 2 -58 68 21 -70 59 41 -61 47 36 -85
$$ packed form
4132f1J05j3r7J06Nj22J03J7r8P5K9j12P0M6j13M8O8j04K7Q2j14K2J10j16j1R9
4158E1q5j3J06q3k8J33q4n0J21n1o7J18m7q2J29l0j04J10j1r8R8J6j13R2K6j22
4184f8N9M2r0M8P3j23O8P6j31J9J12j35M0Q4j23n9J76j39N0O7m1r7J56q3o9J71
4210H3m7r7J03j2j03J17j7r9J07K3j32Q4M5j15Q2L7j35P1P9j39M6Q4j15K2Q9j06
4236d5%J32j04m0J23p8m3J18q3l8J32n9q8J30l4q5J15l6r3J28j3j14J08J4j07
4261f0R2J8j23Q7N3j30M4P6j17M4Q3j24K1J14j20qJ25j07j0J01q6l4J45q8n3J30
4287G3o4o6J20m3r3J40k8j08J02Kr8J07oj16J11L4j38P4N7j08M3O0j26M0J00j22
4313e3J9J05j07%J09j17j2J40r7m1J20p0l5J14p3o0J26m7r1J29j8j02J08j1j21
$$ plain form
4338 -85 44 50 -74 17 58 -71 7 52 -78 -5 74 -72 -21 57 -54 -30 66 -47 -38 72 -41 -53 71 -11 -51 73
4364 73 -14 -65 69 19 -59 68 30 -60 57 33 -73 57 43 -78 30 57 -70 19 56 -79 7 64 -74 -7 64
4389 64 -69 -24 66 -60 -43 56 -63 -43 82 -36 -61 66 -15 -64 68 -12 -67 65 12 -66 58 32 -65 54 29
4414 29 -66 45 49 -79 30 56 -71 23 60 -73 21 68 -72 -17 69 -45 -19 54 -59 -41 77 -45 -52 84 -34
4439 -34 -48 56 -32 -53 81 -7 -63 64 16 -68 66 11 -71 61 27 -75 42 48 -66 33 42 -80 24 53 -77 -4
4465 -4 71 -62 -11 58 -71 -21 68 -70 -32 67 -42 -46 62 -37 -45 81 -27 -68 69 -2 -51 71 -2 -64 69 29 -77
4492 -77 51 35 -68 44 33 -76 37 54 -86 6 51 -76 10 56 -69 -14 70 -64 -41 65 -57 -32 68 -65
4516 -65 -38 72 -40 -57 70 -15 -54 70 -24 -69 75 13 -81 55 24 -66 63 18 -73 61 41 -84 14 34 -76
$$ packed form
4338h5J29Oj24R1M1j29P8M5j30P3P9j46N1P8j11K4R6j13RJ10j13j2J24q2m0J24
4364G3q7n1J34n0p8J27l8r0J17k4j06J30j4j21J08K7j27Q9L7j35Q6N7j38O7P1
4389F4j33M5R0j26J7R9j19K0J25j18k5J27q1m9J32q0n5J32n3p8J24k6r7J19k5
4414B9r5J11Mj28J09K6j27R4L7j33R4M7j40N5Q6j14K6P3j13J8J18j22pJ36j18
4439c4j4J04q8k1J34q8n6J27m8q4J34n5q2J32l4j02J17Oj14R9Rj22J04K9j30P3
4465dP5j33N1O9j29N0Q9j38L8R9j09mJ08r9qJ26j08m1J37p1m9J22p3o2J33m0j06
4492g7J28j6j03J12j1j09J13J7j40R2M5j27Q6M6j25N5Q4j34K3J06j22K5J00j33
4516f5K7J10j12j7J27q5l9J24r4m5J44o2r4J36l1r0J29m5r1J34k0j25R8K0j10
$$ plain form
4541 -76 32 56 -79 4 63 -85 -15 65 -56 -21 67 -67 -41 75 -62 -59 64 -32 -42 70 -21 -50 88 -3 -72 65
4567 65 0 -69 62 22 -73 72 34 -82 48 39 -61 41 42 -87 37 60 -80 6 65 -65 -6 67 -67 -21 82
4592 82 -65 -47 65 -38 -47 73 -52 -51 80 -26 -59 69 -5 -53 74 -3 -74 77 25 -74 56 26 -65 52 51 -86
4618 -86 38 58 -78 21 54 -81 18 65 -82 -7 70 -78 -20 61 -73 -31 72 -63 -48 73 -40 -53 71 -23 -57
4643 -57 72 -12 -59 85 4 -78 61 18 -67 66 32 -81 64 44 -71 41 53 -90 22 62 -83 20 73 -75
4667 -75 1 71 -69 -22 68 -64 -31 82 -61 -54 73 -46 -55 78 -23 -58 70 -12 -69 83 5 -87 64 20 -64 65
4693 65 36 -57 56 55 -73 40 56 -77 29 68 -77 6 64 -78 -7 74 -76 -24 65 -62 -21 82 -52 -48 77
4718 77 -41 -60 70 -37 -53 89 -2 -72 63 5 -73 69 14 -81 68 37 -79 48 58 -68 51 47 -66 34
$$ packed form
4541g6J08K4j35Q3N9j48P0Q0j21L5Q8j34K6J16j37LJ23r6j0J12r1k9J38r1o9J37
4567F5o5o9J31m0r5J45l8j16J30rj00J02Jj29J24K3j40Q6N9j30N9P3j34M6J03
4592H2j47J8J12j03rJ20j25JJ31j06l3J28p4m8J27p7p1J51n2r9J30l0r1J17jj37
4618h6J24K0j36R9L3j35R9M7j47P5P7j48N8Q1j34M2J03j35J5J21j13j3J24r4l4
4643e7J29q4m7J44q1q2J39m3q5J33l4j13J45k0j15J12J2j43J12M0j45J03N3j48
4667g5P6P0j40M7R0j32L3J13j43PJ27j19rJ33j01l5J28q2n7J52p8r2J51m4q4J29
4693F5k9r3J13jj28J13J6j33J06L9j45Q3N8j42P1Q1j50N2Q9j27M1J03j34MJ25
4718G7j18j9J30j07j6J42r1p0J35n8p8J42n5r5J49l1j16J27J0j26J19mj13J00
$$ plain form
4742 34 78 -83 -3 77 -65 4 63 -70 -11 87 -77 -43 76 -45 -45 65 -51 -53 80 -19 -71 77 2 -66 65 -12
4768 -12 -70 80 27 -81 61 35 -71 50 37 -73 56 62 -86 23 72 -62 15 60 -72 -1 86 -75 -22 74 -52
4793 -52 -29 75 -61 -51 94 -43 -69 69 -12 -66 69 -18 -61 83 5 -83 60 33 -68 57 19 -78 61 47 -86
4818 -86 29 57 -81 26 59 -92 15 73 -81 -14 62 -66 -12 72 -74 -38 82 -50 -63 71 -32 -51 74 -38
4842 -38 -72 89 -6 -80 78 20 -55 66 18 -82 75 49 -86 37 55 -68 39 52 -87 35 78 -88 -8 63
4866 63 -61 -9 61 -78 -23 89 -57 -39 80 -40 -45 79 -53 -70 85 -19 -79 65 2 -64 68 -3 -78 75
4890 75 23 -83 45 32 -77 45 45 -78 52 67 -69 20 67 -62 10 64 -69 -11 72 -67 -30 64 -47 -34 73
4915 73 -58 -56 76 -35 -58 71 -17 -64 73 -10 -70 70 20 -72 73 21 -56 53 29 -77 53 56 -88 36 63
$$ packed form
4742C4M4j61Q0Q0j42O9N9j33N9R8j64L4J19j21%J10j16kJ33r9n2J48p5o8J31p7
4768a2n8J50n3j08J42k6j06J21j3j10J29Oj48J09M9j34P7M5j32P1Q7j61N3R6j26
4793e2K3J04j36J0J45j37k6J38q1n4J35q7m3J44p8q8J43k7j01J25l8r7J39j4j33
4818h6J15K8j38J07L3j51J07N8j54O7P6j28N4Q4j46L6J20j32j3J34j03j9J25j12
4842c8l4J61r5p4J58n8p5J21m8j00J57k6j35J23J8j23J07J3j39J22M3j66Q0P1
4866F3j24N2P0j39N5J12j46J8J19j20nJ24j32j7J55j04o0J44o3o6J32p1p5J53
4890G5n2j06J28j3j09J22%j23J30J5j36Q9M7j29P2N4j33N8Q3j39L7R4j11J3J07
4915G3j31KJ32j11k3J29q8m7J37q3o0J40n0r2J45n2p7J09k4j06J30Lj44J24K7
$$ plain form
4940 63 -75 27 68 -80 0 75 -70 -15 63 -60 -32 62 -69 -48 75 -50 -48 75 -31 -57 68 -26 -78 70 4
4965 4 -67 67 13 -67 62 28 -81 55 37 -69 47 49 -74 31 62 -77 24 72 -69 11 71 -68 0 74 -55
4990 -55 -27 77 -47 -41 73 -44 -53 69 -30 -64 61 -29 -68 65 1 -73 72 18 -65 64 30 -77 71 62 -65 36
5016 36 52 -65 24 57 -76 20 81 -73 0 72 -53 -13 59 -70 -28 85 -46 -45 77 -35 -44 65 -38 -62 66
5041 66 -19 -78 61 11 -67 61 4 -76 55 39 -75 49 51 -60 35 46 -68 35 68 -73 2 66 -66 0 59 -72
5067 -72 -22 78 -61 -31 70 -40 -34 53 -51 -54 77 -17 -70 68 -13 -62 59 -18 -73 68 10 -85 39 31 -62 41
5093 41 32 -73 37 52 -83 17 64 -64 8 56 -69 7 71 -64 -22 81 -45 -37 59 -56 -42 79 -38 -72 58
5118 58 -18 -57 59 -27 -62 69 5 -78 48 20 -61 53 22 -68 53 49 -77 26 50 -52 16 57 -62 9 78 -70
$$ packed form
4940F3j38J02M1j48Q0P5j45N5P8j23K8R4j31K1J23j25KJ23j06k6J25r4n2J48o6
4965Dp1J34n4q0J29l4j09J36j8j06J16Kj23J05L1j39J01M8j41Q0O0j39O8P4j29
4990e5K8J04j24OJ14j17rJ22r9l4J25r0l9J33o4p4J45n4q3J29l4j07J48rj27J01
5016C6J6j17Q9L3j33R6O1j54P3P2j25M0P2j29M2J13j31JJ22j12rJ09j03k4J28
5041F6q5n9J39n0p8J28n7q0J31j6j14J24Kj11R5J1j14J03L3j41P5O4j32O6N9j31
5067g2N0J00j39L0J01j10OQ7j04lJ31r4n3J38q1m9J21p7n5J41n8r5J24qr3J03
5093D1rj05J10J5j35J00M7j28P2M8j25P6O4j35M2J03j26QR6j15J4J21j17l4J30
5118E8p6l9J16q6l5J31o4q3J26k8q1J14l1r0J21mj26J03K4j02O8M1j19P1O9j48
$$ plain form
5144 -70 -7 68 -45 -7 70 -63 -46 71 -51 -68 64 -31 -52 66 -37 -57 68 1 -74 45 6 -62 59 3 -71
5169 -71 74 37 -77 32 42 -53 28 44 -74 20 61 -63 -7 64 -49 5 69 -53 -9 81 -47 -38 61 -43 -40 56 -35
5196 -35 -48 61 -31 -68 56 -8 -68 51 -2 -66 45 8 -79 40 36 -59 43 49 -60 37 68 -57 12 57 -65 9 67
5223 67 -50 7 68 -48 -27 60 -49 -27 65 -52 -55 60 -36 -63 66 -14 -67 58 -9 -64 47 12 -73 51 5 -72
5249 -72 39 39 -54 45 49 -60 27 56 -56 31 74 -50 6 64 -42 -11 72 -57 -22 76 -39 -36 64 -37 -45 59 -38
5276 -38 -64 66 -21 -62 62 4 -63 49 6 -66 52 24 -71 38 33 -60 36 52 -65 23 49 -50 20 58 -39 10 65 -55
5304 -55 -8 73 -39 -9 66 -36 -23 66 -41 -46 60 -31 -58 55 -7 -65 59 3 -79 53 4 -73 39 19 -66 49
5330 49 32 -72 31 44 -54 36 55 -60 23 64 -58 -15 74 -48 -8 60 -51 -16 69 -26 -41 54 -30 -52 57 -35 -47
$$ packed form
5144g0O3P5j13L8P7j33J7J17j22j7J32r5k1J18j03k0J25o7p5J19l9o8J21n6p4
5169g1J45l7j14J09J0r5Q1J6j18R4M1j24N6P1j13N4O4j22M4R0j28RR9j04LR6r1
5196c5j3J09r2l7J24o4o0J19n3o4J11l7q7J19mr5J02Oj09R7L1j25O9M5j22P4N8
5223F7j17N7O1j16K1Q7j09K2R2j17lJ15r6k7J29q0n3J25o7n5J11l5q5J24m6p7
5249g2J11%r3R9Mj09Q7K9j12Q7M3j24N6N8j06L1Q3j29L5R8j15LJ00j01qJ04r7
5276c8k6J30q7m1J24n8o7J12m3p2J18k8r5J09nr3R6J6j17Q8K6r9P0L8r7M9N5j20
5304e5M7Q1j12L0P5j02J3Q9j07nJ06r1k7J13o2n8J24n6q2J32m9p7J12k0q5J15
5330D9j7j04J03J3r8R0J9j15Q3M1j22M3Q9j22M0O8j11L5Q5r5j5R5q4k2J09r2j2
$$ plain form
5357 -47 54 -16 -66 51 -1 -55 46 3 -70 55 28 -67 29 26 -49 30 38 -69 46 71 -53 13 54 -42 -3 49 -53
5384 -53 1 68 -41 -41 66 -29 -22 47 -45 -43 70 -19 -60 43 -14 -52 35 -16 -60 54 22 -62 27 17 -59 40 31 -76 34
5413 34 37 -64 -2 54 -51 12 40 -67 1 76 -46 -24 57 -26 -27 40 -50 -39 70 -22 -53 52 -2 -48 50 -22 -69 72
5441 72 8 -72 35 20 -51 35 6 -70 34 34 -66 18 56 -42 25 47 -62 19 77 -40 -7 65 -46 -13 60 -53 -29
5468 -29 70 -28 -47 61 -27 -40 64 -30 -64 50 -20 -69 44 -4 -61 47 7 -67 46 32 -69 17 40 -59 35 48 -60
5495 -60 30 59 -50 -1 59 -40 8 68 -50 -20 61 -35 -30 59 -25 -31 55 -31 -52 54 -9 -67 48 -14 -56 42 -2 -64 46
5524 46 15 -73 24 22 -54 34 34 -65 21 46 -50 17 60 -47 14 64 -50 0 75 -49 -29 65 -27 -25 60 -24 -39 63 -27 -47
5554 -47 46 -23 -64 37 -14 -69 28 -2 -71 35 17 -73 32 24 -69 32 41 -65 19 48 -61 18 61 -43 11 63 -41
$$ packed form
5357d7J01p0n0J17n2n4J01m3p3J25k7r5R6lp5P9Qj07J15K5j24O6M1r6L9N2j02
5384e3N4O7j09%J07r5PO9r2KJ13q9m1J03n7l8Q7n1m4J14l2q4Q9j0p6R9rj07J10
5413C4Lj01O2N6j05O3K8j07O8P5j22K2Q1q3jO7r0J1J09r2l1J05n4m6R8p2m7J41
5441G2o4q0J07j5p1Q6k9p6J04%j00Q4L8r8O7K2j09Q1N8j17L3P2j11L3P3j13K4
5468b9R9r8j9J08q8j3J04r4l4J14p0m9J13m8n7J08m0p4J13j4j01Q6K3r9R4J3j08
5495f0R0K9j09M9O0r9M8O0j18L0Q1r6NQ9q4oQ6q6k1J06o3n8J15o2m2R8m4o2J10
5524D6l1q8R7kp6Q8%r9Q6K5r6O7M3j07O1N0j14N0P5j24K0R4r2KQ5q4j5J02r0k0
5554d7R3o9m1J01n1n5R7l0o9J06j8r0J05qr3J01Rj06Q4K9j09P9M3j04N4N2j04
$$ plain form
5581 -41 -15 74 -35 -8 65 -44 -37 45 -35 -37 65 -27 -47 42 -12 -53 48 -8 -61 34 -1 -66 29 27 -52 32 31 -54 30 40
5611 40 -58 11 57 -55 3 52 -43 11 71 -46 5 64 -32 -21 51 -29 -38 62 -29 -37 59 -10 -43 52 -18 -53 47 -9 -62
5640 -62 30 16 -64 32 14 -55 25 16 -65 18 34 -51 27 48 -52 10 60 -45 -5 60 -27 -5 71 -41 -11 78 -42 -34 56
5669 56 -17 -41 44 -27 -53 51 -6 -60 31 -2 -53 36 -13 -62 37 18 -82 15 30 -55 27 30 -57 17 40 -53 4 57 -42 8
5699 8 54 -46 -3 76 -29 -33 55 -29 -18 49 -38 -42 61 -13 -55 43 -9 -51 36 -14 -69 37 6 -67 20 11 -59 12 21 -64 22
5730 22 36 -67 0 40 -34 13 47 -52 -2 66 -39 -19 54 -15 -9 47 -41 -27 52 -20 -46 53 -17 -51 34 -16 -57 41 1 -70
5760 -70 27 1 -56 28 4 -64 35 24 -63 11 30 -48 25 41 -56 -1 49 -34 -7 51 -32 -6 57 -37 -21 62 -26 -33 41 -21 -28
5791 -28 50 -17 -63 38 1 -51 23 0 -48 39 -6 -65 25 23 -62 14 23 -54 32 40 -47 10 51 -44 -2 58 -33 3 58 -34 -12
$$ packed form
5581d1K6Q9j09K7P3j09PQ2q0kJ02r2k0Q9n4m1J01n6n3R5l5o5R5kp9Q4jq5Q4J0
5611D0r8O9M6j12N8M9r5N4O0j17N1N9r6J1P2q0rJ00r1qR6o9l3R5p0l5J00n6n3
5640f2R2j4q0R6j8o9Q0rq1Q3J6q5P8K1j00O2N0j05M0O5q7K2P6j12L0Q9j20QR0
5669E6p3k4Q5p1k6J04n7n4R1l3n1Q9m9m9R9j9j00R7J5q5Q2Lq7P4K3r3N7N3r9N0
5699HM6j00M3P9j05mQ8q4J1O7q7mJ03p4m2R8n2m2Q7n0n5J06l1p3Q7rp0P1Rq5Q6
5730B2J4j03O7M0p4M7L4r9N0O8j05K0P3o9ON6q8J4P9p2k6R9p0l4Q5n0m1R8m0p1
5760g0R7k6n7Q4k4o8R9j1q7P4J9p8P3J6r7N5N0q3K7N8q3K6O3r4J6Q3q8pP4o2p
5791b8P8o7m6J01l7n2P4k3m8Q7m5n9R0kq5P6Rp7Q6Qq7N7M1r5M2O0r1L6N5r2K2
$$ plain form
5822 -12 53 -34 -23 55 -17 -23 44 -14 -35 53 -13 -45 31 -10 -53 25 -12 -66 25 1 -57 25 16 -65 7 8 -59 12 33 -36 -4 38
5854 38 -40 0 56 -33 -9 35 -34 -13 55 -17 -27 51 -28 -22 51 -11 -39 48 -2 -41 49 -14 -49 33 2 -57 28 21 -54 20 20 -50
5886 -50 17 18 -59 10 41 -45 10 50 -27 -3 44 -33 -6 56 -30 -36 48 -27 -24 44 -14 -27 60 -11 -35 34 -5 -34 32 -10 -41 43
5918 43 16 -50 28 16 -43 21 4 -49 18 32 -54 2 30 -35 19 33 -34 4 47 -33 -16 45 -17 -21 41 -23 -23 58 -17 -24 43 -13
$$ packed form
5822a2O5q7J1P8p2oO7n8k1Q8o6l2P6m1m3P8l7n4R1k4n8Q2rq1P2Jo7P1K1o9L2M2
5854C8p8M0N6q9K4M4o9K1O8p2j0P8p9OP3o2k8Q7n0l9R0o3l5Q2l1n9Q5pp5P4%p0
5886e0O7Jp7O9L1q6N5M0p7K4M7p7K7O2q6oQ4p5LO8n8j3Q7p1k4O9l9k9O6m2l1Q4
5918D3k7o6P8j2n9O4j7n3O7J4q6N6K8o5N4J4o7L8M3q0J7O1o2mO2o4%Q1p5pO7n6
$$ [...]
8191E5
##END NTUPLES=NMR FID
##END=
