##TITLE=1H_LY-16Dix.5.B
 CD3CN, 8 sc, 
 4.06.2021
##JCAMPDX= 6.0         $$ Bruker NMR JCAMP-DX V2.0
##DATA TYPE= NMR FID
##DATA CLASS= NTUPLES
##ORIGIN= UXNMR, Bruker Analytische Messtechnik GmbH
##OWNER= root
$$ XWIN-NMR		Version 3.5
$$ Fri Jun  4 11:27:13 2021 Russian Standard Time (UT+4h)  she@DPX200
##.OBSERVE FREQUENCY= 200.131506
##.OBSERVE NUCLEUS= ^1H
##.DELAY= (6, 6)
##.ACQUISITION MODE= SIMULTANEOUS
##.ACQUISITION SCHEME= undefined
##.AVERAGES= 8
##.DIGITISER RES= 18
##SPECTROMETER/DATA SYSTEM= spect
##.PULSE SEQUENCE= zg30
##.SOLVENT NAME= CD3CN
##.SHIFT REFERENCE= (INTERNAL, CD3CN, 0, 15.7039)
##AUDIT TRAIL= $$ (NUMBER, WHEN, WHO, WHERE, WHAT)
$$ ##TITLE= Audit trail, XWIN-NMR		Version 3.5
$$ ##JCAMPDX= 5.01
$$ ##ORIGIN= Bruker BioSpin GmbH
$$ ##OWNER= she
$$ F:/spectra/data/she/nmr/H-F/1/audita.txt
$$ ##AUDIT TRAIL=  $$ (NUMBER, WHEN, WHO, WHERE, WHAT)
(   1,<2021-06-04 11:26:07.84 +0400>,<she>,<DPX200>,
      <created by zg, POWCHK disabled, PULCHK disabled
       configuration hash MD5:
       00 E9 B6 7A A2 85 ED C7 34 08 36 98 17 FE 4E 26
       data hash MD5: 16K
       D3 44 62 FD 50 07 EB 65 4D 34 1E 7B BE 12 72 03>)
$$ ##END=
$$ 
$$ hash MD5
$$ 61 B1 62 7E FF 8A B1 6A 8A F4 B8 5D DA 53 40 D7
##$RELAX= 
##$RELAX= 
##$RELAX= 
##$RELAX= 
##$RELAX= 
##$RELAX= 
$$ Bruker specific parameters
$$ --------------------------
##$DU= <F:/spectra>
##$EXPNO= 1
##$NAME= <H-F>
##$PROCNO= 1
##$TYPE= <nmr>
##$USER= <she>
##$AMP= (0..31)
100 100 100 100 100 100 100 100 100 100 100 100 100 100 100 100 100 100 
100 100 100 100 100 100 100 100 100 100 100 100 100 100 
##$AQSEQ= 0
##$AQ_mod= 1
##$AUNM= <au_zg>
##$AUTOPOS= <>
##$BF1= 200.13
##$BF2= 200.13
##$BF3= 200.13
##$BF4= 200.13
##$BF5= 200.13
##$BF6= 200.13
##$BF7= 200.13
##$BF8= 200.13
##$BYTORDA= 1
##$CFDGTYP= 0
##$CFRGTYP= 5
##$CHEMSTR= <none>
##$CNST= (0..31)
1 1 145 1 1 1 1 1 1 1 1 1 1 1 1 1 1 1 1 1 1 1 1 1 1 1 1 1 1 1 1 1 
##$CPDPRG= <>
##$CPDPRG1= <>
##$CPDPRG2= <>
##$CPDPRG3= <>
##$CPDPRG4= <mlev>
##$CPDPRG5= <mlev>
##$CPDPRG6= <mlev>
##$CPDPRG7= <mlev>
##$CPDPRG8= <mlev>
##$CPDPRGB= <>
##$CPDPRGT= <>
##$D= (0..31)
0 1.2 0 0 0 0 0 0 0 0.06 0 0.03 0 0 0 0 0.0002 0 0 0 0 0 0 0 0 0 0 0 0 
0 0 0 
##$DATE= 1622791567
##$DBL= (0..7)
120 120 120 120 120 120 120 120 
##$DBP= (0..7)
150 150 150 150 150 150 150 150 
##$DBP07= 0
##$DBPNAM0= <>
##$DBPNAM1= <>
##$DBPNAM2= <>
##$DBPNAM3= <>
##$DBPNAM4= <>
##$DBPNAM5= <>
##$DBPNAM6= <>
##$DBPNAM7= <>
##$DBPOAL= (0..7)
0.5 0.5 0.5 0.5 0.5 0.5 0.5 0.5 
##$DBPOFFS= (0..7)
0 0 0 0 0 0 0 0 
##$DE= 6
##$DECBNUC= <off>
##$DECIM= 32
##$DECNUC= <off>
##$DECSTAT= 4
##$DIGMOD= 1
##$DIGTYP= 9
##$DL= (0..7)
0 120 120 120 120 120 120 120 
##$DP= (0..7)
150 150 150 150 150 150 150 150 
##$DP07= 0
##$DPNAME0= <>
##$DPNAME1= <>
##$DPNAME2= <>
##$DPNAME3= <>
##$DPNAME4= <>
##$DPNAME5= <>
##$DPNAME6= <>
##$DPNAME7= <>
##$DPOAL= (0..7)
0.5 0.5 0.5 0.5 0.5 0.5 0.5 0.5 
##$DPOFFS= (0..7)
0 0 0 0 0 0 0 0 
##$DQDMODE= 0
##$DR= 18
##$DS= 0
##$DSLIST= <SSSSSSSSSSSSSSS>
$$ [...]
##$SUBNAM2= <"">
##$SUBNAM3= <"">
##$SUBNAM4= <"">
##$SUBNAM5= <"">
##$SUBNAM6= <"">
##$SUBNAM7= <"">
##$SUBNAM8= <"">
##$SUBNAM9= <"">
##$SW= 20.0188882624521
##$SWIBOX= (0..15)
0 0 2 0 0 0 0 0 0 0 0 0 0 0 0 0 
##$SW_h= 4006.41025641026
##$TD= 16384
##$TD0= 1
##$TE= 0
##$TE2= 300
##$TE3= 300
##$TEG= 300
##$TL= (0..7)
0 120 120 120 120 120 120 120 
##$TP= (0..7)
150 150 150 150 150 150 150 150 
##$TP07= 0
##$TPNAME0= <>
##$TPNAME1= <>
##$TPNAME2= <>
##$TPNAME3= <>
##$TPNAME4= <>
##$TPNAME5= <>
##$TPNAME6= <>
##$TPNAME7= <>
##$TPOAL= (0..7)
0.5 0.5 0.5 0.5 0.5 0.5 0.5 0.5 
##$TPOFFS= (0..7)
0 0 0 0 0 0 0 0 
##$TUNHIN= 0
##$TUNHOUT= 0
##$TUNXOUT= 0
##$USERA1= <user>
##$USERA2= <user>
##$USERA3= <user>
##$USERA4= <user>
##$USERA5= <user>
##$V9= 5
##$VALIST= <valist>
##$VCLIST= <CCCCCCCCCCCCCCC>
##$VD= 0
##$VDLIST= <DDDDDDDDDDDDDDD>
##$VPLIST= <PPPPPPPPPPPPPPP>
##$VTLIST= <TTTTTTTTTTTTTTT>
##$WBST= 1024
##$WBSW= 4
##$XGAIN= (0..3)
0 0 0 0 
##$XL= 0
##$YL= 0
##$YMAX_a= 72192
##$YMIN_a= -75129
##$ZGOPTNS= <>
##$ZL1= 120
##$ZL2= 120
##$ZL3= 120
##$ZL4= 120
##$ABSF1= 10
##$ABSF2= 0
##$ABSG= 5
##$ABSL= 3
##$ALPHA= 0
##$AQORDER= 0
##$ASSFAC= 0
##$ASSFACI= 0
##$ASSFACX= 0
##$ASSWID= 0
##$AUNMP= <proc_1d>
##$AZFE= 0.1
##$AZFW= 0.1
##$BCFW= 1
##$BC_mod= 2
##$BYTORDP= 1
##$COROFFS= 0
##$CY= 11.3945322036743
##$DATMOD= 1
##$DC= 2
##$DFILT= <>
##$DTYPP= 0
##$F1P= 15.9154993809931
##$F2P= -4.1035820241983
##$FCOR= 0.5
##$FTSIZE= 0
##$FT_mod= 4
##$GAMMA= 1
##$GB= 0.15
##$INTBC= 1
##$INTSCL= 1
##$ISEN= 128
##$LB= 0.24
##$LEV0= 0
##$LPBIN= 0
##$MAXI= 10000
##$MC2= 0
##$MEAN= 0
##$ME_mod= 0
##$MI= 1.114404
##$NCOEF= 0
##$NC_proc= 0
##$NLEV= 6
##$NOISF1= 3.799351
##$NOISF2= 2.8
##$NSP= 1
##$NTH_PI= 0
##$NZP= 0
##$OFFSET= 15.70392
##$PC= 1
##$PHC0= -11199.3
##$PHC1= 8.200993
##$PH_mod= 1
##$PKNL= yes
##$PPARMOD= 0
##$PSCAL= 0
##$PSIGN= 0
##$REVERSE= no
##$SF= 200.130013532006
##$SI= 16384
##$SIGF1= 3
##$SIGF2= 2
##$SINO= 400
##$SIOLD= 16384
##$SREGLST= <1H.CDCl3>
##$SSB= 0
##$STSI= 0
##$STSR= 0
##$SW_p= 3612.71676300578
##$SYMM= 0
##$S_DEV= 0
##$TDeff= 0
##$TDoff= 0
##$TI= <>
##$TILT= no
##$TM1= 0
##$TM2= 0
##$TOPLEV= 0
##$USERP1= <user>
##$USERP2= <user>
##$USERP3= <user>
##$USERP4= <user>
##$USERP5= <user>
##$WDW= 1
##$XDIM= 8192
##$YMAX_p= 0
##$YMIN_p= 0
$$ End of Bruker specific parameters
$$ ---------------------------------
##NTUPLES= NMR FID
##VAR_NAME=  TIME,          FID/REAL,        FID/IMAG
##SYMBOL=    X,             R,               I
##VAR_TYPE=  INDEPENDENT,   DEPENDENT,       DEPENDENT
##VAR_FORM=  AFFN,          ASDF,            ASDF
##VAR_DIM=   8192,          8192,            8192
##UNITS=     SECONDS,       ARBITRARY UNITS, ARBITRARY UNITS
##FACTOR=    0.0002496,     1,               1
##FIRST=     0,             0,               0
##LAST=      2.0444736,     0,               0
##MIN=       0,             -75129,          0
##MAX=       2.0444736,     72192,           0
$$ Real data points
##PAGE= N=1
##DATA TABLE= (X++(R..R)), XYDATA
$$ [...]
$$ plain form
2313 1620 171 -1716 390 1645 -821 -1300 1259 877 -1601 -426 1700 -96 -1619 687 1478 -1105
2329 -1105 -1112 1466 696 -1616 -128 1673 -395 -1531 912 1260 -1285 -773 1615 322 -1714 166
2345 166 1541 -784 -1353 1217 993 -1510 -498 1648 -79 -1713 529 1447 -1045 -1120 1401 666 -1609
2362 -1609 -135 1677 -366 -1527 873 1276 -1277 -881 1538 422 -1579 195 1641 -603 -1402 1038
2378 1038 1026 -1420 -597 1638 150 -1594 394 1493 -878 -1237 1219 813 -1496 -340 1589 -188
2394 -188 -1550 680 1346 -1079 -950 1430 495 -1653 -61 1586 -459 -1404 982 1146 -1291 -704 1479
2411 1479 137 -1621 317 1515 -757 -1196 1206 832 -1470 -371 1603 -127 -1567 608 1374 -1021
2427 -1021 -1025 1351 625 -1455 -41 1543 -433 -1459 837 1174 -1197 -748 1498 369 -1539 141
$$ packed form
2313A620j449j887K106J255k466m79K559l82k478J175K126j796j523K306P91k583
2329a105pK578p70k312J488J801k068j136K443L48k545N12K388j293k036J880
2345A66J375k325n69K570k24k503J012K146j727j634K242R18k492p5K521p35k275
2362a609J474J812k043j161K400M03k553L96K419j116k001J774J446k244p99K440
2378A038j2k446Q23K235j488j744J988J099k371l59K456m06k309J156J929j777
2394a88j362K230O66k425J29K380r35k148J592J647k045r45K386J64k437N87K183
2411A479j342j758J938J198k272m39K402l74k302J099J974j730j440K175P66k395
2427a021mK376p26k080J414J584j976j026K296L37k371M49K246j129j908J680
$$ plain form
2443 141 1444 -680 -1330 1046 984 -1335 -549 1476 26 -1508 443 1366 -902 -1119 1208 654 -1484
2460 -1484 -259 1544 -219 -1387 758 1215 -1139 -893 1356 413 -1486 112 1534 -492 -1230 998
2476 998 978 -1325 -551 1481 120 -1520 356 1341 -784 -1074 1190 681 -1398 -312 1438 -241 -1516
2493 -1516 560 1182 -999 -833 1339 484 -1495 -141 1433 -404 -1321 823 1097 -1133 -675 1383
2509 1383 249 -1461 225 1418 -626 -1175 1004 793 -1294 -367 1489 -23 -1417 488 1239 -932
2525 -932 -1015 1178 568 -1331 -46 1474 -365 -1359 748 1069 -1106 -720 1334 287 -1411 196 1377
2542 1377 -608 -1185 971 904 -1226 -508 1342 -8 -1394 441 1328 -785 -1026 1117 671 -1349 -311
2559 -311 1325 -134 -1256 661 1132 -1022 -831 1218 446 -1349 -12 1353 -420 -1202 859 970
$$ packed form
2443A41J303k124o50K376o2k319P86K025j450j534J951R23k268k17K327n54k138
2460a484J225J803j763j168K145M57k354K46K249r43j899J598J422k026p38K228
2476I98k0k303P74K032j361j640J876R85k125k90K264n09k079J086J750j679j275
2493a516K076O22k181J66K172q55j979J354J574j837r17K144K74k230M58K058
2509A383j134j710J686J193k044n49K179k11k087R27J856j512j394J905P51k171
2525i32q3K193o10j899J285J520j839r94K107L21k175L86K054j047j698J607J181
2542A377j985n77K156o7k130P18J850j350j386J835Q87k113k41K143m46k020J038
2559c11J636j459j122J917M71k154J91K049p72j795J337J365j773p82K061J11
$$ plain form
2575 970 -1153 -593 1384 214 -1379 204 1202 -711 -1019 1042 731 -1251 -291 1384 -148 -1386
2591 -1386 480 1100 -911 -816 1203 484 -1353 -60 1349 -358 -1210 741 951 -1060 -613 1269 224
2608 224 -1325 235 1363 -540 -1118 872 771 -1184 -434 1323 42 -1283 422 1191 -800 -976
2624 -976 997 553 -1240 -172 1293 -250 -1263 627 1062 -941 -752 1163 362 -1307 30 1225
2640 1225 -476 -1073 889 877 -1086 -482 1229 38 -1307 328 1191 -670 -917 1046 645 -1205 -271
2657 -271 1261 -159 -1203 562 1041 -883 -766 1139 431 -1231 11 1252 -378 -1162 680 866
2673 866 -1004 -561 1212 274 -1207 152 1174 -594 -1052 877 725 -1073 -351 1269 -69 -1229
2689 -1229 406 1147 -732 -841 1017 503 -1177 -148 1222 -209 -1080 665 973 -940 -677 1099
$$ packed form
2575I70k123N60J977j170j593J583R98j913l08K061l11j982R60J675j532j238
2591a386J866O20k011R5K019p19j837J293J409j707q52J951K10k011M47J882j045
2608B24j549J560J128j903n78J990j01j955P50J757j281j325J705P69j991j76
2624i76J973m44j793J068J465j543j013J890M35k003J89J915q01j669J337J195
2640A225j701n97J962j2j963O04J711j191j345J635Q63j861k47J963m01j850R34
2657b71J532j420j044J765M79j924J17J905p08j662J242J241j630p84J842J86
2673H66j870M43J773r38j481J359J022j768m58J929j52j798P22J620j338j160
2689a229J635P41j879j09J858n14j680J029J370j431q71J745L08j913K63J776
$$ plain form
2705 1099 260 -1217 140 1235 -430 -967 831 747 -1065 -435 1160 52 -1171 347 1082 -681
2721 -681 -883 959 584 -1139 -246 1170 -184 -1179 468 975 -811 -683 1078 407 -1178 -57 1131
2738 1131 -372 -1075 689 881 -912 -517 1141 200 -1192 154 1123 -516 -918 837 662 -1041 -311
2755 -311 1175 -16 -1112 423 996 -762 -807 964 453 -1104 -73 1185 -235 -1075 563 813 -900
2772 -900 -581 1067 238 -1132 148 1116 -468 -968 753 702 -984 -399 1104 35 -1143 300 1066
2789 1066 -575 -828 860 554 -1057 -243 1091 -151 -1061 517 987 -740 -711 956 378 -1087 -50
2806 -50 1119 -299 -977 682 792 -848 -505 1064 175 -1087 165 1004 -562 -896 797 640 -961
2823 -961 -285 1066 -69 -1083 350 893 -713 -714 937 436 -1036 -104 1047 -268 -980 572 797
$$ packed form
2705A099q39j477J357J095j665n37J798q4j812O30J595j108j223J518P35j763
2721f81k02J842l75j723Q93J416j354r95J647N07j786J28J761o71j585J121J188
2738A131j503p03J764J92j793L95J658r41j392J346R69j639m02J755j75j703P30
2755c11J486j191j096J535N73j758m5J771n11j557J031J258j420q40J638K50j713
2772i00L19J648q29j370J280R68j584n00J721n1j686N85J503j069j178J443P66
2789A066j641k53J688l06j611Q14J334j242r10J578M70j727K9J667n78j465J037
2806e0J169j418o78J659J10j640L43J569q89j262J252Q39j566l34J693j57j601
2823i61O76J351j135j014J433N43j606jJ651n01j472R32J151j315p12J552K25
$$ plain form
2840 797 -846 -541 1009 258 -1057 97 1045 -378 -864 695 637 -931 -385 1048 95 -1019 305
2857 305 973 -583 -787 795 476 -1006 -213 1050 -117 -996 419 819 -740 -608 914 293 -1019
2874 -1019 18 1020 -317 -936 622 722 -756 -445 919 83 -1040 236 931 -493 -727 805
2890 805 535 -921 -204 995 -116 -975 407 868 -655 -618 849 344 -955 -16 990 -276 -906
2907 -906 532 706 -791 -457 926 186 -983 149 942 -455 -871 643 582 -847 -297 951 -3
2924 -3 -949 312 835 -612 -693 800 410 -933 -119 932 -213 -878 518 756 -727 -518 870 227
2942 227 -941 88 903 -356 -732 673 563 -849 -331 922 45 -927 273 847 -527 -664 737
2959 737 435 -893 -187 915 -127 -899 367 721 -667 -539 840 291 -948 -33 917 -280 -852
$$ packed form
2840G97j643L05J550p51j315J154R48j423m86J559n8j568N46J433r53j114J324
2857C05O68j556k04J582l19j482P93J263j167q79J415M00j559J32J522o21j312
2874a019J037J002j337o19J558J00j478L11J364q36j123J276O95j424k34J532
2890H05k70j456P17J199j111q59J382M61j523L7J467n05j299R39J006j266o30
2907i06J438J74j497L34J383p40j169J132P93j397m16J514o1j429N50J248r54
2924cr46J261N23j447q1J493l90j343Q14J051j145o65J396K38j483K09J388o43
2942B27j168J029Q15j259l76J405j10j412N18J253q77r72J200N74j374j37J401
2959G37l02j328P06J102j042p72J266L54j388J28J379n49j239R15R50j197n72
$$ plain form
2976 -852 502 661 -701 -386 885 124 -921 163 884 -409 -706 677 525 -810 -200 912 -61
2993 -61 -883 357 799 -575 -602 738 322 -860 -30 878 -241 -805 501 614 -733 -446 821 144
3011 144 -883 138 837 -414 -733 613 513 -782 -282 849 5 -847 281 772 -514 -609 731
3028 731 392 -839 -150 860 -130 -818 418 705 -606 -480 778 242 -878 20 856 -292 -737 538
3046 538 582 -701 -327 820 69 -850 196 786 -444 -657 630 423 -766 -157 836 -119 -811 342
3064 342 671 -605 -513 716 263 -809 -17 808 -264 -745 466 584 -656 -364 773 132 -806 150
3082 150 793 -372 -649 603 493 -721 -251 803 15 -767 284 716 -473 -551 659 332 -789 -100
3100 -100 796 -158 -745 407 599 -635 -442 730 179 -824 37 747 -306 -652 513 474 -683 -252
$$ packed form
2976h52J354J59j362L15J271p61j045J084P21j293k97J383j52j335O10J112r73
2993f1q22J240M42j374k7J340m16j182Q30R08j119n64J306J13j347K87J267o77
3011A44j027J021O99j251l19J346j00j295N00J131q44q52J128M91j286r5J340
3028G31l39j231O89J010r90o88J236K87j311J26J258n36j120Q98Q36j148m45J275
3046E38M4j283L74J147p51r19J046N90j230k13J287k07j189O09R93r55o92J153
3064C42L29j276R2J229m53j072P92Q25j072m81J211J18j240K92J137o41r38R56
3082A50O43j165k77J252j10j214M70J054p88p82J051M32j189p8J210l27j121O89
3100a00Q96r54n87J152J92j234J93J172n51j003Q61P10j053l46J165l9j157M31
$$ plain form
3118 -252 769 15 -785 215 701 -452 -544 644 367 -749 -123 780 -113 -719 345 607 -534 -411
3136 -411 689 204 -766 28 769 -247 -686 449 530 -630 -333 731 87 -775 145 725 -380 -618
3154 -618 551 409 -682 -181 763 -59 -743 286 657 -493 -512 638 271 -728 -39 745 -202 -677 422
3173 422 546 -584 -333 684 107 -729 149 699 -353 -594 535 424 -636 -223 693 -27 -685 272
3191 272 628 -460 -490 620 309 -710 -98 715 -153 -674 360 553 -556 -403 668 178 -723 12
3209 12 684 -262 -619 454 461 -621 -273 720 56 -712 171 657 -365 -506 569 361 -665 -130 727
3228 727 -71 -677 302 564 -493 -397 626 196 -700 10 681 -229 -629 392 446 -568 -292 645 54
3247 54 -706 134 628 -350 -537 495 370 -617 -167 688 -44 -670 244 597 -415 -448 569 266 -631 -53
$$ packed form
3118b52J021p54q00J000M86j153r2J188k77j116O26R03q93o06J064K62j141J23
3136d11J100m85r70P94P41j016m39J135Q1j160K97J064o44q62R20N80j105k38
3154f18J169j42j091N01R44q22o84J029L71j150j9J150l67r99O89P84r47m75J099
3173D22J24j130K51J017n77q36Q78N50j052k41J129j11j060M13R16p20o58R57
3191B72L56j088l0J110l11j019O12Q13q68n21J034J93j109J53J071m90r01P35
3209A2O72r46l57J073Pj082L48R93o64p68Q83M86j022j41J075k08j026N35Q57
3228G27p98o06R79K62j057R6J023m30q96P10O71r10m00J021N4j014K76R37n91
3247E4p60Q40M94r78j87J032j25r87M50Q55p32o26R14L53j012l3J017l03q97N78
$$ plain form
3267 -53 675 -143 -621 358 513 -517 -348 623 147 -683 65 674 -264 -565 434 404 -567 -229 630 1
3287 1 -635 202 580 -391 -477 525 283 -611 -97 630 -125 -611 316 509 -476 -362 564 163 -626 25 606
3308 606 -242 -532 420 419 -539 -263 609 70 -618 141 575 -314 -471 487 344 -581 -161 627 -21 -596 229
3329 229 518 -412 -385 564 242 -620 -48 622 -154 -586 296 436 -494 -298 569 81 -618 78 562 -291
3349 -291 -491 411 332 -530 -173 602 -19 -589 209 525 -341 -380 492 227 -563 -38 602 -139 -529 318 464
3370 464 -431 -311 538 139 -580 40 561 -226 -511 367 383 -500 -242 550 30 -581 124 517 -338 -452
3390 -452 457 291 -541 -138 556 -63 -550 225 470 -377 -335 503 188 -559 -1 562 -160 -490 327 387 -458
3411 -458 -238 530 73 -542 111 514 -258 -428 385 292 -494 -129 540 -28 -540 191 472 -355 -371 449 217
$$ packed form
3267e3P28q18m78R79J55j030J69R71m76q30P48O09r38l01R99l0r71L38Q59o29
3287Ao36Q37L78r71q6J002k42q94N14P27p55m86R27J93r85J14R26m01p89O51N81
3308F06q48k90R52jr58K76Q72n39o88P59M34q89j57R58j43r25M20P88o48n75Q25
3329B29K89r30K7R49l22q62N72O70p76m32Q82J40r30J96Q67m88o99O96M84q53
3349b91k00R02p9q62L57P75o21n70P98L16q66l9Q72k65p90N25O40p41l90Q47J46
3370D64q95J20Q49l99p19O20N21p87k85Q78J6q83K58P92n20o11P05L93q55j14
3390d52R09j66q32M03O94o19m87P75K45q47M2Q38l15p47N58N63p22l30Q17O0q45
3411d58K20P68m57o15O53M03p72j70Q13r3p86L65O69n68n12P31K81q27j6Q20k32
$$ plain form
3432 217 -517 -52 527 -122 -511 261 410 -407 -303 479 106 -551 32 522 -216 -470 355 352 -464 -220 505
3453 505 34 -516 144 479 -266 -372 424 266 -507 -99 530 -52 -480 249 431 -362 -297 461 171 -504
3473 -504 -4 481 -194 -449 302 321 -424 -201 474 53 -512 83 449 -276 -401 362 272 -447 -135 491 -21
3494 -21 -496 153 410 -312 -325 424 197 -485 -33 518 -99 -468 243 383 -364 -262 439 127 -480 54 491
3515 491 -180 -416 316 288 -436 -185 476 21 -489 123 431 -267 -366 353 213 -438 -79 466 -82 -460 212
3536 212 384 -319 -267 405 119 -474 11 452 -152 -414 292 348 -359 -211 415 48 -462 80 430 -222 -363
3557 -363 333 280 -413 -142 451 -6 -447 149 398 -290 -328 370 216 -424 -48 443 -99 -439 207 324 -355
3578 -355 -251 413 114 -452 14 407 -199 -385 286 265 -393 -165 428 20 -420 121 388 -243 -296 352 195
$$ packed form
3432B17p34M65N79o49l89P72J49q17J04P82l73o57N83M90p38k54Q25lq16K44P25
3453E05m71n50O60L35p45j06P96j58p73M08O29n82m28P29J82p93O5P58k90o75
3473e04N00M85o75k55P51J9p45K23O75m21n65N95L66p25j25P63r0p19L12O26n12
3494b1m75O49K57p22j3P49k27o82M52N51o17l69P11J40p47J02P01l12o07N34M37
3515D91o71k36P32k8p24K51O61m55n10O12L08o98r9P19j40o51L59N45n48l78O72
3536B12J72p03N2O72k86n93M85M41o04k62P06N6p07J48O26l67n10N42L50o52j41
3557c63O96n3o93K71N93m57m41N96K49o88l8O98j54o40L76M91n42l40O46J17o79
3578c55J04O64k99n66M66L93o06j86O71k1o58K28N93m08m40N41K67o31n3O48j57
$$ plain form
3599 195 -427 -74 456 -20 -404 200 359 -288 -255 382 130 -430 27 444 -129 -399 248 307 -364 -211 405
3620 405 69 -467 62 411 -207 -362 292 243 -386 -130 418 -33 -441 143 382 -260 -276 376 194 -416 -58
3641 -58 426 -102 -399 222 337 -308 -206 391 91 -416 52 401 -169 -360 277 255 -362 -132 423 32 -398
3662 -398 122 366 -240 -314 317 196 -385 -58 430 -51 -416 172 351 -291 -275 366 149 -419 -10 418 -120
3683 -120 -373 256 309 -342 -205 383 58 -418 82 410 -172 -308 328 245 -376 -127 394 -5 -382 156 349
3704 349 -245 -257 349 151 -387 -25 391 -94 -373 202 294 -314 -197 388 84 -410 11 357 -185 -350 248
3725 248 248 -336 -128 399 19 -417 89 368 -214 -285 323 210 -360 -62 425 -40 -380 184 353 -282 -254
3746 -254 349 137 -390 27 419 -112 -352 235 266 -332 -197 362 57 -364 89 354 -199 -315 280 196 -368
$$ packed form
3599A95o22L53N30m76l84O04J59o47L3O37k52n60M57M17n73k70O47N9o71J53O16
3620D05l36n36N29L49o18j55O54m9o29K56N48m51m08N84K39o42j6O52j82o10L58
3641e8M84n28k97O21J15o45J02N97l00n07M68L49n70j91O37k2o17K30N55l91m30
3662c98N20K44o06p4O31j21n81L27M88m81l65N88J79o42J6O41k17n68M09M28n38
3683a20k53O29N3o51J37N88l25m76N00L28n82j36O36q3o21K49N21l99l77N38J93
3704C49n94j2O06j98n38L62M16m85k79N75R2o08J17N85l04m94M21L46n42j65N98
3725B48%n84K08N27l80m36N06K79n82p1O08j13n70K98M87m65l40N64J69o35K8
3746b54O03k12n27M17L92n31k40N87L1n98J35N59l05m21M53K65n53j16N95q4n64
$$ plain form
3767 -368 -106 382 -21 -372 140 327 -240 -251 324 152 -374 -46 364 -103 -342 229 306 -280 -179 372 83
3788 83 -401 28 382 -139 -301 264 251 -324 -136 379 23 -390 97 357 -212 -298 308 188 -348 -59 403
3809 403 -57 -394 147 310 -275 -234 336 122 -351 -1 362 -137 -351 215 258 -310 -165 361 54 -347 81
3830 81 360 -181 -277 281 211 -326 -90 365 -8 -336 176 344 -234 -255 330 149 -386 -41 392 -61 -330
3851 -330 205 276 -310 -205 354 92 -384 24 349 -154 -330 240 252 -331 -135 380 4 -395 83 339 -194
3872 -194 -260 311 196 -333 -60 371 -55 -360 167 313 -237 -189 348 117 -357 9 360 -111 -309 217 248
3893 248 -295 -152 348 45 -358 74 350 -178 -295 240 190 -334 -92 381 -6 -366 111 329 -237 -258 302
3914 302 155 -345 -15 382 -78 -359 205 308 -265 -198 322 90 -359 32 362 -126 -282 261 253 -303 -138
$$ packed form
3767c68K62M88m03l51N12J87n67j1N75j72n26L28M10m67k39N71P7n86J01N51k89
3788H3m84M29L54n21j62N65j3n75J88N15l56m13M87K60n69q6O06j20n36K89M62
3809D03m60l37N41J63n85M1N70k14m73L50L63m99k14N66M3n68J45N26l07m01M28
3830H1K79n41r6N58p0n37K36M55l73l28N12J68n78k1N85j81n35L45M33m53k69
3851c30N35P1n86J05N59k62m76M08L25n03j76N70J2n83J96N15l76l99M78K56n33
3872a94o6N71j15n29K73M31m26l05N27J46n50M8N37k31m74L66L51m71j98N26L1
3893B48n43J43N00l03m03M32K76n28j17N35n0n24K42M73l87l60M77K18n66k1N60
3914C02j47n00L30L97m60k81N64J03n73O7N20k32m49L91L30m88j56N43qn56J65
$$ plain form
3935 -138 339 17 -346 121 357 -184 -255 288 185 -317 -71 338 -49 -311 162 276 -255 -199 314 119 -351
3956 -351 -7 334 -128 -332 205 237 -295 -147 356 58 -359 34 314 -170 -271 270 220 -308 -91 361 -2
3977 -2 -346 134 324 -211 -222 305 159 -357 -32 373 -55 -317 173 263 -291 -200 326 55 -336 32 323 -132
3999 -132 -318 228 167 -301 -153 348 68 -339 39 270 -150 -268 213 179 -308 -70 331 -73 -332 148 295
4020 295 -213 -202 266 128 -321 -16 347 -94 -286 204 254 -272 -153 329 65 -342 55 342 -142 -269 240
4041 240 205 -293 -104 335 -6 -343 93 283 -223 -230 276 145 -321 -36 317 -74 -324 160 208 -231 -107
4062 -107 308 73 -345 18 294 -117 -272 244 201 -283 -115 320 25 -315 103 317 -166 -230 259 165 -302
4083 -302 -57 329 -26 -305 153 283 -236 -208 286 97 -336 -25 328 -99 -304 170 225 -266 -155 306 45
$$ packed form
3935a38M77l22l63M67K36n41p1N43j03n02K46M09l87k62M73J14n31N6N13j95m70
3956c51L44L41m62k04N37L2n32J48N03k98m17L93K80m84j01N41n0n28K17M52l63
3977bl44M80J90n35j1N27j46n16L25M05m28k62M90R0n54R1N26k71l91L68K91m55
3999a32j86N46o1m68J48N01k80m07L78K31m20j18M81l4m87K38M01m04k59M80J47
4020B95n08J1M68j38m49L05L63m41j92M90N0n26J19M82k64m07L97K87m84j27N09
4041B40l5m98J89M39l41l37M36J90n06pN06j31m66K85L53l91k50M84M8m39J24
4062a07M15k35m18L63K76m11j55N16m3m84J68M35k95l40M18K14m83o4M89r4m67
4083c02K45L86l55k79M58J30n19K8M94j89m33L11L53m27k05M74N5m91J11M61k61
$$ plain form
4104 45 -323 51 305 -152 -247 235 202 -285 -87 316 -11 -314 105 290 -170 -194 265 133 -291 -27 311
4125 311 -67 -283 163 242 -218 -157 278 82 -301 26 297 -127 -267 188 191 -273 -116 299 22 -315 71
4146 71 271 -178 -251 239 165 -300 -63 312 -22 -299 128 268 -218 -199 276 113 -305 -10 319 -73 -272
4167 -272 195 233 -221 -140 277 44 -295 39 296 -115 -226 215 164 -262 -87 287 -6 -294 97 272 -176
4188 -176 -206 231 122 -286 -54 282 -66 -290 108 225 -215 -168 262 81 -296 16 283 -102 -236 189 215
4209 215 -226 -120 292 53 -290 54 284 -139 -216 235 176 -251 -59 290 -10 -279 116 244 -195 -194 230
4230 230 108 -282 -24 269 -67 -263 146 195 -228 -155 249 56 -284 31 262 -111 -233 185 162 -233 -96
4251 -96 268 15 -270 78 249 -150 -180 245 144 -259 -48 278 -25 -264 136 238 -180 -159 257 82 -284
$$ packed form
4104D5l68L74K54m57r5M82l3m87J98M03l27l03M19J85m60k4M59j32m24K64L38
4125C11l78k16M46P9m60O1M35j96l83L27K71m24j40M55Lm64J57M15k77l37L86
4146G1K00m49p3M90p4m65K37L75l34k77M27J40m86J9M75j63m18K95L29l92j99
4167b72M67L8m54Q1M17k33l39L34K57m11j11M41n1m26J75L74k93k88L91J75m48
4188a76l0M37j09m08K32L36l48k24L98J17m40M7M30j81l77L12K67l85j34M25K6
4209B15m41J06M12k39l43L44K30m23p7M51n9m27J92L49l00k69L95J28m39JM24
4230B30j22l90K58K93l36j96M09M9m23P3M04j93l40L15K31l73j22M18k3l95J37
4251i6L64k53k85L48J71l99l0M25j01m03K11L26l03k39M00J02m18K1M16j75l66
$$ plain form
4272 -284 -2 274 -84 -240 157 177 -241 -132 256 23 -287 49 264 -142 -221 186 131 -256 -64 258 -28
4293 -28 -267 90 216 -173 -165 224 93 -256 -3 274 -53 -241 147 208 -199 -117 246 70 -242 47 272 -102
4315 -102 -209 203 173 -237 -87 261 15 -256 86 244 -161 -202 210 131 -255 -54 257 -43 -249 115 210
4336 210 -194 -174 244 78 -249 13 252 -87 -234 171 195 -203 -88 271 50 -245 58 245 -131 -182 219
4357 219 161 -234 -48 283 -2 -233 103 209 -143 -200 244 97 -240 -11 267 -4 -214 119 203 -226 -127
4378 -127 193 37 -312 11 241 -187 -193 160 152 -240 -109 257 33 -249 76 246 -132 -184 217 130 -232 -35
4400 -35 275 -19 -234 125 227 -174 -147 235 76 -241 8 242 -72 -207 149 174 -198 -110 237 44 -253
4421 -253 39 219 -123 -209 154 129 -241 -64 233 -25 -253 80 217 -166 -182 204 95 -255 -22 256 -43
$$ packed form
4272b84K82K76l58j56L97K0m18J09L88k33l10L36K15m06p9M07n5l87J92L22k86
4293b8k39L57J26l89QL89j31l49K53K77l27j88L88O1m07Q2L63j76l12K89K25l74
4315a02j07M12l0m10J50L48k46k71L42J58m05m1M12p9l86K01L11l00k06L64R5
4336B10m04K0M18j66l27K62K39l39j47M05K4l98J15L59k21k95L03J87l76n1M01
4357B19n8l95J86L31k85k31L36J06l52n7M44j47l37K29K78k71k10L33Q4m29R9
4378a27L20j56l49L23K30m28oL53ql92J31L66k24k82L25J70l78n2M01q7l62J97
4400c5L10k94k15L59J02m01K7L82j59l17K49K34l14j35L56K5l72Q8L47j93k97
4421b53K92J80l42q6L63k5l70J77K97k58k28L33J37l83j6L86j09l50K33K78k99
$$ plain form
4442 -43 -241 124 205 -194 -126 243 67 -252 16 263 -89 -195 178 159 -223 -89 261 20 -230 24 232
4463 232 -133 -185 216 146 -224 -100 248 -41 -228 135 165 -218 -170 141 80 -240 6 191 -94 -178 111 184
4485 184 -298 -101 313 10 -192 91 235 -101 -139 263 151 -235 -46 245 -55 -224 97 147 -186 -137 264
4506 264 98 -221 14 240 -97 -197 130 143 -219 -121 199 57 -257 10 213 -123 -205 172 124 -229 -74
4527 -74 244 -3 -245 82 222 -137 -156 199 107 -225 -28 253 -40 -209 133 193 -165 -119 232 68 -242 26
4549 26 251 -85 -198 170 157 -214 -78 251 15 -239 59 227 -136 -186 193 114 -242 -49 249 -34 -258
4570 -258 100 225 -171 -163 196 73 -248 -1 241 -73 -220 148 177 -195 -99 232 51 -230 56 238 -95
4591 -95 -169 175 148 -203 -52 246 -7 -202 103 204 -156 -150 212 94 -226 -33 229 -62 -221 117 183 -193
$$ packed form
4442d3j98L65Q1l99O8L69j76l19K68K47l52j06L73j9l82J34L50k41k50K54K08
4463B32l65n2M01p0l70J24L48k89j87L63L0l83M8L11o1l20K46J85k85q4K89P3
4485A84m82J97M14l03k02K83J44l36l8M02j12l86J89K91l00j69L21N0l33M9M01
4506B64j66l19K35K26l37j00L27J3l62R8L20j42l14K67K03l36q2L77m8l53J55
4527g4L18k47k42L27J40l59j9L55r2l32J97K81k93j69L42O0l58M6L51j64l10K68
4549B6K25l36j13L68j3l71J36L29k36k54K98J68l63n0L79p9l56J93K98k83k24
4570b58L58J25l96QL59j23l21K47K42l14j47L68K9l72R6L31j81k81K86J82l33
4591i5p4L44k7l51J51K98k53j95L05J01l60OL62j18l20J93K62k91j59L38O6l76
$$ plain form
4613 -193 -140 218 57 -253 9 217 -112 -216 182 143 -218 -88 244 18 -241 97 230 -124 -129 203 98
4634 98 -211 -32 258 -28 -217 113 203 -164 -118 225 91 -225 15 237 -71 -205 143 166 -191 -82 236
4655 236 33 -230 47 218 -118 -182 168 122 -218 -53 236 -19 -245 95 215 -153 -151 203 76 -243 -6
4676 -6 254 -63 -228 148 200 -173 -124 240 60 -230 51 248 -84 -194 174 154 -197 -72 237 8 -229 89
4698 89 219 -142 -170 195 114 -217 -43 227 -54 -235 105 165 -178 -139 204 49 -238 3 213 -89 -205 162
4720 162 165 -193 -93 241 36 -230 51 229 -102 -160 206 139 -205 -42 261 5 -216 103 211 -146 -148 214
4742 214 95 -238 -7 245 -62 -212 135 165 -193 -129 228 41 -253 23 225 -108 -208 165 130 -220 -83
4763 -83 240 -23 -243 58 214 -131 -155 170 103 -247 -41 231 -32 -198 126 224 -161 -139 225 74 -225 8
$$ packed form
4613a93N3L58j61l10K62K08l29j04L98l9l61J30L32k26k59L38J33l54nL32j05
4634I8l09J79K90k86j89L30R0l67M6L43j34l16K40K22l08j34L48K3l57J09L18
4655B36k03k63K77J71l36o4L50m6l40J65K89k55k26L40J20l68KL54j27l19K37
4676fK60l17j65L76N2l73M9L64j80k90K81J97l32j10L68k0l51J25L09k29k37L18
4698H9J30l61k8L65q1l31J74K70k81j81L40O0l43L9L43j55k87K41K10l02j16L67
4720A62Ll58J00L34k05k66K81J78l31n8L66o7l44J63L03k56k21L19J08l57kL62
4742B14j19l33K31K52l07j50L47L0l58O4L57j87k94K76K02l33j00L73l5l50J37
4763h3L23k63k20L01J56l45k4L25o7l50K06K72k63j66L24R8l85K2L64j51k99K33
$$ plain form
4785 8 250 -74 -189 161 159 -200 -99 241 18 -239 15 201 -119 -174 164 126 -234 -41 257 5 -234 71
4807 71 183 -186 -170 201 86 -252 1 246 -51 -222 140 151 -221 -116 229 31 -215 45 235 -116 -191
4828 -191 193 174 -185 -70 246 -38 -257 99 244 -139 -156 163 98 -232 -47 239 -64 -239 97 173 -172
4849 -172 -182 256 81 -273 29 254 -113 -215 160 154 -210 -114 228 37 -250 71 160 -146 -229 236 137 -195
4871 -195 -9 269 -24 -233 30 252 -105 -182 204 23 -162 -33 237 -61 -151 122 228 -210 -111 204 113
4892 113 -244 39 144 -108 -188 144 163 -216 -56 250 -50 -227 66 145 -85 -144 254 118 -213 -14 268
4913 268 -43 -284 119 161 -224 -93 256 89 -233 39 197 -138 -162 251 153 -227 -78 304 61 -298 101
4934 101 197 -191 -147 142 90 -193 11 253 -58 -241 66 186 -187 -182 188 44 -255 -25 220 -73 -200 142
$$ packed form
4785HK42l24j15L50kl59J01L40k23k57K54J86l20n5L38l8l60J93K98k52k39L05
4807G1J12l69J6L71j15l38K53K45k97j71L62J1l72J05L45j98k46K60J90l51p5
4828a91L84j9l59J15L16k84k19L56J45l83j7L19o5l30J85K86l03j75L36P6l45
4849a72j0M38j75l54L02K25l67j02L75ol64R6L42j91k87L21Q9l06q3M65r9l32
4871a95J86K78k93k09K63K22l57p7L86j81j85J29K70k98r0K73J06m38R9L15r1
4892A13l57K83J05k52q0L32J9l79J60L06l00j77K93P9k30n9L98j36l31J99K82
4913B68l11k41M03M2l85J31L49j67l22K72J58l35k4M13r8l80J49L82k43l59L99
4934A01R6l88M4K89n2k83K04K42l11j83L07J20l73NL70j44k99K30K45k93j27L42
$$ plain form
4956 142 201 -185 -117 285 40 -247 70 220 -111 -153 190 128 -233 -57 257 -2 -229 117 250 -145 -168 232
4978 232 107 -233 -12 252 -59 -219 135 180 -211 -130 215 50 -239 23 222 -111 -210 162 136 -214 -98
4999 -98 228 5 -245 64 211 -132 -170 189 117 -211 -51 239 -28 -218 132 201 -143 -118 222 74 -235 9
5021 9 248 -53 -196 149 181 -193 -108 234 58 -249 38 218 -119 -199 175 133 -219 -65 249 -18 -249 72
5043 72 190 -165 -173 204 98 -232 -21 234 -61 -229 122 174 -174 -124 215 52 -239 17 236 -76 -185 156
5065 156 155 -190 -79 230 20 -221 80 227 -135 -190 170 102 -231 -54 237 -26 -240 98 198 -177 -166 211
5087 211 72 -257 -27 223 -89 -228 145 166 -198 -110 240 37 -246 35 229 -108 -174 189 149 -201 -66
5108 -66 240 3 -220 75 214 -139 -143 216 121 -228 -30 258 -40 -215 108 173 -169 -133 210 57 -241 11
$$ packed form
4956A42N9l86O8M02k45k87L17J50l31m2L43o2l61J76L14k59k27L46J33l95k3M00
4978B32j25l40K21K64l11j60L54M5l91Q1L45j65k89K62J99l33r9L72k6l50J16
4999i8L26k23k50L09J47l43l8L59p2l28J60K90k67j90L50O9l44K5L40j48l09K44
5021IK39l01j43L45L2l74Q5L42j76l07K87J80l37q0L74m2l52J54L14k67k31L21
5043G2J18l55qL77j06l30K11K55k95j68L51N2l48N0L39j63k91K56K19l12j09L41
5065A56jl45J11L09k10k41L01J47l62n5L60o8l33J77K91k63k14L38J00l75J1L77
5087B11j39l29K30K50l12j39L73K1l64Q8L50k03k83K81J94l37o6L63m0l50J35
5108f6L06k37k23K95J39l53mL59r5l49J98K88k98j75L23O5l42L6L43j53k98K52
$$ plain form
5130 11 223 -88 -212 133 134 -205 -90 221 9 -249 52 213 -128 -178 181 115 -229 -35 243 -35 -221 108
5152 108 209 -164 -153 217 89 -239 7 245 -49 -212 159 174 -195 -104 221 45 -243 35 235 -109 -189
5173 -189 171 135 -229 -77 222 1 -236 70 168 -147 -149 196 94 -228 -11 203 -69 -243 112 153 -184 -98
5195 -98 219 71 -237 27 224 -116 -204 151 165 -226 -52 260 12 -208 55 235 -77 -161 167 100 -191 -59
5217 -59 167 -57 -168 137 153 -226 -151 213 97 -251 13 254 -122 -229 127 165 -217 -106 217 19 -225
5238 -225 33 207 -116 -207 170 122 -212 -72 173 -29 -244 79 205 -147 -145 215 117 -246 -19 255 -48 -211
5260 -211 139 179 -196 -107 225 49 -252 23 222 -105 -222 152 155 -224 -95 231 -1 -251 58 201 -149
5281 -149 -187 196 115 -241 -36 245 -35 -242 95 183 -167 -147 227 82 -241 -6 248 -60 -210 148 162 -198
$$ packed form
5130A1K12l11j24L45Jl39J15L11k12k58L01J61l41n0L59o6l44J94K78k78j86L29
5152A08J01l73J1L70j28l28K46K38k94j63L71J5l69R1L25j76k88K78K00l44q0
5173a89L60l6l64J52K99k21k37L06R8l15kL45j02l22K17K14k72j74L55M1l37Q6
5195i8L17j48l08K64J97l40q8L55J4l91J74L12k48k20K63J80l12q4L28o7k91J32
5217e9K26k24j11L05J6l79P5L64j16l48K64K41l76j07L56L8l82J11L23j98k44
5238b25K58J74l23r1L77m8l34J40K45k02k15L23J26l52KL60r8l63K27K74l03j63
5260b11L50M0l75Q9L32j76l01K75J99l27j17L74Ll79J29L26k32k50L09J43l50
5281a49l8L83q1l56K05K81k80k07L37Q8l50K0L74j45l23K35K54l08j50L58J4l60
$$ plain form
5303 -198 -106 230 36 -236 61 236 -107 -192 172 130 -234 -74 244 -13 -254 86 209 -158 -172 190 71
5324 71 -260 -20 243 -72 -242 125 180 -192 -128 220 44 -246 34 242 -104 -209 173 177 -209 -77 253 12
5346 12 -238 67 228 -141 -178 199 116 -226 -36 242 -35 -226 112 197 -177 -140 212 73 -250 -12 228 -85
5368 -85 -228 125 162 -208 -115 223 39 -245 42 230 -136 -195 191 131 -241 -62 256 -13 -231 105 221 -148
5390 -148 -143 217 95 -235 -17 248 -48 -223 153 189 -185 -124 223 39 -255 25 243 -100 -195 168 146 -216
5412 -216 -96 225 -11 -254 66 207 -142 -175 183 102 -243 -49 243 -45 -239 101 184 -171 -119 222 66
5433 66 -260 15 241 -92 -207 166 183 -196 -86 258 23 -235 52 239 -133 -188 186 133 -220 -35 251
5454 251 -37 -249 121 205 -179 -171 200 86 -252 -20 238 -69 -235 141 168 -210 -126 220 26 -244 36 230
$$ packed form
5303a98R2L36j94k72K97J75l43q5L64m2l64J60L18k57k41L40J23l67j4L62j19
5324G1l31K40K63l15j70L67N5l72O4L48j76k90K80K08l46j05L82Ml86J32L30k41
5346A2k50L05J61l69l7L77q3l42J90K78k77j91L38Q5l74L7L52j39l23K38K40l13
5368h5j43L53L7l70R3L38j84k84K87J88l66n9L86o0l72J79L18k69k18L36J16l69
5390a48NL60j22l30K18K65k96j75L76L6l74O1L47j84k94K80K18l43r5L63k2l62
5412b16J20L21k36k43L20J41l49l3L58q1l45J94K92k88j94L40Q3l55N2L41j56
5433F6l26K75K26l33j15L73J7l79J10L44k35k58K87J87l72n5L74n3l53J85K86
5454B51k88k12L70Q4l84QL71j14l38K32K58l07j66L76K7l78Q4L46j94k70K80J94
$$ plain form
5476 230 -117 -205 176 152 -221 -73 248 6 -235 85 235 -134 -147 223 109 -237 -16 254 -42 -231 129
5497 129 195 -196 -139 232 46 -264 18 245 -102 -233 151 157 -238 -96 239 -2 -265 59 226 -150 -211 185
5519 185 114 -240 -51 253 -45 -234 109 203 -174 -155 216 77 -244 5 249 -77 -217 156 182 -198 -109 247
5541 247 35 -240 55 220 -125 -187 196 120 -248 -63 245 -20 -249 100 208 -178 -178 202 75 -263 -24
5562 -24 259 -79 -231 141 163 -209 -122 242 38 -255 36 230 -104 -195 184 153 -210 -58 257 2 -241 82
5584 82 215 -135 -155 211 117 -225 -25 249 -55 -242 120 190 -180 -136 220 54 -245 13 231 -106 -225 150
5606 150 152 -232 -110 241 15 -257 63 233 -136 -202 190 132 -236 -50 251 -24 -231 116 206 -171 -148 234
5628 234 99 -246 11 264 -60 -213 149 189 -199 -122 236 56 -249 42 219 -113 -191 174 135 -240 -83
$$ packed form
5476B30l47q8L81k4l73J48L21k42k41L20J50l69j3L70j14l46K21K70k96j89L60
5497A29O6l91N7L71j86l10K82K27l47j31L84Ol95J42L35k41k63L24J67l76o1L96
5519A85p1l54J89L04k98j89L43R4l77J9L71j39l21K49K44l26j40L73K6l80Q9L56
5541B47k12k75K95J65l45o2L83p6l68J85L08k65k29L49J08l86%L80j27l38K39
5562b4K83l38j52L72K2l72Q7L64k04k93K91J94l34r1L79l1l63J52L15k55k43L23
5584H2J33l50k0L66r4l42K00K74l04j87L62P0l70M4L56j66k99K58K18l37j19L75
5606A50Kl84J22L51k26k72L20J70l69o6L92n8l68J86L01k75k07L47R0l77K3L82
5628B34j35l45K57K53l24j53L62M0l88P7L58j80l05K91J77l32p8L65l9l75J57
$$ plain form
5649 -83 238 -6 -248 73 202 -160 -176 205 104 -261 -45 239 -56 -241 110 194 -179 -122 235 53 -248
5670 -248 12 251 -87 -205 159 157 -217 -89 262 19 -242 73 236 -134 -176 200 120 -243 -40 254 -32
5691 -32 -245 106 202 -174 -151 207 55 -246 2 227 -93 -242 132 160 -201 -123 229 36 -245 42 234 -113
5713 -113 -193 177 150 -213 -65 247 -7 -239 96 228 -152 -160 222 111 -229 -12 259 -54 -217 132 198 -191
5735 -191 -122 234 57 -251 26 235 -113 -209 176 160 -227 -81 237 -1 -258 65 212 -155 -172 201 110 -241
5757 -241 -34 247 -38 -235 124 198 -169 -135 219 81 -228 12 233 -75 -186 155 167 -195 -97 244 30
5778 30 -235 58 240 -126 -188 198 127 -229 -57 240 -23 -243 83 204 -168 -166 211 85 -251 -7 237 -81
5800 -81 -237 141 176 -203 -123 222 40 -250 43 231 -107 -199 179 149 -212 -61 243 4 -227 94 215 -136
$$ packed form
5649h3L21k44k42L21J29l62j6L81j01l65K16K84k95j85L51Q4l73N7L57j82l01
5670b48K60K39l38j18L64kl74J28L51k43k61L15J63l70m2L76q0l63K03K94k86
5691c2k13L51R6l76K3L58j52l01K48K25l20j49L74K8l61P8L52j93k81K87J92l47
5713a13q0L70k7l63J48L12k54k32L35J32l80qL82j11l40K17K71l13j63L49O6l89
5735a91O9L56j77l08K77K09l48r6L85j6l87J46L18k38k57L23J47l67j7L73r1l51
5757b41K07K81k85j97L59P4l67L4L54j38l09K40K21l08j11L41J2l62R8L41k14
5778C0k65K93J82l66o2L86p1l56J72K97k63k20L26J21l72KL77j26l36K44K44l18
5800h1j56L78L5l79Q0L45j82k90K93J88l38r2L78l0l61J51L04k39k31L21J21l51
$$ plain form
5822 -136 -155 197 110 -231 -20 239 -48 -216 123 178 -179 -132 214 65 -238 5 220 -99 -223 138 151 -214
5844 -214 -104 224 9 -243 50 210 -146 -190 187 103 -241 -53 240 -31 -233 110 201 -168 -143 212 89
5865 89 -225 5 244 -75 -204 149 179 -192 -106 235 38 -239 42 220 -109 -202 153 123 -222 -76 217 -12
5887 -12 -238 68 194 -159 -167 182 83 -220 -44 230 -53 -235 114 166 -173 -126 214 46 -239 31 229 -99
5909 -99 -190 172 164 -208 -90 235 7 -235 71 224 -136 -162 190 111 -228 -40 231 -43 -231 109 188 -177
5931 -177 -132 212 60 -239 -12 219 -85 -214 127 151 -197 -103 202 27 -227 43 199 -115 -181 171 117 -219
5953 -219 -43 236 -9 -235 96 188 -150 -143 177 86 -203 12 223 -61 -200 112 197 -186 -111 218 45 -239
5975 -239 15 213 -98 -213 144 116 -230 -94 225 -23 -258 63 200 -138 -199 184 111 -221 -46 225 -43
$$ packed form
5822a36j9L52q7l41K11K59k87j68L39N5l57M7L46j49l03K43K15l19j24L61J3l65
5844b14J10L28k15k52K93J60l56m4L77q4l44J88K93k71k02L43R1l69K5L55j23
5865H9l14K30K39l19j29L53L0l71Q6L41j97k77K81J78l29r3L55l0l45J46K93k29
5887a2k26L06J26l53qL49r9l03J76K74k83j82L49N2l39M7L40j68k85K70J98l28
5909i9r1L62ql72J18L25k28k42L06J53l60k6L52p9l39J88K71k74j88L40P9l65
5931a77M5L44j52k99K27K31l04j29L41K4l48R4L05j75k54K70J56l14o6L52n4l36
5953b19J76K79k45k26L31R2l38PL20r1k89K15K11k84j39L12Q5l83P5L29j73k84
5975b39K54J98l11j15L57k8l46J36L19k48k35L21J37l38o1L83p3l32J75K71k68
$$ plain form
5996 -43 -220 126 179 -138 -133 198 83 -215 -2 225 -66 -182 154 161 -182 -97 222 35 -222 40 206 -109
6018 -109 -166 175 129 -211 -61 227 -14 -226 83 185 -157 -156 203 74 -231 -12 219 -63 -217 126 160 -191
6040 -191 -104 216 10 -219 29 228 -105 -193 161 133 -192 -79 231 7 -209 57 209 -137 -131 194 100 -216
6062 -216 -16 217 -43 -201 100 185 -159 -140 165 60 -248 -21 203 -88 -219 146 135 -190 -86 241 -2
6083 -2 -220 19 188 -141 -191 157 146 -220 -49 223 -21 -228 85 197 -146 -111 211 90 -221 -13 228 -57
6105 -57 -182 153 147 -175 -107 196 43 -212 58 198 -115 -193 138 96 -195 -91 224 1 -256 57 199 -131
6127 -131 -123 135 70 -220 -29 221 -35 -202 123 180 -173 -139 220 71 -257 13 229 -79 -185 161 162 -163
6149 -163 -72 216 7 -229 73 218 -112 -191 191 103 -198 -16 215 -45 -212 112 188 -144 -175 101 42 -232
$$ packed form
5996d3j77L46N3l17NL31j15k98K13K27k91j16L36Pl43Q5L19j87k57K62J66l15
6018a09n7L41m6l40J50K88k41k12L09J02l42JL59j29l05K19K31k82j54L43L4l51
6040a91Q7L20k06k29K48J99l33q8L54k8l25J13L10k24k16K66J52l46OL25r4l16
6062b16K00K33k60j58L01Q5l44J9L05j05l08K27K24k91j31L65j1l25J04L27k43
6083bk18K39J69l29n0L48j1l66J71K72k44k07L13J12l43L5L22j21l11K08K41k85
6105e7j25L35ol22O8L03j53k55K70J40l13p8L31m2k91J04L15k23k57L13J42l30
6127a31QK58o5k90J91K50k56j67L25N7l53L4L59j49l28K70K16l08j06L46Jl25
6149a63R1K88k09k36L02J45l30p9L82q8l01J82K31k60j67L24P6l32l1K76n9k74
$$ plain form
6171 -232 -18 211 -153 -264 98 120 -159 -125 285 35 -248 25 207 -117 -211 190 125 -198 -33 235 -5
6192 -5 -209 86 201 -129 -125 195 95 -207 -13 236 -42 -196 169 160 -189 -112 211 40 -232 30 208 -109
6214 -109 -176 135 129 -170 -81 165 -34 -255 75 197 -149 -160 189 64 -205 -34 213 -59 -210 108 175 -153
6236 -153 -124 202 82 -214 8 210 -65 -178 150 155 -160 -80 229 28 -221 55 214 -111 -168 177 120 -197
6258 -197 -47 212 -24 -215 86 183 -156 -158 186 63 -222 4 220 -78 -213 119 154 -198 -105 226 43 -207
6280 -207 46 210 -102 -180 161 132 -192 -59 216 6 -193 87 205 -126 -137 189 107 -218 -16 223 -82
6301 -82 -180 111 172 -171 -107 193 45 -233 11 194 -88 -191 143 132 -207 -88 219 18 -231 51 192 -130
6323 -130 -156 179 95 -214 -28 231 -35 -217 98 184 -136 -116 227 76 -209 18 221 -73 -180 142 162 -167
$$ packed form
6171b32K14K29l64j11L62K2k79L4M10k50k83K73J82l24r4M01o5l23J65K68k40
6192ek04K95J15l30ML20j00l02J94K49k78j54L65rl49P7L23j71k72K62J78l17
6214a09o7L11ok99Q9K46j99k21L30J22l46j1L49j25k69J71K47k72j51L18O7l28
6236a53K9L26j20k96K22K02k75j13L28Nl15Q0L09k01k49K76J59l25n7L45n7l17
6258a97J50K59k36j91L01R7l39kL44j23k85K26K16k98j35L32L5l52R3L31j83k50
6280b07K53J64l12p8L41k9l24J33K75k10j99K80J18l31j1L26q2l25K02K39l05
6301h2r8K91O1l43O4L00j48k78K44J83k82j03L34j1l39J19L07k01k49K82J41l22
6323a30k6L35q4l09J86K59k66j82L15Q6l20K0L43j51k85K27K03k94j07L22K0l29
$$ plain form
6345 -167 -80 216 26 -214 57 215 -110 -179 146 107 -192 -62 210 -23 -214 90 173 -156 -156 171 73 -219
6367 -219 -6 215 -53 -186 130 164 -170 -104 215 58 -208 48 216 -95 -160 173 143 -189 -46 230 -3
6388 -3 -213 89 207 -128 -120 210 108 -215 -19 216 -47 -202 117 161 -168 -110 199 52 -229 11 208 -93
6410 -93 -195 137 127 -193 -85 213 17 -213 54 199 -123 -166 173 97 -199 -30 237 -15 -209 106 189 -133
6432 -133 -116 210 69 -201 21 242 -57 -176 147 150 -188 -77 213 12 -231 39 210 -121 -174 161 104 -219
6454 -219 -64 194 -43 -211 91 186 -144 -151 185 76 -211 -10 219 -54 -201 119 154 -160 -103 199 55 -202
6476 -202 27 207 -84 -169 166 148 -169 -65 217 8 -209 54 186 -127 -153 178 102 -197 -30 209 -53
6497 -53 -210 100 160 -185 -121 197 44 -214 3 213 -98 -175 145 137 -186 -84 215 18 -219 60 198 -111
$$ packed form
6345a67Q7K96j90k40K71J58l25o9L25l9k99J30K72k33j91L04Q3l29%L27r8k92
6367b19K13K21k68j33L16L4l34O6L19j57k66K56J68l11o5L33l0l32J43K76k33
6388ck10L02J18l35QL30j02l23J96K35k63j55L19M4l29N8L09j47k81K40J97l01
6410i3j02L32j0l20J08K98j96k30K67J45l22m3L39p6k96J69K67k52j94L15Q3l22
6432a33J7L26j41k70K22K21k99j19L23Ll38J11K90k01k43K70J71l31n3L35n7l23
6454b19J55K58k37j68L02R5l30pL36j09k87K01K29k73j47L20L5l14N7L02j44k57
6476b02K29J80k91q5L35j8l17J04K82k09k17K63J32l13k6L31p6k99J67K39k62
6497e3j57L10O0l45O4L18j53k58K17K10l11p7L20ql23J02K99j97k37K79J38l09
$$ plain form
6519 -111 -164 159 117 -199 -30 212 -3 -207 103 201 -156 -118 216 66 -231 -3 213 -55 -188 122 161 -155
6541 -155 -96 206 51 -229 15 192 -105 -163 164 104 -216 -63 202 -7 -238 70 157 -163 -152 194 78 -191
6563 -191 -13 246 -67 -182 118 174 -155 -101 233 55 -202 27 233 -93 -190 154 144 -194 -55 218 16
6584 16 -226 79 200 -98 -158 192 105 -233 -53 208 -55 -198 89 186 -180 -137 199 18 -248 -9 209 -63
6606 -63 -156 117 135 -187 -94 202 57 -170 63 224 -106 -151 171 71 -177 -33 228 -20 -195 121 176 -137
6628 -137 -95 154 122 -186 56 199 -33 -243 61 167 -190 -88 220 59 -281 3 231 -90 -156 144 103
6649 103 -211 -129 226 -26 -171 81 176 -127 -137 164 91 -174 -1 222 13 -178 116 158 -154 -100 203 65
6671 65 -198 35 200 -72 -169 148 126 -181 -63 216 9 -213 68 193 -126 -156 170 90 -211 -39 205 -37
$$ packed form
6519a11n3L23m2l16J69K42k15k04L10R8l57L8L34j50k97K28K16k68j33L10L9l16
6541a55N9L02j55k80K44J77k97n8L27o0l20J53K65k09k31L08Q7l20J1L46j16k69
6563a91J78K59l13j15L00N6l29N4L34j78k57K29K06l26r7L44j0l38J39K73k02
6584A6k42L05J21k98o0L50q7l38J80K61k63j43K87R7l66M3L36j81k66K39K18k72
6606f3r3K73J8l22R3K96j45k27K33J61l30m5L22j00k48J44K61k48j75L16N5l13
6628a37M2K49l2l08K42J43k32k10L04J06l57J02L08j61l40K84K28l21o6L00m1
6649A03l14Q2L55k52j45K52R5l03j0L01p3k65J73K23k09j91K94M2l12N4L03j38
6671F5k63K33J65k72r7L17k2l07J18K79k07k22K81J25l19l0L26q0l01J72K44k42
$$ plain form
6693 -37 -200 91 171 -145 -122 185 51 -241 2 200 -76 -175 122 144 -160 -73 192 25 -203 56 203 -99
6715 -99 -153 152 120 -157 -38 203 -11 -195 87 177 -139 -138 182 83 -199 -9 202 -64 -189 100 139 -176 -105
6738 -105 186 12 -218 20 182 -105 -169 150 121 -194 -66 208 3 -182 79 184 -126 -130 169 95 -193 -26
6760 -26 203 -37 -185 108 157 -155 -106 188 61 -204 8 197 -66 -164 120 121 -172 -86 190 2 -208 40
6782 40 168 -120 -154 161 85 -200 -48 188 -41 -206 67 162 -139 -124 169 54 -197 8 206 -54 -174 116
6804 116 143 -156 -73 203 37 -188 36 197 -82 -154 142 116 -161 -46 199 -15 -191 63 166 -123 -147 149
6826 149 74 -187 -37 176 -49 -188 90 142 -144 -109 167 28 -193 19 179 -83 -166 123 128 -167 -75 183
6848 183 10 -187 63 178 -101 -122 170 95 -174 -29 205 -17 -181 96 164 -139 -104 173 55 -188 0
$$ packed form
6693c7j63K91Q0l16K3L07j34k92K43J98k76r9K97K2l04Q7K65j67k28K59J47l02
6715i9n4L05l2k77J19K41k14j84K82R0l16JL20r9k82J90K11k66j25K89L9l15P1
6738a05K91j74k30K38J62k87o4L19k9l15J28K74k05j85K61J05l10mK99p4k88J67
6760b6K29k40j48K93M9l12M9K94j27k65K12J89k63r8K84Jk93Q6K76j88k10K48
6782D0J28k88l4L15p6k85J52K36k29j65K73R5l01J5K93j15k51K05J98k60j20K90
6804A16K7k99Q3K76j66k25K24J61k79p2K96k6k77J15K45k14j76K54J03k89k4K96
6826A49p5k61J50K13k25j39K78N2k86L5K76j39k21K12J60k62q3K89Nk95R2K58
6848A83j73j97K50J15k79k1K92p5k69J45K34k22j64K77O8l03L5K77j18k43J88
$$ plain form
6869 0 186 -73 -168 104 116 -159 -78 159 3 -193 31 163 -105 -155 129 97 -179 -66 180 -25 -191 66
6891 66 155 -118 -123 151 71 -176 -2 185 -42 -158 109 145 -140 -91 188 42 -178 33 183 -81 -135 142 112
6914 112 -176 -59 186 -11 -177 61 146 -124 -127 145 69 -186 -35 160 -52 -190 74 127 -144 -108 157 29
6936 29 -203 -5 180 -68 -168 108 112 -142 -69 175 25 -175 49 178 -95 -135 148 92 -158 -22 186 -5
6958 -5 -166 88 154 -120 -109 160 52 -183 -10 165 -64 -174 102 117 -162 -89 170 5 -187 43 166 -106
6980 -106 -154 128 91 -161 -46 167 -13 -170 75 161 -110 -104 161 72 -160 -4 178 -28 -155 103 141 -135
7002 -135 -98 164 46 -175 21 171 -69 -145 118 108 -161 -65 172 4 -187 39 163 -114 -133 132 77 -181
7024 -181 -34 171 -37 -175 84 134 -136 -95 156 45 -193 11 177 -49 -156 122 120 -143 -50 190 23 -157
$$ packed form
6869@J86k59r5K72J2k75Q1K37j56j96K24J32k68n0K84l2k76J13K46k05j66K57
6891F6Q9k73nK74q0k47J74J87k27j16K67L6k85M9K79j46k20K11J50k64n4K77l0
6914A12k88J17K45j97j66K38Q5k70lK72p6k55J51J95k12j38K64N3k71L6K65j28
6936B9k32J98J85k48j00K76Mk54P3K44j50k00K24J29k73m0K83n6k50J36K08j91
6958ej61K54O6k74J1K69j08k35J73J75k29j10K76J5k79P3K59j65j92K30J23k72
6980a06m8K82l7k52J15K13j80j57K45Q6k71OK65q9k32J56J82k06j27K58L8k76
7002a35L7K62j18k21J96J50k40p6K63j0k69R6K37j68j91K26J24k77j9K65n5k58
7024a81J47K05k08j38K59N0k70M1K51j11k38K04J66k26j07K78kk63R3K40j67j80
$$ plain form
7046 -157 53 172 -84 -134 143 96 -156 -30 198 0 -164 58 147 -111 -102 153 65 -174 -8 180 -59 -168
7068 -168 91 116 -141 -80 163 22 -175 27 163 -94 -139 110 108 -149 -54 171 -8 -162 72 151 -107 -107 154
7091 154 85 -162 3 177 -32 -145 99 145 -112 -81 157 43 -182 31 172 -63 -144 127 113 -93 -79 123
7113 123 31 -188 23 136 -98 -102 124 105 -140 -27 148 5 -158 81 149 -94 -96 142 73 -206 2 204 -9
7136 -9 -154 134 139 -132 -21 177 20 -163 54 160 -87 -120 136 72 -155 -19 187 3 -175 75 125 -112
7158 -112 -101 152 31 -171 -11 173 -67 -146 106 105 -128 -91 151 26 -158 12 173 -88 -134 123 89 -128
7180 -128 -29 179 18 -138 70 147 -85 -116 152 83 -148 -9 169 -36 -157 83 140 -112 -87 200 10 -205
7202 -205 14 157 -85 -131 143 123 -173 -72 142 -35 -182 141 144 -38 -113 130 84 -119 -8 211 -76 -214
$$ packed form
7046a57K10J19k56n0K77m7k52J26K28j98j64K22Q9k58RK55q8k39J66J88k39j09
7068a68K59K5k57O1K43j41j97K02J36k57m5K49kk57R5K25j79j54K34P9k58%K61
7091A54o9k47J65J74k09j13K44M6k57L1K38j14k25K13J41k35q1K71j4k06J4K02
7113A23r2k19K11J13k34mK26j9k45J13J75j43j63K39O8k43kK38o9k79K08K02k13
7136ij45K88Nk71J11J98j57j83K17J06k47l3K56o4k27J36K06j84j78K50N0k37
7158a12J1K53j21k02J60J84k40p9K52jk33L7K42j25j84J70J61k61m6K57l4k17
7180a28R9K08j61j56K08P7k32l1K68o9k31J39J78k05j21K40N7k52K5K87j90k15
7202b05K19J43k42m6K74k0k96J01K14j77j47L23Lj82p5K43m6k03J11K19k87j38
$$ plain form
7224 -214 114 217 -211 -67 77 83 -161 43 145 -116 -90 93 156 -148 -70 240 -11 -180 79 198 -42 -64
7246 -64 147 115 -237 -66 196 -66 -214 83 170 -118 -113 149 49 -146 -7 148 -60 -145 84 101 -137 -66 143
7269 143 12 -163 30 148 -84 -114 127 96 -138 -24 169 -5 -140 69 146 -96 -86 147 72 -151 -7 150
7291 150 -32 -139 78 115 -112 -75 144 26 -167 8 137 -76 -142 98 76 -140 -64 142 -17 -170 39 126
7313 126 -98 -112 124 58 -157 -10 148 -33 -147 88 122 -121 -67 152 40 -147 17 164 -48 -122 111 99
7335 99 -125 -61 144 1 -154 42 134 -82 -110 107 67 -139 -41 129 -35 -156 68 118 -113 -106 125 51 -162
7358 -162 -27 141 -51 -136 79 108 -114 -60 139 29 -142 31 146 -75 -111 122 88 -129 -28 157 1 -135
7380 -135 74 119 -90 -82 129 53 -145 -5 144 -43 -145 76 96 -127 -70 133 10 -164 9 135 -85 -129
$$ packed form
7224b14L28J03m28J44J44Ok44K04J02k61K6J83O3l04P8L10k51j69K59J19k40k2
7246f4K11l2l52J71K62k62j48K97Q7k88NK62j00j95J39J55k08q5K29J7k38P1K09
7269A43j31j75J93J18k32l0K41l1k34J14J93j74j35K09P7k42J0K33p5k23J44J57
7291A50j82j07K17L7k27L7K19j18j93J75J29k13o6K40k2k16P6K06j59j53K09Q7
7313A26k24j4K36o6k15J47J58j81j14K35L4k43N4K19j12j87J64J47k12p4K33j2
7335I9k24O4K05j43j55J96R2k16k8K17m0k06R8J70j64j21K24N0k31PK31p4k13
7358a62J35J68j92q5K15K9k22N4J99j10j71J73J15k21l6K33l4k17J01J85j56j36
7380a35K09M5k09QK11p6j98J40J49j87j02K21K0k23N7K03j23j74J73J26k20m4
$$ plain form
7402 -129 92 75 -139 -55 141 -8 -142 50 140 -73 -109 121 73 -139 -22 150 -11 -124 78 122 -95 -74
7424 -74 132 52 -138 4 136 -39 -121 94 100 -123 -58 134 13 -148 28 126 -81 -117 100 67 -148 -39 128
7447 128 -36 -155 47 109 -102 -96 121 53 -141 -7 141 -40 -123 93 112 -101 -68 144 29 -128 51 147 -57
7470 -57 -107 103 103 -117 -38 144 16 -122 52 109 -83 -87 117 57 -139 -25 123 -33 -131 58 99 -117 -80 118
7494 118 19 -149 -10 122 -62 -114 103 83 -126 -56 137 -1 -142 27 132 -55 -107 107 65 -130 -20 143
7516 143 -8 -121 58 115 -86 -82 123 60 -133 -10 137 -41 -130 67 95 -106 -75 120 16 -141 0 118
7538 118 -77 -124 89 63 -127 -51 136 -11 -145 44 109 -83 -99 116 53 -132 -9 138 -34 -123 78 107 -87
7561 -87 -59 131 30 -118 24 134 -56 -112 104 88 -124 -52 128 -2 -132 48 101 -74 -111 101 54 -138 -36
$$ packed form
7402a29K21j7k14Q4J96j49j34J92R0k13l6K30m8k12J17J72j61j13K02M4k17K1
7424g4K06q0j90J42J32j75q2K15Ok23O5J92j21j61J76R8k07l6K17l3k15J09J67
7447A28j64j19K02O2k11OK17o8j94J34J48j81q3K16J9k13L3K12j15j57J79R6k04
7470e7n0K10%k20P9J82j28j38J74N7j92mK04o0j96J14J48j56r8J89M1k16L7J98
7494A18r9j68J39J32j84n2K17k0k09P0J93j38j41J69J05j87n2K14m2j95J10J63
7516A43j51j13J79N7k01MK05o3j93J23J47j78q9J97K8k01L1J95j04j57J41J18
7538A18j95m7K13k6j90P6J87j47j34J89O5j92j6K15o3j85J23J47j72q9K01K9j94
7561h7K8J90j01j48J42J10j90n6K16j6k12P2J80j30j30J80N3j75l7K12m7j92J02
$$ plain form
7584 -36 112 -31 -140 44 94 -93 -93 110 19 -142 -3 123 -49 -121 87 96 -107 -50 139 17 -125 25 134
7607 134 -55 -74 109 76 -109 -18 147 -1 -120 54 102 -84 -73 126 51 -129 11 125 -38 -122 59 89 -104
7630 -104 -65 115 17 -128 13 124 -70 -103 78 70 -122 -48 126 -4 -117 41 115 -69 -87 103 54 -118 -20
7653 -20 132 -20 -117 76 106 -80 -63 107 44 -110 -2 126 -42 -98 75 75 -102 -42 123 -3 -135 22 102
7676 102 -80 -98 92 57 -132 -24 119 -21 -132 43 89 -76 -74 97 23 -126 -1 119 -39 -107 80 93 -94
7699 -94 -45 124 29 -108 30 136 -51 -88 83 83 -96 -29 130 9 -99 52 109 -69 -89 98 49 -109 -15 108
7723 108 -41 -120 55 89 -105 -79 93 16 -128 7 110 -55 -99 92 71 -105 -41 116 6 -112 46 101 -61
7746 -61 -64 107 61 -106 -3 121 -8 -106 71 99 -73 -54 110 48 -109 3 118 -33 -98 63 74 -95 -50 113
$$ packed form
7584c6J48j43j09J84N0j87%K03r1j61J39J26j72p2K08Rk03N7J89j22j42J50J09
7607A34j89j9J83l3j85R1J65j48j19J74M8j86J1J99p5j80J40J14j63q4J81L0j93
7630a04L9J80r8j45J41J11j94l3J81qj92P4J74j30j13J58P4j84j8J90m9j72R8
7653b0J52j52r7J93L0j86J7J70o3j54J08J28j68n6J73%j77O0J65j26j32J57Q0
7676A02j82j8J90l5j89J08J43j40j11J75M6j65KJ71p4j49J25J20j58o8J87J3j87
7699i4M9J69r5j37J38J06j87l7J71%j79O7J59j21j08J51N7j78k0J87m9j58R4J23
7723A08j49p9J75L4j94K6J72p7j44J35J03j65m4J91k1j76O4J57j10j18J58N5j62
7746f1lJ71m6j67J03J24j29r8J77K8j72J9J64o2j57J12J15j51o5J61J1j69M5J63
$$ plain form
7770 113 10 -119 16 106 -69 -100 80 57 -118 -28 112 -15 -114 52 91 -76 -68 94 42 -109 5 131 -26
7793 -26 -94 70 88 -73 -51 108 11 -103 24 110 -34 -82 85 70 -86 -31 112 -1 -105 39 99 -72 -84 80
7817 80 44 -117 -17 102 -34 -125 44 79 -89 -68 87 31 -110 -5 94 -50 -109 76 82 -91 -31 109 11 -97
7841 -97 23 113 -41 -61 98 71 -93 -13 125 -6 -89 54 100 -75 -61 101 40 -105 3 106 -44 -95 53
7864 53 66 -92 -44 97 13 -110 17 85 -55 -84 69 50 -109 -32 104 6 -102 32 87 -63 -57 83 49 -101
7888 -101 9 110 -13 -85 67 90 -64 -33 94 28 -99 13 116 -35 -72 90 80 -84 -40 120 -12 -85 29
7911 29 99 -74 -109 67 27 -90 15 83 -48 -143 57 75 -75 -42 51 36 -110 -34 73 -76 -91 66 44 -93
7935 -93 -31 126 -8 -45 44 103 -10 -77 43 87 -85 -34 116 24 -68 37 81 -23 -75 114 45 -102 29 99 -25
$$ packed form
7770A13j03j29J35R0j75l1J80k3j75R0J40j27r9J66L9j67QJ62n2j51J14J26j57
7793b6o8J64J8j61K2J59r7j14J27Q6j44m8J67j5j56N5J43j13j04J44O0j71j2J64
7817H0l6j61J00J19j36r1J69L5j68K1J55n6j41J05R9j44n9J85Oj73O0J40r8j08
7841i7J20R0j54k0J59k7j64Q0J38j31q3J43M6j75J4J62o1j45J08J03j50n1J48
7864E3J3j58M8J41q4j23J27O8j40k9J53j9j59P7J36r8j08J34N5j50OJ40l4j50
7888a01J10J01j23p2J52K3j54L1J27o6j27J12J03j51l7J62j0j64M4J60j32p3J14
7911B9P0j73l5J76m0j17J05O8j31r5K00J8j50L3R3j5j46P6J07j49j5J57k2j37
7935i3O2J57j34l7Q9N9j13o7J20M4j72N1J50r2r2J05M4j04n2J89o9j47J31P0j24
$$ plain form
7960 -25 -97 46 30 -133 -64 100 5 -91 11 90 -37 -99 82 59 -117 -9 95 2 -75 39 68 -52 -76 101
7984 101 78 -41 -19 65 -37 -81 112 83 -94 -70 91 31 -106 17 91 -37 -114 50 52 -108 -49 108 5 -129
8008 -129 29 99 -67 -139 50 67 -85 -45 104 -29 -111 41 131 -56 -51 64 12 -63 25 56 -39 -91 75 49 -92
8033 -92 -27 124 -18 -73 23 94 -73 -50 121 63 -4 -122 47 1 -89 11 17 -29 -29 41 42 -84 42 70 -59 -139 13
8060 13 17 -71 -1 81 14 -85 71 97 -47 -71 40 34 -104 -43 158 -65 -57 -24 115 -99 -77 61 7 -19 52 119 -24
8087 -24 -44 91 104 -34 -22 52 24 -125 -1 51 -10 -61 24 37 -75 -23 64 8 -105 6 76 -55 -72 68 27 -103
8113 -103 -20 81 -23 -88 36 70 -60 -44 80 31 -85 14 92 -19 -69 68 70 -60 -27 92 13 -75 26 81 -30
8138 -30 -45 67 36 -86 -12 77 -18 -81 33 54 -67 -51 69 20 -96 -5 77 -40 -103 44 43 -65 -37 79 8 -72
$$ packed form
7960b5p2J43j6j63O9J64r5r6J02P9j27o2J81k3j76J08J04r3p7J14K9j20k4J77
7984A01k3j19K2Q4j02m4J93k9j77K4J61o0j37J23P4j28p7J64Kj60N9J57j03j34
8008a29J58P0j66p2J89J7j52M0J49j33q2J52R0j87NJ15n2p5Q8L1r5n2J66k6j41
8033i2O5J51j42n5R6P1j67K3J71n8o7j18J69m6r0J00Om6%P0Jj26J26K8j29q0J52
8060A3Mq8P0Q2o7r9J56K6j44k4J11oj38O1K01k23QL3J39k14K2J38n4k6P1O7j43
8087b4k0J35J3j38J2P4k8j49J24N2o1n1Q5J3j12N2Q7n6j13J11P0j31j7J40m1j30
8113a03Q3J01j04o5J24L4j30J6J24m9j16R9P8j11n0J37Kj30L3J19p9q8J01N5j11
8138c0j5J12l1j22P4Q9r5o3J14K1j21J6J20m9j16R1Q2j17o3J47jj08K8J16p1q0
$$ plain form
8164 -72 22 68 -43 -52 69 51 -68 -9 91 3 -70 35 90 -38 -41 69 38 -64 3 84 -6 -74 36 69 -60 -46
8190 -46 63
$$ packed form
8164g2R4M6j11rJ21j8j19N9J00q8p3J05N5j28lJ10l1j02O7Q1r0o8J10L3j29J4
8190d6J09
8191F3
$$ Imaginary data points
##PAGE= N=2
##DATA TABLE= (X++(I..I)), XYDATA
$$ plain form
0 0 0 0 0 0 0 0 0 0 0 0 0 0 0 0 0 0 0 0 3 -8 8 -8 8 -8 9 -16 16 -16 21 -24 25 -32 33 -40 43 -49 56 -61 67 -75
40 -75 84 -94 103 -116 127 -140 154 -170 187 -207 228 -252 277 -307 338 -375 418 -467 524 -593 674
61 674 -778 912 -1090 1339 -1717 2342 -3582 6887 -33205 -75129 53454 50466 -59050 -28490
75 -28490 64255 1582 -58239 24164 51636 -47626 -39053 62427 23668 -71507 -4196 72192
87 72192 -14778 -66307 33787 54521 -46556 -36236 55744 13202 -61131 7242 58338 -27968
99 -27968 -49487 46653 39048 -57857 -24060 61228 4077 -61353 14683 54762 -31484 -41859
111 -41859 46799 26617 -56045 -8649 59482 -9678 -56222 26855 46756 -41933 -33382 52725
123 52725 18328 -55865 283 54482 -18776 -49237 32578 36556 -44811 -20868 53461 5383
$$ packed form
0@%%%%%%%%%%%%%%%%%%Lj1J6j6J6j6J7k5L2l2L7m5M9n7O5p3Q3r2J05j17J28j42
40g5J59j78J97k19K43k67K94l24L57l94M35m80N29n84O45p13P93q85R91j117J267
61F74j452J690k002K429l056M059n924J0469m0092m1924J28583k988j09516L0560
75b8490R2745o2673n9821Q2403K7472r9262Q573J01480l8759r5175O7311P6388
87G2192q6970n1529J00094K0734j01077J0320R1980m2542p4333O8373N1096q6306
99b7968k1519R6140p605r6905L3797Q5288n7151o5430P6036M0079q6246j0375
111d1859Q8658k0182q2662M7396O8131o9160m6544Q3077J9901q8689Q551Q6107
123E2725l4397p4193N6148N4199p3258l0461Q1815L978q1367K3943P4329m8078
$$ plain form
135 5383 -54899 10712 49695 -27097 -41265 39055 28070 -47003 -12108 50701 -3899 -48530
147 -48530 19978 42634 -32581 -31865 41769 17393 -47783 -2360 48869 -11496 -42942 26154
159 26154 34270 -37710 -23349 43392 8247 -46104 6997 44864 -20054 -38032 31383 27130
171 27130 -40374 -14628 44458 241 -44369 13729 39520 -26172 -30329 36757 19572 -41956
183 -41956 -5971 42971 -8792 -40955 21208 34471 -30472 -22855 38561 10506 -42426 1783
195 1783 40310 -15424 -35439 26697 27173 -34616 -15974 38811 2964 -39548 9631 36041 -21313
208 -21313 -29607 29736 19457 -35509 -7280 38734 -3870 -36377 15746 30881 -26536 -23553
220 -23553 33497 13736 -36160 -901 37139 -10333 -33642 20278 26034 -29084 -16736 34452
$$ packed form
135E383o0282O5611L8983p6792j4168Q0320j0985p5073L4895O2809n4600m4631
147d8530O8508K2656p5215P16P3634k4376o5176M5423N1229o0365l1446O9096
159B6154Q116p1980J4361O6741l5145n4351N3101L7867o4918j7978O9415m253
171B7130o7504K5746N9086m4217m4610N8098K5791o5692m157O7086j7185o1528
183d1956L5985M8942n1763l2163O2163J3263o4943P617O1416k8055n2932M4209
195A783L8527n5734k0015O2136M76o1789J8642N4785l5847m2512M9179K6410n7354
208b1313q294N9343j0279n4966K8229M6014m2604l2507N2123J5135n7417K983
220b3553N7050j9761m9896L5259L8040m7472k3309N3920N756n5118J2348N1188
$$ plain form
232 34452 5759 -36236 5718 34207 -16837 -29068 26048 20956 -32895 -11592 35135 -356
244 -356 -34962 11764 31845 -20540 -24036 28284 14243 -33735 -4500 34375 -6232 -31282 17333
257 17333 26646 -25227 -18700 30556 8649 -33285 1759 32480 -11917 -28592 20561 21746 -26941
270 -26941 -12477 31175 2699 -32015 6893 28613 -17017 -23539 24930 16714 -28950 -6687
282 -6687 31272 -3450 -30691 12330 25991 -20615 -18770 27360 10641 -30423 -959 30553
294 30553 -8820 -27740 17420 21729 -24791 -14315 28768 4842 -30125 5152 28906 -13897
306 -13897 -24426 20768 16415 -26926 -8126 29734 -520 -28492 10274 25542 -18173 -19927
318 -19927 23826 11973 -27317 -2804 28544 -5801 -26235 14216 21866 -20498 -14702 25130
$$ packed form
232C4452k8693m1995M1954K8489n1044j2231N5116n092n3851K1303M6727l5491
244c56l4606M6726K0081n2385l496N2320j4041m7978K9235L8875m0607k5050M8615
257A7333R313n1873O527M9256k1907m1934L5044L0721m4397j6675M9153J185m8687
270b6941J4464M3652k8476l4714L8908K1720m5630o522M8469q216m5664K2263
282f687L7959l4722k7241M3021J3661m6606J845M6130j6719m1064K9464L1512
294C0553l9373j8920M5160M309m6520J0476M3083k3926l4967L5277K3754m2803
306a3897j0529M5194m353m3341J8800L7860l0254k7972L8766J5268m3715j754
318a9927M3753j1853l9290K4513L1348l4345k0434M0451P650m2364N796L9832
$$ plain form
330 25130 6259 -27601 1941 26427 -10566 -22982 18156 17774 -23255 -10538 25642 1227
342 1227 -26932 6814 24699 -14284 -19587 20919 13176 -25017 -5407 26357 -3176 -25246 11332
355 11332 21740 -18084 -15860 23211 8815 -25326 -110 25679 -8100 -23539 14822 18228
367 18228 -20673 -11390 24656 4211 -25272 3869 23329 -12104 -20171 17931 14396 -21936 -6976
380 -6976 24102 -729 -23605 8391 20804 -15120 -16015 20213 9651 -23346 -2580 23970 -4520
393 -4520 -21635 11981 17974 -17820 -12784 21065 5445 -22915 1965 22423 -8808 -19119 15200
406 15200 13916 -20507 -8222 22852 1186 -22986 6041 20851 -12528 -16501 17958 10878 -21301
419 -21301 -3954 22545 -3223 -21587 9672 18197 -15109 -12347 19942 6274 -22160 311
$$ packed form
330B5130j8871l3860K9542K4486l6993j2416M1138l82m1029J2717L6180k4415
342A227k8159L3746J7885l8983n303M0506p743l8193J9610L1764k9533k2070L6578
355A1332J0408l9824K224L9071j4396l4141K5216K5789l3779j5439L8361L406
367A8228l8901R283L6046k0445k9483K9141J9460l5433q067L8102l535l6332J4960
380f976L1078k4831k2876L1996J2413l5924q95L6228j0562l2997K0766K6550k8490
393d520j7115L3616N993l5794N036L3849j5620k8360K4880K0458l1231j0311L4319
406A5200j284l4423J2285L1074k1666k4172K9027J4810l3379l973L4459p080l2179
419b1301J7347K6499k5768j8364L1259Q525l3306K762L2289j3668k8434K2471
$$ plain form
431 311 21658 -7390 -19581 13156 15383 -17356 -9249 20159 2263 -21392 4115 19845 -10403
444 -10403 -16557 15309 11325 -18849 -5057 20571 -1469 -19975 8011 17623 -13573 -13678 17362
457 17362 8057 -19287 -1014 20245 -5201 -18587 11063 14965 -16106 -10207 19093 4265 -19933
470 -19933 2524 19087 -8977 -16521 14111 12003 -17989 -6611 19541 96 -19504 6191
482 6191 17489 -11721 -13515 16309 8495 -19207 -2961 19613 -3224 -17988 9457 15294 -13947
495 -13947 -10548 17240 4880 -18904 936 18415 -6625 -16005 11759 12145 -15653 -7149 17969
508 17969 1496 -18465 4120 16760 -9735 -13781 14088 9353 -16824 -3706 18158 -2069
520 -2069 -17654 7298 14948 -12092 -10795 15875 5973 -17552 -190 17691 -5505 -16024 10543
$$ packed form
431C11K1347k9048j2191L2737K227l2739Q107K9408j7896k3655K5507J5730l0248
444a0403o154L1866l984l0174J3792K5628k2040j8506K7986R612l1196j05L1040
457A7362r305k7344J8273K1259k5446j3386K9650L902l1071N899K9300j4828k4198
470a9933K2457J6563k8064p544L0632k108k9992J1378K6152j9445j9600K5695
482F191J1298k9210j794K9824p814k7702J6246K2574k2837j4764K7445N837k9241
495a3947L399K7788j2360k3784J9840J7479k5040r380K7764L86k7798Q504K5118
508A7969j6473j9961K2585J2640k6495m046K7869m735k6177J3118K1864k0227
520b069j5585K4952P650k7040J297K6670r902k3525J7362J7881k3196j0519K6567
$$ plain form
533 10543 12610 -14579 -7969 16995 2441 -17768 3216 16772 -8446 -14056 12578 9678 -15938
546 -15938 -4874 17168 -534 -16656 6022 14749 -10695 -11326 14155 6574 -16290 -1254 17036
559 17036 -3716 -15611 8658 12938 -12434 -8788 15105 3939 -16188 1227 15586 -6341
571 -6341 -13568 10702 10232 -13862 -5791 15553 469 -16136 4337 14589 -9044 -11710 12800
584 12800 7718 -15209 -2995 15901 -2208 -15176 7101 12969 -11060 -9203 14127 4751 -15485
597 -15485 440 15496 -5321 -13784 9687 10631 -13041 -6483 15080 1864 -15347 3078 14160
610 14160 -7716 -11813 11205 7997 -13755 -3536 14904 -1165 -14498 5654 12557 -9632 -9464
623 -9464 12550 5442 -14124 -825 14408 -3689 -13103 7993 10724 -11249 -7148 13379 2763
$$ packed form
533A0543K067k7189O610K4964j4554k0209K0984J3556k5218n610K6634k900k5616
546a5938J1064K2042j7702j6122K2678Q727k5444o31K5481p581k2864J5036J8290
559A7036k0752j1895K4269M280k5372L646K3893j1166k0127J7415J4359k1927
571f341p227K4270m70k4094Q071K1344j5084j6605K0473J0252k3633k666K4510
584A2800n082k2927J2214J8896j8109j2968K2277N868k4029J857K3330r376k0236
597a5485J5925J5056k0817q463K3471R44k3672O558K1563j3216j7211J8425J1082
610A4160k1876m097K3018l208k1752J0219J8440j6069j3333K0152O903k2189J68
623i464K2014p108j9566J3299J5233j8097r414K1096K731k1973M101K0527j0616
$$ plain form
636 2763 -14273 1817 13696 -6210 -11692 10015 8516 -12834 -4680 13992 7 -13957 4503
649 4503 12404 -8620 -9681 11774 5995 -13710 -1760 14183 -2640 -13120 6896 10906 -10297
662 -10297 -7452 12870 3587 -13813 788 13429 -4955 -11625 8690 8739 -11448 -4990 13111
675 13111 876 -13427 3138 12144 -7058 -9857 10056 6381 -12301 -2532 13142 -1622 -12749
688 -12749 5406 10887 -8724 -7914 11216 4201 -12568 -21 12804 -3932 -11541 7561 9169
701 9169 -10315 -5666 12149 1620 -12719 2618 12103 -6473 -10200 9556 7174 -11717 -3491
714 -3491 12589 -678 -12359 4598 10848 -8056 -8311 10559 4867 -11991 -874 12294 -3077
727 -3077 -11277 6789 9298 -9597 -6308 11489 2821 -12050 1091 11551 -4774 -9948 7964
$$ packed form
636B763j7036J6090J1879j9906n482K1707j499k1350Q154J8672j3985j3964J8460
649D503P901k1024j061K1455n779j9705J1950J5943j6823j0480K0016M010k1203
662a0297K845K0322r283j7400J4601J2641j8384o670K0315M9k0187O458J8101
675A3111j2235j4303J6565R006j9202k799J9913l675j8682R769J5674j4764j1127
688a2749J8155N481j9611Q10J9130p015j6769J2547J2825j6736p609J9102J608
701I169j9484M649J7815j0529j4339J5337R485j8576l727J9756k382j8891Q226
714c491J6080j3267j1681J6957O250j8904k55J8870n692j6858J1117J3168j5371
727c077q200J8066K509j8895L289J7797q668j4871J3141J0460j6325n174J7912
$$ plain form
740 7964 7409 -10300 -4202 11479 405 -11625 3279 10447 -6806 -8389 9468 5354 -11298
753 -11298 -1991 11735 -1771 -11100 5312 9414 -8248 -6718 10398 3436 -11420 282 11347
766 11347 -3880 -9941 7309 7778 -9788 -4676 11360 1255 -11575 2387 10620 -5809 -8691
779 -8691 8557 5884 -10485 -2623 11271 -924 -11018 4151 9375 -7235 -6982 9530 3976
792 3976 -10775 -599 10916 -2799 -9942 5822 7917 -8262 -5060 9995 1882 -10676 1465
805 1465 10334 -4523 -8829 7182 6342 -9307 -3382 10386 18 -10459 3290 9455 -6228
818 -6228 -7527 8332 4524 -9870 -1191 10440 -2107 -9837 5258 8342 -7719 -5873 9445
831 9445 2798 -10164 710 10047 -3935 -8823 6845 6893 -8728 -4059 9793 756 -10005 2407
$$ packed form
740G964n55j7709O098J5681j1074j2030J4904P168j7253j583J7857m114j6652
753a1298R307J3726j3506r329J6412M102j7662J530J7116o962j4856J1702J1065
766A1347j5227o061J7250M69j7566N112J6036j0105j2830J3962Q233j6429k882
779h691J7248k673j6369P862J3894j2195j0094J5169N224j6610K53J6512n554
792C976j4751J0176J1515j3715p143J5764K095j6179L202J5055q113j2558J2141
805A465Q869j4857m306J6011q40j5649N925J3768j0368j0477J3749O165j5683
818f228j299J5859l808j4394Q679J1631j2547p730J5095L084j6061J846J5318
831I445o647j2962J0874R337j3982m888J5668M8j5621M669J3852r037j0761J2412
$$ plain form
845 2407 9096 -5423 -7381 7822 5058 -9365 -2331 9665 -1042 -9376 4035 8032 -6662
858 -6662 -5930 8575 3269 -9590 -329 9544 -2667 -8511 5433 6711 -7638 -4227 9175 1585
872 1585 -9416 1533 8869 -4496 -7477 6878 5212 -8642 -2350 9684 -463 -9513 3250
885 3250 8199 -5944 -6286 7854 3652 -9011 -679 9254 -2292 -8555 5012 6954 -7211 -4649
899 -4649 8626 1774 -9286 1157 9046 -3738 -7602 6193 5599 -7966 -3218 8647 262 -8649
913 -8649 2652 7928 -5075 -6260 6962 3844 -8399 -1278 8764 -1524 -8334 4121 7017
926 7017 -6283 -4945 7899 2552 -8531 239 8319 -3072 -7369 5569 5817 -7163 -3214 8482
940 8482 624 -8742 2002 7924 -4612 -6404 6746 4350 -8038 -1733 8498 -1097 -8260 3600
$$ packed form
845B407O689j4519j958J5203k764j4423P034J1996j0707q334J3411L997j4694
858f662P32J4505n306j2859R261R873j2211n844J3944J278j4349L411J3402p590
872A585j1001J0949P336j3365k981J4355j666j3854O292J2034j0147r050J2763
885C250M949j4143l42J4140m202j2663Q332R933j1546o263J3567J942j4165K562
899d649J3275o852j1060J0443P889j2784l864J3795n94j3565M748J1865q385q911
913h649J1301N276j3003j185J3222l118j2243P121J0042j0288o810J2455K896
926G017j3300J338J2844n347j1083Q770Q080j1391m297J2938K48j2980L949J1696
940H482p858r366J0744N922j2536j792J3150k396j2388O305J0231r595p163J1860
$$ plain form
954 3600 6949 -5925 -5174 7393 2654 -8310 7 8372 -2526 -7501 4802 5757 -6781 -3728
968 -3728 7835 1286 -7939 1612 7652 -3927 -6424 5834 4425 -7279 -2056 8050 -342 -7831
982 -7831 2864 6923 -4996 -5273 6649 3089 -7679 -710 7707 -1991 -7169 4421 6025 -6116
996 -6116 -3983 7287 1437 -7972 949 7568 -3349 -6314 5651 4753 -7061 -2580 7681 -1
1010 -1 -7656 2492 6798 -4705 -5301 6422 3291 -7408 -916 7670 -1527 -7209 3597 5710 -5669
1025 -5669 -3975 7033 1999 -7385 473 7140 -2888 -6379 4726 4755 -6188 -2576 7279 562
1039 562 -7295 1711 6607 -3791 -5198 5544 3332 -6796 -1179 7279 -1044 -6919 3321 6018
1053 6018 -5110 -4465 6190 2039 -7165 177 7223 -2249 -6295 4314 4804 -6002 -3065 6725
$$ packed form
954C600L349j2874P51J2567m739j0964Q317Q365j0898m975J2303R55j2538L053
968c728J1563o549r225R551O040j1579k497J2258j409j1704N223J0106q392p489
982g831J0695M059j1919k77J1922l560j0768O969Q417r698n178J1590J604j2141
996f116K133J1270n850r409Q921O619j0917k965J1965q98j1814M481J0261p682
1010ap655J0148M306j1503n96J1723l131j0699O492Q586r197n682J0806K113j1379
1025e669J694J1008n034r384P858O667j0028l491J1105K9j0943L612R855o717
1039E62p857R006M896j0398j407J0742k212j0128N617Q458q323n875J0240K697
1053F018j1128O45J0655m151r204P342P046r472m046J0609M90j0806K937R790
$$ plain form
1067 6725 672 -7004 1730 6700 -3721 -5515 5449 3885 -6483 -1691 6991 -580 -6882 2637
1081 2637 5951 -4421 -4339 5990 2627 -6603 -490 6467 -2025 -6170 3896 5063 -5299 -3258
1095 -3258 6388 1287 -6803 677 6317 -2839 -5377 4640 3933 -5902 -2019 6607 33 -6428 2222
1110 2222 5778 -4171 -4652 5444 2773 -6327 -603 6805 -1259 -6203 3201 4920 -5115 -3566 6109
1125 6109 1604 -6506 627 6389 -2669 -5590 4370 4123 -5721 -2385 6356 314 -6425 1684 5874
1140 5874 -3371 -4469 5076 2955 -6099 -1230 6224 -897 -5939 2929 5254 -4303 -3660 5478 1747
1155 1747 -6313 -59 6101 -1897 -5370 3654 4136 -5038 -2514 5899 646 -6163 1242 5661 -3202
1170 -3202 -4797 4620 3279 -5493 -1150 6264 -622 -6148 2307 5143 -4027 -3800 5345 2226 -5811
$$ packed form
1067F725o053p676Q734M970j0421j794J0964j564j0368M792Q682p571o302R519
1081B637L314j0372Q2J0329l363r230O113O957q492m145J0066J167j0362K041
1095c258R646n101q090P480N640r156k538J0017p07r835L883Q626o574o461Q650
1110B222L556r949m81J0096k671r100N724P408q064m944R404J719j0035J549R675
1125F109m505q110P133N762r058k921R960k47r844L336Q741o042o739Q109M190
1140E874r245j098R545k121r054M869P454p121n042Q868K325r557O43R138l731
1155A747q060O254O160p998l473R024M82r174K524Q413n253o809P405M419q863
1170c202j595R417j341q772M343P414o886n526Q455K836r170K27R145l119q037
$$ plain form
1185 -5811 -104 5978 -1909 -5632 3481 4463 -4840 -2930 5604 971 -5910 1009 5661 -2778 -4779
1200 -4779 4245 3349 -5464 -1898 5776 37 -5530 2103 5184 -3570 -4079 4651 2381 -5513 -622
1215 -622 5741 -1067 -5147 2975 4291 -4445 -3029 5367 1413 -5772 299 5449 -2212 -4786 3797
1230 3797 3685 -4867 -2048 5538 169 -5843 1353 5086 -3059 -3852 4678 2615 -5458 -919 5686
1245 5686 -963 -5536 2560 4719 -3849 -3289 4952 1689 -5469 129 5464 -1836 -4897 3264 3618
1260 3618 -4615 -2267 5326 687 -5347 1178 5060 -2843 -4423 3847 2948 -4789 -1259 5413 -241
1275 -241 -5148 1951 4456 -3518 -3449 4598 2041 -5166 -327 5295 -1349 -4807 2995 3995 -4158 -2681
1291 -2681 4853 869 -5407 664 5128 -2204 -4183 3812 3027 -4942 -1755 5209 -108 -5252 1801
$$ packed form
1185e811N707O082p887l723R113R82r303J910Q534m633o881O919M652q439k001
1200d779R024q96q813L566P674n739n567P633L081q754n09Q730k270p894M891
1215f22O363o808m080Q122J316q736J416Q396l954p185O071N150p661k574Q583
1230C797j12q552K819P586n369o012P196L733q145p93Q530k063q073M539O605
1245E686o649m573Q096K159q568N60Q241l263p158N598N335p300l061Q161L54
1260C618q233K348P593m639o034O525L882p903j580Q270q99p737L530O672n654
1275b41m907P099K505p974O9Q047k557p207M839N622o644l458P802J000q153J477
1291b681P534l984o276O071M464p332j979P995p85p969L187O964n317n144P053
$$ plain form
1306 1801 4800 -3108 -3628 4273 2195 -4986 -578 5208 -1026 -4877 2521 4040 -3765 -2705 4809
1321 4809 1395 -5079 275 4878 -2042 -4513 3216 3432 -4113 -1865 4855 368 -5037 1042 4451
1336 4451 -2691 -3725 3879 2562 -4624 -1007 4983 -598 -4801 2189 4181 -3485 -3142 4316 1602
1351 1602 -4843 77 5026 -1446 -4359 2940 3359 -4262 -2334 4752 778 -4837 1003 4677 -2450
1366 -2450 -3941 3594 2649 -4569 -1309 4904 -226 -4795 1728 4220 -3003 -3160 4111 1997 -4678
1381 -4678 -610 4640 -1034 -4330 2508 3733 -3452 -2387 4361 968 -4873 283 4522 -1810 -3865
1396 -3865 3200 2950 -4161 -1720 4577 214 -4681 1161 4189 -2612 -3388 3626 2066 -4370 -546
1411 -546 4834 -809 -4538 2121 3673 -3421 -2642 4339 1412 -4536 257 4583 -1670 -4183 2779
$$ packed form
1306A801K999p908n20P901k078p181M408N786o234l851P398J519p805J060P514
1321D809l414o474N354M603o920k471P729K16p545K248O720m487n405O079L409
1336D451p142j034P604j317p186L617N990n581m203O990J992p666L43P458k714
1351A602o445M920M949o472k913P299M19p621J928P086l974n615N840L674p127
1366b450j491P535r45p218L260O213n130m569O523K492p223j57P271k114o675
1381d678M068N250n674l296O838J225p185J065O748l393n841N156M239o332k055
1396c865P065k50p111K441O297m363m895N842L028o801p76P014j560o436L824
1411e46N380n643l729O659J552p094P79O981k927n948M793M326o253k513O962
$$ plain form
1426 2779 3084 -3766 -1767 4468 358 -4563 1075 4270 -2357 -3553 3398 2330 -4208 -1105 4387
1441 4387 -408 -4215 1919 3893 -2898 -2912 3680 1501 -4309 -188 4381 -1148 -3854 2627 3237 -3604
1457 -3604 -2228 4082 781 -4311 664 4087 -2015 -3473 3157 2533 -3934 -1238 4395 -224 -4432
1472 -4432 1383 3702 -2805 -2842 3872 1853 -4253 -499 4290 -1081 -4039 2276 3300 -3204 -2066
1487 -2066 4103 901 -4344 444 4186 -1737 -3553 2872 2633 -3749 -1451 4264 221 -4156 1124
1502 1124 3796 -2366 -3079 3173 1875 -3901 -594 4265 -572 -3958 1868 3281 -3026 -2509 3677
1517 3677 1213 -4022 168 4078 -1438 -3601 2587 2799 -3460 -1691 4015 267 -4192 909 3827
1532 3827 -2034 -3028 3219 1981 -3954 -900 4017 -594 -4005 1825 3501 -2759 -2512 3565 1266
$$ packed form
1426B779L05o850J999O235m110m921N638L195o627j196O951j068o538L103N492
1441D387m795l807O134J974o791j4O592k179n810M121M569n529k706O481O10o841
1457c604J376O310l301n092M975L423o102j458O630o24o467K696N633m619m208
1472d432N815K319o507l7O714k019o106L754M789n371k958O315J024o504J138
1487b066O169l202n245M788L742n923j816O425k39o382K298N715m043m377N280
1502A124K672o162p13O252j298n776L307M859m837l386N826J413o307N17O186
1517C677k464n235M190L910n516k163O188K12o259J769N706l748m459N101K918
1532C827n861r94O247j238n935L054M917m611l411N830J676o260K47O077k299
$$ plain form
1547 1266 -4018 -87 4023 -1161 -3603 2320 2942 -3156 -1784 3792 734 -3958 632 3661 -1936
1562 -1936 -3241 2827 2337 -3512 -1084 3884 -104 -3931 1222 3347 -2482 -2748 3274 1706 -3672
1577 -3672 -386 3796 -861 -3583 2001 2930 -3053 -2050 3638 885 -3908 476 3764 -1473 -3145
1592 -3145 2655 2357 -3454 -1385 3773 190 -3734 1221 3451 -2183 -2731 3059 1676 -3808 -598
1607 -598 3845 -597 -3601 1688 3057 -2723 -2189 3349 1175 -3691 -4 3648 -1264 -3308 2260
1622 2260 2623 -2978 -1521 3588 378 -3810 630 3415 -1796 -2816 2799 1996 -3320 -893 3563
1637 3563 -374 -3607 1438 3107 -2458 -2337 3178 1297 -3594 -127 3684 -994 -3315 2048 2609
1652 2609 -2972 -1720 3496 690 -3543 637 3463 -1706 -2960 2546 2021 -3278 -1020 3648 -41
$$ packed form
1547A266n284L931M110n184k442N923O22o098J372N576l058m692M590L029n597
1562a936j305O068m90n849K428M968l988l827N153K125n829k66O022j568n378
1577c672L286M182m657k722N584R29n983J003N688k753m793M384L288n237j672
1592c145N800k98n811K069N158l583l924M955K230n634n48N790j383n484L210
1607e98M443m442l004N289J369n780N34N538k174m866L687L652m912k044N568
1622B260L63n601J457N109l210m188M440K785n211j020N615q03n316K427M456
1637C563l937l233N045J669n565J21N515j881m891L467L811m678k321N363N61
1652B609n581J252N216k806m233M180K826n169j254N506n25n299K258M668l689
$$ plain form
1667 -41 -3562 1147 3143 -2166 -2495 2860 1475 -3411 -471 3462 -712 -3281 1758 2772 -2557 -1910
1683 -1910 3128 803 -3489 229 3383 -1257 -2858 2325 2244 -2959 -1279 3338 147 -3435 963
1698 963 3178 -1883 -2499 2723 1604 -3230 -532 3402 -626 -3268 1575 2692 -2559 -1942 3125 1023
1714 1023 -3355 192 3253 -1325 -3007 2102 2309 -2782 -1325 3304 361 -3332 704 3033 -1734
1729 -1734 -2500 2539 1728 -3057 -743 3296 -266 -3169 1314 2791 -2186 -2170 2744 1202 -3169 -231
1745 -231 3194 -776 -2850 1776 2282 -2608 -1561 3037 583 -3187 478 3081 -1412 -2568 2272
1760 2272 1847 -2920 -944 3226 -59 -3167 1053 2758 -1958 -2067 2701 1215 -3144 -293 3149
1775 3149 -788 -3015 1608 2430 -2333 -1582 2894 638 -3174 272 3032 -1231 -2613 2038 1935 -2613
$$ packed form
1667d1l521M709J996n309l29N355j385m886K940L933m174k569N039J014n329O47
1683a910N038k325m292L718L154m640j601N183q1n203J680M617l191l582M398
1698I63K215n061o16N222j119m834K698L934m028k642M843J117n251O17N067k102
1714A023m378L547L061m578j682N109K07n091J457M629k943l693M036K329m767
1729a734p66N039q11m785K314M039l562k903M483J477m977J6M914j542m371K938
1745b31L425l970k074M626N06m890J047M598k454l770L665K603m493j156M840
1760B272m25m767J976M170l285l108M220J705m716j09M768j486m359K851L442
1775C149l937k227M623Q22m763P51M476k256l812L446K760m263j382M651j03m548
$$ plain form
1791 -2613 -1014 3000 88 -3050 875 2836 -1667 -2292 2300 1491 -2720 -497 2977 -436 -2876
1806 -2876 1324 2437 -2147 -1850 2598 928 -2868 72 2888 -1073 -2656 1847 2080 -2494 -1324
1821 -1324 2818 389 -2880 622 2703 -1526 -2215 2308 1561 -2779 -734 2948 -240 -2805 1197
1836 1197 2470 -1953 -1851 2538 1047 -2879 -236 2850 -691 -2576 1542 2068 -2269 -1399 2687 574
1852 574 -2869 274 2690 -1159 -2301 1899 1663 -2443 -854 2786 47 -2797 777 2495 -1559
1867 -1559 -1949 2223 1254 -2603 -384 2764 -515 -2635 1295 2172 -1994 -1494 2469 665 -2723 209
1883 209 2671 -1077 -2352 1790 1766 -2367 -1033 2672 186 -2697 705 2508 -1454 -1997 2075 1295
1899 1295 -2489 -470 2671 -363 -2527 1169 2182 -1862 -1638 2319 873 -2594 -96 2585 -736
$$ packed form
1791b613J599M014k912l138L925J961m503o25M592q09m211K223L474l413k440
1806b876M200J113m584K97M448j670l796K940K816l961j583M503K33m574J170
1821a324M142k429l269L502K081m229o89M523p47m340K045L682l188k565M002
1836A197J273m423J02M389j491l926K643L086l541j885M118N26m337Q70M086k113
1852E74l443L143K416l849j142M200k36m106J589L640k739k844L574J718m054
1867a559l90M172r69l857K219L148l279k120L930Q77m166N00L963j804l388K932
1883B09K462l748j275M142k4m133J334L705k486k883L402J803l962n43M072p80
1899A295l784K019L141l034k164L696J013m044K24L957j446l467K498K681l321
$$ plain form
1914 -736 -2361 1443 1843 -2036 -1183 2409 376 -2572 431 2428 -1194 -2040 1854 1501 -2277 -725
1930 -725 2539 -76 -2496 894 2243 -1576 -1705 2129 1007 -2438 -191 2493 -655 -2317 1381
1945 1381 1886 -2004 -1311 2353 550 -2516 230 2378 -1050 -2061 1695 1510 -2197 -829 2455 71
1961 71 -2423 719 2198 -1414 -1741 1984 1161 -2306 -425 2429 -284 -2292 1018 1933 -1650 -1386
1977 -1386 2119 719 -2357 24 2334 -773 -2101 1428 1594 -1982 -1006 2273 265 -2393 451
1992 451 2198 -1143 -1803 1725 1209 -2133 -508 2342 -256 -2264 1000 1980 -1605 -1461 2041 776
2008 776 -2285 -59 2283 -675 -2058 1335 1631 -1874 -1071 2171 360 -2280 343 2159 -1030 -1828
2024 -1828 1609 1297 -2018 -649 2242 -22 -2194 742 1973 -1333 -1502 1841 963 -2119 -266 2216
$$ packed form
1914g36j625L804M00l879Q53L592k033k948L003J997l622q46L894l53l778J552
1930g25L264k615k420L390J349l819j29L834j122l445K247K684l148j662L698
1945A381N05l890O93L664j803l066K746K148l428j011L756j85l707J368L284k384
1961G1k494L142J479l612l27L725q23l467J881K854k713k008L310R15l583K64
1977a386L505j400l076K381K310l107j328L529J66l576R76L279k008k658K844
1992D51J747l341o60L528n16l342J625K850k598k008L264R80l585J44L502j265
2008G76l061K226K342k958j383L393K96l505Q03L242j811k640K623J816l189p98
2024a828L437l12l315J369K891k264k172K936J231l306j69L343q78l082J853K482
$$ plain form
2040 2216 -436 -2087 1083 1737 -1613 -1190 2003 509 -2206 148 2096 -874 -1846 1456 1367 -1902
2056 -1902 -744 2143 53 -2194 646 2042 -1225 -1619 1729 1018 -1993 -333 2171 -380 -2004
2071 -2004 1046 1687 -1550 -1211 2000 654 -2082 37 2099 -726 -1915 1320 1478 -1749 -966 1998
2087 1998 290 -2074 389 1910 -1026 -1611 1513 1134 -1888 -496 2021 -102 -2007 764 1796
2102 1796 -1306 -1360 1705 816 -2020 -169 1949 -478 -1805 1177 1472 -1602 -988 1985 409 -2085
2118 -2085 250 1956 -881 -1710 1389 1113 -1805 -594 2033 -20 -2031 636 1752 -1203 -1298 1705
2134 1705 859 -1920 -222 2007 -432 -1904 893 1593 -1415 -1069 1778 541 -1973 88 1921 -659
2150 -659 -1713 1190 1285 -1617 -756 1899 134 -1974 446 1881 -1018 -1540 1357 972 -1756 -396
$$ packed form
2040B216k652j651L170O54l350M23L193j494k715K354J948k970r72L302q9l269
2056a902J158K887k090k247K840J396l267l94L348p11l011J660K504k551j624
2071b004L050O41l237L39L211j346k736K119K062k825j189L235J58l227P83K964
2087A998j708k364K463J521k936n85L124l79l022J392K517k123j905K771J032
2102A796l102n4L065q89k836J851K118k427j327K982K95l074O14K973j576k494
2118b085K335J706k837q29L099k76k918J211K627k053k011K667J116k955r5L003
2134A705q46k779J698K229k439j472K797P00l008L46K847j237k514K061J833k580
2150f59j054K903R5k902Q61K655j765k108K420J435k899n22K897l85k728J360
$$ plain form
2166 -396 1955 -191 -1801 852 1623 -1372 -1236 1647 645 -1847 47 1891 -670 -1685 1198 1333
2182 1333 -1659 -894 1817 240 -1829 307 1759 -958 -1501 1450 1112 -1749 -515 1849 -109 -1804
2198 -1804 763 1670 -1185 -1219 1631 796 -1856 -216 1849 -345 -1688 977 1410 -1423 -955 1769
2214 1769 479 -1880 119 1806 -701 -1556 1162 1107 -1602 -593 1852 63 -1872 473 1633 -1084
2230 -1084 -1353 1460 849 -1729 -265 1858 -290 -1775 822 1455 -1303 -1007 1637 468 -1811 119
2246 119 1826 -648 -1562 1174 1230 -1560 -772 1717 154 -1790 437 1714 -887 -1388 1320 918 -1644
2263 -1644 -436 1752 -133 -1715 737 1508 -1162 -1222 1515 736 -1695 -162 1709 -444 -1597 926
2279 926 1287 -1321 -818 1668 314 -1791 179 1635 -814 -1442 1253 1068 -1548 -546 1714 -43
$$ packed form
2166c96K351k146j610K653P71k995J36K883j002k492J894J844k561j015K883J35
2182A333k992P65K711j577k069K136J452k717n43K951l38k861J234K364j958j695
2198a804K567R07k855l4K850q35k652J640K065k194j343K665M33k833M68K724
2214A769j290k359J999J687k507q55K718n5k709J009K445j789j935K345J160k717
2230a084k69K813o11k578J464K123k148j485K597O33k758K96K644j169k279J930
2246A19J707k474r14K736N6k790P88K489j563j944K227J277k601n01K708m02k562
2263a644J208K188j885j582K452P71k670o0K737p79k431J533J871k153j153K523
2279I26L61k608N03K486j354k105J970J456k449o28K695j85k616J002K260j757
$$ plain form
2295 -43 -1754 546 1547 -1031 -1182 1439 728 -1641 -160 1762 -354 -1607 901 1359 -1317 -979
2311 -979 1599 507 -1651 139 1714 -614 -1494 1037 1079 -1456 -662 1665 162 -1675 399 1553
2327 1553 -922 -1328 1289 903 -1578 -428 1652 -153 -1614 692 1420 -1113 -1026 1469 547 -1691
2343 -1691 -67 1649 -454 -1444 1035 1214 -1368 -746 1579 201 -1709 306 1596 -777 -1307 1228
2359 1228 897 -1524 -412 1668 -120 -1634 611 1411 -1097 -1085 1425 676 -1559 -108 1629 -407
2375 -407 -1547 830 1234 -1241 -795 1580 397 -1640 119 1560 -656 -1386 1061 1043 -1378 -586 1552
2392 1552 85 -1589 429 1464 -919 -1181 1246 723 -1565 -281 1651 -177 -1492 757 1299 -1157
2408 -1157 -931 1416 437 -1563 111 1609 -532 -1374 1005 1045 -1349 -623 1542 112 -1606 367
$$ packed form
2295d3j711K300J001k578j51K621p11k369J481J922k116j253K508M58k676L38
2311i79K578j092k158J790J575k328q80K531M2k535P94K327j503j837K074J154
2327A553k475m06K617l86k481J150K080j805j461K306P28k533Q7K495r22k238
2343a691J624J716k103r90K479J79k582O22K325j378j910K015J290k373n30K535
2359A228l31k421J112K080j788j514K245Q00k508J2K510p49k235J451J737k036
2375d07j140K377M04k475M46K375j183k037J759J441k216p30K447j8k421P92K138
2392A552j467j674K018J035k383k62K427n23k288J284J932j828j315K249N42k456
2408a157K26K347r79k000J674J498k141q42K379M0k394P26K165j430j718J973
$$ plain form
2424 367 1488 -823 -1223 1203 838 -1422 -355 1487 -232 -1555 629 1329 -1008 -950 1375 579 -1529
2441 -1529 -128 1515 -419 -1406 879 1198 -1179 -748 1425 304 -1501 211 1441 -705 -1271 1063
2457 1063 893 -1361 -472 1549 26 -1492 463 1295 -995 -1088 1249 664 -1439 -137 1535 -315
2473 -315 -1389 779 1101 -1191 -766 1435 391 -1501 115 1458 -564 -1230 991 941 -1247 -610 1458
2490 1458 41 -1537 411 1416 -783 -1050 1180 690 -1438 -358 1455 -141 -1410 633 1225 -980
2506 -980 -898 1267 460 -1447 -23 1461 -438 -1318 836 1002 -1149 -576 1418 179 -1485 245 1327
2523 1327 -731 -1146 1076 820 -1268 -306 1417 -195 -1460 553 1218 -934 -889 1252 517 -1364 -38
2540 -38 1423 -404 -1289 814 1064 -1114 -705 1302 271 -1362 249 1390 -612 -1203 951 848 -1269
$$ packed form
2424C67J121k311m00K426l65k260J067J842j719j323K184P00k337N8K325p96k108
2441a529J401J643j934r87K285L19k377M31K173j121j805J712J230k146n66K334
2457A063j70k254Q89K021j523j518J955Q32k290r3K337n85k103J302J672j850
2473c15j074K168L22k292M25K201j044j892J616J343k022o66K221n0k188O37K068
2490A458j417j578J948J005k199k67K230m90k128J080J813j596j269K043N92k205
2506i80Q2K165q07j907J424J484j899q80K154J66k151N73J994j239j664J730J082
2523A327k058m15K222k56k088R62J723j612j265K013O65k152M5K141p35j881J326
2540c8J461j827q85K103K50k178M09K007j031j633J611J141k002n91K154j03k117
$$ plain form
2557 -1269 -517 1363 64 -1299 393 1249 -852 -1068 1100 643 -1319 -263 1368 -217 -1288 657
2573 657 1096 -1019 -782 1286 416 -1404 -12 1310 -446 -1107 926 913 -1150 -520 1320 78 -1401
2590 -1401 309 1263 -682 -960 1092 653 -1314 -290 1354 -170 -1314 541 1085 -935 -799 1165
2606 1165 425 -1324 -9 1355 -406 -1270 698 940 -1044 -590 1289 250 -1314 200 1255 -616
2622 -616 -1112 899 789 -1113 -348 1283 -34 -1280 443 1174 -798 -938 1062 555 -1255 -166 1289
2639 1289 -246 -1150 707 987 -1023 -709 1155 250 -1279 154 1291 -494 -1057 868 775 -1142 -480
2656 -480 1240 48 -1250 353 1129 -726 -908 1017 589 -1206 -230 1234 -194 -1239 532 1026
2672 1026 -850 -719 1145 439 -1242 -84 1215 -387 -1115 746 973 -945 -566 1236 238 -1270
$$ packed form
2557a269P52J880j299j363J692Q56k101k16K168m57j962J056J631j585j071J945
2573F57M39k115K37K068q70j820J392J322j756o61K033j3k063O30J840j242j479
2590a401J710R54j945k78K052m39j967J024J644j524j144J855N44k020J36J964
2606A165p40j749J315J364j761q64J968K42j984M54J879j039j564J514J055j871
2622f16m96K011j10j902P65J631j317j246J723P31j972j40K000n07j810J089J455
2639A289j535r04J857K80k010L14J864r05j529J433J137j785n63J925r3j917O62
2656d80J720j192j298J603P76j855j82J925m28j795R76J464j428j045J771M94
2672A026j876J31J864p06j681J158J299j602p28J861K27j918L79J802r98j508
$$ plain form
2688 -1270 281 1215 -633 -983 865 724 -1103 -323 1223 -38 -1176 438 1023 -840 -860 1008 460
2705 460 -1178 -65 1233 -286 -1113 621 845 -970 -604 1128 262 -1178 161 1150 -511 -978 835
2722 835 752 -1055 -413 1176 41 -1173 338 1099 -630 -824 955 552 -1154 -270 1155 -171 -1111
2739 -1111 540 990 -819 -713 1028 342 -1198 -24 1161 -337 -1032 683 813 -946 -479 1130
2755 1130 145 -1159 221 1046 -607 -914 863 642 -1041 -258 1168 -90 -1163 384 949 -751
2771 -751 -717 994 429 -1104 -56 1136 -315 -1056 624 849 -876 -560 1058 225 -1133 156 1129
2788 1129 -425 -958 712 677 -992 -411 1075 44 -1077 341 1034 -648 -871 826 532 -1060 -234
2805 -234 1095 -125 -1053 510 926 -778 -664 952 311 -1072 12 1034 -394 -961 713 789 -885
$$ packed form
2688a270J551R34j848l50J848j41j827P80J546j261j138J614N85j863k0J868n48
2705D60j638J113J298j519q27J734K24j815L66J732q66j440J339R89j661m67J813
2722H35q3j807O42J589j135j214J511P61j729j94J779m03j706Q84J425j326r40
2739a111J651M50j809J06J741o86j540J174J185j498o95J715J30j759M67J609
2755A130r85j304J380Q25j653l07J777k21j683P83J426j258j073J547N65j700
2771g51L4J711n65j533J048J192j451p41J680K25j725L16J618q33j358J289R73
2788A129j554n33J670l5j669N81J486j031j121J418O93j682k23J697k94j592Q26
2805b34J329j220r28J563M16j704J14J616o41j383J084J022j428n67J674P6j674
$$ plain form
2822 -885 -467 1042 109 -1091 203 992 -532 -790 844 587 -992 -285 1042 -100 -1049 413 881
2839 881 -722 -689 929 396 -1057 -81 1055 -247 -997 519 754 -826 -519 1007 253 -1028 134
2856 134 1012 -450 -909 684 649 -901 -338 1050 51 -1033 284 919 -588 -735 819 449 -1009
2873 -1009 -164 1065 -197 -951 504 817 -749 -513 910 182 -1053 73 1021 -350 -833 657 622
2890 622 -880 -384 961 38 -1024 272 926 -524 -754 765 470 -921 -187 969 -142 -967 398
2907 398 808 -660 -592 872 336 -958 -17 948 -326 -917 562 744 -738 -433 919 151 -956 163
2925 163 907 -479 -767 730 556 -868 -274 938 -38 -919 363 813 -646 -656 788 368 -909 -79
2943 -79 921 -240 -849 505 641 -800 -482 896 180 -931 128 905 -394 -749 644 557 -825
$$ packed form
2822h85M18J509r33j200J294P89j524k58J634k57j579P07J327j142r49J462M68
2839H81j603L3J618n33j453R76J136j302p50J516K35j580L07J526p54j281J162
2856A34Q78j462m59J593l5j550N63J388r99j084J317O35j507j47J554l70j458
2873a009Q45J229j262p54J455L13j566K36J423p28j235J126R48j371m83J490l5
2890F22j502M96J345r23j062J296O54j450k30J519k95j391P34J156j111q25J365
2907C98M10j468O8J464n36j294R41R65j274n91J479J82j482L05J352p68j107J119
2925A63P44j386k88J497j74j424N94J212r76q81J282M50j459j0J444m20j277Q30
2943g9J000j161o09J354J36j441L18J378p16j111J059P77j299l55J393q7j382
$$ plain form
2960 -825 -300 931 33 -897 274 836 -507 -623 772 415 -918 -172 938 -127 -893 400 768
2977 768 -614 -533 796 235 -929 13 909 -295 -796 551 625 -754 -365 862 80 -910 215 847
2995 847 -499 -710 681 482 -807 -177 887 -117 -859 368 695 -629 -533 788 305 -861 -14
3012 -14 868 -271 -813 504 630 -697 -397 829 151 -862 145 821 -393 -683 632 498 -809
3029 -809 -280 871 15 -842 274 773 -506 -607 688 352 -851 -119 871 -165 -811 419 664 -640
3047 -640 -461 779 194 -853 62 824 -326 -725 552 539 -698 -280 816 22 -843 243 756 -465
3065 -465 -588 680 407 -762 -124 819 -135 -800 372 670 -569 -487 717 253 -812 1 807 -281
3083 -281 -746 483 571 -675 -391 775 133 -793 141 755 -383 -635 588 458 -735 -218 823 -9
$$ packed form
2960h25N25J231q98r30J171N62j343j16J395l57j333P46J110j065p66J293L68
2977G68j382Q1J329n61j164R42Q96j204n01J347P4j379L89J227p82r90J125O32
2995H47j346k11J391j99j289O30J064j004p42J227L27j324R6J321m83j166Q47
3012a4Q82j139n42J317J26j327L00J226o78j013J007O76j214k90J315j34j307
3029h09N29J151q56q57J116M99j279j01J295l36j203P32R90j036o46J230K45j304
3047f40J79J240n85j047R15P62j150l99J277j3j237M18J096p94q65J086N13j221
3065d65j23J268k73j169O38R43r54o65J172K98j239Q2J204m64j065Q13Q06j088
3083b81m65J229Q8j246K84J166o42r26R34O14j138k52J223j30j193N17J041q32
$$ plain form
3101 -9 -772 287 686 -512 -531 696 312 -781 -75 794 -182 -714 416 557 -615 -376 726 125 -792
3120 -792 98 744 -351 -636 557 461 -697 -250 769 8 -758 239 673 -439 -505 633 310 -750
3138 -750 -104 763 -144 -739 346 607 -547 -434 694 217 -752 25 766 -258 -679 468 515 -616
3156 -616 -282 736 59 -749 185 709 -385 -588 571 409 -694 -159 743 -83 -717 310 617 -516
3174 -516 -459 635 223 -721 10 719 -258 -646 446 512 -606 -338 678 110 -706 136 670 -369 -552
3193 -552 556 429 -674 -198 735 -18 -690 275 629 -453 -472 631 327 -692 -80 704 -140 -661 371
3212 371 547 -543 -381 670 168 -736 46 687 -285 -608 471 416 -630 -255 691 18 -708 181 617
3231 617 -400 -483 568 302 -674 -87 702 -118 -649 328 544 -475 -372 615 176 -681 44 667 -241
$$ packed form
3101ip63J059L99j198j9J227l84j093P06Q69r76n32J130J41j172K39J102o01r17
3120g92Q90O46j095k85J193r6j158M47J019p61p66R97M34j112o6J138l23j060
3138g50O46Q67r07n95J085K61j154J13J128m77r69P77P41j024m21J147M7j131
3156f16L34J018o77q08R34N24j094k03J159j62j103N35R02q26o34J027L07j133
3174e16N7J094m12r44P31P09r77l88J092O6j118K68J016n68q16Q42N34j039j83
3193e52J108j27j103M76R33p53o72R65L54j082j9J103l04j019O12P84q44n21J032
3212C71J76j090J62J051n02r04P82O41r72l23J079n5j046L75R46o73p26Q89M36
3231F17j017q3J051k66r76N87P89q20n31R77K16j019J03R87m39q57P25O23r08
$$ plain form
3250 -241 -597 434 445 -569 -268 670 66 -694 149 643 -344 -529 500 358 -612 -159 666 -61 -668
3269 -668 252 576 -441 -446 569 247 -662 -51 665 -173 -645 341 495 -506 -337 597 110 -645 101 614
3289 614 -306 -534 474 394 -581 -192 647 -6 -625 230 560 -395 -438 521 274 -600 -54 620 -132 -574
3309 -574 338 485 -497 -357 576 158 -630 29 597 -234 -544 399 409 -553 -276 594 58 -637 127 563
3329 563 -327 -453 488 326 -598 -143 632 -46 -601 245 522 -398 -355 542 192 -604 1 605 -177 -538
3349 -538 357 413 -489 -252 573 70 -602 113 545 -295 -473 419 294 -523 -140 587 -49 -569 229 491
3369 491 -396 -397 486 218 -547 -51 574 -138 -551 295 439 -434 -309 525 128 -566 46 555 -223 -481 407
3390 407 387 -504 -233 564 42 -558 141 525 -309 -398 450 269 -545 -111 564 -77 -543 257 441 -404 -319
$$ packed form
3250b41l56J031J1j014L01R38o04p60Q43M94r87j85J029j42r70M53Q25p27o07
3269f68R20L24j017nJ015l22r09O11P16q38m72R86J54j001J69R34m87p55P46N13
3289F14r20k28J008q0r75L89Q39o53o19Q55L30r55m3R59k47q74N46O74p52m42
3309e74R12J47r82J40R33m18p88O59N68q31l10R43J0r62K77Q70n36o95P64M36
3329E63q90j26R41j62r24M55P75o78n55Q46K77r20M3Q97l50p96O05O04p82l61
3349e38Q95N6r02K37Q25n03o72P15M32q40j78Q92j25q17L83P27o36n20P98K62
3369D91q87jQ83k68p65M96O25p12m13Q46J44q73J25Q34l97o94O12N09p78k58Q88
3390D07k0q91K71P97n22o00O99L84q34q9Q48j81q14M34O75o41m66Q00J84q45Q5
$$ plain form
3411 -319 486 142 -550 10 530 -202 -488 328 357 -448 -219 525 54 -564 103 503 -289 -434 406 293
3431 293 -484 -129 541 -35 -525 194 461 -340 -349 452 222 -520 -30 553 -119 -499 282 431 -416 -305 479
3452 479 123 -517 60 503 -217 -457 342 306 -474 -187 505 16 -506 161 446 -305 -365 416 240 -493 -69
3473 -69 504 -88 -465 252 399 -357 -256 459 123 -510 10 488 -168 -409 323 331 -404 -211 473 51 -505
3494 -505 88 458 -240 -372 368 256 -464 -125 499 -31 -496 168 426 -320 -333 418 189 -463 -29 485
3514 485 -119 -464 242 342 -385 -239 461 98 -483 53 466 -196 -397 310 277 -397 -144 460 5 -455
3534 -455 154 428 -258 -324 362 188 -445 -61 467 -70 -424 235 384 -330 -288 394 135 -443 4 449 -164
3555 -164 -401 278 328 -383 -218 454 63 -456 76 427 -224 -364 359 277 -398 -130 441 -18 -443 177 400
$$ packed form
3411c19Q05l44o92N60N20p32k86Q16K9q05K29P44m71o18O67M00p92j45Q40j13
3431B93p77L55O70n76m90P19K67q01rQ01k30p42M90N83o72l80P81J49q47J11P84
3452D79l56o40N77M43p20k40P99l6p80K87O92m89n22O67K85p51o0P81j76p33M24
3473f9N73n92l77P17J47p56J01P15l36o33N20M78o56k41P32Qp35J93O84m22n56
3494e05N93L70o98j32P40j12p20L39O24n30m65O64K58p46j3P51k29o52M34N14
3514D85o04l45P06J00p27J46P00l63n81N36M13o62k01P07l3o74K53O04m55m60
3534d55O09K74o86o6O86j74o33L84N28n37l54O59J49p14M2O82k59n78M47M45o13
3555a64k37O79N0p11J65O72l91n19N32L51o51j40P23q2o75K68N71m59m25O20K23
$$ plain form
3576 400 -275 -279 413 201 -423 -45 447 -90 -392 244 328 -332 -211 415 89 -444 56 418 -185 -354 289
3597 289 247 -397 -135 438 23 -431 115 378 -261 -313 337 190 -399 -53 452 -53 -418 194 354 -302 -256
3618 -256 399 143 -434 2 439 -127 -384 257 310 -344 -192 406 49 -445 93 430 -193 -319 324 242 -404
3639 -404 -113 421 -21 -406 168 373 -267 -269 357 154 -398 -13 413 -120 -384 220 304 -323 -197 405 83
3660 83 -417 47 390 -185 -352 282 277 -334 -120 424 15 -431 123 389 -236 -307 336 221 -390 -72 421
3681 421 -45 -386 200 348 -292 -257 376 123 -403 11 427 -125 -383 247 276 -362 -199 386 64 -396 76
3702 76 376 -203 -316 301 209 -375 -92 408 -25 -379 167 339 -242 -227 363 153 -389 -26 390 -87 -346
3723 -346 227 305 -282 -183 373 75 -419 35 394 -155 -327 275 256 -339 -146 400 15 -399 105 360 -222
$$ packed form
3576D00o75mO92k12o24L78M92n37l02O36Q4o60J21O26l26n33N00L62o03j69O43
3597B89m2o44K62N73m15m54N46K63o39n2O50j47n89L46N05n05l65O12J60o56M6
3618b56O55k56n77M36M37n66k57O41N3o54J52N98l57m94N38L37o23j26O43q2o46
3639d04K91N34m42l85N74K05o40kO26k03n52L85M26n33k64O04Q4o27J26O02l22
3660H3n00M64L43n75j67O34no11K14N44m09m46N54K66o25p1O43j15o11L18M93
3681D21m66l41N86J48o40L5O33k53n26M14M16n52k58O30K9o38J63N85l22m60M72
3702G6L00n79j13O17r2n84K83N00m33l54N46J72n81J5N90k10n42L63M16m77k59
3723c46N73P8n87R9N56k98m94M54L59n49j72O02j9n95J93N46l85m14N04K55n82
$$ plain form
3744 -222 -303 315 203 -360 -56 411 -63 -401 158 322 -284 -230 359 145 -362 20 369 -145 -339 248 267
3765 267 -327 -149 382 47 -375 92 356 -178 -290 290 204 -358 -98 379 -28 -344 162 332 -255 -246 309
3786 309 123 -391 -16 399 -82 -347 186 284 -313 -211 358 78 -388 30 376 -152 -335 257 251 -335 -121
3807 -121 388 -6 -388 102 363 -198 -262 320 199 -337 -48 374 -67 -364 185 318 -263 -217 344 105 -375
3828 -375 16 354 -142 -330 224 242 -324 -152 348 28 -362 93 329 -211 -309 267 209 -347 -93 390 -8
3849 -8 -364 149 320 -244 -252 323 160 -370 -34 375 -86 -334 223 296 -300 -187 364 83 -386 34 376 -126
3871 -126 -284 266 224 -343 -124 351 -10 -370 118 334 -208 -236 296 144 -372 -56 369 -51 -343 157 285
3892 285 -252 -202 323 101 -351 19 348 -132 -330 223 250 -278 -133 383 56 -374 73 348 -176 -283 276
$$ packed form
3744b22q1O18j12n63L04M67m74l38N59J64o06N4N89k14n07L82L49n14j94N87J9
3765B67n94J78N31l35m22M67K64n34j12N80q6n62K60M77m07l16N06J70n87RN55
3786C09j86n14L75M15m81k65N33R8n97J02N69k80m66M18L46n28j83N92on86K14
3807a21N09l94l82M90K61n61o4N82j21n36K89M22m41k97N49J33n81M6N61k39m80
3828c75L91L38m96j88N54J8n66J72N00l20l90M55K36n40r8N76n8n56K54M83l98
3849hl56N13J71n64qN75j63n30L36M09m61k48N57P3n96J13N51k81m69M20L42n02
3871a26j58N50m2n67K19M75l61l60M88K16n42k8N32j52n16L16M25m20k92N00J28
3892B85n37N0N25k22m52L70L29m80j98N53K7n28J45N16l27m30M47K75n24j07N59
$$ plain form
3913 276 218 -312 -79 369 -30 -358 144 342 -230 -256 298 140 -341 -33 374 -82 -324 190 263 -305 -202
3934 -202 323 58 -340 54 347 -163 -306 237 203 -313 -118 344 9 -321 104 298 -204 -229 307 173 -321
3955 -321 -63 340 -57 -310 179 296 -241 -184 329 100 -360 -17 343 -111 -292 228 249 -295 -160 341 47
3976 47 -370 47 339 -176 -278 271 198 -318 -87 364 -5 -360 118 329 -195 -206 293 127 -327 -21 370
3997 370 -44 -310 186 291 -246 -159 270 59 -290 20 303 -154 -331 230 190 -279 -89 333 -11 -318 85
4018 85 303 -200 -252 256 144 -324 -79 333 -33 -306 153 287 -240 -215 291 105 -348 -9 344 -95 -313
4039 -313 196 250 -266 -149 326 49 -346 56 315 -157 -245 255 207 -286 -78 326 -14 -323 108 304 -139
4060 -139 -162 267 145 -307 -26 341 -77 -305 169 245 -259 -175 291 72 -319 55 312 -137 -278 205 189
$$ packed form
3913B76n8n30K33M48l99l28N02J98n72k6N54j58m81L08M07m56k42N14P3n68J03
3934b02N25k65l98L94K93n10j43N43l4n16J95M62l35l30M25J94n02k5N36j34m94
3955c21K58M03l97k53M89J17n37N7N13k29m60L43L60m54j81N20K1n44J35N01k94
3976D7m17M17K92n15j02N49p3n16K31M51l69l55M78K11n24j1M99j66m54L06L91
3997C70m14k66M96J05n37Q7M29k11l49L10K83m57j77N61m0m69J90M22l44l07M03
4018H5K18n03n2N08j12m68K45M12l66k73M59J34n27K5N06j86m53L39L53m39k18
4039c13N09N4n16J17M75k77l95M02K59m72q8N00m8m93K08M04l40l09M31J96m43
4060a39k3M29j22m52K81L67m18k28M74P6n04Q4M66k19l91L74K57m49j41M83j6
$$ plain form
4081 189 -282 -109 324 23 -306 99 290 -197 -233 266 161 -311 -49 343 -21 -303 148 271 -235 -188 295
4102 295 104 -327 1 309 -89 -255 207 236 -268 -148 305 35 -315 60 304 -129 -237 232 165 -284 -88
4123 -88 302 -21 -291 112 266 -190 -188 265 122 -298 -29 312 -62 -287 153 248 -225 -147 310 85 -301 22
4145 22 281 -130 -266 216 213 -257 -106 317 35 -308 77 285 -160 -234 244 153 -299 -62 323 -31 -293 136
4167 136 247 -212 -196 254 90 -294 4 298 -88 -261 164 196 -243 -127 279 31 -280 60 288 -135 -229
4188 -229 217 178 -251 -78 291 -2 -287 109 269 -161 -184 246 127 -278 -36 288 -71 -287 163 247 -213
4209 -213 -175 268 75 -299 -13 273 -101 -256 181 201 -246 -121 284 25 -284 68 264 -152 -216 229 156
4230 156 -248 -74 283 -18 -259 104 222 -181 -169 262 104 -258 -13 277 -65 -237 153 195 -216 -143 253
$$ packed form
4081A89m71J73M33l01l29M05J91m87l6M99j05m72K62L92l64k82M51J23n06M7M83
4102B95j91m31L28L08l98j66M62K9n04J20M53k70l50L75K44m33j08M69o7m49J96
4123h8L90l23k70M03J54m56KM53j43m20K69L41l74k25M40R5m73P8M57k25l86L23
4145B2K59m11j36M82lm70J51M23k82l43L85K08m45p4M78r1m52K37L85l54k62M29
4167A36J11m59J6M50j64l84K98K94l86j73M25L2m39J16M06k48l11L40K28m23r4
4188b29M46l9m29J73L69k93k85L96J60m30k3M30j19m05K42L24l59k16M50Q4m60
4209b13L8M43j93l74K86K86l74j55M37K0m47J25M05k59l09L52J96m16o4M45p3
4230A56m04J74L57l01k41L63J18m03J2M31j58l62K45K90l42j72L90M2m11P3L96
$$ plain form
4251 253 54 -265 27 257 -129 -224 186 151 -268 -104 271 3 -275 70 251 -149 -197 217 122 -278 -44
4272 -44 279 -40 -256 134 220 -194 -152 261 79 -277 11 279 -89 -237 167 190 -204 -102 263 28 -272
4293 -272 63 243 -123 -195 200 125 -233 -54 256 -36 -269 97 234 -189 -190 232 84 -252 -15 259 -87
4314 -87 -252 139 188 -217 -143 250 46 -259 40 260 -114 -228 198 162 -233 -77 273 9 -254 94 253
4335 253 -164 -184 229 134 -248 -33 265 -47 -244 123 189 -181 -152 232 70 -245 11 233 -100 -224 165
4356 165 164 -230 -103 243 11 -257 55 239 -131 -179 190 140 -245 -63 237 -25 -287 48 222 -147 -153 286
4378 286 116 -261 -51 183 -96 -213 136 198 -126 -105 253 67 -271 32 247 -108 -221 182 161 -219 -92
4399 -92 257 -1 -252 70 224 -154 -191 192 109 -240 -39 247 -46 -236 107 204 -180 -130 226 85 -227 8
$$ packed form
4251B53j99l19K92K30l86r5M10l5m19J64L75k68k78L45J81m00m8M14r5m00K34
4272d4L23l19k16L90Q6m14M2M13j82l56K88K68l68j48M04K3l94J02L65k35l00
4293b72L35J80l66p2L95p5l58J79L10k92k33L66J37m23jM22j48l36K37K74l46
4314h7j65L91M9m05P4L93k04l05K99K20l74j14M26l6l95J56L50k64k63L48J59
4335B53m17k0M13r5l82K15K98l12j97L67O6l70K9L84j62l15K56K22l33j24L89
4356A65jl94J27L46k32k68L12J84l70m8L69n0l85J82L00k62k62L35J74l69oM39
4378B86j70l77K10K34k79j17L49O2l24K1L58j86l38L03K15l55j13M03k1l80J27
4399i2L49k58k51L22J54l78l7L83q3l49K01K86k93j90L43R7l84N0L56j41l12K35
$$ plain form
4421 8 248 -69 -213 159 162 -203 -87 247 41 -243 63 244 -113 -198 206 151 -215 -64 262 -19 -242 96
4443 96 227 -158 -164 214 97 -254 -19 240 -90 -253 131 174 -194 -153 251 72 -260 7 244 -91 -196 188
4465 188 160 -186 -19 243 30 -283 69 227 -155 -159 202 109 -247 -72 246 -40 -243 120 159 -134 -111 228
4487 228 64 -184 -91 239 -81 -224 195 136 -233 -57 201 27 -194 67 237 -111 -155 172 140 -215 -31
4508 -31 222 -40 -243 121 231 -136 -94 206 55 -235 20 239 -74 -215 158 185 -203 -103 229 37 -237
4529 -237 39 228 -102 -180 169 137 -210 -75 242 -7 -234 76 199 -148 -159 192 91 -239 -35 238 -52
4550 -52 -239 115 177 -193 -131 226 52 -252 30 231 -90 -210 166 155 -210 -82 249 9 -244 78 240
4571 240 -132 -172 191 125 -210 -32 248 -31 -222 115 203 -172 -152 208 68 -228 7 229 -82 -206 133
$$ packed form
4421HK40l17j44L72Ll65J16L34k06k84L06J81l57q5M04n5l66J51L26k81k23L38
4443I6J31l85oL78j17l51K35K59l30j63L84M3l68M1M04j79l32K67K37l35j05L84
4465A88k8l46J67K62k13l13L52J58l82mL61r3l56J75L18k86k03L63L9k93K3L39
4487B28j64k48R3L30l20j43M19n9l69J76K58j74k21K61J70l48m4L27l2l55J84
4508c1K53k62k03L64J10l67M2L00j51k90K55K19l13j41L73K7l88J00L32j92k74
4529b37K76J89l30p8L49l2l47J35L17k49k27L10J23l47j1L51j01l30K04K73k90
4550e2j87L54O2l70O2L57j74l04K82K01l21j20L76j1l65J28L31k40k53L22J62
4571B40l72m0L63o6l35J78K80k79j91L37Q8l75K0L60j40k96K35K22l11j24L39
$$ plain form
4592 133 169 -202 -103 233 22 -230 56 219 -130 -185 173 130 -223 -50 233 -10 -220 101 211 -163 -159 210
4614 210 90 -232 -21 248 -52 -200 147 186 -201 -109 210 36 -255 26 309 -48 -175 162 177 -225 -63
4635 -63 238 -4 -246 71 212 -141 -174 184 93 -237 -47 237 -31 -221 106 191 -178 -126 225 59 -234 7
4657 7 242 -77 -193 154 148 -193 -86 223 22 -236 62 227 -124 -189 190 128 -211 -45 254 -17 -234 100
4679 100 207 -162 -158 214 86 -238 -7 248 -64 -229 121 167 -194 -116 223 42 -235 35 236 -107 -201 180
4701 180 158 -202 -83 233 4 -214 88 217 -140 -158 198 105 -220 -31 225 -40 -214 120 176 -181 -130 214
4723 214 72 -247 11 215 -85 -202 157 149 -212 -85 253 19 -237 48 212 -135 -182 179 128 -227 -60
4744 -60 250 -18 -232 95 196 -159 -133 221 84 -211 10 250 -66 -217 133 163 -172 -109 249 36 -235
$$ packed form
4592A33L6l71R9L36k11k52K86J63l49n5L58m3l53J73K83k43k10L21J10l74ML69
4614B10j20l22K11K69l00j48L47L9l87R2L19j74k91K81K83l57j27L37J5m02J62
4635f3L01k42k42L17J41l53l3L58r1l30J90K84k68j90L27Q5l69N2L51j66k93K41
4657GK35l19j16L47ol41J07L09k01k58K98J65l51o5L79o2l39J66K99k71k17L34
4679A00J07l69ML72j28l24K31K55l12j65L50M6l61P8L39j81k77K70K01l43r4L81
4701A80k2l60J19L16k29k18L02J29l57j8L56r3l25J89K56k65j74L34N6l57N1L44
4723B14j42l19K58K04l00j17L59ql61J27L38k34k56K85J64l47m7L61n1l55J67
4744f0L10k68k14L27J01l55K6L54j37k95K21K40l16j51L50L0l35O3L58k13k71
$$ plain form
4765 -235 59 214 -99 -205 200 142 -227 -91 237 -19 -212 70 228 -138 -206 176 111 -217 -22 243 -40
4786 -40 -213 118 189 -179 -136 224 87 -256 24 242 -109 -198 125 87 -168 -103 231 51 -206 77 205 -148
4808 -148 -175 209 98 -255 -12 253 -17 -212 122 188 -184 -133 176 86 -206 -25 254 -75 -210 124 165 -179
4830 -179 -142 228 27 -220 51 253 -140 -213 159 87 -227 -47 232 7 -204 137 215 -146 -141 269 90 -277
4852 -277 -54 303 -59 -242 123 225 -231 -129 201 42 -249 54 236 -57 -199 128 147 -218 -85 246
4872 246 42 -195 92 177 -197 -187 180 91 -195 -51 242 -69 -258 110 180 -164 -83 181 61 -215 -18 180
4894 180 -96 -212 153 256 -199 -111 244 29 -185 38 230 -84 -207 114 95 -175 -73 250 -11 -211 95
4915 95 224 -246 -108 189 22 -265 -44 264 -66 -260 159 205 -320 -168 220 -1 -281 113 245 -162 -227
$$ packed form
4765b35K94J55l13j06M05n8l69J36L28k56j93K82J58l66o8L82o5l28J95K65k83
4786d0j73L31P1l68M3L60j37l43K80K18l51q9L23l8k55O5L34j80k57K83J28l53
4808a48k7L84j11l53K43K65k70j95L34O6l72N1L09r0k92J81K79l29j35L34M1l44
4830a79L7L70k01k47K71K02l93p3L72p2l14J80K79k25k11L41P8l61NM10j79l67
4852b77K23L57l62j83L65J02m56J02L30j59k91L03J82k93j42L27J9l65J33L31
4872B46k04k37K87Q5l74J0L67q9k86J44K93l11j89L68P0l44Q1K64j20k76J97J98
4894A80k76j16L65J03m55Q8L55k15k14K23J92l14j23L21j9k70J02L23k61k00L06
4915I5J29m70J38K97j67k87K21L08l30j94M19M6n25J52L88k21k80L94J32m07o5
$$ [...]
8191B8
##END NTUPLES=NMR FID
##END=
