##TITLE=1H_LY-16Dix.4.B
 CD3CN, 8 sc, 
 3.06.2021
##JCAMPDX= 6.0         $$ Bruker NMR JCAMP-DX V2.0
##DATA TYPE= NMR FID
##DATA CLASS= NTUPLES
##ORIGIN= UXNMR, Bruker Analytische Messtechnik GmbH
##OWNER= root
$$ XWIN-NMR		Version 3.5
$$ Thu Jun  3 13:48:13 2021 Russian Standard Time (UT+4h)  she@DPX200
##.OBSERVE FREQUENCY= 200.131506
##.OBSERVE NUCLEUS= ^1H
##.DELAY= (6, 6)
##.ACQUISITION MODE= SIMULTANEOUS
##.ACQUISITION SCHEME= undefined
##.AVERAGES= 8
##.DIGITISER RES= 18
##SPECTROMETER/DATA SYSTEM= spect
##.PULSE SEQUENCE= zg30
##.SOLVENT NAME= CDCl3
##.SHIFT REFERENCE= (INTERNAL, CDCl3, 0, 15.7039)
##AUDIT TRAIL= $$ (NUMBER, WHEN, WHO, WHERE, WHAT)
$$ ##TITLE= Audit trail, XWIN-NMR		Version 3.5
$$ ##JCAMPDX= 5.01
$$ ##ORIGIN= Bruker BioSpin GmbH
$$ ##OWNER= she
$$ F:/spectra/data/she/nmr/H-F/1/audita.txt
$$ ##AUDIT TRAIL=  $$ (NUMBER, WHEN, WHO, WHERE, WHAT)
(   1,<2021-06-03 13:47:01.96 +0400>,<she>,<DPX200>,
      <created by zg, POWCHK disabled, PULCHK disabled
       configuration hash MD5:
       00 E9 B6 7A A2 85 ED C7 34 08 36 98 17 FE 4E 26
       data hash MD5: 16K
       C2 4E B2 9B 5A C6 04 37 7C 71 36 4F AA 1D B6 99>)
$$ ##END=
$$ 
$$ hash MD5
$$ 5E CE 30 E1 2A 36 6F 8B D4 F3 36 8D C4 E4 6A 25
##$RELAX= 
##$RELAX= 
##$RELAX= 
##$RELAX= 
##$RELAX= 
##$RELAX= 
$$ Bruker specific parameters
$$ --------------------------
##$DU= <F:/spectra>
##$EXPNO= 1
##$NAME= <H-F>
##$PROCNO= 1
##$TYPE= <nmr>
##$USER= <she>
##$AMP= (0..31)
100 100 100 100 100 100 100 100 100 100 100 100 100 100 100 100 100 100 
100 100 100 100 100 100 100 100 100 100 100 100 100 100 
##$AQSEQ= 0
##$AQ_mod= 1
##$AUNM= <au_zg>
##$AUTOPOS= <>
##$BF1= 200.13
##$BF2= 200.13
##$BF3= 200.13
##$BF4= 200.13
##$BF5= 200.13
##$BF6= 200.13
##$BF7= 200.13
##$BF8= 200.13
##$BYTORDA= 1
##$CFDGTYP= 0
##$CFRGTYP= 5
##$CHEMSTR= <none>
##$CNST= (0..31)
1 1 145 1 1 1 1 1 1 1 1 1 1 1 1 1 1 1 1 1 1 1 1 1 1 1 1 1 1 1 1 1 
##$CPDPRG= <>
##$CPDPRG1= <>
##$CPDPRG2= <>
##$CPDPRG3= <>
##$CPDPRG4= <mlev>
##$CPDPRG5= <mlev>
##$CPDPRG6= <mlev>
##$CPDPRG7= <mlev>
##$CPDPRG8= <mlev>
##$CPDPRGB= <>
##$CPDPRGT= <>
##$D= (0..31)
0 1.2 0 0 0 0 0 0 0 0.06 0 0.03 0 0 0 0 0.0002 0 0 0 0 0 0 0 0 0 0 0 0 
0 0 0 
##$DATE= 1622713621
##$DBL= (0..7)
120 120 120 120 120 120 120 120 
##$DBP= (0..7)
150 150 150 150 150 150 150 150 
##$DBP07= 0
##$DBPNAM0= <>
##$DBPNAM1= <>
##$DBPNAM2= <>
##$DBPNAM3= <>
##$DBPNAM4= <>
##$DBPNAM5= <>
##$DBPNAM6= <>
##$DBPNAM7= <>
##$DBPOAL= (0..7)
0.5 0.5 0.5 0.5 0.5 0.5 0.5 0.5 
##$DBPOFFS= (0..7)
0 0 0 0 0 0 0 0 
##$DE= 6
##$DECBNUC= <off>
##$DECIM= 32
##$DECNUC= <off>
##$DECSTAT= 4
##$DIGMOD= 1
##$DIGTYP= 9
##$DL= (0..7)
0 120 120 120 120 120 120 120 
##$DP= (0..7)
150 150 150 150 150 150 150 150 
##$DP07= 0
##$DPNAME0= <>
##$DPNAME1= <>
##$DPNAME2= <>
##$DPNAME3= <>
##$DPNAME4= <>
##$DPNAME5= <>
##$DPNAME6= <>
##$DPNAME7= <>
##$DPOAL= (0..7)
0.5 0.5 0.5 0.5 0.5 0.5 0.5 0.5 
##$DPOFFS= (0..7)
0 0 0 0 0 0 0 0 
##$DQDMODE= 0
##$DR= 18
##$DS= 0
##$DSLIST= <SSSSSSSSSSSSSSS>
$$ [...]
##$SUBNAM2= <"">
##$SUBNAM3= <"">
##$SUBNAM4= <"">
##$SUBNAM5= <"">
##$SUBNAM6= <"">
##$SUBNAM7= <"">
##$SUBNAM8= <"">
##$SUBNAM9= <"">
##$SW= 20.0188882624521
##$SWIBOX= (0..15)
0 0 2 0 0 0 0 0 0 0 0 0 0 0 0 0 
##$SW_h= 4006.41025641026
##$TD= 16384
##$TD0= 1
##$TE= 0
##$TE2= 300
##$TE3= 300
##$TEG= 300
##$TL= (0..7)
0 120 120 120 120 120 120 120 
##$TP= (0..7)
150 150 150 150 150 150 150 150 
##$TP07= 0
##$TPNAME0= <>
##$TPNAME1= <>
##$TPNAME2= <>
##$TPNAME3= <>
##$TPNAME4= <>
##$TPNAME5= <>
##$TPNAME6= <>
##$TPNAME7= <>
##$TPOAL= (0..7)
0.5 0.5 0.5 0.5 0.5 0.5 0.5 0.5 
##$TPOFFS= (0..7)
0 0 0 0 0 0 0 0 
##$TUNHIN= 0
##$TUNHOUT= 0
##$TUNXOUT= 0
##$USERA1= <user>
##$USERA2= <user>
##$USERA3= <user>
##$USERA4= <user>
##$USERA5= <user>
##$V9= 5
##$VALIST= <valist>
##$VCLIST= <CCCCCCCCCCCCCCC>
##$VD= 0
##$VDLIST= <DDDDDDDDDDDDDDD>
##$VPLIST= <PPPPPPPPPPPPPPP>
##$VTLIST= <TTTTTTTTTTTTTTT>
##$WBST= 1024
##$WBSW= 4
##$XGAIN= (0..3)
0 0 0 0 
##$XL= 0
##$YL= 0
##$YMAX_a= 305404
##$YMIN_a= -302551
##$ZGOPTNS= <>
##$ZL1= 120
##$ZL2= 120
##$ZL3= 120
##$ZL4= 120
##$ABSF1= 10
##$ABSF2= 0
##$ABSG= 5
##$ABSL= 3
##$ALPHA= 0
##$AQORDER= 0
##$ASSFAC= 0
##$ASSFACI= 0
##$ASSFACX= 0
##$ASSWID= 0
##$AUNMP= <proc_1d>
##$AZFE= 0.1
##$AZFW= 0.1
##$BCFW= 1
##$BC_mod= 2
##$BYTORDP= 1
##$COROFFS= 0
##$CY= 11.3945322036743
##$DATMOD= 1
##$DC= 2
##$DFILT= <>
##$DTYPP= 0
##$F1P= 15.9154993809931
##$F2P= -4.1035820241983
##$FCOR= 0.5
##$FTSIZE= 0
##$FT_mod= 4
##$GAMMA= 1
##$GB= 0.15
##$INTBC= 1
##$INTSCL= 1
##$ISEN= 128
##$LB= 0.24
##$LEV0= 0
##$LPBIN= 0
##$MAXI= 10000
##$MC2= 0
##$MEAN= 0
##$ME_mod= 0
##$MI= 1.114404
##$NCOEF= 0
##$NC_proc= 0
##$NLEV= 6
##$NOISF1= 3.799351
##$NOISF2= 2.8
##$NSP= 1
##$NTH_PI= 0
##$NZP= 0
##$OFFSET= 15.70392
##$PC= 1
##$PHC0= -11398.17
##$PHC1= 17.80099
##$PH_mod= 1
##$PKNL= yes
##$PPARMOD= 0
##$PSCAL= 0
##$PSIGN= 0
##$REVERSE= no
##$SF= 200.130013532006
##$SI= 16384
##$SIGF1= 3
##$SIGF2= 2
##$SINO= 400
##$SIOLD= 16384
##$SREGLST= <1H.CDCl3>
##$SSB= 0
##$STSI= 0
##$STSR= 0
##$SW_p= 3612.71676300578
##$SYMM= 0
##$S_DEV= 0
##$TDeff= 0
##$TDoff= 0
##$TI= <>
##$TILT= no
##$TM1= 0
##$TM2= 0
##$TOPLEV= 0
##$USERP1= <user>
##$USERP2= <user>
##$USERP3= <user>
##$USERP4= <user>
##$USERP5= <user>
##$WDW= 1
##$XDIM= 8192
##$YMAX_p= 0
##$YMIN_p= 0
$$ End of Bruker specific parameters
$$ ---------------------------------
##NTUPLES= NMR FID
##VAR_NAME=  TIME,          FID/REAL,        FID/IMAG
##SYMBOL=    X,             R,               I
##VAR_TYPE=  INDEPENDENT,   DEPENDENT,       DEPENDENT
##VAR_FORM=  AFFN,          ASDF,            ASDF
##VAR_DIM=   8192,          8192,            8192
##UNITS=     SECONDS,       ARBITRARY UNITS, ARBITRARY UNITS
##FACTOR=    0.0002496,     1,               1
##FIRST=     0,             0,               0
##LAST=      2.0444736,     0,               0
##MIN=       0,             -302551,         0
##MAX=       2.0444736,     305404,          0
$$ Real data points
##PAGE= N=1
##DATA TABLE= (X++(R..R)), XYDATA
$$ [...]
2933f19j988M266M82m595R36M307k156l584L318K407m002j068M369m80m380J861
2949i26L939l010k995L807J775m220k81M279j167m004K435L311l487k240M150
2964A366J011m301L84M207j873l743K988K877l818j704M297L17m265J077L902
2979B722k504l166L535K128m152q94M352m69m066J858L444l037k494L821J308
2994B386m289O1M269j361l651K574K775l617j633M113L67m241R60L924k133l215
3010b711L104K160l820r00M132l97m047J643L546k724k667L596J566m084k78M141
3026B260j050l866K239L149l140k108L797Q92m095M01L954j690l451K832K591
3041B715l643j443M026J77m073J168L645k372k862L250J829l801n96L997o71l733
$$ y = [-619, -2607, 1659, 2141, -2454, -1518, 2789, 633, -2951, 367, 2774, -1228, -2296, 2073, 1593, -2787, -926, 3013, 3, -2992, 815, 2590, -1630, -1911, 2368, 1201, -2803, -368, 2943, -544, -2784, 1366, 2377, -1924, -1540, 2667, 794, -2949, 39, 2916, -902, -2606, 1691, 2008, -2257, -1180, 2722, 218, -2948, 587, 2715, -1437, -2331, 2021, 1552, -2514, -656, 2788, -249, -2743, 1078, 2386, -1903, -1842, 2427, 1066, -2585, -11, 2764, -853, -2486, 1627, 1994, -2247, -1287, 2637, 504, -2711, 393, 2553, -1267, -2167, 1965, 1568, -2479, -836, 2710, -14, -2681, 915, 2481, -1603, -1881, 2260, 1210, -2656, -417, 2732, -408, -2516, 1281, 2173, -1922, -1521, 2433, 743, -2708, 124, 2715, -928, -2371, 1655, 1832, -2241, -1073, 2572, 200, -2662, 588, 2417, -1384, -1980, 2017, 1346, -2387]
3057b387J909L072k981k152L651J090l991K33L871j403l375K467K516l294j413
3072b187L759K30l897R51L636k070k954K950J993l604r01L885l13l813J501L349
3088B515k474k502L251J389l738k10L830r50l582K109K936k960j968L546P85l816
3104a839M43L721j645l194K594K335l299j146L642q5l660J300L265k371k564L112
3120F09J669l549m89L654p35l410J831K851k744k020L371R40l605K38L538j428
3136G21l105K416K406l156j471L499M02l562P64L308j877k759K759J999l447r59
3152b062L689j98l520J363L048k405k313L189J354l542l45L617q16l236J912K568
3168B303k820j637L405O14l598M72L394j524k802K419J977l126r77L508r3l494
$$ y = [-2387, -478, 2594, -387, -2539, 1112, 2202, -1789, -1556, 2315, 912, -2463, 4, 2520, -774, -2187, 1572, 1802, -2095, -1144, 2492, 422, -2532, 418, 2411, -1193, -2094, 1791, 1478, -2335, -834, 2515, 41, -2461, 790, 2179, -1559, -1769, 2061, 1111, -2471, -362, 2574, -386, -2354, 1192, 1977, -1839, -1396, 2325, 680, -2514, 80, 2415, -884, -2030, 1612, 1527, -2133, -833, 2432, 61, -2503, 609, 2278, -1271, -1760, 1894, 1159, -2251, -420, 2431, -313, -2333, 1038, 1978, -1627, -1389, 2149, 721, -2384, 32, 2438, -718, -2189, 1310, 1712, -1850, -1086, 2222, 345, -2414, 345, 2344, -1103, -2062, 1627, 1429, -2091, -728, 2320, -85, -2398, 791, 2145, -1397, -1742, 1875, 1059, -2177, -265, 2303, -517, -2154, 1251, 1865, -1733, -1261, 2133, 609, -2193, 226, 2203, -923, -1900, 1608, 1515, -1979]
3184a979J068L067k025k304K798J350l307l49L519o72l340J596K818k440j935
3199b135L073Q75l408K33L387j187l087K072K410k788j420L230L35l413P51L317
3215B245j739k775K491J920l053q59L291k96l197J351K836k231k190K908J219
3230A921l235j46L252r36k978J926K425k651j572L041N54l190N56L005j568k553
3246b149K405J843k941r74L180l1l135J052K790j961k242K710J438l115m86L188
3262A572n28k964J540K461k361j787K987R01l230L9L188j044k781J977K107k642
3278e65j314L124L01l158O62K853j589k317K435J525k976o46L183l02l043J209
3294f18K531k018j788K639R31k995rL036r06k721J704K139k376j280K811L74l004
$$ y = [-1979, -911, 2156, 131, -2173, 625, 1975, -1332, -1681, 1838, 1166, -2174, -578, 2240, -200, -2135, 938, 1813, -1595, -1362, 2025, 838, -2249, -177, 2233, -555, -1975, 1255, 1590, -1823, -1072, 2245, 506, -2269, 222, 2142, -911, -1770, 1521, 1225, -1972, -621, 2215, -16, -2206, 702, 1921, -1314, -1460, 1792, 856, -2122, -196, 2229, -422, -1994, 1047, 1601, -1589, -1033, 1972, 404, -2149, 256, 2099, -842, -1816, 1364, 1333, -1802, -750, 2040, 79, -2163, 547, 1985, -1130, -1616, 1572, 1044, -1920, -380, 2081, -280, -2067, 920, 1821, -1409, -1370, 1818, 774, -2007, -30, 2077, -565, -1879, 1245, 1546, -1612, -950, 1903, 314, -2003, 432, 1957, -1019, -1665, 1518, 1216, -1827, -618, 1913, -105, -1893, 746, 1677, -1318, -1327, 1709, 803, -1918, -214, 1925, -451, -1731, 1080, 1454, -1550]
3311a550N10K925j338k497K043J756k584q73K937p8k977J001K680j790k186K436
3327D15J352k790l90K936n53k831J462K400k190j705K636Q59k869J75K843j158
3343E92k521J931J977k485j224K790K31k778O97K543j567k055K240J382k665n93
3359a505K819l37k657J211K272j972j665K501R45k751j04K752p73k444J551J946
3375A789k191j269K648M40k805L96K671j215k279J920J683k400r67K763L0k739
3391a525Q15K442j584j921K231J158k568l73K732n35k581J324K172j981j497K385
3407F94P10k615K12K555j015k214J690J639k221r37K515J53k541P09K282j435
3423A81j870K044J248k413n40K546k59k426J019K056j687j518K266Q19k543p6
$$ y = [-1550, -1040, 1885, 547, -1950, 93, 1849, -735, -1608, 1329, 1251, -1726, -725, 1955, 165, -2021, 415, 1767, -1023, -1413, 1523, 970, -1861, -399, 2001, -189, -1894, 742, 1601, -1268, -1093, 1750, 592, -1929, 2, 1979, -506, -1730, 1060, 1291, -1487, -790, 1753, 186, -1869, 371, 1753, -912, -1505, 1314, 977, -1680, -469, 1803, -169, -1834, 667, 1612, -1139, -1243, 1509, 736, -1708, -157, 1789, -402, -1671, 977, 1417, -1388, -992, 1679, 464, -1815, 105, 1788, -612, -1579, 1184, 1214, -1525, -710, 1732, 148, -1773, 458, 1616, -952, -1325, 1407, 872, -1709, -385, 1787, -194, -1691, 694, 1404, -1211, -999, 1556, 541, -1673, 17, 1656, -565, -1502, 1013, 1166, -1375, -666, 1616, 181, -1689, 355, 1603, -810, -1350, 1196, 937, -1489, -470, 1586, -101, -1619, 647, 1466, -1077, -1153]
3439a153K546o50k342J425J855k005j209K387M52k527K70K465j079k019J743J437
3455A596k240p42K466j4k473P72K174j447j660J942J028k279k71K404m81k280
3471a505J202J830j774j207K135N60k319K33K252r47k022J530J543j965q13K173
3487I06J18k270O15K099j262j753J815J166k160n05K316k42k215R79J930j533
3503Dj522J976Q34k201q4K246o62k042J332J670j871j107K146M36k205L09K072
3520A331j000j789J639J292k005p04K137j9k085P01J816j322j385J847Q93k144
3536g97k66K101l91j951J040J643j609j080J979N11k144J32K070p87j778J364
3552C7J299j808p98K144K32k191M05J963j053j578J533J069j910m66K179j72k115
$$ y = [-1153, 1393, 743, -1599, -174, 1681, -324, -1533, 854, 1306, -1221, -951, 1514, 435, -1584, 159, 1596, -644, -1386, 1080, 1066, -1407, -635, 1539, 92, -1568, 374, 1402, -877, -1148, 1256, 775, -1505, -303, 1527, -247, -1454, 681, 1241, -1078, -845, 1407, 460, -1562, -32, 1511, -454, -1267, 906, 1024, -1246, -631, 1468, 206, -1547, 268, 1434, -726, -1231, 1085, 843, -1372, -393, 1537, 4, -1518, 458, 1292, -909, -993, 1253, 591, -1451, -119, 1551, -320, -1427, 719, 1155, -1050, -741, 1331, 331, -1458, 181, 1473, -532, -1236, 901, 882, -1203, -502, 1314, -8, -1393, 454, 1347, -797, -1063, 1038, 647, -1304, -264, 1379, -230, -1310, 669, 1180, -964, -832, 1238, 451, -1327, 37, 1336, -472, -1270, 874, 1106, -1085, -680, 1283, 230, -1348, 185, 1254, -656, -1122, 1057, 885, -1230]
3569a230P17J860j366j336J799P22k013j03K119n20j962J117J538j537r88J876
3585F93K59j979L42J948r02j684J443J174j815n99J951k2j950O39J831j177j417
3602a265J553Q66j852k29J957m09j899J010J638j449j226J817O13j951M1J922
3618A137p01j762J262J420j651r33J970K51k006L71J852r64j615J529J147j828
3634e21n54J979r9j936P31J669j300j266J700P31j919j02J949m94j721J048J373
3651A268j546r50J804M47j892K46J766q00j546J306J083j690o02J938J9j914N50
3668e13J698j059j363J543Q83j838l37J927k64j824Q41J587j335j108J715N43
3684A096j984K1J980n77j772J174J339j560q20J856J61j909L78J798r39j482J387
$$ y = [-1230, -513, 1347, -19, -1355, 444, 1166, -847, -950, 1169, 649, -1313, -196, 1342, -195, -1183, 693, 952, -1027, -685, 1263, 361, -1323, 120, 1294, -521, -1120, 831, 809, -1141, -502, 1329, 152, -1265, 288, 1154, -698, -927, 1030, 621, -1278, -268, 1370, -79, -1305, 512, 1125, -826, -785, 1137, 436, -1326, -64, 1356, -295, -1228, 742, 993, -1013, -642, 1210, 246, -1369, 160, 1307, -521, -1075, 904, 805, -1131, -400, 1269, -31, -1297, 403, 1134, -785, -887, 1062, 568, -1153, -105, 1268, -278, -1228, 576, 1023, -869, -623, 1143, 343, -1203, 103, 1186, -504, -1106, 832, 851, -1063, -513, 1185, 126, -1237, 306, 1189, -649, -986, 941, 677, -1147, -306, 1281, -54, -1162, 553, 1096, -888, -867, 1113, 536, -1236, -62, 1277, -283, -1103, 753, 914, -995, -617, 1181, 242, -1240, 147]
3701A47R89j702l97J879k06j822P08J602j189j200J566O90j770n4J799n80j682
3718a222J071J367j478q70J744L47j830K58J751q46j533J311J154j646o61J826
3734G43O2j843N85J692j115j375J544Q58j861k89J948k84j808R09J502j367j106
3751a205J655N88j867Q6J811o52j584J187J184j571p27J832J53j881M07J717r59
3768A74j335J369R10j643l52J731k33j742P70J543j222j110J590O25j798q4J824
3785A017m99j688J065J364j483r25J765L56j826K35J782q53j536J293J132j668
3801d69n97J880M1j856N54J638j145j343J556Q72j804k63J855l15j713Q99J411
3818A201j388r69J717M44j837O8J772o06j487J170J102j559o60J759O7j785M74
$$ y = [147, 1136, -566, -963, 916, 710, -1112, -404, 1198, 9, -1191, 375, 1065, -705, -759, 1040, 460, -1222, -151, 1216, -262, -1132, 612, 959, -871, -613, 1138, 292, -1241, 70, 1224, -422, -1083, 743, 805, -1038, -453, 1239, 124, -1251, 293, 1151, -710, -999, 949, 665, -1143, -234, 1268, -99, -1205, 450, 1038, -829, -743, 1068, 416, -1168, 19, 1203, -368, -1095, 737, 890, -991, -584, 1133, 174, -1161, 208, 1118, -525, -877, 854, 621, -1121, -351, 1192, -30, -1140, 450, 1075, -723, -807, 1017, 518, -1170, -105, 1259, -224, -1149, 616, 972, -854, -619, 1163, 310, -1226, 67, 1199, -469, -1066, 814, 855, -1001, -447, 1191, 46, -1297, 259, 1131, -673, -936, 919, 604, -1109, -210, 1201, -187, -1156, 561, 1005, -832, -764, 1008, 402, -1085, 85, 1187, -372, -1032, 727, 794, -991, -517]
3835e17J670r57j324J396Q41j707l61J846j84j807P51J527j185j126J579N94j806
3852g70n3J912o19j708J101J332j421q59J754K73j855K81J746q59j489J292J089
3869A147j587n09J797j23j817O85J610j181j251J552O94j670j37J724m51j553
3885a070R40J344j393r66J635M10j721K54J645p25j510J242J095j602o48J791
3901G21P6j706M98J538j062j257J471Q41j729l11J754k28j695Q23J487j320j048
3918a147J640N73j848k6J736n41j513J130J140j478p34J769J95j836L45J663q68
3935B00j304J313Q98j649l43J762j93j690O52J425j128j002J466N29j653%J726
3952A009n20j605R51J255j342p47J617K34j692K72J681q07j461J208J023j504
$$ y = [-517, 1153, 196, -1128, 268, 1109, -598, -959, 887, 703, -1104, -353, 1174, -11, -1137, 442, 1036, -770, -823, 1089, 470, -1238, -137, 1195, -226, -1085, 669, 942, -913, -632, 1114, 255, -1234, 58, 1147, -440, -949, 848, 725, -1092, -407, 1203, 22, -1229, 323, 1017, -653, -790, 934, 483, -1070, -130, 1214, -179, -1145, 490, 900, -821, -567, 1078, 353, -1157, 85, 1180, -422, -1070, 721, 797, -909, -411, 1127, 65, -1192, 279, 1120, -609, -920, 834, 606, -1089, -266, 1221, -99, -1147, 493, 1066, -782, -808, 928, 387, -1126, 4, 1144, -334, -1068, 701, 896, -940, -595, 1068, 200, -1104, 209, 1107, -542, -885, 877, 684, -1006, -354, 1071, -57, -1059, 407, 936, -717, -717, 1009, 489, -1116, -165, 1090, -252, -999, 618, 852, -840, -568, 1113, 306, -1155, 53, 1076, -428]
3968d28n15J694o1j722O34J588j087j268J401Q03j669k71J772l17j646R29J390
3985A227j375r84J601M54j748J34J701o73j479J173J107j463o40J625J22j700
4001i18M60J545r86j233J391Q59j647l26J714k47j614P22J377j186j002J521N52
4018I82j683n0J672n19j515J010J239j436p79J687K72j766L08J667p84j452J284
4035A37R51j570m94J749j1j708N66J519j093j253J497P62j714j71J767l78j620
4052a064Q70J300j295q75J616L60j741J62J677o92j386J131J065j508n87J663
4068F96O0j720M45J593r23j228J316Q14j635l00J713k41j667Q00J418j225j031
4085a115J537N68j755k3J790n45j578J005J253j413p74J680K54j790L39J669q78
$$ y = [-428, -943, 751, 690, -1032, -398, 1190, 103, -1165, 236, 1039, -630, -901, 871, 554, -1092, -163, 1227, -148, -1132, 469, 923, -825, -691, 1010, 337, -1142, 31, 1138, -325, -965, 660, 782, -918, -458, 1087, 101, -1132, 259, 1118, -529, -855, 859, 612, -1002, -280, 1097, -89, -1091, 430, 982, -701, -751, 921, 402, -1113, -103, 1136, -300, -1079, 608, 880, -886, -578, 1089, 305, -1147, 137, 1088, -482, -976, 773, 762, -946, -380, 1139, 46, -1207, 290, 1052, -662, -833, 934, 556, -1064, -194, 1106, -189, -1064, 552, 912, -829, -667, 1010, 318, -1068, 63, 1128, -380, -967, 696, 756, -964, -519, 1074, 151, -1077, 239, 1053, -582, -882, 831, 590, -1077, -277, 1141, -84, -1115, 422, 990, -765, -788, 1002, 457, -1121, -116, 1137, -276, -1050, 630, 884, -906, -567, 1102, 224]
4102B24j424J304J030j580m97J761j14j675O35J473j121j148J504O29j668q9J669
4119I13m22j531R21J258j343q34J566L37j680J89J651p08j396J155J015j507n44
4136i60J661J8j693N06J600j022j219J353Q28j662k87J744k75j664P96J414j228
4153i0j034J583N16j719K1J727o37j503J084J227j443p27J638J82j727L60J580
4170A038q84j278J339Q72j586l82J666j41j642P05J399j145j082J472O46j634
4186f37j53J671m43j432Q83J201j383p59J621L28j703J92J635p35j360J146J012
4203A084j532n37J740J3j710M94J538r75j184J388P04j656k42J767k72j656Q09
4220b27J380j235r58J522M32j731J19J707o29j482J057J141j438o12J622P7j693
$$ y = [224, -1200, 104, 1134, -446, -943, 818, 704, -971, -336, 1137, 16, -1132, 372, 1001, -667, -756, 913, 491, -1040, -119, 1139, -204, -1038, 528, 865, -815, -626, 1025, 317, -1079, 76, 1091, -416, -960, 701, 719, -974, -468, 1132, 110, -1109, 244, 1072, -590, -877, 867, 592, -1072, -276, 1138, -90, -1124, 459, 975, -744, -723, 1004, 367, -1136, -52, 1175, -268, -995, 643, 825, -902, -542, 1038, 154, -1124, 215, 1087, -499, -881, 785, 644, -998, -293, 1106, -39, -1121, 351, 997, -637, -790, 881, 438, -994, -111, 1090, -293, -1052, 569, 897, -806, -614, 1021, 286, -1074, 72, 1084, -448, -985, 755, 768, -942, -448, 1090, 115, -1069, 319, 1023, -633, -875, 892, 620, -1036, -227, 1153, -82, -1040, 482, 914, -817, -698, 1009, 380, -1102, -45, 1096, -342, -954, 668, 745, -948]
4237i48M40J579q86j278J255Q45j472l45J625k43j579P31J350j133j022J504N64
4254I87j675k4J673n43j530R96J239j375p75J581K94j687L11J580q56j354J286
4271A28J029j606n42J696J7j667O17J451j080j185J465P09j662j89J696l60j540
4288a023Q95J223j326q59J614L69j696J65J574o33j346J115J016j496n50J666
4304G08P3j683M60J482r70j117J344P26j607k89J705k28j632P56J341j164r53
4321a048J540M36j735J23J696o18j492J022J185j420o88J654J86j764L64J657
4337A098q83j324J239Q97j531l33J641k12j600P46J408j162j063J442N92j622
4353f67n8J630m61j518R61J206j347p39J529K59j585K81J500p61j324J201R52
$$ y = [-948, -508, 1071, 185, -1093, 162, 1007, -465, -810, 815, 572, -1007, -276, 1074, -59, -1081, 423, 987, -688, -712, 961, 418, -1112, -116, 1123, -252, -1027, 554, 848, -839, -528, 1052, 196, -1158, 128, 1157, -449, -991, 705, 722, -945, -328, 1123, 43, -1142, 323, 1032, -630, -819, 877, 517, -1023, -128, 1095, -231, -1090, 524, 893, -803, -638, 936, 303, -1043, 72, 1088, -408, -958, 708, 781, -902, -442, 1040, 70, -1047, 297, 1023, -584, -873, 832, 604, -1028, -272, 1069, -95, -1048, 492, 928, -807, -684, 1012, 394, -1098, -76, 1109, -311, -999, 655, 841, -923, -559, 1098, 215, -1109, 130, 1027, -504, -837, 804, 592, -1008, -262, 1146, -16, -1079, 363, 955, -667, -725, 905, 444, -1074, -113, 1093, -254, -993, 536, 795, -790, -509, 991, 230, -1094, 107, 1059]
4370A059j496n13J646l8j582N68J440j044j118J378P19j605k14J651l16j577Q53
4387a89J333j311q91J541M27j677J13J630o27j410J078J048j417n96J649M1j645
4404i03M35J524r19j207J316P86j554k84J599k29j507P09J253j110r34J442M80
4421H97j594L5J551n10j404R55J106j317p19J604J99j646L36J514q02j261J206
4438A50Q92j519l96J629j07j602N95J441j044j112J398O57j617j23J646m07j512
4455a031Q83J217j276p76J505L16j630J89J605p15j350J111R64j368n36J551N
4472F64j563M97J413r46j085J290P04j541k06J594l03j484P39J287j171r25J469
4489D33M46j581P1J562n65j414J032J072j355o77J579J85j665L55J552q25j266
$$ y = [1059, -437, -950, 696, 658, -924, -356, 1084, 40, -1078, 300, 1019, -586, -800, 851, 535, -1042, -189, 1144, -167, -1058, 483, 910, -767, -654, 976, 349, -1061, 17, 1065, -352, -948, 701, 742, -903, -468, 1056, 137, -1070, 246, 1032, -522, -806, 793, 564, -943, -234, 1019, -91, -1025, 417, 897, -697, -662, 889, 379, -1025, -70, 1036, -281, -1000, 604, 803, -843, -507, 1007, 205, -1056, 150, 1042, -477, -873, 756, 649, -953, -358, 1083, 39, -1073, 325, 982, -635, -758, 888, 481, -1031, -148, 1069, -207, -983, 522, 838, -792, -603, 1002, 287, -1063, 48, 1012, -356, -892, 659, 664, -899, -402, 1011, 65, -1020, 270, 974, -567, -773, 821, 518, -966, -227, 1060, -111, -1036, 433, 879, -702, -631, 931, 366, -1048, -16, 1056, -299, -976, 603, 788, -877, -522, 1030, 205, -1061]
4506a061J201Q95j509l92J637j35j601O65J382j105j030J413N78j605m0J566m17
4523D42j477R10J172j266p62J495K59j539K52J461p59j224J116R00j378n03J576
4540F75p1j486N32J355r74j098J341O82j518j75J559l67j405P89J240j247q68
4557a036J530L91j636J08J573n89j353J029J029j393o18J641R6j650M11J461q90
4574A04j152J265P97j558l05J651k23j523O51J274j051q64J342M27j529K0J577
4591I03n14j410R19J075j230o53J465J63j537L15J462p28j252J090Q57j359l66
4608h00J549j51j513N89J395j040j074J324O32j514r5J574m31j437Q64J213j274
4625a89p86J445L24j555K01J527p13j351J144J013j414n50J505N9j499M72J357
$$ y = [-1061, 140, 1035, -474, -866, 771, 636, -965, -300, 1082, -23, -1053, 360, 938, -667, -707, 859, 442, -1035, -125, 1047, -219, -981, 514, 773, -766, -514, 947, 188, -1036, 80, 980, -398, -901, 675, 604, -882, -350, 1005, 31, -1067, 274, 956, -562, -737, 822, 455, -950, -161, 1079, -168, -1036, 494, 885, -751, -643, 930, 341, -1012, 17, 1046, -347, -965, 676, 772, -878, -467, 994, 104, -1048, 217, 1014, -544, -849, 802, 579, -944, -293, 981, -70, -934, 408, 835, -694, -674, 903, 389, -1021, -102, 973, -257, -910, 555, 718, -819, -504, 958, 230, -1022, 68, 925, -434, -800, 749, 598, -915, -326, 1069, 29, -1045, 279, 911, -603, -698, 876, 445, -992, -128, 1085, -189, -975, 470, 794, -761, -560, 967, 254, -1097, 47, 1060, -354, -904, 601, 660, -839, -367, 990]
4642I90r49j081J314O60j486k09J525k74j411P47J191j161q53J436M20j523L7
4659f27J457n06j275R92R49j340n43J544Q4j566L47J409q05j154J267P45j464
4676d86l24J553j38j520O08J278j054q97J383M84j621L4J611m72j442R15J080
4693I92j243o69J502J58j560L01J485p68j188J054Q49j353l49J496j06j523N93
4710c29J322r86r87J263N84j445r3J488m08j384Q41J157j180p70J417K63j495
4727g42K10J494o87j271J077R55j362n44J503Jj484M70J379r61j062J293P07j540
4745e64k35J587k70j466P51J225j175q19J404M29j547J08J477n88j291R93R25
4762I44j284n15J474O7j509M08J351q00j108J164P23j413k49J478k12j407O79
$$ y = [990, 41, -1040, 274, 934, -552, -761, 764, 490, -921, -174, 1017, -144, -997, 439, 859, -664, -627, 830, 324, -951, 41, 990, -350, -893, 651, 735, -831, -484, 925, 120, -1034, 233, 978, -486, -810, 743, 605, -915, -307, 971, -83, -980, 403, 887, -734, -700, 911, 439, -1003, -88, 992, -251, -920, 582, 740, -820, -519, 966, 198, -990, 64, 913, -440, -789, 707, 601, -922, -329, 993, 7, -980, 283, 867, -578, -671, 817, 409, -975, -134, 1023, -157, -927, 490, 753, -742, -532, 962, 275, -996, 81, 1036, -326, -870, 633, 634, -850, -380, 999, 38, -1024, 269, 976, -564, -799, 788, 518, -948, -197, 1028, -147, -966, 438, 867, -680, -572, 905, 317, -974, 19, 944, -340, -855, 619, 686, -823, -415, 936, 136, -972, 192, 915, -498, -747, 731, 519, -888, -209]
4779b09J176j045q72J349M22j485K9J499n03j316R42J018j259o71J467J72j508
4796g94L33J419q04j185J157Q54j436l83J549j33j475O08J288j042r42J319N28
4813H61j475o4J468m15j318Q33J068j181o69J448J97j486K22J388o59j164J056
4830A10P85j278l87J412o3j392N20J222r05r84J236N52j385j40J471l07j398P66
4848a65J114j124p65J366L07j448J64J460o70j218J006R02j266n08J452M4j475
4865h24M46J319q40j048J168O65j381k23J466l11j335P25J141j039q23J279L91
4882G76j403N2J389n30j192Q96R26j160n53J345Q6j362L55J265q03j061J137P08
4900H71j302l28J413j40j348N86J158j038q06J301M10j358k6J418m82j230Q54
$$ y = [-209, 967, -78, -950, 399, 821, -664, -635, 864, 361, -955, -13, 1005, -254, -925, 542, 714, -794, -461, 958, 154, -1031, 126, 980, -456, -839, 710, 577, -898, -290, 998, -44, -986, 333, 861, -614, -678, 790, 375, -943, -110, 958, -223, -892, 556, 753, -733, -511, 877, 218, -946, 110, 895, -383, -770, 642, 579, -813, -293, 929, 24, -960, 276, 828, -557, -697, 774, 467, -931, -165, 949, -175, -940, 426, 733, -715, -551, 909, 239, -979, 27, 929, -337, -845, 607, 651, -824, -378, 941, 101, -947, 221, 886, -495, -718, 748, 437, -898, -173, 968, -71, -894, 385, 776, -627, -575, 814, 284, -908, -12, 914, -246, -799, 546, 632, -730, -375, 890, 87, -974, 163, 871, -431, -759, 654, 514, -834, -248, 910, -128, -934, 367, 777, -581, -607, 811, 329, -901, -47]
4917d7J001j231o30J424K29j446K26J315o42j123J088P36j363l39J441q9j358
4934h08N26J203r29q84J236M68j417p3J443l69j217P21R58j042o43J269K33j376
4952g01K14J334o23j130R66Q01j190m10J373p6j385M88J242q48r66J121O28j324
4970d86j27J378l32j355P08J136j030p84J292L48j371J01J359n65j201R47Q78
4987H96j205n03J340P5j355M35J258q44j037J094P00j275k73J313j61j244N98
5004a88J074j001p80J214M33j303l1J326m45j162Q28R47j162n83J320K08j384
5021f89K25J250o22j025J021P22j291l69J394p0j340N00J195q78r05J199M80j335
5039e38j38J410l33j237P25R60j049o33J318K49j400J70J304n47j140R05P79j138
$$ y = [-47, 954, -277, -907, 517, 746, -700, -474, 841, 199, -924, 164, 900, -463, -802, 639, 550, -808, -282, 921, -8, -892, 344, 812, -605, -678, 765, 396, -821, -100, 858, -184, -827, 442, 675, -701, -487, 847, 224, -906, 60, 861, -329, -739, 634, 558, -827, -339, 903, 55, -911, 210, 838, -486, -613, 765, 433, -922, -214, 922, -108, -892, 400, 748, -623, -522, 837, 272, -929, 18, 896, -309, -812, 528, 603, -752, -317, 941, 97, -940, 154, 854, -421, -694, 619, 458, -786, -188, 886, -115, -895, 319, 752, -551, -582, 744, 299, -863, -35, 912, -250, -833, 487, 695, -689, -464, 786, 164, -861, 160, 882, -409, -778, 616, 546, -794, -294, 901, 23, -882, 317, 797, -538, -676, 734, 401, -836, -111, 849, -200, -833, 485, 734, -666, -496, 808, 261, -879, 26, 805, -333]
5057c33l71J306j2j373M37J192q03r01J044N73j227j51J317k64j248O27J058r22
5075e1p68J179K91j260J24J260m91j137Q41R08j150n50J282Q3j298L84J239p50
5093A36j018J019O91j243k83J285j30j223N71J054r14p99J159M73j306m7J294
5110G19m12j133P85Q55j035n37J242J53j307K35J176n96r69R28O98j143l51J266
5128E74q8j227M53J087p93q13J045M77j233p6J291k99j211O87R61r98o71J239
5146D05K73j307J67J236n41j098R19P76j158m33J298J2j262M03J146p81r14J062
5164B03N97j244j96J280k23j186O13R84r15p15J176L15j274N5J234m75j016Q47
5182F0P67j081m78J246O4j268L06J139o33r31R45O33j190j93J227j82j194N39
$$ y = [-333, -704, 602, 590, -783, -346, 846, 43, -858, 186, 759, -468, -619, 698, 434, -814, -187, 871, -51, -819, 360, 651, -609, -485, 775, 284, -853, -12, 896, -254, -804, 478, 561, -737, -353, 886, 136, -882, 137, 828, -415, -698, 587, 457, -766, -195, 859, -55, -854, 305, 778, -528, -575, 719, 307, -826, -41, 814, -221, -758, 484, 637, -670, -435, 741, 145, -824, 104, 802, -341, -692, 574, 486, -741, -288, 799, 6, -807, 238, 715, -518, -594, 697, 398, -813, -126, 835, -163, -834, 405, 678, -629, -462, 774, 233, -865, 54, 830, -328, -761, 537, 549, -713, -310, 836, 55, -859, 203, 800, -444, -640, 640, 417, -769, -156, 828, -87, -802, 374, 689, -585, -530, 704, 229, -787, 60, 827, -254, -732, 514, 578, -690, -384, 755, 122, -809, 136, 769, -421, -614, 613, 431, -763, -224]
5200b24J042q74p45J130L79j253J5J271m22j147P35R08j012n45J228J47j322K91
5218c98J230o75j001R23P23j182k75J230r5j186M69J088q61p98J032M70j202m3
5236e51J234l27j150P28Q91r95o15J197J96j198J96J132n50r87Q75P07j077l70
5254f64J198j2j223M38J059p79q48J066N40j201j63J213k64j182O80R66r60o20
5272g56J166K76j253O4J214m71j037Q17P99j077m60J219O8j208L29J072o82r05
5290h25J008N22j141j90J252j70j153N22R38q59o80J087L35j177J5J190l83j026
5308g35O93P80r84m40J163R3j241K86J170o11r63Q84O41j091k74J198j54j168
5326g53N27J042q27p65J046M16j237K3J221l86j144P47R23r79n85J118K14j207
$$ y = [-224, 818, -56, -801, 329, 708, -545, -530, 741, 319, -828, -93, 815, -197, -742, 486, 633, -689, -398, 832, 157, -844, 79, 802, -380, -655, 575, 480, -706, -237, 851, -10, -808, 224, 694, -508, -551, 683, 356, -794, -66, 825, -170, -785, 412, 608, -590, -394, 738, 188, -799, 76, 783, -294, -664, 534, 522, -701, -263, 796, 17, -831, 235, 775, -426, -589, 624, 360, -822, -142, 824, -136, -756, 410, 686, -567, -503, 711, 240, -797, 20, 819, -258, -718, 501, 569, -639, -310, 762, 80, -825, 183, 705, -436, -626, 626, 456, -697, -175, 763, -96, -776, 311, 646, -531, -516, 674, 291, -735, -42, 738, -246, -686, 477, 570, -671, -385, 785, 174, -789, 95, 736, -355, -629, 569, 415, -753, -226, 816, -11, -776, 270, 686, -551, -528, 693, 307, -837, -90, 833, -146, -731, 387, 601, -606]
5344f06K41J101n82r37Q63O96j085l23J131k2j148M07J041p78p95R79N39j139
5362d17j03J123k52j082O02R21r65o00J159K46j172O2J184m96r97Q43P42j101
5380c03m11J173M7j183L68J116p47q53J006N38j220j72J263k06j136N58R46q84
5398a00o65J108L42j254O9J172m16j031P30Q11r98m60J178P7j250K85J110n72
5416A36r01R02O07j080k65J170j54j160N19J017q44p06J041M14j226PJ222l75
5434C24j116O81Q93r55n68J183J38j184K74J140o16j029Q94P19j129l14J221o0
5452D96j213M76J061q22q04J002N05j160q7J183k83j120O66R00r78o09J165K39
5470F17j185J12J148n03r36Q29O97j077l83J185Jj193M01J065p20q39J015M94
$$ y = [-606, -365, 736, 154, -783, 80, 776, -309, -632, 499, 477, -671, -264, 777, -1, -796, 183, 722, -417, -520, 603, 351, -731, -129, 792, -173, -773, 386, 632, -540, -478, 706, 210, -787, 56, 798, -303, -714, 459, 506, -677, -309, 807, 60, -793, 213, 751, -469, -641, 622, 416, -720, -162, 784, -100, -765, 343, 685, -569, -500, 672, 256, -775, -45, 766, -232, -692, 486, 563, -687, -402, 708, 136, -765, 137, 744, -336, -601, 569, 415, -745, -226, 791, -53, -759, 282, 696, -530, -523, 699, 324, -792, -111, 782, -173, -741, 442, 580, -604, -330, 810, 194, -835, 59, 778, -351, -665, 556, 496, -717, -241, 820, -2, -806, 196, 701, -459, -546, 637, 354, -766, -100, 800, -178, -787, 378, 617, -568, -456, 692, 189, -747, 82, 779, -298, -681, 504, 505, -688, -287, 778, 58, -781, 234, 728]
5488G28j143j73J159j72j145N75R77r03o22J050L39j258J03J223m76j102Q21Q13
5506G94j044m88J240Q1j252K97J148o83r31R73O53j172k47J226j56j179N83J009
5524H52q95p53J064M49j220oJ183l82j022P15P84r62n39J163J62j197K11J128
5542G35n87r41R08O38j119l03J243j02j138M13J037q07p47J087L97j196r7J277
5560F98l32j149O74R26r74n75J156K13j281J61J235n70j014Q87P11j090l44J215
5578E47m6j202M08J103p48q75R95N32j126j45J193k47j152O22R55r15o30J077
5596C46K82j171P7J185m79j052Q00Q25j036m69J167P5j219L24J110p05r04R99
5614A55O35j199k38J246j74j194N68J045r23p55J176L78j251JJ216l88j078P78
$$ y = [728, -415, -588, 571, 399, -746, -171, 806, -97, -719, 331, 670, -588, -485, 738, 262, -840, -19, 794, -250, -738, 502, 583, -669, -372, 776, 93, -838, 135, 788, -384, -631, 595, 439, -740, -157, 852, -43, -796, 268, 717, -503, -509, 674, 292, -730, -15, 769, -193, -732, 431, 593, -604, -393, 735, 148, -793, 115, 753, -366, -669, 574, 472, -666, -253, 784, -23, -770, 317, 714, -482, -579, 698, 366, -783, -109, 817, -157, -732, 424, 637, -644, -483, 752, 182, -832, 55, 766, -324, -668, 547, 501, -701, -293, 810, 62, -813, 182, 714, -412, -557, 636, 389, -763, -141, 814, -101, -731, 346, 628, -543, -466, 719, 240, -812, -12, 813, -223, -692, 475, 550, -669, -345, 765, 60, -844, 155, 790, -409, -647, 599, 425, -769, -201, 844, -79, -834, 342, 720, -531, -530, 686, 298, -780, -2]
5632bQ52j098n14J223J73j290K34J186o13r35R36N97j152k51J213q0j186M51J011
5651G55q02p28J075M11j211r8J291l48j124O52R23r83n58J190K05j288K09J213
5669G84n76j024Q79P12j131l40J290m5j311M20J192q05q68J008N57j213j30J286
5687F85l12j209O95R94r77o72J191K73j267J38J229n29j069Q43Q09j058m47J143
5705D60N5j230L83J150p31r27J003N88j146k24J183j63j185O18R86q96p48J136
5723C12L89j241M6J195m35j062P91Q27j066n41J258J69j289K61J132o18r32R52
5741A48O43j218k74J282j22j182M96J027q68p30J096M29j227q0J247l08j090O59
5759g2Q68r74n31J125K12j273K17J186n70j001R19O42j064l33J174j9j211M21
$$ y = [-2, 850, -248, -762, 461, 634, -656, -422, 764, 151, -784, 152, 749, -403, -654, 559, 479, -707, -256, 755, -47, -775, 300, 711, -500, -598, 693, 345, -779, -127, 796, -187, -745, 445, 650, -638, -429, 784, 208, -816, 63, 775, -356, -696, 594, 549, -762, -342, 850, 45, -823, 185, 742, -471, -601, 685, 373, -836, -141, 853, -124, -796, 395, 668, -599, -461, 768, 239, -830, 13, 822, -236, -683, 460, 515, -715, -332, 818, 87, -840, 163, 751, -395, -619, 564, 401, -784, -166, 820, -76, -824, 312, 701, -540, -494, 701, 266, -796, -5, 822, -244, -785, 473, 642, -647, -386, 746, 128, -804, 148, 791, -427, -701, 581, 459, -723, -227, 800, -68, -798, 298, 727, -500, -580, 667, 359, -731, -72, 796, -178, -709, 416, 628, -645, -428, 758, 188, -813, 106, 748, -316, -649, 525, 506, -705, -284]
5777b84J061p44q02R73M82j157r5J218l05j112O59R14r30o21J116K73j233J64
5795d23J172n24j008Q39P38j069m16J228j8j203L92J071o87r19J009N71j150j80
5813e77J178k34j122N99R29q59o81J087L49j207O5J178m31j048P31Q42j018m77
5831f96J148J19j174K41J078o08q72R24N56j106k14J191j57j142M93R92q16p35
5849g78J060M19j211oJ186l39j091P31Q12j012n09J203J32j237K46J156o12r47
5867g97Q85O64j083l23J236j11j126M05J040p77p59R61M47j123p7J166k96j058
5885g26O16Q68r03n78J109K14j160J71J056m55r60Q23O96j066l76J164J2j152
5903f47L59J025o87q23J022M77j145j50J169k29j068N47R01q95o21J144K88j214
$$ y = [-284, 777, 33, -769, 204, 686, -471, -566, 652, 347, -765, -106, 808, -122, -743, 373, 646, -587, -423, 749, 225, -783, 56, 794, -275, -691, 537, 519, -684, -292, 779, 92, -827, 182, 753, -397, -577, 601, 367, -755, -156, 773, -86, -767, 320, 669, -538, -473, 705, 274, -774, -43, 799, -219, -696, 452, 571, -603, -362, 716, 108, -764, 160, 716, -390, -604, 587, 430, -712, -219, 773, -43, -778, 282, 701, -510, -516, 670, 331, -760, -29, 783, -229, -738, 465, 597, -640, -394, 762, 150, -797, 88, 752, -331, -654, 582, 471, -655, -250, 790, 13, -746, 215, 662, -461, -538, 628, 332, -726, -110, 758, -145, -723, 386, 600, -560, -389, 667, 212, -748, 75, 771, -295, -671, 493, 505, -647, -288, 737, 50, -773, 249, 726, -419, -569, 600, 371, -697, -150, 751, -144, -765, 379, 667, -547]
5921e47P1J164m06j027P65P43r98m22J156K2j184K83J183o82q68Q85N81j069k02
5940e52J126j71j105M75R66p86o53R56L59j093L7J100m04j000P21P68r48m82J088
5959D02J28j125K66J066o17q88Q83O14j049k60J102j05j121M90R93q12p40J037
5977B64M19j136m9J106l08j009O44Q14r17n28J097J95j142J67J067n29q98Q44
5995A01O24j065l01J120Kj086L54R70o87p54R46M19j051j26J129k29j034N72Q02
6014G06q36n49J021K73j142O6J144m41r21O89O73r63l66J147nj138L14J042o33
6033H1p93Q87N12j073j47J114k12j100N51R33p97o60J022L08j131O8J111m09j010
6052g45P04P62r16m57J045R2j070K57J026n99q47Q55N70r83k44J040r9j050M90
$$ y = [-547, -476, 688, 282, -745, 20, 763, -235, -657, 499, 521, -663, -380, 803, 121, -747, 138, 719, -350, -552, 574, 403, -702, -227, 739, -47, -700, 256, 615, -478, -441, 659, 255, -745, -24, 744, -204, -686, 402, 530, -595, -329, 737, 120, -768, 115, 729, -320, -580, 522, 417, -704, -214, 779, -33, -773, 264, 683, -453, -502, 604, 296, -713, -69, 745, -172, -700, 397, 592, -550, -383, 684, 155, -743, 101, 725, -340, -641, 479, 481, -605, -251, 719, 32, -722, 224, 643, -408, -534, 595, 366, -668, -96, 706, -130, -679, 342, 615, -527, -461, 683, 242, -679, 10, 683, -280, -646, 501, 496, -642, -328, 714, 81, -712, 175, 687, -386, -533, 581, 369, -731, -180, 753, -44, -704, 318, 626, -505, -437, 674, 265, -745, -41, 721, -195, -652, 393, 485, -585, -328, 698, 99, -748, 107, 677, -306, -550, 490, 391, -659, -169]
6071a69Q93p36p29R69L92j043o8J085l21r77O59P72r29m74J088J77j147K01J076
6090G19o01q81Q75O23j053l20J149n7j077M18R41p19p26R58L91j086o7J111k72
6109C26r98N99Q07r06n08J039K21j099J28J041m54r00P68O08r83k99J078j1j081
6128f24L38R76o30p53Q94M41j034j38J093k29j031N60Q64q36n18R62K53j121J45
6147c88J064m40r39P13P21r70m00J085M0j078L22R77o30p65Q55M64j006j56J123
6166E92k08j051N12Q46p54o32R61L10j015K6R90l32r19O72O93q99m51J041Q6j017
6186e49K25R69n58p72P92N56r81k17J009j00j006M45Q96p50o52R47L50j046k0
6205d62J066l36r59O53P55r11m55J073Q3j021J85J013n71q28Q29N56r94k59J097
$$ y = [-169, 724, -12, -741, 228, 620, -423, -491, 594, 273, -704, -45, 727, -202, -676, 412, 589, -558, -357, 719, 118, -763, 112, 735, -318, -638, 511, 454, -623, -205, 736, 17, -709, 249, 640, -446, -513, 598, 326, -672, -73, 734, -172, -680, 359, 580, -519, -391, 650, 196, -704, 64, 672, -311, -610, 468, 457, -624, -286, 690, 60, -693, 201, 642, -392, -530, 563, 334, -697, -137, 727, -109, -627, 335, 588, -533, -388, 676, 236, -703, 10, 731, -239, -639, 446, 486, -592, -270, 707, 77, -688, 167, 631, -375, -531, 592, 384, -667, -155, 691, -63, -695, 266, 576, -439, -413, 577, 245, -674, -2, 691, -208, -659, 382, 468, -549, -324, 645, 87, -685, 107, 663, -318, -535, 474, 374, -632, -187, 709, -41, -693, 254, 604, -442, -462, 604, 268, -691, -38, 717, -194, -649, 424, 507, -514, -329, 684, 113, -715, 114, 670, -324, -583, 514]
6224E14q4j069M22Q94o78o75R27L23r74n8J025k96r41O01P70q81m64R86J69j019
6244e08J33J011m98p94P34O07r78k47R79Oj040L79R08p04p06R44L97j037q4J076
6264E78k45r89N57P55p90n18J016J82j061J17J045m65q51P34O48r69l18J056l5
6283D47j056L39R21o00p23Q54M32r93j14J071k49r68M92Q32p58n85R40K79j033
6302d72J08R98m40q46O42O84q75l86R83O6j018K95R41o20p72Q46N17r88j78J011
6322D96j44r76M77Q75q01o39R77L21j033L5J010l80r14P07O84r02m46J007J36
6341D90j032K09R48n31p36P90N08r83k22J030p9r66L73Q65p06n73Q70L60j020
6360d05o3J011k53r17N55P37q31m29R82J31j021J55R73m76q10P24N88r57k42J053
$$ y = [514, 430, -639, -217, 677, -1, -676, 251, 574, -400, -458, 567, 271, -670, -69, 701, -180, -644, 342, 511, -508, -375, 636, 138, -656, 78, 685, -293, -540, 439, 445, -595, -216, 692, -12, -718, 226, 623, -414, -498, 578, 333, -656, -99, 656, -134, -652, 364, 546, -515, -398, 647, 182, -669, 65, 713, -256, -574, 482, 447, -609, -270, 651, 51, -672, 182, 614, -379, -493, 578, 329, -639, -147, 685, -73, -658, 282, 561, -472, -364, 634, 194, -652, -10, 674, -201, -587, 396, 462, -556, -261, 680, 60, -712, 134, 651, -337, -515, 496, 352, -624, -147, 728, -73, -712, 265, 586, -447, -412, 598, 218, -696, 11, 695, -207, -653, 354, 490, -542, -333, 615, 84, -652, 138, 646, -337, -559, 471, 392, -574, -201, 664, -42, -615, 255, 615, -405, -468, 543, 290, -627, -72, 665, -166, -595, 387, 518, -503, -348, 625, 149, -661, 63, 651, -306, -548, 505]
6380E05j03r96L71Q91o46o71Q59L75r99k4J048l09r75N81P96q09n11R39J62r82
6400d98J42R80m62q55P29O31r31k83R77l1r77L54R02o13p11P98M43r27j30R56
6420D94k01r15N19P70p71n01Q88K55r90O4R67m14q29P16O25q81l62R79O6j003
6440e24K81Q65o10o50P89M72r81j51J019j55r38M25Q06p35n37R16K84j008N8R55
6460E81l25q83O24O38q30m05R98O8r76K21R07m76p80P40M93q94k17R68r8r35L98
6481a83P97o05o20Q55K95r68rR75k94q97O07P06q01m32R00J57j001K18R12m95
6501A17p68P29N67r35k42R95q4r69L81Q74o72o77Q74M07r77p0J008k68q94M98
6521a06P25p42m75R24J83r71J17R69m50q23O59O13q44l23R38K9r49K79Q69n73
$$ y = [505, 402, -594, -223, 668, 22, -649, 210, 585, -414, -438, 610, 301, -674, -93, 703, -106, -617, 322, 484, -498, -356, 624, 162, -693, 36, 667, -264, -547, 430, 399, -578, -224, 678, 65, -646, 152, 595, -332, -462, 494, 293, -622, -103, 667, -104, -605, 283, 538, -452, -388, 579, 165, -664, 52, 677, -204, -566, 413, 479, -524, -243, 622, 12, -638, 151, 623, -358, -509, 510, 355, -583, -158, 648, -87, -624, 292, 576, -432, -374, 581, 256, -627, -3, 635, -195, -600, 398, 466, -510, -289, 618, 142, -638, 102, 595, -299, -516, 452, 354, -581, -183, 614, 9, -611, 244, 539, -429, -438, 537, 243, -654, -47, 659, -142, -574, 326, 483, -518, -300, 612, 117, -651, 78, 645, -290, -532, 463, 379, -590, -209, 665, -7, -684, 190, 597, -380, -450, 558, 290, -604, -106, 619, -123, -598, 326, 509, -462, -345, 624, 174, -649, 10, 623, -221, -544, 394, 423, -526, -247, 622, 49]
6541D9o51P47M35r51j06R99j91r09M87P45p65n44R28K30r78R4R70l98q57P08O36
6562F78q93l89J010Q1j030K76R02n50p50Q08N05r55j93J006j69r51M81P65o69
6581c7n91R12K93r79l4R72l09q59N93O85p93m17R10J42r88J89R27n07p50P37N08
6602F04q87k55J021r8r70L77Q38o72n70Q29L35r63k3R75k72r08N59P38q09m50
6622f01R36J63j017K12R22m98p63P37N35r21k43J021o4j003L69Q69o43o27Q38
6641B22L54r51j00R86k36q65N03P12p31m87R08J45r39J33R30m01q27O18O35p93
6661a84l76R32L8r38K73Q42n57o58P98L92q93j27R20j55r45N20P82p28n60R11
6681B87K72r68M8R36l73q60O70O27q30l99R61O5r41K38Q43n03p12P66M87r19k10
$$ y = [49, -602, 145, 580, -371, -477, 522, 331, -578, -91, 654, -111, -655, 273, 503, -475, -381, 589, 191, -666, 42, 678, -215, -604, 406, 487, -543, -267, 635, 85, -665, 143, 648, -307, -500, 506, 337, -614, -133, 632, -37, -628, 284, 577, -402, -436, 536, 227, -632, -39, 646, -147, -564, 346, 488, -500, -311, 616, 109, -641, 96, 604, -283, -538, 483, 385, -585, -208, 630, -42, -612, 217, 552, -411, -434, 541, 269, -639, -80, 658, -151, -601, 335, 498, -519, -307, 615, 117, -646, 91, 626, -295, -538, 483, 419, -584, -215, 654, 11, -616, 222, 576, -375, -475, 511, 275, -590, -87, 625, -106, -593, 315, 460, -479, -346, 584, 183, -644, -26, 609, -184, -560, 372, 410, -528, -255, 587, 30, -628, 170, 562, -331, -458, 462, 307, -638, -118, 664, -64, -624, 287, 559, -409, -361, 575, 202, -658, 12, 639, -191, -590, 371, 436, -505, -267, 576, 73, -639, 127, 614, -305, -515]
6702e15R81j02r24L80P74o45n61Q53K78r09k0R50k81q58N37O78p93l57Q92R8r44
6723d88J76Q61m30p12O70N15q79k36R73m9r64L46Q42o16o08Q04L16q89n4R42k32
6744B88q95N22O94p49m29Q46J69r38J45R34m16q23O69N58p96l07R22or13L05Q48
6765F28n84o63P89L85q86j07Q88j49q47M42P38o68n66Q42K39r05Q6Q68l29q13
6785f12O13O08q05l52Q95O8r37K58Q47n34o58P70M31r14j45R41j53q49M01P38
6805F11o84n18Q70K69r61J2R39l25q03N79N96p54l47Q88N6q96J88Q47m62p16P18
6826A07M47q40j90R47j35q70L35P89n83n84P78K98q46n2R15k60p97M79O68p46
6846a40l86Q31J26q94J64Q79m58p21O59N21q48k05Q92q7q56L39P80n84o17P74
$$ y = [-515, 466, 364, -560, -180, 594, -51, -612, 241, 519, -390, -410, 540, 259, -599, -62, 616, -177, -534, 358, 456, -488, -312, 549, 119, -593, 77, 592, -287, -523, 450, 401, -563, -217, 625, 9, -599, 205, 521, -368, -422, 520, 288, -607, -85, 609, -140, -569, 277, 446, -492, -347, 587, 171, -652, 17, 575, -221, -528, 394, 388, -525, -220, 628, 44, -619, 170, 555, -331, -438, 450, 301, -546, -104, 634, -34, -600, 242, 481, -424, -338, 530, 201, -612, 1, 609, -196, -548, 347, 415, -522, -264, 583, 49, -609, 161, 592, -322, -467, 474, 321, -528, -127, 611, -73, -591, 279, 548, -413, -401, 538, 213, -590, -11, 585, -169, -516, 372, 428, -468, -280, 567, 105, -611, 107, 554, -286, -476, 471, 336, -534, -199, 590, 7, -577, 201, 499, -347, -399, 516, 256, -541, -62, 606, -140, -526, 305, 431, -463, -299, 580, 122, -599, 60, 581, -267, -472, 420, 333, -523, -184, 596, 12, -605, 169]
6866A69L80q95o2Q99k29q31M91O95p01m60Q23K04q96N6Q89m04p22O38N28p71l04
6887e03Q57M5q77K28P86m85o48P44L85q10j65Q78j45q38L99P29o55m67P85K31
6907D74q46J9Q69l09p95N72N96p95l05Q72O3q99K31Q18m88o72O99M60q67j65R07
6928D39j26q77M00P32o10n13P62L18q78m6Q92k84p51M97O18p22l85Q34J46q40
6948c94J05Q06m07o58N91M87p92k43R14o3q49K99P90n66o00P19L76q63m8Q92k26
6969B70q08M62O59o87m57Q55J91r29J39Q74l93p63O25N17p69k91Q63L7q91K70
6989b26Q00n32o01O92M02q43j05Q87j68q52M31P12o46m93P48K73q81L6Q56k87
7009B03p47N20N97p27l48Q49M4q58K19Q10m54o99P14M43q34j46Q55j46q37L76
$$ y = [169, 549, -346, -408, 491, 262, -569, -78, 617, -84, -544, 279, 483, -413, -357, 532, 128, -594, 44, 572, -199, -503, 354, 399, -478, -250, 536, 51, -597, 147, 532, -278, -443, 435, 290, -548, -149, 580, -75, -542, 243, 474, -372, -353, 516, 207, -588, -16, 580, -215, -520, 352, 415, -484, -253, 565, 77, -595, 104, 564, -303, -468, 439, 313, -564, -164, 568, -42, -555, 207, 525, -353, -399, 493, 209, -542, -45, 573, -149, -534, 300, 446, -394, -289, 517, 110, -548, 43, 530, -262, -505, 409, 346, -503, -204, 586, 20, -580, 139, 515, -348, -396, 496, 270, -538, -76, 583, -104, -561, 294, 485, -444, -305, 569, 176, -587, 38, 555, -214, -505, 358, 395, -496, -226, 574, 42, -559, 133, 535, -308, -413, 474, 306, -546, -115, 597, -49, -542, 206, 479, -402, -366, 490, 203, -544, -24, 573, -154, -502, 347, 391, -467, -248, 562, 108, -591, 123, 566, -268, -414, 441, 295, -542, -166]
7029a66P70o14n70Q29K48q71kQ83k92q14N88O13p36m09Q64J36r12J86Q15m48o82
7050e84O76M59p93k75R02k5q80L37P66n67n70P33L65q90r6Q82j61q09M55O69p19
7071a25m15Q49J71q86R6Q27l45p35O19M98p43k84Q55K1r38L12P79n11n99P15L99
7092E60q84p8Q95k19q16M31O95o43m92Q16J89q90R4Q91l64p59N73N67p30l25Q14
7113C25Q2q86K46Q14m79o74O75M28p70j88Q82j55p95L90O90o02n43P80K67q37
7133c50RQ06k57p53N13O42p45l77Q18J30q84J81Q11m43p10P29M58q02k78Q97m1
7154C54q69L64P26n94n43P79K94q77l7Q71k24p75M90O14p00m01Q66J39r22J16
7174c29Q39l76p17O37M76p64k33Q54j1q42K81P43n17n86P18L51q48q2Q83j63q60
$$ y = [-166, 604, -10, -580, 249, 497, -374, -376, 507, 215, -599, -11, 602, -134, -543, 321, 457, -455, -269, 546, 98, -584, 92, 551, -242, -517, 385, 360, -520, -183, 583, 16, -554, 179, 544, -346, -442, 440, 279, -530, -75, 594, -125, -540, 309, 480, -406, -310, 517, 172, -563, 56, 554, -189, -473, 382, 403, -535, -223, 556, 45, -554, 161, 560, -324, -402, 493, 274, -542, -111, 584, -59, -551, 265, 454, -436, -342, 549, 185, -574, -1, 566, -164, -489, 325, 407, -479, -233, 581, 102, -572, 103, 531, -239, -427, 455, 300, -495, -105, 585, -17, -560, 220, 487, -350, -341, 465, 208, -545, -32, 610, -135, -512, 306, 436, -448, -267, 544, 101, -609, 120, 578, -224, -502, 395, 354, -515, -151, 575, -19, -562, 217, 511, -366, -403, 468, 244, -531, -41, 573, -127, -528, 338, 477, -445, -329, 510, 134, -583, 54, 530, -234, -467, 387, 376, -466, -185, 558, 41, -545, 173, 524, -324, -406, 477, 314, -546]
7195e46M41O90o81m17P69K00q87R1Q69l51p64N80N86p74k83Q55mq58K47P90n06
7216D7n86O86L84q45r1Q34j36q09M24O73o46m97P92K66q68L1Q43l07p68N68N79
7237E74p42l24Q03R3q46J87P75m47o34O37M43p72k03Q68p6q38L57P16n93n45P72
7258B05K83q70J5Q55k90p57N37O02p08l88Q44R3q83J94Q25m19p41O68M75p80k33
7279d73Q80q9q30L31P60n84n51P16L81q56p8Q50j59p85L98O45o56m07Q00J46q52
7300d13R9Q19l41o95N28N57p76k70Q48K5q55K59P69n18n91P21L32q28p0Q50j30
7321C20q39L98O56o04m52P51K61q96P6Q44l49p01N06N32p07k89Q48O0q82K39P69
7342E41m56o23O54M18q07j34Q21j29p74L68O74n70m75P01K57q34K8Q16k90p30
$$ y = [-546, -105, 585, -96, -513, 256, 456, -431, -340, 529, 178, -586, -6, 580, -194, -477, 378, 374, -484, -237, 553, 47, -539, 147, 531, -314, -405, 429, 293, -516, -92, 581, -65, -562, 230, 496, -372, -341, 502, 195, -573, -5, 574, -168, -492, 311, 404, -442, -255, 520, 73, -561, 76, 519, -253, -456, 412, 336, -502, -145, 571, -22, -567, 205, 488, -382, -367, 488, 198, -559, -22, 580, -128, -516, 328, 421, -462, -268, 557, 138, -603, 65, 540, -240, -473, 407, 318, -512, -181, 579, -5, -556, 160, 541, -315, -393, 457, 298, -487, -89, 556, -100, -507, 293, 439, -413, -314, 505, 164, -531, -3, 554, -222, -492, 356, 381, -474, -215, 554, 36, -555, 166, 498, -330, -400, 450, 320, -519, -121, 535, -69, -521, 230, 491, -405, -329, 515, 166, -535, -29, 503, -204, -493, 355, 415, -467, -228, 541, 85, -538, 116, 534, -273, -407, 414, 285, -489, -121, 553, -17, -492, 209, 466, -368, -340, 476, 186, -544]
7362e44M87O24o77l97P88J29q34J38P64l81o60O30M72p93j94Q14m9q05L42O93
7382E47n72n30P39K77q11k7Q32k40p64M98O10p01l60Q03J29q30J32P91l91o78
7402e46O17M85p49k86Q24j1q03K87O84n04n49O94L60q45n4Q17j41p62L79O30o27
7423a00m16P50K22q47P5P72l16o32N22N02p48k41P95J1q02K18P54m70n48O40L48
7444D89p84j12Q56j71p98L75O80n91m27P10K19p86L4P85k87p29M95N72o68l26
7464d64P82M0q05K12P52m28o29O01M36p03k12P83o9p58L14O66n18n31P01K82p35
7485b83o6P94k41p07M77N68o51l99P59J69q16J12P98l96o57O27M21p36j96P70
7505C47m9p56L16O81n34n25O80L32p93q4Q01j50p40M09N96o14m07P37J94q30R6
$$ y = [-544, -57, 567, -110, -507, 281, 410, -424, -286, 478, 97, -563, 67, 539, -254, -448, 366, 317, -488, -146, 547, -25, -555, 184, 461, -350, -377, 455, 215, -549, -51, 559, -142, -502, 301, 430, -400, -268, 523, 132, -546, 71, 556, -193, -479, 345, 334, -469, -182, 502, -2, -551, 143, 503, -342, -396, 421, 280, -482, -103, 527, -100, -516, 234, 456, -391, -316, 456, 140, -492, 30, 532, -216, -457, 338, 349, -453, -235, 519, 49, -499, 141, 489, -295, -407, 449, 278, -520, -145, 535, -56, -483, 227, 446, -340, -306, 479, 192, -537, -42, 530, -138, -464, 318, 358, -447, -235, 517, 89, -540, 61, 497, -206, -418, 365, 296, -462, -148, 518, 0, -531, 170, 452, -283, -349, 445, 204, -503, -26, 542, -109, -508, 251, 420, -396, -284, 514, 118, -539, 88, 509, -227, -423, 347, 298, -458, -142, 539, 5, -520, 160, 492, -301, -385, 416, 266, -474, -65, 531, -83, -490, 247, 441, -389, -293]
7526b93P57l21o50N42N08p27k44P86J7p91K02P30m63n48O07L91p50j44Q27j58
7546B78p70L83N98n24m56P24J74p83P2P78l07o71N19M84o92k44P58L8p91K08P62
7567E38m42o08O22L72p17j68P87r5p87L88O41n94m69P33K36p33j9P65k51p14M88
7588b7N57o49l52P34J03p57J65P27l96o31N95M31p20j93P68o6p35L01O10m91m83
7609e09O85K63p62k2P72k13p11M43N55o20l44P89P4p87J17P83l89o46N76M25o92
7630b13k01P63k5p93L14O96n13n43O59L36p79p4P92j92o93L95N76n92l99O91K15
7651D20p78P3P24l05o29N03N13p25k71P74M7p77J91P46m77n53O44L33o78j69Q00
7672D06j28p48L60O21o00l95P31K02q34R4P57k91o74N12M91o86k51P51N1q12K12
$$ y = [-293, 464, 143, -507, 35, 543, -184, -428, 358, 375, -416, -214, 516, 53, -495, 112, 503, -247, -391, 436, 278, -492, -109, 489, -35, -491, 233, 407, -376, -304, 474, 167, -504, 15, 499, -193, -437, 321, 359, -432, -224, 538, 96, -512, 110, 482, -235, -403, 384, 289, -498, -110, 531, -63, -532, 201, 437, -296, -315, 450, 199, -515, -27, 530, -119, -471, 263, 366, -391, -226, 501, 105, -526, 69, 500, -220, -413, 355, 289, -446, -145, 465, -26, -509, 176, 439, -323, -345, 427, 214, -497, -54, 501, -119, -463, 326, 400, -387, -270, 513, 124, -522, 54, 479, -213, -414, 349, 324, -469, -155, 541, 28, -515, 144, 480, -299, -373, 419, 227, -466, -71, 505, -87, -486, 205, 420, -358, -285, 439, 134, -495, 8, 521, -204, -475, 299, 346, -431, -240, 506, 29, -524, 120, 453, -225, -394, 406, 278, -470, -110, 511, -89, -484, 247, 449, -385, -291, 466, 175, -499, 13, 504, -182, -433, 318, 369, -443, -231]
7693b31P21m08n85O29L46p43j07P78r7p61L16O53n17n08O82K47p43JP59k53o69
7714d90M26N83o38l37P20R0p44J55P29l94n95N61M00p07j42P31o5p40L25O58n37
7735a1m81O88K51p42l7P30k23o69M45N68o32l59P33J14p40Q8P40l67o21O03M09
7756D87o82k53P75j1p36K22O82m54n47O53L12p17r1P61j51p25M16N54n88l81P37
7777B63J67p76N2P28k77o37M91M59o77k04P66k8p63K48O76m78n23O57L25p37j17
7798c85P96j57p27L99N64n34m10O66K11p81P3P30k66o81N04N08o59k95P56Np34
7819d17K13O96m20n59N67L93o89j74P81j28p28L37O21n19m63O83K23p09l3P41
7839D16k47o48M47N71o77l00P21Q1p40J61O91m03n92N92M14p10j75P46n4p33L26
$$ y = [-231, 490, 82, -503, 126, 472, -271, -378, 400, 303, -458, -142, 511, -6, -514, 168, 415, -328, -327, 432, 179, -490, -64, 519, -119, -456, 264, 354, -390, -235, 494, 100, -495, 66, 466, -241, -383, 348, 283, -457, -132, 526, -11, -492, 196, 447, -295, -332, 398, 175, -494, -49, 519, -113, -472, 261, 375, -365, -277, 463, 96, -525, 78, 487, -195, -448, 327, 316, -420, -198, 484, 30, -517, 136, 448, -269, -360, 401, 250, -475, -59, 495, -93, -474, 263, 430, -346, -294, 434, 157, -480, 11, 470, -207, -411, 355, 327, -436, -188, 488, 10, -513, 144, 469, -268, -385, 411, 254, -473, -74, 490, -44, -454, 212, 423, -358, -285, 445, 179, -502, 2, 510, -149, -444, 312, 317, -417, -204, 492, 72, -487, 80, 473, -216, -390, 391, 263, -465, -128, 493, -26, -489, 194, 417, -292, -325, 416, 169, -479, -32, 539, -138, -438, 283, 364, -376, -215, 476, 73, -519, 73, 487, -223, -398, 348, 294, -439, -113]
7860a13O06n00m75O56K71p68k2P56j93o77M10N45o23l46P44J05p50R7P35l43n79
7881d64N10M57p11k11P47k4p13K12O61m48m92O08L05p14q3P29j30p07L64N96n60
7902f8l89P08J77p85J05O88k89o29N24M69o99k36P47K0p36J89P05m62n40O13L42
7923D54p05j37P99j70o99L50N99n52m30O91K02p36J9P58l13n99M73M90o15l06
7943d27P19O1p36J37P01l48n79N50M00o98j65P32q4o77K75O42n01m64O83K15p52
7964c16oP54k34o57M30M92n84l27P25R6p56J52P03l90n84N68M14o97j63P29n3
7985B96p31K78O42m63n11O65K69p50j7P08j84o70L87N65n99l58P28J33p41Q1P30
8006D58l28o03N22M41o63k57P06N0p29K31O33m46m83N91L41p29r7P35j29o84L65
$$ y = [-113, 493, -7, -482, 174, 445, -323, -345, 411, 218, -459, -49, 496, -127, -473, 271, 376, -374, -277, 458, 115, -464, 46, 503, -208, -419, 328, 304, -409, -197, 464, 16, -476, 132, 437, -277, -360, 369, 239, -468, -104, 492, -68, -457, 251, 428, -357, -252, 436, 147, -482, 42, 511, -188, -424, 323, 343, -393, -204, 501, 39, -501, 112, 454, -251, -388, 411, 241, -458, -108, 491, -61, -491, 200, 402, -334, -315, 443, 130, -469, 4, 494, -121, -427, 292, 353, -383, -246, 455, 107, -472, 78, 478, -220, -385, 347, 263, -414, -139, 503, 2, -462, 221, 436, -316, -322, 432, 198, -459, -29, 463, -121, -448, 277, 373, -383, -231, 472, 82, -502, 66, 480, -217, -380, 349, 296, -435, -157, 485, 22, -489, 176, 445, -305, -322, 386, 202, -468, -81, 484, -115, -473, 255, 388, -353, -272, 458, 130, -473, 49, 490, -173, -430, 276, 326, -403, -172, 461, 15, -468, 123, 464, -265, -362, 373, 244, -440, -75]
8027g5N57n51l66O35K10p32K8P08k57o23N11M26o53k40P40M3p71J89O85m11n14
8048d61N82L16o93j05P45j18p15L47N63m90m46O78K18p45N3O96k36o39M18N13
8068D81n84l29O71J01p08J53O76l72o01N67L87o58j41O88l1p35L06O14m98m52
8088d65O29K64o93l6O84j87o79M81M76n72l37O88J29p23R1O89l21n86N09M30o45
8109a74k45P20K0p03K07O25m19m98O02L12p14r2P13j00o92L57N48n24l93O46K04
8130D00p19L2O87k53o27M88M65o36k54P18L0p36J84O44l76n09N75L10o59j27P46
8151C83j35o79L51N59m84m47O36K09o92QP08k58o11M14M93n76k95O79P5o89J18
8172b33O62l25n67N03L92o15j90O88m7o97K78O00m56m41N77K85o85l2P06
$$ y = [-75, 482, -69, -435, 200, 410, -322, -294, 414, 157, -466, 45, 471, -182, -422, 318, 361, -410, -221, 464, 53, -461, 121, 437, -256, -361, 384, 266, -449, -102, 461, -29, -475, 203, 421, -324, -271, 425, 189, -450, -32, 481, -103, -432, 239, 340, -368, -215, 461, 89, -512, 55, 442, -216, -357, 331, 300, -435, -129, 485, -13, -465, 164, 428, -265, -301, 383, 196, -483, -2, 474, -98, -435, 253, 382, -341, -250, 439, 118, -468, 41, 471, -174, -419, 301, 321, -382, -175, 450, 31, -467, 135, 447, -267, -359, 354, 254, -438, -81, 467, -57, -450, 196, 400, -319, -287, 400, 147, -480, 8, 473, -163, -417, 301, 331, -405, -221, 423, 47, -462, 113, 423, -236, -363, 383, 248, -431, -80, 479, -5, -452, 184, 393, -299, -291, 417, 159, -452, -38, 455, -121, -416, 263, 338, -351, -233, 429, 104, -463, 40, 432, -183, -373, 315, 268, -429, -151, 449, -7, -448, 129, 414, -271, -303, 403]
8191D03
$$ Imaginary data points
##PAGE= N=2
##DATA TABLE= (X++(I..I)), XYDATA
0@%%%%%%%%%%kJ0j6J6j6K4l2L2m0N0n8P2q3R4j15J38j57J80k09K40k73L10l53
33a88M01m52N07n70O40p15P97q86R84j094J213j339J478j633J802j985K186k409
51a263K654k923L224l564L949m384M880n459O145o969P978r247J0906j3170J6447
66I204k1631L1061n3401J94875J16879n64114J35317M42153k32395l56744L56926
77E8130J94931m06946n0440M45735j11798m14362K37176L52978l54404k41097
87b90097M24405J16681m64755K3163M47196j48057l85054K67703K82367l52837
97g9285j60504M01288J6911m11457J17842L86590k31082l12583L20694K07639
107B56053l84153q5727M05322m4742l88709J70122L34707k72845k46097L45981
$$ y = [0, 0, 0, 0, 0, 0, 0, 0, 0, 0, 0, -2, 8, -8, 8, -8, 16, -16, 16, -24, 26, -32, 40, -43, 51, -64, 74, -83, 97, -112, 128, -145, 165, -188, 213, -239, 268, -302, 338, -377, 420, -466, 518, -576, 637, -702, 776, -857, 945, -1040, 1146, -1263, 1391, -1532, 1692, -1872, 2077, -2307, 2573, -2886, 3259, -3710, 4268, -4979, 5927, -7243, 9204, -12427, 18634, -34767, 160108, 276987, -287127, -151810, 290343, 57948, -298796, 58130, 253061, -153885, -204325, 241410, 129612, -284750, -47574, 305404, -49000, -290097, 134308, 250989, -213766, -190603, 256593, 108536, -276518, -8815, 273552, -79285, -239789, 161499, 178410, -233047, -115205, 271385, 40303, -272280, 48414, 256053, -128100, -213827, 191495, 146753, -241956, -71834, 262873, -9972, -256069, 89912]
117H9912J31715l81890l252L80976j24533l46288K31711K75807l11001j74019
127b30862L62554O0396l74812N7781L46535j74073k90160K68458K08396l28058
137i3845j01821L55091j4014l48041J23875L04687k20286k33597K91203J40759
147B04011l31535l6299L37901o8902l08413J68403K50493k51223j73049L02426
157I3813P6657l21402K9699L12361j27266k69437K10673J98026k75640j11829
167a84345L10385J7172l10137Q1632K80545j71671k24127K43112J45748k89213
177a00899n4026L04043m3922k89405J34921K45420k09204j73995K64673Q8022
187A65628k94096J241K88519r2072k54190J75373J99340k36227j23416K72366
$$ y = [89912, 221627, -160263, -163515, 217461, 92928, -253360, -21649, 254158, -56843, -230862, 131692, 192088, -182724, -124943, 221592, 47519, -242641, 25817, 234213, -93845, -195666, 159425, 145411, -202630, -78755, 225932, 5646, -227951, 63252, 204011, -127524, -163823, 174078, 105176, -203237, -34834, 215659, -35564, -208613, 93813, 170470, -150932, -121233, 191128, 63862, -205575, 5098, 203124, -72516, -184345, 126040, 143212, -166925, -85293, 195252, 23581, -200546, 42566, 188314, -100899, -154925, 149118, 105196, -184209, -49288, 196132, -13072, -187067, 77606, 165628, -128468, -127227, 161292, 69220, -184970, -9597, 189743, -46484, -169900, 102466]
197A02466L4589k83358N3776K64570j34135k17724K00921J50009k47004o9255
207a45145K68310j5213k61397R5931K26552j68827j72461K22364J01955k51330
217i9261j8634K58792o3808k41565J35307J95771j95232j30815K36859N6449k51149
228a17286K4966K40586j03828k07019J70197J52562k18337q2262K44534L879k46329
239a38337P4522K24376j42611j78074J96106J12338k32481l9568K42399l6741
249H1929k25640J11544J89717j72159j35880K11402O5098k31794R973K29726q0685
260E3231k02505J43458J55456j91528r3815K19715K4276k25410M6343K07565j12389
271B4397j69772J66824J17312k01076n1160K16042k0745k12489Q6110J85235j42451
$$ y = [102466, 137055, -146303, -92527, 172043, 37908, -179816, 21105, 171114, -75890, -145145, 123165, 107952, -153445, -57514, 169038, 211, -172250, 50114, 152069, -99261, -117895, 140897, 77089, -164476, -29169, 166602, -28630, -159445, 77414, 133863, -117286, -92320, 148266, 44438, -162581, 7616, 160178, -58159, -140421, 104113, 107992, -138337, -63815, 160561, 17950, -160124, 35982, 148320, -84161, -123729, 118670, 81929, -143711, -32167, 157550, -14609, -150489, 60913, 126011, -105783, -95810, 133916, 53231, -149274, -5816, 149640, -41888, -135703, 84012, 108288, -117122, -70779, 136786, 24397, -145375, 21449, 138761, -62315, -113475, 102567, 81822, -130667, -44557, 140678, -1773]
282a773j37665J86959P9203k10594j2794K11512n7245j93755J19726J57047j68416
293b7795j03651K00219L9898k11129K8543K01843r3043j72495J46681J24415j86601
304e3115o5314K06895J625k02929O4708J79915j24954j42438J68349Q9021j94478
315g2715k6560K02370l5979j88546R4689J55420j44812j09073J79051N2809j94406
326h7752P749J89160o7186j64195J21314J25520j61508p4878J84162J5986j89645
337a01273M2700J75828r5398j41563J41429R4953j73960m1430J86252j7518j79994
348a09974P4754J55974j23296j15335J59691O2961j80560n603J82565n1947j66053
359a16823J02782J31155j43928q2766J72145K8935j81178K7526J70855q2150j45038
$$ y = [-1773, -139438, 47521, 126724, -83870, -96664, 114848, 57603, -136152, -16426, 140621, -27795, -131446, 68773, 108671, -102458, -73915, 127928, 34885, -137610, 9071, 133486, -53115, -118429, 88466, 90091, -112838, -48130, 131785, 6831, -135607, 32742, 121763, -72715, -99275, 103095, 67116, -121430, -26741, 128679, -16133, -125206, 53845, 106654, -87752, -80003, 109157, 41971, -122224, -910, 124610, -36898, -111776, 72386, 88372, -101273, -58573, 117255, 21857, -119706, 21723, 116676, -57284, -98714, 87538, 70020, -109974, -35220, 120754, -2542, -117877, 41814, 104775, -75785, -81388, 101177, 49230, -116823, -14041, 117114, -26814, -109580, 62565, 91500, -89678, -62152, 108703, 26553, -118485]
370a18485J26326J04373j56085n1112J72731m811j72230N7264J52539j03832j17520
381a10842J39718P1095j61256j7895J67214l6010j56766Q5259J31044j24959r2813
392a06211J50208M3315j61746J0747J59528o0683j40116J04052J05939j37801
402c2768o2419J56017J1719j58021M2087J46765r0006j21267J26989Q2502j50882
413d9284l4849J59381j7052j52507O6958J31135j09327r6771J40072N3513j55367
424f4098n229J52788m5998j36399R2664J08762j27231o9572J48491K3833j54722
435g6711K2741J43754o7813j18330J07612Q3694j35409m1963J48245l407j45160
446h2747M8507J26948q9601r6830J21367N7641j40641j3280J45942l0687j35460
$$ y = [-118485, 7841, 112214, -43871, -94983, 77748, 72937, -99293, -42029, 110510, 6678, -110842, 28876, 99971, -61285, -79180, 88034, 52024, -104742, -19483, 111561, -13398, -106211, 43997, 87312, -74434, -63687, 95841, 35158, -104958, -906, 105033, -32768, -95187, 60830, 72549, -85472, -43385, 103380, 13374, -107893, 19096, 101598, -49284, -84133, 75248, 58196, -94311, -27353, 103782, -5545, -102316, 37756, 91269, -64098, -69327, 83461, 37463, -98936, -6272, 102490, -24741, -94313, 54178, 78011, -76711, -53970, 89784, 21971, -96359, 11253, 94947, -40462, -82425, 65820, 62413, -82747, -34240, 92708, 3107, -93723, 27644, 85285, -55356, -68636, 77306, 46619, -88841]
457h8841P0903J09093j06406p3259J31953L1864j42897J3200J39648n6355j21953
468i3050R2911R0231j21114m8908J38243M056j40989M0265J29137p9309j02819
479i1346J10374O5650j31187k2668J38437k2383j32079O4734J13349r8606q2268
490h7993J21324M1083j33659K955J32572m5251j17540Q2745R1434j10800n6509
501g9639J26658J5643j30213K6595J21413o5646j01034R7555P1064j18429l2727
512f8760J27917r009j25089M8886J09169q4046q2365J10776M8299j24845q992
523e8059J25782l2311j15431O9608R3412r9488o1834J19448K4302j26941J5900
534d5612J21322n4793j03442Q8052P5149j12399m0004J24755J430j23403L7914
$$ y = [-88841, -17938, 91155, -15251, -88510, 43443, 75307, -67590, -54390, 85258, 28903, -93050, -139, 90092, -31022, -79930, 58313, 62369, -78620, -38355, 90782, 11473, -91346, 19028, 84678, -46509, -69177, 69260, 46877, -85202, -20468, 92881, -5725, -87993, 33331, 74414, -59245, -56290, 76282, 31031, -86509, -3764, 87670, -23130, -79639, 47019, 62662, -67551, -40956, 80457, 14811, -86223, 11332, 82396, -36033, -68760, 59157, 50148, -74941, -26055, 83114, -932, -83297, 27479, 75778, -49067, -58059, 67723, 35412, -80019, -10411, 83001, -16487, -78321, 41127, 65429, -61512, -45612, 75710, 20917, -82525, 5527, 80676, -31723, -71727, 53028, 54458, -68945, -31031]
545c1031J10337p2755q6808R9160N4172j15836j6652J20948k1494j13106N7681
556a5384R3825q8435o6227J09325L2239j18778M654J16051m0744j01628P2595
567b507P7446r6686m5715J10958R652j14376K6606J05843n9894q5710Q8114N7867
579G1598j07121k4216J14651j2254j10883M7172R6003p6780p0978R8775L8812
590F4779j11112l324J11735l2462j01180O4697Q0072r0524n1030J06949J7256
601E5856j12117J8209J05807n1681q9283P8998O3639r7979l1567J07763k415j06205
613f0975L5758R3844o5451p2604Q8330M4490j01816j2059J05109k1229r7641N1945
625a2299Q0272p7396n4990R4717K4254j02687Q217J00259l9367q7246O6693O5292
$$ y = [-31031, 79306, 6551, -80257, 18903, 73075, -42761, -59413, 61535, 40041, -73065, -15384, 78441, -9994, -76221, 33104, 65343, -53435, -48781, 67270, 26526, -75102, -2507, 74939, -21747, -67462, 43496, 53148, -61228, -34622, 71221, 11327, -74383, 13731, 71598, -35523, -59739, 54912, 42658, -68225, -21053, 74950, -1830, -72808, 25967, 64779, -46333, -49657, 62078, 29616, -71564, -6867, 73205, -17319, -68349, 38600, 55856, -56261, -38052, 67755, 16074, -73209, 5789, 69428, -28551, -60118, 47645, 45230, -60975, -25217, 68627, 3176, -69428, 18902, 63392, -38424, -50483, 54626, 33397, -64244, -12299, 67973, -9423, -64413, 30304, 54558, -48129, -39912, 60347, 20980, -66266, 427, 65719]
637F5719q7584l7060R9461M979j01389K7547R3250n6384p4895P9498M8470r4755
649c3143j7179J00576j5625r6386M6318Q2453p1660n9925Q9369L1009r8212J083
661d1322R7241l3056q7078O0708O8235q1424m2226R3422J1859r6088J9469Q9214
673E8954m8405p3999P1945N1988q7131k4364R3376n717r0268L5460P8634o1450
685i77n9595Q0695L5020r1014o745R1697k2483q3253M9715O6819p2180m4435Q6724
698B9988J7844r1975J0672Q7270l8713p3769O3327N2821q1837k7229R1636o23
710C9412r1392K8452Q1503n3493o3141P3406L8935q6036j1545Q9840j6379q3903
722e4341M2562O9134o4629m7402Q0460K1351q8178O093Q6655l2249p6026N4715
$$ y = [65719, -21865, -58925, 40536, 45515, -55874, -28327, 64923, 8539, -66356, 13142, 61612, -33143, -50322, 50254, 34629, -61757, -15439, 67014, -4646, -64571, 24798, 55807, -42405, -41322, 55919, 22863, -64215, -3507, 64728, -16696, -58922, 34500, 46359, -49729, -30260, 58954, 10549, -63450, 8495, 60483, -26648, -51012, 42364, 36647, -53621, -18161, 60473, -977, -60572, 20123, 55143, -35871, -42616, 49081, 26598, -56655, -6940, 59879, -12301, -56736, 29988, 47832, -44143, -33471, 53799, 15086, -58683, 4644, 57465, -24372, -51601, 40035, 39412, -51980, -23528, 57975, 4482, -58659, 14747, 53682, -32354, -43899, 45941, 29562, -54341, -11779, 57355, -7274, -54676, 25784, 47135, -41043, -34950, 51705, 19456, -56570, -1855]
734a855N7415p1823l3299Q2032O468q4272K0136P8069m4096o3463O3690M2289
746E1291p7088j6675Q3011j0397q0678L5956P0122n7238n1898P2555K8036q0988
758c3991j504Q1427k4885p3857M8275N8717o6576l7364P7910J1570q1819J5385
770b6712P7593m0535o5673O0839M6782p4262k2640Q0278l800p8428K9599O9178
782E2219n1831n3308O8354L2555p7018q008P8155j7724p2001M1416N9102o0269
794h358m0530P2502J7998p6785O352P3150l0526o2706N1437M6660o7023k6807
806d4636P5136M109p5169J9627O7725m1845n3885N9769L4713p1619j2496P5769
818C7198j0641p1140L3340N9125n3208m1711O7793K0581p5108K244P4372k4581
$$ y = [-1855, 55560, -16263, -49562, 32470, 38938, -45334, -25198, 52871, 8775, -54688, 9002, 51291, -25797, -42472, 40539, 30142, -50536, -14580, 55542, -1696, -53594, 18961, 46997, -33991, -35495, 45932, 21047, -52810, -4535, 54182, -12394, -49758, 28152, 39722, -42097, -26712, 50881, 10346, -55327, 5512, 52294, -21968, -44608, 35670, 31870, -46558, -16959, 52219, 388, -52920, 15434, 47989, -29029, -37037, 41118, 23394, -48607, -7191, 51911, -8358, -48888, 23614, 41612, -35173, -28821, 44329, 13803, -48903, 2534, 49194, -17829, -44636, 30500, 34609, -40560, -20933, 46792, 4947, -48938, 10831, 45544, -26075, -38571, 37198, 26557, -44583, -11243, 47882, -5326, -47037, 20756, 41337, -33771, -31527, 42845, 18264]
830A8264o5562M4893M9749o1148k9094P1364O111p4441J6542O9174l7057n6042
842d7247N4196L7532o5954j5652P1069p369o9519K8751O0913m6321m5237N9609
854A4771K4948o7497k454O8673j9796o3024L9458N0906n4711l3426O4266J2325
866C4439o7462R983O4156l1162n5085M8158L9835o0166j9812O6433k027o6014
878c8724K3753N8659m3374m5934N8069K8572o5823p525O7104j4193o1733L4417
890f732N0383n0813l4112O1846J4462o6290O619O4003k6924n4891M4728M0649
902D2928n8145k3048O4632K854o4552J7692N8423l5664m6298M9777K9307n9393
914b1487j0313O2635r468n9150K8549M9980m4696l5869N6276J8344o1929J049
$$ y = [18264, -47298, -2405, 47344, -13804, -42898, 28466, 34577, -39864, -23322, 45852, 8795, -47247, 6949, 44481, -21473, -37125, 33944, 26575, -42944, -14193, 46720, 399, -44838, 14771, 39719, -27778, -30232, 38441, 18645, -44379, -4921, 45985, -8726, -42152, 22114, 34439, -33023, -23040, 41116, 9954, -45131, 3027, 42862, -17304, -37116, 29317, 27290, -38724, -14971, 43688, 314, -45620, 12449, 41021, -24802, -32327, 34777, 20584, -41149, -6732, 43651, -7162, -41274, 20572, 35034, -31256, -24637, 39366, 12442, -42449, 2279, 42928, -15217, -38265, 26367, 29221, -35331, -17639, 40784, 5120, -41178, 8599, 37906, -21487, -31800, 30835, 21367, -37783, -9234, 40746, -3950, -39819, 16457, 34801, -27128, -26079]
926b6079O1116k0535n4346L7667M2096n0544k4998N8815N715o1315J3423N6776
938C7791l1783m6514M7154L2039n7070j3854O1124o106n9262K5018N1116m1217
950a564l7654N3243K0526n9498j391N9895j7498n3846L4498M2392m8243k7374
962c6514N6640R848n8783R151N5517k6807m6817M0981L2832n1719j6072N7214
974B5471j595n6393J9200M9790l5111l8582M7170K3523n4530o270N6142j1581
986A7234n2048K8419M2974m1889k8878N1414J1835n6220N550N4752k2197m6931
998c5985L7474L4844m8600j9200N4451J148n5398J6534N0624l1936m0113M4063
1010G906K5350n1980q035N4668r726n2099K5792M3846l9321l1221M8706J5837
$$ y = [-26079, 35037, 14502, -39844, -2177, 39919, -10625, -35623, 23192, 28907, -32408, -18985, 37791, 6008, -40506, 6648, 38687, -18383, -32237, 28887, 22781, -36481, -11463, 39653, -1564, -39218, 14025, 34551, -24947, -26338, 33557, 16059, -37787, -3289, 39103, -9140, -36514, 20126, 29974, -28809, -19658, 35859, 9052, -37765, 3216, 36048, -15671, -31743, 25471, 23876, -32517, -13317, 36473, 1362, -37220, 9950, 33473, -21057, -27327, 28815, 17234, -34814, -6395, 36579, -5310, -34188, 17226, 29061, -27159, -21609, 33143, 10946, -35985, 1489, 36333, -12267, -31467, 22984, 24132, -31266, -14732, 35892, 3956, -36157, 7906, 33256, -18724, -26759, 27909, 18183, -33916, -8124, 35722, -3599, -34820, 13886, 29723]
1022B9723n2523J754N1592j9155m6376L3377L6017m3878k1530N0594N507n1873
1034b6771J1030M7847k6757l9784L9217K7797m7101j2787N0041l894m8082K0595
1046h649M1825l4823l1697M4863J7797n0614k204N1053j3328m5375K8626L5745
1058C3219m1137k3533M8367Q498n0275P919M7365k3111l9181L6216K7102m5870
1070a4421j2906N0473k385m9699J7087M3381l0415l2655M1218J9451m7433m833
1082b3137M8179j0654m4732K4447L6418l5307k3675M3715R421m7835M794M6208
1094B7842j8657l9943L0894K9897l9619j6574M4876J795m5698J2972M1918k6173
1106C530l3833L6213K1477m2976o789M6151p687m3975K1242L6742l3369k6552
$$ y = [29723, -22800, -21046, 30546, 11391, -34985, -1608, 34409, -9469, -30999, 19595, 25102, -26771, -15741, 32106, 5349, -34435, 4782, 32579, -14522, -27309, 22732, 18838, -29244, -8649, 33176, -1647, -33344, 11519, 29316, -21298, -23502, 27551, 14223, -31152, -2526, 33219, -7918, -31451, 16916, 25414, -24861, -16942, 30423, 7312, -31869, 4347, 31449, -14421, -27327, 23146, 20761, -28938, -11851, 31530, 1115, -31540, 9678, 29129, -18304, -23137, 25042, 14388, -30344, -5897, 30521, -4786, -28461, 15254, 24675, -23160, -18366, 27842, 9185, -30758, 136, 30033, -9586, -26160, 18716, 20511, -25187, -12215, 29703, 3530, -30303, 5910, 27387, -15589, -22378, 23773, 16086, -27889, -6647, 30095, -3274, -29826]
1118b9826M1314J3334m4735K108M4541j6751l9824K8993L0480l8459j7998M3998
1130A7175L706m5022J0922M1717k3871l3914L4348K3014m1185j0088M3162m574
1142A5390m1533J8695L6568k9715k7324L7709J5048m2525k042M2386j1621l7911
1154b6875K4535L0597l4246k0191M0024P470m1714O148L9276j9476l3187L0519
1166B880K4010l8043j1803M2098j224m1424J4054L5679k6550k7137L6283J6570
1178B5393m1104l743M1739r794l8444K1754L0683l2058k0048L9341Q041m2173
1190b0413M572M0362j6591l3993K7301K4081l5716j2585M0179R3m0138J2592L6703
1203B6447k3056k9084L1089J7771l7153n588L9545o268l7228J7952L1220k7828
$$ y = [-29826, 11488, 24822, -19913, -17805, 26736, 9985, -29839, -846, 29634, -8825, -26823, 17175, 20881, -24141, -13219, 28498, 4627, -29287, 5061, 28075, -13110, -23198, 19964, 15390, -26143, -7448, 29120, -595, -27919, 9790, 24838, -17687, -19729, 22657, 11036, -26875, -2340, 28257, -5989, -26180, 13844, 21314, -20400, -14252, 25024, 5548, -27639, 2880, 26890, -11153, -22956, 19142, 17918, -23506, -9452, 26227, -323, -27460, 8823, 25393, -15711, -19454, 22285, 12491, -25953, -4199, 26484, -5574, -25622, 13719, 21760, -20413, -15841, 24521, 7930, -26063, 1238, 25319, -10397, -22982, 17197, 17290, -22848, -10256, 26447, 3391, -25693, 5396, 23167, -13986, -19574, 19971, 13703, -23525, -5573, 25647, -2181]
1215b181k2148L4434J0361l8012K371L7855j4509l4021K4848K6582l2209j5739
1227b2368L6814L191l8342Q955L5476k0374k8693L0104J9757l5771q172L7544
1239A8121n175l6425J7419L1619k7225k3179L4444J2661l7966r50L7437j1100
1251I681l3422K1921K5988l0629j6506L5990N486l6920O623L4503j7937k9182
1263b4404K6670K0338l3070r603L6622j002l5660J1967L0984k2241k3970K9894
1275F525J4459l4320l216L5586q248l3051J8816K7024k7314j8148L2922P116l5656
1288a7505M033L4400j4550k9073K4351K1398l1538j1860L4728J95l4853J1493
1300h781L1950k1139k5042K8924J5504l3935m804L5104o410l2605J6900K7029
$$ y = [-2181, -24329, 10105, 20466, -17546, -15175, 22680, 8171, -25850, -1002, 25580, -6629, -22368, 14446, 17637, -20705, -11750, 23726, 3352, -25341, 4763, 24520, -11251, -19423, 18121, 12946, -23479, -6060, 25559, -1666, -24845, 9599, 22260, -15706, -16656, 20781, 9681, -23741, -1820, 24168, -6461, -22967, 13023, 18509, -18411, -11788, 22715, 4778, -24404, 2266, 22604, -10466, -20069, 16553, 15551, -20109, -8142, 22842, 601, -23369, 6525, 20984, -13336, -16552, 19034, 10786, -22265, -3449, 23575, -3739, -21887, 11035, 18151, -17505, -13472, 20928, 6378, -22695, 1656, 23054, -8484, -20344, 14384, 14579, -20274, -8781, 23169, 2030, -23012, 5912, 21416, -12519, -17323, 17781, 11371, -21234, -4334, 22695]
1312B2695k5659j8867L1791R299l4292J370L3227j2448k9570K1589K2678k8422
1324f609j3059L3028K928l3962P096L0691j7216k4789K5435J6960l0550p101L2955
1337A5807l337l1984J3348K7690k2181k0440K8735J0958l2643m09L3263r614k9640
1350b0447J9029K2873k7016j4619L1557M518l2839O341L1432j5779k6477K3423
1362A996J8045k9397q199L2438k231l1931J2395K8278k1016k1521K7568J2658
1374A9083l1214k694L1622p802k9336J6948K4536k3722j6362K8511O598l1029
1386a4861L160K9830j2978k5752K1593J9693k7367j1128L0160R94l0464R020K7816
1399A9716j7912k2456K4788J4741k8876n164L0409m883k8557J4568K3690k3320
$$ y = [22695, -2964, -21831, 9960, 19259, -15033, -13663, 19564, 7116, -22454, -865, 21813, -6609, -19668, 13360, 16288, -17674, -10578, 20113, 2897, -21892, 3543, 20503, -10047, -17148, 15807, 12470, -19514, -6166, 21524, -657, -21097, 7638, 18596, -14047, -14456, 18807, 9193, -20447, -1418, 21455, -5561, -20180, 11377, 15895, -16944, -10603, 20829, 5050, -21427, 1996, 20041, -9356, -17555, 14883, 12652, -19279, -6884, 21394, 378, -21143, 6425, 19083, -12131, -14825, 16797, 8995, -20341, -3393, 21143, -2579, -18941, 9570, 16168, -14861, -11701, 18129, 5151, -20601, 992, 20685, -6682, -17810, 12350, 13344, -17120, -8100, 19716, 1804, -20652, 4136, 18877, -9999, -15163, 15246, 10363, -18194, -3626, 20064, -3256]
1411c256j7102K9139Q874l0983J243L0084j1295k6553J9602J9914k6326j1622
1423a8281L0322K639l0632O804K7665j5969k2148K3579J4655k8841o157L0623
1435A4259l007k9073J2170K4991j9670j8120K5427R449k9258p65K9702p648k6408
1448a7951J6178K0886k3058j3461K7348M359k9250M809K8163j3138k3710K0240
1460A415J6569k5503p684K8488j769k8734J0440K5458j8270j9477K4531J1768
1472A7232k7837k267K8469p643k6871J5859K2131k2217j4418K6774N620k8509
1484a3677L584K7246j2584k3525J9953J7464k5139r571K7715N78k7442Q618K4959
1497A8179j6672k0162K2405J2803k6180m225K7514m252k5566J2747K1472k0142
$$ y = [-3256, -20358, 8781, 17655, -13328, -12085, 17999, 6704, -19849, -247, 19667, -6659, -18281, 12041, 14680, -15952, -9148, 18517, 2548, -19600, 3979, 18634, -10207, -16364, 14259, 11252, -17821, -5651, 19340, -330, -18450, 6977, 16426, -12832, -13597, 16105, 8457, -17951, -1773, 19113, -3945, -17406, 9942, 14301, -14949, -10140, 18023, 4885, -18825, 1415, 17984, -7519, -15203, 13285, 11516, -17218, -6778, 18680, 410, -19067, 5464, 17232, -10605, -12872, 15597, 7954, -18917, -3058, 19073, -3144, -17562, 9212, 14832, -13677, -10093, 17153, 4569, -18956, 997, 18461, -6678, -16249, 11466, 12044, -15398, -6780, 18179, 1507, -18655, 3750, 16553, -9627, -13852, 13662, 9410, -16156, -3409, 18063, -2079]
1509b079j5804K4772Q260k6761O49K6467r257k3428J6993J8035k3099j0848K6581
1522A0481K434k7326O068K5071j4140k0228K1134J3731k5563o060K6798k972k5768
1535a6340J1593K2197j8576j5929K4108Q336k7216l91K6989p866k3912J5582J8753
1548A7328k1560j1776K5438L992k6476M229K4692j2022k0712J8425J4390k3108
1560g160o600K5958j140k5911Q700K2602j5820j7536K1234J0717k4298k495K5312
1573A3563n633k3766J2823J9397j8919j2997K3262N192k5320L095K4855j0744
1585D808k1447J7404J5846k2403q786K4648M50k4733Q063K2766j5049j8052K0352
1598C867J1108k4065l400K5032m614k3384J2396J9766j8636j4082K2722O986k4478
$$ y = [-2079, -17883, 6889, 15149, -11612, -10963, 15504, 6247, -17181, -188, 17847, -5252, -16100, 10481, 12915, -14411, -8343, 16728, 2588, -17640, 3494, 17225, -8338, -14398, 12400, 9428, -16340, -4747, 17450, -1126, -17055, 7053, 15389, -11827, -12218, 14771, 6905, -17007, -1425, 17328, -4232, -16008, 9430, 13422, -13054, -8825, 15867, 3845, -16867, 1558, 15948, -7160, -13760, 12198, 11058, -14853, -6153, 16449, 629, -16907, 4327, 15044, -9254, -11749, 13563, 7930, -15836, -3013, 16384, -2535, -15532, 7730, 12922, -12398, -9303, 15552, 4808, -16639, 765, 16611, -5792, -14578, 10070, 10520, -14213, -6150, 16616, 1567, -16485, 3867, 14975, -9090, -12490, 12542, 7928, -15456, -3060, 16706, -1930, -16012, 6710, 13696, -10782]
1611a0782R06K3751q778k0901J5534J6271k0453r619K3590K270k4357N012K2212
1624A4656j2229j8147J8361J2588k2094n522K3585k270k3072R541J9883j5930
1636f50j4667K0733Q101k3460o49K3772o860k1429J3645J6821j9262j0748K2692
1649H039L544k3499M392K2386j1563j8867J7252J3028k1469o064K3592j246k2949
1662a3424Q596K0124j5054j5508J9733R267k2385k166K2740n204k0973J2092J7286
1675A5124j7472j1764K1075N060k2753J802K1828q589j8557J4923J3849j9409
1687d883p791K1753O28k2078O295K0157j2593j5926J7808J0174k1170l573K2251
1700A1052l419k1044J0064J7385j5876j2039K0053N700k1894J403K1572q295j9176
$$ y = [-10782, -9876, 13875, 5097, -15804, -270, 16001, -4452, -14071, 9519, 11789, -12568, -7556, 14656, 2427, -15720, 2641, 15229, -6865, -12387, 11198, 8928, -14144, -4603, 15280, -650, -15317, 5416, 13517, -9943, -10592, 13180, 6320, -15109, -1464, 15357, -3905, -14653, 8039, 11583, -11916, -7524, 14862, 3299, -15568, 1684, 14712, -6757, -12821, 10771, 9525, -13424, -4828, 15296, 242, -15266, 4467, 13734, -8651, -10817, 11923, 6719, -14254, -2162, 15124, -2348, -14112, 6963, 12023, -10730, -8928, 12900, 4311, -14246, 677, 14526, -4883, -12674, 9079, 9707, -12371, -6076, 14081, 1488, -14438, 3370, 13544, -7626, -11199, 11052, 7633, -13411, -3347, 14038, -1838, -13877, 6176, 11876, -10018, -8615, 12957, 4662, -14514]
1713a4514J4057J4482j8524q230K1503J652k2015N027K0204j1258j6404J6234
1725B214J0896j9562m286K1069k543k0488Q955J7898j4319j3477J8119P422k0490
1738h592q98K0837n433j8970J1344J5260j6094j0102J8893L625k0097L322J9489
1751A2584r485j6708J4646J2132j8307o232K0066l82j9898P014J7776j2744j3881
1764a3419J7156Q567j9498k139J9774m846j8394J1071J5235j5916j0326J9070
1776F335M584k0136J614J8914p979j6127J3589J2028j7508o790J9556Q98j9452
1789a0474N236J7359j0927j3749J5486Q947j8495l383J9430k231j8163P867J4995
1802A1898j3100j0751J6888N527j8862K18J8912n833j6785J0990J2643j5302p501
$$ y = [-14514, -457, 14025, -4499, -12729, 8774, 10426, -11589, -6562, 13642, 2384, -14020, 2214, 13110, -6452, -10738, 10331, 7788, -12700, -3745, 14153, -166, -13643, 4476, 11898, -8592, -9490, 11347, 5914, -13056, -1712, 13548, -2546, -12648, 6245, 9870, -10227, -6905, 12584, 3099, -13609, 1037, 13169, -5138, -11370, 8696, 8314, -11584, -4570, 13206, 462, -13419, 3737, 12304, -7194, -9333, 10441, 5595, -12799, -1728, 13507, -2409, -12735, 6335, 10919, -9217, -7603, 11311, 3332, -12795, 794, 12822, -4686, -11476, 8080, 8978, -10474, -5238, 12121, 1194, -12555, 2931, 11878, -6617, -10000, 9430, 7199, -10964, -3097, 11898, -1202, -11953, 4935, 10462, -8400, -8182, 10730, 4897, -11888, -898, 11745, -3557, -11058]
1815a1058J8195J814j9059L954J7797r110j4435J3575R570j6837l786J8420k262
1828F778j8187P842J6075j2327j1883J5677O383j7782m60J8014n356j6541J0471
1841a296J3372j4289q762J6698L114j7677K685J7003q036j4800J2409J0991j5365
1854c953n852J6893J58j6857N546J5185j0564j2208J4379Q061j6490k728J6974
1867H544k914j6035Q225J3456j2662r625J5720M756j6925P51J6341o330j4173
1880a0871J1180J0667j4880o136J6870R74j6999M429J5453r314j2384J3266Q062
1893A0317j5829l111J6691k132j5678P326J3122j1735r409J4851M821j6432J06
1906g092J6277n012j4489R432J1320j2996p138J5215K375j5974K607J4925p292
$$ y = [-11058, 7137, 8951, -10108, -6154, 11643, 2533, -11902, 1673, 11243, -5594, -9380, 9040, 6778, -11409, -3567, 12508, 181, -11702, 3975, 10358, -7424, -7884, 10130, 4774, -11767, -1296, 12076, -2213, -10975, 5723, 8837, -8840, -6155, 10848, 2812, -11988, 421, 11412, -3953, -9805, 7088, 7246, -9611, -4065, 11120, 556, -11652, 2727, 10788, -5702, -8430, 8544, 5630, -10405, -2180, 11276, -1386, -11011, 4709, 9465, -7460, -6709, 9632, 3302, -10871, 309, 10976, -3904, -10040, 6830, 7804, -9195, -4766, 10687, 1373, -11011, 2255, 10317, -5512, -8623, 8068, 5936, -9742, -2416, 10706, -1029, -10438, 4413, 9234, -7198, -7092, 9185, 4173, -10316, -884, 10436, -2560, -9698, 5517, 7892, -8082, -5475, 9450, 2158]
1919B158j2354J1374Q633j4275m054J5670q10j5494N542J3690r662j0368J2976
1932C026O088j4977j267J5460l722j4259Q223J1530j1972p543J4472K793j5515
1945g663K141J4887o732j2734J0496R219j3291m706J4784j33j4867M916J3451
1958I768r084j0674J2256O744j4142k082J4733k603j3929P007J1740j0587q426
1971i279J2980M295j4153L38J3914m871j2426Q890R700j2029n942J3832J555j4272
1985g468L053J3226p321j0790J0717P323j3003l079J3910j446j3377N870J1537
1998I152r650q476J2416M590j3929j64J3900m269j2388Q246R621j1354n929J3198
2012D964J686j3742K669J2902o637j0822R909P627j2207l747J3273n30j3002M674
$$ y = [2158, -10196, 1178, 9811, -4464, -8518, 7152, 6342, -9152, -3610, 10080, 418, -9950, 3026, 9114, -5863, -7130, 8330, 4608, -9651, -1428, 10102, -1870, -9413, 5059, 7852, -7663, -5522, 9365, 2633, -10101, 395, 9614, -3677, -8383, 6401, 6268, -8599, -3683, 9768, 684, -9990, 2266, 9010, -5132, -7214, 7519, 4916, -9013, -2006, 9734, -853, -9279, 3701, 7996, -6157, -5819, 8095, 3224, -9202, -312, 9388, -2641, -8583, 5249, 6804, -7468, -4415, 8811, 1490, -9300, 1417, 8740, -4263, -7342, 6568, 5122, -8255, -2385, 9152, -498, -8974, 3442, 8032, -5897, -6061, 7839, 3570, -8818, -572, 9049, -2305, -8234, 4964, 6650, -7092, -4423, 8479, 1842, -8980, 929, 8556, -3651, -7398, 5875, 5345, -7657, -2983]
2026b983J1531q323q902J1105N459j2673j381J2957k790j2042O641J0029r818
2039a190o975J1953L293j2863P20J2397m818j0731Q453P945j1147m332J2574L04
2053E583j2698L737J1431p434r011J0352N797j2229j994J2833j959j1910N743
2066a759R784r020o772J1375L110j2460Q17J2346m549j0852P805Q112j0369m728
2080g160J1926J041j2306K641J1388o035r312Q846O232j0866k601J1795j227j1599
2094g237M875J0272p882p652J0094M214j1413n02J1619l193j0644O611Q537r149
2108a450n525J0849J749j1494K141J1007n699r365Q539O689j0476l177J1306o80
2122D414j1075M398R742p603p543R898M566j1014r04J1106k913j0247O306Q362
$$ y = [-2983, 8548, 225, -8677, 2428, 7887, -4786, -6167, 6790, 4000, -8042, -1401, 8628, -1190, -8165, 3788, 7081, -5782, -5062, 7335, 2517, -8214, 239, 8184, -2963, -7295, 5279, 5583, -7115, -3378, 8053, 619, -8392, 1960, 7757, -4472, -6466, 6367, 4408, -7502, -1759, 8025, -995, -7767, 3608, 6718, -5742, -4925, 7421, 2872, -7980, -175, 7937, -2432, -7160, 4766, 5807, -6499, -3858, 7530, 1495, -7817, 1029, 7261, -3605, -6206, 5589, 4362, -7237, -2362, 7910, 28, -7624, 2470, 6684, -4729, -5231, 6388, 3195, -7449, -838, 7699, -1450, -6975, 3874, 5623, -5871, -3730, 7277, 1578, -7787, 752, 7441, -3035, -6212, 5094, 4414, -6661, -2263, 7479, -124, -7667, 2231, 6797, -4217, -5121, 5985, 3072, -7175, -869, 7493]
2136G493q905n727J0598K647j1117Q50J0448m371q945P454O708r691l912J0815
2150D345O35j0801K853R703o050p722Q603N021j0381j939J0851j241j0023M600
2164a546Q296p571n823R658K874j0790L81J0662l489r231O405O852q810l824J0350
2179D394N34j0770K603R859n514p822P955N054r608j854J0365j527j0190M384
2193b137Q851o812o336Q703L313r845k4R964l155r220N974P447q005m822R331
2208C227J662r783J663R426m603q253O930O040q600l101R488j19r347L399Q352
2223F381o356o717Q371M241r429j110R672k102q930N092P303p551m989R075K155
2238E106r593R30R122l983p690O728N711q747l153R590J82r547K731Q626n347
$$ y = [7493, -1412, -7139, 3459, 6106, -5011, -4161, 6287, 1916, -7029, 425, 7133, -2558, -6470, 4345, 4980, -5821, -2968, 6735, 685, -7037, 1566, 6587, -3794, -5733, 5118, 3877, -6146, -1546, 6750, -821, -6644, 3014, 5888, -4902, -4521, 6141, 2652, -6579, -174, 6678, -2132, -5956, 4394, 4928, -5842, -3239, 6620, 1106, -6716, 1239, 6293, -3315, -5169, 5196, 3669, -6521, -2137, 6714, -98, -6434, 2269, 5582, -4263, -4287, 5677, 2522, -6698, -724, 6723, -1282, -6104, 3227, 4889, -4894, -3231, 6195, 1592, -6661, 269, 6309, -2291, -5392, 4096, 3977, -5370, -1971, 6381, 25, -6692, 1679, 5920, -3509, -4619, 5053, 2951, -5979, -887, 6416, -1135, -6124, 2951, 5106, -4487, -3557, 5565, 1582, -6108, 620, 6331, -2416, -5569, 4021, 4203, -5344, -2613, 6013, 666]
2253F66o699P524M221r006j566R418j410q782M193P439o566n338Q292K793r193
2268d014K7R181k888q217N398O371p359l801Q771J073r146J743Q446m536p027
2283e978O838M875q307k114R032q29q838L573P577o030n590P833L041q888j55
2298c960Q922k629q002N243O269p378m001Q591J271q931J625Q553m128p117O174
2313E02M917p850k396Q682l33q534L055P658n380o018P153L719q302r95Q545j765
2329B658q038M251O753o248m620P764K034q512N91Q254l284p189N710N523p274
2344a627l115Q124L19q352K399P603m834o039O832L878q075j270Q397j402p967
2359e129L947O661o214m741P609K417q216L85Q065k935p221N109N441o902l213
$$ y = [666, -6033, 1491, 5712, -3294, -4860, 4558, 3148, -5634, -1441, 5998, -568, -5906, 2386, 5179, -4014, -3987, 5194, 2306, -5911, -513, 5858, -1501, -5302, 3469, 4542, -4604, -2861, 5585, 1049, -5978, 860, 5735, -2572, -4686, 4346, 3517, -5321, -1748, 5829, -201, -5791, 2042, 5083, -3805, -3960, 4962, 2333, -5669, -426, 5843, -1535, -5536, 3055, 4326, -4605, -2980, 5573, 1445, -5672, 502, 5419, -2431, -4827, 3855, 3522, -5012, -1957, 5701, 321, -5697, 1456, 5175, -3127, -4122, 4423, 2658, -5380, -1129, 5624, -624, -5244, 2520, 4554, -3958, -3367, 4887, 1603, -5586, 124, 5647, -1627, -4742, 3382, 3701, -4651, -2252, 5351, 517, -5522, 1310, 5188, -2887, -4157, 4240, 2838, -5129, -1182, 5479, -735, -5476, 2133, 4550, -3666, -3281, 4784, 1849, -5372, -263, 5178, -1724, -4937]
2374d937Q063Q47q195J759P628m161o408O070M502p343k147P962n23p712L053
2389a542O797n189n141O793K902p819n08P884j949p213M501N878o390m016P473
2404B461J488p906J179P438l514o177N662M352p197k127P869l25p729K742O759
2419D975m969n107O723L090p611p24P740j809p169L980N699n768l686P240J575
2434D179p841O66P437k916o470M923M807o388k632P329L44p543J970O955l993
2449H27n640N647L563o889j259P532j047p168L265O133n200m541O371K318p126
2464c214K67P246k559o517M510M994o099l008P047O20p236J808O777l921n567
2479d852N592L877o595j717O915p80o785L130O060m929m508O303K586p038m84
$$ y = [-4937, 3126, 3973, -4222, -2463, 5165, 1004, -5404, 666, 5168, -2175, -4322, 3640, 3117, -4595, -1542, 5255, 66, -5075, 1718, 4620, -3199, -3707, 4177, 2228, -4985, -484, 5394, -996, -5012, 2461, 3949, -3957, -2778, 4660, 1146, -5031, 631, 4983, -2214, -4341, 3528, 3203, -4526, -1784, 4975, 6, -5101, 1622, 4712, -2899, -3623, 4117, 2308, -4861, -881, 4818, -950, -4636, 2604, 4179, -3662, -2996, 4441, 1525, -4945, -22, 4785, -1603, -4235, 3094, 3438, -4105, -2135, 4820, 827, -4813, 834, 4397, -2492, -3751, 3781, 2734, -4434, -1169, 4964, -236, -4777, 1594, 3912, -3214, -2947, 4299, 1740, -4777, -267, 4727, -1372, -4380, 2667, 3287, -3949, -2141, 4636, 715, -4852, 740, 4617, -1978, -3695, 3220, 2440, -4345, -1215, 4845, -84, -4592, 1711, 4297, -2741, -3225]
2494c225O907j880o241M045N177n662l483O569J435o894P81O552l031n633M887
2509C04M165o257k230O945K04o790J991N904m221m613N808K978o689q02O919j342
2525B274o390L345N069n211l379O534J497p017N61O678k599n611M462L952n854
2540a689k084O682m9o751K029O218l716m824N195K949o371j020O802r49o437K910
2556a105N518m459l973N563J909o319K57O433k203n965L873M717n141k924O100
2571B281Q18o470J220O145l259n178M814L718n684j636O125o80o117K736N417
2586D250m415m101N681K419o200m28O174j779n565L722M462n238k963O039J162
2601C220o258J024N870k951m956M511L456n705j877O297J55o084J824N361l660
$$ y = [-3225, 3682, 1802, -4439, -394, 4783, -879, -4362, 2207, 3642, -3252, -2471, 4081, 1050, -4583, 304, 4469, -1788, -4018, 2927, 3131, -3659, -1668, 4236, 15, -4598, 1210, 4188, -2501, -3303, 3616, 2274, -4116, -771, 4298, -913, -4292, 2242, 3739, -3278, -2717, 3961, 1362, -4249, 213, 4165, -1689, -3773, 2909, 2860, -3891, -1862, 4356, 640, -4184, 1011, 3960, -2411, -3431, 3371, 2422, -4015, -1105, 4413, -46, -4019, 1544, 3453, -2866, -2609, 3824, 1621, -4344, -471, 4246, -895, -3819, 2281, 3099, -3371, -2151, 3994, 735, -4443, 371, 4089, -1595, -3231, 2894, 2214, -3903, -1167, 4250, -165, -4266, 1415, 3834, -2366, -2794, 3380, 1601, -3964, -242, 4220, -1018, -3981, 2058, 3220, -3038, -2014, 3856, 905, -4051, 460, 3916, -1789, -3666, 2631, 2786, -3298, -1474, 3887, 227]
2616B27m286N048K704n915q47O211j009n827K850M845m438l351N552J605o152
2631b783J41O003j930n214L725M007n068k337N819K93o103J580N679l201m519
2646c908M673K916n587j173N970p84n694K622M840m110l528N238J883n793oN851
2662C410j892n384L442M223m752k600N628R52n841Q57N441k714m682M131L413
2677C632n103j734N705l6n749J802N176l401m063M610K578n459p97N741j048n240
2693c386K812M388m312l111N183J361n648M78N674k149m873L640L601m867k055
2708c264N446K63n558J624N062l250m006M493K623n277r51N535q48n368K468M632
2724C624l802l302M884J787n426j24N329j698m860L327L904m388k512N188Q30
$$ y = [227, -4059, 989, 3693, -2222, -3069, 3142, 2133, -3694, -844, 4001, -437, -3788, 1764, 3369, -2783, -2642, 3361, 1431, -3783, -58, 3949, -1119, -3456, 2363, 2656, -3447, -1867, 3812, 611, -3908, 765, 3681, -1906, -3079, 2891, 2107, -3587, -965, 3875, -235, -3763, 1475, 3358, -2435, -2441, 3410, 1518, -3866, -424, 3799, -953, -3553, 2075, 3027, -2814, -1957, 3484, 770, -3912, 219, 3632, -1471, -3205, 2500, 2464, -3285, -1483, 3693, 292, -3771, 839, 3417, -2042, -2839, 2902, 1854, -3386, -574, 3814, -498, -3609, 1574, 2935, -2713, -2235, 3439, 1290, -3583, 57, 3658, -1209, -3264, 2182, 2445, -3113, -1489, 3573, 323, -3683, 810, 3433, -1844, -2795, 2740, 1892, -3476, -1008, 3624, -178, -3480, 1404, 3191, -2235, -2359, 2970, 1272, -3588, -261, 3643, -745, -3257, 1931, 2761]
2739B761n530Q41N235k454m479L794L270m784j690N292J0n200J774M636l465l674
2755c663M552K321n188n02N356j159m972K744M013m157k735M992J256n284N21
2770a905N036k222m296L629L186m706j791N203J82n257J459M784k926l730M148
2785G94K422n018j024N243n56m922K238M211l551l090M596J651n260j25N268j360
2801A517m730K817L667l995k286M861P48n218P98M902k326m165L640K937m502
2816a335j342N049l23n093J784M467l155l284M208J929m843k73M994j366m651
2831c234K743L822l855k544M562J034m907O64M806k132m238L355L115m321j735
2846b865M739K83m780J416M452k876l742L895K516m577j049M875n15m639K080
$$ y = [2761, -2769, -1928, 3307, 853, -3626, 168, 3438, -1346, -3036, 2256, 2266, -2934, -1160, 3476, 11, -3663, 889, 3210, -1978, -2480, 2876, 1717, -3255, -511, 3502, -655, -3390, 1602, 2858, -2426, -1905, 3131, 909, -3387, 242, 3428, -1278, -3069, 2134, 2316, -2941, -1482, 3302, 376, -3354, 794, 3216, -1802, -2826, 2417, 1861, -3061, -823, 3388, -163, -3253, 1343, 2994, -2266, -2391, 2877, 1517, -3213, -396, 3271, -724, -3010, 1851, 2599, -2619, -1821, 3081, 755, -3410, 230, 3167, -1335, -2677, 2372, 2049, -3044, -1260, 3207, 52, -3232, 976, 2905, -1938, -2211, 2783, 1417, -3234, -491, 3331, -524, -3068, 1494, 2528, -2379, -1715, 3091, 959, -3279, 76, 3191, -1130, -2865, 1874, 2157, -2623, -1207, 3245, 369, -3373, 522, 3038, -1539, -2588, 2287, 1772, -2867, -787]
2861g87L995l402k992M356J630m770j51M753j486m290K999L453m003k279M636
2876A662P04m803Q28M446k341l580L648K498m477j191M720l48m526J861L954l165
2892a10k975M161J793m716l73M714j049m268K394L379l640k163M458R41m759M56
2908a757M582j923l934L047K876l969j593M613K21m684J126M227k451l322L557
2923F16K100m342p46M707o65m496K051L804l137k735L981J283m508K25M573j577
2939A134m006K762L032l703j779M235K61m396J242M174k502l452L392K410m066
2954a262r94M283m88m189J856L712l022k795L855J661m266l21M282j161m010K480
2970c79L365l439k318M088J032m331L64M137j855l530L047K693l913j537M331
$$ y = [-787, 3208, -194, -3186, 1170, 2800, -1970, -2121, 2632, 1146, -3144, -145, 3308, -695, -2974, 1662, 2366, -2437, -1609, 2837, 496, -3084, 564, 3062, -1415, -2606, 2114, 1766, -2760, -899, 3055, -110, -3085, 1076, 2869, -1847, -2220, 2494, 1445, -2823, -429, 2950, -690, -2853, 1605, 2546, -2213, -1757, 2825, 902, -3032, 15, 2891, -1078, -2671, 1942, 2163, -2521, -1395, 2832, 381, -2941, 616, 2716, -1626, -2372, 2335, 1670, -2826, -775, 3029, -108, -2843, 1138, 2421, -2087, -1862, 2711, 1134, -2872, -110, 2922, -781, -2560, 1675, 1936, -2460, -1218, 2956, 454, -2998, 394, 2804, -1262, -2256, 2027, 1539, -2650, -794, 2918, -104, -2899, 956, 2617, -1649, -1970, 2312, 1151, -2859, -379, 2986, -453, -2771, 1317, 2349, -1982, -1618, 2519, 664, -2866, 181, 2874, -1039, -2576, 1755]
2985A755K16m278J155L841k501l039L513J934m156o10M383o95m027J996L267l168
3001d14k233L944R98m231K90M159j548l631K607K730l518j530M005K40m130J030
3017a232L833k206l107L197K111l871r62M147l94m036J682L542k683k701L498
3032H18J516l984k33M029r97l736K288L025l212k053L864Q28m086M61L897j784
3048F41l280K842K362l523j237L937pl981J295L466k483k645L381J642l907m26
3064a923M009q36l671J949K963k886k012L619Q21l872L51L783j476l291K489K467
3080B484l305j494L833K94l921R47L635k023k971K855J980l533q04L851m03l736
3096b311J538L299k557k466L288J399l737j21L780j040l543K195K809k987j771
$$ y = [1755, 1971, -2307, -1152, 2689, 188, -2851, 662, 2596, -1560, -2170, 2213, 1518, -2509, -513, 2754, -414, -2647, 1297, 2295, -1936, -1646, 2513, 965, -2666, -59, 2671, -847, -2377, 1628, 1868, -2262, -1232, 2601, 395, -2712, 485, 2596, -1275, -2237, 1910, 1516, -2520, -838, 2704, 21, -2680, 818, 2334, -1650, -1883, 2146, 1149, -2587, -299, 2726, -486, -2539, 1325, 2153, -1933, -1472, 2425, 641, -2639, 203, 2565, -958, -2195, 1742, 1735, -2246, -951, 2515, 32, -2613, 768, 2410, -1497, -1923, 2086, 1250, -2421, -472, 2491, -395, -2407, 1212, 2033, -1839, -1488, 2295, 819, -2472, 17, 2484, -821, -2315, 1518, 1812, -2109, -1162, 2473, 450, -2521, 334, 2314, -1219, -2023, 1828, 1425, -2311, -773, 2526, -31, -2497, 791, 2190, -1547, -1668, 2112, 1072, -2471, -276, 2533, -454, -2225]
3111b225L502N72l704O60L517j828k980K770K154l379j079L596j20l566J301L172
3127B363k334k465L093J514l552l35L610p98l385J891K797k781j996L390R83l573
3143a578K00L441j313l129K395K392l147j461L580L97l620P73L303j902k727K850
3159D54J864l439q46L639k44l458J358K918k356k124L165J110l584n5L576r95
3175I83l184K025K427k789j530L335M65l540N90L314j575k715K432J869l114q84
3191a891L476j39l538J198L112k043k379K739J429l221l64L448p43l250J671K763
3207B268k482j891L061Q97l389K33L390j288l049K173K343k817j399L199K62l276
3223a765Q55L054j866k544K609J740l106o99L277l88l187J475K735k330k020K884
$$ y = [-2225, 1277, 1849, -1855, -1195, 2322, 494, -2486, 284, 2438, -941, -2020, 1576, 1456, -2110, -809, 2363, 29, -2436, 657, 2171, -1381, -1716, 1894, 1096, -2289, -398, 2399, -382, -2378, 1012, 1995, -1578, -1378, 2063, 750, -2379, 16, 2408, -739, -2200, 1380, 1777, -1843, -1070, 2233, 331, -2396, 454, 2318, -1121, -1967, 1672, 1428, -2030, -672, 2246, -110, -2234, 931, 2041, -1543, -1598, 1978, 983, -2201, -176, 2251, -538, -2068, 1267, 1732, -1808, -1218, 2096, 521, -2194, 238, 2107, -1007, -1891, 1585, 1446, -2092, -894, 2218, 175, -2204, 535, 1964, -1257, -1621, 1827, 1084, -2166, -495, 2268, -214, -2105, 956, 1853, -1536, -1303, 2087, 799, -2250, -77, 2266, -551, -1950, 1249, 1511, -1765, -910, 2144, 278, -2266, 343, 2083, -1023, -1722, 1555, 1167, -2020, -545, 2190, -140, -2160, 724]
3239G24J097l136m7L151j095k773K003K246k725j443L111M92l176N19K979j528
3255C99k490K317J852k918r96L195l0l110J070K727j977k132K696J369l154m41
3271a623L270n52l028J517K473k352j707K916Q71l196J81L040j157k602K021J946
3287B018k753j104L129J58l140P58K814j613k202K350J387k884m73L065m60k898
3303a848J333K472k085j724K616Q65k981Q7L004r47k722J720K159k323j342K791
3319A075L91k995N26K879j399k479K137J791k639q91K919q8k932R79K671j841
3335A04k060K387J294k745l50K907o82k703J556K283k272j605K693P39k840K31
3351a063K726j166k333J939J732k489r68K760J20k727P44K478j617j995K273J329
$$ y = [724, 1821, -1315, -1362, 1789, 694, -2079, -76, 2170, -555, -1998, 1113, 1605, -1571, -1052, 1927, 399, -2091, 226, 2078, -840, -1836, 1359, 1329, -1781, -711, 2016, 39, -2093, 603, 1972, -1182, -1623, 1647, 1095, -1933, -416, 2057, -295, -2002, 914, 1785, -1411, -1230, 1810, 653, -1949, 72, 2018, -735, -1839, 1290, 1448, -1692, -934, 1880, 267, -1935, 415, 1802, -1082, -1555, 1510, 1050, -1848, -515, 1957, -128, -1852, 764, 1629, -1352, -1265, 1739, 792, -1930, -210, 1949, -374, -1716, 1075, 1466, -1529, -1003, 1876, 477, -2002, 135, 1926, -713, -1604, 1315, 1227, -1705, -726, 1945, 104, -1956, 431, 1725, -1020, -1370, 1537, 855, -1848, -292, 1991, -281, -1886, 807, 1546, -1294, -1063, 1663, 497, -1836, 103, 1835, -654, -1622, 1138, 1258, -1469, -725, 1753, 136, -1859, 414, 1743]
3367A743k696n09K836l54k653J169K263j915j609K452Q38k776oK761p73k533J587
3384a75K014k199j315K646M51k824M10K678j224k226J948J535k433p93K731j25
3400A099k685R57K372j671j844K201J131k528k28K582o24k395J392J969k048j302
3416a622K435N65k567K93K423j094k131J801J575k227r18K503J36k526O54K289
3432A589j402j810K008J184k449m46K563k92k460J077K106j742j566K199Q79k504
3448a066p1K510o84k248J423J733j995j121K436L62k545L88K365j086j986J728
3464A43J343k132o42K379j45k394Q80K105j483j538J932Q99k229j72K276n77k168
3481a523J275J786j748j196K086N10k274K97K178r47j974J561J464j973q43K264
$$ y = [1743, -953, -1462, 1374, 1020, -1633, -464, 1799, -116, -1725, 727, 1565, -1211, -1217, 1544, 771, -1762, -175, 1839, -360, -1675, 971, 1422, -1402, -992, 1686, 462, -1764, 184, 1719, -714, -1507, 1224, 1099, -1586, -629, 1743, 72, -1772, 429, 1560, -968, -1196, 1386, 762, -1633, -241, 1728, -320, -1622, 813, 1378, -1189, -896, 1527, 433, -1698, 103, 1678, -549, -1467, 1036, 1172, -1354, -700, 1589, 187, -1623, 385, 1569, -880, -1326, 1237, 945, -1515, -438, 1668, -74, -1640, 559, 1438, -1066, -1137, 1373, 689, -1559, -136, 1597, -398, -1519, 917, 1279, -1266, -878, 1487, 401, -1585, 143, 1486, -646, -1288, 1091, 946, -1448, -568, 1537, 54, -1484, 448, 1347, -882, -1054, 1222, 645, -1523, -248, 1538, -210, -1406, 680, 1190, -1084, -787, 1391, 444, -1530, 31, 1495, -478, -1321, 943]
3497I43P9k243N99K125j307j778J786J193k112m59K244k65k183J007J901j656
3513a26j398K031Q00k202r3K220o98j961J345J597j878r99K120L15k145L64K005
3530A297j054j615J644J099k005n97K138n0k070P59J814j328j379J782Q06k075
3546h34j85K108m34j946J070J560j574j082K000N28k173Q9K089o96j869J301J379
3563A331j761p44K065J41k185M70J991j065j624J590J056j942l98K088k13k060
3579a260Q10J789j338j295J746O35j953J1K042o25j849J171J453j648r14J895
3595F70L23j981L55J902r13j664J389J165j737n52J905r1j910O98J776j258j429
3612a352J658R64j951l22J958l35j853R76J657j506j176J819N98k015L8J959o67
$$ y = [943, 1022, -1221, -622, 1503, 196, -1582, 204, 1397, -715, -1174, 1070, 805, -1378, -371, 1530, -126, -1524, 507, 1307, -895, -988, 1232, 534, -1427, -82, 1515, -363, -1362, 758, 1073, -1072, -708, 1297, 243, -1372, 272, 1371, -634, -1231, 907, 857, -1213, -454, 1360, 32, -1347, 435, 1241, -834, -1019, 1089, 655, -1291, -221, 1339, -235, -1317, 683, 1211, -962, -873, 1216, 520, -1349, -48, 1331, -430, -1174, 891, 1032, -1153, -683, 1308, 243, -1381, 209, 1265, -677, -1075, 1013, 800, -1260, -450, 1339, 1, -1294, 452, 1087, -866, -855, 1187, 562, -1287, -116, 1337, -311, -1225, 670, 993, -988, -633, 1269, 356, -1308, 81, 1246, -491, -1043, 862, 771, -1139, -441, 1335, 77, -1352, 306, 1270, -681, -1003, 955, 620, -1233, -257, 1400, -106, -1282, 537, 1135, -880, -842, 1117, 450]
3629D50j742J277J405j720q62J955J94j958L79J851j005j515J507J021j834m38
3645a035J951j92j880Q12J545j306j176J721O89j867q6J840n03j730J086J326
3661A195j510q02J840K96j950K65J809q14j559J324J135j712o51J946P9j925N55
3678d79J735j110j352J530Q12j913k26K030l16j889R04J561j381j137J738N57
3694A064j927P3J925o55j689J169J238j539p19J834P8j915M80J757r86j418J437
3711B07R59j695l83J801k97j764Q34J564j297j113J642O22j829m0J818n70j642
3728a183J066J376j503r39J782L61j828K67J748q45j566J346J112j696n94J929
3744H33L1j906N93J631j149j307J573P88j779k45J900l64j703R10J382j392r45
$$ y = [450, -1292, -15, 1390, -330, -1192, 763, 957, -1001, -622, 1229, 224, -1291, 216, 1237, -597, -1035, 916, 724, -1156, -344, 1201, -105, -1281, 440, 1129, -738, -824, 1016, 513, -1217, -131, 1195, -315, -1117, 723, 1019, -931, -666, 1143, 329, -1230, 94, 1229, -483, -1134, 812, 891, -1034, -479, 1256, 146, -1206, 324, 1136, -777, -1003, 1027, 711, -1178, -274, 1287, -94, -1231, 507, 1064, -863, -790, 1135, 480, -1209, -40, 1198, -341, -1060, 774, 852, -1063, -583, 1174, 188, -1230, 207, 1166, -529, -912, 889, 592, -1172, -338, 1226, -71, -1184, 458, 1080, -749, -789, 1029, 459, -1183, -117, 1259, -244, -1183, 599, 960, -868, -601, 1147, 302, -1264, 82, 1194, -502, -1096, 833, 864, -1042, -449, 1182, 33, -1274, 299, 1087, -692, -937, 963, 599, -1104, -194, 1188, -204, -1149]
3761a149J724M16j889J35J869p03j559J212J142j551o68J730L9j753N19J666j001
3778A79j325J398Q75j713l85J824j99j786P77J581j287j152J665O19j809m8J786
3795A000n59j659J084J354j485q84J803L74j942K51J752q39j486J340J120j684
3811d60n76J829j3j816O16J587j175j203J560P59j800k00J835l21j657Q76J340
3828A181j398q86J657L97j828K10J777p11j504J139J094j588n70J803R1j831M29
3845e38J696r80j362J416Q54j736k82J818k54j812Q38J571j286j082J610N58j843
3862h14jJ845n62j664J088J358j486p99J692K01j812L90J742r50j460J368J022
3879A158j651m21J746j76j686P15J495j238j149J570O37j642j10J706m97j603
$$ y = [-1149, 575, 991, -898, -763, 1106, 403, -1156, 56, 1198, -353, -1021, 709, 748, -1005, -486, 1180, 179, -1146, 252, 1127, -586, -971, 853, 654, -1132, -355, 1226, -61, -1213, 452, 1071, -738, -786, 1000, 441, -1218, -134, 1220, -265, -1149, 654, 1028, -914, -663, 1089, 250, -1236, 104, 1224, -460, -1036, 793, 780, -1036, -420, 1167, -8, -1211, 349, 1108, -692, -892, 943, 622, -1035, -159, 1181, -217, -1103, 554, 951, -877, -667, 1110, 399, -1105, 34, 1128, -460, -1030, 773, 864, -967, -538, 1158, 178, -1184, 232, 1086, -650, -932, 886, 632, -1180, -342, 1229, -57, -1139, 471, 1029, -814, -815, 1030, 468, -1196, -108, 1250, -236, -1035, 657, 858, -954, -564, 1178, 228, -1232, 136, 1158, -493, -914, 832, 656, -1030, -315, 1180, -58, -1207, 363, 1000, -642, -752, 954, 457, -1146]
3895a146J024J269j409q54J648M22j735J92J646q02j422J227J113j601o32J791
3911G31K8j759N71J598j090j282J503Q17j780k96J836k62j661Q45J375j367r24
3928a117J651M48j843J26J761n99j499J056J159j499o40J738J05j790M04J596
3944A057q93j242J339P88j611k49J697k67j730P59J438j140r91J489N27j721J7
3961g33J715n56j569J023J222j352p93J683J99j744L81J673q81j456J221J073
3977A106j551n32J769o9j711O36J533j169j192J500P10j672j67J758l95j625R17
3994a54J300j307r25J590L89j695J72J645p19j413J219J029j506o18J679L6j699
4011i77N24J512r31j211J367P94j648l23J719k57j630Q21J383j240j033J595N55
$$ y = [-1146, -122, 1147, -262, -1116, 532, 954, -781, -589, 1057, 255, -1167, 60, 1173, -428, -1060, 731, 759, -1000, -429, 1169, 79, -1203, 300, 1117, -663, -959, 877, 615, -1046, -201, 1174, -193, -1117, 534, 982, -861, -735, 1026, 427, -1072, -16, 1143, -356, -996, 742, 847, -943, -539, 1057, 164, -1078, 261, 1049, -562, -811, 886, 619, -1111, -352, 1086, -54, -1045, 444, 971, -750, -733, 982, 426, -1143, -120, 1102, -250, -1043, 640, 839, -905, -524, 1149, 268, -1188, 33, 1106, -445, -977, 792, 723, -988, -352, 1181, 12, -1180, 320, 1030, -642, -809, 949, 554, -1071, -154, 1146, -161, -1086, 504, 893, -802, -630, 1015, 296, -1117, 102, 1131, -375, -993, 686, 722, -977, -453, 1059, 128, -1083, 284, 1078, -570, -893, 826, 569, -1061, -240, 1143, -97, -1130, 465, 1020]
4028A020j769j7J758n23j606J039J219j440p51J739K06j761L35J613q54j405J323
4045A26R94j584m89J796j04j736O21J478j107j096J458O65j718j06J769m42j576
4062a051R16J226j312q54J623L17j693J89J655o61j426J122J034j504n16J643
4078G08M8j691N17J564j018j238J376Q39j690k78J759l05j666P73J452j222j025
4095a097J586M93j751N1J717o02j556J086J269j460p79J687K06j746L71J588q61
4112B02j309J295R10j604l82J698j55j628O54J427j155j064J447O26j631r4J711
4129I48m60j541Q90J209j316p67J623K72j691K32J681q10j387J186J046j516n65
4146i66J705K1j733N57J573j060j222J427P60j670k50J756l36j657Q91J392j268
$$ y = [1020, -749, -766, 992, 469, -1137, -98, 1121, -319, -1070, 669, 875, -886, -551, 1062, 208, -1197, 126, 1120, -464, -953, 843, 739, -997, -376, 1102, -5, -1101, 357, 1022, -696, -802, 967, 525, -1051, -135, 1091, -221, -1075, 548, 865, -828, -639, 1016, 355, -1071, 51, 1085, -419, -935, 708, 756, -935, -418, 1146, 128, -1110, 266, 1105, -585, -863, 896, 591, -1075, -302, 1150, -72, -1097, 489, 982, -769, -718, 999, 397, -1159, -73, 1196, -264, -1043, 644, 850, -896, -525, 1063, 202, -1107, 188, 1098, -506, -888, 810, 655, -973, -319, 1108, -47, -1111, 336, 962, -669, -763, 948, 488, -1053, -163, 1046, -270, -1037, 586, 858, -833, -601, 1080, 270, -1117, 69, 1115, -401, -966, 739, 760, -973, -416, 1157, 97, -1125, 302, 1062, -608, -858, 898, 562, -1095, -204, 1188, -80]
$$ [...]
8191B52
##END NTUPLES=NMR FID
##END=
