##TITLE=1H_LY-16Dix.3.B
 CD3CN, 8 sc, 
 2.06.2021
##JCAMPDX= 6.0         $$ Bruker NMR JCAMP-DX V2.0
##DATA TYPE= NMR FID
##DATA CLASS= NTUPLES
##ORIGIN= UXNMR, Bruker Analytische Messtechnik GmbH
##OWNER= root
$$ XWIN-NMR		Version 3.5
$$ Wed Jun  2 13:43:54 2021 Russian Standard Time (UT+4h)  she@DPX200
##.OBSERVE FREQUENCY= 200.131506
##.OBSERVE NUCLEUS= ^1H
##.DELAY= (6, 6)
##.ACQUISITION MODE= SIMULTANEOUS
##.ACQUISITION SCHEME= undefined
##.AVERAGES= 8
##.DIGITISER RES= 18
##SPECTROMETER/DATA SYSTEM= spect
##.PULSE SEQUENCE= zg30
##.SOLVENT NAME= CD3CN
##.SHIFT REFERENCE= (INTERNAL, CD3CN, 0, 15.7039)
##AUDIT TRAIL= $$ (NUMBER, WHEN, WHO, WHERE, WHAT)
$$ ##TITLE= Audit trail, XWIN-NMR		Version 3.5
$$ ##JCAMPDX= 5.01
$$ ##ORIGIN= Bruker BioSpin GmbH
$$ ##OWNER= she
$$ F:/spectra/data/she/nmr/H-F/1/audita.txt
$$ ##AUDIT TRAIL=  $$ (NUMBER, WHEN, WHO, WHERE, WHAT)
(   1,<2021-06-02 13:43:00.76 +0400>,<she>,<DPX200>,
      <created by zg, POWCHK disabled, PULCHK disabled
       configuration hash MD5:
       00 E9 B6 7A A2 85 ED C7 34 08 36 98 17 FE 4E 26
       data hash MD5: 16K
       5A BB 5D 47 FA 64 62 F8 B5 86 A2 D0 C8 C0 A6 FF>)
$$ ##END=
$$ 
$$ hash MD5
$$ 1A 32 7B 2A 4E 44 0E B4 3B 1C 71 0D 16 B3 B7 EB
##$RELAX= 
##$RELAX= 
##$RELAX= 
##$RELAX= 
##$RELAX= 
##$RELAX= 
$$ Bruker specific parameters
$$ --------------------------
##$DU= <F:/spectra>
##$EXPNO= 1
##$NAME= <H-F>
##$PROCNO= 1
##$TYPE= <nmr>
##$USER= <she>
##$AMP= (0..31)
100 100 100 100 100 100 100 100 100 100 100 100 100 100 100 100 100 100 
100 100 100 100 100 100 100 100 100 100 100 100 100 100 
##$AQSEQ= 0
##$AQ_mod= 1
##$AUNM= <au_zg>
##$AUTOPOS= <>
##$BF1= 200.13
##$BF2= 200.13
##$BF3= 200.13
##$BF4= 200.13
##$BF5= 200.13
##$BF6= 200.13
##$BF7= 200.13
##$BF8= 200.13
##$BYTORDA= 1
##$CFDGTYP= 0
##$CFRGTYP= 5
##$CHEMSTR= <none>
##$CNST= (0..31)
1 1 145 1 1 1 1 1 1 1 1 1 1 1 1 1 1 1 1 1 1 1 1 1 1 1 1 1 1 1 1 1 
##$CPDPRG= <>
##$CPDPRG1= <>
##$CPDPRG2= <>
##$CPDPRG3= <>
##$CPDPRG4= <mlev>
##$CPDPRG5= <mlev>
##$CPDPRG6= <mlev>
##$CPDPRG7= <mlev>
##$CPDPRG8= <mlev>
##$CPDPRGB= <>
##$CPDPRGT= <>
##$D= (0..31)
0 1.2 0 0 0 0 0 0 0 0.06 0 0.03 0 0 0 0 0.0002 0 0 0 0 0 0 0 0 0 0 0 0 
0 0 0 
##$DATE= 1622626980
##$DBL= (0..7)
120 120 120 120 120 120 120 120 
##$DBP= (0..7)
150 150 150 150 150 150 150 150 
##$DBP07= 0
##$DBPNAM0= <>
##$DBPNAM1= <>
##$DBPNAM2= <>
##$DBPNAM3= <>
##$DBPNAM4= <>
##$DBPNAM5= <>
##$DBPNAM6= <>
##$DBPNAM7= <>
##$DBPOAL= (0..7)
0.5 0.5 0.5 0.5 0.5 0.5 0.5 0.5 
##$DBPOFFS= (0..7)
0 0 0 0 0 0 0 0 
##$DE= 6
##$DECBNUC= <off>
##$DECIM= 32
##$DECNUC= <off>
##$DECSTAT= 4
##$DIGMOD= 1
##$DIGTYP= 9
##$DL= (0..7)
0 120 120 120 120 120 120 120 
##$DP= (0..7)
150 150 150 150 150 150 150 150 
##$DP07= 0
##$DPNAME0= <>
##$DPNAME1= <>
##$DPNAME2= <>
##$DPNAME3= <>
##$DPNAME4= <>
##$DPNAME5= <>
##$DPNAME6= <>
##$DPNAME7= <>
##$DPOAL= (0..7)
0.5 0.5 0.5 0.5 0.5 0.5 0.5 0.5 
##$DPOFFS= (0..7)
0 0 0 0 0 0 0 0 
##$DQDMODE= 0
##$DR= 18
##$DS= 0
##$DSLIST= <SSSSSSSSSSSSSSS>
$$ [...]
##$SUBNAM2= <"">
##$SUBNAM3= <"">
##$SUBNAM4= <"">
##$SUBNAM5= <"">
##$SUBNAM6= <"">
##$SUBNAM7= <"">
##$SUBNAM8= <"">
##$SUBNAM9= <"">
##$SW= 16.9725357007746
##$SWIBOX= (0..15)
0 0 2 0 0 0 0 0 0 0 0 0 0 0 0 0 
##$SW_h= 3396.73913043478
##$TD= 16384
##$TD0= 1
##$TE= 0
##$TE2= 300
##$TE3= 300
##$TEG= 300
##$TL= (0..7)
0 120 120 120 120 120 120 120 
##$TP= (0..7)
150 150 150 150 150 150 150 150 
##$TP07= 0
##$TPNAME0= <>
##$TPNAME1= <>
##$TPNAME2= <>
##$TPNAME3= <>
##$TPNAME4= <>
##$TPNAME5= <>
##$TPNAME6= <>
##$TPNAME7= <>
##$TPOAL= (0..7)
0.5 0.5 0.5 0.5 0.5 0.5 0.5 0.5 
##$TPOFFS= (0..7)
0 0 0 0 0 0 0 0 
##$TUNHIN= 0
##$TUNHOUT= 0
##$TUNXOUT= 0
##$USERA1= <user>
##$USERA2= <user>
##$USERA3= <user>
##$USERA4= <user>
##$USERA5= <user>
##$V9= 5
##$VALIST= <valist>
##$VCLIST= <CCCCCCCCCCCCCCC>
##$VD= 0
##$VDLIST= <DDDDDDDDDDDDDDD>
##$VPLIST= <PPPPPPPPPPPPPPP>
##$VTLIST= <TTTTTTTTTTTTTTT>
##$WBST= 1024
##$WBSW= 4
##$XGAIN= (0..3)
0 0 0 0 
##$XL= 0
##$YL= 0
##$YMAX_a= 57866
##$YMIN_a= -51046
##$ZGOPTNS= <>
##$ZL1= 120
##$ZL2= 120
##$ZL3= 120
##$ZL4= 120
##$ABSF1= 10
##$ABSF2= 0
##$ABSG= 5
##$ABSL= 3
##$ALPHA= 0
##$AQORDER= 0
##$ASSFAC= 0
##$ASSFACI= 0
##$ASSFACX= 0
##$ASSWID= 0
##$AUNMP= <proc_1d>
##$AZFE= 0.1
##$AZFW= 0.1
##$BCFW= 1
##$BC_mod= 2
##$BYTORDP= 1
##$COROFFS= 0
##$CY= 11.3945322036743
##$DATMOD= 1
##$DC= 2
##$DFILT= <>
##$DTYPP= 0
##$F1P= 15.9154993809931
##$F2P= -4.1035820241983
##$FCOR= 0.5
##$FTSIZE= 0
##$FT_mod= 4
##$GAMMA= 1
##$GB= 0.15
##$INTBC= 1
##$INTSCL= 1
##$ISEN= 128
##$LB= 0.24
##$LEV0= 0
##$LPBIN= 0
##$MAXI= 10000
##$MC2= 0
##$MEAN= 0
##$ME_mod= 0
##$MI= 1.114404
##$NCOEF= 0
##$NC_proc= 0
##$NLEV= 6
##$NOISF1= 3.799351
##$NOISF2= 2.8
##$NSP= 1
##$NTH_PI= 0
##$NZP= 0
##$OFFSET= 15.70392
##$PC= 1
##$PHC0= -11563.87
##$PHC1= 13.80099
##$PH_mod= 1
##$PKNL= yes
##$PPARMOD= 0
##$PSCAL= 0
##$PSIGN= 0
##$REVERSE= no
##$SF= 200.130013532006
##$SI= 16384
##$SIGF1= 3
##$SIGF2= 2
##$SINO= 400
##$SIOLD= 16384
##$SREGLST= <1H.CDCl3>
##$SSB= 0
##$STSI= 0
##$STSR= 0
##$SW_p= 3612.71676300578
##$SYMM= 0
##$S_DEV= 0
##$TDeff= 0
##$TDoff= 0
##$TI= <>
##$TILT= no
##$TM1= 0
##$TM2= 0
##$TOPLEV= 0
##$USERP1= <user>
##$USERP2= <user>
##$USERP3= <user>
##$USERP4= <user>
##$USERP5= <user>
##$WDW= 1
##$XDIM= 8192
##$YMAX_p= 0
##$YMIN_p= 0
$$ End of Bruker specific parameters
$$ ---------------------------------
##NTUPLES= NMR FID
##VAR_NAME=  TIME,          FID/REAL,        FID/IMAG
##SYMBOL=    X,             R,               I
##VAR_TYPE=  INDEPENDENT,   DEPENDENT,       DEPENDENT
##VAR_FORM=  AFFN,          ASDF,            ASDF
##VAR_DIM=   8192,          8192,            8192
##UNITS=     SECONDS,       ARBITRARY UNITS, ARBITRARY UNITS
##FACTOR=    0.0002944,     1,               1
##FIRST=     0,             0,               0
##LAST=      2.4114304,     0,               0
##MIN=       0,             -51046,          0
##MAX=       2.4114304,     57866,           0
$$ Real data points
##PAGE= N=1
##DATA TABLE= (X++(R..R)), XYDATA
0@%%%%%%%%%%%%%%%%%Qj6J6j6J6j6K4l2L2m0M8n1N9p2Q1r0J05j20J36j53J70j87
39i8K07k32K60k89L20l55L92m33M78n26N80o39P04p74Q53r40J039j152J277j423
59g51J593j792K032k328K701l189L858m835O419r529K5327n9865J6985Q0870r0024
74c2528J5225O1100o9847P665O8901p8504P26P7858o7909j9194Q6018n9895l2416
87d2800Q8066m1763m8447Q1447k9051n0917P4945k0570n6942P7430q861p0008
99d7471O6874Q415p2139N7547J8161p3779N0370K9912p7623L8478M1285p3707
111c3677K7026M6777p2280J8791N7689o8281L454O2965n9806q270O4550n2084
123a3146j5956O9280m4783k9258O8526l3543l6711O6474k4580m4081O4777j3573
$$ plain form
0 0 0 0 0 0 0 0 0 0 0 0 0 0 0 0 0 0 0 8 -8 8 -8 8 -8 16 -16 16 -24 24 -27 32 -40 41 -49 56 -64 72 -81 89 -98
39 -98 109 -123 137 -152 168 -187 205 -228 250 -276 304 -335 369 -405 448 -492 547 -605 672 -751
59 -751 842 -950 1082 -1246 1455 -1734 2124 -2711 3708 -5821 19506 -40359 -23374 57496 -32528
74 -32528 -17303 43797 -26050 -18385 50516 -27988 -27262 50596 -17313 -36507 49511 -10384 -42800
87 -42800 45266 3503 -44944 36503 7452 -43465 31480 10910 -46032 31398 22537 -47471
99 -47471 19403 27818 -44321 13226 31387 -42392 7978 37890 -39733 -1255 40030 -33677
111 -33677 -6651 40126 -32154 -13363 44326 -23955 -20501 42464 -17342 -25612 38938 -13146
123 -13146 -29102 40178 -4605 -33863 34663 1120 -35591 30883 6303 -37778 26999 13426
135A3426n1868N9059j619n5461N1638O310n8722M6927J7709o0825L7740K5795
147C0109o0995K9184L3108n9939K1727M2088n7906R854M7180n2546J414N1096
159C4374m8425p558N5191m2081j6815N6961l4173k4871N5969k7611l2344N6269
171B4886j7390l8615N2546r558m4005M8689j086m7883M4694Q420n0909L7098J6058
184B2945n0811L0911K2597n1526K3446K9617m9692J5993L5411m7213Q115L9443
196B9236m5286l8M5079l9319q407M6709l3750j5849M7038k7770k1634M7746k1483
209B272k8052M6957j4697l3727M5695o961l9582M1565J243m2327L7269R004m3975
222b5316L1333J4559m5379K5747K1315m4544K0141K6925m4419J2649L2353m1647
$$ plain form
135 13426 -38442 20617 18998 -36463 15175 21485 -37237 9690 27399 -33426 4314 30109
147 30109 -30886 -1702 31406 -28533 -6806 35282 -22624 -12770 34410 -18136 -16722 34374
159 34374 -14051 -21609 33582 -8499 -25314 31647 -2526 -27397 28572 961 -31383 24886
171 24886 7496 -31119 21427 11869 -32136 16553 15467 -32416 12278 20698 -30211 6887 22945
184 22945 -27866 3045 25642 -25884 -2438 27179 -22513 -6520 28891 -18322 -10207 29236
196 29236 -16050 -16088 28991 -10328 -18735 27974 -5776 -21625 25413 -2357 -23991 23755 2272
209 2272 -25780 21177 6480 -27247 18448 11487 -28095 13470 14713 -27614 9655 18659 -25316
222 -25316 6017 20576 -24803 944 22259 -22285 -2144 24781 -19638 -6989 25364 -16283
234a6283N456L6396l8110j832L9260l3382q285M1007k8456j4826M1035k3684j9920
247b1624M2555j7398k6237M0905j0927l1126L8130m412l3945L6098J796l7956
259b4141L1890Q943l9359K6921J4302m0391K2252K0326m0546J6429K6077l8837
271a6134R454K8837l6876M590L3580l4035k649L6160k9600r193L6886k4942j3985
284a7907L8135k0158k0227L7526j3427k3950L5263r065k7726L4276k998l1713
296b1971L1354M093l3655K6418Q375l5053K3550J4563l6276J8027J9813l5354
308a6116J2514K3234l4329Q063K7625l2992J445L0917k8817l540L2184k6449q966
321a5227L4482k1988j4801L4945j5970j8975L3070j2220k2786L2970o102k6824
$$ plain form
234 -16283 -10827 25569 -12541 -14373 24887 -8495 -16780 24227 -4229 -19055 21980 -1704 -21624
247 -21624 20931 3533 -22704 18201 7274 -23852 14278 9866 -24079 12019 13815 -24141
259 -24141 7749 16692 -22667 4254 18556 -21835 417 20743 -19803 -3374 22703 -16134
271 -16134 -6680 22157 -14719 -10129 23451 -10584 -13233 22927 -6673 -15866 21020 -3922 -17907
284 -17907 20228 70 -20157 17369 3942 -20008 15255 6190 -21536 12740 9742 -21971
296 -21971 9383 13476 -20179 6239 14614 -20439 3111 17674 -18602 -575 19238 -16116
308 -16116 -3602 19632 -14697 -6634 20991 -12001 -10556 20361 -8456 -11996 20188 -6261 -15227
321 -15227 19255 -2733 -17534 17411 1441 -17534 15536 3316 -19470 13500 7398 -19426
333a9426K9616m60k8195K6673L367l0519K4503R276l2998J9059J5081l1304J4517
346h10J7873l1576J0209K2359l0313M704K5459k7149O35K6832k6410l958L0794
359A8649k2700j0559L1060j7474j4011L0527j4399j7910L1073r498k2706K8560
371A0612l867k3609K6763j008k7058K5225M979k9637K0459J0581k8443J6399J2922
384A4318k9245J3392J8014k8975P544K1003k6185L918K2717k5303M1K6128k3049
397e682o196K7082j8260r047K7189j6268j3184K8544j2135j8067K7368o872j9877
410a5405K5656m100k2785K5072J043k5735K1284N716k5787J8433Q825k6957J5905
423A165J3513k7945J0597J7245k5655P068J9245k4922L291K2144k3154j663K3835
$$ plain form
333 -19426 10190 9730 -18465 8208 11575 -18944 5559 14835 -18163 896 15977 -15327 -810
346 -810 17063 -14513 -4304 18055 -12258 -7554 17905 -9244 -8609 18223 -8187 -12145 18649
359 18649 -4051 -14610 16450 -1024 -15035 15492 1093 -16817 14256 4758 -17948 10612
371 10612 6745 -16864 9899 8891 -18167 7058 12037 -17600 2859 13440 -15003 1396 14318
384 14318 -14927 -1535 16479 -12496 -4952 16051 -10134 -6216 16501 -8802 -8761 17367 -5682
397 -5682 -11878 15204 -3056 -12103 15086 -1182 -14366 14178 2043 -16024 11344 4472 -15405
410 -15405 10251 6151 -16634 8438 9481 -16254 5030 10746 -15041 3392 12217 -14740 1165
423 1165 14678 -13267 -2670 14575 -11080 -4012 15233 -9689 -6398 15746 -7408 -9071 14764
436A4764j9706n212K4427j7420q898K5899j3879j3316K5232r946j5853K4655o622
449D125j8697K3926k471k1626K1285J723k2497J9257N036k4102J6845R084k5055
462a3167J3273J2625k4681J0061J5498k4476O552J8873k3067J964K0648k0767
474f664j636K2080j8333n148K3184j5636q909K3350j2650j1840K3722r377j5382
487a3239K2982n159j7931K1006j457j9401J9109J774k0858J7212N473k1910J4521
500B122Q515k2584J1886J1941k2671Q603J5054k1945M759J7275k0450J393J9123
513A3021j8737k026K0520j6708n294K1598j4347q728K2095j1307j1850K1875p820
526B292j4411K0845m577j6677J9438j024j8211J7682K204j9590J5553N532k0433
$$ plain form
436 14764 -4942 -10154 14273 -3147 -12045 13854 -25 -13341 11891 1945 -13908 10747 4125
449 4125 -14572 9354 6883 -14743 6542 8265 -14232 5025 10061 -14041 2804 11888 -13167
462 -13167 106 12731 -11950 -1889 13609 -10867 -4315 14558 -8509 -6545 14103 -6664
474 -6664 -8300 13780 -4553 -9701 13483 -2153 -11062 12288 -362 -12202 11520 2143 -13239
487 -13239 9743 4584 -13347 7659 6202 -13199 5910 7684 -13174 4038 9511 -12399 2122
500 2122 10637 -11947 -61 11880 -10791 -2188 12866 -9079 -4320 12955 -7495 -6102 13021
513 13021 -5716 -7742 12778 -3930 -9224 12374 -1973 -10701 11394 87 -11763 10112 2292
526 2292 -12119 8726 4149 -12528 6910 5886 -12325 5357 7561 -12029 3524 9056 -11377
539a1377J2856Q616k0423J0072J1101k0311P344J3873j9797L757J6017j8226P16
552e782J7495j6850k231J9179j5006n864J9820j2084q333J9742j0008j0817K0253
565I514p121j4011J9313l393j5623J7634q17j7082J6604K469j8802J4017N821
578H523j8753J1462P936j9001R456J0899j9139N901J3303j7521L136J4420j6763
591f141P50J6646j5511l047J7721j2703n528J7582j1058p760J8603q701j1031
604a0178J8066n363j2535J6946l549j4205J6963n70j6712J5013L094j7110J2615
617B475N184j7567J0990Q041j8091P985J0448j7080N709J1803j7013L543J4375
630A0802j6175k73J5783j3585k826J5868j2096n047J6935r967q057J6672p215
$$ plain form
539 -11377 1479 10095 -10328 -256 10845 -9466 -2122 11751 -8046 -4289 11728 -6498 -5782
552 -5782 11713 -5137 -7368 11811 -3195 -9059 10761 -1323 -9656 10086 78 -10739 9514
565 9514 2393 -11618 7695 4302 -11321 6313 5496 -11586 5018 7487 -11315 2702 8523
578 8523 -10230 1232 9168 -9833 -377 10522 -8617 -2716 10587 -6934 -3798 10622 -6141
591 -6141 -5391 11255 -4256 -7303 10418 -2285 -7813 9769 -1289 -9049 9554 853 -10178
604 -10178 7888 2525 -10010 6936 3387 -10818 6145 5575 -11137 3876 6970 -10140 2475
617 2475 7659 -9908 1082 9123 -8968 -983 9465 -7615 -1906 9897 -7116 -3573 10802
630 10802 -5373 -5646 10137 -3448 -6274 9594 -2502 -7549 9386 -581 -8638 8034 819
643H19r612J6222n610j1629J6480k707j4103J4801N18j4670J3169K451j5712J1901
657B318N329j6567R355P685j6137P587R316j6635N505J2103j5961K104J3345j4132
671d785R9J4125j3367k318J5780j1378n578J5681q813p082J5613p340r391J5898
685G144m482j1634J4358j822j2193J3398k04j3890J2672L055j5075J0073N353
698F753j4746Q524O964j5339O836R632j5077L810J0913j3775K288J2111j3683
711d789j68J4180j2012l358J4380r811m843J4555q809p098J5393o201r564J4213
725F068l751j0424J3480k103j2042J3028Q57j3500J0768L166j3370R458M730j4171
739g806Q011P321j4299N337R052j3285L435J0106j3003J488J1912j1840j083J2496
$$ plain form
643 819 -8793 7429 1819 -9810 6670 3963 -10140 4661 5179 -9491 3678 6129 -9583 2318
657 2318 7647 -8920 435 8120 -8017 -430 8886 -7749 -2244 9859 -6102 -3998 9347 -4785
671 -4785 -4686 9439 -3928 -6246 9534 -1844 -7422 8259 -554 -7636 7977 637 -8754 7144
685 7144 2662 -8972 5386 3564 -8629 4769 4565 -9325 3347 6402 -8673 1400 6753
698 6753 -7993 531 7495 -7844 -1008 8624 -6453 -2643 8270 -5505 -3217 8894 -4789
711 -4789 -4957 9223 -2789 -6147 8233 -1578 -6421 8134 -675 -7773 7620 1419 -8145 6068
725 6068 2317 -8107 5373 3270 -8772 4256 5113 -8387 2381 5547 -7823 1635 6365 -7806
739 -7806 205 7526 -6773 -1436 7616 -5669 -2234 7872 -5131 -3643 8269 -3571 -4654 7842
753G842j0496k750J3175r547m840J4262p530p443J3713n176q611J3134l541j0031
767g839J2755j380j1450J1666Q04j2242J0453K639j3177R107N183j3423O901O913
781F910j3017M846Q246j2458L154R711j1847J058J0757j0934q28J1837r866l034
795e465J2521q172m985J2643o355o579J2314m883q045J2234k927r439J1691j090
809C463j0799J0713R21j1558R574K884j2142Q138M678j2368O530O382j2275M707
823a152P824j1891K981R366j1193P93J0271j0135j100J0909q843k638J1503p676
837i81m681J1684n964o189J1580m322p697J1270k423q949J0476n87r781R501Q24
852C761j0560Q916K914j1306P244M556j1371N782N949j1357M498P646j1251K314
$$ plain form
753 7842 -2654 -5404 7771 -1776 -6616 7646 116 -7327 6386 1210 -7401 5733 2192 -7839
767 -7839 4916 3536 -7914 3752 4556 -7686 2767 5406 -7771 1336 6519 -6904 -3 6910
781 6910 -6107 -1261 6985 -5473 -2319 7392 -4455 -3397 7360 -3574 -4402 7435 -2431 -5465
795 -5465 7056 -1116 -6101 6542 187 -6392 5922 1039 -7006 5228 2301 -7138 4553 3463
809 3463 -7336 3377 4298 -7260 2314 5198 -6944 1194 5872 -6496 34 6416 -5859 -1152
823 -1152 6672 -5219 -2238 7128 -4065 -3272 6999 -3136 -4236 6673 -2170 -4808 6695 -981
837 -981 -5662 6022 58 -6131 5449 1127 -6570 4700 2277 -6672 3804 3217 -6564 2937 3761
852 3761 -6799 2117 5031 -6275 969 5525 -5846 -64 5885 -5472 -974 6672 -4579 -2265
866b265Q781j0182P65R397r656q15J0568q544k904J0954o834m444J0649n740n688
881e958J1141l929p402J0418k100q321R625o79r161R188J274j0169P560L010r907
896e410O424L853j0512N612N796j0763L717P361r980J955P824r678P75R315q817
911b528j273R676p496k518R743o829l750J0641n528n865J0410l425o789R701k315
926A855p900R364m42q823Q273J301q961P150K057r690O598M191j0078M703N646
941E244r490L220O345r284K095P646q916K11Q446p723q96Q781p416k451R590o143
957g41m096R697m505n135R268l718o358R475j983p548Q659m38q067Q000P86q906
973e610P183K555r325N589L909q845M723M798r341L292O329q898J602P249p943
$$ plain form
866 -2265 6516 -3666 -2901 6496 -3160 -3975 6593 -1951 -4855 6099 -735 -5179 5470 -270 -5958
881 -5958 5183 1254 -6148 4270 2170 -6151 3474 2795 -6366 2822 4096 -6073 1487 4497 -5410
896 -5410 1014 4867 -5645 -33 5763 -5000 -1283 6078 -3902 -1947 5877 -3801 -3026 6289 -2528
911 -2528 -3801 5875 -1621 -4139 5604 -1225 -4975 5666 138 -5727 4683 1258 -5531 4170 1855
926 1855 -6045 3319 2877 -5946 2327 3628 -5333 1817 3874 -5816 782 4973 -5105 -402 5244
941 5244 -4246 -1026 5319 -3965 -1870 5776 -3140 -2929 5517 -2206 -3102 5679 -1737 -4188 5402 -741
957 -741 -4837 4860 355 -4780 4488 770 -5588 3887 1904 -5644 3015 2577 -5490 2510 3296 -5610
973 -5610 1573 4128 -5197 392 4301 -4544 179 4977 -4364 -1072 5257 -3641 -2039 5210 -2733
988b733M08P693p706j100Q640o434k682Q544n306l497Q824m531m930R024l054
1003A160o319Q376j584o650Q227n88p962P474J176q380O281K423q344N611L401
1018D302r050M462N169q732K657N805q095J894O660p996M36P754p174j491P918
1033D519n803k209Q246n174l769Q450l820m940Q054k582n473P915j748o704P746
1048B708L2p535O489J240p675N921K415q120N048L712q363L632M602p906L027
1063g73N540q119J617O734p524p9P294o445j195P513n800k308Q027m757l627P828
1079C926l723m567P872k519n488P656j219o584O795J51o850O225J317p338N416
1094A070K419p682M525L576p734L439M521p621K430N577p278J086O163o912p3
$$ plain form
988 -2733 -2325 5368 -2338 -3438 5202 -1232 -3914 4630 -676 -4173 4651 120 -4810 4214 1160
1003 1160 -5159 3217 1633 -5017 3210 2622 -5340 2134 3310 -5070 1211 3634 -4710 901 4302
1018 4302 -4748 -286 4883 -3849 -1192 4613 -3482 -1588 5072 -2924 -2488 5266 -1908 -3399 4519
1033 4519 -1284 -3493 4753 -421 -4190 4260 440 -4500 3554 972 -4501 3414 1666 -5038 2708
1048 2708 2740 -4795 1694 2934 -4741 1180 3595 -4525 523 4235 -4128 -496 4106 -3800 -773
1063 -773 4767 -3352 -1735 4999 -2525 -2604 4690 -1755 -2950 4563 -1237 -3545 4482 -275 -3902 3926
1079 3926 203 -4364 3508 989 -4499 3157 1938 -4646 2149 2300 -4550 1675 2992 -4346 1070
1094 1070 3489 -4193 332 3908 -3826 -387 4134 -3487 -1057 4520 -2758 -1672 4491 -2421 -2494
1109b494O871o117j077P358n581k440P606m537l516P682l361m452P403k362n260
1124d277P211j131o224O554J25o624N976J333p060N162K387p496M058L632p116
1139c490L105M359p108K061N223o855Q78O033o264k50O477n744j222P091n042
1154g48k578P069m048l315P195l161m243P178k176n421O682q00n714O247k2o403
1170d258N859J248o984M877K451o952L914L263o955L131M437o869J624N030o280
1185b464Q10N617n957j08O359n508j629O601m418k334O687l844l393O942k666
1200F95m427O463j621m841O147j060n508O321L05o438N185J399o443M590K212
1215B979o672L955L398o880K558M180o270J851M644o397R76N747n847n13O070
$$ plain form
1109 -2494 4377 -1740 -2817 4541 -1040 -3480 4126 -411 -3927 3755 394 -4058 3345 983 -4277
1124 -4277 2934 1803 -4421 2133 2258 -4366 1610 2943 -4117 1045 3432 -4064 -6 3626 -3490
1139 -3490 -385 3974 -3134 -1073 4150 -2705 -1827 4206 -2058 -2308 4169 -1575 -2797 4294 -748
1154 -748 -3326 3743 -305 -3620 3575 414 -3829 3349 1173 -4248 2434 1634 -4080 2167 2145 -4258
1170 -4258 1601 2849 -4135 742 3193 -3759 155 3418 -3537 -406 4031 -2838 -1214 3816 -2464
1185 -2464 -1654 3963 -1994 -2102 4257 -1251 -2880 3721 -697 -3031 3656 -188 -3581 3361 695
1200 695 -3732 2731 1110 -3731 2416 1356 -4152 2169 2474 -3964 1221 2620 -3823 767 2979
1215 2979 -3693 262 3660 -3220 -662 3518 -2752 -901 3743 -2654 -1678 4069 -1778 -2291 3779
1230C779m921j403O083m463k197O721l390l535O277k400m001O170j747m747O232
1245B458n56n688N346O04n667M828J103o219M457K449o489L340L351o290K492
1260d81L801o333J878M974n994M53N311n355k80N634m996j188O262m209k491O237
1276C223l148l134O127k592m069O177j306m792N573l31n130N051K99n677M770
1291A041J650n997L727K425n941L095L109o097K362M098n943J224M691n425M77
1306a504N089n286n67N704m450j482N822l834k236N950l351l200O204k138m049
1321c328N700j272m468N458m35n178M979P11n474M210J502n490L764K193n991
1336c119K899L342n753J903L972n431J097M402n279J80N069m629p18N198m166
$$ plain form
1230 3779 -1142 -2545 3538 -925 -3122 3599 209 -3326 2951 551 -3450 2720 973 -3774 2458
1245 2458 1902 -3786 1560 2164 -3503 1325 2428 -3791 666 3115 -3374 -34 3317 -2973 -481
1260 -481 3320 -3013 -1135 3839 -2155 -1702 3609 -1746 -2026 3608 -1388 -2576 3686 -523 -3014 3223
1276 3223 75 -3059 3068 476 -3593 2584 1278 -3514 2059 1728 -3402 1649 1948 -3729 1041
1291 1041 2691 -3306 421 2846 -3095 0 3109 -2988 -626 3472 -2471 -1247 3444 -1981 -1504
1306 -1504 3585 -1701 -2268 3436 -1014 -2496 3326 -508 -2744 3206 -145 -3345 2859 721 -3328
1321 -3328 2372 1100 -3368 2090 1655 -3523 1456 2167 -3307 903 2405 -3085 679 2872 -3119
1336 -3119 -220 3122 -2631 -728 3244 -2187 -1090 3312 -1967 -1787 3282 -1347 -2065 3133 -1033
1351a033j340N618l724k420N845k793l252N602j893l661N494j274m521N171k16
1366A603m874M691N95n156M223J352n623L548K436n587K572L068n363J942L708
1381C135n292J033M313m963N9M793m353o63N099l923j621N253l209k336N344k497
1397A72k993N283j841l670N153r78m270M809j74m653M445O92m965L892J382n265
1413b981L299K230n236K646K919n243J818L529n098J022M201m721P6M534m164
1428a169o67M789l735j484N050l091k338N137k220k916M903j660l534M817q12
1443A070m067M522L0m431M037P00m770L627J562m983K899K238m860K353K751m962
1459b284J713L444m865Q35M035m373J17M329m155p29M777l485j590M787k737k115
$$ plain form
1351 -1033 -2373 3245 -479 -2899 2946 153 -3099 2503 610 -3051 2443 1169 -3352 1819 1603
1366 1603 -3271 1420 2015 -3141 1082 2434 -3189 359 2795 -2792 -220 2848 -2515 -573 3135
1381 3135 -2157 -1124 3189 -1774 -1715 3078 -1275 -1938 3161 -762 -2383 2870 -339 -2675 2669 172
1397 172 -2821 2462 621 -3049 2104 1126 -3144 1665 1491 -3162 1283 1975 -2990 902 2284 -2981
1413 -2981 318 2548 -2688 -42 2877 -2366 -548 2981 -2117 -1095 3106 -1615 -1539 2995 -1169
1428 -1169 -1836 2953 -782 -2266 2784 -307 -2645 2492 272 -2644 2259 599 -2935 1882 1070
1443 1070 -2997 1525 1555 -2876 1161 1861 -2909 718 2280 -2703 196 2434 -2426 -73 2678 -2284
1459 -2284 -571 2873 -1992 -1157 2878 -1495 -1378 2951 -1204 -1933 2844 -641 -2231 2556 -181 -2296
1475b296M735k320k749M883j528l541M536o25l856M222N8m327L783R20m581L097
1491D11J598m436K704K039m760K146K937m693J259L408m319O83L768m189n9M323
1507B820l697r49M324l117j309M532k864k122M804k042k960M421j188l138M253
1522A768p68l776M115K09m182L421Q76m140L084J375m500K602K335m481J587K728
1538B253m077J253L087m189N61L804l825l97L910l246p10M092l117j490M491k333
1554F7k295M156j669k457M116j402l089M267m99l705L617K13l704L347O52m100
1570b485L026J509m253K175K052l998J772K442m150J155L217l840K33L397l363
1585a111j61L600l244p91M067k639j639L920k014j973L952j654k584M018r14l107
$$ plain form
1475 -2296 2439 119 -2630 2253 725 -2816 1720 1095 -2761 1461 1519 -2808 975 1895 -2686 411
1491 411 2009 -2427 277 2316 -2444 -298 2639 -2054 -795 2613 -1706 -1023 2745 -1444 -1503 2820
1507 2820 -877 -1826 2498 -619 -1928 2604 -260 -2382 2422 380 -2580 1841 653 -2485 1768
1522 1768 1000 -2776 1339 1548 -2634 787 1663 -2477 607 1982 -2518 84 2419 -2062 -475 2253
1538 2253 -1824 -571 2516 -1673 -1112 2692 -1133 -1530 2380 -866 -1576 2516 -601 -2091 2400 67
1554 67 -2228 1928 259 -2198 1918 516 -2573 1694 1195 -2510 1107 1320 -2384 963 1615 -2485
1570 -2485 541 2050 -2203 -28 2024 -1974 -202 2240 -1910 -755 2462 -1378 -1145 2252 -1111
1585 -1111 -1272 2328 -916 -1707 2360 -279 -1918 2002 -12 -1985 1967 313 -2271 1747 833 -2274
1601b274L588l24l206L406O0l644L209Q68l906K580J451l880K146J930l974J602
1617c68K551l775R21K797l536N04L188l437k04L640k920r74L672k387j432L754
1633A994j977k033L760j302k467L513q44k769L462l44l247L212M11l470K705R18
1649A522l547K362J431l688J889J952l614J386K315l561R46K787l464K50L160
1664B126l028l29L257k722p74L495k378j419L611j790j905L504j323k316L459
1679A468p59k778L188p7l013K792M11l176K537R01l396K133J485l449J635J919
1695A821l395J152K337l267O26K654l033J54K893k814l42L171k535q90L322k093
1711b39j377L335j665j813L315j200k202L202o89k587K993j09k881K685M31l052
$$ plain form
1601 -2274 1314 990 -2216 1190 1250 -2394 815 1683 -2223 357 1808 -2072 74 2004 -1970 -368
1617 -368 2183 -1592 -671 2126 -1410 -906 2282 -1155 -1359 2281 -639 -1613 2059 -328 -1760 1994
1633 1994 17 -2016 1744 442 -2025 1488 644 -2125 1337 993 -2254 958 1369 -2101 604 1522
1649 1522 -2025 337 1768 -1920 -31 1921 -1693 -307 2008 -1553 -607 2180 -1284 -1034 2126
1664 2126 -902 -1231 2026 -696 -1470 2025 -353 -1772 1839 49 -1856 1648 325 -1991 1468
1679 1468 709 -2069 1119 1042 -1971 821 1232 -1944 593 1494 -1902 231 1716 -1733 -98 1821
1695 1821 -1574 -422 1915 -1352 -726 1928 -1105 -951 1942 -872 -1214 1957 -578 -1468 1854 -239
1711 -239 -1616 1719 54 -1759 1556 356 -1846 1356 667 -1920 1073 964 -1917 768 1199 -1853
1727a853K357Q84l180J983J415l222J472J822l109J045K176l042N48K589k853
1742i68m4K804k460m59K899k263q79L105j906j376L106j464j741L087j071k178
1758a808L036m96k529K687k5k595K484L20k873K305Q88l064J804J338k964J436
1774e6J680l027R75K204k850L24K399k514QK537k432m05K898k087j031K872j610
1791a15j336K891j314j749K929q07k145K654l78k234K570r7k615K430N23k813
1807a606J944R00k743J718J187k910J378J758k836P83J947k630N37K227k616K0
1823i42K665k263o27K626j807q33K690j673j316K872j131j767K640p22j935K580
1839A057m28k328K498K36k554J988N26k479J880Q11k752J614J420k764J031J638
$$ plain form
1727 -1853 504 1388 -1792 191 1606 -1616 -144 1678 -1431 -386 1790 -1252 -704 1885 -968
1742 -968 -1012 1792 -668 -1127 1772 -491 -1370 1735 -171 -1547 1559 95 -1646 1441 370 -1808
1758 -1808 1228 732 -1797 890 865 -1730 754 1074 -1799 506 1394 -1670 134 1472 -1492 -56
1774 -56 1624 -1403 -428 1776 -1074 -750 1649 -865 -857 1680 -752 -1157 1741 -346 -1377 1495 -115
1791 -115 -1451 1440 126 -1623 1306 499 -1646 1008 630 -1604 966 869 -1746 684 1207 -1606
1807 -1606 338 1238 -1505 213 1400 -1510 -132 1626 -1210 -427 1520 -1110 -573 1654 -962 -942
1823 -942 1723 -540 -1167 1459 -348 -1181 1509 -164 -1480 1392 261 -1506 1134 412 -1523 1057
1839 1057 629 -1699 799 1035 -1519 469 995 -1484 396 1207 -1545 69 1489 -1275 -244 1394
1855A394k543Q48J856k674M26K344k363j63K357k063l77K479j974q60K791j437
1871D1j405K544j064j517K556q31j938K579k19k270K169J90k284K032M57k584
1887a544J760J093k570J243J313k451J049J496k588P48K017k418J81K125k163
1902g09j07K285k054n09K534j684r44K448j348j141K492j172j579K575o63j895
1918a471K359k43k063K136P8k293J959N84k377J589Q58k385J345J204k499R80
1934b39J629k375N10J860k174J91K022k100k01K250j811n63K350j560q95K381
1950A275j325j247K425r18j537K312o07j752K215k57j996K048J14k157J851N08
1966I52k291J614Q69k398J203J230k280R23J488k247N71J738k175J78J997j959
$$ plain form
1855 1394 -1149 -301 1555 -1119 -693 1651 -712 -875 1482 -581 -958 1521 -453 -1313 1478 41
1871 41 -1364 1180 116 -1401 1155 324 -1614 965 746 -1524 645 835 -1449 583 1040 -1544
1887 -1544 216 1309 -1261 -18 1295 -1156 -107 1389 -1199 -451 1566 -852 -671 1454 -709
1902 -709 -816 1469 -585 -1094 1440 -244 -1188 1260 -88 -1229 1263 91 -1488 1087 424 -1471
1918 -1471 888 645 -1418 718 796 -1497 462 1046 -1331 258 1116 -1269 76 1280 -1219 -239
1934 -239 1390 -985 -475 1385 -789 -598 1424 -676 -877 1373 -438 -1001 1349 -211 -1106 1275
1950 1275 -50 -1297 1128 210 -1327 985 378 -1374 841 584 -1412 636 750 -1407 444 952
1966 952 -1339 275 1144 -1254 -51 1179 -1101 -178 1310 -937 -366 1372 -803 -625 1372 -587
1982e87k01K126j732n67K264j456r41K239j138j236K267q19j496K217m87j791
1998a338K051j41j923J946J91k095J714N42k207J462Q58k224J168J153k236Q67
2014b12J495k167N05J669k066J50J912j846j96K061j648n95K149j394r24K240
2030A133j037j269K139p05j452K061m17j720J959o0j923J801L03k007J568N54
2046I28k172J333R76k144R93J211k072P32J389k093M87J689j950O5J850j749k16
2063g43K000j599n94K103j271r39K067r57j078K050q18j461K049l18j712J832
2079F11K4j788J647K62j973J487P07k069J097R55j952R51J163k075O48J506j960
2096g59K22J671j704K4J754j699l23J970j408o66J950j144q39K002r97j187K050
$$ plain form
1982 -587 -788 1338 -394 -961 1303 -153 -1094 1145 7 -1229 1038 219 -1277 940 453 -1338
1998 -1338 713 572 -1351 595 786 -1309 405 947 -1260 202 1060 -1164 4 1157 -1079 -212
2014 -212 1283 -884 -379 1290 -776 -626 1286 -560 -756 1305 -343 -938 1211 -183 -1107 1133
2030 1133 96 -1173 966 261 -1191 870 453 -1267 692 632 -1291 510 813 -1194 374 928
2046 928 -1244 89 1065 -1079 -86 1125 -947 -215 1174 -919 -432 1257 -693 -628 1222 -527 -743
2063 -743 1257 -342 -936 1167 -104 -1043 1024 67 -1011 1039 221 -1240 809 491 -1221 611
2079 611 635 -1153 494 756 -1217 270 977 -1092 5 960 -992 -41 1122 -953 -305 1201 -759
2096 -759 -537 1134 -570 -546 1208 -491 -814 1156 -252 -918 1032 -112 -951 1051 54 -1133 917
2113I17n78j483J807k63j504J773n3j785J621L77j941J288O64j839J144Q80k021
2130i96Q24J288j900M36J402j747K56J584j741q4J835j475n03J795j249n88J914
2147A051j099r65J942p49j230J770m76j285J812k91j643J700J60j742J384L57
2163F96j724J310N81j897J084R85j857O42J125j774N52J390j781J46J646j546
2179d22k44J619j320l32J758j265p37J902q72j029J738o59j164J794m34j446J718
2196F05j9j578J391J31j570J421L78j803J214P76j815Q20R32j699P11J116j780
2213g69M28J428j611P1J444j464j03J604j374m41J798j050q08J666q23r28J719
2230G87o07j209J710k78j414J517k5j476J416K06j673J266N90j670R69P33j676
$$ plain form
2113 917 339 -1144 663 400 -1104 669 616 -1169 452 829 -1112 176 840 -999 145 1025 -996
2130 -996 -172 1116 -784 -348 1054 -693 -437 1147 -594 -678 1157 -318 -821 974 -275 -863 1051
2147 1051 -48 -1013 929 180 -1050 720 244 -1041 771 480 -1163 537 697 -1045 339 696
2163 696 -1028 282 863 -1034 50 1035 -822 -180 945 -829 -277 1113 -668 -522 1124 -422
2179 -422 -666 953 -367 -699 1059 -206 -943 959 87 -942 796 137 -1027 767 333 -1113 605
2196 605 586 -992 399 530 -1040 381 759 -1044 170 946 -869 -49 883 -816 -105 1011 -769
2213 -769 -341 1087 -524 -453 991 -473 -576 1028 -346 -787 1011 -39 -847 819 -4 -932 787
2230 787 180 -1029 681 403 -1011 506 481 -995 421 627 -1046 220 810 -860 109 842 -834
2247h34P92R34j700O08J227j636K66J322j529O1J466j386k16J592j206m68J611
2264I04j007p01J642q15r64J686n24j147J587k87j338J444rj449J321L00j540
2281h97J108N07j609R22P94j637O94J009j598M60J190j499J88J306j420m5J444
2298I17j258k51J560j123n74J552q84p57J590o83r34J550m83j137J496k33j269
2315i21J377Lj409J263L22j501J031N44j541Q38P42j513O85R63j518L96J123j435
2333e51J55J320j342j07J444j154l95J468r60n60J472q45p47J551o00r80J459
2350F28l87j111J383j82j238J331J08j362J105L04j399J023M73j497Q49P69j500
2367g03N83R43j409L68J069j404J28J294j212j54J325j089l20J395r90n82J542
$$ plain form
2247 -834 -42 892 -808 -200 1027 -609 -343 979 -550 -489 977 -409 -625 967 -239 -707 904
2264 904 -103 -804 838 23 -941 745 221 -926 661 374 -964 480 471 -978 343 643 -897
2281 -897 211 718 -891 31 825 -812 -118 891 -707 -247 943 -556 -368 938 -482 -527 917
2298 917 -341 -592 968 -155 -729 823 -61 -818 772 89 -845 705 222 -915 581 348 -921
2315 -921 456 459 -950 313 635 -866 165 709 -832 6 748 -765 -80 883 -635 -239 884 -551
2333 -551 -396 924 -418 -525 919 -235 -630 838 -122 -682 790 -55 -802 749 149 -831 628
2350 628 241 -870 513 331 -907 424 532 -830 275 579 -820 203 676 -821 28 797 -703
2367 -703 -120 823 -586 -218 851 -553 -425 869 -343 -497 828 -261 -581 814 -176 -758 784
2384G84p09q50J409m87r07J367l65j128J345m0j265J176J74j293J076K87j449
2401h75R60O18j409O73P53j361N46Q70j407L53J124j287N0J184j149p1J264j095
2419b59l70J403q44o05J355o53o94J344n55r72J390k21j123J205qj182J128J39
2437D78j317J021M37j357P78N98j318O87P52j414M54R87j296K06J063j156P7J150
2455H30j177j79J288r41l95J281q05n28J343o81p88J329l75r44J188k10r82J204
2473D58n3j199J060K45j268R08M21j268P91O00j367N47Q39j242L30Q87j190K37
2491b64J060j199l9J218j004k69J184q81l63J305p74o42J278n15p50J187m05q16
2509f89J229k48j089J147Q1j149R41K18j138Q78L81j266P12O38j246M87P41j184
$$ plain form
2384 784 75 -775 634 147 -760 607 242 -886 459 419 -846 330 504 -789 287 574 -875
2401 -875 85 703 -706 -33 720 -641 -95 775 -632 -279 845 -442 -392 792 -357 -428 836 -259
2419 -259 -629 774 -70 -675 680 27 -667 677 122 -850 540 319 -804 401 393 -789 339 478
2437 478 -839 182 619 -738 40 638 -680 7 759 -655 -201 786 -510 -304 759 -397 -320 830
2455 830 -347 -526 762 -179 -574 707 -98 -626 717 36 -752 577 202 -742 446 236 -746 458
2473 458 405 -794 266 511 -757 151 572 -696 95 695 -672 -125 714 -528 -198 689 -501 -264
2491 -264 796 -403 -442 776 -228 -497 687 -194 -557 748 -26 -668 610 95 -655 532 127 -689
2509 -689 540 292 -797 350 431 -718 223 441 -697 181 562 -704 8 646 -600 -113 628 -556
2527e56L71R38j196Q4J094j038j28J106r14k18J183q50m77J263o14o69J186m66
2545I9p60J193l10r47J155q4j045R80Q3j061R48K25j177Q24M45j213O30O02j143
2564e56M63P42j156K89R08j084P2J004r96r5J083q89k69J161p46m99J146n65o42
2583f29J157l92p86J133k45r24J066m0j020R62J36j087Q63L11j137P13M75j146
2601e90N60O08j120M36P58j129K45Q88j042M5R86r33r5J030q48k78J109p13m62
2620e45J101n25o25J126l86p90J109j92r25R76jr58R18J31j051P98L49j113O32
2639B9N13j098N09O56j127L39Q22j043J36Q69r52M6R42r21j29J064p89l59J055
2658E62o13m68J069n14o26J078l22p78J002j71q30R55k8r74Q90K11j037P00L55
$$ plain form
2527 -556 -185 753 -443 -359 735 -303 -431 675 -239 -457 726 -124 -601 662 48 -621 565 99
2545 99 -661 532 222 -725 430 346 -699 281 364 -697 251 476 -701 123 568 -645 -15 587 -556
2564 -556 -93 649 -507 -218 690 -394 -322 682 -314 -409 674 -215 -484 677 -69 -568 578 13 -629
2583 -629 528 136 -650 483 238 -686 380 340 -680 282 418 -669 194 505 -632 81 556 -590
2601 -590 -30 578 -542 -106 652 -477 -232 656 -386 -341 645 -288 -383 647 -201 -479 630 -83 -545
2620 -545 556 31 -594 532 146 -644 465 273 -652 324 323 -635 283 414 -637 161 510 -603 29
2639 29 542 -556 -47 609 -518 -179 643 -400 -264 605 -347 -301 641 -280 -409 655 -134 -493 562
2658 562 -51 -519 550 36 -590 488 166 -612 390 219 -611 344 316 -658 232 443 -594 106 461
2677D61j021O16M91j087M54P06j047K50P66r86J62Q73r65n3J022q11k64R90o82
2696a25l30J016o17n05J075m16o68R99k91p19R86j71q73R30O5r41P75J65r27P14
2716A42L39j074N90N59j016L65O17r44K87P37r87Q3R24q54j09Q88p37k01R91p14
2736a14m11J080n04n77R68l56o16R65k63p81R47m0q72Q18P7r03P87K01r99O55
2756F2M15r79M85M78r39M24O00r83K27P82q85N8Q05q19n1R18p69k63R70n58m29
2777d51R31m76n03R84l79o82R54j51p83Q34k2q29Q17J17r41P02L01r34N62L82
2797D33r57N07N41r77L05O75q72J50P09q36Q1Q05p99j26Q86o38k73Q76n72l69
2817d51R60m64n63R29k51o59Q37j40p27Q35j1q40P40J86q83O06L00r13N47M48
$$ plain form
2677 461 -560 56 547 -540 -86 620 -427 -177 589 -397 -235 638 -327 -380 642 -169 -433 557 -125
2696 -125 -455 561 -56 -561 514 98 -570 429 138 -581 405 234 -639 291 356 -585 190 355 -572 142
2716 142 481 -593 -3 556 -460 -95 522 -422 -135 602 -385 -302 622 -232 -341 547 -190 -391 600 -114
2736 -114 -525 555 51 -526 442 86 -530 435 172 -609 338 298 -574 244 321 -582 205 406 -593 62
2756 62 477 -502 -17 461 -478 -54 546 -437 -210 572 -313 -255 550 -269 -320 598 -171 -434 536 -22 -451
2777 -451 480 4 -499 485 106 -576 378 227 -556 278 256 -573 244 361 -580 122 423 -511 51 433
2797 433 -524 -17 524 -453 -148 527 -345 -195 514 -322 -241 564 -235 -361 525 -113 -386 490 -82 -451
2817 -451 509 45 -518 411 160 -499 338 198 -529 306 295 -545 195 381 -502 104 404 -509 38 486
2837D86r56L74N85q75K41O38q57J57P43q26l5Q42o88j68Q29o14k63Q68n09m21
2857d49Q91l67n25Q44k58o24Q50j40p40P77M6q01O76J56q19N90K99q70M59M48
2877D43q61L40N49q47K10O63p99M3P61p19p2P73o44k01Q35n51l29Q64m55m50Q48
2898D01l09n53Q10k02o31P82p2p02P12N2p48O15J66p85N55L17q40M18M61q13K67
2919i9N32p69J87O13p70P0P29o91j05P76o00k41Q06n08l53Q36l70m67P77k72n18
2940d37P74j74o43P55j1p23O47R9p28N92J90p94N04L54p75L46M23p66K80N16p68
2961c39J75O36p14LO62o12r3P15n67k15P72m49l51P59l48m47P79k62n65P44p5
2982B08o36O52No66O20R8p45N51K86p69M11L54p52L61M35p72K18N69o96Q8O00
$$ plain form
2837 486 -470 -96 489 -386 -145 493 -364 -207 536 -290 -325 517 -171 -339 490 -124 -387 481 -28 -449
2857 -449 442 75 -450 394 136 -488 362 222 -518 259 305 -496 180 336 -483 107 406 -464 -5 443
2877 443 -418 -78 471 -376 -166 497 -302 -259 502 -217 -289 484 -160 -361 474 -77 -406 458 3 -447 401
2898 401 92 -461 349 147 -484 298 226 -476 236 288 -460 155 321 -464 91 408 -432 -14 447 -366 -99
2919 -99 433 -336 -149 464 -306 -236 493 -198 -303 473 -127 -368 438 -70 -423 413 43 -424 353 81 -437
2940 -437 337 163 -480 275 264 -459 188 287 -441 151 341 -453 51 405 -370 -24 399 -367 -87 429 -339
2961 -339 -164 472 -242 -239 423 -189 -282 433 -134 -349 423 -26 -377 382 34 -413 366 104 -461 283 208
2982 208 -428 224 229 -437 183 281 -464 87 373 -396 15 369 -383 -22 413 -359 -141 428 -268 -180 420
3003D20o49L4O30o29j33P44m87k51P11m21l34P41l46m55P41j78n37O65r7n90O62
3024B41J3p13N92J82p14M69K65p10M16L54p86L07M99p07J72N30o73R8O09o67o4
3045b87P11n44j79O63m59k16P08m21l79P41k70m64O83j76n08O75q0o31N95R8o40
3066c80N10J49o73M89K58p44L68M15p11K26M67o70J64N54o63MO32n69r9O62n25
3087a36j67P14m61l27P23l15m07O81k38m54O69j27n66O24kn88N42O8o36N32J98
3108C27o94L92L15o77L13L81o74K56M72o82J04N63o11J0N98n53j14O72m89k36
3128c27O88l77l33O85l17l99P07k06n15O44r1n66O10J5o18N54J33o63M50K23o42
3149c45L84K91o77L23M20o83J86M96o26P3N21n77KO12n31j24O21m57k16O49l79
$$ plain form
3003 420 -229 -195 435 -194 -327 417 -70 -321 390 -31 -365 376 30 -425 316 138 -399 266 169 -421 241
3024 241 254 -459 133 315 -399 70 335 -375 41 395 -391 -84 415 -292 -120 410 -263 -165 444 -223 -287
3045 -287 424 -120 -299 364 -95 -311 397 -24 -403 338 68 -396 287 111 -397 278 198 -433 162 260 -380
3066 -380 130 279 -394 95 353 -391 -23 392 -319 -93 374 -296 -132 422 -241 -237 395 -174 -273 389 -136
3087 -136 -303 411 -50 -377 346 31 -376 305 67 -387 282 155 -411 213 211 -377 165 233 -403 129 327
3108 327 -367 25 340 -337 -24 357 -317 -61 411 -271 -167 396 -215 -205 393 -160 -274 398 -91 -327
3128 -327 361 -16 -349 336 19 -380 327 121 -394 250 159 -407 203 218 -400 154 287 -376 74 297 -345
3149 -345 39 330 -347 -24 396 -287 -101 395 -231 -158 363 -214 -212 400 -131 -255 366 -91 -307 342 -37
3170c7l08O76k81m32O54j59m89O16q8n52N71N7o10N35J34o54M32K36o68L68L55
3191C56o64K57M23o51J75M71o10Q5N47n73l9O19n17j47O30m33k41O30l50k88O40
3212C20k67m09O20j62m79N93n3n48N68N6o26N11J60o34M17K31o35L55L35o50K45
3233e2M34o43J30M95n79M6N71n65o9O02m78j55O09m27k14O54l65l51O56k19m27
3254c47N90j50m63N98p1n36N42P4n98M55J45n98M31K47o49L06L60o13K01M12o00
3275b64J50M93o02L1N84n25r6N85m80j68O41l96k90O69k89l80O00k14m11O49j49
3296A38n21N93nn57M96O6n70M71J71o37L86L03o12K67L23o13K37M23o17J13N24
3317C79n54j6N30n18o2O04m69j98O48l62k79O04k93l68O54k14m82O21m3n23N29
$$ plain form
3170 -37 -345 331 50 -382 272 113 -376 240 152 -400 171 228 -382 153 287 -367 65 301 -367 1 356
3191 356 -308 -51 372 -279 -104 367 -243 -158 389 -184 -223 396 -121 -268 362 -71 -312 318 -32 -320 320
3212 320 53 -356 264 102 -377 216 163 -385 183 239 -387 124 284 -350 67 298 -337 18 353 -297 -52
3233 -52 382 -261 -131 364 -215 -169 402 -163 -232 370 -108 -263 346 -81 -295 359 -6 -357 299 80 -347
3254 -347 243 93 -370 228 157 -379 163 237 -361 94 239 -359 72 319 -330 -24 336 -277 -76 336 -264
3275 -264 -114 379 -223 -192 392 -133 -229 356 -124 -292 349 -47 -337 332 43 -337 263 49 -362 287 138
3296 138 -383 210 205 -352 144 210 -360 111 282 -355 31 334 -278 -11 312 -301 -64 359 -258 -145 379
3317 379 -175 -191 339 -179 -241 363 -106 -304 344 -18 -297 307 14 -354 300 86 -396 225 182 -341 188
3338A88j2n57N43Q3o21M54K38o27L35K75o12L08L54o33J73M56n45P1M65n42M2
3359a64N29n37r1O16m13j98N79l69k69O27k91l84O18j53m43N72j05m92N83nn91
3380c81M93J54n85L96J91n81L53K93o54K71L96n93J68M25n73R3N02n68j3N61m55
3401a07j22N54m17j82O09l68k95O02k39l61N81j64m47N70o8n21N22N9n38M60J07
3422B35n86M32K21o25L21L42o23K36L92n87J49M67n76K4N32n21l9N64m76j36O05
3443C51m15k37N95l05l00N87k37l78N72j31m62N55n6m83N11K1n46M69J49o00L87
3464D7K23n89L28L03n81K39L89o07J41M64n55M1N19n11p2N73m42j62N73l82k41
3485c02O11l16l24O14k15m25N78j06m72N47l2n17M99P0n48M29J43n65L82K23n79
$$ plain form
3338 188 176 -381 162 245 -376 78 316 -311 24 299 -313 -5 349 -284 -111 345 -200 -129 336 -206 -164
3359 -164 365 -172 -263 353 -60 -258 321 -48 -317 310 19 -365 253 100 -343 229 124 -368 215 210 -381
3380 -381 112 266 -319 77 268 -313 40 333 -321 -50 346 -247 -79 346 -227 -134 368 -200 -213 348 -107
3401 -107 -229 325 -92 -274 335 -33 -328 274 35 -326 255 91 -356 214 146 -375 147 206 -332 128 235
3422 235 -351 81 302 -323 -2 340 -283 -47 345 -242 -93 374 -202 -178 354 -167 -206 358 -118 -254 351
3443 351 -64 -301 294 -11 -311 276 39 -339 233 102 -360 195 139 -344 167 188 -358 111 260 -340 47
3464 47 270 -319 9 312 -269 -30 359 -248 -107 357 -198 -157 362 -149 -221 352 -90 -252 321 -61 -302
3485 -302 309 -7 -331 283 68 -357 221 115 -357 190 158 -359 140 210 -338 91 234 -331 51 274 -305
3506c05K94L25n86K23L89n70J22M49n19K9M95m84o0N37m41j63N73l34k64N90l00
3527@l27N87j92m18N62r1m78N37j7n20M95Q4n70M12J87n64L36K56n73K83L24n84
3549b71J87M03n36J01M48n18K4N18m83j01N49l89j71N30l38k18N74k80l55N69
3569B43j62m14N33q4m59N19jn32M56J29n44L83J59n41L54K54n87K51L62n56J56
3590h1L90n18R8M69n22k8N18m22j16N17l77j69N65l26k98N63k08l42N13j61l78
3611c13N22p9m69M84M2n13M26J00n17L93K00n75K87K99n33K03L30n35J67M22n30
3632a89L4M96m77n1N00m29j10N65l85k34N48k57k86N26k21l39N51j47m26N06k7
3653A48m58M48K8n02M41J36n45L38K19n13K67K56n39K13L87n51J09M28m74K0M48
$$ plain form
3506 -305 -11 314 -272 -49 340 -230 -108 341 -178 -149 346 -138 -198 339 -102 -265 308 -26 -290 300 0
3527 0 -327 260 68 -350 212 121 -357 180 163 -357 138 222 -348 64 251 -313 23 279 -294 -11 313 -271
3549 -271 -84 319 -217 -116 332 -186 -162 356 -127 -228 321 -68 -239 291 -47 -265 309 29 -326 243
3569 243 81 -333 200 116 -343 176 175 -357 99 228 -316 67 226 -315 39 293 -294 -43 319 -237 -81
3590 -81 309 -209 -111 358 -164 -192 326 -96 -212 305 -72 -241 324 -2 -300 263 55 -287 226 65 -313
3611 -313 209 130 -339 145 187 -326 100 200 -317 76 276 -299 -12 287 -246 -43 287 -248 -81 341 -189
3632 -189 -155 341 -136 -187 313 -116 -226 339 -46 -280 268 11 -275 251 30 -309 242 95 -331 175 148
3653 148 -310 138 166 -336 105 241 -304 34 253 -260 7 263 -276 -63 324 -227 -118 310 -164 -144 304
3674C04m55l3N37m39j56N38l31k21N35k80k98N66j86m16N42q8m20M64l5m67M75
3695A36O7n40M03J78n32L20K12n21K68L11n43J59L83m86Q9M07m85J3M98m66q2
3716b11N16l59j71N11l16k35N45k53l41N50j41l90M96r7m34M98ln10M44J04n14
3737c11L62J77n26L16K48n38K32L29n26J60L80n09P4M34m42k7M66m01r0M87l64
3758f9j61N15l06k43N16k18l20N12j34m03M98o1m32M48J9m76M14J04n17L62J92
3779B40n38L04K73n47K17L59n31J24M03m96O8M26m51k3M87m10j18N19l54j89N16
3800B79k83k67N32k09l38M97j26l82M77n6m28M49K4m68L85J20n01L39J96n24K86
3821BK71n21K00L44n17J35M02n09N0M61m56m1M80l94j16N15l49k09N33k79k82
$$ plain form
3674 304 -151 -184 353 -86 -242 296 -35 -256 279 -1 -299 267 81 -335 207 119 -301 163 128 -339 136
3695 136 203 -337 66 244 -288 32 244 -277 -9 302 -241 -82 301 -185 -96 311 -174 -161 337 -129 -211
3716 -211 305 -54 -225 286 -30 -265 280 27 -314 236 95 -295 201 104 -330 168 165 -345 99 203 -311
3737 -311 51 228 -298 18 266 -272 -40 289 -237 -77 303 -206 -132 302 -140 -167 299 -102 -192 295 -69
3758 -69 -230 285 -21 -264 252 34 -286 226 92 -311 187 126 -306 142 161 -315 99 203 -314 48 240
3779 240 -298 6 279 -268 -51 308 -223 -99 304 -192 -124 302 -149 -172 315 -95 -213 306 -48 -237 279
3800 279 -4 -271 261 52 -286 211 85 -297 180 124 -304 145 169 -299 86 206 -295 44 240 -284 2
3821 2 273 -248 -48 296 -221 -86 316 -193 -143 318 -138 -179 301 -93 -209 306 -43 -252 281 2 -280
3842b80N34k12l39N20j26m12M88k6m44M31K5m56M04J01n02L32K08n10K57K59n10
3863b58K11L40n12R6M15m52K9M16m23m2M93l99j49N29l31k15N18k71k62N25j92
3884F6l69N14j04l92M61n4m37M49O4n18L85J61n01L12J83m99K77K90n35J74L53
3905B80m64Q6L85m68M2M58m42p0M84l52j42M66l14j85N14k63l01N15j62l45M76
3926A98j13l93M72j9m64M15J02m78L49J27m99L43K14n33K38L03m80J65L32m86
3946b07J07M11m79QM47l85o4M40l69j27N04l09k48N08k02k84M64j72l39M93q6
3967A11m13M48J1m42M00O7m82L65J78n21K70K48m77K09K82n08J85L72n00O0M27
3988B90m38MM40m15p8N01l56j90N11k66k22M70k38k73M94j60l75M84p0m00M36
$$ plain form
3842 -280 254 42 -297 223 97 -315 173 147 -297 134 159 -297 107 208 -294 38 246 -264 -7 252 -258
3863 -258 -47 293 -219 -123 292 -160 -131 285 -138 -180 313 -86 -235 294 -37 -252 266 -5 -267 258 66
3884 66 -303 211 107 -285 176 122 -315 134 198 -320 65 226 -275 37 220 -279 -2 288 -247 -73 280
3905 280 -184 -98 287 -181 -139 319 -123 -193 291 -61 -203 263 -51 -236 278 15 -286 229 67 -278 198
3926 198 85 -308 164 145 -319 96 198 -280 69 196 -303 40 254 -279 -41 262 -218 -53 279 -207
3946 -207 -100 311 -168 -160 287 -98 -162 278 -91 -218 286 -23 -271 237 35 -249 215 43 -296 197 111
3967 111 -302 146 157 -285 115 182 -300 65 243 -278 -8 240 -237 -28 254 -254 -69 303 -197 -137 290
3988 290 -148 -144 296 -119 -197 304 -52 -242 269 3 -219 251 13 -260 234 74 -301 183 113 -287 149
4009A49nm44M07Q1m75L28J67m68K64K32m99K21L15n04J25L83m58N8M12m45JM58
4031C03m07j04M99l34j69M90k93k42N20k07l33M90j20l72M63o3m13M42Km67M08
4052I3J00m84L37J70m91K74K48m90J93L06m83J36L53m55O1M28m52l0M77l97j05
4073b11M86l27j81N03k84k55N15k00l26N03j29l81M63l9m30M17M1m61L87J15m77
4094b71L08J79m81K67K43m97J91L28m62R7L71m46L6M16m21l5M51l53j34M77l03
4115c9k01N06k66k63M91j63l22M72r2l92M55m5m41M27N8m67L64J31m96L33J91
4136B41n13K40K90m97J66L25m60J15L72m61K3M31m03m0M47l51j26M70l07k17M91
4157B36k15k76M84j93l07M84j05l89M26Km13L89M9m51L70J27m90K76K23m76K37
$$ plain form
4009 149 144 -300 107 188 -287 41 208 -260 4 236 -263 -42 273 -231 -106 277 -181 -123 289 -156 -155 303
4031 303 -104 -208 291 -43 -212 278 -15 -257 263 56 -277 213 93 -279 184 121 -292 150 152 -315 93
4052 93 193 -291 46 216 -275 -1 247 -243 -50 256 -227 -91 262 -193 -132 296 -156 -186 291 -106 -211
4073 -211 275 -52 -233 270 -14 -269 246 46 -280 223 94 -287 176 137 -293 124 165 -296 91 206 -271
4094 -271 37 216 -265 2 245 -252 -61 267 -195 -98 273 -173 -137 279 -142 -177 274 -79 -213 264 -39
4115 -39 -240 266 0 -263 228 65 -257 215 123 -269 186 141 -300 127 185 -282 82 213 -283 50 241
4136 241 -272 -32 258 -239 -73 252 -208 -93 279 -182 -159 272 -131 -171 276 -75 -201 269 -38 -255 236
4157 236 21 -255 229 36 -271 213 108 -281 145 147 -266 123 172 -279 91 218 -272 4 227 -249 -12
4178a2K67m89J87L45n18Q7M07m28PM22m10m4M69l59j58M79k87j83M68k48k65N09
4200B46j62l61M43o0l63M12k8m05M07N3m69L37J56m62K82K03m83K29K98m96J38
4221h5L50m52Q0L67m40K8M62m27p7M54l30j39M70l06j93N04k34k92M74j42l19
4242b47M35j06l72M56Qm47L64Q9m38L20J35m65L01K27n07K11K71m43J48L15m59
4263b04R4L98m23l7M24l46o7M24l52j29M90k87k33M75j98k76M57j64l39M78m4
4284A41m15M04J4m00L65N9m53L53J70m98K62K33m55J83K78m53J19L59m41N3L76
4305B54l89j3M06l80q7M72l10j75M54k38k31M55j93k85M57j08l62M38m4l75L95
4326A41Pm38L77J12m53K91J86m55K28K20m66K08L00m60R0L70m16L1L86m00l0M20
$$ plain form
4178 -12 255 -234 -47 298 -220 -133 274 -154 -147 275 -135 -179 290 -69 -227 252 -35 -218 250 2 -263 246
4200 246 84 -277 166 106 -257 155 127 -278 129 182 -287 50 206 -256 26 229 -254 -25 273 -223 -85
4221 -85 265 -187 -107 260 -180 -152 310 -117 -194 260 -70 -209 261 -45 -238 266 32 -260 214 72 -247
4242 -247 188 82 -290 166 174 -273 91 180 -258 62 197 -268 33 260 -247 -36 235 -208 -60 255 -204
4263 -204 -110 288 -135 -172 252 -94 -161 263 -89 -218 272 -15 -248 227 29 -247 210 46 -293 185 141
4284 141 -274 130 144 -256 109 168 -285 68 238 -260 2 235 -220 -37 241 -212 -93 266 -175 -122 254
4305 254 -135 -148 258 -122 -209 263 -47 -222 232 -6 -237 218 25 -260 197 89 -273 165 121 -254 141
4326 141 148 -290 87 199 -254 37 223 -232 -4 216 -250 -42 258 -202 -112 258 -158 -127 259 -141 -171 249
4348B49l51j07M41k72j74M44k48k26M55j61l09M41q9l50M09l6l79L76M2m15L41
4369H1J10m40K89J71m50K29K42m65J67L21m40P9L65m10J1L85l78l8M45l56j29
4390b11M48k70j86M39k18k46M51j56l06M30p6l44L86k2l76L68N7m22L18J36m36
4411b36K63J80m33K15K43m42J43L16m20P8L44m25L2M12l92p2M44l10j53M38k74
4432d9j79M49k08k71M61j37l06M12q7l47M12j3m15L76P6m00K99J20m30K67J82
4453B12m47K06K60m24J31K92m12P6L58l89j7L96l37o9M01l11j30M39k59k29M58
4474B05j77k54M26j60l05M37o8l85M08K2l85L44N8m31L25J54m56K43K23m18J71
4495b3K56m31J36L21m26L4L70l70mL93l57q3M36l10j67M34k19k02M20j94k62M53
$$ plain form
4348 249 -102 -209 232 -40 -214 230 -18 -244 211 50 -259 182 93 -257 152 116 -263 113 155 -260 81
4369 81 191 -249 40 211 -239 -10 232 -233 -66 255 -185 -106 259 -151 -140 245 -133 -171 274 -82 -211
4390 -211 237 -33 -219 220 2 -244 207 51 -255 175 99 -245 141 119 -257 111 168 -254 64 200 -236
4411 -236 27 207 -226 -11 232 -210 -67 249 -171 -93 251 -174 -142 270 -122 -194 250 -60 -213 225 -49
4432 -49 -228 221 13 -258 203 66 -240 172 85 -262 150 137 -278 98 174 -226 73 193 -237 30 212
4453 212 -235 -29 231 -193 -62 230 -182 -106 252 -137 -154 242 -95 -164 237 -74 -204 235 -24 -253 205
4474 205 28 -226 200 40 -265 172 104 -281 127 149 -236 108 166 -265 60 214 -242 1 224 -194 -23
4495 -23 233 -198 -62 259 -167 -133 237 -133 -137 256 -101 -184 252 -58 -225 209 -10 -212 208 14 -248 205
4517B05j26l39M09l9l57L84Pm04L66Q9m50K84J77m30K48J94m45J86L01m56R2L37
4539B33l88N0L60l93k1M13l38j14M22k87j41M20k43k14M59j69l00M03p6l12L92
4560A56n7l50L83K1m11L31J05m13K95J43m50K50K48m60J60K84m15J08L23m35P3
4581a11L82l88m3M00l33q5M16l04j51M45k33k32M23j58k61M05j08l31M35l7l80
4602b49L59L0l80L18Q3m00K85J63m21K07K14m12J72K75m44J10L43m01J5L68l64
4623a29k4L89l38r5M46k97j68M28k26k19M31j69k89M33q7l36L93k3l67L76J0l85
4645b46L32J05m22K72J67m14K16K11m21J66K83m20J00L18l90K5L54l64l2M09l19
4666g0j24M15k68j67M26k22k33M38j60k75M08q6l30L85k4l67L64M9l97L11J17
$$ plain form
4517 205 79 -260 149 110 -247 137 144 -260 106 195 -255 29 206 -224 24 218 -227 -41 260 -196 -104 233
4539 233 -155 -105 255 -138 -159 254 -84 -198 224 -63 -204 216 -27 -241 218 49 -251 152 76 -236 156
4560 156 99 -251 132 153 -258 73 178 -235 60 203 -247 3 251 -209 -49 235 -180 -72 251 -184 -111
4581 -111 271 -117 -160 240 -93 -178 238 -66 -217 228 -5 -237 186 28 -233 172 64 -267 168 131 -249
4602 -249 110 140 -240 78 161 -239 46 209 -212 -5 209 -203 -31 244 -200 -90 253 -148 -133 235 -129
4623 -129 -153 236 -102 -197 249 -48 -216 212 -14 -233 198 29 -260 173 86 -250 143 120 -247 129 139 -246
4645 -246 86 191 -231 41 208 -206 10 221 -200 -34 249 -171 -71 247 -143 -118 236 -128 -160 249 -70
4666 -70 -194 221 -47 -214 212 -10 -243 195 35 -240 168 82 -248 137 113 -254 110 159 -238 73 190
4687A90m21K68J57m10K29K18m33J59K99m25Q2L22l69J4L47l43l5L81l04j16M04
4708B14k61j67M23k17k25M25j47k82L91o6l18L63j8l69L70M6m11L15J22m13K62
4729C7J66m32K24K54m30J18L11m01Q1L15l87K6L79l62o0L94k87j20L91k62j65
4750b10M18k02k41M00j16k80L85q3l18L87ol79L32P8l85K77J01l89K64J93m26
4771b00J80K50m04J43K63l98Q4L54m01rL85l36m9L66l14j02M31k64j93M12j82
4792A6k27L81j56k62M01o6l32L50J3l42L26K2l76L06J38m14K29J93l87J80K27
4813B20m06J33K97l88N0L15l43RL45l53n3M17k94j53M07k21j70L86k01k43M26
4834A80j22l04L84n3l12L60k6l76L56Q9m01K57J39l73K27J64l97J96K39l94J08
$$ plain form
4687 190 -231 37 194 -216 13 231 -202 -43 256 -169 -87 235 -134 -120 227 -116 -151 230 -74 -190 214
4708 214 -47 -214 209 -8 -233 192 45 -237 154 88 -230 133 115 -254 116 162 -249 66 188 -225 37
4729 37 203 -229 -5 249 -181 -63 248 -153 -72 243 -144 -118 261 -101 -161 233 -54 -174 217 -45 -210
4750 -210 208 6 -235 165 49 -231 154 71 -247 140 134 -245 87 165 -220 57 158 -231 33 226 -200
4771 -200 -20 230 -174 -31 232 -166 -82 272 -129 -138 247 -89 -138 228 -86 -188 243 -21 -214 198 16
4792 16 -211 170 14 -248 153 87 -245 105 118 -224 102 124 -252 54 192 -222 7 200 -187 -7 220
4813 220 -186 -53 244 -144 -94 221 -122 -113 232 -121 -174 243 -51 -204 203 -18 -188 198 -3 -246 180
4834 180 58 -246 138 85 -227 133 107 -269 87 176 -225 32 171 -202 25 189 -208 -12 227 -167 -59
4855e9K83l56N3L11l69JL71l08r6L81k57j22L76k42j80M08j69k67L96r7k96L89
4877A51p4l29L58K5l69L09P2l74K94J07l91K33K06m04J54K42l65J08K71l75N4
4898i7L36l44l0L50k96o5L62k76j28L89k01k06L80j54k32L74j21k79L75m7l20
4919b30L36J6l61L20O7l74K59J57m04K26J78l86J73K41l95J07L01l73M4L20l27
4940a05j5L46l05p9L78k81j16L61k01j82L82j60k48L64p4k96L53m2l12L38Ol24
4962b12K80R2l70K63J33l91K19J87l89J53K52l72R2K86l48L6L11l18l1L51l01
4983g7q2L68k54j38L78k05j94L72j36k45L66q9k80L30k0l16L13L2l45K89Q2l51
5005b02K23J61l63J89J85l59J31K49l66Q2K93l33L0K95l14l0L40k59j04L42k15
$$ plain form
4855 -59 224 -132 -79 232 -137 -136 235 -73 -169 212 -45 -167 209 -33 -213 195 26 -241 155 58 -238 151
4877 151 77 -252 106 131 -238 71 143 -231 63 170 -221 12 218 -186 -32 210 -155 -47 224 -151 -97
4898 -97 239 -105 -135 215 -81 -146 216 -60 -188 201 0 -206 174 20 -212 162 41 -238 137 90 -230
4919 -230 106 122 -239 81 148 -226 33 190 -214 12 190 -196 -23 218 -177 -70 231 -142 -98 222 -105
4940 -105 -120 226 -79 -158 220 -61 -177 184 -17 -199 183 23 -225 139 65 -231 122 80 -232 106 112 -212
4962 -212 68 160 -210 53 186 -205 14 201 -188 -35 217 -155 -63 223 -125 -89 222 -96 -127 224 -77
4983 -77 -159 209 -45 -183 195 -10 -204 168 32 -213 153 64 -216 114 94 -222 91 123 -222 67 149 -202
5005 -202 21 182 -181 8 193 -166 -35 214 -152 -70 223 -110 -80 215 -99 -129 211 -48 -152 190 -25
5026b5j37L42j88k06L90j37k57L53o9k87L37l4l12L21N1l56K65R5l31K19J22l53
5048a97K00K07l69J07K49l16N5K68l18J8L12k99m7L28k45r1L30k31j44L67j69
5069A5k14L47j12k33L40j01k55L39k4l26L00M8l23K61P9l45K31J56l62J55K12
5090A88l30J15K20l33P0K79l11j0L18k70n1L09k46j05L48k02j72L40j51j82L31
5111A55j28k37L43n9k84L00Rk96K76L7l29K60J01l46K03J56l36J88J68l53J32
5132d0K56l49N1K73k86OK93k87m2L31k34j25L18j77j37L15j51k03L20q0k46K89
5154I5k4k63K87rk96K71P7l44K21J21l17J95J50l30J49K16l30Q0K36l01O1K56
5176B01l14K0L03k66o8K94k11r9L25j95j59L34j40k08L07q9k18K97m2k68K81K8
$$ plain form
5026 -25 -162 180 -8 -214 176 39 -218 135 66 -221 116 82 -230 91 142 -214 51 146 -185 34 156 -197
5048 -197 3 210 -159 -52 197 -119 -64 204 -114 -96 216 -83 -130 198 -47 -138 192 -39 -183 184 15
5069 15 -199 148 36 -197 143 42 -213 126 102 -224 76 124 -199 62 141 -204 27 183 -179 -24 188
5090 188 -142 -27 193 -140 -70 209 -102 -112 206 -64 -115 194 -52 -157 191 -11 -183 157 6 -176 155
5111 155 27 -210 133 74 -210 90 99 -197 79 116 -213 47 148 -198 5 161 -175 13 181 -172 -40
5132 -40 216 -133 -82 191 -95 -89 204 -83 -125 206 -28 -153 165 -12 -149 166 15 -188 132 52 -194 95
5154 95 71 -192 95 86 -210 61 138 -206 15 136 -181 14 164 -166 -17 199 -131 -51 185 -116 -55 201
5176 201 -113 -93 210 -56 -124 170 -41 -140 185 -10 -169 165 25 -183 124 35 -183 114 72 -196 85 113
5198A13l03K37O8k98K28J01l18J87J48l00J12J97l13R2K33l02M9K66k73k4K80
5219A80k50n1L07k36j06L24j74j58L11j29j95L09r2k36L13l4k74K78mk78K52P0
5241A27l08K05J23l05J50J70l09J23J96l07R1K31k92L8K66k91j3K96k42p7L04
5262A76j94j16L07j68j64L07j34j89L12q2k34K97m3k73K76J7k85K38O9k99K11
5283B9J07l09J73J53l12J34J98l02Q2K25k83K4K66k60j7K63k21p2L05k05j17K99
5305A60j53j55K91j20j98L16p9k29K58k8k59K63J7k76K45P3l15K10J15l12J71
5326eJ62l08J24J99l04Q9K13k74L9K43k71j3L01k35q1K81j87j08K97j65j46K98
5348A49j20j94K79o7k18K69l5k47K59L3k87K26N7k63J70J08l02J70J76l11J17
$$ plain form
5198 113 -190 47 115 -183 45 146 -172 15 163 -137 -25 172 -141 -49 184 -118 -69 197 -76 -100 180
5219 180 -70 -121 186 -50 -156 168 -6 -164 147 18 -177 132 40 -196 117 83 -191 87 83 -195 57 127
5241 127 -181 24 147 -158 -8 162 -147 -24 172 -135 -44 187 -105 -67 199 -92 -105 191 -51 -128 176
5262 176 -18 -134 173 5 -159 148 14 -175 137 55 -179 118 75 -198 78 95 -190 48 117 -182 29
5283 29 136 -173 0 153 -159 -25 173 -129 -47 178 -105 -81 185 -75 -92 171 -50 -122 183 -22 -139 160
5305 160 7 -148 143 23 -175 141 62 -167 91 63 -196 67 84 -192 53 126 -189 21 136 -176 -5
5326 -5 157 -151 -27 172 -132 -43 170 -104 -65 178 -93 -106 195 -40 -121 160 -27 -135 162 -3 -149 149
5348 149 29 -165 114 47 -171 98 63 -184 75 108 -179 47 104 -159 11 119 -183 -13 163 -148 -31
5369c1J81k69P0K18k94M8K77k71k9K67k20m7K76k20r9L10j60j62K95j07j89K79
5391A23r7k14K83rk53K38K1k60K26M6k89K15J12l02J44J52k71J06J79k87P3K37
5413A73k68J6K38k38MK63k51p0L08j86j18K80j50j39K90j37k00L13p6k19K66l3
5435F6k35K58mk71K30P6k92J78J18k72J53J31k94J21K05k88O0K29k50J5K37k44
5457g3k7K63k18p1K83j80r1K79j66j54L10j19j92K63m9k18K71l5k60K61K0k57
5479a60K05N8k61J94J03l00J48J67k90R1J96k61O4K14k62J9K34k32j8K49j99o1
5501a02K72j86j22K96j36j62K68j07j69K74p4k23K61nk61K30L0k57K22O2k74J84
5523B1J06k88J46J47k78J16J86k84P1K21k55OK45k22k6K55k04p1K77j92j13K76
$$ plain form
5369 -31 150 -119 -49 169 -125 -77 200 -71 -100 167 -53 -100 176 -44 -143 167 7 -155 140 33 -156 123
5391 123 26 -188 95 86 -167 71 92 -168 58 104 -185 30 142 -160 -16 136 -135 -29 150 -137 -64 173
5413 173 -95 -79 159 -79 -75 188 -63 -133 175 -11 -129 151 1 -138 152 15 -185 128 52 -167 99 66
5435 66 -169 89 85 -186 44 120 -172 6 124 -148 5 136 -158 -37 168 -120 -60 169 -81 -66 171 -73
5457 -73 -100 163 -55 -126 157 -23 -114 165 -1 -155 155 36 -156 107 58 -160 111 76 -184 77 97 -160
5479 -160 45 103 -158 36 139 -161 -13 154 -136 -45 151 -110 -46 168 -94 -75 159 -73 -91 158 -41 -102
5501 -102 170 -16 -138 158 22 -140 128 21 -148 126 52 -171 90 85 -176 54 84 -173 49 111 -163 21
5523 21 127 -161 -15 132 -146 -30 156 -128 -57 164 -91 -85 160 -62 -88 167 -37 -108 169 -23 -136 140
5545A40j42j38K70r4j87K76o8k07K35ok43K32K4k56K01P1k79J92J02k95J49J47
5567A24k50R4J76k71O6K05k51K5K40k34j7K48k11n2K67j80j10K75j46j31K55r6
5589B6j78K65n9k24K59j0k30K25J6k54K07P2k66J54J20k67J41J26k58J00J97k69
5611a07M3K04k17nK42k20k9K50j99p8K66j64j02K58j47j34K70q9j93K58n5k06
5633a54K30j0k35K39K5k52J84Q1k56J82Q9k70J29J46k54P5J76k28N4J97k48J0
5655i0K41k13l8K38j76p5K62j74j12K69j10j67K55p2j81K61o0k20K57rk39K11
5677E8K7k36J83Q0k67J63J19k57J09J34k38R8J72k61M8K05k09j5K17j93l3K32
5699A36j84o3K58j47j27K48j18j28K46r3j81K53k9k11K08%k09K06J4k52K02R2
$$ plain form
5545 140 -2 -140 130 36 -151 125 57 -150 85 79 -164 68 92 -164 37 108 -171 21 123 -172 -23 124
5567 124 -126 -32 144 -127 -61 144 -107 -82 158 -76 -93 155 -56 -108 159 -21 -131 144 -2 -133 122 26
5589 26 -152 113 54 -170 89 79 -151 74 90 -164 43 115 -151 3 123 -144 -3 123 -135 -35 162 -107
5611 -107 -64 140 -77 -82 160 -60 -89 161 -38 -116 150 -14 -116 142 -5 -139 131 42 -151 107 52 -154
5633 -154 76 66 -169 70 95 -157 27 108 -148 34 123 -147 -18 128 -126 -51 125 -103 -49 148 -100 -90
5655 -90 151 -62 -100 138 -38 -113 149 -25 -137 132 22 -145 110 38 -143 118 58 -162 95 86 -153 58
5677 58 85 -151 32 112 -155 8 127 -130 -21 113 -125 -27 145 -116 -68 137 -72 -87 130 -63 -96 136
5699 136 -48 -111 147 0 -127 121 3 -125 121 28 -153 100 71 -140 68 68 -141 65 79 -173 29 121
5721A21k66J43J02k32J30J20k55R2J84k34L4J83k01K2K07k14m1K52j71r3K44j34
5743gj07K29j12j37K46p3j70K17k9j91K15j2k16J92O0k33J44P0k11J30R6k38J12
5766b5J46k33O8J62k15M1J88k28MK25j88m2K27j51q7K38j49r9K42r7j41K14o0
5789D0j67K22m1k01K05K4k12J79M4k26J59Q1k47J29J31k27Q1J39k06N4J49k02
5811i2K5J91j94kJ91j79k6K20j61q4K48j37j21K29q5j49K35q0j56K17m1j87K08
5834G0Lk06J80M3k20J53Q0k23J09J15k12Q4J42k20M3J80k04J5J99j95j5K05j70
5857d4n0K12j33q6K09r9j16K26j01j39K19o6j75K26k2j80J80Qj94J69L9k12J40
5880A1P7k11J07J06k03P3J45k01M1J67j90MJ93j69l2J98j63m6J98j21p9J94q6
$$ plain form
5721 121 -145 -2 100 -132 -2 118 -137 -45 139 -95 -61 122 -79 -57 150 -64 -105 147 -24 -117 127 -7
5743 -7 -114 115 3 -134 112 39 -131 86 57 -134 81 69 -147 45 105 -128 16 86 -125 5 101 -137 -25
5766 -25 121 -112 -44 118 -97 -56 132 -96 -92 133 -55 -97 130 -21 -108 130 -19 -118 124 27 -114 100 40
5789 40 -127 95 54 -147 58 82 -130 49 93 -133 26 107 -140 -11 120 -107 -26 113 -93 -39 110 -92
5811 -92 -67 124 -70 -72 119 -60 -86 134 -27 -111 137 0 -121 108 23 -126 109 29 -127 90 49 -138 70
5834 70 73 -133 47 90 -130 23 103 -120 -11 104 -108 -24 118 -102 -59 121 -83 -68 131 -64 -79 126 -44
5857 -44 -94 118 -15 -101 108 9 -107 119 18 -121 98 32 -143 83 61 -119 61 69 -125 44 83 -129 11
5880 11 88 -123 -16 90 -113 -40 105 -96 -55 112 -78 -74 119 -50 -82 116 -47 -93 105 -16 -95 99 13
5903A3j21J99p4j30K02l4j78J85j0j79J83J3j86J56N7k30J41Q9k16J03J05k06
5925a18R1J36k09N0J55j86J6J72j69k3K02j58m9J90j21o3J87j06j04K11p5j43
5947a14J88k9j59J78rj76J63L6j84J32N5j89J18Q2k00J07J06k05N4J49j82L5J54
5970A10j82JJ75j57k6J78j47m2K02j43p2K15j08j10J81n9j19J89m1j59J83kj81
5993a14J65J4j74J45M9k03J22J01j90O3J03j79Q5J14j96M7J52j71%J64j64lJ79
6016A09j50n6J92j08q8J96j06p9J83q4j20J93j6j64J51Nj67J61K2j86J44N3j83
6039i8J05Q3j85R2J00j99O6J35j70J7J54j61QJ49j56j7J74j33m8J69j10o2J87
6062A00j05j08J97n7j24J67l8j38J64Jj67J62J2j77J43L7j67J27O1k00J03J04
$$ plain form
5903 13 -108 91 17 -113 89 55 -123 62 52 -127 56 69 -117 39 96 -134 7 96 -120 -17 88 -118
5925 -118 -27 109 -100 -50 105 -81 -65 107 -62 -85 117 -41 -90 100 -21 -84 103 -3 -107 104 29 -114
5947 -114 74 45 -114 64 55 -121 42 78 -106 26 81 -108 10 92 -108 -1 105 -100 -46 103 -79 -44 110
5970 110 -72 -71 104 -53 -79 99 -48 -90 112 -31 -103 112 4 -106 75 16 -103 86 45 -114 69 67 -114
5993 -114 51 65 -109 36 85 -118 4 105 -85 -22 81 -98 -13 101 -95 -48 104 -67 -67 97 -67 -70 109
6016 109 -41 -97 95 -13 -101 95 -11 -90 93 9 -111 82 66 -98 53 58 -109 52 74 -112 32 85 -98
6039 -98 7 90 -95 -3 97 -102 -36 99 -71 -54 100 -61 -53 96 -60 -77 97 -36 -84 85 -25 -87 100
6062 100 -5 -113 84 27 -97 70 32 -106 58 59 -108 54 66 -111 32 69 -98 29 90 -110 -7 97
6084I7j89O9J11j65L9J38j75PJ63j39l5J72j28m4J75j17p4J79p6r0J59n9j26J79
6108G1l1j51J70mj53J40J3j60J33M0j67J10P4j77Q4R9j89P8J17j80L1J50j52m
6132e8J48j44j7J55j22m1J69j04p2J65p7j00J72n5j04J55l1j36J54j1j37J41K3
6155G3j62J19M6j63R9O5j64P9J03j80O4J05j61L7J25j46J7J35j47mJ38j22l9J64
6179H1j10o3J52o9q0J64o1j12J69k2j36J46j9j33J29K4j56J31L9j68J07N8j54
6202h3Q1P8j63O1J10j52J5J23j27KJ31j30j8J64j30l7J46r7n0J43q6p6J84o3j13
6227h7J47l2j01J41l0j32J41J5j50J10M1j37Q9N2j45Q1P8j55L9J13j50L6J23j41
6251e4JJ46j37l3J52r5m9J41r3o6J61p7q2J51m9q9J39l9j16J51k6j14J10J8j38
$$ plain form
6084 97 -92 -23 88 -77 -38 100 -75 -68 95 -44 -79 93 -35 -79 96 -21 -95 84 8 -82 77 18 -108 71
6108 71 40 -111 59 55 -98 42 55 -105 28 68 -99 11 85 -92 -8 91 -98 -20 97 -83 -52 98 -54 -58
6132 -58 90 -54 -71 84 -38 -79 90 -14 -86 79 2 -98 74 19 -85 70 39 -97 57 46 -91 50 73
6155 73 -89 30 76 -87 12 77 -87 -8 95 -85 -21 84 -77 -40 85 -61 -44 91 -56 -60 78 -44 -83 81
6179 81 -29 -92 60 -9 -89 75 14 -98 71 49 -87 59 40 -93 36 60 -96 35 74 -94 13 71 -83
6202 -83 -2 76 -87 -26 84 -68 -53 70 -57 -55 76 -54 -72 92 -38 -75 71 -26 -76 67 -19 -95 89 26 -87
6227 -87 60 28 -73 68 38 -94 47 62 -88 22 63 -74 15 67 -78 3 81 -74 -35 78 -72 -36 87 -54
6251 -54 -53 93 -44 -77 75 -20 -69 72 -21 -87 74 -3 -85 66 17 -72 67 28 -88 63 37 -77 33 51 -87
6276h7J22K8j35R4N2j43O3O9j31O4R2j64M1J06j30JJ21j08%J15r6n7J63r3m8J19
6302E8o1q1J40m0j08J49j9j09J17rj18J27J4j50J16K7j25R3M4j35Q0O2j40N7Q6
6327G5j29K0R8j29J9J21j22k3J38r8m8J25p1n7J56q3p8J45l8j01J25k9r5J28q
6352D1j32J26K8j38R8L1j31Q8N9j54Q5P1j41N2P8j19K6J04j29RJ21j13j5J20j08
6377d3j7J20q6n9J42n0p5J30o1p6J15j7r4J08Qj15J06J0j23R0M8j35P6O0j21O1
6403BN6j17L5R2j20J4J09j14lJ10r9k1J24r6l1J32r4m3J22p1m5J18n7q2J26k2
6429B5j07J25j4r7R6J9j08Q2L8j17Q3L8j16N8O4j20L1P9j03J5R1j08RJ06j06j8
6455e5J04p6l9J33p7n1J18o4o7J16k9p9J09j6q8R2Jr6R6Rj03Q8J9j01P6M0j13
$$ plain form
6276 -87 35 63 -72 22 74 -69 -6 63 -68 -4 88 -76 -35 71 -59 -58 63 -45 -45 70 -26 -83 80 -13 -61 58
6302 58 -3 -84 56 16 -92 57 38 -71 46 37 -81 46 60 -90 26 53 -72 21 65 -70 10 72 -68 -11 75
6327 75 -54 -34 64 -65 -46 75 -47 -70 68 -30 -78 47 -24 -81 75 -8 -86 59 21 -80 45 16 -79 49 41
6352 41 -91 35 63 -75 23 54 -77 11 70 -84 1 72 -69 -17 61 -58 -32 72 -57 -48 73 -40 -55 65 -43
6377 -43 -60 60 -26 -85 57 7 -68 62 1 -75 40 23 -71 37 45 -70 36 46 -77 13 61 -74 2 62 -59 2
6403 2 58 -59 -24 68 -52 -38 71 -43 -46 64 -35 -56 68 -28 -59 73 -21 -64 58 -13 -58 60 3 -79 47 25
6429 25 -82 43 29 -68 28 47 -61 21 59 -58 25 63 -53 5 69 -51 -20 59 -44 -29 62 -46 -37 69 -37 -55
6455 -55 49 -27 -66 67 -10 -61 57 -7 -74 42 13 -66 43 27 -61 31 32 -64 32 41 -62 26 45 -56 20 60 -53
6482e3N5O7j22L5R0j20K0R4j09jJ10j05k8J27q6k7J01p2l3J15n7q0J21m1n9R4
6508C6j5q6R8jj05J01J7j03P5L3j13P6L2j00N2O7j11L5P5j03K9P2j05MJ03r3k0
6535e0R7q2j5J04q2m0J20m9o8J10m2o1J00k2q9R5Mq2P7J9j00Q3K3j09P2N5j09
6562d1M2N4j03L7P0j09K3Q7j01J3P8q0j2R9q5j4R3o9l8R7n5m8J03n4n7J04k3p7
6590f6Q4J3q1P7K4j06Q3J9r6N1M0q4L9N8r4K2Q2r5rQ8q3RP9r0j0R7p1l6J03p5
6620b8k7R8m8o6J06m1n8R1k2p3R4nq7Q2K6r0O2J6q0O8L8r7M4N1r4L2O1r2K4P2
6650E7q5qQ2p8j4Q5o7k0R9o4m7R8n0n0Q9l4m9Q8j0q2R4j9o1N8Np0O3L4r3N0M2
6681D3q2L7M1r0M1O3q1J4O7p7pP3o3qP9p4k3Q5n4l1P5l3n1Q2k3o5Q2po3P2rp1
$$ plain form
6482 -53 2 69 -53 -18 72 -48 -28 66 -43 -44 66 -39 -67 60 -26 -53 48 -24 -57 58 1 -79 42 1 -58 36
6508 36 21 -65 33 32 -73 28 45 -58 17 50 -63 13 45 -55 -3 64 -47 -12 63 -40 -11 61 -44 -40 63 -30 -50
6535 -50 47 -35 -50 54 -28 -68 52 3 -65 45 3 -58 42 20 -69 26 30 -52 25 44 -56 27 50 -59 13 68 -41
6562 -41 1 55 -48 -11 59 -50 -27 60 -41 -28 50 -30 -42 57 -28 -42 51 -18 -56 41 -14 -62 41 -13 -70 34 11 -66
6590 -66 18 31 -50 27 51 -55 28 47 -49 2 42 -42 -3 55 -39 -17 65 -30 -39 49 -34 -25 54 -36 -46 51 -20 -56 47 -28
6620 -28 -55 43 -5 -71 35 -6 -64 27 5 -68 26 21 -66 16 42 -48 14 30 -50 18 56 -41 3 54 -40 -8 53 -39 -15 57
6650 57 -28 -36 46 -32 -46 39 -28 -48 51 -13 -60 38 -12 -62 27 -7 -56 32 22 -60 34 15 -46 12 17 -53 10 44 -49 1 43
6681 43 -39 -2 39 -51 -10 53 -28 -14 53 -24 -31 42 -21 -29 50 -24 -47 38 -16 -47 28 -5 -56 26 3 -62 20 13 -50 22 13 -58
6713e8P5J6p8O9Qp7N7K9q6N6L0q3L7M9p1J7N9q6KP4o4k0R6p8j4P5m3m3Q5l7n4
6744e8P9k4m9P8j6p0P8ln9N9J6p1N4K1o4M1K4p2L7M0p0K0N6q5K0O2p1NO5p5LP0
6776D1n7k2O2l8k9Q5m7l0N6j3o1P5j6o0P3ko4O4J1q0O3K9q2N3L3p8L5L2p3L8M3
6807D1o3LO1p7J2O7o5rO4n3k1P7n1l0Q1m5l7O7k7l2O5k1n7O5Qo6P0j0o7O4J9p4
6839d1M6L6o5K6L2o6L1M7q2J8N7n1LM9p0jO9n1k4P4n0k6P0m1l4P5k5n5O6j1n2
6870d6O8mo7O8%o7O0J0n7M5K2o4L6L9p5K6M8o0J1M1n8J2N2n9j0P2n2j9M4l5k0
6901c9O9l9m4O9j3n9P9k2m5O6mo9O4Mm2L7J2o0M9K5p1L5L3n2J6L6o3K3M7o9PN3
6933C3m7j5N6m7j2O3m1k9M6j5m0O5k2l4N4j2m3N9pn7O0J1o8N7J7o8M0J9n0M0K5
$$ plain form
6713 -58 17 33 -45 24 32 -45 12 41 -45 11 41 -42 -5 44 -27 -10 49 -37 -35 39 -25 -45 51 -27 -41 34 -9 -52 33 -4 -58
6744 -58 21 -3 -52 26 10 -60 18 15 -44 15 31 -40 14 35 -29 12 36 -36 1 41 -29 -9 47 -38 -18 44 -27 -22 43 -32 -29 41
6776 41 -16 -38 24 -14 -43 42 -5 -35 21 8 -53 22 6 -54 19 17 -47 17 28 -52 11 40 -42 11 44 -34 1 33 -40 -2 41
6807 41 -22 -19 42 -35 -23 44 -21 -30 34 -19 -40 37 -14 -44 37 -8 -45 22 -5 -37 28 7 -50 15 23 -43 27 17 -50 14 33 -41
6839 -41 5 41 -24 2 34 -32 -1 46 -36 -18 39 -12 -9 40 -30 -31 38 -13 -37 37 -13 -39 31 -10 -44 31 6 -49 17 6 -46
6870 -46 22 18 -49 19 19 -48 12 22 -35 10 32 -32 4 43 -32 -6 42 -18 -7 34 -24 -12 40 -19 -29 43 -9 -28 16 -19 -39
6901 -39 30 -9 -53 16 3 -56 23 1 -44 22 18 -51 13 17 -25 12 24 -36 13 38 -33 2 35 -17 -1 35 -28 -5 42 -27 -20 33
6933 33 -14 -29 27 -20 -32 31 -10 -39 7 -8 -48 17 -5 -39 15 3 -40 19 12 -45 15 26 -42 15 32 -36 4 23 -27 13 38
6964C8o5L0K9o1J8M7n0pO2o9JP0n7j6O1l6j5M8l6l1O4k6l3M8j6l7N4j1m9O0om1
6996c2L8K2n6L0L1o3L6K8o0L0K7n3J6M8n7KM9m7j1O7n5j2M8l2k4N5l6l5O9k3l6
7027c6O1j6m3N7j0l8K8Qm5M5J8n9L9K4n9L8J7m6K0L7n9J7M6n5LM2m2j7M8k5k1
7058b3M9l7j6M8l3k5M9k6l0O0k6k2L7%m4M3On2M9Om2L6Rn0K3M2m3J4L9o1J2K7
7090A9l5J4L2l8qM5k9k5M7k7k9M7k1k6M3pl9M7rl0L9j0k3L1nl6L9J6n2L0J8l8
7122b0K7L1n5K4K2l8OK6l5J1L8m9PK8m4ML9k1k4L8j3k6M2k8l3N5k2j6K9ll5M2
7154GNm5M0Ol9L5Nl9L1K0m0J8L3m0KK5l7%M4m5mM7l6qL9l0j7N4k4k8L3j5k3M0
7188A4k1k4N3pm3L0Kl6M7Jm0L1Kk0%L9l1NK6m2J8L0m1PK0k0KK1k8oK6j9j6L5j7
$$ plain form
6964 38 -27 3 32 -29 -11 36 -14 -21 41 -28 -27 43 -14 -30 31 -5 -20 28 -8 -39 25 -1 -34 14 -2 -39 15 4 -45 15 9 -32
6996 -32 6 28 -28 2 33 -30 6 34 -26 4 31 -22 -6 42 -15 -13 36 -11 -22 45 -10 -22 26 -6 -30 25 -11 -46 23 0 -36
7027 -36 25 9 -34 23 13 -25 3 11 -34 11 29 -30 9 33 -26 12 29 -17 3 40 -19 -2 44 -11 -8 34 -8 -25 23 -2 -23
7058 -23 26 -11 -27 21 -12 -37 12 -14 -44 16 -10 -32 5 5 -39 4 10 -42 7 13 -29 7 16 -34 -11 31 -12 2 41 -20 -8 19
7090 19 -16 -2 30 -8 -16 29 0 -25 22 -5 -34 13 -8 -34 9 2 -37 10 1 -29 10 0 -23 8 3 -33 6 22 -30 0 18 -20
7122 -20 7 38 -17 7 29 -9 -3 23 -12 -1 37 -12 -5 23 -21 -17 22 1 -23 15 2 -24 18 -10 -43 12 -10 -26 3 0 -35 7
7154 7 12 -33 7 13 -26 9 14 -25 6 26 -14 4 37 -3 -1 24 -13 -13 31 -14 -18 29 -7 -15 24 -6 -23 31 7 -21 12 -3 -26 14
7188 14 -7 -31 22 15 -28 2 4 -32 15 16 -24 7 9 -11 -11 28 -3 2 28 -14 4 34 -7 0 20 0 2 23 -5 -11 15 -4 -20 15 -2
7223bj9L6k4j5K9j0k7K7J1l4K5J6m7M3%l5J4L0m3K6J6l3L0J6m1J0L7l8LL2l9j
7255gL2l8PK7k8nL4l8KK6j3k1K4Lj8J8j2j3K2Kk5K1mk5L4Lk5K1Ok8K1J6l2J8J9
7290B4l2QJ9k5kL0k9pL3j7k3L6j0l2M1j9k0L5j8j9L1j0k4M1ml7M0pk3K6%j7J1
7323@J0k7J9K1l5J1K9l5lK8j5qK1l1PL5l5J2J3k4mK6l0rL4rk8J3Qj3J6rpK8jj9
7359a1J6%j6K0nj5K8pj6K1Nk6J1J2l2PK0k1MK0k0JPj0LJ3j0j0K6k5qL3j6k2L6
7394A3j0k9K8Jl0L1kk0J9Qk8K4Qk1K2Mk3RK2l1J3J5l7QK5j8qK0k4mJ8j4nK0j4
7429a0oK3k5lK3rqPJ8k4K0lk0K1Jj5K2nrNJ2l3K2J8l6K0J6k1jJ3k6LK0j5kJ7j9
7466i%J2j4oJ6j5j0L0j1rK7j1j5J8jk0K2%rJ7j6lRPj4QJ4j7MOk4J4J4k1JJ4op
$$ plain form
7223 -2 -21 15 -9 -24 5 -5 -32 -5 6 -28 -3 13 -34 9 9 -26 -12 18 -25 1 17 -16 14 30 -11 -1 36 -2 1 33 -6 -7
7255 -7 25 -13 -6 21 -7 -12 22 -16 -14 12 -1 -22 2 5 -13 5 -7 -20 2 4 -21 0 -4 -29 5 8 -17 4 10 -18 3 19 -13 5 24
7290 24 -8 0 19 -6 -8 22 -7 -14 19 2 -21 15 5 -27 14 -5 -25 10 -8 -27 4 -6 -30 11 7 -30 10 3 -20 6 6 -11 0
7323 0 10 -17 2 23 -12 -1 28 -7 -10 18 3 -5 16 -15 -8 27 -8 4 17 -7 -11 15 -15 -24 10 1 -27 -14 -6 -19 -3 -12 -19 9 8 -11
7359 -11 5 5 -11 9 4 -11 17 10 -6 15 20 -6 5 17 -15 -8 12 -9 -5 15 -5 -4 3 -7 -4 9 -1 -11 15 -10 -18 15 -1 -23 13
7394 13 3 -26 2 3 -27 4 2 -18 1 9 -19 5 13 -8 14 18 -5 4 26 -5 8 23 -14 -6 19 1 -7 13 -11 -15 3 -11 -16 4 -10
7429 -10 -16 7 -18 -21 2 -7 -15 -8 10 -14 6 3 -17 4 5 -10 12 7 -2 3 15 -18 4 22 -14 6 22 1 0 13 -13 -10 10 -5 -7 10 -9
7466 -9 -9 3 -11 -17 -1 -16 -26 4 -7 -16 11 0 -15 3 2 -18 4 4 -5 12 -4 -7 2 9 -5 3 17 0 4 10 -14 0 14 -7 -6 8 2 -5
7504eJ1j5%K9k2j7J8k1%K5j9qK6pk1L3nj8L2j9JJ4nj4J9jk3K0Rk1J3Koj1QqRK
7542Ej3%K1k3mJ0j3mJ8j5jJ7kj6K1qj2K3j2oJ8pqJ4oj4K9qj4J5MoPOm0K8Jj5J5
7581Ejj9NK3j9j0J8j5%K4j5qJ7j6pJ3Mj7K5Jk0J5Ok1K0ok0K2jj0J0Mj9K0Qj6j
7618aJ5k4J4J4j9LJ0l1QK0j7jK6k5pJ5j3jJ3j5jK3j1qJ6nj3J9jj6J7Kj4J1MrR
7655GJ3k2J3pj4J3mj2J1Lj2PJ2k1KJ5k2J1Oj9NJ6j4rK5j3jJ2j1j1K1LlJ4j4j1
7691a1RLrJ8Jj6J3%j4OJ1k0RJ3j6jJ4j5MQj7MJ7k9JJ4nkLknJ3orK2nkJ5j0j3J7
7732Hqj3K3qmJ2Ok8J0Qj7K1j4oMJ4j5kJ4j9QJ2k0qJ8k0lL1k0LJ1j6KJ4lqJ2j0
7770a1JK0kj4J6oKQpmORk4J7mk0K2Lj2pK0k3NOj1JQj3JJ0j1J3Rj1lL%pJ1Pj5J8
$$ plain form
7504 -5 6 -9 -9 20 -2 -19 -1 -22 -22 3 -16 -24 2 -5 -26 7 2 -16 16 -3 -2 12 7 -7 12 11 -12 8 17 -4 9 11 5 -6 2 -6 3 5
7542 5 -8 -8 13 -10 -14 -4 -17 -21 -3 -18 -19 -2 -4 -20 1 -7 -19 4 -8 -14 4 -3 -11 3 -3 -17 12 4 -10 5 9 3 10 16 -24 4 5 -10 5
7581 5 4 -15 -10 13 -6 -16 2 -13 -13 11 -4 -12 5 -11 -18 -5 -1 -18 7 8 -12 3 9 -12 8 2 -18 4 3 -7 3 7 -12 8 16 0 -1
7618 -1 14 -10 4 18 -1 2 12 -19 -11 9 -8 -9 17 -8 -15 0 -13 -14 -1 -16 -17 6 -5 -13 3 -2 -15 4 3 -13 4 6 -8 3 7 -2 7
7655 7 20 -2 11 4 -10 3 -1 -13 -2 1 -11 -4 8 -13 -11 4 -18 -7 -1 -20 -15 1 -13 -22 3 -10 -11 1 -10 -21 0 3 0 14 0 -11
7691 -11 -2 1 -8 10 11 -5 8 8 -6 0 11 -9 0 13 -3 -4 10 -5 -1 7 -10 -6 11 -18 -17 -3 -8 -10 -7 -9 -14 -1 -7 -16 6 1 -1 14 4 -9 8
7732 8 0 -13 10 2 -2 10 16 -12 -2 6 -11 10 -4 -10 -6 8 -7 -9 5 -14 -6 6 -14 -22 -4 -24 -27 4 -16 -13 -2 -18 -16 -2 -5 -13 -1 -11
7770 -11 -10 10 8 -6 10 4 6 14 7 3 9 18 -6 11 7 -13 9 12 0 -7 13 -10 -5 1 -10 -9 -1 -14 -13 -3 -14 -1 8 -3 -6 -3 -3 -10 1 8 -7 11
7812A1pj4K0llPJ1j7NOj3MpmMOk0J3Rk6J4Nj5NJ2k2LJ9rjMj2oK5j6J5kpj3J7J2
7853A0j6J3oj5K8nj0J8nj0J0jj4J6pj1JJ0k7K5Ok4J0J6l2J1J1j8qK0lJRnnJ2j4
7890i%K1j3mJ4oj1J7jj3J5%k6K4Jj5J1LplljLJ0j9QQk0JJ2j1NNj0NJ1j0KJ1qK
7931aKJj2J9pmJ4j7jK1j2qJ2%j5J2lk6K0Rj4J0J0k2J3nk8J8Rj4PJ2k3QJ2j7MK4
7969Hj5j8L3j9kK2j3mJ4Mj5K1j1pJ5j1j0J5jj2Rnj0J1okOpoJ8%l0J1J5k1J7Kj1
8007a5%J7qrK5l0J6KknJ8j4JK4k2mK2nj8K3k5pJ2KqJ5j3j3J4lmQMk3J5%j4J0R
8046eopJ0pOJ5j3KJ0rpK3j6KJ4qoJ5lj1J8Jk3J0ok3K0J2j4J0%l1K7lk3K3j2j1
8084b6J7J4k6J8Nj8RJ8j9OJ3j5nJ8j7JL1k0j3K2Jk2K8j3j2J3kk4L5j4j7J8mk0
$$ plain form
7812 11 4 -10 10 7 4 11 22 5 10 16 3 7 0 -4 0 6 -14 -1 8 -18 -4 1 -14 -9 3 -19 -16 3 -6 -7 -3 -15 -21 4 -12 3 1 -6 -19 -2 10
7853 10 -6 7 1 -14 14 9 -1 17 12 2 12 11 -3 13 6 -5 -4 6 -21 4 10 -14 -4 12 -20 -9 2 -16 -24 -4 -7 -6 3 -2 -7 5 -9
7890 -9 -9 12 -1 -5 9 3 -8 9 8 -5 10 10 -16 8 9 -6 5 8 1 -2 -5 -6 -3 7 -12 -4 4 -16 -15 -3 -14 -9 -4 -14 -9 2 -8 -6 5 -3 -1
7931 -1 1 2 -10 9 2 -2 12 -5 -6 15 3 -5 7 7 -8 4 1 -25 -5 4 -10 0 10 -12 1 -4 -32 -14 -5 -19 -12 0 -23 -15 -3 -20 -16 8
7969 8 -7 -25 8 -11 -13 9 -4 -8 6 10 -5 16 5 -2 13 2 -8 7 6 -6 3 -2 -12 -1 -7 -9 -3 -10 -16 2 2 -28 -17 -2 -23 -6 -4 -15
8007 -15 -15 2 -6 -15 10 -20 -4 -2 -4 -9 9 -5 -4 20 -2 -6 16 11 -7 16 -9 -16 -4 -2 -10 5 -8 -21 -7 -10 -14 -6 -2 -25 -10 -10 -24 -14 -5
8046 -5 -11 -18 -8 -15 -9 6 -7 -5 5 -4 -11 12 -4 -2 12 4 -2 13 10 -1 17 18 -5 5 -1 -24 -4 8 -6 4 4 -27 0 -3 -26 -3 -15 -26
8084 -26 -9 5 -21 -3 2 -16 -7 11 -8 -2 11 -4 -9 9 -8 -7 24 4 -9 13 14 -8 20 7 -5 8 6 -18 17 3 -14 4 0 -20
8118b0J4jj2kK6l1K6Kk9J1K2j9KJ3k4J0K7j6pK2j5JJ3k1JJ9mk1K3rj4K8k1mK4
8153A4j9j5L5j0k8K6mk1K4%k2J3Pj5jJ6k3RL0l3J8Lk4J5NpLJ1j4lK9k1%J9j0l1
8189b4K2P
$$ plain form
8118 -20 -6 -7 -19 -21 5 -26 0 2 -27 -16 6 -13 -11 2 -22 -12 15 -1 -8 14 -1 0 13 -8 -7 12 8 -13 10 1 -13 15 -6 -10 14
8153 14 -5 -20 15 5 -23 3 -1 -22 2 2 -20 -7 0 -15 -16 0 -23 -14 16 -17 1 4 -20 -5 0 -7 -4 7 -7 -10 19 -2 -2 17 7 -24
8189 -24 -2 5
8191E
$$ Imaginary data points
##PAGE= N=2
##DATA TABLE= (X++(I..I)), XYDATA
0@%%%%%%%%%%%%%%%%%%Lj1J6j6J6j6J6k1K9l2L3m1M8n0N8o6P4q5R5j07J21j35
40g1J49j65J82k01K22k45K69k96L28l61L97m36M81n31N87o51P24q09R07j022J162
61F20j337J558j847K245k829L762n473R535l4332j7453J03417o6962l0720Q2556
75D2740m7072l1857Q0263m9755l7654Q6668l7148n5166Q6721k3317o5469Q2198
87C1152n294p6622O9787R692p4067N8874J7380p4422N5110K6698q2322M2193M3701
100D1860p7871K8158N0560p3658J8035N8211p1873M993O6473o3175p821O7739
112D1631n5883j5616P2823m8851l0264P3259l5933l9691O9953k4684m5061O8142
124B9825j6321n5197O3533k707n8868N6432O697o1915N0278J6960o5192M0906
$$ plain form
0 0 0 0 0 0 0 0 0 0 0 0 0 0 0 0 0 0 0 0 3 -8 8 -8 8 -8 8 -13 16 -16 17 -24 24 -26 32 -34 40 -45 50 -57 64 -71
40 -71 78 -87 95 -106 116 -129 140 -156 172 -189 208 -228 253 -278 309 -342 382 -427 480 -542 620
61 620 -717 841 -1006 1239 -1590 2172 -3301 6234 -28098 -45551 57866 -9096 -39816 42740
75 42740 -4332 -36189 44074 -5681 -43335 43333 6185 -48981 37740 14423 -51046 31152
87 31152 25858 -50764 19023 28715 -45352 13522 30902 -43520 11590 38288 -44034 -1841 41860
100 41860 -36011 -7853 42707 -30951 -12916 45295 -26578 -21585 44888 -18287 -26108 41631
112 41631 -14252 -29868 42955 -5896 -36160 37099 1166 -38525 31428 6744 -38317 29825
124 29825 13504 -41693 21840 19133 -39735 16697 23394 -38521 11757 28717 -36475 4431
136D431K7827o4262L0081L4525o1901K2970M2847o0437J1310M8327n5631K006
148a7907N2812m9972o293N7125m4697j7943N8789l5188k5558N8224k8016l2854
160c1478N8185j9374m0209N5613r946m5937N0578j656m9443M7182Q315n3123L9271
173G978J6050n4282L2723K4018n4125K5803L1467n3627J6303L7408m9427Q520
185a1191M1119m6321O56M5531m0979p398M7745l5559j5335M8523k9976k2067N0689
198B5437k2012k9831M8204j4487l5131M5349o856l8562M2443L1m2539L8410P480
211A7936m5250L3786J4913m7777K7237K2866m6910K0456K8767m5658J2606L2731
223B5703m3145O425L7514l9392n22M0062l6270p988M2936l0534j4992M3712k4511
$$ plain form
136 4431 32258 -32004 -1923 32602 -29299 -6329 36518 -23919 -12609 35718 -19913 -17907
148 -17907 34905 -15067 -21360 35765 -8932 -26875 31914 -3274 -28832 29392 1376 -31478
160 -31478 26707 7333 -32876 22737 12791 -33146 17432 15776 -33667 13515 21830 -31293 7978
173 7978 24028 -30254 2469 26487 -27638 -1835 29632 -23995 -7692 29716 -19711 -11191
185 -11191 29928 -16393 -15737 29794 -11185 -18583 29162 -6397 -21732 26791 -3185 -25252 25437
198 25437 3425 -26406 21798 7311 -27820 17529 10673 -27889 14554 14585 -27954 10456 17936
211 17936 -27314 6472 21385 -26392 845 23711 -23199 -2743 26024 -19634 -7028 25703
223 25703 -17442 -11017 26497 -12895 -13417 26645 -9625 -17613 25323 -5211 -20203 23509 -1002
236a002k1301M3414j7792k6578M1705j1519l1353L9005m964l4104L7231J482l8553
249b4329L2618Q411m0418K7605J4991m0387K2790K0050m1515J6849K6199m0035
261a7171J0119L0060l7825M504L4125l5177k110L7276l1149r284L7976k6008j3503
274a8167L9621k1577k0227L9295j5260k5382L7350q881k8461L5423l487l2646
286b2399L2385L630l4547K7380Q230l5425K4309J3887l6882J9269J9932l6550
298a6781J2515K3528l4489Q555K7902l3445K012L1400l0021m037L2931k6312q500
311a4742L4795k2956j4581L5844j7060j9315L4218j2923k3145L4145p262k7494
323b0476L1925q13l0274K7501L703l1338K5374R337l3413K0126J4655l2476J5299
$$ plain form
236 -1002 -22303 21111 3319 -23259 18446 6927 -24426 14579 9615 -24489 12742 14224 -24329
249 -24329 8289 16700 -23718 3887 18878 -21509 1281 21331 -20184 -3335 22864 -17171
261 -17171 -7052 23008 -14817 -10313 23812 -11365 -13475 23801 -7348 -16632 21344 -4664 -18167
274 -18167 21454 -123 -20350 18945 3685 -21697 15653 6772 -21689 13734 10247 -22399
286 -22399 9986 13616 -20931 6449 14679 -20746 3563 17450 -19432 -163 19769 -16781
298 -16781 -4266 19262 -15227 -6672 21230 -12215 -10203 21197 -8824 -12861 20070 -6242 -14742
311 -14742 20053 -2903 -17484 18360 1300 -18015 16203 3280 -19865 14280 7018 -20476
323 -20476 11449 10636 -19638 7863 11566 -19772 5602 14939 -18474 1652 16307 -16169 -870
336h70J7717l2094J1807K2296l2098N595K6852k8277k30K7564k5973m334L0248
349A8203k2707r771L1304j7992j3989L0303j5159j7351L2024j0431k3063L0146
361A1517l989k5242K7025k35k7207K5468M731l0082K1463J0505k9314J7256J2706
374A4602l0262J4592J7910l0633Q801K2402k7513L364K3177k5683K27K6466k3711
387f261n763K7985j9012r513K7516j6375j2763K8782j2910j8007K8125o819k0227
400a5242K5585m050k2754K5050N93k6056K2192O199k6561J8314Q852k7244J6301
413A179J3326k8443J1405J7541k6437P233J9480k5474L920K2668k4545j555K5319
426A5617k0375n574K5239j8005q966K6368j4847j3256K6314j0195j6236K4765
$$ plain form
336 -870 16847 -15247 -3440 18856 -13242 -7647 19205 -9072 -9302 18262 -7711 -12045 18203
349 18203 -4504 -14275 17029 -963 -14952 15351 192 -17159 14865 4434 -18629 11517
361 11517 7528 -17714 9311 9076 -18131 7337 12068 -18014 3449 13954 -15360 1896 14602
374 14602 -15660 -1068 16842 -13791 -4990 17412 -10101 -6737 16440 -9243 -9016 17450 -6261
387 -6261 -12024 15961 -3051 -12564 14952 -1423 -14186 14596 1686 -16321 11804 4985 -15242
400 -15242 10343 6293 -16461 8589 9182 -16874 5318 11517 -15044 3270 12122 -15122 1179
413 1179 14505 -13938 -2533 15008 -11429 -4196 15284 -10190 -6270 16398 -8147 -9702 15617
426 15617 -4758 -10332 14907 -3098 -12064 14304 -543 -13799 12515 2320 -13916 10849
438A0849o881j8692K4258k826k1978K1920J825k3045J9465N186k4321J7113R077
451A1950k5540J3385J3071k4549R877J5491k4331O610J8608k3498K365K1130k1340
464f771j428K2562j9374n009K4269j6635r431K4463j2851j2433K4081r407j5236
477a3200K3317n934j7989K1903k095j9727K0421J392k1878J8156N669k2896J4719
490A858R143k2674J1569J1863k2440Q680J4750k1982N062J7036k0845J869J9351
503A3240j9363j844K1141j7149n742K2005j4162q872K2237j1310j1842K2081q234
516B186j4476K1518n098j7016K0450j476j8997J8655K185k0331J6105N420k1056
529a1931J3489Q729k1116J0530J1425k0908P493J4066k0207M156J6278j8687Q61
$$ plain form
438 10849 3968 -14724 9534 6708 -15270 6650 8475 -14570 4895 10081 -14240 2873 11950
451 11950 -13590 -205 12866 -11683 -1806 13685 -10646 -4036 14572 -8926 -6561 14569 -6771
464 -6771 -8199 14363 -5011 -10020 14249 -2386 -11817 12646 -205 -12638 11443 2036 -13200
477 -13200 10117 4183 -13806 8097 6002 -13725 6696 8088 -13790 4366 10035 -12861 1858
490 1858 11001 -11673 -104 11759 -10681 -2001 12749 -9233 -4171 12865 -7980 -6111 13240
503 13240 -6123 -7967 13174 -3975 -9717 12288 -1874 -10746 11491 181 -11661 10420 2186
516 2186 -12290 9228 4130 -12886 7564 6088 -12909 5746 7931 -12400 3705 9125 -11931
529 -11931 1558 10287 -10829 -299 11126 -9782 -2289 11777 -8430 -4274 12004 -6683 -5822
542e822J7701j7035k101J9167j5222n664K0076j2367q556K0063r850j1083K0184
555I491p178j4060J9527l523j5805J7912r22j7191J6959K112j9184J4829N912
568H879j9585J1871Q320j9478R786J0969j9835O511J3751j8415L247J4980j7134
581f133Q50J6734j6045k787J8128j3202n685J7952j1196p699J8745r121j1016
594a0475J8617n474j3003J7054l094j4236J6633m97j6565J5024L140j7178J2586
607B532N105j7528J1466P692j8856Q730J1019j8027N410J2490j6970L273J4332
620A0668j6316lJ5990j4119k636J6256j2750m679J7594j1022q150J7871p533j0360
634i189J6554n247j1717J6274k785j3992J4948M08j4777J3199K281j5666J2343
$$ plain form
542 -5822 11879 -5156 -7257 11910 -3312 -8976 11100 -1267 -9823 10240 390 -10693 9491
555 9491 2313 -11747 7780 4257 -11548 6364 5442 -11749 5210 7322 -11862 2967 8879
568 8879 -10706 1165 9485 -9993 -207 10762 -9073 -2562 11189 -7226 -3979 11001 -6133
581 -6133 -5283 11451 -4594 -7381 10747 -2455 -8140 9812 -1384 -9083 9662 541 -10475
594 -10475 8142 2668 -10335 6719 3625 -10611 6022 5525 -11040 3984 7124 -10054 2532
607 2532 7637 -9891 1575 9267 -9589 -859 10160 -7867 -2457 10033 -6937 -3664 10668
620 10668 -5648 -5651 10339 -3780 -6416 9840 -2910 -7589 10005 -1017 -9167 8704 1171 -9189
634 -9189 7365 2118 -9599 6675 3890 -10102 4846 5254 -9523 3676 5957 -9709 2634
647B634N028j7121R839Q120j6525P154R632j6206N281J1811j5929K293J3613j4336
661d712m2J4345j3572k160J6097j2032n560J6398r191p401J5870p566r238J6286
675G522n106j1949J5159j880j2782J3740j20j4043J3014K723j5394J0621N458
688F963j4911Q594O784j5303P193R489j5496L962J1409j3961J817J2218j3380
701d622r8J3968j2289l229J4568r936m852J4575q904o933J5579o639r786J4806
715F208l675j0794J3742k205j2172J3561M90j3965J1478L177j3864R740M684j4314
729g909Q448P196j4859N599R271j3576L572J0175j3233J808J2031j2496j050J3063
743H040j0489l102J3141r211m796J3998p481p267J3651n314q589J3318l762j0114
$$ plain form
647 2634 7662 -9459 380 8500 -8025 -871 8761 -7445 -2164 9647 -6282 -3989 9624 -4712
661 -4712 -4754 9591 -3981 -6141 9956 -2076 -7636 8762 -429 -7830 8040 474 -8764 7522
675 7522 2416 -9533 5626 3746 -9036 4704 4584 -9459 3555 6278 -9116 1505 6963
688 6963 -7948 646 7430 -7873 -680 8809 -6687 -2725 8684 -5277 -3460 8758 -4622
701 -4622 -4720 9248 -3041 -6270 8298 -1638 -6490 8085 -819 -7752 7827 1188 -8598 6208
715 6208 2533 -8261 5481 3276 -8896 4665 5155 -8810 2668 5845 -8019 1721 6405 -7909
729 -7909 539 7735 -7124 -1525 7746 -5830 -2258 7917 -5316 -3508 8523 -3973 -5023 8040
743 8040 -2449 -5551 7590 -1621 -6417 7581 100 -7167 6484 1170 -7419 5899 2137 -7977
757g977J3330j524j2158J1909J187j2533J0303K837j3027R133M850j3575P318
770G3O856j3439N423Q351j3233L654J0280j2597J007J1346j1203j101J1938r713
784b358k815J2442q419m874J2671o741o510J2755n048q353J2562k867r813J1679
798D311p99j0797J0489R58j1429R617K915j2149Q200M665j2639O609O599j2496
812e946M868Q109j2211K965R408j1526J036J0495j0567r23J1265r310k692J1906
826F877p948m811J2014o157o347J1856m347p573J1425k843r059J0865p32r996
840f776R847J059j0789Q743K942j1345P241M657j1375N651N964j1260M526P566
854F651j1365K416Q869j0481P10R747r612q15J0653q834k966J1225p039m471J1018
$$ plain form
757 -7977 5353 3829 -8329 3580 4767 -7766 2537 5374 -7653 1480 6330 -7245 73
770 73 6929 -6510 -1087 7264 -5969 -2315 7965 -4632 -3625 7721 -3482 -4583 7355 -2358
784 -2358 -5173 7269 -1150 -6024 6647 -94 -6604 6151 1103 -7250 5312 2445 -7368 4311
798 4311 3512 -7285 3204 4162 -7267 2350 5265 -6884 1316 5981 -6658 -49 6550 -5946
812 -5946 -1078 7031 -5180 -2215 7193 -4333 -3297 7198 -3369 -4292 6973 -2337 -5029 6877
826 6877 -1071 -5882 6132 -25 -6372 5484 1137 -6436 4989 2146 -6913 3952 3220 -6776
840 -6776 3071 4130 -6659 2084 5026 -6319 922 5579 -5796 -145 5819 -5441 -915 6651
854 6651 -4714 -2298 6571 -3910 -3200 6547 -3065 -3880 6773 -2061 -5027 6198 -841 -5312 5706
869E706n842n737J1338m312p523J0914k245q640R830p46r155R483R79j0380Q038
884A708K901j0512O622M298j0540N545N857j0844L553P375r848J950P754r519
898c700R57R171r145j160J0132p737l029R994o548l968J0671n375n933J0367l563
913A134o864R726k404p607R800r76r208Q946J323r618P389K502r886O563M206
928E026j0171M956N637r716L285O198r469K525P808r324K98Q770q000j368Q907
943E362p037k405R493o165m168R773m477n247R269l661o334R544k039p624Q907
958C191k49q355P749Q07q812P390K481r529N975L970r407M764M942r489L567O403
974E398r234J757P415q105M65P659p908q50Q758o802k589R073n391l835Q780m578
$$ plain form
869 5706 -136 -5873 5465 1153 -6370 4544 2299 -6341 3489 2743 -6412 3071 4050 -6330 1708
884 1708 4609 -5903 719 5017 -5523 22 5879 -4965 -1412 5963 -3885 -1935 5819 -3700
898 -3700 -2743 6428 -2717 -3877 6255 -1482 -4511 5483 -1065 -5033 5638 263 -5670 4697 1134
913 1134 -5730 3996 1592 -6015 3785 2809 -6399 2547 3870 -5748 1641 4143 -5743 820 5026
928 5026 -5145 -189 5448 -4268 -983 5215 -4254 -1729 6079 -3245 -2947 5823 -2177 -3545 5362
943 5362 -1675 -4080 5413 -752 -4920 4853 376 -4871 4398 737 -5597 3947 1908 -5716 3191
958 3191 2942 -5413 2336 3143 -5669 1721 4202 -5327 648 4618 -4789 -25 4917 -4572 -1005 5398
974 5398 -3836 -2079 5336 -2769 -2304 5355 -2553 -3403 5355 -1447 -4036 5037 -354 -4189 4591 13
990A3m937R143l003o336Q432j493o791P955n75p752P577J028q600O475K657q443
1006d650N517L413r087M495N106q867K919O088q215J795O588q205N73P942p413
1021b001j380Q172o064k184Q289n546l505Q763m284n141Q452k432n661P909j671
1036A716o748P605m7p484O709J323p607N900K123q182N281L772q555L627M909
1051D342p955K664N686p889J449O611p553o0P298o475q91P581o237k224Q282n130
1067e01l774Q306l606m722P870k589n514P774j403o548P074p4o962O552J151p480
1083d446N689K339p971M489L747p632L420M596p612K295N479p371J191O322o891
1098b356o2O897o198j160P408n466k517P533m529l479P751l370m464P555k547
$$ plain form
990 13 -4924 4219 1216 -5120 3312 1819 -4972 2983 2408 -5344 2233 3261 -5339 1136 3793 -4650
1006 -4650 867 4280 -4807 -312 4794 -4073 -1154 4934 -3281 -1486 5102 -3103 -2530 5412 -2001
1021 -2001 -3381 4791 -1273 -3457 4832 -714 -4219 4544 260 -4881 3571 1139 -4522 3387 1716
1036 1716 -5032 2573 2526 -4958 1751 3074 -4533 1367 3490 -4692 589 4361 -4194 -567 4342
1051 4342 -3613 -949 4737 -3152 -1703 4908 -2645 -2705 4593 -1882 -2773 4808 -1429 -3653 4629 -501
1067 -501 -4275 4031 425 -4297 3573 984 -4530 3244 1841 -4707 2367 2293 -4669 1883 3034 -4446
1083 -4446 1243 3582 -4389 100 3847 -3785 -365 4231 -3381 -1086 4393 -2978 -1787 4535 -2356
1098 -2356 -2418 4479 -1719 -2879 4529 -937 -3454 4079 -450 -3929 3822 452 -4012 3543 996
1113I96n515P382j195o227O894N2o802O057J170p117N359K308p517M310L560p358
1129c643L306M490p337K155N270p105R72O242o266k58O432n749j321O910n014
1144i16k436P223m004l545P172l089m347P201k160n435O805q23n821O345J13o427
1160d144N775J149p054M979K589o944L994L211p131L277M284p196K024N282o641
1175b546Q45N733o084q2O378n616j588O664m434k355O713l787l215O888l037m468
1191c991O781j568n010O250q39n657O039L82o372N119J554o393M402K156o554
1206c701M127L260p153K734M373o536J825M881o288R75N632o062m68O213m970
1221a158j316O167m604k079O800l825l495O668k524m191O191j713m627O254o77
$$ plain form
1113 996 -4519 2863 1668 -4559 2335 2387 -4415 1642 2812 -4305 1054 3362 -4155 155 3715 -3643
1129 -3643 -337 4153 -3184 -1029 4241 -2864 -1892 4350 -1916 -2174 4258 -1491 -2812 4098 -916
1144 -916 -3352 3871 -133 -3678 3494 405 -3942 3259 1099 -4336 2469 1646 -4175 2170 2283 -4144
1160 -4144 1631 2780 -4274 705 3294 -3650 344 3555 -3576 -299 3985 -3211 -1187 4095 -2546
1175 -2546 -1701 4032 -2052 -2134 4244 -1372 -2960 3704 -730 -3085 3628 -159 -3374 3514 477 -3991
1191 -3991 2790 1222 -3788 2462 1623 -4034 2005 2387 -3985 1134 2688 -3705 697 2853 -3701
1206 -3701 426 3686 -3467 -733 3640 -2896 -1071 3810 -2478 -1503 4129 -1933 -2401 3812 -1158
1221 -1158 -2474 3693 -911 -2990 3810 -15 -3510 3158 634 -3557 2634 921 -3706 2548 1871
1236A871n757N402O02n779M821J291o114M461K364o674L313L512o191K384L837
1251C343o208J881M878o127N09N499n424m94N686m951j089O350m393k539O315
1266C236l292l144O197k626l845O313j671m900N842l78n247N204K84n689M917
1281A201J544o122L874K450o023L012L052o018K513M103o028J159M696n431L61
1296a657N093n143m15N707m644j584N972l754k357N905l228l164O152k159l991
1311c267N757j353m532N491o34n113N356N80n710M385J522n728L783K254n955
1326c164L030L285n851J983L924n445J248M296n470M09N229m839p65N448m130
1341h12j616N505l571k352N787k696l244N534j947l690N497j330m520N341k12
$$ plain form
1236 1871 -3886 1516 2118 -3661 1160 2451 -3663 798 3162 -3512 -199 3313 -2878 -494 3343
1251 3343 -2865 -984 3894 -2233 -1724 3775 -1649 -2143 3543 -1408 -2497 3853 -540 -3079 3236
1266 3236 -56 -3200 2997 371 -3474 2839 1168 -3732 2110 1732 -3515 1689 1973 -3716 1201
1281 1201 2745 -3377 497 2947 -3076 -64 2988 -3030 -517 3586 -2442 -1283 3413 -2018 -1657
1296 -1657 3436 -1707 -2122 3585 -1059 -2643 3329 -425 -2782 3123 -105 -3269 2883 724 -3267
1311 -3267 2490 1137 -3395 2096 1462 -3651 1705 2285 -3425 960 2482 -3246 537 2791 -3164
1326 -3164 -134 3151 -2700 -717 3207 -2238 -990 3306 -2164 -1755 3474 -1365 -2130 3318 -812
1341 -812 -2428 3077 -494 -2846 2941 245 -2999 2535 588 -3102 2395 1065 -3455 1886 1674
1356A674n075M733P57n208M152J315n604L615K416n615K774L088n542K011L661
1371C152n508J216M497n122J06M833m464o29N084m067j514N367l360k381N493
1386B703k476l066N306j848l770N158q86m234M807p7m683M367O56n038L930J509
1402B358n284L243K309n300K587L006n305J787L555n138J074M203m774K37M577
1417C135m449o16M921l875j398N204l220k290N196k400k914N021j738l528M948
1432A997r15m117M618N2m514L993O85m739L641J519m969L006K275n016K258K874
1448B648m939J651L559m828P66M061m372P2M292m106o15M718l681j445M991k937
1464a65k193M870k428k832M988j550l560M646o74l862M211j27m204M034O87m705
$$ plain form
1356 1674 -3401 1332 2089 -3119 1033 2348 -3256 359 2775 -2840 -66 3022 -2520 -509 3152
1371 3152 -2356 -1140 3357 -1765 -1659 3174 -1290 -1919 3165 -902 -2416 2951 -409 -2790 2703
1386 2703 227 -2839 2467 619 -3151 2007 1121 -3113 1694 1617 -3066 1301 1957 -3081 849 2358
1402 2358 -2926 317 2626 -2674 -87 2919 -2386 -599 2956 -2182 -1108 3095 -1679 -1442 3135
1417 3135 -1314 -1930 2991 -884 -2282 2922 -298 -2588 2608 208 -2706 2315 577 -2951 1997
1432 1997 1082 -3035 1583 1635 -2879 1114 1799 -2940 701 2220 -2749 257 2532 -2484 -226 2648
1448 2648 -2291 -640 2919 -1909 -1143 2918 -1454 -1382 2910 -1196 -1811 2907 -774 -2219 2772 -165
1464 -165 -2358 2512 84 -2748 2240 690 -2870 1776 1102 -2760 1451 1324 -2880 1154 1841 -2864
1480b864L419J615m679K719K194m787K079K940m682J245L484m255O19L664m208
1495a497M4M300l832r17M530l121j539M540k720k166M765k044k957M507j221l165
1511b493M318q67l752M274M4m328L635R68m237L060J325m489K713K217m636J817
1527d31K829m259J249L110m242O84L804l959m09M044l184q19M038l034j423M467
1543B465k464k340M351j618k597M146j350l138M247m95l782L625L31l734L274
1558I21N96m047L159J450m476K309K191m126J792K466m173J318L136m063L97L525
1574B375l458j44L626l327p19M120k809j651M045k036j999L934j719k490M089
1589A837j038l210L695k26l315L359J84l652L172R25l991K543J552l833K110J845
$$ plain form
1480 -2864 555 2170 -2509 210 2404 -2383 -304 2636 -2046 -801 2683 -1572 -953 2711 -1497
1495 -1497 -1453 2847 -985 -1902 2628 -493 -2032 2508 -212 -2378 2387 343 -2614 1893 672 -2493
1511 -2493 1825 958 -2794 1480 1524 -2804 831 1799 -2438 622 1947 -2542 171 2388 -2248 -431
1527 -431 2398 -1861 -612 2498 -1744 -1060 2744 -1215 -1624 2420 -764 -1583 2455 -579 -2002 2465
1543 2465 1 -2339 2012 394 -2203 1943 593 -2545 1702 1207 -2575 1050 1381 -2353 921
1558 921 1517 -2530 629 2079 -2397 -88 2103 -2023 -231 2235 -1938 -620 2516 -1547 -1150 2375
1574 2375 -1083 -1227 2399 -928 -1647 2473 -336 -1987 2058 22 -1977 1957 238 -2252 1837
1589 1837 799 -2411 1284 1058 -2257 1102 1286 -2366 806 1731 -2260 283 1835 -1998 112 1957
1605A957l959J754K527l980R60L007l646L96L262l412j87L646l019r10L682k514
1621d36j278L778k186j899L954j522k571L713q22k864L438k87l243L224M01l485
1637b085K712Q91l539K402J382l761J971K035l726J262K465l503Q02K792l392
1652a292K57L185l102l10L343k792p60L563k457j413L714j849j956L541j338k269
1668a935L482q93k762L350k20l092K963L18l258K668Q68l478K215J506l481J626
1684a23J908l350J199K297l333O98K730l130R0L018k820m29L210k486r59L330
1700A850k056j412L315j657j812L352j226k286L291o76k663L069j50k903K809
1715H45L43l090K458Q56l248K066J387l288J573J837l215J089K203l109O11K566
$$ plain form
1605 1957 -2002 -248 2279 -1701 -741 2266 -1380 -984 2278 -1134 -1321 2325 -694 -1604 2078 -436
1621 -436 -1714 2064 -122 -2021 1933 411 -2160 1553 731 -2133 1305 1018 -2225 999 1400 -2085
1637 -2085 627 1518 -2021 381 1763 -1998 -27 2008 -1718 -456 2009 -1494 -692 2100 -1292
1652 -1292 -1035 2150 -952 -1262 2081 -711 -1471 2092 -365 -1778 1936 87 -1869 1672 334 -1935
1668 -1935 1547 654 -2108 1242 1022 -2070 893 1211 -2047 621 1489 -1989 226 1732 -1749 -123
1684 -123 1785 -1565 -366 1931 -1402 -704 2026 -1104 -1014 2004 -816 -1245 1965 -521 -1480 1850
1700 1850 -206 -1618 1697 40 -1772 1580 354 -1932 1359 683 -1980 1089 939 -1964 845
1715 845 1188 -1902 556 1412 -1836 230 1617 -1671 -98 1739 -1476 -387 1816 -1293 -682 1884
1731A884k906K3K843k574m45K977k293r22L153j889j474L169j362j833L030j000
1747C81k138L010n77k509K824m5k735K564L66k957K308R19l106J778J410k989
1763a496J418J642l025J121K092l012N24K473k669N4K626k501m00K915k133j022
1779a393K937j594j346K849j370j675K996r46k191K791l38k372K539Pk603K371
1795F62N21k847J942R91k757J663J222k921J411J753k938Q13K068k628M51K226
1811A632k596R6K629k375n36K682j907q11K739j755j249K958j306j806K732o76
1827D51j939K534m59k247K523J10k582K104N90k571J865Q53k748J630J421k821
1843a286R92J715k525P64J856k610M47K334k460k10K456k018m40K494j976q14
$$ plain form
1731 1884 -1022 -999 1844 -730 -1175 1802 -491 -1413 1740 -149 -1623 1546 184 -1649 1381 381
1747 381 -1757 1253 676 -1833 991 946 -1789 775 1141 -1816 492 1411 -1695 83 1493 -1496
1763 -1496 -78 1564 -1461 -340 1752 -1260 -736 1737 -932 -878 1748 -753 -1153 1762 -371 -1393
1779 -1393 1544 -50 -1396 1453 83 -1592 1404 458 -1733 1058 720 -1652 887 894 -1709 662
1795 662 1183 -1664 278 1269 -1488 175 1397 -1524 -113 1640 -1298 -485 1583 -1045 -594 1632
1811 1632 -964 -868 1761 -614 -1150 1532 -375 -1186 1553 -202 -1451 1507 201 -1605 1127 451
1827 451 -1488 1046 587 -1660 863 973 -1609 495 1085 -1486 379 1232 -1516 114 1535 -1286
1843 -1286 -294 1421 -1104 -340 1516 -1094 -647 1687 -773 -983 1473 -545 -985 1509 -467 -1281
1859a281K813j560j389K651j068j549K567q83j849K651l35k338K252J71k294K042
1875F01L89k528J906R47k715J361J350k495J029J539k577P28K042k429J09K189
1891A446k103j57K236k031m20K586j775j037K547j307j269K496j077j571K565
1906A129o60j942K318k29k012K149k0k276K096N13k501J701R17k468J333J186
1922A234k472J060J616k436N68J815k224K51K023k156j36K311j875o27K395j524
1938a77r42K362j305j257K444q92j578K342n65j822K215k40k032K103J85k199
1954a358J813N25k297J586Q49k379J290J186k364R92J495k316O18J744k256J96
1970f76K019j961j55K109j776n04K242j551q79K337j180j239K291q47j512K247
$$ plain form
1859 -1281 1532 -28 -1417 1234 166 -1383 1184 301 -1548 1103 768 -1570 682 853 -1441 601
1875 601 990 -1538 368 1315 -1400 -39 1311 -1184 -155 1384 -1193 -465 1577 -852 -743 1446
1891 1446 -657 -814 1422 -609 -1029 1557 -218 -1255 1292 -15 -1284 1212 135 -1436 1129
1906 1129 469 -1473 845 616 -1396 753 733 -1543 553 1066 -1435 266 1183 -1285 48 1234
1922 1234 -1238 -178 1438 -998 -430 1385 -839 -588 1435 -721 -857 1454 -421 -1048 1347 -177
1938 -177 -1119 1243 -62 -1319 1125 233 -1345 997 432 -1390 825 585 -1447 656 841 -1358
1954 -1358 455 980 -1317 269 1118 -1261 29 1215 -1149 -157 1338 -978 -360 1384 -872 -676
1970 -676 1343 -618 -773 1336 -440 -944 1298 -253 -1132 1205 25 -1214 1077 230 -1282 965
1986I65m97j810K074j24j952J930K34k105J702N49k266J436R12k221J176J196
2002A199k272Q59J474k202N10J718k055J74J914j918j65K099j710n60K149j417
2018b03q74K242j123j155K190q39j486K117m47j727K040o7j961J787L04k021J533
2035C10O01k124J333R26k165J032J255k129P01J445k110M20J805j947K0J882j739
2052d84k65J929j578n14K131j369r14K138j018j142K086p82j454K082l92j699
2068a245J900rj784J680J71j978J598O38k088J201R52k025R06J137k034O81J504
2085A205j995K33J693j720oJ760j693l09K005j446p13K044j073r33J943r66j154
2102a125K049o07j462J889k72j583J768p5j786J691L38j975J331O86j854J156
$$ plain form
1986 965 468 -1342 732 608 -1344 586 820 -1285 417 966 -1300 136 1048 -1173 3 1199
2002 1199 -1073 -214 1260 -942 -432 1286 -769 -595 1319 -599 -764 1335 -375 -935 1214 -203
2018 -203 -1077 1165 42 -1113 1077 238 -1248 869 422 -1305 735 668 -1293 494 798 -1223 310
2035 310 911 -1213 120 1046 -1119 -87 1168 -961 -260 1185 -925 -505 1300 -647 -627 1255 -484
2052 -484 -749 1180 -398 -912 1219 -150 -1064 1074 56 -1086 1000 218 -1236 846 454 -1245
2068 -1245 655 646 -1138 542 713 -1265 333 971 -1117 84 1036 -989 -83 1054 -980 -299 1205
2085 1205 -790 -557 1136 -584 -590 1170 -523 -832 1173 -273 -986 1058 -15 -948 995 29 -1125
2102 -1125 924 317 -1145 744 472 -1111 657 582 -1204 487 825 -1150 181 867 -987 169
2118A69Q06k020R25J213k003N33J459j768K64J540j761l7J832j516m57J847j218
2135a92o52J879j108r48K001p90j298J835m18j324J761k65j631J702J23j797J434
2152C12M28j722J280N78j955J116J014j919O87J166j746N35J286j789K82J603
2168A156j661j92J688j380l11J774j294p11J902r54j041J789o06j108J745n13
2184B83j401J777p2j647J466K12j623J363M21j800J193P96j857Q01R61j677P31
2201g3J097j805M56J441j706L6J533j414j42J603j391m11J797j131p51J694q61
2218b8q78J732o97j135J779l55j449J515j1j447J425J97j642J290N01j744J021
2235G4P59j679Q29R46j748O05J251j640K05J356j482K9J468j404j85J654j260
$$ plain form
2118 169 975 -1045 -120 1093 -910 -377 1082 -686 -422 1118 -643 -680 1152 -364 -821 1026 -192
2135 -192 -844 1035 -73 -1021 980 190 -1108 727 309 -1015 746 481 -1150 552 675 -1122 312
2152 312 740 -982 298 876 -1079 37 1051 -868 -181 985 -761 -226 1060 -729 -447 1156
2168 1156 -505 -697 991 -389 -700 1074 -220 -931 971 17 -1024 765 159 -949 796 283
2184 283 -1118 659 587 -1060 406 618 -1005 358 779 -1021 172 968 -889 -88 873 -804 -73
2201 -73 1024 -781 -325 1116 -590 -554 979 -435 -577 1026 -365 -776 1021 -110 -861 833 -28
2218 -28 -906 826 129 -1006 773 418 -1031 484 473 -974 451 648 -994 296 797 -947 74
2235 74 833 -846 -17 929 -819 -214 1037 -603 -398 958 -524 -495 973 -431 -616 1038 -222
2252b22n45J657j016p12J701q28r37J673n73j151J571k93j301J492o9j449J400
2269C98K43j570J179M82j649R77P45j606P51R90j612M42J160j541K33J351j452
2286d79n9J488j283l10J566j098n78J570r13p42J614o79r49J580m97j188J500
2303E43j84j291J391M6j409J258K44j495J108N00j561R08P25j555P13R58j560
2320f61M13J117j439J64J288j312m5J399j230l41J479j019n43J542q34p91J547
2337G34n88j012J465l18j144J362j45j250J348J01j428J152L17j458J006N40j482
2354h00Q50P69j521N49R41j401L88J058j395K01J283j314j05J351j107l34J395
2371H08r98n16J511p65p90J404n38r19J394l78j103J417p8j327J190K00j303J033
$$ plain form
2252 -222 -767 890 -126 -838 863 35 -902 771 198 -953 618 325 -976 516 447 -1002 398
2269 398 641 -929 250 732 -917 60 805 -801 -50 940 -672 -230 930 -611 -378 973 -479
2286 -479 -538 950 -333 -643 923 -175 -753 817 -96 -838 776 97 -852 728 231 -957 543
2303 543 359 -932 459 505 -904 354 598 -897 211 711 -850 58 783 -772 -59 899 -661
2320 -661 -248 869 -570 -406 882 -430 -475 924 -306 -647 832 -187 -730 812 -22 -813 734
2337 734 146 -866 599 281 -863 499 354 -896 452 553 -875 277 594 -864 142 682 -800
2354 -800 50 819 -702 -153 788 -613 -225 833 -562 -361 922 -392 -497 854 -253 -587 808
2371 808 -190 -706 805 40 -750 654 116 -803 591 213 -890 527 449 -878 312 512 -791 242
2389B42L29j402R52O20j467O92P97j390N03Q95j414L76J167j340M7J202j162j14
2407d67J258j102k76J411r23o00J392o79p16J355n67r22J397k73j106J245l0j153
2425g56J114Q1j299J093M35j410Q09O30j356O34P48j367M76R85j324K04J076j179
2443d06N4J158j182j61J337r65m49J323p64n63J287o93p37J383m37r37J260k49
2461B59j014J203q6j200J119K42j282Q97M02j228Q11N22j370O44Q19j312L73R41
2479G40j197J99J038j204k6J236j006k87J209q62l85J263p89o30J355n57q22J230
2497E05l32q69J208k20j090J154N4j145R73K06j127Q97L36j293P74O48j283M93
2515a11P66j172L73Q75j204J81J048j098o9J104r36k09J192q83m80J280o37o76
$$ plain form
2389 242 571 -831 121 741 -726 -34 763 -627 -124 771 -643 -267 900 -440 -393 809 -353 -467
2407 -467 791 -311 -587 824 -99 -699 693 14 -702 653 86 -836 561 288 -818 427 397 -756
2425 -756 358 439 -860 233 668 -742 67 697 -659 -25 723 -644 -168 817 -507 -303 773 -406
2443 -406 -352 806 -376 -537 800 -165 -614 709 -55 -618 669 -24 -761 622 185 -752 508 259
2461 259 -755 448 362 -838 281 523 -759 138 540 -688 123 645 -725 -81 738 -574 -201 740
2479 740 -457 -258 780 -424 -450 786 -220 -507 702 -160 -545 718 -71 -701 654 97 -725 505
2497 505 173 -696 512 292 -798 356 410 -735 238 444 -683 214 550 -743 31 679 -604 -111
2515 -111 655 -517 -144 731 -473 -292 756 -342 -411 693 -243 -452 740 -143 -623 657 20 -656
2533f56J197m32p62J187l52r35J175o5j081J015J06j082R39K52j209Q32M66j225
2551f30N97O25j148M92P30j198L30R03j130R2J014r95o9J075r08k66J161p67m67
2570e59J167o11o07J180m57p78J158k60r39J081m9j013R86J18j097Q69L10j156
2588f57P31N08j184N75O49j154M03P82j115K33Q88j032M9R84r41r3J051q88k88
2607d99J146p41m75J146n53n94J087m19p36J097k44q79J013l3r68R35J27j076
2625f66Q31L49j140O57N21j089N14O27j105L68P81j065J57R04r62pR77r20j63
2644d31J076p74l93J082o16m72J072n44n95J099l69p83J027j30q59R36or57Q83
2663B46J74j043P49L30j027O44M54j095N20O63j066K57P86r64J33Q62r48k3J002
$$ plain form
2533 -656 541 109 -653 534 182 -753 422 357 -724 291 397 -685 254 506 -703 129 595 -630
2551 -630 -33 592 -556 -64 666 -532 -202 701 -429 -337 677 -318 -387 688 -220 -486 675 -92 -559
2570 -559 608 -3 -610 570 113 -665 493 233 -706 375 326 -687 299 417 -680 189 499 -657
2588 -657 74 582 -602 -27 622 -532 -129 653 -462 -229 659 -373 -324 660 -281 -374 677 -211 -499
2607 -499 647 -94 -569 577 24 -570 517 98 -638 459 215 -664 349 316 -652 283 410 -666
2625 -666 165 514 -626 31 552 -537 -23 604 -501 -133 648 -417 -260 644 -318 -325 652 -268 -431
2644 -431 645 -129 -522 560 -56 -528 544 0 -595 504 135 -648 379 249 -610 326 320 -637 246
2663 246 420 -623 126 456 -571 73 527 -568 -48 615 -451 -194 592 -372 -239 623 -325 -348 654
2682F54q37k61J016o81l43J044o44n12J111m40p06J004k47p37R49j50q68R50N6
$$ plain form
2682 654 -183 -444 572 -109 -452 592 -52 -564 547 107 -599 405 158 -579 370 220 -648 302 358
$$ [...]
8191a3
##END NTUPLES=NMR FID
##END=
