##TITLE=1H_LY-16Dix.2.B
 CD3CN, 8 sc, 
 2.06.2021
##JCAMPDX= 6.0         $$ Bruker NMR JCAMP-DX V2.0
##DATA TYPE= NMR FID
##DATA CLASS= NTUPLES
##ORIGIN= UXNMR, Bruker Analytische Messtechnik GmbH
##OWNER= root
$$ XWIN-NMR		Version 3.5
$$ Wed Jun  2 09:57:27 2021 Russian Standard Time (UT+4h)  she@DPX200
##.OBSERVE FREQUENCY= 200.131506
##.OBSERVE NUCLEUS= ^1H
##.DELAY= (6, 6)
##.ACQUISITION MODE= SIMULTANEOUS
##.ACQUISITION SCHEME= undefined
##.AVERAGES= 8
##.DIGITISER RES= 18
##SPECTROMETER/DATA SYSTEM= spect
##.PULSE SEQUENCE= zg30
##.SOLVENT NAME= CDCl3
##.SHIFT REFERENCE= (INTERNAL, CDCl3, 0, 15.7039)
##AUDIT TRAIL= $$ (NUMBER, WHEN, WHO, WHERE, WHAT)
$$ ##TITLE= Audit trail, XWIN-NMR		Version 3.5
$$ ##JCAMPDX= 5.01
$$ ##ORIGIN= Bruker BioSpin GmbH
$$ ##OWNER= she
$$ F:/spectra/data/she/nmr/H-F/1/audita.txt
$$ ##AUDIT TRAIL=  $$ (NUMBER, WHEN, WHO, WHERE, WHAT)
(   1,<2021-06-02 09:56:09.57 +0400>,<she>,<DPX200>,
      <created by zg, POWCHK disabled, PULCHK disabled
       configuration hash MD5:
       00 E9 B6 7A A2 85 ED C7 34 08 36 98 17 FE 4E 26
       data hash MD5: 16K
       62 A2 DD 65 14 3F 7D E6 DC 2E 02 B1 9C 8A 44 0A>)
$$ ##END=
$$ 
$$ hash MD5
$$ E2 D6 73 89 6B FB 32 AA 7C 62 81 45 F7 B2 26 E5
##$RELAX= 
##$RELAX= 
##$RELAX= 
##$RELAX= 
##$RELAX= 
##$RELAX= 
$$ Bruker specific parameters
$$ --------------------------
##$DU= <F:/spectra>
##$EXPNO= 1
##$NAME= <H-F>
##$PROCNO= 1
##$TYPE= <nmr>
##$USER= <she>
##$AMP= (0..31)
100 100 100 100 100 100 100 100 100 100 100 100 100 100 100 100 100 100 
100 100 100 100 100 100 100 100 100 100 100 100 100 100 
##$AQSEQ= 0
##$AQ_mod= 1
##$AUNM= <au_zg>
##$AUTOPOS= <>
##$BF1= 200.13
##$BF2= 200.13
##$BF3= 200.13
##$BF4= 200.13
##$BF5= 200.13
##$BF6= 200.13
##$BF7= 200.13
##$BF8= 200.13
##$BYTORDA= 1
##$CFDGTYP= 0
##$CFRGTYP= 5
##$CHEMSTR= <none>
##$CNST= (0..31)
1 1 145 1 1 1 1 1 1 1 1 1 1 1 1 1 1 1 1 1 1 1 1 1 1 1 1 1 1 1 1 1 
##$CPDPRG= <>
##$CPDPRG1= <>
##$CPDPRG2= <>
##$CPDPRG3= <>
##$CPDPRG4= <mlev>
##$CPDPRG5= <mlev>
##$CPDPRG6= <mlev>
##$CPDPRG7= <mlev>
##$CPDPRG8= <mlev>
##$CPDPRGB= <>
##$CPDPRGT= <>
##$D= (0..31)
0 1.2 0 0 0 0 0 0 0 0.06 0 0.03 0 0 0 0 0.0002 0 0 0 0 0 0 0 0 0 0 0 0 
0 0 0 
##$DATE= 1622613369
##$DBL= (0..7)
120 120 120 120 120 120 120 120 
##$DBP= (0..7)
150 150 150 150 150 150 150 150 
##$DBP07= 0
##$DBPNAM0= <>
##$DBPNAM1= <>
##$DBPNAM2= <>
##$DBPNAM3= <>
##$DBPNAM4= <>
##$DBPNAM5= <>
##$DBPNAM6= <>
##$DBPNAM7= <>
##$DBPOAL= (0..7)
0.5 0.5 0.5 0.5 0.5 0.5 0.5 0.5 
##$DBPOFFS= (0..7)
0 0 0 0 0 0 0 0 
##$DE= 6
##$DECBNUC= <off>
##$DECIM= 32
##$DECNUC= <off>
##$DECSTAT= 4
##$DIGMOD= 1
##$DIGTYP= 9
##$DL= (0..7)
0 120 120 120 120 120 120 120 
##$DP= (0..7)
150 150 150 150 150 150 150 150 
##$DP07= 0
##$DPNAME0= <>
##$DPNAME1= <>
##$DPNAME2= <>
##$DPNAME3= <>
##$DPNAME4= <>
##$DPNAME5= <>
##$DPNAME6= <>
##$DPNAME7= <>
##$DPOAL= (0..7)
0.5 0.5 0.5 0.5 0.5 0.5 0.5 0.5 
##$DPOFFS= (0..7)
0 0 0 0 0 0 0 0 
##$DQDMODE= 0
##$DR= 18
##$DS= 0
##$DSLIST= <SSSSSSSSSSSSSSS>
$$ [...]
##$SUBNAM2= <"">
##$SUBNAM3= <"">
##$SUBNAM4= <"">
##$SUBNAM5= <"">
##$SUBNAM6= <"">
##$SUBNAM7= <"">
##$SUBNAM8= <"">
##$SUBNAM9= <"">
##$SW= 16.9725357007746
##$SWIBOX= (0..15)
0 0 2 0 0 0 0 0 0 0 0 0 0 0 0 0 
##$SW_h= 3396.73913043478
##$TD= 16384
##$TD0= 1
##$TE= 0
##$TE2= 300
##$TE3= 300
##$TEG= 300
##$TL= (0..7)
0 120 120 120 120 120 120 120 
##$TP= (0..7)
150 150 150 150 150 150 150 150 
##$TP07= 0
##$TPNAME0= <>
##$TPNAME1= <>
##$TPNAME2= <>
##$TPNAME3= <>
##$TPNAME4= <>
##$TPNAME5= <>
##$TPNAME6= <>
##$TPNAME7= <>
##$TPOAL= (0..7)
0.5 0.5 0.5 0.5 0.5 0.5 0.5 0.5 
##$TPOFFS= (0..7)
0 0 0 0 0 0 0 0 
##$TUNHIN= 0
##$TUNHOUT= 0
##$TUNXOUT= 0
##$USERA1= <user>
##$USERA2= <user>
##$USERA3= <user>
##$USERA4= <user>
##$USERA5= <user>
##$V9= 5
##$VALIST= <valist>
##$VCLIST= <CCCCCCCCCCCCCCC>
##$VD= 0
##$VDLIST= <DDDDDDDDDDDDDDD>
##$VPLIST= <PPPPPPPPPPPPPPP>
##$VTLIST= <TTTTTTTTTTTTTTT>
##$WBST= 1024
##$WBSW= 4
##$XGAIN= (0..3)
0 0 0 0 
##$XL= 0
##$YL= 0
##$YMAX_a= 77055
##$YMIN_a= -69426
##$ZGOPTNS= <>
##$ZL1= 120
##$ZL2= 120
##$ZL3= 120
##$ZL4= 120
##$ABSF1= 10
##$ABSF2= 0
##$ABSG= 5
##$ABSL= 3
##$ALPHA= 0
##$AQORDER= 0
##$ASSFAC= 0
##$ASSFACI= 0
##$ASSFACX= 0
##$ASSWID= 0
##$AUNMP= <proc_1d>
##$AZFE= 0.1
##$AZFW= 0.1
##$BCFW= 1
##$BC_mod= 2
##$BYTORDP= 1
##$COROFFS= 0
##$CY= 11.3945322036743
##$DATMOD= 1
##$DC= 2
##$DFILT= <>
##$DTYPP= 0
##$F1P= 15.9154993809931
##$F2P= -4.1035820241983
##$FCOR= 0.5
##$FTSIZE= 0
##$FT_mod= 4
##$GAMMA= 1
##$GB= 0.15
##$INTBC= 1
##$INTSCL= 1
##$ISEN= 128
##$LB= 0.24
##$LEV0= 0
##$LPBIN= 0
##$MAXI= 10000
##$MC2= 0
##$MEAN= 0
##$ME_mod= 0
##$MI= 1.114404
##$NCOEF= 0
##$NC_proc= 0
##$NLEV= 6
##$NOISF1= 3.799351
##$NOISF2= 2.8
##$NSP= 1
##$NTH_PI= 0
##$NZP= 0
##$OFFSET= 15.70392
##$PC= 1
##$PHC0= -11568.7
##$PHC1= 19.40099
##$PH_mod= 1
##$PKNL= yes
##$PPARMOD= 0
##$PSCAL= 0
##$PSIGN= 0
##$REVERSE= no
##$SF= 200.130013532006
##$SI= 16384
##$SIGF1= 3
##$SIGF2= 2
##$SINO= 400
##$SIOLD= 16384
##$SREGLST= <1H.CDCl3>
##$SSB= 0
##$STSI= 0
##$STSR= 0
##$SW_p= 3612.71676300578
##$SYMM= 0
##$S_DEV= 0
##$TDeff= 0
##$TDoff= 0
##$TI= <>
##$TILT= no
##$TM1= 0
##$TM2= 0
##$TOPLEV= 0
##$USERP1= <user>
##$USERP2= <user>
##$USERP3= <user>
##$USERP4= <user>
##$USERP5= <user>
##$WDW= 1
##$XDIM= 8192
##$YMAX_p= 0
##$YMIN_p= 0
$$ End of Bruker specific parameters
$$ ---------------------------------
##NTUPLES= NMR FID
##VAR_NAME=  TIME,          FID/REAL,        FID/IMAG
##SYMBOL=    X,             R,               I
##VAR_TYPE=  INDEPENDENT,   DEPENDENT,       DEPENDENT
##VAR_FORM=  AFFN,          ASDF,            ASDF
##VAR_DIM=   8192,          8192,            8192
##UNITS=     SECONDS,       ARBITRARY UNITS, ARBITRARY UNITS
##FACTOR=    0.0002944,     1,               1
##FIRST=     0,             0,               0
##LAST=      2.4114304,     0,               0
##MIN=       0,             -69426,          0
##MAX=       2.4114304,     77055,           0
$$ Real data points
##PAGE= N=1
##DATA TABLE= (X++(R..R)), XYDATA
0@%%%%%%%%%%%%%%%%qJ6j6J6j6J8k6L2l4M2m9N7o6P5q9J03j15J28j47J68j88K11
38A12k36K63k94L28l64M04m47M92n44O02o64P33q07Q88r79J080j191J315j456
57g65J614j798K013k266K571k942L410m025M866o090Q063j1905L1132p7872K7424
72b6570J02579j21729K3708Q1504r5763J1867R2025j06442L029J05616r4068k6491
84e0735J18360p8799m6781J15765n2352o2928J04892l9645o3811J00839l1457
95A3348p6980J06645j1620r7006R0110J5308r7694P2851K6244r5256O4586L7352
107D7888j01107N3544N3512j01036L7223O6385r7862K0657P9262q7812J437Q2195
119E4286p6746r914Q4496p0348k0910R3367o0198m0891R2995m2300n1869Q7187
$$ plain form
0 0 0 0 0 0 0 0 0 0 0 0 0 0 0 0 0 0 -8 8 -8 8 -8 10 -16 16 -18 24 -25 32 -34 41 -48 55 -60 68 -79 89 -99 112
38 112 -124 139 -155 173 -191 213 -234 258 -286 316 -348 385 -422 466 -513 567 -624 691 -765
57 -765 849 -949 1064 -1202 1369 -1573 1837 -2188 2678 -3412 4651 -7254 23878 -53994 -26570
72 -26570 76009 -45720 -22012 59492 -36271 -24404 67621 -38821 -35792 69824 -24244 -50735
84 -50735 67625 -11174 -57955 57810 5458 -57470 47422 7777 -56034 44805 13348
95 13348 -63632 43013 31393 -65613 24497 39805 -57889 14962 41206 -54050 10536 47888
107 47888 -53219 325 53837 -47199 -9976 56409 -41453 -20796 58466 -29346 -27909 54286
119 54286 -22460 -32374 52122 -18226 -39136 54231 -5967 -46858 46137 3837 -48032 39155
131C9155k9107n9114Q3349j6670o7911P7645k112p4566O9133J0913q0004O0128
143A0839K6844q0897M6549L6572p9197L6144M4941p8564K6602N7073p6268J0592
155a8770O4812o8267k001O9095o1057j3517P2884n2524k4848P4896m2646l5465
167c7408P4361l3026m6042P3445j8935n3967O7353p941n9621O1543K598o4295
179d1935N5906J4849o8027M5829K5369o7579L6558L3907o7035K6410M2110o4042
191b7680J6620M9063o0370O379N4402n6733m705O0463m8451j5406O1869m0546
203e095k4508O1848l2676l2049O2151k4132m0143O0449j4736m7045N7594m547
215A7111n3356N1715N613n6411M5660J5275n8176L7929K2969n9355K9958L1357
$$ plain form
131 39155 10048 -49066 34283 17613 -50298 27347 25235 -49331 19802 30715 -49289 10839
143 10839 37683 -43214 3335 39907 -39290 -3146 41795 -36769 -10167 46906 -29362 -18770
155 -18770 46042 -22225 -24226 44869 -16188 -29705 43179 -9345 -34193 40703 -1943 -37408
167 -37408 36953 3927 -42115 31330 12395 -41572 25781 17840 -41781 19762 22360 -41935
179 -41935 13971 28820 -39207 6622 31991 -35588 970 34877 -32158 -5748 36362 -27680
191 -27680 -11060 38003 -22367 -15988 38414 -18319 -23024 37439 -11012 -26418 35451 -5095
203 -5095 -29603 32245 -431 -32480 29671 5539 -34604 25845 11109 -35936 21658 17111
215 17111 -36245 15470 21083 -35328 10332 25607 -32569 5360 28329 -31026 -1068 30289
227C0289n7780K1955L8264n6312J2293M4434n2202L090M8996m7218o128N2248
239C1929m0809j4635N4010l3750k2817N3494k6934k9366N4183j8609l6824N1687
251B1559r978m2660M7670j462m6192M4044O856n0377L8028J5723n1525L1261K2534
264B5481n2231K4726K9974n1715J6708L6820m8710P801M0235m5474R12M5349m1019
277a1143q146M7938l4658j6127M8216k8320k2274M8956k1579k9706M7344j2884
289G617l4082M3939o778l8411M1628J084m2721L7038R769m4314L0596J5261m5535
302b4909K6081K2774m6225J8661K9024m4222J1531L3000m2256N441L7965l9656
314a2791k873M1288l3938r118M2399l0199j5682M4391k4179k2741M4065j6405
$$ plain form
227 30289 -27491 -5536 32728 -23584 -11291 33143 -19059 -15969 33027 -14191 -20319 31929
239 31929 -8880 -23515 30495 -3255 -26072 27422 488 -28878 25305 6696 -30128 21559
251 21559 11581 -31079 16591 15129 -31063 12981 19837 -30540 7488 23211 -28314 2947 25481
264 25481 -26750 -2024 27950 -23765 -7057 29763 -18947 -11146 29089 -16385 -15473 29876 -11143
277 -11143 -19289 28649 -6009 -22136 26080 -2240 -24514 24442 2863 -26843 20501 7617
289 7617 -26465 17474 10696 -27715 13913 14997 -27724 9314 19083 -25231 5365 20626 -24909
302 -24909 1172 23946 -22279 -3618 25406 -18816 -7285 25715 -16541 -11100 26865 -12791
314 -12791 -15664 25624 -8314 -17432 24967 -5232 -20914 23477 -702 -23443 20622 4217
326D217k7469M1294j1256l1829M0204l680l6224L5614L412l7557L1340Q441l9775
339b3268K7764J5620m1802K0617K2206l9371J4867K5643l9005R232L0774l6874
351a3597K154L4150l2496l093L5595l0658q829L9444k5673j6452L9266j9172k0552
364a9913L8226j4914k5189L8217q654l0500L4700j780l1603L1885K285l5063K9262
377F959R349l7492K3202J5716l5882J8105J8823l6281J3803K4685l5290O551K8060
390B0308l1537J782K9964k9801l203L3611k6441j0537L4309k0564j4195L4183
402A7879j7469j9104L5148j2079k4618L3180n708k6741L0765j885k9955K9332
414H745M427l2967K4429J0024l2807K0512J3901l3676J6891J9279l4021J0455
$$ plain form
326 4217 -23252 18042 6786 -25043 15161 11481 -24743 10871 14283 -23274 8066 16507 -23268
339 -23268 4496 20116 -21686 -1069 21137 -18234 -3367 22276 -16729 -7497 23277 -13597
351 -13597 -11443 22707 -9789 -12882 22713 -7945 -16774 22670 -3003 -19455 19811 639 -19913
364 -19913 18313 3399 -21790 16427 7773 -22727 11973 10193 -21410 10475 12760 -22303 6959
377 6959 16308 -21184 2018 17734 -18148 -43 18780 -17501 -3698 20987 -14303 -7752 20308
390 20308 -11229 -9447 20517 -9284 -12487 21124 -5317 -15854 18455 -2109 -16304 17879
402 17879 410 -18694 16454 4375 -20243 12937 7229 -19512 11253 9368 -20587 8745
414 8745 13172 -19795 4634 14658 -18149 2363 16264 -17412 -521 18758 -15263 -4808
426d808K3334l1085N937K5650k9648J148K8832k6899m911L0377k2409r228L0730
439A7020j9145j3644L1883j4498j8650L0690r567k1627K9498n312k4789K8122
451I981j36k7877K4649M860k8695K1780Q869l0139J8473J3666l0780J3930J7731
464A6312k9958R736K1077k9187N157K4812k6965l87K6644k3814m831K8006k0558
477c956r170K8983j6770j3639K8688j2696j7081K8434q445k0898K7013l323k3553
490a6413K4298J166k5042K1615N173k6451J8808R589k7181J5159J3251k7417J1516
503a929J7083k6969P300K0490k5538K586K2854k3331j607K4736k0800n848K5989
516A5016j7765r831K6695j4344j3789K6620j0318j7246K5699n883k0011K3972
$$ plain form
426 -4808 18526 -12559 -6622 19028 -10620 -9472 19360 -7539 -12450 17927 -4482 -13710 17020
439 17020 -2125 -15769 16114 1616 -17034 13656 4089 -17538 11960 6648 -18141 9981
451 9981 9845 -18032 6617 11477 -17218 4562 13431 -16708 1765 15431 -15349 -1419 16312
464 16312 -13646 -3910 17167 -12020 -6863 17949 -9016 -9403 17241 -6573 -11404 16602 -3956
477 -3956 -13126 15857 -913 -14552 14136 1440 -15641 12793 4348 -16550 10463 7140 -16413
490 -16413 7885 9051 -15991 5624 10797 -15654 3154 12743 -14438 721 13972 -13445 -1929
503 -1929 15154 -11815 -4515 15975 -9563 -6977 15877 -7454 -9061 15675 -5125 -10973 15016
516 15016 -2749 -12580 14115 -229 -14018 12602 2284 -14962 10737 4854 -15157 8815
528H815j698k2352K1631K690k3717J8864O626k4741J5759J0508k5090J2056J4000
541A3351k4461Q307J6729k3640M673J9626k2275K74K1634j9816l460K2862j7555
554c751o993K4202j4699j1143K4291j0856j3961K3656p907j6704K3379m047j9817
567a4350K1487L41k1168J9011L422k2365J7099P315k3599J3524J0978k2919J0179
580a045J3281k2569P303J6377k1848K974J8585j9438l31J9540j7973l334K1523
593A3045j5760p634K2032j2088j0349K1447r788j2831K1857o540j6178K0546k598
606E161j7543J8868k56j9220J8132L464k1418J5227P465k1288J2173R778k1399
619a0856R834J2963k1308N962J5402j9558L069J6710j8824J85J9202j7072m209
$$ plain form
528 8815 7117 -15235 6396 9086 -14631 4233 10859 -13882 1877 12385 -12705 -649 13351
541 13351 -11110 -2803 13926 -9714 -5041 14585 -7690 -7416 14218 -5598 -9058 13804 -3751
554 -3751 -10744 13458 -1241 -12384 11907 1051 -12910 10746 2839 -13865 9514 5467 -14350
567 -14350 7137 7478 -13690 5321 8743 -13622 3477 10792 -12807 717 11695 -11224 -1045
580 -1045 12236 -10333 -3030 13347 -8501 -5527 13058 -6380 -6711 12829 -5144 -8478 13045
593 13045 -2715 -10349 11683 -405 -10754 10693 905 -11926 9931 3391 -12787 7759 5161
606 5161 -12382 6486 6230 -12990 5142 8606 -12812 2415 9880 -11408 765 10543 -10856
619 -10856 -1022 11941 -9367 -3405 11997 -7561 -4492 12218 -6606 -6421 12781 -4291 -8500
632h500K0101j3629p013J9797j1501r595K0448q499j2836J9476n040j4354J8402
645G257k798j6415J7930Q22j8638J5362M387j8770J3101O653j9580J1130R956
658A0397j9907P711J2442j8800N252J4122j8671K471J6871j7154j508J7754j4587
671c607l862J8266j3142o729J9499j0206j0222J8652o964j1716J8008m850j4054
684a0927J7547j295j6085J5199J756j6309J3616L758j7718J2068P402j8290Q701
697e77R721j7382O609J1382j7493M269J4121j6511O91J5156j4581j244J6151j3797
711c485m118J7816j1332p505J7465q557r075J7218o946j1527J7452l591j3878
724a0063J5527o58j4539J4141J419j5892J2918M778j6792R917P159j6204Q052
$$ plain form
632 -8500 11601 -2028 -9041 10756 -745 -10340 10108 1609 -11227 8249 3209 -11145 7257
645 7257 4459 -11956 5974 6796 -11842 3520 7907 -10863 2238 8891 -10689 441 10397
658 10397 -9510 -1799 10643 -8157 -2905 11217 -7454 -4983 11888 -5266 -6774 10980 -3607
671 -3607 -7469 10797 -2345 -9074 10425 219 -10003 8649 1685 -10031 7977 3127 -10927
684 -10927 6620 5325 -10760 4439 6195 -10114 3502 7260 -10458 1610 9012 -9278 -577
697 -577 9144 -8238 -1629 9753 -7740 -3471 10650 -5861 -5170 9986 -4595 -5839 10312 -3485
711 -3485 -7603 10213 -1119 -8624 8841 284 -8791 8427 1481 -10046 7406 3815 -10063
724 -10063 5464 4806 -9733 4408 5827 -10065 2853 7631 -9161 756 7915 -8289 -237
737b37Q887j6530N911J1553j5982K679J3044j4298M19J3890j3477j936J5435j1608
751b250m756J5628r657o676J5926q096q959J6466n399j1443J5294k677j2484J4218
765E135o39j3784J3241J902j4857J1519M295j5253R764O276j5794P800Q839j5393
779f949N092J0517j4507K682J1703j3486N78J3039j2260j854J3810j0795l969
792f399J4516r172o300J4765p005q285J4504m765r886J3799k901j1370J3222n60
806D163j2571J2164J629j3692J0680L850j4213R075N945j4412P149P859j4249
819f623N081R588j3723K846J0947j2890P45J2327j1633j681J2961j0111l801J3295
833G328q382n492J3604o686p618J3345m526r133J2792k541j0538J2075l24j1672
$$ plain form
737 -237 8650 -7880 -1969 9584 -6398 -3719 9325 -4973 -4554 9336 -4141 -6077 9358 -2250
751 -2250 -7006 8622 -1035 -7711 8215 119 -8840 7626 2227 -9216 6078 3401 -9083 5135
765 5135 4496 -9288 3953 5855 -9002 2517 6812 -8441 1323 7599 -8195 -395 8444 -6949
779 -6949 -1857 8660 -5847 -3165 8538 -4948 -4370 8669 -3591 -5445 8365 -2430 -6399
792 -6399 8117 -1055 -7355 7410 405 -7880 6624 1859 -8027 5772 2871 -8499 4723 4163
806 4163 -8408 3756 5385 -8307 2373 6223 -7990 1085 7030 -7382 -233 7626 -6623
819 -6623 -1542 8046 -5677 -2831 8116 -4774 -4029 8298 -3335 -5016 7945 -2166 -5967 7328
833 7328 -1054 -6546 7058 372 -7246 6099 1573 -7560 5232 2691 -7847 4228 3904 -7768
847g768J0864J814j2307R442L430j2905Q382N709j3295O300P439j3019M447Q779
861G312j2661K805J0466j2090L02J1466j0615j508J1917r687l337J2816q071n534
875f419J2845n930p054J2196m568q372J2351k358j0011J1195j94j0751R942J438
889D310j1440R087L603j2168P073N430j1643N635O371j1991M377Q359j1853K135
903b715R850j0633J60J0216j0063j334J1564q747l584J1703p044m930J1558o053
917e2o303J2100m290q415J1422j857r175J0389n37j0218R660J577j0985Q132L547
932D995j0811O673M417j1309N620O635j1279L370Q007j0322J692Q639r861K86
946c248R895r095j887J0418p485l056J0598o859m781J1133n225o498J0887l269
$$ plain form
847 -7768 3096 4910 -7397 2045 5475 -7430 952 6661 -6634 -334 7105 -5914 -1467 7312
861 7312 -5349 -2544 7922 -4168 -3866 7600 -3015 -4523 7394 -2293 -5630 7186 -885 -6419
875 -6419 6426 496 -6558 5638 1070 -7302 5049 2691 -7320 3875 3681 -7070 2872 4310
889 4310 -7130 1957 5560 -6608 465 5895 -5748 -113 6258 -5733 -1356 7003 -4850 -2715
903 -2715 7135 -3498 -3338 6878 -3185 -4519 7045 -1702 -5286 6417 -627 -5557 6001 -52
917 -52 -6355 5745 1455 -6960 4462 2605 -6570 3819 3282 -6936 2724 4301 -6684 1448 4995
932 4995 -5816 857 5274 -6035 -415 6220 -5059 -1689 6318 -4004 -2312 6327 -3534 -3248
946 -3248 6647 -2448 -4335 6083 -1402 -4458 6140 -719 -5500 5633 408 -6090 4797 1528
960A528p417J0237k240q678J0074j96r752Q820J532r999P829K885j0611O655M753
975E420j0782M687O093r991L565P023j0146J839Q444r339j26R126p993j368R437
990E889p459l059J0193n851m753R796m437n566R854l363p001R777j611q336Q715
1005B788L6q518Q282J268r692P234L169r960N667M486r619M701N504j0018L250
1020a422P239r368J232P688q438K61Q440p949j370R411o741l446R233n192m131
1035d553R346m252n687R287k600o839Q572j264p181Q070j34q363P700J758r066
1050e206O203K930q908N323M176r140M252N533r175K594O347q575J829P289q465
1065b993K54Q261p535j571Q674o228k786Q742n343l969R070m007n275Q571k724
$$ plain form
960 1528 -5889 4348 2108 -6570 3504 3308 -6444 2376 3908 -6091 1738 4623 -5988 667 5420
975 5420 -5362 -675 5418 -4573 -1008 6015 -4131 -2292 6152 -3187 -3313 5813 -2180 -3548 5889
990 5889 -1570 -4629 5564 -287 -5040 4756 319 -5247 4607 1244 -5757 4020 2409 -5927 2788
1005 2788 2824 -5694 2588 3856 -5836 1398 4567 -5393 274 4760 -4859 -158 5346 -4672 -1422
1020 -1422 5817 -3551 -2319 5369 -3069 -2808 5632 -2317 -3687 5724 -1017 -4463 4770 -422 -4553
1035 -4553 4793 541 -5146 4141 1541 -5298 3274 2010 -5171 2899 2765 -5598 2102 3860 -5206
1050 -5206 997 3927 -4981 342 4518 -4622 -370 5163 -4012 -1418 4929 -3646 -1817 5472 -2993
1065 -2993 -2739 5522 -2013 -3584 5090 -1138 -3924 4818 -525 -4494 4576 569 -4706 3865 1141
1080A141o258Q329j301p026P860J60p947O665J646q137N850K914q426M801M079
1095D350q518L640N248q366K329O122q006J141P107p378l04P603o774j667Q121
1110D648n703k753Q458m842m149Q470l626n184Q275k289o041P770j113o751P345
1125B515K55p563O373J571p796N568K813p977M582L872q230L261N030p658K164
1140a220N765p412R40O581o924l93P215o090j582P520n386k608Q022m449m028
1155d049P825l311m785P730k214n638P535j059o737O767L98o921O134J279p482
1170d528N540K645p879M301L856p641L121M616p432K196N788p104N33O230o297
1185b055l89O680n774j380P364n080k964P380l788l686P254l044m701P360j741
$$ plain form
1080 1141 -5117 3212 1911 -5115 2745 2905 -5042 1623 3269 -4868 982 3896 -4530 271 4350
1095 4350 -4168 -528 4720 -3646 -1317 4805 -3201 -2060 5047 -2331 -2635 4968 -1806 -3473 4648
1110 4648 -1055 -3808 4650 -192 -4341 4129 503 -4681 3594 1305 -4736 3034 1921 -4830 2515
1125 2515 2770 -4793 1580 3151 -4645 923 3736 -4241 341 4213 -4017 -756 4274 -3384 -1220
1140 -1220 4545 -2867 -1927 4654 -2270 -2663 4552 -1538 -3120 4400 -986 -3594 4428 -21 -4049
1155 -4049 3776 465 -4320 3410 1196 -4442 3093 2034 -4703 2064 2462 -4459 1675 2954 -4528
1170 -4528 1012 3657 -4222 79 3935 -3706 -585 4031 -3401 -1205 4583 -2521 -1988 4242 -2055
1185 -2055 -2444 4236 -1538 -2918 4446 -634 -3598 3782 -6 -3692 3562 518 -4183 3177 1436
1200A436n669O706n59o041O178R8o644O137J602p375M817K678p228L999L500p319
1216c684L238M696p314J665N448o518Q02N810o409k22O797n605j735O960m485
1231e56k635O774l867l484P254k589m746O611j454n180O266o82n831O109O34o622
1247c998N070J790o474M391K354o950L803L736p000K536M584o572J566M976o505
1262b693P96O071n932o68O295n119j472O502m589k471O977l595l726O712k380
1277G08m248O419j719n185O281l31n775N503P45n992M818J425o454M291K817o573
1293c270L080L577o342K361M224o393J475N178o049K13N683n344n51N991n051
1308a218j691O444m045k623O449l266l334O435k660m339O502j272n128N795k77
$$ plain form
1200 1436 -4233 2473 1914 -4127 2051 2149 -4495 1642 3244 -4131 686 3364 -3864 135 3635 -3684
1216 -3684 -446 4250 -3064 -1399 4049 -2469 -1667 4143 -2266 -2488 4309 -1296 -3031 3929 -556
1231 -556 -3191 3583 -284 -3768 3486 897 -3849 2762 1308 -3872 2394 1712 -4119 1990 2624 -3998
1247 -3998 1072 2862 -3612 779 3133 -3817 -14 3722 -3278 -742 3842 -2730 -1164 3812 -2693
1262 -2693 -1897 4174 -1758 -2426 3869 -1250 -2722 3780 -809 -3280 3697 102 -3624 3088 708
1277 708 -3540 2879 1160 -4025 2256 1925 -3850 1653 2398 -3594 1224 2649 -3805 486 3303 -3270
1293 -3270 -190 3387 -2955 -594 3630 -2763 -1288 3890 -2159 -1946 3737 -1607 -2158 3833 -1218
1308 -1218 -2909 3535 -510 -3133 3316 50 -3284 3151 491 -3848 2654 1382 -3746 2049 1772
1323A772n451N376O33o029M688J824o197L718K646o046L159L354o400K088M448
1338C583n948R33M992n391R5N348n138q98N892m294j886N900l645k532O193l031
1354A73l560O199j979m383N771r47m739N569k67n464N011Q84n710M310J751n843
1370c224L703K516o102K858L589n948J709M183n529R53M761n195j02N305m732
1385a255j118N547l888j855N703l226k844N715k429l523N596j568m131N372p61
1400A335m704N039J79n206M488J041n468L951J930n577L260K612n724K485L427
1415C068n541J686M079n314P73M547m945j13N053m396j082N257l681j834N370
1430B927l067k650N422k271l442N265j265l902M899o51m417M617K40m834M128
$$ plain form
1323 1772 -3679 1697 2330 -3699 989 2813 -3384 334 2980 -3066 93 3447 -2953 -865 3583
1338 3583 -2365 -1432 3560 -1831 -1736 3612 -1526 -2424 3468 -826 -2712 3188 -457 -2989 3204 173
1354 173 -3387 2812 833 -3550 2221 1274 -3465 2104 1837 -3627 1384 2268 -3442 868 2619 -3224
1370 -3224 479 2995 -3107 -249 3340 -2608 -899 3284 -2245 -1292 3469 -1726 -1828 3477 -1255
1385 -1255 -2373 3174 -714 -2569 3134 -92 -2936 2779 350 -3173 2423 855 -3276 2096 1335
1400 1335 -3369 1670 1849 -3357 1131 2172 -3296 655 2585 -2992 268 2880 -2844 -359 3068
1415 3068 -2473 -787 3292 -2022 -1249 3298 -1647 -1760 3293 -1103 -2185 3072 -609 -2443 2927
1430 2927 -140 -2790 2632 361 -3081 2184 919 -2983 1916 1265 -3152 1465 1705 -3129 999
1445I99J144n057L504J824n238K934K656n296K072L262n006J465L728m933P32
1460a210M324m681k08M766m023r25M945l637j776N206k849k597N064k008l052
1475b661M845j467l635M837n85m309M274L43m463L802J034m809L267J897m928
1490b558K411K549m676J981K936m792J278L746m539L00M116m021k29M313l817
1505a002r49M737l129j940M689k483k228M725k108l004M851j219l742M307l20
1520A185l791L972R9m285L753J058m556K839J835m462K378K296m632J911L074
1535B674m411P99L347l858L66L645l859k73M248l394j219M260k728j530M313k534
1551a54k235M582j663l006M209j001l123M023o68l650M007L22m167L242R67m013
$$ plain form
1445 999 2143 -2914 590 2414 -2824 110 2766 -2530 -458 2804 -2202 -737 2991 -1942 -1210
1460 -1210 3114 -1567 -1775 2991 -1032 -1957 2988 -649 -2425 2781 -68 -2665 2399 391 -2661
1475 -2661 2184 717 -2918 1919 1334 -2975 1299 1642 -2821 981 2015 -2794 473 2370 -2558
1490 -2558 -147 2402 -2274 -293 2643 -2149 -871 2875 -1664 -1364 2752 -1269 -1498 2815 -1002
1505 -1002 -1951 2786 -343 -2283 2406 -77 -2305 2420 312 -2692 2159 940 -2802 1505 1185
1520 1185 -2606 1366 1465 -2820 933 1991 -2565 274 2109 -2353 25 2321 -2311 -400 2674
1535 2674 -1737 -938 2409 -1449 -1083 2562 -1297 -1570 2678 -716 -1935 2325 -403 -1933 2380 -154
1551 -154 -2389 2193 530 -2476 1733 732 -2391 1632 964 -2686 1321 1643 -2524 718 1685 -2328
1567b328K875J415m328K468K210m322J537K750l993J029L085m001L92L744l559
1582a026m97L766k946r41L899k729j565M258k079k325L999j385k598L836r47l105
1598b385L803k02l531L281L94l594L053P82l962K787J558m074K063K106l953J571
1614c03K525l945R84L050l600K30L292l344j59L587l116r30L965k533j589L827
1630A941j877k046L804j456k563L701p01k944L343k29l160L229K69l554K893R85
1646A635l659K316J454l650J944J959l813J444K491l597Q78K719l434L71L099
1661B157l161l32L450k740q69L492k409j270L595j942j967L638j293k372L449
1676A426q01k689L297k10l129K996L85l256K471J000l373K130J465l473J663J960
$$ plain form
1567 -2328 547 1962 -2366 102 2312 -2010 -473 2277 -1716 -687 2398 -1603 -1211 2533 -1026
1582 -1026 -1523 2243 -703 -1644 2255 -474 -2039 2219 140 -2185 1814 429 -2169 1667 720 -2385
1598 -2385 1418 1216 -2315 966 1360 -2234 819 1601 -2361 426 1984 -2090 -27 2079 -1874 -303
1614 -303 2222 -1723 -739 2311 -1289 -1059 2233 -1111 -1270 2317 -799 -1729 2236 -297 -1886 1941
1630 1941 64 -1982 1822 366 -2197 1504 803 -2141 1202 973 -2187 1042 1311 -2243 650 1635
1646 1635 -2024 292 1746 -1904 40 1999 -1814 -370 2121 -1476 -598 2121 -1313 -942 2157
1661 2157 -1004 -1336 2114 -626 -1495 1997 -412 -1682 1913 -29 -1996 1642 349 -2023 1426
1676 1426 625 -2064 1233 1023 -2106 890 1275 -1981 490 1490 -1883 247 1712 -1761 -98 1862
1692A862l426J094K413l341O28K707l067J98K933k822m10L220k521r19L381k195
1708b65j440L422j707j805L393j223k280L296p97k550L123k26k948K893L96l128
1724a846K384Q92l233K031J344l232J591J819l264J104K228l106O84K504k950
1739a050J34K893k732m38K978k234r00L150k120j188L190j660j733L173j164k058
1755a759L104p69k467L008k07k731K597K59k850K439O28l020K116J215l182J572
1771d7J609k989J196J934l018P30K418k829J32K563k437k62K689k295o71K990
1787A713j897j297K935j422j527K886j132j934K917o05k362K645j46k412K456
1802H18J78k735K307P32k889J808J136k811J552J369k927J205J964k854N92K145
$$ plain form
1692 1862 -1564 -470 1943 -1398 -770 1937 -1130 -932 2001 -821 -1231 1989 -532 -1451 1930 -265
1708 -265 -1705 1717 10 -1795 1598 375 -1905 1391 594 -1956 1167 941 -2007 886 1282 -1846
1724 -1846 538 1430 -1803 228 1572 -1660 -69 1750 -1514 -410 1818 -1288 -604 1900 -1050
1739 -1050 -916 1977 -755 -1193 1785 -449 -1349 1801 -319 -1507 1683 23 -1710 1463 299 -1759
1755 -1759 1345 576 -1891 1117 910 -1821 776 1035 -1815 624 1252 -1768 348 1563 -1619 -47
1771 -47 1562 -1427 -231 1703 -1315 -585 1833 -996 -864 1699 -738 -1000 1689 -606 -1277 1713
1787 1713 -184 -1481 1454 32 -1495 1391 259 -1675 1242 637 -1725 920 774 -1638 818
1802 818 996 -1739 568 1300 -1589 219 1355 -1456 96 1465 -1462 -257 1707 -1147 -555 1590
1818A590k592L14K344k536j35K748k179q05K711j701j006K722j547j435K891j020
1834C64j903K578n34k037K486k67k402K437L70k612J910P07k546J746R78k773
1850a498J478J564k753Q77J781k507O76J966k619K75K434k313l16K444j950n71
1866a032K522j836j027K812j328j523K551q99j671K524o73k037K504o1k368K073
1882E31L98k335J873O29k598J625J219k568J106J477k432Q71J619k518N66K126
1898A589k346pK221k051k71K334j939o57K540j564j105K480j211j271K469j016
1914A95j695K516m95k001K279p0k130K031K32k345J841P46k410J437J042k394
1930a221J177J364k439P88J733k301L26J954k072L3K089j983l88K296j666p49
$$ plain form
1818 1590 -1002 -688 1656 -880 -1015 1733 -446 -1251 1460 -241 -1247 1475 -72 -1507 1384 364
1834 364 -1539 1039 505 -1532 954 687 -1715 722 1092 -1520 390 1097 -1449 297 1275 -1498
1850 -1498 -20 1544 -1209 -332 1449 -1058 -382 1584 -1035 -760 1674 -639 -955 1489 -461 -1032
1866 -1032 1490 -346 -1373 1439 111 -1412 1139 240 -1431 1093 420 -1617 887 826 -1542 531
1882 531 929 -1406 467 1096 -1502 123 1342 -1226 -120 1357 -1075 -204 1415 -1103 -537 1589
1898 1589 -757 -764 1457 -594 -865 1469 -470 -1127 1413 -151 -1256 1224 13 -1258 1211 195
1914 195 -1500 1016 521 -1480 799 729 -1401 630 862 -1483 358 1104 -1306 131 1173 -1221
1930 -1221 -44 1320 -1119 -331 1402 -899 -573 1381 -691 -658 1431 -552 -940 1356 -310 -1059
1946a059K360j391j058K352j124j397K360p24j663K220m08j841K124o2k086J921
1962E24L23k231J690O79k273J453J033k376J043J342k234P30J599k155L67J861
1978A375k064k0K056j797l99K117j551p19K228j243j105K212r57j366K163o14
1994C16j586K111k98j846J913M4j947J762L68k097J552O87k175J290J006k192
2010a092R87J273k168O93J557k049L40J723j942rJ907j714l13K053j499o94K096
2027A149j232j021K140q64j334K022n19j498J940k58j738J802Q9j903J588M79
2043H42j961J385O92k093J134J046k040Q22J276j936N43J432j938L07J715j823
2059e97q7J839j573l29J932j424o88K024j136j010J982p84j155J931o26j486J903
$$ plain form
1946 -1059 1301 -90 -1148 1204 80 -1317 1043 319 -1344 876 468 -1373 751 689 -1397 524
1962 524 847 -1384 306 985 -1288 165 1198 -1178 -135 1207 -1027 -297 1302 -853 -486 1375
1978 1375 -689 -709 1347 -450 -849 1268 -283 -1002 1226 -17 -1122 1090 133 -1233 930 316
1994 316 -1270 841 543 -1303 610 654 -1293 469 837 -1260 292 979 -1196 94 1100 -1092
2010 -1092 -105 1168 -1000 -307 1250 -799 -459 1264 -678 -687 1220 -494 -807 1246 -253 -947 1149
2027 1149 -83 -1104 1036 172 -1162 860 341 -1157 783 525 -1213 589 678 -1225 363 842
2043 842 -1119 266 958 -1135 -1 1045 -995 -173 1103 -833 -290 1142 -796 -489 1226 -597
2059 -597 -684 1155 -418 -747 1185 -239 -927 1097 -39 -1049 933 149 -1006 925 299 -1187 716
2076G16j78j699J656J68j742J467L81j891J314P92j988R08J038j831P56J228j901
2093h06M53J503j801N8J639j511j12J700j512m31J886j224p55J844r66r03J856
2110I18p96j213J895m03j485J649j34j477J604Q5j724J453M73j858J088P53j706
2127h78R38R21j860O57J273j714K68J366j552R2J528j532j96J760j267n93J651
2144H62j040o35J735r04r71J788n94j230J600l17j251J619j97j545J509K53j624
2161i42J185M16j583J106O00j725R39R87j697M94J080j550L92J287j551N1J521
2178A010j325l12J464j090l80J544j043p32J682o73r92J495m51j092J488k90j287
2195i84J463P8j427J160K05j395J144M08j552R78P47j569O43Q78j439N33J007
$$ plain form
2076 716 538 -1161 495 663 -1079 388 769 -1122 192 984 -1004 -96 942 -889 -133 1095 -806
2093 -806 -353 1150 -651 -593 1046 -465 -577 1123 -389 -820 1066 -158 -913 931 -35 -938 918
2110 918 122 -1091 804 401 -1084 565 431 -1046 558 643 -1081 372 845 -1013 75 828 -878
2127 -878 60 981 -879 -222 1051 -663 -395 971 -581 -489 1039 -493 -689 1071 -196 -789 862
2144 862 -178 -813 922 18 -953 835 241 -989 611 294 -957 662 465 -1080 429 682 -942
2161 -942 243 659 -924 182 782 -943 -4 983 -714 -220 860 -690 -298 989 -562 -511 1010
2178 1010 -315 -627 837 -253 -633 911 -132 -864 818 145 -847 648 197 -895 593 303 -984
2195 -984 479 557 -870 290 495 -900 244 652 -900 78 825 -744 -101 777 -662 -129 878
2212H78j526L04J275j348pJ285j217j74J378j121m15J533q46p15J398o48q21J431
2230F44m81j017J393j89j197J248K0j235J146J89j385J005N18j387P97O32j394
2247f93O41P79j412M96J034j354K24J092j256M9J210j154j57J281r77l77J318
2264G44q17n61J343o85p77J349m32r11J298k55j067J166l2j158J083K11j223Q97
2282A73L93j276P42O13j294N54P77j265L97R20j187J91J003j135rJ124j015j56
2300d50J210r07m00J213p34n47J238n83o79J206m29q45J188k34r66J099o0j074
2318g54J030J80j139Q46L67j180O80N14j168N79P06j176L44Q39j106J71R54j030
2336c43l0J044q98k22J089p50l80J092o89n23J182m89o88J110l49p93J057k12
$$ plain form
2212 878 -648 -344 931 -417 -424 861 -356 -530 848 -273 -688 845 -1 -716 682 34 -787 644
2230 644 163 -854 539 350 -847 401 421 -814 332 521 -864 141 659 -728 69 701 -693
2247 -693 -52 727 -685 -189 845 -509 -285 807 -449 -400 810 -344 -501 780 -197 -574 744
2264 744 -73 -634 709 24 -753 596 164 -747 551 296 -771 395 363 -795 288 499 -724 173
2282 173 566 -710 32 645 -649 -95 682 -583 -186 734 -453 -262 741 -394 -403 721 -294 -450
2300 -450 760 -147 -547 666 -68 -615 623 40 -639 567 138 -707 481 247 -719 380 320 -754
2318 -754 276 456 -683 163 530 -650 30 544 -624 -45 661 -515 -171 668 -438 -267 687 -343
2336 -343 -373 671 -227 -449 640 -110 -490 602 -87 -610 572 83 -605 505 156 -637 420 208
2354B08q82J024J9j006Q70J68j006P98K72j101O82N07j109M89O48j038L26P27
2372E96j049J74R00r06n0R33q03j87R87p59l47J096n58n72J009l79o04R81l07
2391A55p64R81j07q82Q71Q3q92P93J39j005P27L78j003N37M65r57M47N59j019
2410d94L32P62r50Q9Q09q27J3Q79q33j97R90o66l72R57m94m53R53m37o45R86k01
2431B01p57Q52m8p94Q18L4q95P47K56r34N66L51q85N29M76r95L79O25r02J73P09
2452E06q16J34P49q81kQ52o98k07Q57o13k79R17n46m65R47l58n81Q22k29o07Q76
2473C78j56p78Q09O3q41O55K01q15O01L09r16M52N01q60K93N36q20K53O49q57
2493c43R2P88p42j05P67o60j17Q49o30l11Q65m50m18Q02l52m58Q48l02o34Q35
$$ plain form
2354 208 -674 350 369 -637 233 401 -605 193 465 -636 46 553 -556 -67 581 -457 -131 596
2372 596 -453 -279 621 -285 -335 598 -205 -392 595 -164 -511 585 27 -545 464 85 -519 462 155
2391 155 -609 372 265 -617 254 337 -555 238 377 -628 99 477 -526 11 476 -481 -34 525 -494
2410 -494 -162 600 -350 -261 548 -279 -266 613 -220 -417 573 -93 -465 492 -2 -455 498 61 -584 402 201
2431 201 -556 296 248 -546 272 306 -589 158 414 -520 46 397 -488 41 517 -478 -99 526 -376 -203 506
2452 506 -310 -176 573 -308 -310 542 -156 -363 494 -119 -398 519 -27 -492 455 97 -484 338 109 -498 378
2473 378 222 -556 253 316 -525 130 331 -484 117 426 -490 -38 463 -397 -104 432 -388 -135 514 -343
2493 -343 -251 537 -205 -310 457 -203 -320 529 -101 -412 453 3 -415 387 35 -423 425 123 -511 324
2513C24r4p07O95Rp12O84J07q02N96K95q36M40L73p97L76N07q21K08O27p41L7
2534b32O73o69j6P26o57j65Q00n17l05P72m39l62P81l39m84P93k14n88P21j14
2554A65o13P02k1o96O44J16p32N19K38p33M55L24p70L73M34p48K33N25p07J00
2574a92O14o53j3O84n75j64P03m89k51P24m02l55P32l04m66P24j84n35O64q3n85
2595d06O16J9o32N61J15o71M79K21o91M39K93p02L26M14p00K22M65o44J32N20
2615C76o13M7N89n53j06O46m83k01O72m02l06O78k87m23O41j82m58O30j09n46
2635c90O00J9o02N07J25o13M50K06o56L68L29o50K66L67o09K04M34o24J22N32
2655C85n79oN44m91o5N63m72j68O34l66k92O16k94l22O05k40m21O17q2n12N16
$$ plain form
2513 324 230 -477 218 227 -485 199 306 -496 100 395 -441 -1 372 -425 -49 458 -363 -155 472 -269 -232
2534 -232 441 -228 -244 482 -175 -340 460 -57 -362 410 -29 -391 390 51 -433 360 146 -442 279 165
2554 165 -448 254 233 -463 181 297 -435 84 322 -411 44 368 -402 -29 405 -343 -110 415 -292 -192
2574 -192 422 -231 -244 440 -135 -299 404 -85 -336 388 -14 -369 363 59 -407 317 133 -402 262 179 -406
2595 -406 210 229 -403 158 273 -398 81 302 -389 50 343 -359 -33 381 -319 -97 368 -276 -144 376
2615 376 -237 -190 399 -154 -260 386 -97 -298 374 -28 -334 344 57 -366 275 93 -365 265 156 -390
2635 -390 210 229 -373 134 259 -354 96 302 -354 14 343 -307 -41 326 -283 -79 355 -269 -147 385
2655 385 -194 -200 344 -147 -212 351 -121 -289 345 -21 -313 303 9 -313 292 52 -369 248 166 -346 170
2676A70Rn18M95O2n85M57K13o24L40K61n68K81L24o12J98M45n66O8M54m95L3M97
2698C39n03q3O00m23j96N66l49k22N85l23l26O05j87l90N28j15m23N26n2n11M92
2719A38R3n42L68J71n29L45K27n75K66L52n52J64L69n10J03M46n23NN32m54j06
2740b12M95l68j30N19l54k30N66k61l22N22j79l40N23j34m24N05j7m53M14M5m67
2761c02M18J01n39L48K26n11K40K74n05K16L35n26J04M19m53J1M29m20l2M78m06
2782i5j51N27k93k35M84k34k74N13j89l57N03q2l94M43n7l98M39K2m84L80J65
2803B33m91L03J52m69K97K34n08J99L15m54R7L49m49R1L94m38m7M72l51j06M28
2824B51l03j58M48k55k37M73j66l08M33r2l33M09m2m30L91Q0m13L70N0m13K86
$$ plain form
2676 170 179 -339 156 218 -367 90 303 -321 19 280 -288 -7 317 -295 -97 348 -218 -150 304 -191 -158 339
2698 339 -164 -247 353 -70 -266 300 -49 -271 314 -9 -335 270 83 -307 221 106 -317 209 157 -354 138
2719 138 231 -311 57 228 -301 44 271 -304 -38 314 -238 -74 295 -215 -112 334 -189 -184 348 -106 -212
2740 -212 283 -85 -215 304 -50 -280 286 25 -297 225 46 -294 229 95 -329 176 159 -294 120 165 -302
2761 -302 116 217 -322 26 252 -259 -19 255 -250 -34 301 -225 -121 298 -155 -144 285 -135 -167 311 -95
2782 -95 -246 281 -12 -247 237 3 -271 242 53 -304 199 117 -277 166 109 -289 150 172 -312 68 233
2803 233 -258 45 197 -272 25 259 -249 -50 265 -189 -92 257 -192 -101 293 -145 -192 280 -71 -177 251
2824 251 -52 -210 238 -17 -254 219 53 -255 178 86 -247 162 120 -310 81 161 -252 118 168 -245 41
2845D1J57m61K55K61m42J29K80m33J53L11m35M2M17m10M8L24l68k2M45l73j69
2866b50N31k96k66N47l01k49M73j60k48L36o6l32M48j4l77K99O5l51K90J11m64
2887b74K82J87m22K07K41m20J34L00m08J1M07l83J5L58l34m0L67l06j03M16k79
2908d4j37L97k24j85L86j58k62L98r2l03L62l1l23L23K8l71L08Q9l80K32J50l79
2930b16K02J99l81J47K64l80Q9K79l52N4L14l39k0L62k88q4L56k47j19L47k08
2951b1j66L68j40k30L51j10k45L35o3l07L39J7l30K84L9l40K47J22l71K11J99
2972A89l42J30J93l24Q2K24l27M5L45l19RK43k43OK96k54r3L40k18j51L34j67
2994bj57K52j35k02L56Pl23L08k7l07J98J08l41K73J37l70K83J12l21J21K03k92
$$ plain form
2845 41 198 -263 -8 253 -189 -60 220 -213 -60 251 -184 -142 275 -135 -87 237 -131 -153 292 -81 -250
2866 -250 281 -15 -281 266 -35 -284 189 29 -219 117 51 -281 167 153 -224 75 140 -211 79 190 -274
2887 -274 8 195 -227 -20 221 -199 -65 235 -173 -162 245 -138 -123 235 -99 -139 228 -78 -181 235 -44
2908 -44 -181 216 -8 -193 193 35 -227 171 79 -224 138 107 -216 107 135 -236 72 161 -219 13 163 -216
2930 -216 -14 185 -196 -49 215 -165 -76 203 -149 -95 219 -120 -140 222 -66 -150 206 -41 -160 187 -21
2951 -21 -187 181 41 -189 162 52 -193 142 79 -228 111 128 -202 82 121 -219 28 150 -221 -10 189
2972 189 -153 -23 170 -154 -72 152 -175 -130 215 -104 -95 148 -95 -89 207 -47 -140 200 -18 -169 165 -2
2994 -2 -159 93 -42 -244 112 119 -204 104 77 -230 -32 76 -265 8 145 -225 58 170 -151 -30 173 -119
3016a19N0K20k76j5K52k81J26K85k91l1L36k09j32K37j87q0K75j76j83L08k7j50
3038f8J97m6k77L31m4l12L08Q7l23J08J84l05K00Q5l16J74J32k20O5J46k16J33
3060B3J48k93K8K37j83p7K05j47m8K81k39m7K50p3j58K11p3j56K84j57j48K34
3082A02k6k22K20kk15J77Q6l00J95J12k70J35J19k65J19J68k81Q8K03k68N7K24
3104A56k26J2K07k04n9K37j64o3K63k17n3K61j23j83K80m9j93K13m9j81K08Jk07
3127a33J86M1k18J62M1k23J68R7k53J11J39k40P8J53k22O3J92k31J5K05j81l0
3149h0K04j75m3K26j64p2K30j13j19K18j14j31K46p0j79K32l7k03J98Rj98J76
3171D1M8k27J52R0k24J17J13k29Q3J46k07M8J81k04kK05j95j2K04j57o1K16j54
$$ plain form
3016 -119 -69 151 -125 -140 112 -169 -43 242 -49 -80 256 47 -85 152 -35 -115 160 -16 -199 109 82 -68
3038 -68 129 83 -194 137 93 -219 89 176 -147 -39 145 -160 40 125 -191 -17 115 -105 -40 106 -110 23
3060 23 171 -122 -94 143 -40 -117 88 -59 -107 174 -65 -112 138 65 -93 118 45 -111 173 16 -132 102
3082 102 76 -146 74 72 -143 34 120 -180 15 127 -143 -8 111 -154 -35 133 -148 -60 143 -125 -68 156
3104 156 -70 -58 149 -55 -114 123 -41 -104 159 -58 -111 150 27 -156 124 75 -118 95 46 -135 73 74 -133
3127 -133 53 94 -124 38 79 -144 24 121 -132 -21 118 -122 -44 109 -113 -50 142 -89 -74 131 -50 -80
3149 -80 124 -51 -94 132 -32 -104 126 13 -106 112 -2 -133 113 43 -136 96 59 -144 54 63 -135 41
3171 41 89 -138 14 104 -120 -3 110 -119 -36 110 -97 -49 132 -72 -74 131 -64 -76 128 -29 -90 126 -28
3194b8p0K11j20r6K01q2j37K19n5j53K07n1j66J95j8j79J76L3k07J43O9k03J18
3217GR2k14J06J21k18O5J56k01K9J63j78J1J88j72l6K02j37p5K04j20q8K17j12
3240A0j14K11o2j39J88n8j53J97j4j96J85K7j89J39M4j94J37P5k08J21J09k11
3262i5P1J07j90P2J46j88PJ83j62j3J69j51k4J83j40p0K07j03j05K00j05r5J97
3285A01o1j48J84k9j60J75j4j63J67K1j96J36P8j83J04P6j86R8R9k05O8J39j77
3308g6L2J42j80K2J81j87rJ96j47n3J72j23n8J95j02j03J93o0j35J75m0j36J67
3331F6qj82J55L6j74J37L5j81J33O9j99R5J08j83P1J05j83P6J49k03K1J59j55
3354e3kJ56j45k3J82j48n4J79r5q2J78q6j05J93o0j47J80j6j63J63Rj70J47L6
$$ plain form
3194 -28 -98 113 -7 -103 98 16 -121 98 43 -110 97 46 -120 75 57 -122 54 87 -120 23 92 -111 7
3217 7 99 -115 -9 112 -106 -41 115 -86 -57 106 -72 -61 127 -45 -81 121 -16 -91 113 -7 -95 122 10
3240 10 -104 107 45 -94 94 36 -117 80 66 -130 55 82 -107 32 76 -118 19 94 -114 7 116 -95
3262 -95 -24 83 -107 -35 111 -77 -70 113 -49 -62 107 -44 -68 115 -25 -95 112 9 -96 104 -1 -96 101
3285 101 40 -108 76 47 -113 62 48 -115 52 73 -123 13 91 -92 12 88 -98 0 99 -106 -38 101 -76
3308 -76 -44 98 -82 -60 121 -66 -75 121 -26 -79 93 -30 -88 107 5 -98 95 35 -100 75 35 -101 66
3331 66 58 -124 31 67 -107 30 65 -116 17 86 -113 -18 90 -93 -22 83 -100 -24 125 -78 -57 102 -53
3354 -53 -55 101 -44 -67 115 -33 -87 92 -3 -85 93 7 -98 95 35 -112 68 52 -111 52 61 -109 38 74
3378G4j94J25O9j81J10Q6j83P7J07j90M8J55j70J9J58j73oJ92j66l9J97j46o0
3401i1J92j10q3J96j03j02J90o1j44J92l3j56J75nj84J63L2j94J61L8j99J34Q5
3424I3k02P9J22j89O1J25j70L3J59j84J7J66j54l1J93j43o4K01j22q8J92r0r7
3447i3J79n3j46J97l0j66J72j7j60J56K4j84J63M7k05J30Q1k03J00R9k03Q6J25
3470I9j87L6J65j74MJ83j82j7J94j51m2J75j22p2J82q5j04J93o9j29J80m8j48
3493a19J78mj75J69J0j72J40M8j79J20O8j86J00J16k01N8J33j82L2J53j68J6J58
3516A13j57j9J83j50m4J76j11p8J78q6r6K00p8j27J74m4j35J64j4j67J64J8j79
3539a15J35N3j77J18O3j82J14Q1j90P2J23j70L6J34j68K8J49j47k6J69j36l4J67
$$ plain form
3378 74 -120 5 74 -107 3 89 -94 -17 90 -100 -52 103 -67 -48 110 -63 -69 123 -43 -82 115 -31 -91
3401 -91 101 -9 -92 104 1 -101 89 28 -116 76 43 -113 62 57 -127 36 68 -126 35 73 -126 8 93
3424 93 -109 -30 92 -97 -36 89 -81 -48 111 -73 -56 110 -44 -75 118 -25 -89 112 -10 -98 94 4 -93
3447 -93 86 33 -113 84 54 -112 60 43 -117 39 63 -121 42 89 -116 14 95 -108 -8 91 -112 -26 99
3470 99 -88 -52 113 -61 -57 126 -56 -73 121 -30 -72 103 -19 -91 91 6 -98 95 26 -103 77 29 -119
3493 -119 59 55 -120 49 59 -113 27 75 -104 16 84 -102 -2 114 -87 -29 104 -78 -46 107 -61 -45 113
3516 113 -44 -63 120 -30 -74 102 -9 -87 91 5 -91 109 31 -96 78 34 -101 63 49 -118 46 64 -115
3539 -115 20 73 -104 14 77 -105 9 90 -100 -28 95 -75 -39 95 -73 -45 104 -43 -69 100 -36 -70 97
3562I7j22n2J90j26q9J94p9j12J71m3j21J67k4j70J64J6j69J38K4j65J42N3j93
3585a09J13P7j74O2J21j82N4J42j76K0J63j65j4J78j43m2J88j32q3J89q9q7J73
3608H4p0j12J92n6j51J89k9j54J61Lj74J54L9j85J25O4j76Q9J02j98R0J18j98
3631i3M3J56j74J5J56j79J2J84j56m3J84j17p8J95j13q9J96q4j14K02o3j52J87
3654G5l2j53J75rj74J59L6j87J26O5j88J10Q5j93Q6J20j86M7J31j76L5J62j81
3677f7j4J90j44l6J90j45o2J99j13j00K12q1j25J90n7j41J94k5j84J72J2j83J57
3700C9K9j90J48O5k04J22J00k10Q2J24k05O6J32j86J7J91j83j0J84j57l7K01j46
3723b8p0K03j05j07J92p2j37K25p0j48J94j7j73J71K1k00J59M1j97J30Q9k11J11
$$ plain form
3562 97 -25 -77 113 -13 -102 92 13 -99 72 29 -92 75 51 -119 45 61 -108 30 54 -111 31 84 -109
3585 -109 4 81 -93 -31 90 -92 -38 104 -72 -52 111 -54 -68 110 -33 -75 113 -19 -102 87 -2 -89 84
3608 84 14 -98 94 38 -113 76 47 -107 54 57 -117 37 76 -109 16 80 -96 -7 95 -103 -13 105 -93
3631 -93 -50 106 -68 -53 103 -76 -64 120 -36 -79 105 -12 -90 105 -8 -97 99 15 -99 103 40 -112 75
3654 75 43 -110 65 56 -118 41 77 -110 16 81 -107 3 88 -105 -19 101 -85 -38 93 -83 -48 114 -67
3677 -67 -81 109 -35 -71 119 -26 -88 111 -2 -102 110 29 -96 94 37 -104 90 65 -119 53 65 -118 39
3700 39 68 -122 26 91 -113 9 109 -101 -19 105 -100 -34 98 -88 -71 120 -63 -73 111 -46 -83 118 -28
3723 -28 -98 105 0 -107 85 13 -124 101 31 -117 77 60 -113 58 79 -121 38 79 -118 12 101 -110 1
3746AR4k14J00J29j96L7J52j89K7J70j73pJ93j71m0K00j39o5J99j11r8K03p9j32
3770a09J97n8j51J98j2j82J76K5k01J49O7k11J22R5k20J09J16k04N9J47k02L9
3792e1J70j89jJ80j65k2J91j57m8K02j26q0J99r8j11J99o8j37K01m4j57J85j9
3815E4j75J83J4k03J65M4k07J39Q4k08R9J15k17P8J53k13M4J60j93K1J75j73k4
3838h5K05j59o1K13j27q3J98j02j17K10p7j41K12m9j66K08j8j85J78K1j90J55
3860D0M7j96J20Q6k07R9J20k07O8J37j95M5J54j90LJ84j71k8K00j48n9K19j36
3883a5r5K19q8j33K08o9j41K04m7j67J91kj80J56L3j93J55O1k09J11J02k09Q4
3906b4J19j95O8J40j93L2J75j81lJ69j61k9J89j40o6K09j08j06J99p5j29K09o1
$$ plain form
3746 1 95 -119 -19 110 -86 -49 103 -86 -59 111 -62 -69 124 -47 -87 113 -26 -91 108 -3 -101 102 23 -109
3770 -109 88 30 -121 77 65 -117 59 84 -117 32 99 -112 10 105 -115 -6 110 -94 -35 112 -90 -51
3792 -51 119 -70 -71 109 -56 -78 113 -44 -92 110 -16 -96 103 5 -106 93 25 -112 89 45 -112 73 54
3815 54 -121 62 76 -127 38 82 -125 14 98 -110 -11 104 -113 -35 118 -95 -51 109 -84 -63 112 -61 -85
3838 -85 120 -39 -100 113 -14 -97 101 -1 -118 92 15 -126 86 37 -129 79 61 -124 54 75 -115 40
3860 40 87 -109 11 97 -110 -11 109 -98 -30 107 -88 -43 111 -79 -76 108 -63 -91 109 -39 -98 121 -15
3883 -15 -110 109 21 -112 96 27 -114 90 43 -124 67 65 -115 41 74 -119 36 97 -112 -1 101 -108 -24
3906 -24 95 -100 -32 108 -85 -53 122 -59 -62 107 -54 -83 106 -34 -100 109 1 -105 94 19 -110 99 38
3929C8j54J93j3j81J85Mj80J59L8k09J46P5k07J03Q9j93R8J14k04N8J60j86J7
3952e0J58j75LJ80j63n2K12j37p3K05j12j03J98q6j16J90m4j54J89j9j80J86J2
3975F9j81J53N8k09J32Q3k13J22R6k16Q3J44k13N5J59k02K2J79j89k1J98j46n5
3998i2J94j36p6K11r6j12J89n9j35J98n2j53J97k4j74J75K8k07J73M5k01J39P9
4021A11k15J04J09k10Q1J39k07L6J76k02J0K02j84m0K10j71m6J89j14r5K07q5
4043Ej13J94n7j44K04m7j60J88rj90J83K8k01J48N8j96J15J04k11J03J01j91O4
4066b4J39j97L5J67j80MJ91j84l8K02j55n9K13j40q3K02r2j16K09o9j43K10n1
4089D1j61J89Oj91J70K6j88J43O3j98J18R6k08Q3J27j99N1J46j96K8J68j80j2
$$ plain form
3929 38 -116 77 64 -117 68 72 -108 51 89 -120 26 101 -106 -3 86 -107 -9 105 -99 -41 119 -67 -50
3952 -50 108 -67 -64 116 -47 -99 113 -24 -97 108 -4 -107 91 5 -111 79 35 -119 70 51 -129 57 69
3975 69 -112 41 99 -110 22 105 -108 14 110 -106 -23 121 -92 -37 122 -80 -58 121 -68 -89 109 -37 -92
3998 -92 102 -34 -110 101 5 -107 82 23 -112 86 34 -119 78 54 -120 55 83 -124 49 94 -107 32 111
4021 111 -104 0 109 -101 -20 119 -88 -52 124 -78 -68 134 -50 -90 120 -51 -97 92 -22 -117 90 5
4043 5 -108 86 29 -115 89 42 -118 70 61 -129 54 82 -119 29 87 -109 6 110 -101 2 103 -88 -24
4066 -24 115 -82 -47 120 -60 -56 135 -49 -87 115 -40 -99 114 -26 -109 93 1 -115 94 25 -118 92 41
4089 41 -120 69 75 -116 54 80 -108 35 98 -100 18 114 -94 -11 116 -83 -32 114 -82 -54 114 -66 -78
4112g8J89j59l9J98j36p7K05j23r8K10r0j21J96n4j51J99k0j73J78J7j94J57L9
4135G5j95J42P6j99J10J01k09Q5J32k08N1J64j95J4J71j70j7J86j64k9J93j42
4157b8p1K01j07j05J99r4j14J96l5j69J95j5j73J85jj93J73M5k03J26Q5k12J08
4180gJ22k12Q2J30j97M4J46j75K8J49j60k5J88j56n5K01j32o8J97j04j14K09o9
4203B2j42J83l7j38J86l5j59J69L2j95J45M3j84J33Q2k11J08J06k00O7J43j96
4225g8M7J54j99J0J83j64l2J87j48m4J96j39p9K00j02j06J89o7j35J92l4j54J85
4248F2j4j70J71Rj67J49M7j97J22Q5j88Q6J12k10Q1J46k02M1J54j84lJ70j59j6
4272g5J92j66m1J94j26r2K02r2j07J97p3j38J93l4j54J78j4j64J66J9j92J45P0
$$ plain form
4112 -78 111 -48 -87 111 -25 -102 103 -20 -118 92 2 -119 77 23 -128 71 51 -122 56 73 -121 36 75
4135 75 -120 22 98 -101 9 110 -99 -14 118 -90 -39 125 -70 -56 115 -55 -72 114 -50 -79 114 -28
4157 -28 -99 102 -5 -110 89 -5 -119 77 42 -127 68 53 -120 65 64 -129 44 89 -114 12 97 -115 -7
4180 -7 115 -97 -15 115 -82 -38 108 -67 -39 110 -50 -75 113 -43 -98 103 -29 -97 100 -4 -118 91 22
4203 22 -120 63 26 -112 74 39 -120 49 81 -114 31 74 -110 23 105 -106 2 108 -92 -25 118 -78
4225 -78 -31 123 -76 -66 117 -47 -79 108 -40 -84 112 -27 -106 94 -8 -114 75 8 -127 65 31 -123 62
4248 62 48 -122 49 58 -109 40 87 -110 12 97 -91 -5 107 -103 -22 124 -78 -37 117 -67 -70 100 -59 -75
4272 -75 117 -49 -90 104 -22 -114 88 -4 -111 86 13 -125 68 34 -120 58 44 -120 46 65 -127 18 88
4295H8j85J04R4j92R0J06j95O4J36j77K7J49j70jJ76j58m7J93j20p7J89j16q2
4318a04J93q7j24K04n1j66J90l8j31J69%j79J63K9j78J19Q6k02J15P4k14J19J18
4341A05j83M4J54j78J7J50j58j8J82j49n7J83j15p1J91j05r2J88p4j25J83m6j47
4364a21J73qj70J71K1j77J43N2j98J32P4k01J13J03j93O7J24j89M8J44j67J4J63
4387A18j61j6J70j36n3J77j09q7J94j05r1J87p0j25J78m6j38J77j1j63J49K9j81
4410a13J30N3j61J02Q0j89R6J03j88N7J32j73M4J37j78J6J82j70k8J80j39n8J83
4433I8j10r2J96q2j18J87n9j22J74m1j56J78Lj61J26L1j56J19O4j82J16R3j92
4456h6Q0J02j71N0J27j71J2J58j46j0J60j39k8J67j24o7J84r6r5J79p4j19J83
$$ plain form
4295 88 -97 7 101 -91 -1 105 -90 -26 110 -67 -40 109 -61 -62 114 -44 -91 102 -18 -95 94 -22 -104
4318 -104 89 2 -122 82 31 -135 55 17 -114 55 55 -124 39 68 -110 9 95 -107 8 82 -132 -13 105
4341 105 -78 -34 120 -58 -41 109 -49 -67 115 -34 -91 92 -23 -94 97 -8 -100 88 14 -111 72 26 -121
4364 -121 52 44 -126 45 66 -111 32 84 -114 18 92 -109 4 107 -86 -19 105 -84 -36 108 -59 -45 118
4387 118 -43 -59 111 -25 -78 99 -10 -97 97 -8 -99 88 18 -107 71 25 -113 64 53 -110 39 68 -113
4410 -113 17 70 -91 11 91 -98 -2 101 -87 -30 102 -71 -27 110 -68 -52 130 -40 -68 112 -27 -85 98
4433 98 -12 -104 92 10 -108 79 20 -102 72 31 -125 53 56 -105 21 52 -104 15 79 -103 13 106 -86
4456 -86 -6 96 -75 -25 102 -69 -57 101 -45 -55 105 -34 -62 105 -19 -86 98 2 -93 86 12 -107 76
4479G6m7j36J74j3j73J53J6j59J38K5j65J20P1j87J03R2j67O1J17j90N3J46j66
4502e8J6J49j58oJ67j45l9J78j09p4J64q7q5J66o8j24J74k0j50J58jj60J59Rj71
4527a15J38N5j82J17N8j69J07P9j78N8J32j71L3J44j69J6J54j50j8J73j40l9J69
4550A02j05p6J70j00j04J90n9j28J71k7j41J63j8j59J53K9j84J41O1j85J09P1
4572G4j80R2J08j79N8J27j64L0J43j77MJ80j57l0J77j21o8J87j07q6J91q8j06
4595i2J59l9j26J60k3j54J63J1j63J42K1j66J24M2j71J02R4j85Q0J07j72N0J35
4618I9j77K6J52j60OJ52j34l3J76j19o1J81j02r9J86q3j04J73n4j33J69k1j37
4641i7J47nj57J34L9j76J23M8j51P1R9j65O6J04j54M2J22j61K0J51j49qJ57j20
$$ plain form
4479 76 29 -107 67 54 -119 34 50 -109 29 54 -111 9 80 -107 -4 88 -79 -18 99 -91 -38 108 -58
4502 -58 -42 107 -51 -57 110 -35 -74 104 -5 -79 85 -2 -87 79 11 -113 61 41 -109 49 48 -112 47 56 -115
4527 -115 23 78 -104 13 71 -98 9 88 -90 -32 100 -71 -38 106 -63 -47 107 -43 -61 112 -28 -67 102
4550 102 -3 -79 91 -9 -113 77 18 -110 61 34 -107 56 38 -121 32 61 -123 18 79 -106 3 74
4572 74 -106 -14 94 -85 -27 100 -64 -34 109 -68 -64 116 -41 -71 106 -15 -83 104 -3 -89 102 14 -92
4595 -92 67 28 -98 62 39 -115 48 59 -104 38 59 -107 17 59 -112 -10 84 -101 -21 86 -86 -36 99
4618 99 -78 -52 100 -60 -54 98 -36 -69 107 -12 -73 108 6 -93 93 10 -94 79 25 -108 61 40 -97
4641 -97 50 45 -112 22 61 -115 8 56 -95 -24 75 -90 -24 80 -74 -32 90 -71 -51 100 -49 -57 100 -20
4665b0m5J73j14o4J75j09q5J87q7j01J59m1j34J67j8j58J57J6j60J38L8j78J05
4688AQ1j84Q8Q6j58P2J12j80L3J49j58NJ45j37j3J50j34l5J73r4p8J71p7r7J64
4713H5o8j14J64k5j38J50mj62J51K2j62J37M6j79R2Q7j72P9R7j79N6J26j66L4
4737d3J41j63J9J50j50k0J74j31o5J71r0p4J72o8j11J64m8j17J52j7j47J52Kj52
4761i9J37K4j63J20N0j70J05P9j77P1J12j66M0J29j64J6J53j51oJ58j25n9J74
4784H8j10o6J83j11p5J76p4j03J57k5j26J51k2j51J50K3j61J16M4j69J26O0j79
4807i8P8J11j65M0J18j49K8J19j55J9J56j44l2J64j22l8J66j17p4J88r1j06J78
4830G4n5j02J59l1j35J56j0j47J32K2j59J23M3j67R2R1j74P8R5j62N6J06j58J8
$$ plain form
4665 -20 -65 108 -6 -70 105 -4 -89 98 11 -90 69 28 -106 61 43 -115 42 58 -102 36 74 -104 1
4688 1 82 -102 -14 72 -86 -14 98 -82 -49 100 -58 -53 92 -45 -58 92 -42 -77 96 2 -76 95 18 -79 85
4713 85 17 -97 67 42 -96 54 50 -112 39 61 -101 36 82 -97 -5 82 -90 -11 86 -93 -37 89 -77 -43
4737 -43 98 -65 -46 104 -46 -66 108 -23 -88 83 -7 -81 91 23 -88 76 28 -89 63 46 -101 51 53 -99
4761 -99 38 62 -101 19 69 -101 4 83 -94 -23 89 -77 -37 92 -72 -56 97 -54 -60 98 -27 -86 88
4784 88 -22 -88 95 -16 -91 85 11 -92 65 40 -86 65 43 -108 42 65 -96 20 64 -105 21 81 -98
4807 -98 -20 91 -74 -34 84 -65 -37 82 -73 -54 102 -42 -74 90 -32 -70 96 -21 -95 93 2 -104 74
4830 74 19 -83 76 45 -90 66 56 -91 41 63 -96 27 70 -97 -5 86 -88 -10 85 -77 -21 85 -73 -55
4854e5J48j54qJ59j34k3J51j14n4J78j01q6J68o2j03J67n0j16J59k5j41J46kj37
4878h9J38K0j66J20O0j75R9Q3j85Q8R6j66M2J17j55QJ49j47LJ48j37l9J65r5o7
4903h5J59q0p4J64o8j11J68l1j38J59k0j35J53Pj70J29M2j65J12O7j62O9J02j83
4927i1O4J20j55J9J39j57J2J38j37m6J60p6o2J75j38m8K03j15j00J47n2r7J58
4950F1k5j33J55kj46J36K8j60J12N8j71Q5Q6j74Q1R4j70M9J17j49J4J48j56jJ49
4975H6j32k6J55j23m6J71r4q1J74p8j10J75n4j17J54j4j44J85pj82J58K3j38R6
4999C1Rj20Q7Q0j70O4J11j73K7J42j51J5J40j54oJ56j22n3J61j04n4J52p4r0J65
5024F9n7j13J64l5j27J58j4j55J57K7j65J10O3j64R4P2j63Q7Q4j71M1J23j43J4
$$ plain form
4854 -55 93 -61 -69 90 -44 -67 84 -30 -84 94 -7 -93 75 13 -90 77 27 -89 70 45 -96 50 48 -89
4878 -89 49 69 -97 23 83 -92 7 90 -95 -7 89 -77 -35 82 -73 -65 84 -63 -60 88 -49 -88 77 -18 -85
4903 -85 74 -6 -80 84 16 -95 73 42 -96 63 43 -92 61 68 -102 27 69 -96 16 83 -79 -10 92 -91
4927 -91 -27 93 -62 -43 96 -61 -49 89 -48 -94 66 -10 -72 103 -35 -83 120 5 -95 52 0 -97 61
4950 61 36 -97 58 56 -90 46 74 -86 26 84 -87 -2 84 -90 -9 85 -85 -36 81 -68 -54 94 -62 -63 86
4975 86 -46 -72 83 -40 -86 85 -9 -90 84 6 -104 71 17 -100 54 40 -104 81 74 -108 50 73 -65 31
4999 31 40 -80 7 87 -83 -19 92 -81 -54 88 -63 -48 92 -62 -68 88 -34 -87 74 -30 -84 68 -6 -96 69
5024 69 12 -101 63 28 -99 59 45 -110 47 74 -91 19 82 -82 12 84 -79 8 92 -79 -38 85 -58 -44
5048d4J37j49lJ58j30n1J52j01n7J60r3q6J70n2j11J56l2j24J52j6j27J37K1j70
5072a03J30L9j60J24N1j75R5R5j73N0J16j56L5J26j61J5J55j45k8J54j13l9J51
5095H3j15o2J67q3r0J58m9j16J63l5j30J64pj41J19L0j58J24M8j60J01Q2j63O1
5119iR2j46M9J14j64K5J34j47j7J56j19l6J66j26p2J77q3r1J69p1j04J63m1j20
5143a01J44rj39J35J1j35J26L2j59R7Q1j75J00P9j54O2J07j72L7J44j54JJ44j52
5167e0rJ57j42l3J65j04p8J60p0r6J63n1j26J72l2j35J49Oj46J30L5j73J14O0
5191F6j67R3P8j59P4J13j69M2J24j51J1J33j40jJ53j41l5J56j10n8J59q1q7J61
5215F4p2r9J63m2j29J64k6j40J56J5j68J30M7j71J06O9j72J02R7j79O3J24j82
$$ plain form
5048 -44 93 -56 -59 99 -31 -82 70 -31 -88 72 -21 -107 63 11 -100 56 24 -100 52 36 -91 46 67 -103
5072 -103 27 66 -94 30 81 -94 1 96 -77 -27 89 -67 -32 94 -67 -52 103 -42 -70 84 -29 -68 83
5095 83 -32 -94 73 -10 -100 58 9 -107 56 21 -109 55 48 -93 26 56 -102 22 70 -90 11 93 -70 -9
5119 -9 83 -63 -14 100 -64 -39 95 -52 -69 87 -32 -68 98 -28 -100 77 -6 -97 72 1 -103 60 19 -101
5143 -101 43 34 -105 30 41 -94 32 64 -95 2 83 -92 8 87 -67 -5 102 -70 -33 111 -43 -42 102 -50
5167 -50 -59 98 -44 -77 88 -16 -94 66 -4 -100 63 12 -114 58 26 -109 40 46 -100 30 65 -108 6 66
5191 66 -101 -8 70 -89 -15 98 -71 -29 95 -56 -45 88 -52 -53 100 -41 -76 80 -30 -88 71 -10 -97 64
5215 64 -8 -107 56 14 -115 49 23 -117 39 54 -114 16 63 -108 -2 67 -105 -3 94 -85 -22 102 -80
5238h0M7J38j61J1J50j44k9J63j22m7J62j05p0J65p9j01J75n6j26J66l7j32J59
5261D7Jj64J31L4j55J15N4j64J12O2j62Q1Q9j64O3J18j60K5J48j73J3J42j36l4
5285g7J70j28m8J73r6r3J81o8j23J83m7j41J66k2j47J54Pj54J23N6j85J24N6j63
5309i9R3R4j84P0J18j69L0J49j67K3J43j52j0J65j39l8J71j28o3J85j05q7J82
5332H2o2j24J65k3j41J67k3j59J54Nj51J20N3j63J00P9j89R5J10j75N5J21j73
5355g7M1J42j62kJ68j41l0J66j36m8J85j15q3J80p7j19J73n3j18J63j7j60J67
5378D7J1j74J45K9j69J23N7j73J01R0j80P3J01j60N1J23j66J3J61j57j2J61j32
5401c7m1J88j21p3J84r1j09J76n8j23J77m8j36J69lj60J47J2j62J34N0j76R9Q2
$$ plain form
5238 -80 -33 105 -56 -45 105 -39 -68 95 -27 -74 88 -17 -87 78 -1 -102 73 17 -109 57 20 -112 47
5261 47 48 -116 15 49 -106 9 63 -101 11 73 -89 -8 81 -83 -20 98 -62 -37 111 -62 -49 93 -43 -77
5285 -77 93 -35 -83 90 -6 -99 82 14 -109 74 27 -114 52 30 -117 37 44 -110 13 69 -116 8 64 -99
5309 -99 -6 88 -96 -26 92 -77 -47 102 -65 -42 101 -51 -61 104 -35 -73 98 -30 -93 92 -13 -100 82
5332 82 20 -104 61 38 -103 64 41 -118 36 41 -110 10 63 -100 0 79 -110 -15 95 -80 -25 96 -77
5355 -77 -36 106 -56 -58 110 -31 -61 105 -31 -79 106 -9 -92 88 11 -108 65 12 -106 57 40 -120 47
5378 47 58 -116 29 58 -111 12 69 -104 -3 87 -93 -20 81 -79 -28 95 -71 -58 103 -54 -66 95 -37
5401 -37 -78 110 -11 -84 100 9 -100 76 18 -105 72 24 -112 57 54 -106 41 53 -109 25 75 -101 -2 80
5425H0j84Q2J11j86Q3J20j90K7J69j64j3J63j45j9J83j47o1J95r1j09J83p4j03
5448i0J80n8j46J84k4j53J59oj47J36K9j86J34O8j90R7J03k07R1J25j88N2J47
5471A10j68PJ56j56j3J81j56m5J93j21o5J86r6j06J95p3j38J85l0j50J61Jj75
5494a17J61K0j71J32N2j86J24O8j81Q7J06j89O0J39j94M8J49j66JJ67j68k0J92
5517A14j36o2J88j13q4J94q7j16J90n7j32J77m0j38J66qj81J62L2j77J32N4j78
5540a00J02Q6j94R0J22j94M8J39j79J3J66j62LJ66j45m5J83j20p3J91r6r6J80
5563H5n9j32J89m5j51J90rj83J65J9j76J45M0j86J24P3j82Q6J12k02O3J26j77
5586h5M9J36j77L6J48j59k8J82j50m1J68j18p5K22j05p7J58j01k7R8L5j58R0L4
$$ plain form
5425 80 -104 -22 89 -97 -14 106 -84 -57 112 -52 -65 98 -47 -66 117 -30 -91 104 13 -96 87 13 -90
5448 -90 90 32 -114 70 46 -107 52 46 -101 35 64 -122 12 80 -110 -13 90 -117 -26 99 -89 -37 110
5471 110 -58 -51 105 -51 -64 117 -39 -84 109 -12 -77 109 13 -93 102 29 -109 76 46 -104 57 58 -117
5494 -117 44 64 -107 25 77 -109 15 83 -98 -11 95 -94 -34 105 -89 -41 108 -58 -57 110 -58 -78 114
5517 114 -22 -84 104 -9 -93 101 14 -102 88 31 -101 76 36 -102 64 56 -125 37 69 -108 24 78 -100
5540 -100 2 88 -106 -16 106 -88 -40 99 -80 -67 99 -63 -60 106 -39 -84 99 -21 -94 97 1 -95 85
5563 85 26 -106 83 38 -113 77 68 -115 50 69 -107 38 78 -108 16 89 -93 -7 105 -97 -34 92 -85
5586 -85 -36 100 -77 -41 107 -52 -80 102 -48 -89 79 -39 -114 108 3 -74 84 -17 -44 54 89 -69 21 55
5610E5j73J76K1j82J32O0j89J20P6j98Q5J23j89M5J38j82K8J59j85JJ88j68k4
5633h3J87j30p2K04j18r3J96p9j20J84m2j53J89j9j72J84J1j85J53L2j83J36O5
5656I2k03J06J11k09Q0J25j96N2J48j84KJ77j72j4J77j47l3K08j57n9K00r0j16
5679a02J89p7j27K11o7j42J84k4j67J78J1j75J49N0k17J40Q5k08J07J00j88P4
5701a6J17k01N4J60j87J2J76j83oJ79j50n1J93j30p1J93r5r6K11r1j43K04l9j57
5725a17J77Jj75J74K4k06J51O0k02J28O4j92J17J08k02O3J36j85L8J36j75J1J72
5748A06j61l7J81j33n0J91j17q2K03r3j24K05o0j51J90l1j63J97qj81J68L4j91
5771a07J44O0j98J22Q3k08Q9J22j98N1J46j82K8J64j88nJ87j60m6J95j47n1J98
$$ plain form
5610 55 -118 58 79 -103 29 89 -100 20 96 -102 -17 106 -83 -38 100 -82 -54 105 -80 -79 109 -59 -83
5633 -83 104 -26 -98 106 -12 -105 91 12 -108 76 34 -119 70 51 -121 63 74 -111 42 74 -109 27 92
5656 92 -111 -5 106 -103 -23 102 -94 -42 106 -78 -76 101 -71 -85 92 -55 -88 120 -37 -96 104 14 -102
5679 -102 87 10 -117 94 27 -115 69 45 -122 56 67 -108 41 91 -126 14 99 -109 -2 98 -90 -16
5701 -16 101 -100 -46 114 -73 -61 115 -68 -74 105 -45 -96 97 -33 -104 89 -6 -102 109 18 -125 79 40 -117
5725 -117 60 61 -114 60 84 -122 29 89 -113 15 79 -113 4 112 -90 -27 109 -76 -38 98 -77 -66 106
5748 106 -55 -92 89 -44 -94 97 -20 -102 101 8 -116 89 29 -122 68 37 -126 71 63 -118 50 84 -107
5771 -107 37 97 -101 21 104 -104 -15 107 -91 -40 106 -76 -48 116 -72 -77 110 -50 -96 99 -48 -99 99
5794I9j17j01K19r4j16J90m6j56J99k9j81J88Oj80J56M7j96J41P1k11J14J13k07
5817i1P9J27j96M3J62k01J8J64j61j8J77j46n1J96j37q0K07j06j04K00p1j32J97
5840G6m9j55J88nj87J69L6k03J59O5k02J33P2j97R5J24k04N8J46j94K8J65j87
5863f9LJ85j71k8J88j41o1J90j17r4K03r0j15J97n9j39J84k0j69J85Nj97J64M3
5887G7k01J41P7k02J11J13k07P7J20j93N2J42j75NJ85j76k3J90j52m4K04j45p9
5910a03K02j13r6J99q1j33J98n1j57J97k6j62J78J5j95J61M4k03J46P7k16J16
5932cJ13k09Q1J28j90L5J63j85OJ75j69k9J95j46o4K07j18j12K21r9j17K06o5
5955B4j50J91m0j38J55J3j64J40K5k07J61N3j90J22J02k09J12J22k07M6J47j77
$$ plain form
5794 99 -18 -119 100 6 -110 80 34 -122 77 48 -133 55 61 -119 37 84 -112 29 100 -111 3 116 -91
5817 -91 -12 115 -81 -38 124 -77 -59 105 -56 -74 103 -43 -94 102 -35 -115 92 -14 -118 82 11 -121 76
5840 76 27 -128 60 55 -132 37 73 -130 29 94 -108 25 97 -100 -5 119 -85 -27 119 -75 -47 118 -69
5863 -69 -66 119 -52 -80 108 -33 -94 96 -21 -115 88 -2 -117 80 21 -118 66 46 -123 62 67 -130 34 77
5887 77 -124 17 94 -108 3 116 -91 -14 106 -87 -35 107 -68 -63 122 -54 -77 113 -39 -83 121 -24 -103
5910 -103 99 -14 -110 89 8 -125 73 22 -135 62 36 -126 52 67 -128 33 77 -126 20 97 -119 -3
5932 -3 110 -99 -18 110 -80 -45 118 -67 -61 114 -55 -84 111 -35 -99 108 -10 -122 99 0 -117 89 24
5955 24 -126 65 25 -113 42 55 -109 31 56 -151 10 63 -127 -5 97 -112 0 122 -85 -39 108 -69
5977f9K5J51j76JJ87j67m1K02j32q1K05j19q6J96r0j35K04n6j45J88qj92J85K6
6001G3k04J52O2k01J21Q0k07J12J20k03O8J60k10M2J64k00K3J82j84k5K00j62
6023c7m5J92j34o8K07j17j25K31r1j32J91m9j61J96pj81J80K4k03J62N3k10J42
6046A8R0k20J03J13k04P5J46k12N5J76k03oK03j75k9J95j63m7K01j27r9K10r4
6069Fj21K11q4j39K09m7j79J89J1j81J69K0j96J59O8k12J28R7k09R1J21k12P9
6092b2J48k07K9J77j73j2J86j76l2K05j54p3K11j11r9K09r3j38K21o3j68K04k6
6115D3j73J85Lj96J86K4k12J59P5k08J15J03k17J00J45k23N9J51j87J9J77j79
6137e1j2J98j63n6J94j24q8K19j10j25K10p4j39K01l1j82K01k6j95K06Rk06J64
$$ plain form
5977 -69 -44 107 -69 -68 119 -48 -89 113 -19 -100 105 -14 -100 96 6 -129 75 19 -126 62 54 -138 47 73
6001 73 -131 21 83 -118 3 83 -124 -12 108 -95 -27 133 -77 -35 129 -71 -48 134 -50 -75 125 -37
6023 -37 -82 110 -24 -92 115 -2 -127 104 13 -119 72 23 -138 58 51 -130 50 74 -129 33 86 -124 18
6046 18 108 -112 -9 104 -100 -25 121 -91 -36 140 -63 -69 134 -41 -70 125 -38 -85 116 -11 -110 100 6
6069 6 -115 96 12 -127 82 35 -144 45 56 -125 44 64 -132 27 95 -117 11 108 -101 -10 111 -101 -22
6092 -22 126 -81 -52 125 -48 -60 126 -50 -82 123 -31 -104 107 -4 -103 106 13 -125 96 33 -135 69 43
6115 43 -130 55 58 -138 48 72 -140 19 94 -114 1 104 -113 -13 132 -91 -32 119 -68 -49 128 -51
6137 -51 -63 135 -28 -84 110 -14 -102 117 7 -118 92 18 -121 80 49 -133 68 42 -153 53 62 -144 20
6160B0O3k13J38Q2k11J04J23k06O5J52k19M9J78k01PJ98j85j3K04j59o5K10j31
6183a0r2K23j25j20K14o4j58K10k8j81J92jj89J68K6j96J51O7k04J22R0k09R0
6206b4J34k17O4J58k05L0J77j92J3J86j75l2K05j50o6K19j38q8K18r4j45K22p7
6229B3j46K04m8j60J93nj97J74K5j94J39P8j99J17R2k08Q5J33j89L8J68k03K0
6252f0J85j96j2K02j57n6K16j40q1K19j20j11K15r1j23J99n2j61K01j1j99J82
6274D9K2j98J66M0k16J57O7k04J37N6j90R4J07j94N2J57j98J1K24k03qK10j85
6297d7l5J91j23q7K10r7j23K16p6j54K21n0j78J96Pj89J62L0k05J50P8k32J41
6320FR0k18J01J18k04N8J66k11L8J77j90mJ92j83k0K13j55q1K27j32r1K25j19
$$ plain form
6160 20 83 -130 8 90 -121 -17 106 -100 -35 117 -102 -53 125 -76 -69 129 -56 -69 135 -24 -89 121 -10
6183 -10 -102 121 -4 -124 90 26 -132 78 50 -131 61 60 -129 39 65 -131 20 87 -117 5 95 -114 -24
6206 -24 110 -107 -43 115 -90 -60 117 -75 -62 124 -51 -83 122 -28 -94 125 -13 -101 117 23 -122 100 23
6229 23 -123 81 33 -127 66 61 -136 38 63 -131 8 86 -113 4 96 -112 -27 106 -83 -45 123 -80 -60
6252 -60 125 -71 -83 119 -38 -94 122 -18 -99 120 0 -111 104 13 -110 89 37 -124 77 66 -133 49
6274 49 71 -127 39 79 -137 20 87 -117 20 76 -114 -20 87 -107 -55 102 -96 -85 139 -64 -72 138 -47
6297 -47 -82 109 -14 -101 109 12 -111 105 29 -125 96 46 -132 64 71 -118 44 74 -131 19 97 -135 6
6320 6 96 -122 -21 97 -107 -49 117 -94 -56 121 -69 -73 119 -64 -84 129 -26 -107 120 -12 -103 122 3
6343Cj26K25p1j58K01k2j82J87kj74J80L2k23J53O9k15J24R0k15R6J41k24O8J63
6367A20k09K2J82j94mK04j62n1K18j50q2K20j18j13K24q8j34K24o9j52J90k4j84
6390a30J89Nk00J86N2k21J38Q6k23J18J15k21P5J52k29N2J74j96J5J92j89k7K10
6413A23j70m3K14j48r4K28j16j10K29p7j50K15o2j77K21j4j98J98J3k01J56O1
6435I8k23J35J05k30J06J20k26Q0J53k14L5J83j82j7K06j88j6J98j58o3K13j38
6457b3q8K18r4j24K00o8j37J96l4j67K08mj98J79K0k02J36N5j90J55Q9k62J27
6480hJ19k27N5J78k15K4J91j98rK11j68l3K04j52p9K27j36j07K26q2j32K04o3
6503C0j56K01j2k01K07Kj98J70M4k13J46P4k14J11J23k26R3J30k13O4J47k14L0
$$ plain form
6343 3 -123 102 31 -127 74 52 -130 57 55 -119 61 93 -130 23 92 -123 1 91 -124 -28 113 -111 -43 120
6367 120 -89 -67 115 -79 -83 121 -41 -92 126 -24 -106 114 -4 -117 107 19 -115 109 40 -112 78 54 -130
6390 -130 59 64 -136 50 102 -119 19 105 -118 0 115 -106 -31 121 -108 -56 118 -78 -63 129 -60 -87 123
6413 123 -47 -90 124 -24 -118 110 -6 -116 113 36 -114 101 39 -138 83 69 -129 69 82 -119 37 98
6435 98 -125 10 115 -115 -9 111 -115 -35 118 -96 -61 122 -60 -77 129 -59 -75 123 -35 -98 115 -23
6457 -23 -111 107 13 -111 89 21 -116 80 46 -121 87 83 -115 64 84 -118 18 73 -117 38 127 -135 -8
6480 -8 111 -116 -61 117 -98 -74 117 -81 -90 121 -47 -80 124 -28 -107 120 -16 -123 103 21 -111 93 30
6503 30 -126 75 63 -138 69 71 -127 43 87 -126 20 94 -120 -9 114 -112 -19 111 -102 -38 109 -105 -75
6526g5K09k02j3J84j60l3K09j54p8K22j25j06K25r2j24K07o1j68K11j1j86J77
6548E6J4j91J61N9k22J34R3k12J06J11k19R4J36k15M6J63j97J9J82k00KJ97j77
6571f0m0K15j36p9K06j19j10K26r5j39K13m1j67K09l0j83J99Ok05J62P7k23J33
6594A9Q4k11J10J21k27P6J40k00M7J59k03J4J95j87l1K05j58n0K08j43o9K20j17
6617Bj23K15p2j40K04n1j62J96nj86J69L3j97J59M9k20J52Q2k08R5J16k01O1J43
6641A11k05M8J70j93j9K04j70l3K04j67n2K16j30j14K31j01j28K22p2j51K11l7
6663D5j75J91J1j95J73M2k15J56P1k19J12J15k24R5J32k06O3J58k07J6J77j94
6685g8oJ93j68m1K21j52p5K10j07j17K27q5j51K19m5j71K00j6j93J90K3k04J78
$$ plain form
6526 -75 134 -68 -81 103 -57 -90 119 -35 -113 109 -16 -122 103 11 -113 94 33 -135 76 65 -121 56
6548 56 70 -121 40 99 -123 11 104 -108 -2 109 -110 -16 120 -95 -49 114 -83 -64 118 -82 -80 117 -60
6571 -60 -100 115 -21 -100 106 -13 -123 103 8 -131 82 41 -126 83 53 -130 69 75 -130 32 109 -114 19
6594 19 103 -108 2 123 -104 -28 112 -88 -41 118 -85 -71 124 -63 -94 111 -47 -97 111 -32 -101 119 2
6617 2 -121 94 22 -118 86 35 -127 69 64 -122 47 80 -117 42 91 -129 23 105 -103 -8 108 -93 -32 111
6641 111 -94 -46 124 -69 -88 116 -54 -87 117 -50 -102 114 -16 -130 101 0 -128 94 22 -129 82 45
6663 45 -130 61 72 -123 50 92 -123 33 104 -115 -3 112 -112 -17 115 -91 -28 130 -77 -61 116 -78
6685 -78 -84 109 -59 -100 121 -31 -106 104 -3 -120 107 22 -129 90 45 -126 74 58 -135 55 78 -126 52
6708E2M9k23J30Q5k10J22J12k29Q9J36k16P1J54k02K0J72j84j5J93j59n6K12j41
6731c8q3K22j17j14K22q2j37K00l8j67K00rj95J89L1k09J58P7k27J39P9k12J04
6754gJ26k19O9J44k06M4J80k06J2J83j87j4J99j58o2J97j25q1K12j03j20K19p9
6777A8j37J90l9j67J93%j82J73L5k05J57N9k14J40R3k24J05J28k17P1J46k12M5
6800d4J55j77J0J84j80m1K00j45o0K02j31r1K28j16j19K27q1j54K19n6j62J93
6822F1jj89J67K1j80J47N5j99J43Q0k12R9J25k10P1J43k17N0J68j85j5J98j80
6845f0k8J97j55n6K05j29j00K20r2j28K05p7j37K17m3j75J87Lj83J64M4k10J61
6868C0O6k16J25J10k10Q9J19k08O9J53k12L5J73j93MJ93j86m1K23j54q3K16j12
$$ plain form
6708 52 101 -122 8 93 -117 5 117 -112 -23 113 -103 -32 122 -80 -60 112 -72 -87 106 -53 -109 103 -38
6731 -38 -121 101 -16 -130 92 10 -127 73 35 -132 68 59 -136 53 84 -125 33 110 -117 22 101 -111 -7
6754 -7 119 -100 -31 113 -93 -49 131 -75 -63 120 -67 -81 118 -40 -102 95 -30 -111 101 -2 -122 97 18
6777 18 -119 71 32 -135 58 58 -124 49 84 -121 36 95 -119 21 114 -110 -5 123 -94 -23 123 -89 -44
6800 -44 111 -66 -56 128 -52 -93 107 -38 -98 104 -27 -118 110 -6 -125 102 21 -133 86 30 -132 61
6822 61 60 -129 38 59 -121 26 81 -118 25 105 -107 -8 117 -93 -22 121 -96 -46 122 -63 -78 120 -60
6845 -60 -88 109 -46 -102 103 -26 -126 94 2 -126 79 2 -135 82 39 -136 51 54 -129 35 79 -131 30
6868 30 96 -120 5 115 -95 -6 113 -95 -26 127 -85 -50 123 -70 -66 127 -59 -100 123 -31 -114 102 -10
6891a0j13K16r4j44K18m5j61J95j7j71J75J1j96J68M5k11J48Q6k11J19R7k12Q7
6914b0J50k26N9J58k12L5J82j95PJ91j86l4J98j39o8K09j26j13K20o9j58K09m2
6937C0j65K04ok05J95K7k10J60N1j96J33P9k10J09J18k12P5J44k07N4J55j97K8
6960d6J68j70l5K02j52m7K01j55p8K27j13j23K09p4j37K00m1j69J99j8j92J81
6982C7L4j94J47N7k07J37J07k20R6J20j99P6J45k23M2J78j94oJ97j72l3J92j61
7005d4n8K14j25r9K14r6j22K03o8j52K00k9j78J95Oj90J71L3k05J51P6k12J09
7028fR8j88R4J21k09N8J66k04L1J69j78j4J77j64l4K04j39p2K07j22j05K12r7
7051Ej39K15n0j68K00j6j87J95J8j92J56M1k00J48P3k06J07J13k20R3J30k06O4
$$ plain form
6891 -10 -123 93 -1 -145 73 28 -133 62 45 -126 49 60 -136 32 77 -134 14 100 -111 8 105 -107 -20
6914 -20 130 -96 -37 121 -91 -56 126 -69 -62 129 -57 -91 107 -32 -100 109 -17 -130 90 21 -137 72 30
6937 30 -135 69 63 -142 53 80 -130 30 81 -115 18 97 -113 -4 114 -98 -23 121 -86 -32 123 -74 -46
6960 -46 122 -48 -83 119 -33 -80 121 -34 -112 115 2 -121 88 14 -123 77 36 -133 66 48 -144 37
6982 37 71 -123 24 81 -126 11 118 -102 -6 114 -85 -9 136 -87 -45 133 -61 -67 130 -42 -75 117 -44
7005 -44 -102 112 -13 -112 102 6 -116 87 19 -133 67 38 -140 55 61 -129 42 75 -130 21 97 -115 -6
7028 -6 92 -96 -2 119 -90 -32 134 -70 -39 130 -48 -62 115 -49 -83 121 -18 -90 117 -5 -110 102 5
7051 5 -134 81 31 -137 63 47 -140 55 73 -119 37 78 -122 26 99 -107 0 113 -107 -14 116 -90 -26
7074b6J54j95RJ88j76k1J96j59n3K11j42q4K14j03j29K31q6j48K00l2j84J87j
7097E1j90J76L4k14J63O7k07J31Q5k03R0J16j94P2J42k00L9J68j84QJ85j83j8
7120f6J92j49p0K06j25q0K10j15j18K08o7j51J95l2j69J87j3j77J68M4k12J43
7142IP3j97J13R5k14J04J37k16N4J55j88K5J73j84LJ97j77n1K02j28q1K07j21
7165a0j01K18q0j35J89n3j40J83k6j78J95kj85J59L9j96J48O2k06J22J04k17P5
7188c5J45k02M8J67k00K7J91j94j7J90j47m2J93j46p3K15j10j26K08p7j34K07
7210H8n3j64K02j8j93J79K0j86J55M2j98J39Q2k09J02J10j90O2J36k01M3J70j98
7233h0J1J88j55k4J86j60n8K07j25q7K03r9j07K06r2j38J98k1j76J84jj83J64
$$ plain form
7074 -26 128 -67 -58 130 -46 -67 129 -30 -83 128 -14 -98 116 13 -116 115 29 -119 81 49 -135 52 51
7097 51 -139 37 71 -143 20 87 -120 11 96 -107 -17 99 -95 -23 119 -81 -42 126 -58 -50 135 -48 -66
7120 -66 126 -23 -93 113 -12 -92 118 3 -115 93 26 -125 70 38 -131 56 43 -134 34 78 -134 9
7142 9 82 -115 -2 93 -121 -17 120 -96 -42 113 -75 -50 123 -61 -58 139 -38 -89 113 -15 -96 111 -10
7165 -10 -111 107 27 -108 81 28 -112 71 45 -133 62 60 -125 34 73 -123 25 87 -119 3 107 -110 -35
7188 -35 110 -92 -44 123 -77 -50 141 -53 -70 120 -27 -69 124 -22 -95 120 10 -116 92 15 -119 88
7210 88 35 -129 73 55 -138 41 61 -125 30 72 -126 13 95 -114 -12 98 -92 -30 106 -95 -52 118 -80
7233 -80 -69 119 -36 -60 126 -34 -92 115 -10 -97 106 7 -100 106 14 -124 74 53 -123 61 60 -123 41
7256D1K5j95J55O6k20J30R0j94R9J09k06P6J41k05M6J56j90J0J76j70j7J99j44
7279b2o0J91j12r2K03j06j16K06n7j50J96l8j60J81oj84J64L3k01J51O9k07J19
7302BQ5j98R5J18j95P0J31j94N4J38j77%J83j47m1J95j37o2K02j26r3K01r4j10
7326a00J92o8j40J96l1j61J78Nj82J57K7j94J35O6k01J20R7k01R1J19j99N9J53
7349A18j94L3J56j79oJ90j62l8K04j43o0J91j12r1J98r3j20J91n6j30J75k4j64
7372a16J76jj74J49L7j85J22P4j93J06J01j95P1J23j88O3J28j85M6J61j80j0J79
7395A09j57m0K02j38n9J86j05r4J97p0j33J93o6j32J79j0j72J75Kj66J19M6j80
7418a14J44M7j85R8J07j91N8J29j89P0J42j70m4K05j75LJ82j86j7K10j20q7J93
$$ plain form
7256 41 66 -129 26 92 -128 2 92 -102 -3 106 -100 -24 117 -88 -42 114 -76 -66 110 -60 -77 122 -22
7279 -22 -82 109 -3 -95 108 2 -114 92 35 -115 81 43 -117 64 58 -126 38 71 -130 21 90 -117 2
7302 2 87 -111 -16 102 -93 -23 108 -86 -32 106 -71 -71 112 -35 -76 119 -18 -80 122 -4 -97 104 10 -100
7326 -100 92 24 -116 80 49 -112 66 71 -111 46 73 -121 14 80 -121 -1 96 -105 -14 105 -94 -35 118
7349 118 -76 -43 113 -66 -72 118 -44 -82 122 -21 -81 110 -2 -93 105 12 -108 83 27 -103 72 48 -116
7372 -116 60 59 -115 34 71 -114 8 82 -111 -5 96 -99 -28 95 -93 -30 98 -87 -41 120 -60 -70 109
7395 109 -48 -88 114 -24 -83 103 -2 -96 101 31 -102 91 25 -107 72 62 -110 65 67 -99 20 66 -114
7418 -114 30 77 -108 -10 97 -94 -36 93 -96 -26 116 -54 -98 107 -68 -65 117 -69 -86 124 4 -83 110
7441A10j21o2J66p2j25K03l8k20K15%j80J50P0k17J26N8j61P9J22j47L8J04j20
7464b2M1L1j61Q8R7q6l5J73j90J3K01k01m9K03j23o4J79r8q7J62J1k19J94j5r2
7489d9J36l1j55J42K4j80J65K6j84J62jj69J15J24k05N4J16j47pJ48j64j9K12
7512A13j95m0K63j97m0K00j29o9J62pj64J64l5q4J67q8j06J39Qj65J07J05k04
7535i5J55O1k37J06O6j93J20P8j41N9J07j99J00Q3j77Q2J87j78n2J45j16l0J93
7558A24j42j17K20o6p4J42p9j38K10m0j46J52Nj59J52J7j59J55N2k24J36O6j99
7581a12J31N9j65M1J71k49M4J83j73l1J81j49kJ84j66j9J33p9p8K65j38j07J53
7604G7j7q9N1J7j25R4J8j05R0R9k12N1P8j34J57N7j38J8J21j68L8J09j40k0J31
$$ plain form
7441 110 -11 -73 93 21 -104 99 61 -159 56 56 -124 26 96 -121 5 63 -98 -19 103 -44 -6 98 -22
7464 -22 19 50 -111 -23 74 -12 -47 126 -64 -51 150 -51 -100 103 -20 -84 95 -3 -90 72 83 -136 58 43 -49
7489 -49 87 56 -99 43 67 -113 52 78 -106 56 55 -114 1 125 -80 -26 90 -57 -64 84 -80 -99 113
7512 113 -82 -122 141 -56 -96 104 -25 -94 68 61 -103 61 26 -58 109 21 -85 54 62 -103 4 109 -95
7535 -95 60 121 -116 -10 56 -137 -17 61 -80 -21 86 -113 -13 70 -107 -25 162 -16 -68 77 -39 -69 124
7558 124 -18 -135 85 19 -55 87 8 -130 80 40 -106 46 51 -108 44 61 -98 57 109 -115 21 87 -112
7581 -112 19 78 -87 -46 125 -124 -80 103 -70 -101 80 -69 -71 113 -53 -72 61 -18 -96 169 31 -76 77
7604 77 60 -29 22 39 -86 8 26 -79 11 110 -102 -51 27 -107 50 107 -31 -13 108 -60 -22 87 -53 -73 58
7629E8j58L9J82j62j0J98k15MJ42o1j21K14j61j6K21q5j62K07j02o1J23pj57J17
7653B7K4j46J28J8j98J40J06j61N0P8j82L4J85k02M0J35r6j6J05j47O7M4m0r3
7677a00K48j55j24J98m8j49J76j7j58K01k2j55J42k6q8Q9O5j31L8J08k33J67R2
7700A18j84N5J01j93Q4J09j80J3J63j60j1J74j17m8J58j09n1J47j00m2J70o7j35
7723a05J91q8o0J15Pj02O2J2r0J31Kk43J59J35k23Q8Q4j76P1J49k00M5J49j73
7747f0KJ46j46mJ49j39k6J75j18o1J79j04q6J71p6j00J66l2j37J57j1j32J48l
7771E8j52J31L5j65J05O3j62R1P8j63O2J08j53L1J29j64J7J39j51pJ63j25n3J60
7795G5j05o6J78r1q9J67n8j08J51k7j26J68l1j37J45K3j47J07M2j53Q2P6j67P9
$$ plain form
7629 58 -100 -61 121 -41 -51 147 -68 -64 78 17 -104 110 -51 -67 154 69 -93 114 12 -49 74 67 -90 27
7653 27 51 -95 33 51 -147 -7 99 -62 -12 66 -116 -82 103 -99 -59 76 -20 -36 69 -78 -11 33 -7 -100
7677 -100 148 -7 -131 67 19 -130 46 29 -129 72 50 -105 37 11 -77 12 77 -54 -16 92 -141 26 118
7700 118 -66 -11 90 -103 -19 90 -90 -77 86 -74 -85 89 -28 -76 82 -27 -78 69 -31 -73 97 30 -105
7723 -105 86 -2 -62 53 60 -42 20 32 -58 73 75 -168 -9 126 -97 -9 75 -101 -30 119 -81 -36 113 -60
7747 -60 -58 88 -58 -62 87 -52 -78 97 -21 -82 97 -7 -93 78 2 -98 68 36 -101 56 45 -87 61 58
7771 58 -94 37 72 -93 12 75 -87 4 82 -81 -19 89 -64 -33 96 -68 -51 88 -63 -70 93 -32 -85 75
7795 75 -30 -96 82 -9 -98 69 11 -97 54 27 -99 69 38 -99 46 69 -78 29 71 -82 0 76 -91 -12
7819a2R8j57N5J08j61M7J18j72RJ43j16k8J50j25l2J60j09p5J82r0r1J63o0j04
7843i9J55l0j33J59lj38J29K5j45J16L2j59J02P3j72Q7Q2j55N7J04j59L9J13j40
7867f0LJ35j34pJ47j27m4J68q9p8J51o7q1J59p6r2J45k6j27J48qj31J29J8j40
7892h4J08M9j61J00O5j57Q3P5j45M2J13j58K2J28j40J0J35j25l8J52j02n5J48
7915F5q2o2J50p3q9J51l9j25J61k2j29J39Jj38J27K9j49J09M1j47Q1Q1j49N9R3
7940H3j58M8J23j54J2J33j39nJ36j18m7J57j10m6J54r6o1J47o2q9J50l9j23J48
7964D4rj28J37j3j22J19L3j39R6N7j58Q7O7j41O1R6j54M2J17j44J0J30j37nJ41
7989H7j24l1J30q0o6J54q2p5J49n3j03J42m3r6J30j2j29J34J3j35J16L7j42J01
$$ plain form
7819 -12 86 -71 -16 92 -69 -22 96 -76 -67 76 -40 -68 82 -43 -75 85 -24 -99 83 -7 -98 65 5 -99
7843 -99 56 26 -107 52 49 -89 40 65 -80 36 68 -91 11 84 -88 -1 81 -74 -17 87 -72 -33 80 -60
7867 -60 -57 78 -56 -63 84 -43 -87 81 -8 -86 65 -2 -83 76 0 -92 53 27 -100 48 40 -91 38 56 -84
7892 -84 24 73 -88 12 77 -80 3 78 -67 -25 88 -70 -48 80 -60 -50 85 -40 -78 74 -28 -83 65
7915 65 -17 -79 71 -2 -91 60 21 -104 57 35 -94 45 46 -92 35 64 -85 24 65 -82 -1 80 -69 -10 83
7940 83 -75 -27 96 -58 -46 87 -52 -57 79 -39 -86 71 -39 -85 69 -27 -88 59 -3 -92 58 19 -104 44
7964 44 35 -93 44 31 -91 28 61 -78 18 75 -83 4 71 -70 -9 87 -67 -25 92 -52 -42 88 -49 -54 87
7989 87 -37 -68 62 -18 -84 70 -12 -87 62 9 -94 48 5 -91 39 27 -102 32 45 -90 26 63 -79 22
8013B2N2j52Q4Q3j54M5J00j24RJ06j36J1J40j19l4J46j08m2J43j03m8J47o2j00
8037i4J54n7r1J30l7j05J31pj18J18J7j37J38J5j41R2O4j35N6Q3j30M8R7j53L3
8062b9J17j30mJ17j05j1J18j11l4J38q8n4J44p4q0J45n4j02J42j4j20J15Qj21
8086h7J14K2j39J03M1j30P9N7j30P0Q1j41N2R9j42J1J23j13qJ22j20j7J24q5n0
8111f4J28q7n1J33o9p8J35l4j01J21k0r1J15qj20J13K9j29Q5M3j28Q6O0j37N4
8136a5R1j39M9Q5j29L5R2j13J0J19j04l9J29r6l2J28q8o9J36o0p6J34m1r8J43
8161E2l0j03J05J7j30J08J6j10R4M6j35Q0O3j35N8P0j16L3Q5j14J7J14j25nJ26
8186H1j05k8J39r9o1
$$ plain form
8013 22 74 -78 6 89 -65 -20 80 -44 -35 71 -65 -54 86 -33 -67 79 -29 -71 72 -31 -79 68 6 -94
8037 -94 60 3 -88 42 5 -100 31 24 -94 24 41 -96 42 57 -84 8 72 -63 -7 76 -54 -6 91 -62 -29
8062 -29 88 -42 -46 71 -34 -45 73 -38 -72 66 -22 -76 68 -6 -86 59 5 -97 45 31 -89 26 34 -87
8086 -87 27 49 -90 13 54 -76 3 60 -70 0 81 -60 -8 91 -51 -40 83 -30 -38 84 -36 -53 71 -14 -64
8111 -64 64 -23 -74 59 -10 -88 47 13 -88 33 13 -78 37 29 -91 22 51 -78 7 50 -78 8 68 -69 -15
8136 -15 76 -63 -14 71 -58 -23 69 -44 -34 85 -19 -58 71 -25 -57 71 -17 -86 50 -10 -86 48 7 -91 52
8161 52 22 -81 24 41 -89 19 35 -75 19 65 -70 10 73 -62 -4 66 -50 -17 68 -46 -29 85 -40 -45 81
8186 81 -24 -52 87 -12 -73
8191g3
$$ Imaginary data points
##PAGE= N=2
##DATA TABLE= (X++(I..I)), XYDATA
0@%%%%%%%%%%%%%%%%%pJ5j6J6j6J6j9K7l2L3m1M8n1N9o7P6q8R8j09J24j40J56
39H2j73J92k14K37k61K89l20L52l88M28m69N15n69O30o95P69q51R44j055J182
59F25j334J518j743K028k404K925l684M891p108J2352m4167j9446J32602r2527
73a5472l6819J10914o5946m1482J08462o8101m9233J17469n2534p4861J19300
84E1697l0202r0921J08265l630j00306Q9558J1657r4840P9327J9038j00282P7178
96A6539L6352j13222N6671O2145j05120L3435O9139r4688K1678P4779r3219Q972
108b6539Q6631q6593r145R3698p5742k5200R8975o1180m3152R5269m4633n1555
120d9166R0888l3883n9229R1726k1992p4991Q5683j299q0806P3081J2334q1994
$$ plain form
0 0 0 0 0 0 0 0 0 0 0 0 0 0 0 0 0 0 0 -7 8 -8 8 -8 8 -11 16 -16 17 -24 24 -27 32 -35 41 -47 51 -58 66 -74 82
39 82 -91 101 -113 124 -137 152 -168 184 -204 224 -245 270 -299 331 -364 405 -446 498 -557 625
59 625 -709 809 -934 1094 -1310 1615 -2069 2822 -4286 8066 -36101 -55547 77055 -15472
73 -15472 -52291 58623 -7323 -48805 59657 -8444 -57677 59792 7258 -67603 51697
84 51697 21495 -69426 38839 35209 -65097 24461 36118 -58722 20605 39643 -60639 16539
96 16539 52891 -60331 -3660 58485 -46635 -13200 55939 -38749 -17071 57708 -35511 -26539
108 -26539 60092 -26501 -35646 58052 -17690 -42890 56085 -5095 -48247 47022 2389 -49166
120 -49166 41722 7839 -51390 40336 18344 -56647 29036 27737 -53069 20012 32346 -49648
132d9648O3482K3646q4776N3085L6647q5331M0042M7745q3459K7825N9657p9074
144c0159J1372O5582p0930q1O9760o4369j0266P5942n7600k5892P8840m4439l7211
157c9451P7082l3325m6227P5248k1943n4698P1562j0146o1960O5594J245o7345
169d4364N9797J5012p1259M8535K5462p1334L9097L4823p0561L0023M4281o9444
181b9932J7578N2186o3694O533N6806n8236l955O1220n0753j4025O3458m3289
193f103k3963O4267l5432l3036O5682k4555m2348O1867j4413m8478N7496m742
205A6242n2743N3272M424n7416M7457J4232o0271M0518K3720o2201L1645L3005
217C1884o0538K2726M0190n8334J2797M5405n4687M086N0937m9197n108N3852
$$ plain form
132 -49648 13834 37480 -47296 5789 42436 -42895 -2853 44892 -38567 -10742 48915 -30159
144 -30159 -18787 46795 -24135 -24216 45544 -18825 -29091 46851 -10749 -36641 42199 -2240 -39451
157 -39451 37631 4306 -41921 33327 11384 -43314 28248 18102 -43858 21736 22981 -44364
169 -44364 15433 30445 -40814 7721 33183 -38151 946 35769 -34792 -4769 39512 -29932
181 -29932 -12354 39832 -23862 -17329 39477 -18759 -22714 38506 -12247 -26272 37186 -6103
193 -6103 -30066 34201 -1231 -34267 31415 6860 -35488 26379 11966 -36512 20984 16242
205 16242 -36501 16771 21195 -36221 11236 25468 -34803 5715 29435 -32766 -1121 31884
217 31884 -28654 -5928 34262 -24072 -11275 34130 -20557 -16471 34466 -14731 -19839 34013
229C4013m3986j4526N6403l6282k3082N6732k8320l0780N5806j9558l7401N3166
241B2185j0951m3088M8988k355m6393M5598O052n0974L9362J4853n2909L2399
253B767K3079n2604K5581K9774n2946J7479L6964n0302Q754M1523m6898J279M6132
266C0582m2804p338M9549l6845j6203M9908k9946k1926N1034k3474k9869M9812
278B2480j5052l5834M6552o942l9484M3433L24m4011L8697R209m5677L1937J5188
291B0820m6275K7159K2146m7176K0195K9271m5702J1722L3379m2766O122L8378
303B7273m0439k239M2140l5363r741M3357l0205j5445M5048k5258k2806M5421
315B1743j7538k8272M2868j1932l2639M1828m763l7501L8292L382m0133L2419
$$ plain form
229 34013 -9973 -24499 31904 -4378 -27460 29272 952 -29828 25978 6420 -30981 22185
241 22185 11234 -31854 17134 14779 -31614 13984 20036 -30938 8424 23277 -29632 2767
253 2767 25846 -26758 -1177 28597 -24349 -6870 30094 -20208 -11454 30069 -16829 -15550 30582
266 30582 -12222 -19560 29989 -6856 -23059 26849 -3097 -25023 26011 2537 -27332 22480
278 22480 7428 -28406 18146 11204 -28280 15153 15477 -28534 10163 19372 -26305 5632 20820
291 20820 -25455 1704 23850 -23326 -3131 26140 -19562 -7840 25539 -17227 -11105 27273
303 27273 -13166 -15405 26735 -8628 -18369 24988 -5217 -20662 24386 -872 -23678 21743
315 21743 4205 -24067 18801 6869 -25770 16058 11295 -26206 12086 15468 -24665 7754
327G754Q995m1051K8914J5758m2778K2178K2093m1129J5791K5823l9917J0801
339f768L1027l8905K953L5805l3736m005L6461l0323r253L9115k5842j5943L9860
352B0446j9568k0942L8267j5460k5012L9262r383l1212L6432j647l3556L2327
364I954L161l5628K9797R238l8456K4455J6031l7272J9009J9037l7670J5056K4848
377B1560l7342P904K9712l3240J446L0686l0579k826L4122k7504j0035L5477k1473
390b092j4667L4604j7712j8660L5513j3017k4631L4087n707k7166L0794j838k9961
403b0453K9420L942l3453K5424J0526l3686K0543J3975l4147J7457J9259l4899
415a6092J1285K4028l2174N999K6273l0425J666K9664k8531m851L2131k3357r633
$$ plain form
327 7754 16749 -24302 4612 20370 -22408 -230 21863 -19266 -3475 22348 -17569 -6768
339 -6768 24259 -14646 -11693 24112 -9624 -13629 22832 -7491 -16744 22371 -3471 -19414 20446
352 20446 878 -20064 18203 2743 -22269 16993 7610 -23602 12830 11183 -22373 9954
364 9954 13115 -22513 7284 16522 -21934 2521 18552 -18720 289 19326 -18344 -3288 21560
377 21560 -15782 -7878 21834 -11406 -9960 20726 -9853 -12679 21443 -6061 -16096 19381 -2092
390 -2092 -16759 17845 133 -18527 16986 3969 -20662 13425 7718 -19448 11346 9508 -20453
403 -20453 8967 12909 -20544 4880 15406 -18280 2263 16238 -17909 -452 18807 -16092
415 -16092 -4807 19221 -12953 -6954 19319 -11106 -9440 20224 -8307 -13158 18973 -4384 -14017
428a4017L1891k0030j3754L2790j5781j8822L2096r930k2170K9859n608k4905
440a8381K8611n31k8324K5338N020k9337K1974R165l0455J8749J3792l1390J3958
453a811J8337k9947R555K1122k9146N366K4582k7635J65K7208k4669m476K8652
466A7303k1847q909L0247j8051j4070L0026j3236j7595K9108q866k0810K7817
478A1117m314k3875K5533M90k5638K3089M832k7603J9897R780k8312J5546J3780
491A4322k7711J1527J6903k6975P689K0197k5826L109K2647k3905r93K4947k1552
504e621n467K6592j8422j0003K7135j4567j3676K6983j0774j7123K6267o674k0074
517a5424K4945k554k2700K2973J905k4573K0255O302k5616J6759J0182k5962J3103
$$ plain form
428 -14017 17874 -2156 -15910 16880 1099 -17723 14373 4443 -17727 12132 6524 -18381
440 -18381 10230 9699 -18625 6713 11733 -17604 4370 13535 -16920 1829 15621 -15769 -1811
453 -1811 16526 -13421 -3866 17256 -11890 -6524 18058 -9577 -9412 17796 -6873 -11349 17303
466 17303 -4544 -13453 16794 -1257 -15327 14699 1463 -16132 12976 4110 -16700 11117
478 11117 6803 -17072 8461 8951 -16687 6402 11234 -16369 3528 13308 -15004 542 14322
491 14322 -13389 -1862 15041 -11934 -4245 15952 -9874 -6765 15882 -8023 -9016 15931 -5621
504 -5621 -11088 15504 -2918 -12921 14214 -353 -14029 12954 2180 -14943 11324 4650 -15424
517 -15424 9521 6967 -15733 7240 9145 -15428 4827 11129 -14487 2272 12454 -13508 -405
530d05J3985k5422R120J6997k4454N151J9737k2918R06K1896k0492l140K3114
543A4075j7914o739K4230j5113j0839K4603j1303j4066K3968p898j6791K3398
555I611m327j9821K1864J03k1464J9409L423k2668J7530P134k4206J4349J1265
568A2202k3941J0569J3819k3233P682J6657k2804L529J9335k0494l69K0323j8414
581e139l348K1804j6365p489K2630j2653j0584K1900r914j2864K2129o962j6301
594a3156K1163k563j8144J8891L14j9262J7756L577k1314J5208P579k1395J2108
607G62R764k1406J0257J2765k2168O616J6138k0521K715J7436j8875M4J9266j7474
621d681l878K0577j4388o882K0403j2279r288K1285r663j3049K0806n364j5151
$$ plain form
530 -405 13580 -11842 -2722 14275 -10179 -5028 14709 -8209 -7303 14593 -5899 -9039 14075
543 14075 -3839 -10578 13652 -1461 -12300 12303 1000 -13066 10902 3004 -13787 9611
555 9611 5284 -14537 7327 7430 -14034 5375 8798 -13870 3660 10794 -13412 937 12202
568 12202 -11739 -1170 12649 -10584 -2902 13755 -9049 -5520 13815 -6679 -7048 13275 -5139
581 -5139 -8487 13317 -3048 -10537 12093 -560 -11144 10756 842 -12022 10107 3145 -13156
594 -13156 8007 5444 -12700 6191 6505 -12757 4999 8576 -12738 2470 10049 -11346 762
607 762 10526 -10880 -623 12142 -10026 -3410 12728 -7793 -5078 12358 -6517 -6473 12793 -4681
621 -4681 -8559 12018 -2370 -9252 11151 -1128 -10416 10869 1206 -11843 8963 3599 -11552
634a1552J8787k556j6492J7894N87j8643J5692M323j9027J3192O521j9573J1590
647G43R659k0480Q197J2853j9156M962J4298j8346K513J6561j7381j226J8168
660A1365j4904m022J8558j3410o580J9931j1015j0258J9572p439j2132J8474n198
673B942j4035J8236j991j6623J6199J735j7036J4054L843j7973J2548P099j8806
686i808R301R940j7701O709J1305j7561M635J4061j6992P84J5675j4687j730J6203
700A0134j3503m018J7715j1673p512J7780q631r206J7296o998j1398J7702m053
713C635j4161J6186o57j4922J4521J233j6138J3669M408j7519J0743P316j6903
726h589Q362Q943j6845O441J1527j6641K927J3359j4697N34J4114j3775j683J5726
$$ plain form
634 -11552 7235 4679 -11813 6081 6668 -11975 3717 8040 -10987 2205 8726 -10847 743
647 743 10402 -10078 -1881 10972 -8184 -3222 11076 -7270 -4757 11804 -5577 -6803 11365
660 11365 -3539 -7561 10997 -2413 -8993 10938 -77 -10335 9237 1798 -10334 8140 2942
673 2942 -11093 7143 5152 -11471 4728 6463 -10573 3481 7324 -10649 1899 8998 -9808
686 -9808 -507 9433 -8268 -1559 9746 -7815 -3180 10881 -6111 -5327 10348 -4339 -6069 10134
700 10134 -3369 -7387 10328 -1345 -8857 8923 292 -8914 8382 1384 -10014 7688 3635
713 3635 -10526 5660 5003 -9919 4602 5835 -10303 3366 7774 -9745 998 8314 -8589
726 -8589 -227 8716 -8129 -1688 9839 -6802 -3875 9484 -5213 -4679 9435 -4340 -6023 9703
740I703j2251m913J6248r566p041J5853p779q859J6233n419j1308J5298k773j2577
754i151J4394p48j3966J3744J993j5653J1617M848j5617R522O628j5741P786Q793
768H449j5766N415J0718j5043L074J2082j4322Q77J3815j3007k046J4498j1053
781b309m343J4718r090o212J4899p216q354J4627n039r980J4199k918j1680J3441
795D743l90j2919J2090J938j3694J0449L913j4134R062O109j4462P121P967j4530
809f737N064R841j3958K940J1305j3194O84J2491j2048j556J3379j0602l765J3826
823G670q827n703J4155o971p839J3791m764r373J3187k589j0518J2363o73j1900
837g991J1244J707j2587R741L683j3080Q211N732j3332O279P553j3051M276Q857
$$ plain form
740 9703 -2548 -7461 8787 -779 -7820 8033 254 -8605 7628 2209 -9099 6199 3426 -9151
754 -9151 5243 4495 -9471 4273 6266 -9387 2230 7078 -8539 983 7611 -8130 -344 8449
768 8449 -7317 -1902 8816 -6227 -3153 8929 -5393 -4516 9299 -3708 -5754 8744 -2309
781 -2309 -6652 8066 -1024 -7236 7663 447 -7907 6720 1681 -8299 5900 2982 -8698 4743
795 4743 4353 -8566 3524 5462 -8232 2217 6130 -8004 1058 7167 -7295 -174 7793 -6737
809 -6737 -1673 8168 -5790 -2850 8455 -4739 -4055 8436 -3612 -5168 8211 -2391 -6156 7670
823 7670 -1157 -6860 7295 324 -7515 6276 1512 -7861 5326 2737 -7781 4582 3909 -7991
837 -7991 3253 4960 -7627 2114 5797 -7283 928 6660 -6672 -393 7160 -5891 -1615 7242
851G242j2551K766J0447j2159L20J1611j0876j671J2263r594l355J2979q347n684
865f609J3210o164p267J2678m585q565J2604k636j0263J1750l05j1172J0198J391
879D265j1543R484L384j2497P593N437j2309N724O847j2004M303Q433j1901J989
893b795R855j0547J36J0148r913j153J1423r045l484J2146p203n449J1698n751
907F6o508J2147m143q487J1470k003r339J0466o19j0041J0169J168j1477Q822
921A691L645j1545O929M811j1575N735O613j1535L734Q110j0680J769Q551j0109
935c856O53J0054r443j792J0783p729l527J0653o500m726J1077n234o593J0993
949D813l174p567J0166k137q660J0079k36r836R073J788j0295P586K897j0646
$$ plain form
851 7242 -5309 -2543 7904 -4255 -3935 7676 -3200 -4871 7392 -2202 -5557 7422 -925 -6609
865 -6609 6601 437 -6830 5848 1263 -7302 5302 2666 -7597 4153 3848 -7324 2874 4265
879 4265 -7278 2206 5590 -6907 686 6123 -6186 -462 6385 -5619 -1316 7117 -4784 -2795
893 -2795 7060 -3487 -3351 6797 -3116 -4269 7154 -1891 -5375 6771 -432 -5881 5817 66
907 66 -6442 5705 1562 -6925 4545 2542 -6797 3669 3050 -6991 3178 4346 -7131 1691
921 1691 5336 -6209 720 5531 -6044 -309 6304 -5231 -1497 6613 -4067 -2298 6253 -3856
935 -3856 -3203 6851 -2592 -4384 6399 -1330 -4857 5796 -704 -5430 5647 413 -6180 4813
949 4813 1639 -5928 4238 2101 -6559 3520 3284 -6552 2521 4309 -5986 1600 4497 -6149
963f149O895M760j1090N080O317j0603L570P218j0362K108Q596r784J9R470q246
978b201j382R550p706k923J0396o264m736J0378m439n895R787l422p018R883j599
993B409q362Q802J66q646Q026J263r485P312L012j0146N832M702r679M656N500
1008E362j0081L329P184r640J452Q121q598J32Q508q254j287R661p121l318R597
1023E047n465m171R507m629n547R734l073p153Q991r68p516Q163k1q494P612J688
1039C705r001O272L160q919N312L914r228M480N607r411K521O674q479J355P390
1054E352q082l3Q248p579j684Q797o308k556Q905n709l976R393m401n454R090
1069D003k663o400Q414j387p201Q121j4q063P073J427q334O218K751q608N120
$$ plain form
963 -6149 746 5506 -5584 -504 5813 -4790 -1220 5998 -4364 -2256 6340 -3444 -3425 6045 -2201
978 -2201 -3583 5967 -1739 -4662 5734 -530 -5266 5112 673 -5222 4565 1143 -5875 4008 2409
993 2409 -5953 2849 3015 -5631 2395 3658 -5827 1485 4497 -5649 183 4885 -4794 -138 5362
1008 5362 -4719 -1390 5794 -3846 -2394 5727 -2871 -2739 5769 -2485 -3772 5889 -1232 -4550 5047
1023 5047 -418 -4589 4918 289 -5258 4476 1403 -5750 3241 2273 -5243 2920 2899 -5595 2017 3705
1039 3705 -5296 976 4136 -4783 529 4443 -4785 -305 5302 -4109 -1588 5086 -3393 -2038 5352
1054 5352 -2730 -2763 5485 -2094 -3778 5019 -1289 -3845 5060 -649 -4625 4768 367 -5087 4003
1069 4003 1340 -5060 3354 1967 -5234 2887 2873 -5190 1883 3310 -5024 1194 3945 -4663 457
1084D57M034q878L651N364q311K399O197q026J066P021p471k61P719o725j633
1099c397Q130n771k778Q471m767m173Q389l659n188Q380k261o112P963j196p096
1114e065P466K71p658O705J616q041N674K760q155M738L922q352L439N102p928
1129c506K291N965p613R78O643p212l20P439o125j580P530n396k717P827m397
1144a93l931P931l190m959P644k100n698P515j038o767O881M08p062O226J462
1159C129p505N442K565p993M383L987p675L249M608p641K365N676p532R38O557
1174D553o723l85O895n920j354P402n227k920P463l869l694P341l011m533P358
1189C376k084n778O988m89o203O221L58o713N830J654p315M741K848p206L796
$$ plain form
1084 457 4491 -4387 -736 4628 -3683 -1284 4913 -3113 -2047 4974 -2497 -2758 4961 -1764 -3397
1099 -3397 4733 -1038 -3816 4655 -112 -4285 4104 445 -4743 3637 1376 -4736 3227 2031 -5065
1114 -5065 2401 2672 -4986 1719 3335 -4706 968 3728 -4427 311 4233 -4119 -680 4422 -3506
1129 -3506 -1215 4750 -2863 -1885 4758 -2454 -2774 4665 -1460 -3040 4490 -906 -3623 4204 -193
1144 -193 -4124 3807 617 -4342 3302 1202 -4496 3019 1981 -4786 2095 2503 -4559 1667 3129
1159 3129 -4376 1066 3631 -4362 21 4008 -3667 -418 4190 -3451 -1086 4590 -2942 -2004 4553
1174 4553 -2170 -2555 4340 -1580 -2934 4468 -759 -3679 3784 -85 -3779 3562 551 -3982 3376
1189 3376 1292 -4486 2502 2013 -4190 2031 2389 -4324 1506 3160 -4155 586 3434 -3772 24
1204B4L487p191L353M640p578J796N618o774P61O059o337j41O731n905j694P154
1220D003m615k593O944m042l386P402l004m767P026j583n398O342o79n774O240
1235B116N03o721N156J815o651M365K536o781L812L624p130K505M706o512J457
1250a200M988o368P92O000o028o68O483n143j705O496m524k361P077l762l781
1265c704O865k532m373O557j743n032O480o10n975N793P18o153M956J419o520
1280c854M504K713o749L296L623o487K275M172o325J594N211o094J54N687n327
1295a607o90N951m916j545O504m217k766O591l121l508O358k519m314O470j309
1310A362n074N904l65n526N451L98o056N128J723o503L976K689o312L170L413
$$ plain form
1204 24 3511 -3680 -327 4313 -3265 -1469 4149 -2625 -1864 4195 -2142 -2283 4448 -1457 -3151 4003
1220 4003 -612 -3205 3739 -303 -3689 3713 709 -4058 2968 1385 -4013 2329 1650 -4124 2116
1235 2116 2619 -4102 1054 2869 -3782 583 3119 -3662 150 3774 -3356 -851 3855 -2657 -1200
1250 -1200 3788 -2580 -1788 4212 -1816 -2484 3999 -1144 -2849 3647 -877 -3238 3839 77 -3704
1265 -3704 3161 629 -3744 2813 1070 -3962 2518 1908 -4067 1726 2444 -3709 1247 2666 -3854
1280 -3854 650 3363 -3386 -90 3533 -2954 -679 3493 -2832 -1238 3973 -2121 -1967 3720 -1607
1295 -1607 -2297 3654 -1262 -2807 3697 -520 -3286 3305 184 -3324 3034 515 -3799 2671 1362
1310 1362 -3712 2192 1827 -3699 1752 2150 -3906 1222 2945 -3558 418 3107 -3205 -35 3378
1325C378o415K280M389o114J107M965n495K68N274n357p14O055m486j925O132
1340C342l592k729O010k926l510O184j914m341N718r95m739N528k79n454N149
1355A452Q77n905M354J952n926L678K523o188K926L559o016J978M227n764J057
1370a216M740n495J39N420m867j073N650m091j788N771l475k712N868k633l555
1385c317N778j546m189N403p56m814N046J91n144M520J111n470L907J890n683
1400c073L270K756n757K406L522n593J656M131n350P40M597n050q2N138m487r74
1416b150N390l929j865N531l206k614N610k409l430N414j451l978N070o93m507
1431c217M753K04m958M240J209n140L463J811n238K945K631n296K186L366n159
$$ plain form
1325 3378 -3037 -757 3632 -2482 -1375 3590 -1905 -1637 3637 -1720 -2434 3621 -865 -2790 3342
1340 3342 -250 -2979 3031 105 -3405 2779 865 -3476 2242 1247 -3492 2036 1757 -3697 1452
1355 1452 2329 -3576 778 2730 -3196 482 3005 -3183 -257 3302 -2714 -736 3491 -2273 -1216
1370 -1216 3524 -1971 -1832 3588 -1279 -2352 3298 -793 -2581 3190 -285 -2997 2871 238 -3317
1385 -3317 2461 915 -3274 2129 1373 -3441 1605 1796 -3348 1172 2283 -3187 720 2610 -3073
1400 -3073 197 2953 -2804 -398 3124 -2469 -813 3318 -2032 -1292 3305 -1745 -1827 3311 -1176 -2150
1416 -2150 3240 -689 -2554 2977 -229 -2843 2767 358 -3072 2342 891 -3087 1983 1290 -3217
1431 -3217 1536 1740 -3218 1022 2231 -2909 554 2365 -2873 72 2703 -2593 -407 2959 -2200
1446b200J327L866m906O32M432m608l20M809l970j028M921l599j696N178l028
1461a90k541N311k143l205N025j538l767M942o18m348M438L03m545L864Q86m756
1477b882L520J724n118K721K622m916J981L079m815J236L720m574K94M222l990
1492a176l20M288l814r47M773l275j873M788k434k452M728j950l018M821j256
1507H83l751M407l31l882M110Q4m356L901R67m805L086J920m557K416K210m641
1523b339K042K992m673J013L517m069M45L614l904j43M295l521j303M381k655
1538c08j651M307k428k247M593j797l070M352q92l255L987n88l622L954K83m206
1554b588L273J116m140K840J368m281K565K232m566J704K836m117J083L091m031
$$ plain form
1446 -2200 -873 2993 -1913 -1281 3151 -1457 -1777 3032 -938 -1966 2955 -644 -2340 2838 -190
1461 -190 -2731 2580 437 -2768 2257 719 -3048 1894 1276 -3072 1366 1669 -2876 988 1874 -2882
1477 -2882 638 2362 -2756 -35 2587 -2329 -348 2731 -2084 -848 2872 -1702 -1408 2814 -1176
1492 -1176 -1496 2792 -1022 -1969 2804 -471 -2344 2444 10 -2442 2286 336 -2682 2139 883
1507 883 -2868 1539 1208 -2674 1436 1520 -2836 1065 2032 -2773 313 2233 -2324 92 2302 -2339
1523 -2339 -297 2695 -1978 -965 2552 -1517 -1072 2542 -1362 -1505 2790 -731 -2034 2347 -308
1538 -308 -1959 2348 -80 -2327 2266 469 -2601 1751 859 -2396 1591 1003 -2619 1335 1618 -2588
1554 -2588 685 1801 -2339 501 1869 -2412 153 2385 -2181 -477 2359 -1758 -675 2416 -1615
1569a615N39L683l789l69L962l098r13L951k868j476M306k190k354M057j394k665
1585b233L872j001l072L941k82l672L393M93l692K937R37l910K657J652m108J985
1601a03K174l875J508K457l922J089L115l855K86L458l379l22L682l107q73L956
1617B289k620j585L893k035j927L877j651k435L862q76l095L567k07l201L149
1632A005L44l575K909J040l778K257J531l630J938J903l750J413K565l680P04
1647h04K917l331K46L119l150l37L485k798q95L543k355j386L738k028j980L768
1663A752j384k382L493q74k704L392l35l133L166L01l336K622Q92l428K264J430
1679A736l610J809J975l481J111K369l268P04K697l157Q7L087k846m48L168k403
$$ plain form
1569 -1615 -1076 2607 -1182 -1551 2411 -687 -1600 2351 -517 -1993 2313 123 -2231 1826 432 -2233
1585 -2233 1639 638 -2434 1507 1225 -2447 946 1439 -2253 684 1621 -2289 368 2020 -2088 -103
1601 -103 2071 -1804 -296 2161 -1761 -672 2443 -1412 -1126 2332 -1047 -1369 2313 -794 -1667 2289
1617 2289 -331 -1916 1977 -58 -1985 1892 241 -2194 1668 792 -2303 1264 1057 -2144 1005
1632 1005 1349 -2226 683 1723 -2055 202 1733 -1897 41 1944 -1806 -393 2172 -1508 -804
1647 -804 2113 -1218 -972 2147 -1003 -1340 2145 -653 -1548 1995 -360 -1746 1992 -36 -2016 1752
1663 1752 368 -2014 1479 605 -2099 1293 958 -2175 991 1292 -2044 578 1470 -1958 306 1736
1679 1736 -1874 -65 1910 -1571 -460 1909 -1359 -655 2042 -1115 -1028 2059 -787 -1235 1933 -470
1695d70j014L396k118j476L445j664j930L379j183k332L314p00k722L212j54l052
1711b069K977K85l194K535R18l351K115J385l304J652J778l282J182K285l193
1726a281O16K561k960Q5K955k823l94L123k352r40L196k054j332L301j677j764
1742a740L202j031k177L015o93k393K910j80k812K708L28k940K389P14l117K147
1758C30J236l220J555J758l107J186J955l044Q26K385l000K26K723k597k61K806
1774A757k380o51L043j975j300L035j446j586K885j132j901K973p12k385K683
1789I08n0k535K442K35k688K199P55k920J816J225k841J493J462k956J226J941
1805A712k944O24K273k615K37K389k508j02K711k288p37K788j812j028K774j555
$$ plain form
1695 -470 -1484 1912 -206 -1682 1763 99 -1831 1548 365 -1967 1347 647 -2075 1137 983 -2069
1711 -2069 908 1193 -2001 534 1452 -1899 216 1601 -1703 -51 1727 -1555 -373 1912 -1281
1726 -1281 -665 1896 -1064 -979 1976 -847 -1241 1882 -470 -1410 1786 -268 -1600 1701 24 -1740
1742 -1740 1462 431 -1746 1269 576 -1817 1093 913 -1899 809 1137 -1803 586 1300 -1817 330
1758 330 1566 -1654 -99 1659 -1448 -262 1693 -1351 -525 1860 -1140 -914 1809 -788 -1049 1757
1774 1757 -623 -1274 1769 -206 -1506 1529 83 -1503 1382 250 -1651 1322 610 -1775 908
1789 908 858 -1677 765 1000 -1688 511 1266 -1654 162 1387 -1454 39 1501 -1455 -229 1712
1805 1712 -1232 -608 1665 -950 -713 1676 -832 -934 1777 -511 -1248 1540 -272 -1300 1474 -81
1821h1j413K928j133j961K704m65k073K447k85k352K493K45k695K038P54k591
1837a440J678J036k738J517J529k826Q49J877k509N79J979k522K58K435k385l79
1853a062K560j921o29K523j837r63K833j443j545K690r47j707K545p13j977K591
1869I98j61k430K182L41k380J919N59k552J779J106k719J211J525k488Q42J682
1885A414k508N46K139k346m5K263j995l57K303j892o18K612j627j187K556j160
1901I8j401K463r40j686K511n04k038K263n6k128K075J37k340J984O69k501J566
1918A72J064k473J194J317k457R10J729k376L92J935k149P9K103k024l31K339
1934A424j742p85K394j354j072K311j121j403K385o98j698K249l60j905K092m4
$$ plain form
1821 -81 -1494 1434 301 -1660 1044 579 -1494 953 668 -1684 809 1054 -1641 397 1151 -1440
1837 -1440 238 1274 -1464 53 1582 -1244 -395 1482 -1027 -448 1531 -991 -733 1702 -683 -1062
1853 -1062 1498 -423 -1052 1471 -366 -1329 1504 61 -1484 1206 259 -1448 1097 384 -1593 998
1869 998 837 -1593 589 930 -1450 469 1028 -1524 255 1361 -1358 -147 1378 -1110 -268 1414
1885 1414 -1094 -548 1591 -755 -800 1463 -532 -889 1414 -478 -1096 1516 -111 -1298 1258 98
1901 98 -1303 1160 220 -1466 1045 541 -1497 766 710 -1418 657 794 -1546 438 1107 -1394 172
1918 172 1236 -1237 -43 1274 -1183 -273 1456 -920 -528 1407 -742 -663 1440 -584 -915 1424
1934 1424 -318 -1103 1291 -63 -1135 1176 55 -1348 1037 339 -1359 890 530 -1375 717 673
1950F73k113J955L91k257J663P05k292J426J007k373J117J351k326P79J632k228
1966h90M35J848k148NK074j833l33K153j619o79K238j360j051K299r84j377K203
1983I81o45j598K128l06j873J941O2k021J769M28k115J535P13k234J251J051k166
2000a099R86J299k178O77J565k096L39J801j962kJ948j783k94K085j532o91K097
2017A160j283r59K171r55j249K103o58j554K001k85j749J883Q5j946J614M58j987
2034a150J380P00k057J154J017k074Q62J330j993M98J493j953K50J772j779j19
2050f69J867j565m00J881j397o29K043j184j008K042q17j216J965o10j488J949
2066G64k64j707J769J27j762J518K87j908J409P26k000J027J035j907P35J178
$$ plain form
1950 673 -1440 515 906 -1351 312 1017 -1275 151 1158 -1215 -98 1253 -1073 -294 1338 -890
1966 -890 -455 1393 -755 -750 1324 -509 -842 1311 -308 -987 1251 -109 -1160 1139 155 -1222 981
1983 981 336 -1262 866 560 -1313 628 690 -1331 438 866 -1249 286 999 -1235 16 1067 -1099
2000 -1099 -113 1186 -992 -315 1250 -846 -507 1294 -668 -670 1278 -505 -799 1286 -246 -937 1160
2017 1160 -123 -1082 1089 134 -1115 988 330 -1224 777 492 -1257 626 711 -1235 379 837 -1150
2034 -1150 230 930 -1127 27 1044 -1030 -168 1162 -831 -333 1160 -793 -543 1229 -550 -669
2050 -669 1198 -367 -767 1114 -283 -912 1131 -53 -1061 981 164 -1052 913 303 -1185 764
2066 764 500 -1207 562 689 -1073 445 732 -1176 233 959 -1041 -14 1021 -886 -151 1027
2082A027j886N17J499j848P7J689j543j46J714j488m28J897j254p92J927q79r83
2099i00J809p90j204J907m58j459J739j28j549J586O6j728J521M06j878J156P45
2116H41j747R81Q87j877P57J222j848L58J448j566J09J481j572j46J759j341n60
2133h14J749j037p16J723q99r66J829o08j301J637k52j294J568j36j533J512J98
2150F60j688J243N17j620J092O11j776R45J002j752N28J139j553L82J234j584
2166f20J78J520j483k66J549j147l96J600j072o97J704p77j025J575m33j045J474
2183F39l50j281J535L1j506J229L01j471J102M63j569R94P60j636O15R12j443
2200f75N33J023j532L36J273j433l5J366j183j97J380j141l89J552r30o96J466
$$ plain form
2082 1027 -859 -342 1157 -691 -614 1075 -468 -614 1100 -388 -816 1081 -173 -965 962 83 -900
2099 -900 909 119 -1085 822 364 -1095 644 516 -1033 553 619 -1109 412 818 -1060 96 841
2116 841 -906 75 962 -915 -158 1064 -784 -426 1022 -544 -435 1046 -526 -672 1087 -254 -814
2133 -814 935 -102 -818 905 6 -960 869 261 -1040 597 345 -949 619 483 -1050 462 660
2150 660 -1028 215 732 -888 204 815 -961 -16 986 -766 -238 901 -652 -270 964 -620
2166 -620 -442 1078 -405 -671 878 -269 -665 935 -137 -834 870 93 -932 643 210 -835 639
2183 639 289 -992 543 574 -932 297 598 -873 229 692 -877 117 877 -759 -144 768 -675
2200 -675 -142 881 -651 -315 958 -475 -510 856 -327 -524 856 -285 -674 878 -52 -748 718
2217G18o86q16J463n45r90J485k40j257J255L3j255J178J92j376J055M53j457
2234g90Q20O74j394O22Q06j413M60J076j345J59J131j223rJ215j136j47J371j040
2252a63m49J354q28n75J376o81p59J366m72r38J311k63j051J203p3j189J147K05
2270E21j268R53L75j313P81N77j288O23P70j285L87R02j240K06J067j155l0J164
2288G47j014k23J226q85m12J226p46n70J262n41p18J255m21r17J195j92j000J123
2306C95k1j078J021J34j152R04L29j210P47N00j200O14O86j196L51Q41j141K02
2324b74R36j037M4J033r69j87J107q15l51J141o65n61J181m73p38J120l02q19
2342f29J039j87q88J031J7j035Q94J77j071P75L45j088O98N12j146M88O52j074
$$ plain form
2217 718 32 -784 679 134 -856 629 389 -868 387 420 -835 343 535 -841 214 667 -790
2234 -790 30 704 -690 -68 738 -675 -215 861 -484 -325 806 -417 -426 789 -347 -494 877 -163
2252 -163 -612 742 -86 -661 715 34 -725 641 169 -769 542 279 -772 431 358 -831 316 521
2270 521 -747 206 581 -732 49 626 -662 -39 731 -554 -167 735 -505 -299 768 -387 -417 747
2288 747 -267 -490 736 -149 -561 665 -81 -651 611 70 -648 607 186 -731 464 272 -728 395
2306 395 374 -704 317 451 -701 203 532 -678 69 569 -631 -17 669 -527 -176 665 -476 -274
2324 -274 662 -375 -331 702 -267 -454 653 -162 -513 628 -37 -598 583 110 -628 492 190 -629
2342 -629 410 223 -665 366 383 -652 242 419 -652 123 468 -620 78 590 -556 -68 584 -490
2360d90L67P24j061K21R02r85j9R77q55j76R90p76l04J098o10n28J037m42o21
2379e51R97l18p40J032j15r32Q82J09r29P74J76r95P39L80j050N48N45j006L93
2398f1N76j018L36P90r74R6Q24q50j5Q47q10j34R90p11l70R90n17m53R60m76n91
2419e71J015k72p47Q98o4p76P93Lq84Q10K34r71N88L95r17M72M69r46L84O44r45
2440c88J78P38q32Q9P83q56o2R10p22k34R05n67l30Q87n51m43R59l65o10Q96k34
2461A51o39Q53j51p68Q22O5q74O75K03q07O08K61r09N10M85r20L37N84q30K32
2481a12O28q54R2P90p48j19P96o27j78Q35o15l18R10m63m89Q48l20m95Q33k57
2501A37o52Q28q3p33P32M2p20O68R7q30O23L14q70M30M15p97L81M66q27K53O31
$$ plain form
2360 -490 -123 601 -460 -239 663 -322 -341 636 -219 -395 595 -181 -485 613 3 -525 512 70 -551
2379 -551 446 128 -612 420 305 -627 255 364 -565 209 385 -610 129 509 -541 7 552 -454 -61
2398 -61 515 -503 -167 623 -351 -255 569 -281 -296 551 -259 -393 597 -114 -484 506 -11 -464 496 20 -571
2419 -571 444 172 -575 323 259 -517 276 279 -605 205 439 -532 56 451 -466 6 475 -471 -87 557 -388
2440 -388 -210 528 -304 -215 568 -288 -350 560 -162 -396 509 -58 -388 499 -52 -495 464 99 -511 385 151
2461 151 -488 365 214 -554 268 333 -541 134 337 -470 138 399 -510 0 485 -435 -98 486 -344 -112
2481 -112 516 -338 -246 544 -204 -323 473 -154 -332 503 -112 -430 480 17 -472 376 56 -439 394 137
2501 137 -515 313 230 -503 229 271 -449 219 316 -514 109 423 -447 -17 398 -399 -18 448 -379 -126 505
2522E05q15P8O79o81j1P34o82j47Q03n37l15P84l96l84P93l68n02Q14j93o10P16
2543B65p1o28O79J3p09O35J41p81N25K61p38M58L28p81L66M55p86K47N27o97J22
2564a69N93o76J4O84o16j21P05n27k30P42m29l41P44l27m53P20j98n31O86q4n96
2585d10O22K5o63N81J43o97M77K44o89L99L33p04L06M10p00K21M83o52J30N54
$$ plain form
2522 505 -310 -232 447 -234 -245 489 -193 -340 463 -74 -389 395 -1 -385 408 40 -462 352 159 -451 265
2543 265 194 -434 245 258 -451 184 325 -456 69 330 -408 50 378 -403 -37 418 -368 -121 406 -291 -169
2564 -169 424 -252 -238 446 -170 -291 414 -113 -343 399 -30 -371 373 46 -407 313 115 -416 270 186 -410
2585 -410 212 237 -426 155 298 -399 78 322 -367 32 365 -339 -33 377 -323 -102 381 -271 -141 413
$$ [...]
8191D0
##END NTUPLES=NMR FID
##END=
