##TITLE=1H_LY-15.Dix.1B
 CD3CN, 8 sc, 
 1.06.2021
##JCAMPDX= 6.0         $$ Bruker NMR JCAMP-DX V2.0
##DATA TYPE= NMR FID
##DATA CLASS= NTUPLES
##ORIGIN= UXNMR, Bruker Analytische Messtechnik GmbH
##OWNER= root
$$ XWIN-NMR		Version 3.5
$$ Tue Jun  1 09:52:36 2021 Russian Standard Time (UT+4h)  she@DPX200
##.OBSERVE FREQUENCY= 200.131506
##.OBSERVE NUCLEUS= ^1H
##.DELAY= (6, 6)
##.ACQUISITION MODE= SIMULTANEOUS
##.ACQUISITION SCHEME= undefined
##.AVERAGES= 8
##.DIGITISER RES= 18
##SPECTROMETER/DATA SYSTEM= spect
##.PULSE SEQUENCE= zg30
##.SOLVENT NAME= CDCl3
##.SHIFT REFERENCE= (INTERNAL, CDCl3, 0, 15.7039)
##AUDIT TRAIL= $$ (NUMBER, WHEN, WHO, WHERE, WHAT)
$$ ##TITLE= Audit trail, XWIN-NMR		Version 3.5
$$ ##JCAMPDX= 5.01
$$ ##ORIGIN= Bruker BioSpin GmbH
$$ ##OWNER= she
$$ F:/spectra/data/she/nmr/H-F/1/audita.txt
$$ ##AUDIT TRAIL=  $$ (NUMBER, WHEN, WHO, WHERE, WHAT)
(   1,<2021-06-01 09:51:05.67 +0400>,<she>,<DPX200>,
      <created by zg, POWCHK disabled, PULCHK disabled
       configuration hash MD5:
       00 E9 B6 7A A2 85 ED C7 34 08 36 98 17 FE 4E 26
       data hash MD5: 16K
       DC 31 E3 EF 32 73 FB 06 49 09 71 92 65 3C 5F 75>)
$$ ##END=
$$ 
$$ hash MD5
$$ 62 10 FE 23 9E E2 CC E9 01 B8 29 0C 7C 12 52 46
##$RELAX= 
##$RELAX= 
##$RELAX= 
##$RELAX= 
##$RELAX= 
##$RELAX= 
$$ Bruker specific parameters
$$ --------------------------
##$DU= <F:/spectra>
##$EXPNO= 1
##$NAME= <H-F>
##$PROCNO= 1
##$TYPE= <nmr>
##$USER= <she>
##$AMP= (0..31)
100 100 100 100 100 100 100 100 100 100 100 100 100 100 100 100 100 100 
100 100 100 100 100 100 100 100 100 100 100 100 100 100 
##$AQSEQ= 0
##$AQ_mod= 1
##$AUNM= <au_zg>
##$AUTOPOS= <>
##$BF1= 200.13
##$BF2= 200.13
##$BF3= 200.13
##$BF4= 200.13
##$BF5= 200.13
##$BF6= 200.13
##$BF7= 200.13
##$BF8= 200.13
##$BYTORDA= 1
##$CFDGTYP= 0
##$CFRGTYP= 5
##$CHEMSTR= <none>
##$CNST= (0..31)
1 1 145 1 1 1 1 1 1 1 1 1 1 1 1 1 1 1 1 1 1 1 1 1 1 1 1 1 1 1 1 1 
##$CPDPRG= <>
##$CPDPRG1= <>
##$CPDPRG2= <>
##$CPDPRG3= <>
##$CPDPRG4= <mlev>
##$CPDPRG5= <mlev>
##$CPDPRG6= <mlev>
##$CPDPRG7= <mlev>
##$CPDPRG8= <mlev>
##$CPDPRGB= <>
##$CPDPRGT= <>
##$D= (0..31)
0 1.2 0 0 0 0 0 0 0 0.06 0 0.03 0 0 0 0 0.0002 0 0 0 0 0 0 0 0 0 0 0 0 
0 0 0 
##$DATE= 1622526665
##$DBL= (0..7)
120 120 120 120 120 120 120 120 
##$DBP= (0..7)
150 150 150 150 150 150 150 150 
##$DBP07= 0
##$DBPNAM0= <>
##$DBPNAM1= <>
##$DBPNAM2= <>
##$DBPNAM3= <>
##$DBPNAM4= <>
##$DBPNAM5= <>
##$DBPNAM6= <>
##$DBPNAM7= <>
##$DBPOAL= (0..7)
0.5 0.5 0.5 0.5 0.5 0.5 0.5 0.5 
##$DBPOFFS= (0..7)
0 0 0 0 0 0 0 0 
##$DE= 6
##$DECBNUC= <off>
##$DECIM= 32
##$DECNUC= <off>
##$DECSTAT= 4
##$DIGMOD= 1
##$DIGTYP= 9
##$DL= (0..7)
0 120 120 120 120 120 120 120 
##$DP= (0..7)
150 150 150 150 150 150 150 150 
##$DP07= 0
##$DPNAME0= <>
##$DPNAME1= <>
##$DPNAME2= <>
##$DPNAME3= <>
##$DPNAME4= <>
##$DPNAME5= <>
##$DPNAME6= <>
##$DPNAME7= <>
##$DPOAL= (0..7)
0.5 0.5 0.5 0.5 0.5 0.5 0.5 0.5 
##$DPOFFS= (0..7)
0 0 0 0 0 0 0 0 
##$DQDMODE= 0
##$DR= 18
##$DS= 0
##$DSLIST= <SSSSSSSSSSSSSSS>
$$ [...]
##$SUBNAM2= <"">
##$SUBNAM3= <"">
##$SUBNAM4= <"">
##$SUBNAM5= <"">
##$SUBNAM6= <"">
##$SUBNAM7= <"">
##$SUBNAM8= <"">
##$SUBNAM9= <"">
##$SW= 16.9725357007746
##$SWIBOX= (0..15)
0 0 2 0 0 0 0 0 0 0 0 0 0 0 0 0 
##$SW_h= 3396.73913043478
##$TD= 16384
##$TD0= 1
##$TE= 0
##$TE2= 300
##$TE3= 300
##$TEG= 300
##$TL= (0..7)
0 120 120 120 120 120 120 120 
##$TP= (0..7)
150 150 150 150 150 150 150 150 
##$TP07= 0
##$TPNAME0= <>
##$TPNAME1= <>
##$TPNAME2= <>
##$TPNAME3= <>
##$TPNAME4= <>
##$TPNAME5= <>
##$TPNAME6= <>
##$TPNAME7= <>
##$TPOAL= (0..7)
0.5 0.5 0.5 0.5 0.5 0.5 0.5 0.5 
##$TPOFFS= (0..7)
0 0 0 0 0 0 0 0 
##$TUNHIN= 0
##$TUNHOUT= 0
##$TUNXOUT= 0
##$USERA1= <user>
##$USERA2= <user>
##$USERA3= <user>
##$USERA4= <user>
##$USERA5= <user>
##$V9= 5
##$VALIST= <valist>
##$VCLIST= <CCCCCCCCCCCCCCC>
##$VD= 0
##$VDLIST= <DDDDDDDDDDDDDDD>
##$VPLIST= <PPPPPPPPPPPPPPP>
##$VTLIST= <TTTTTTTTTTTTTTT>
##$WBST= 1024
##$WBSW= 4
##$XGAIN= (0..3)
0 0 0 0 
##$XL= 0
##$YL= 0
##$YMAX_a= 150936
##$YMIN_a= -134078
##$ZGOPTNS= <>
##$ZL1= 120
##$ZL2= 120
##$ZL3= 120
##$ZL4= 120
##$ABSF1= 10
##$ABSF2= 0
##$ABSG= 5
##$ABSL= 3
##$ALPHA= 0
##$AQORDER= 0
##$ASSFAC= 0
##$ASSFACI= 0
##$ASSFACX= 0
##$ASSWID= 0
##$AUNMP= <proc_1d>
##$AZFE= 0.1
##$AZFW= 0.1
##$BCFW= 1
##$BC_mod= 2
##$BYTORDP= 1
##$COROFFS= 0
##$CY= 11.3945322036743
##$DATMOD= 1
##$DC= 2
##$DFILT= <>
##$DTYPP= 0
##$F1P= 15.9154993809931
##$F2P= -4.1035820241983
##$FCOR= 0.5
##$FTSIZE= 0
##$FT_mod= 4
##$GAMMA= 1
##$GB= 0.15
##$INTBC= 1
##$INTSCL= 1
##$ISEN= 128
##$LB= 0.24
##$LEV0= 0
##$LPBIN= 0
##$MAXI= 10000
##$MC2= 0
##$MEAN= 0
##$ME_mod= 0
##$MI= 1.114404
##$NCOEF= 0
##$NC_proc= 0
##$NLEV= 6
##$NOISF1= 3.799351
##$NOISF2= 2.8
##$NSP= 1
##$NTH_PI= 0
##$NZP= 0
##$OFFSET= 15.70392
##$PC= 1
##$PHC0= -11192.82
##$PHC1= 3.000992
##$PH_mod= 1
##$PKNL= yes
##$PPARMOD= 0
##$PSCAL= 0
##$PSIGN= 0
##$REVERSE= no
##$SF= 200.130013532006
##$SI= 16384
##$SIGF1= 3
##$SIGF2= 2
##$SINO= 400
##$SIOLD= 16384
##$SREGLST= <1H.CDCl3>
##$SSB= 0
##$STSI= 0
##$STSR= 0
##$SW_p= 3612.71676300578
##$SYMM= 0
##$S_DEV= 0
##$TDeff= 0
##$TDoff= 0
##$TI= <>
##$TILT= no
##$TM1= 0
##$TM2= 0
##$TOPLEV= 0
##$USERP1= <user>
##$USERP2= <user>
##$USERP3= <user>
##$USERP4= <user>
##$USERP5= <user>
##$WDW= 1
##$XDIM= 8192
##$YMAX_p= 0
##$YMIN_p= 0
$$ End of Bruker specific parameters
$$ ---------------------------------
##NTUPLES= NMR FID
##VAR_NAME=  TIME,          FID/REAL,        FID/IMAG
##SYMBOL=    X,             R,               I
##VAR_TYPE=  INDEPENDENT,   DEPENDENT,       DEPENDENT
##VAR_FORM=  AFFN,          ASDF,            ASDF
##VAR_DIM=   8192,          8192,            8192
##UNITS=     SECONDS,       ARBITRARY UNITS, ARBITRARY UNITS
##FACTOR=    0.0002944,     1,               1
##FIRST=     0,             0,               0
##LAST=      2.4114304,     0,               0
##MIN=       0,             -134078,         0
##MAX=       2.4114304,     150936,          0
$$ Real data points
##PAGE= N=1
##DATA TABLE= (X++(R..R)), XYDATA
0@%%%%%%%%%%%%%Qj6J6j6J6k4L2l3M1m8N6p2Q2r1J06j22J43j67J91k16K44k77
35a47L14l54L98m46M97n54O16o86P62q43R31j027J133j248J376j516J669j839
53i64K027k237K472k737L039l387L791m266M837n537O421p576R153j1456J5163
68H743k2346N7636j45233O1465J90671k58029O4333J83266k22265J1600K18022
79A47863k12883j9638K20360j74274o0461K28838j52743q5529K27312j16955j21340
90a19450K23864q4086j40391K09176n1554j62305K00099j9112j80064J78583J7054
101G1814j90510J57093M4788j97513J34480P7011k02895J04943J05127j97064
111i2726P5066J26967j90997M6259J49214j79123J1971J64861j59265j8071J73139
$$ plain form
0 0 0 0 0 0 0 0 0 0 0 0 0 0 0 8 -8 8 -8 8 -16 16 -17 24 -24 32 -40 42 -49 57 -65 78 -89 102 -114 130 -147
35 -147 167 -187 211 -235 262 -292 324 -362 400 -443 488 -539 594 -654 722 -794 875 -964
53 -964 1063 -1174 1298 -1439 1600 -1787 2004 -2262 2575 -2962 3459 -4117 5036 -6420 8743
68 8743 -13603 44033 -101200 -39735 150936 -107093 -42760 140506 -81759 -70159 147863
79 147863 -65020 -84658 135702 -38572 -99033 129805 -22938 -108467 118845 1890 -119450
90 -119450 104414 20328 -120063 89113 37559 -124746 75353 56241 -123823 54760 71814
101 71814 -118696 38397 83185 -114328 20152 97163 -105732 -789 104338 -92726
111 -92726 -17660 109307 -81690 -35431 113783 -65340 -53369 111492 -47773 -65844 107295
122A07295j39367m6405J80426j14823p5656J79119q6048r7500J72583o0232j16800
133i7408J64790l1617j33830J49849l298j43150J32874K0526j50552J15704M5660
144F9548j54888R3444O7997j52822P1738Q6217j49938M9733J04816j43173K4552
155c2776J18899j31324J606J28948j18988k1192J37934j02562m4794J41085q2789
166e953o4422J40382o3336q2746J37422m1039r9007J28845j8370j10164J17626
177C9238K613j19074J04442K4372j24607Q7260M4084j25161O9477O1007j23774
188f0123N0852P6892j18915L0790Q9443j10744J1737R9096j01289p074J07025
199F7690q9152k5808J11399p4991m2600J13064n9993n8399J12376m3315p2620
$$ plain form
122 107295 -32072 -78477 101949 -12874 -88530 90589 4541 -92959 79624 19392 -97408
133 -97408 67382 35765 -98065 51784 48486 -94664 38210 58736 -91816 23888 69548
144 69548 -85340 8104 76101 -76721 -4983 81234 -68704 -18971 85845 -57328 -32776
155 -32776 86123 -45201 -43595 85353 -33635 -54827 83107 -19455 -64249 76836 -5953
166 -5953 -70375 70007 6671 -76075 61347 20308 -78699 50146 31776 -78388 39238
177 39238 41851 -77223 27219 51591 -73016 14244 58328 -66833 2644 63651 -60123
188 -60123 -9271 67621 -51294 -20504 68939 -41805 -30068 69028 -32261 -39335 67690
199 67690 -21462 -47270 64129 -10862 -53462 59602 -391 -58790 53586 10271 -62349
210f2349J08484k5864q4428J01905q122r3983R2736R707j00787Q1149K6800j04554
222e9306O7570M2765j05307N2314N7061j03013L6204O9480r8137J9267P9638r0264
234c1728K510Q6803q0594j3267R1862o9390k8713R4374n6246m2507R3841m2823
246D122n4394R1934k8821o5580Q7511j3697p4174Q0554M46q0725P2910J4746q6224
259e1392O2766K9147q8274N0907M1215q8246L9115N2857q6754K5253O3196q1476
271c1686J1212P0218p4961j762P6485o7047j5953Q0359n5944k8518Q0687m5057
283a967l9234Q0553l3348n0211P7616j9861n8140P2009q062o4400O6651M336p0451
296d4509N8471J7262p2841M8892K7497p4130M0119L8284p4748K8642M8280p1452
$$ plain form
210 -62349 46135 20271 -64157 37748 29626 -64357 28379 38086 -62701 18448 45248 -59306
222 -59306 8264 51029 -54278 -1964 55097 -47916 -11712 57768 -40369 -21102 58536 -31728
234 -31728 -29218 57585 -23009 -36276 55586 -13804 -42517 51857 -4389 -46896 46945 4122
246 4122 -50272 41662 12841 -52739 34772 21075 -53099 27455 27901 -52824 20086 34832 -51392
259 -51392 11374 40521 -47753 3154 44369 -43877 -4762 48095 -38659 -13406 49790 -31686
271 -31686 -20474 49744 -25217 -26979 49506 -17541 -33494 46865 -9079 -37597 43090 -1967
283 -1967 -41201 39352 6004 -44207 33409 13548 -44592 27417 19355 -45045 21606 25942 -44509
296 -44509 13962 31224 -41617 7275 34772 -39358 761 39045 -35703 -7061 41219 -30233
308c0233J7152N5098o7752O636O2302o2769o020O7330n4286j7021O9062m6382
320f883k6778P1032l7022l7669O9864k5312m5390O6028j5443n1860O2691m409
332A8849n8432N6048P282o1016M8212J6152o3044M1280K6225o4627L1193L5621
344C3743o2193K1457M1830o0039J2765M9190n6872J535N4535n0227p962N7041
356C4803m4667j6657O0486l7511k6995O0855k7856l4348N8931k0076m0966N7730
368B3729j0631m8098N2981j69n1372M7009P678n4228M1766J6964n6681L3289K5704
381B7941n5210K5011L1511n4030J7671L8503n1927P814M3694m6537m28M6284m2297
394a2000p879M9981l6876j6921N1192k9242k3549N0533k3177k9744N0692j5580
$$ plain form
308 -30233 -13081 42017 -25735 -19099 43203 -19566 -25586 41744 -12542 -29563 39499 -6883
320 -6883 -33661 37371 349 -37320 32544 7232 -38158 27870 12427 -39433 23258 18849
332 18849 -39583 16465 23747 -37269 10943 27095 -35949 5331 31556 -33071 -1878 33743
344 33743 -28450 -6993 34837 -25202 -12437 36753 -20119 -18584 35951 -14276 -22238 34803
356 34803 -9864 -26521 33965 -3546 -30541 30314 2458 -31890 27041 6965 -34001 23729
368 23729 13098 -35000 17981 17812 -33560 13449 21127 -33101 8665 25629 -31052 2237 27941
381 27941 -27269 -2258 29253 -24777 -7106 31397 -20530 -12716 30978 -15559 -15987 30297 -12000
394 -12000 -19879 30102 -6774 -23695 27497 -1745 -25294 25239 2062 -27682 23010 7430
406G430l6754M7977o848m0768M4089Pm4491M0648Q216m7923L4411J6234m8208
419b5980K7922K2191m8366K1751K9014m7502J3460L4410m3859O082L7704m0613
431a3786q19M1505l6195q894M3283k9971j5222M3442k4626k1117M3869j8160k7332
444b4023M2186j0978l1516L9651m875l5486L7192K142l9007L2775Q979m0480K8083
457D643J4681m1745K3255K0914m2012J6933K6206m0426J0913L0274l8635M742
469a0257L4397l5563k211L6950l1086q237L8293k6649j4044L9208k1177j9741
481b0117L8466j5163k4141L6915r533k8132L4855l327l1484L1516K664l3531K7819
494F807Q074l5140K3756J3618l5918J8865J8563l5601J3905K2873l4745Q660K6863
$$ plain form
406 7430 -29324 18653 11805 -28963 15126 15133 -29358 11290 19506 -28417 5994 22228 -25980
419 -25980 1942 24133 -24233 -2482 26532 -20970 -7510 26900 -16959 -10877 26827 -13786
431 -13786 -14605 26900 -9295 -18189 25094 -4877 -20099 23343 -1283 -22400 21469 3309 -24023
444 -24023 18163 7185 -24331 15320 10445 -25041 12151 14293 -24714 8061 17040 -23440 4643
457 4643 19324 -22421 834 21748 -20264 -3331 22875 -17551 -6638 23636 -14999 -10257
469 -10257 24140 -11423 -13634 23316 -7770 -16007 22286 -4363 -18407 20801 -376 -20117
481 -20117 18349 3186 -20955 15960 6427 -21705 13150 9823 -21661 9855 12519 -21012 6807
494 6807 14881 -20259 3497 17115 -18803 62 18625 -16976 -3071 19802 -14943 -6283 20580
507B0580l2988L093L0046l0363k365L2439k7120p774L4057k3097j2957L4698j8518
520b69j7721L4428j3501k1898L3123q243k5341L1109k931k8191K8256K476l0071
533a8774K4666P401l1112K0851J2083l1634J6455J6531l1107J1735K0107k9979
545a2777P247K3444k8513K250K6328k5918k641K8061k3036p037K9612j9831j1835
558a4646L0403j5546j6014K9907j1428j9453K9296o982k3093K7579j793k5429
570a7199K4718K592k6941K2031P101k8413J8247J1760k8244J3890J5108k7554
582a2904J0106J8486k6741N415K1503k4392R33K3027k2077k781K4814j9642p309
595a1562K5912j5886j1072K5674j2689j4114K5887r231j7808K5034m768k0227
$$ plain form
507 20580 -12408 -9315 20731 -9632 -11997 20442 -6678 -14452 19605 -3492 -16449 18249 -269
520 -269 -17990 16438 2937 -18961 14162 5919 -19422 11687 8756 -19435 8821 11297 -18774
533 -18774 5892 13293 -17819 3032 15115 -16519 -64 16467 -14640 -2905 17202 -12777
545 -12777 -5530 17914 -10599 -8349 17979 -7939 -10580 17481 -5555 -12592 17020 -2811 -14646
558 -14646 15757 211 -15803 14104 2676 -16777 12519 5537 -17556 10023 8230 -17199
570 -17199 7519 10111 -16830 5201 12302 -16111 2136 13896 -14348 -458 14650 -12904
582 -12904 -2798 15688 -11053 -5638 15865 -8527 -7594 15433 -6644 -9425 15389 -4253 -11562
595 -11562 14350 -1536 -12608 13066 377 -13737 12150 2919 -14889 10145 5377 -14850
607a4850K3139j278k2114K1752K665k4361J9012P101k4867J5642J0154k5037J2872
620a70J3678k5235Q772J6976k3562M761J8721k2006J422K0990k0226l000K2396
633A3517j6880o516K2382j4243r366K3022j1269j3041K2540p246j5337K1065m336
646D292j7280K0407r15j9751J8339L084k0587J5820N745k1400J4004R162k2381
659a1461J0664J2530k1541P426J4429k0966M796J7069k0110P64J9006j7601k485
672g480J9546j5716n226K0774j3339q920K0821r758j1302J9823p192j3346J9536
685H221m067j5925J7921l78j6952J5848K044j7932J4486N143j9174J1796Q285
698I316j8848R176J0153j8804P133J2772j8691L822J5001j7114R52J6071j5967
$$ plain form
607 -14850 8289 7011 -15103 6649 9314 -15047 3965 11066 -13801 1841 11995 -13042 -170
620 -170 13508 -11727 -2955 14021 -9541 -4780 13941 -8065 -6643 14347 -5879 -8879 13517
633 13517 -3363 -9879 12503 -1740 -11106 11916 647 -12394 10146 2900 -12437 8628 4292
646 4292 -12988 7419 6504 -13247 5092 8176 -12411 3409 9154 -12246 1758 10920 -11461
659 -11461 -797 11733 -9808 -2382 12047 -8919 -4123 12946 -7164 -6400 12606 -4995 -7480
672 -7480 12066 -3650 -8876 11898 -1441 -10361 10460 702 -10600 9223 2031 -11315 8221
685 8221 4154 -11771 6150 5772 -11180 4668 6712 -11220 3266 8409 -10765 1031 9316
698 9316 -9532 -356 9797 -9007 -1874 10898 -7793 -3971 11030 -6084 -5132 10939 -5028
711e028j516J7748j4410m926J8505j1645p491J8321r498r779J8557o760j2513
724a0435J7601l414j3990J6039r30j5248J4819K032j6579J2579M990j6649J0232
737A047P041j6770Q236R492j6690N378J1586j5633K852J2896j4787N61J4526j3621
751c886k319J5527j1659m663J5917j0022o896J6476p913r375J6212n337j1128
764i066J5483l096j2767J4716m45j4254J3136K226j4897J1307M477j5384R423
777H59O858j5471P010Q885j4867M690J0468j4174K366J1994j3080j44J3023j1573
791c156k376J3647j0027m543J4176q242o663J4214o226q485J3969m223j0170J3475
805E370k026j1630J2561K00j2730J1386K382j3556R895M533j3975Q138O545j4039
$$ plain form
711 -5028 -6544 11204 -3206 -8132 10373 -1272 -8763 9558 60 -9719 8838 2078 -10435
724 -10435 7166 3752 -10238 5801 4871 -10377 4442 6474 -10105 2474 7464 -9185 1047
737 1047 8088 -8682 -446 9046 -7644 -2266 9320 -6313 -3461 9435 -5352 -4791 9735 -3886
751 -3886 -6205 9322 -2337 -7000 8917 -1105 -8001 8475 562 -8813 7399 2062 -9066
764 -9066 6417 3321 -9446 5270 4825 -9429 3707 5933 -8964 2343 6820 -8564 859
777 859 7717 -7754 -744 8141 -6726 -2036 8432 -5742 -3376 8618 -4462 -4606 8417 -3156
791 -3156 -5532 8115 -1912 -6455 7721 -521 -7184 7030 804 -7681 6288 2065 -8105 5370
805 5370 3344 -8286 4275 4475 -8255 3131 5513 -8043 1852 6385 -7590 548 7093 -6946
819f946O148Q407j3688L974R955j2914J810J1179j1909m04J2122j0433k556J2573
833G318q857m428J2834p164o338J2764n132p930J2266l291r209J1688j365j0480
847g324J0805P07j1281R535K464j1835Q451M221j2395O939O119j2394N161P574
861F747j2145L551R022j1779J496J0386j0743n13J0962r565k167J1635q318m217
875e648J1941o437n924J1606m783p079J1314l067q622J0625r20r484R446P22j0079
890f389Q587K347j0785P225M281j0839N597N505j0705M411O867j0731K678Q327
904F376j0067R28R003r393l51J0026q789k284J0710p215l937J0672o024n197J0992
919E450m697o819J0569k678p825R687j189q598R177M03r621Q010K357r730O499
$$ plain form
819 -6946 -798 7609 -6079 -2105 7850 -5064 -3254 7925 -3984 -4388 7734 -2699 -5255 7318
833 7318 -1539 -5967 6867 -297 -6635 6129 997 -6933 5333 2042 -7167 4521 3156 -7324
847 -7324 3481 4188 -7093 2442 4906 -6929 1522 5743 -6652 287 6406 -5988 -827 6747
861 6747 -5398 -1847 7175 -4604 -3108 7278 -3465 -3978 6984 -2581 -4748 6887 -1431 -5648
875 -5648 6293 -144 -6068 5538 755 -6324 4990 1923 -6699 3926 3006 -6478 2968 3690 -6389
890 -6389 2198 4545 -6240 985 5266 -5573 24 5529 -5176 -765 6102 -4629 -1951 6376
904 6376 -3691 -2763 6240 -3153 -3504 6522 -2267 -4551 6159 -1056 -4993 5679 -345 -5542 5450
919 5450 753 -6066 4503 1825 -6000 3687 2498 -6100 3077 3480 -6141 1869 4226 -5504 995
934I95L515r762N479N031j0081L838O487r414K297P111q999J102Q256q562p59
949c466R092p296k180R220o522l371R908n516n107R969l937o074R429k754p017
964e622R374j327q295Q609M82q726P442J689r099O745L217r632N178M828r189
979d326L657N639q949K545O841q619P28P739p523o60P930o785j767Q631n932l401
995d252Q803m473m473Q530l576n429Q650k206o767Q167o53p355P407M10p950P035
1011A868J772q675N812L401q676M682M199q693L721N481q629K191O514p892Q21
1026b103O945p245l75P733o510j928Q017n202l089P917m269m066Q054l105n307
1041d533P746j699n995P167o55o666O805O08p395N987J922p629N108K891p864
$$ plain form
934 995 4510 -5252 227 5258 -4823 -985 5502 -3912 -1615 5496 -3503 -2401 5855 -2707 -3466
949 -3466 5626 -1670 -3850 5370 -1152 -4523 5385 -131 -5238 4731 794 -5280 4149 1395 -5622
964 -5622 3752 2425 -5870 2739 3221 -5505 1937 3626 -5473 1272 4489 -5143 35 4863 -4326
979 -4326 -669 4970 -3979 -1434 5407 -3212 -2484 5255 -2268 -2928 5002 -1783 -3550 5081 -851 -4252
995 -4252 4551 78 -4395 4135 559 -4870 3780 1574 -5193 2974 2321 -5034 2373 2783 -5167 1868
1011 1868 3640 -5035 777 4178 -4498 184 4383 -4310 -589 4892 -3737 -1546 4968 -2924 -2103
1026 -2103 4842 -2403 -2778 4955 -1555 -3483 4534 -668 -3757 4160 -109 -4175 3879 774 -4533
1041 -4533 3213 1514 -4481 2686 2031 -4635 2170 2778 -4617 1370 3292 -4337 771 3662 -4202
1056d202M326M066q040L129N123p702J999N827p424R39O656o928m19P188o047
1071a509j591P438n202k710P656m154l889P535k910m749P183j835n519O812n90
1086A966o229O150O12o611N401J679o947M622K783p126L652L784p084K713M604
1101C969o956J736N407o654O27O082o181m51O614n577j543O957m796k580P133
1116C787l903l584P133k872m490O901j790n220O508o88n853N938M91o286N167
1131A239J526o496M376K530o658L448L529o561K421M282o319J509M981o058M70
1146a781N634n515o04N999m924j479O370m343k523O614l410l461O505k551m175
1161c644O466j684n024O177m96n625N556M49n948N020J458o369M180K621o371
$$ plain form
1056 -4202 124 4190 -3850 -721 4402 -3300 -1301 4526 -2898 -1959 4697 -2231 -2650 4538 -1509
1071 -1509 -3100 4338 -864 -3574 4082 -72 -3961 3574 664 -4085 3098 1263 -4256 2556 1966
1086 1966 -4263 1887 2499 -4112 1289 2968 -3979 643 3426 -3700 -48 3736 -3348 -635 3969
1101 3969 -2987 -1251 4156 -2498 -1871 4211 -1970 -2421 4193 -1384 -2927 4030 -766 -3346 3787
1116 3787 -116 -3700 3433 561 -3929 2972 1182 -4038 2470 1782 -4071 1867 2358 -3928 1239
1131 1239 2765 -3731 645 3175 -3483 -35 3494 -3067 -646 3636 -2683 -1174 3807 -2251 -1781
1146 -1781 3853 -1662 -2266 3733 -1191 -2670 3700 -643 -3166 3448 38 -3423 3082 531 -3644
1161 -3644 2822 1138 -3886 2291 1795 -3830 1726 2175 -3773 1247 2705 -3664 516 3137 -3234
1176c234L148L360o213K310M163o080J225M930n507J48N221m909o15N564m454
1191i43j722N931l502k736N880k713l400N994k096m172N792r48m818N325k13n163
1207c504N054O60n787M466J792n940L611K500n942L020L331o093K008M222n628
1222b230R86M578n211J95N165m834r34N586l946j882N519l266k502N650k559l469
1238c154N568j454m059N075p44m432M923O5n106M415J152n298L681J780n416L283
1254B79K591n708K409L509n445J518L933n224Q88M606n058j94N135m288j105N205
1270C051l775j738N502l167k768N471k047l382N054j359l873M978n20m568M464
1285A323N72m782L765J174m914L396J952n218K607K810n003J842L199m862J268
$$ plain form
1176 -3234 -86 3274 -2939 -629 3534 -2546 -1321 3609 -1898 -1750 3471 -1438 -2053 3511 -943
1191 -943 -2665 3266 -236 -2972 2908 195 -3205 2789 693 -3479 2313 1365 -3453 1872 1659 -3504
1207 -3504 1550 2210 -3577 889 2681 -3259 352 2852 -3090 -70 3261 -2832 -824 3398 -2230
1222 -2230 -1244 3334 -1877 -1682 3483 -1351 -2285 3301 -645 -2527 2992 -274 -2776 2874 315 -3154
1238 -3154 2414 960 -3099 1976 1232 -3200 1723 1788 -3318 1097 2249 -3049 632 2412 -3004 279
1254 279 2870 -2838 -429 3080 -2365 -847 3086 -2138 -1250 3356 -1702 -1896 3239 -1049 -2154 3051
1270 3051 -724 -2462 3040 -127 -2895 2576 529 -2853 2201 842 -3031 1947 1427 -3141 1323
1285 1323 1895 -2887 878 2052 -2862 534 2486 -2732 -125 2685 -2318 -476 2723 -2139 -871
1300h71L882m839L88M427m306l85M575l921r85M996l543j917N183k684k571M987
1316B416k117l093N037j340l885M733l91m184M165K63m433L803J104m812L087
1331C53J979m712K332K464m633J762L126m583R20L675m145J68L921l837m16M315
1347B689l467j254M550k831j876M532k358k396M628j759l083M517j006l524M225
1362A587l77l906L982L28m276L481J111m412K900J719m471K348K372m465J611
1377d68K941m210Q92L328l917K27L705l544n10L965l065j142M048k565j703M103
1393B085j985k286M070j407k814L988q09l246L782j94l581L448M39l856L104J021
1409A759m037K622J625m068K108K156m074J536K665l956R28L068l659J80L425
$$ plain form
1300 -871 3011 -1828 -1440 2987 -1319 -1704 2871 -1050 -2035 2961 -582 -2499 2684 0 -2571 2416
1316 2416 299 -2794 2243 903 -2982 1751 1360 -2824 1341 1604 -2829 974 2078 -2734 353
1331 353 2332 -2380 -48 2416 -2217 -455 2671 -1912 -992 2683 -1462 -1294 2627 -1210 -1626 2689
1347 2689 -778 -2032 2518 -313 -2189 2343 -15 -2411 2217 458 -2625 1892 886 -2638 1587
1362 1587 1210 -2696 1286 1614 -2662 819 1930 -2482 418 2137 -2334 14 2386 -2079 -468
1377 -468 2473 -1737 -845 2483 -1434 -1207 2498 -1046 -1556 2409 -656 -1798 2250 -315 -2018 2085
1393 2085 100 -2186 1884 477 -2337 1651 842 -2404 1378 1184 -2397 1051 1490 -2366 738 1759
1409 1759 -2278 344 1969 -2099 9 2165 -1909 -373 2292 -1664 -736 2332 -1327 -1147 2278
1424B278l264m30L702k848j148L769k290j664L793j685k311L694j057k686L490
1439A343n11k958L229J44l396K964O52l574K578J185l589K178J667l731J685K210
1455B076l669J119K546l503P20K917l381L1L400l049n53L405k563j106L636k193
1471a67j733L679j512k225L433r40k554L310m12k978L011L26l205K518Q34l236
1487a851K187J295l427J724J894l323J144K185l177P96K529l157K50K950k841
1502h22l26L033k525o69L243k302j258L420j754j752L262j334k025L281r24k553
1518b005L160k28k827K721K50k940K501P25l209K059J394l164J456J716l035J107
1534c19K109l051N41K551k709l6K642k434l72K877k278r25L083j778j365K950
$$ plain form
1424 2278 -986 -1416 2286 -562 -1710 2059 -231 -1895 1898 213 -2098 1596 539 -2147 1343
1439 1343 832 -2126 1103 1247 -2149 815 1467 -2107 471 1656 -1933 245 1912 -1819 -134 2076
1455 2076 -1593 -474 2072 -1431 -711 2206 -1175 -1144 2256 -793 -1346 2059 -504 -1610 2026 -167
1471 -167 -1900 1779 267 -1958 1475 535 -2019 1291 879 -2099 912 1238 -1967 551 1385 -1851
1487 -1851 336 1631 -1796 -72 1822 -1501 -357 1828 -1349 -553 1976 -1181 -931 2019 -822
1502 -822 -1148 1885 -640 -1309 1934 -368 -1626 1794 40 -1712 1550 216 -1809 1472 548 -2005
1518 -2005 1155 927 -1900 821 1071 -1869 632 1357 -1852 207 1601 -1563 -107 1609 -1426 -319
1534 -319 1790 -1261 -720 1831 -878 -914 1728 -706 -1078 1799 -479 -1404 1679 -99 -1464 1486
1550A486j440j634L061j134k128L007n55k397K716j96k569K649K24k941K347Q35
1566A331k971J864J159k966J610J594l070J057K102k823N01K266k621J64K555
1581A752k450m49K793j971r13K711j643j198K835j330j728K831p82k003K577m57
1597E75k189K559r2k556K329M64k636J964P31k708J822J130k889J406J608k771
1613a253R54J811k662O53K159k603J05K451k238l61K499j967o87K656j667j216
1629a366K686j151j545K498p96j772K466m09k141K264J19k282J960M21k373J796
1645C75P89k543J461J202k508J109J441k471Q55J751k469M55K025k258P8K156
1661A448k095k44K367j888o84K471j529j035K444j209j345K443q34j700K323l90
$$ plain form
1550 1486 46 -1588 1473 339 -1789 1218 663 -1734 982 786 -1783 866 1090 -1851 496 1331
1566 1331 -1640 224 1383 -1583 27 1621 -1449 -392 1710 -1113 -612 1654 -967 -803 1752
1581 1752 -698 -1147 1646 -325 -1238 1473 -170 -1368 1467 137 -1591 1240 458 -1545 1032 575
1597 575 -1614 945 853 -1703 626 1090 -1546 418 1149 -1559 263 1393 -1496 -90 1518 -1253
1613 -1253 -299 1512 -1150 -497 1662 -941 -836 1615 -623 -984 1515 -452 -1139 1517 -150 -1366
1629 -1366 1320 169 -1376 1122 326 -1446 1020 611 -1530 734 853 -1429 531 952 -1421 375
1645 375 1164 -1379 82 1284 -1224 -115 1326 -1145 -290 1461 -1008 -553 1472 -786 -708 1448
1661 1448 -647 -891 1476 -412 -1096 1375 -154 -1189 1255 46 -1299 1144 310 -1390 933 543
1677E43j925K107j5k076J891L96k227J585P79k273J281J093k271R70J401k230
1693i71O16J662k122K75J867j996n6K050j818l92K182j594p14K247j333j040K285
1710A148j052j328K256p24j596K177l70j832K002kj977J810L47k129J549P30k180
1727a171J224J047k148R07J322k101N55J629k000J77J784j797j22J930j639m68
1743h71K072j393q03K085j114j049K108r05j320K119n62j587J979k66j725J901
1759F69mj940J736L90k049J452O88k069J241R54k139R18J338k061N18J522j897
1776g33K39J721j808j53J937j525n30J933j248p62J971j032j109K033o51j395
1792a112J860l62j502J803j19j785J721K45j886J450M94j904J323P36k055J081
$$ plain form
1677 543 -1382 725 710 -1366 525 921 -1306 279 1058 -1215 66 1159 -1112 -142 1259 -971
1693 -971 -355 1307 -815 -540 1327 -669 -725 1325 -493 -885 1297 -297 -1011 1236 -97 -1137 1148
1710 1148 96 -1232 1024 300 -1296 881 511 -1321 681 679 -1298 512 859 -1270 279 1009 -1171
1727 -1171 53 1100 -1048 -141 1181 -920 -365 1264 -736 -559 1225 -572 -694 1236 -403 -871
1743 -871 1201 -192 -995 1090 -24 -1073 1035 130 -1190 929 367 -1220 759 493 -1232 669
1759 669 665 -1275 461 851 -1198 254 942 -1127 114 1068 -1071 -153 1185 -876 -358 1164 -733
1776 -733 -494 1227 -581 -734 1203 -322 -852 1081 -167 -929 1042 10 -1099 934 283 -1112
1792 -1112 748 386 -1116 687 568 -1217 504 749 -1137 313 807 -1097 226 962 -1093 -12
1808a2J116k034P29J289j924N33J481j920J83J763j703k04J811j486m11J929j336
1825a96p98K020r43j119J886o55j267J878m12j552J764J0j700J495K70j750J399
1842C30N18j930J177Q90j911Q50J046j845P00J277j907L86J561j743O7J618j609
1859e25j09J780j529m83J938j198p93J864r63r75J926p39j313J863l04j506J639
1876E73n1j598J560K27j810J329O43j809J006Q32j803Q45J078j834N19J359j693
1893f27K05J453j589K6J634j520l25J798j279n75J763j104p46J865r40j071J873
1910H41n91j271J730l72j399J696j02j651J544K81j714J265N07j744J114P86j838
1927i18Q08J107j730M63J266j639K52J449j565r5J621j320l96J644j143n96J738
$$ plain form
1808 -12 1104 -930 -201 1088 -836 -303 1178 -742 -559 1204 -499 -703 1108 -378 -789 1140 -196
1825 -196 -994 1026 83 -1036 850 195 -1072 806 394 -1158 606 616 -1084 411 681 -1069 330
1842 330 848 -1082 95 985 -926 -76 970 -875 -175 1102 -805 -419 1142 -601 -534 1084 -525
1859 -525 -634 1146 -383 -866 1072 -126 -919 945 -18 -993 933 194 -1119 744 440 -1066 573
1876 573 522 -1076 484 711 -1099 230 873 -936 70 902 -901 -56 1022 -812 -293 1066 -627
1893 -627 -422 1031 -558 -532 1102 -418 -743 1055 -224 -799 964 -140 -886 979 39 -1032 841
1910 841 250 -1021 709 337 -1062 634 532 -1119 425 706 -1008 257 764 -980 134 920 -918
1927 -918 -110 997 -733 -270 996 -643 -391 1058 -507 -602 1019 -301 -697 947 -196 -792 946
1944I46r71r04J767p03j086J671m83j242J659k44j466J556O5j572J387K90j659
1961i89J247N32j740J016Q34j736P51J032j691N05J234j621K05J422j455j06J535
1978I75j294l65J630j088o62J660q28q98J635o09j089J600l49j290J509q0j421
1995i64J381J56j536J245M00j606J076O32j660Q95Q35j651O78J041j637M65J206
2012I56j559K09J363j436o9J497j281l26J572j102n70J614q74q33J593o14j020
2029h80J551l84j215J461r3j369J299J69j432J147M01j522R68O65j571P64Q49
2046H08j531N67J025j516L42J224j431Q9J322j306j03J433j228l41J541j024n97
2063g26J521q03p65J534o36r93J522l58j176J366q3j273J276J25j425J127M48
$$ plain form
1944 946 -25 -929 838 135 -951 720 237 -1005 654 410 -1056 500 565 -1007 380 670 -989
1961 -989 258 790 -950 66 900 -836 -85 947 -744 -239 995 -626 -421 1001 -454 -560 975
1978 975 -319 -684 946 -142 -804 856 28 -870 765 156 -933 667 318 -972 537 457 -964
1995 -964 417 573 -963 282 682 -924 152 784 -876 19 854 -797 -119 922 -715 -250 956
2012 956 -603 -394 969 -467 -536 961 -320 -646 926 -176 -746 868 -6 -839 754 140 -880
2029 -880 671 287 -928 533 440 -929 370 539 -893 254 655 -867 101 766 -805 -41 808
2046 808 -723 -156 869 -647 -305 919 -512 -423 899 -407 -510 923 -305 -646 895 -129 -726
2063 -726 795 -8 -773 761 125 -868 654 296 -880 486 403 -870 406 531 -894 233 681
2080F81j491Q66O54j442O90Q31j479M77J072j403K03J159j266L4J284j237j98
2097e65J419j038m55J403q71n74J447p62q04J492n09j001J378k89j085J323j22
2114C87j269J252J79j359J020L84j366Q94N76j454O76Q65j391L95R74j284K26
2131b95J118j272k4J297j079l09J292q89m37J342p97o75J404n54q67J311l81r39
2149g54J301k52j126J272pj224J088J74j241J024L33j375Q75O05j368O31P34j314
2167f24N08Q87j345K71J110j213kJ150j055j84J265r70m27J334p14o67J286n42
2185F8p68J278l78r88J251j05j113J103N4j151J046K13j272R10M63j289P19N86
2203F27j271O29P35j337M36R36j250K23J000j159Q7J130j122j58J240r31l79J237
$$ plain form
2080 681 -810 56 710 -732 -42 789 -690 -213 859 -544 -341 818 -448 -414 870 -367 -565
2097 -565 854 -184 -639 764 -107 -681 766 4 -800 692 183 -818 560 271 -814 509 387
2114 387 -882 370 549 -810 210 594 -772 122 698 -756 -80 785 -606 -211 763 -521 -295
2131 -295 823 -449 -473 824 -255 -564 728 -161 -598 744 -53 -728 676 122 -745 566 185 -754
2149 -754 547 295 -831 441 434 -790 298 472 -769 255 588 -787 88 693 -675 -44 690 -624
2167 -624 -116 771 -574 -303 807 -406 -408 742 -313 -497 768 -202 -629 705 -9 -676 610 68
2185 68 -700 578 200 -788 463 358 -755 348 402 -749 297 510 -762 148 611 -678 41 627
2203 627 -644 -15 720 -617 -181 755 -495 -272 728 -431 -344 786 -336 -494 746 -185 -564 673
2221F73p79n17J292o36p46J269l55r11J157j63j013J123J0j157J004K64j210Q40
2239A45M10j222P26N84j272N54P67j232L58Q74j176K27R93j141K7J115j028j60
2257d51J145r07l08J214q05m99J250o16o69J205m50p86J166k48r56J093j6j068
2275g06R72J77j127Q60L55j182O81N73j188N06P18j161L46Q53j107J39R74j024
2293c41l3J051r17k12J114q16l71J147o75n34J172n30o91J147l71q02J114k06
2311B46r27J049k4j017R29J63j071P95L61j128O66N49j147M78O94j090K87Q32
2329F45j034R1R56r51j07J034q25k72J090p27m39J120n63o09J098l99p21J072
2347D59k68q46J054j05r53R44P7r98Q58K03j079P80L86j095N90N44j075M65O56
$$ plain form
2221 673 -106 -623 669 33 -713 556 201 -710 447 284 -729 394 404 -753 251 515 -695 145
2239 145 555 -667 59 643 -629 -75 692 -540 -182 692 -484 -257 736 -405 -378 737 -291 -451
2257 -451 694 -213 -521 693 -112 -611 639 23 -646 559 109 -677 489 241 -715 378 362 -706
2275 -706 266 443 -684 176 531 -651 30 603 -585 -79 639 -522 -176 677 -430 -291 683 -341
2293 -341 -374 677 -240 -452 662 -154 -525 622 -53 -587 585 55 -636 511 140 -662 452 246
2311 246 -681 368 344 -673 256 419 -652 143 504 -624 42 591 -556 -78 616 -474 -187 645
2329 645 -389 -298 658 -293 -400 634 -191 -463 627 -100 -539 581 18 -591 507 108 -613 459
2347 459 191 -655 399 294 -659 285 362 -636 222 425 -654 126 512 -583 7 551 -524 -59 597
2366E97j093L17Q28j038R0R11r13n2R86q57k45J087o93m66J076n01o01J068l93
2385A08p41J071j90q83R55j0r31Q95J00j012Q18L08j091O55M54j040N46N44j098
2404e42M36P18j040K29P98r66J10Q85r48m5J006q12k90J036o71l91J056n82n82
2423e95J101l63p46R91j66q32R61m5r54Q92J85j035P17L44j019O28M66j091N06
2442e5O65j070K91P66r98J86Q40r85L9R77q93j60R89p65k54J031p05m33J085n17
2462C4o08J044l78o80J041k66q32R95k4r50Q44J66r85P73K95j073O31N30j074
2481e17M35O53j029L26P62j037J33R31r48o2R69q33j89J036p85l62J113o07n38
2500e49J064m70o16J076l75p56J052j81q72R37nr27Q88J28j034P80L53j077O30
$$ plain form
2366 597 -496 -179 649 -389 -299 612 -301 -353 633 -224 -469 618 -75 -541 535 34 -567 501 108
2385 108 -633 438 248 -635 320 310 -621 274 374 -638 180 488 -603 52 506 -534 12 556 -542
2404 -542 -106 612 -428 -199 599 -367 -257 628 -320 -365 641 -171 -461 575 -96 -487 569 -13 -595
2423 -595 506 143 -603 388 222 -610 351 306 -648 244 429 -606 111 455 -564 64 530 -561 -55
2442 -55 610 -460 -169 597 -401 -215 625 -360 -321 656 -237 -397 592 -173 -427 604 -101 -534 551 34
2462 34 -574 470 92 -588 453 187 -645 350 326 -624 220 386 -599 174 469 -604 27 557 -517
2481 -517 -82 571 -458 -132 630 -407 -274 657 -291 -353 616 -217 -406 630 -155 -517 596 -11 -549
2500 -549 515 45 -571 505 130 -626 426 245 -627 310 305 -622 266 394 -640 140 493 -584 46
2519D6M76j062N08O16j071L11Q14j015J10Q91r25m3R90q64k37J077o97m28J064
2538E61n71n41J088m50o99J074k78q14J008j22q82R46J1r81Q72K02j030P38L26
2557D58j043O42M72j083M98O46j065L34P37r90J59Q55r54oR64q43k06J014p05
2576a16l77J062n92n35J072m23o86J038k59q12R95r2r06R12Q5r84Q17K28j027
2595f00P17L65j044N92N10j071M65O35j034L11P45r82J49Q52r31JR41q59j64R92
2615E90p20l27J034o15m95J064m49o61J031k85p58R76j13q94R16P1r73P98K49
2634D39j008O77L83j041N61N42j054M07O62j009K78P54r67J06R00r22o3R48p99
2653b06j83R75p35l16J037o13m84J029m58n92J005l19p37R98j55q62R11L9r22
$$ plain form
2519 46 522 -540 -32 584 -487 -176 638 -377 -267 624 -301 -344 646 -218 -455 622 -75 -503 561
2538 561 -10 -551 537 87 -612 462 184 -630 378 256 -626 320 331 -650 222 424 -606 132 458
2557 458 -585 57 529 -554 -56 590 -475 -141 596 -394 -235 620 -334 -340 624 -219 -425 589 -116
2576 -116 -493 569 -23 -558 514 91 -595 443 184 -628 367 275 -631 281 366 -618 199 427 -600
2595 -600 117 482 -562 30 540 -531 -66 569 -465 -154 591 -391 -242 610 -321 -320 621 -238 -402 590
2615 590 -130 -457 577 -38 -533 531 82 -579 452 167 -591 385 272 -622 294 365 -608 190 439
2634 439 -569 108 491 -550 11 553 -501 -94 568 -441 -163 591 -376 -270 630 -292 -355 593 -206
2653 -206 -389 586 -149 -465 572 -41 -525 504 46 -546 459 140 -597 401 246 -616 295 334 -588
2672e88Q15J68r92P18L70j042N43N29j003L99O46j031K84Q03r94P4Q83q53o3R31
2692E97q18k16J036p10l85J025n60m83J030m83o15J048l09p55R71j51q09R30m4
2711B99r20Q66J52r87P10L24r80N93M48j041M92O13j019K70P45r41J51Q26r27
2730c26k6R67q06k47R99o75l57J018n82n15J070m28o69R91k61p30R69j70q41R39
2750C20K7r40Q09J73r54P32K64r93O24M74j039M50N82r78L57O60r83J92Q29r13
2770c07mQ89q00j47R61p52l14J040n91n04J002m14o06J001l18p46R84j24q49Q84
2790B85K8r01Q20J49r76P41L21j016N88M47r85M98N30j005L68O88r86K15P56r02
2810c37Q0Q37q42j03R49p38k68R56o15l79R80n12n52J000l31o92R51j70p90Q98
$$ plain form
2672 -588 227 395 -597 121 491 -551 -8 521 -482 -83 563 -468 -184 619 -375 -301 582 -271 -334 597
2692 597 -221 -437 599 -111 -496 529 -31 -514 516 33 -582 466 157 -598 373 222 -587 343 299
2711 299 -621 245 397 -590 120 444 -536 57 505 -536 -44 569 -450 -180 565 -376 -225 601 -326
2730 -326 -352 615 -191 -438 561 -114 -471 547 -35 -550 520 92 -577 414 153 -577 392 222 -619 320
2750 320 347 -593 216 389 -565 167 431 -562 62 536 -503 -53 529 -449 -92 568 -415 -223 606 -307
2770 -307 -311 578 -222 -369 592 -160 -474 566 -25 -529 473 59 -547 454 136 -610 374 250 -599 285
2790 285 313 -588 232 381 -595 146 467 -549 39 486 -499 -1 529 -476 -108 580 -406 -191 565 -337
2810 -337 -257 580 -262 -365 584 -154 -422 534 -81 -460 520 8 -544 456 125 -567 384 214 -576 322
2830C22k4q94Q13J79r54O72L15r65N94M44r99M47N97r83L13O82r34J85P66r04
2850c28M0Q73q12j32R03p13k20R36o31l80R63m99n00R38l54o21R33k25p42Q93
2870C22o0q31Q06R3q82P08K45r40N98M08r49M41N53r37L13O50r16J81P52q54K3
2891b76Q30p85j11Q73o74k48R00n94l46R09m86m72R06l45n88Q84k32o81Q57j09
2911B12p45P75N5q13O87J83q62O01L26q87M72M58q90L46N73q53J96O84q11L8P81
2932E26p33j16Q35o59k32Q75n58l79Q78m25m71Q55l14n73Q44j89o70P84n0p24
2952d96P24M5p74O69J79q29N52L17q15M57L95q37L55N26q18J91O40p62O8O98p24
2973b39n1P84o43k15Q13n09l33Q23m18m65Q48l00n80Q04j49o42P46n4p35P21R6
$$ plain form
2830 322 298 -596 217 396 -558 114 429 -536 58 502 -497 -50 547 -436 -123 559 -375 -190 576 -328
2850 -328 -288 585 -227 -359 544 -169 -389 547 -84 -464 499 0 -500 438 84 -537 396 171 -571 322
2870 322 262 -569 237 330 -552 156 401 -539 59 467 -482 -41 512 -425 -112 538 -378 -197 555 -299 -276
2891 -276 554 -231 -342 531 -143 -391 509 -85 -431 478 -8 -480 426 81 -507 377 145 -536 321 212
2911 212 -533 242 297 -516 171 354 -508 93 419 -468 4 462 -428 -82 491 -362 -166 518 -293 -255 526
2932 526 -207 -323 512 -147 -379 496 -62 -441 437 12 -459 396 82 -491 353 164 -506 278 228 -496
2952 -496 228 273 -501 168 347 -482 70 387 -428 29 424 -413 -58 468 -350 -159 481 -281 -213 485 -239
2973 -239 -290 494 -149 -364 449 -60 -393 430 12 -453 395 95 -485 319 170 -472 274 220 -515 206 302
2994C02p85N88K24p78N23K99q08M45M17q15K67N27o98J58N70p53R3O96o70q7P35
3015D50n90j65P25n12k95Q14m15m41P89k75n11P41j78o20P50j9p25O44J29p42
3035d46N67K03p78N02L56q07L70M33p44K70N02p54J81O14p17J9O62o12p0O89n91
3056a51j71P58n02l04P42l68l81P32l09m85P53j59o00O85l8o31O22N6o94N71K08
3077C34p55M50L35p33L44M21p55K56N52p43J15O09o64J8O64o28j00P19n41k29
3097c31P27m32l07P24l79m03P49k56n12P00j47n46O55o1o18O23Q3o84N25J86o95
3118c99M56K88p43L77M14p18K27N03o83J28N73o69K5O54n87j42P11n16k25P29
3138D03m49l28P46l21m48P14k23n05O93j44n61O58k8o24N78Q6o48N18J74o90M43
$$ plain form
2994 302 -483 105 329 -449 74 373 -435 10 427 -388 -121 406 -292 -134 436 -317 -224 472 -198 -285 450
3015 450 -140 -305 420 -92 -387 427 12 -429 360 85 -426 315 137 -483 267 248 -477 167 296 -446
3035 -446 121 324 -454 48 404 -403 -33 400 -344 -74 428 -326 -145 469 -248 -229 433 -179 -249 440 -151
3056 -151 -322 436 -66 -370 372 4 -377 355 46 -439 314 155 -445 240 202 -429 193 249 -445 126 334
3077 334 -421 29 364 -369 -25 396 -359 -103 449 -294 -179 430 -234 -216 448 -180 -280 439 -102 -331
3097 -331 396 -36 -343 381 2 -401 348 92 -420 280 133 -413 242 181 -437 186 269 -415 110 296 -399
3118 -399 57 345 -398 -21 393 -325 -98 405 -278 -150 423 -246 -221 433 -154 -296 415 -101 -326 403
3138 403 -46 -374 372 51 -397 317 94 -411 282 138 -423 235 207 -417 161 247 -401 117 291 -399 44
3159D4L06p11L53L71o89K57M58o80J46N53o30K0O07n66r2O51n04j94O89m13l34
3180c58P04l10m13O98k25n01O75j03n84O19J3o30N63J06o56M96K16o84M02L01
3200C29o70L16L86o68K31M47o46J37N33o09K4N74n45q0O32m96j77O61m20k90O69
3221C38k99l89O54k10m86O45q9n59O04J1o01N17J30o51M69K21o63L70L26o53K67
3242d8M07o53K00M81o32Q0N51n81NN58n22q7O20m70k14O38l63k78O27k93l69O30
3264B87k03m59O14q5n27N70Jn81N26J21o36M23K52o33L39L18o52K81M26o49J41
3285a26N14o06N1N42n73j9O12n22j47O29m24k10O23l77l00O64k77m02O19j79m29
3306c37N86j21n03N80ln71N02J07n79M34J71o10L81L02o49K56L98n96J57M66o10
$$ plain form
3159 44 350 -361 -8 363 -326 -69 389 -291 -145 408 -222 -202 405 -161 -253 398 -106 -300 389 -24 -358
3180 -358 346 36 -377 321 96 -405 270 167 -417 202 215 -415 148 254 -402 94 310 -374 28 329
3200 329 -341 -25 361 -307 -76 371 -275 -138 395 -214 -190 384 -161 -241 391 -105 -282 379 -41 -331 338
3221 338 39 -350 304 94 -392 253 164 -395 209 220 -381 136 266 -385 84 305 -358 12 338 -315 -48
3242 -48 359 -294 -94 387 -245 -165 386 -195 -190 368 -154 -241 379 -91 -305 333 -30 -308 319 26 -343 287
3264 287 84 -375 239 154 -373 197 198 -383 143 264 -372 51 303 -330 9 327 -325 -44 382 -267 -126
3285 -126 388 -218 -167 375 -198 -217 395 -127 -274 355 -69 -279 344 -33 -333 331 54 -348 271 92 -337
3306 -337 249 128 -375 205 202 -369 133 240 -339 95 266 -344 37 339 -310 -54 344 -252 -95 371 -239
3327b39Q2N49n65n9O08m92j37O16m50k21O58l51l42O41k37l97O06j82m60O14p3
3348A69n54N45M0n45M82R9o03M53K12o33L49K88n82K59L53o17K07M45n92P1N14
3369C60n28j6N45n04j11O24m29k38O19l33l08O29k61m08O37j57n07N92l5n30N34
3390A75L3n88N05J45o21M01K44o15L38L05o34K72L94o16J57M63n80R2M81n30j6
3411a95N68m96j26N89m11j95N98l46l11O36k63l90N97j43m65N72n8n42N48N8n97
3432c72M70J63o04M13K19o30L40L43o37K46L99o09J60M59n85P1N22n28l5N54m81
3453a22j13N88m33k00O07l39k97N91k50l63O06j80m43N68p0n04N23L3n55M72J27
3474B46n91M04K35o26L31L17o03K33M04o02J33M67n49L9N21n12n6N50m56j30N84
$$ plain form
3327 -239 -157 392 -173 -232 376 -116 -253 363 -87 -308 350 -1 -343 298 61 -336 270 88 -372 242 169
3348 169 -385 160 200 -345 137 236 -367 86 298 -335 14 302 -280 -21 332 -285 -78 367 -225 -154 360
3369 360 -168 -184 361 -143 -254 370 -59 -297 322 -11 -319 310 49 -359 278 121 -386 206 171 -359 175
3390 175 208 -380 125 270 -351 50 294 -321 17 322 -312 -40 354 -262 -105 358 -222 -130 351 -179 -195
3411 -195 373 -123 -249 340 -71 -266 332 -14 -325 311 48 -342 255 112 -353 219 161 -381 167 225 -372
3432 -372 98 261 -343 70 289 -341 -1 342 -295 -49 350 -259 -99 360 -225 -154 368 -160 -195 359 -122
3453 -122 -235 353 -80 -280 327 -12 -309 282 32 -331 275 95 -348 220 150 -354 169 202 -353 119 246
3474 246 -345 59 294 -332 -1 316 -287 -54 350 -252 -119 348 -201 -162 359 -153 -209 341 -115 -245 339
3495C39l99k24N94l22k90O00k48l66N69j66m18N46q5m71M89L2n12M47J03n38L84
3516F4J98n59L02K93n72K18L74n65J39M44n32K2N15m79o8N41m31j46N71l61k54
3537b86N86k74l28N58k02l81N69j31m41N14k8m68M67K3m93M22J22n31L46K08n34
3558b82K98K63n34K15L52n35J23M08m78L6M40m63k5N10m15j40N29l35k20N36k77
3579Fk93N49k03l69N26j00m22M80l2m69M64O8n22L83J61n17L31K01n23K74K93
3600B86n41J86L48m75J09L70m73N7M35m31n6M72l65j20M77l33k00N24k58k87N02
3621B27j60l45M75j00m10M86rm75M19Q0m82L73J36n09L27K34n25K20L08m89J68
3642e1L32m93R8M16m54qM45m00n4M48l71j13M82l11k02M75k32k45M64j95l04M75
$$ plain form
3495 339 -60 -284 310 -12 -302 298 50 -316 253 87 -331 215 130 -341 148 180 -332 115 218 -320 64
3516 64 262 -297 5 298 -274 -56 318 -247 -108 336 -196 -174 341 -138 -206 335 -96 -242 329 -32 -286
3537 -286 300 26 -302 256 54 -327 242 111 -330 184 156 -312 155 178 -315 107 229 -302 44 252 -282
3558 -282 16 279 -255 -40 312 -223 -100 308 -170 -134 306 -157 -182 328 -87 -227 302 -33 -253 283 6
3579 6 -287 262 59 -310 216 116 -306 174 142 -327 137 205 -317 66 227 -290 41 242 -281 -7 286
3600 286 -255 -69 279 -196 -87 283 -190 -133 302 -129 -185 287 -78 -198 279 -54 -254 270 12 -275 227
3621 227 67 -278 197 97 -313 173 164 -311 108 188 -294 79 215 -294 33 267 -258 -38 270 -219 -51
3642 -51 281 -212 -114 302 -152 -160 285 -115 -169 279 -92 -205 277 -34 -236 239 7 -238 226 31 -273 202
3664B02j04l80M30j4m13L88L7m35L61J49m94K84K32m73K12K66m76J64L48m70O5
3685a21L94m20KM17m03n7M62l40j55M63k70j99M49k13k67M73j53l28M39q2l42
3706b51L90j8l89L82O5m42L16J46m33K61J83m49K16K70m56J29L24m15O7L70m01
3727a35k4M36l64j11M43k91j69M59k52k34M64j78k95M28j09l16M01m5l72L96J6
3748A48m08L32Q8l98K89J44m35K43K04m22J86K55m02J22K93m05P2L44l69j9L72
3769B34l13p1L97k90j48M16k34k16M26j59k81M22j10l26M02m2l61L62L2l97L19
3790F2R9l93K74J42m06K37J88m02J63K44l91J26K73l72N5L25l39j0L38l08m9L75
3812B31k93j08L77k37j63L78j77k15L75j20k74L74o1l24L47K4l66L09O7l78K78
$$ plain form
3664 202 98 -282 148 134 -279 109 146 -289 72 221 -273 11 243 -230 -18 248 -228 -64 284 -186 -121
3685 -121 273 -147 -145 272 -131 -188 274 -66 -221 242 -28 -227 222 9 -258 215 62 -266 173 91 -251
3706 -251 139 121 -268 114 179 -263 53 199 -234 27 210 -239 -23 247 -209 -80 244 -171 -104 266 -135
3727 -135 -159 277 -87 -198 245 -46 -215 244 -8 -242 222 44 -251 177 68 -248 153 108 -264 132 148
3748 148 -260 72 160 -238 51 195 -240 3 207 -215 -29 226 -176 -54 239 -166 -94 250 -119 -138 234
3769 234 -79 -150 247 -43 -191 225 -9 -225 201 42 -239 183 73 -253 149 107 -254 108 140 -257 62
3790 62 161 -232 42 184 -222 15 203 -199 -36 208 -183 -57 216 -156 -101 224 -115 -125 213 -95 -144 231
3812 231 -62 -170 207 -30 -193 185 8 -207 168 48 -226 148 87 -237 110 134 -232 77 144 -234 44
3833D4J34l85J98K05l79J57K32l77J15K81l65M6L09l14j1L09k85n2L57k68j18
3854a67L47k01j48L35j60j96L47j12k48L30m7k75K85lk92K89N8l47K32J31l44
3875a86J97J62l61J66K23l53Q3K75l24L1K81l03jL19k86o5L37k36j02L14j99j33
3897a61L30j54k04L24q9k23L08q8k30L07j1l11K73M2k94K20R0l11K06J33l25J43
3919b5J94l07R1K27l02N0K69k91k2K96k47o2L08k30r9L30j89j64L16j25j85K98
3941A31r6k17K98l8k65K65Kk50K25N5k87K24Q6l04J69J36k66J25J55k81R7J99
3963A63k78M6K31k52kK59k40l9K87k03j20L01j53j46K93j31j75K98r0k30K89l4
3985G4k39K47Ok67K39O3k97J92J05k79J62J19k73J34J74k82P5K03k58M2K15k39
$$ plain form
3833 44 178 -207 -9 196 -183 -26 206 -171 -56 225 -140 -94 215 -99 -110 199 -86 -138 219 -49 -167
3854 -167 180 -21 -169 166 6 -190 157 45 -203 127 80 -195 90 87 -205 84 142 -205 27 158 -186
3875 -186 11 173 -188 -22 201 -152 -69 206 -118 -87 194 -109 -110 209 -77 -142 195 -41 -143 171 -28 -161
3897 -161 169 15 -189 135 46 -177 131 43 -187 120 109 -202 71 113 -181 39 129 -182 24 157 -168 -25
3919 -25 169 -138 -47 180 -122 -72 197 -94 -116 180 -67 -129 179 -51 -150 180 -9 -173 143 18 -167 131
3941 131 35 -182 116 78 -187 78 80 -170 55 110 -177 47 133 -171 -2 134 -132 -7 148 -133 -36 163
3963 163 -115 -69 162 -90 -92 167 -73 -112 175 -28 -148 153 0 -146 147 16 -159 139 49 -181 108 74
3985 74 -165 82 88 -179 60 123 -174 18 123 -156 6 125 -148 -14 160 -122 -47 156 -102 -60 155 -84
4007h4jK58k37m1K59j77r2K63j68j22K97j36j78K80q5j92K62n4k32K65Rk69K16
4030D1O9k68J88R6k92J68J40k84J18J80k82Q7J98k82O2K30k51pK49k21l2K58k06
4053d1p9K67j65j03K55j23j51K60q8j83K61n8k07K35ok34K22L3k59K03P3k66J69
4076A5J07k69J28J62k70P1K15k74N1K26k52J6K40k40l1K65k06o6K52j58j07K72
4098A47j52j35K57j17j53K54o0j82K31l1k01K04J6k22J87O3k57J80R4k55J41J14
4120A23k55J08J64k45N2K06k35J7K15k22j3K45k03p2K52j52j03K50j31j32K59
4141A28j09j59K36n5j83K32l5k08K28nk08J76N4k19J49P1k16J19J23k35Q6J59
4163A29k19M6J68k16L4K06k10l5K34j69o3K21j48q3K41j24j41K38q6j43K21p5
$$ plain form
4007 -84 -85 173 -64 -105 154 -23 -115 148 -20 -142 155 19 -159 121 36 -156 106 52 -180 85 94 -175 41
4030 41 110 -158 30 126 -166 2 142 -142 -24 156 -126 -39 159 -123 -61 169 -82 -89 160 -61 -93 165 -41
4053 -41 -120 147 -18 -121 134 11 -140 120 32 -151 110 52 -155 80 74 -160 62 95 -164 39 112 -154 15
4076 15 122 -147 -19 143 -127 -56 159 -115 -64 162 -90 -74 166 -74 -105 160 -46 -112 140 -18 -125 147
4098 147 -5 -140 117 0 -153 101 41 -141 90 59 -142 62 78 -144 43 106 -151 29 123 -132 9 123
4120 123 -132 -24 140 -105 -53 153 -82 -65 150 -72 -85 160 -43 -115 137 -15 -118 132 1 -131 128
4141 128 19 -140 96 41 -142 90 55 -153 75 70 -138 38 92 -127 22 93 -123 -4 119 -116 -30 129
4163 129 -90 -44 124 -92 -58 148 -62 -97 137 -32 -95 126 -22 -105 136 12 -129 109 23 -120 101 26
4185B6j60K22l4j87J92K9k23J70N1k17J63P2k24J20J17k29J12J22k26P3J58k16
4207h9L3J83j91LJ84j77l0K08j37r0K19j15j09K10r9j26K27o0j76K05mj91J87
4230F5nk00J85M6k17J34R9k18J10J02k10J05J34k27N9J63j84K0J63j85kJ90j71
4253d4m3K06j35o8J92j21q3K03q6j41K01m2j47J79k3j82J92K4k07J59N1k05J38
4276A8Q8k22J10J19k19O4J65k04M1J54j89J5J96j98k0K04j50n1J98j39o9K06j20
4299cj13K16q1j27J88o3j51K06l0j65J71J5j82J56M4k06J42O9k01J05J11k01Q6
4322a4J30k03N0J66k01RJ79j66k4K04j78l6K08j43q2K16j19j03K12q9j42K13n7
4345C0j49K03l1j71J65Rj80J65L2j94J24Q8k04J22R4k06R2J26j94M6J56j95L2
$$ plain form
4185 26 -134 88 54 -133 59 88 -135 35 86 -131 32 104 -120 0 117 -112 0 122 -104 -31 127 -89
4207 -89 -56 127 -64 -61 123 -54 -84 124 -13 -103 116 1 -108 102 3 -123 104 44 -132 73 69 -122 65
4230 65 60 -140 45 91 -126 8 107 -111 -1 101 -109 -4 130 -97 -38 125 -59 -39 124 -61 -63 127 -44
4253 -44 -87 119 -16 -84 108 -13 -96 107 21 -120 81 39 -108 71 48 -134 58 82 -125 34 85 -120 18
4276 18 106 -116 -6 113 -106 -42 123 -81 -40 114 -75 -60 136 -62 -82 122 -28 -79 119 -20 -89 117 -3
4299 -3 -116 100 19 -108 80 17 -134 72 42 -123 48 63 -119 37 81 -125 17 86 -115 -10 101 -100 -14
4322 -14 116 -87 -37 129 -72 -63 116 -50 -74 130 -48 -84 124 -19 -101 115 -4 -107 105 16 -126 87 30
4345 30 -119 84 53 -118 47 56 -124 41 73 -121 3 91 -113 9 103 -103 -11 115 -79 -33 123 -72 -40
4368d0J62j87j2J95j68n0K26j43r1K21j27j03K16p7j48K11m8j59J95l3j69J84
4390E5K7k14J69M6k05J40P6k06J10J08k05R8J10k07O3J56j98L1J64j86RJ83j77
4413e3k3K00j50o4K03j23r3K06r1j31K09n5j53J97k6j83J97jk00J64N8k10J45
4436B3P1k13J25J05k23R1J38k05O8J32k00M5J69j95J3J73j61k1J79j55m0J99j30
4459a2r5K13j01j14K11q4j36K04l8j70J91j2j78J63K0j84J51O8k17J21J02k08
4481a05R3J21k09P1J54k01J9J72j74kJ75j63k6K08j72n3J98j19p9J88j02j02K06
4504I8q0j39K05n6j40J76k6j67J86J0j88J49N1j96J29Q7k04R6J22k23P5J47j86
4527g4L1J62j95J8J95j84k8K06j60n1J86j15q7K06j10j26K19p9j22J86n8j44J86
$$ plain form
4368 -40 122 -65 -77 118 -50 -100 126 -17 -108 113 -14 -117 99 22 -126 85 37 -122 73 40 -129 55
4390 55 82 -132 37 83 -122 18 94 -112 -2 106 -99 -1 109 -98 -35 121 -77 -46 118 -68 -59 124 -53
4413 -53 -76 124 -26 -90 113 -10 -103 103 12 -119 90 35 -118 79 53 -130 67 66 -134 30 88 -122 23
4436 23 94 -119 6 111 -112 -21 117 -88 -20 112 -88 -43 126 -69 -56 117 -44 -65 114 -41 -81 118 -12
4459 -12 -107 106 5 -109 102 18 -118 86 48 -122 69 57 -121 42 62 -122 29 97 -120 1 103 -105
4481 -105 -12 109 -100 -29 125 -76 -57 115 -59 -61 114 -49 -75 133 -39 -92 106 -13 -92 96 -6 -108 98
4504 98 18 -121 84 28 -112 64 38 -129 57 67 -121 28 79 -117 12 99 -105 -9 113 -110 -35 112 -74
4527 -74 -43 119 -76 -58 137 -47 -75 131 -29 -80 106 -9 -96 110 0 -126 93 14 -108 78 20 -124 62
4550F2j1j91J81K0j74J40M3j84J31Q2k02J03J07j90O2J33j99M9J63j99QJ85j75
4573e6k0J86j50n4K16j44q7K17j06j15K06q4j28K10m8j66J86mj80J74J7j93J57
4596C4M8k03J33Q3k09J17Q8j96R0J28j99L9J43j64J1J68j62j8J90j61m8K01j26
4619a3q5J91r4j07K10o8j54J95l0j76J94oj91J73L4k05J61N2k05J27R0j98R5J19
4643A09k07P5J35j90M3J57j95K2J70j67j7J84j52m9J85j19q3K06r8j13J95p2j36
4666a17J98l9j63J84lj75J64K3j94J43P4k19J27R6k08J03J10k06P6J44j90K1J59
4689A08j72J4J71j73j3J82j48o8K10j31p4J96j03j10K01p4j26J95m2j66J89rj79
4712a22J72Lj84J59N2j96J27Q2j95R4J12k00O6J46k02L4J63j77J6J77j74l4J97
$$ plain form
4550 62 51 -140 41 61 -113 27 70 -114 17 99 -103 0 107 -83 -21 112 -87 -38 125 -74 -66 119 -56
4573 -56 -76 110 -40 -94 122 -22 -109 108 2 -113 93 9 -119 91 43 -123 63 59 -121 53 70 -123 34
4596 34 82 -121 12 95 -114 3 91 -105 -15 113 -86 -47 96 -68 -57 111 -51 -69 121 -40 -88 113 -13
4619 -13 -98 93 -1 -108 102 34 -120 75 45 -131 63 57 -134 39 73 -132 29 81 -124 3 93 -105 -10 109
4643 109 -98 -23 112 -78 -35 122 -73 -51 119 -48 -65 119 -33 -82 103 -16 -99 107 9 -104 91 19 -117
4666 -117 81 42 -121 63 60 -115 49 72 -122 21 95 -124 3 99 -109 -6 104 -102 -26 118 -72 -51 108
4689 108 -64 -50 121 -52 -65 117 -31 -99 111 -20 -94 102 -1 -111 90 16 -110 85 43 -123 66 57 -122
4712 -122 50 53 -131 28 80 -116 11 93 -102 -8 104 -96 -30 116 -86 -52 111 -66 -50 127 -47 -81 116
4735A16j43p2K10j35p7K01q5j32J98o1j24J88m3j65J83j6j61J63J0j58J37L6j77
4758a07J10Q9j96R5J00j87P7J25j85K3J58j60JJ61j50j6J70j44n1J85j04q8J83
4781H9r6r1J89o9j37J75j5j52J68pj57J47K0j75J31O0j65R0O7j65R6R1j86O5J23
4806I6j61K9J34j57NJ56j45k6J70j26n2J63r4p5J75q5j07J71n1j26J55j8j39J50
4830D2J2j66J49K2j63J18K9j40J03P7j63O7Q6j47M1J23j50J5J35j44oJ40j08m0
4854f8J39r2m6J54q7q9J52n3r3J40l2j20J49k6j20J21J7j41J14L3j43J02O2j54
4878h1O6R4j46N0R0j41L0J14j39J5J26j12j8J23r9m5J50q3p2J57o8q7J29l6r8
4903h1J44k9j20J21Oj17J15lj30J13L7j39P5O7j28N4Q7j36M1R8j33J7J25j16k3
$$ plain form
4735 116 -27 -99 111 -24 -101 100 15 -117 81 20 -104 84 41 -124 59 43 -118 45 55 -103 34 70 -107
4758 -107 3 92 -104 -9 91 -96 -19 106 -79 -56 102 -58 -57 104 -46 -62 108 -36 -87 98 -6 -94 89
4781 89 -7 -98 91 22 -115 60 45 -107 61 54 -103 44 64 -111 20 80 -85 5 72 -93 3 94 -92 -27 96
4806 96 -65 -36 98 -59 -54 102 -43 -69 101 -25 -77 86 -8 -83 92 7 -100 71 20 -106 49 31 -108 42
4830 42 54 -112 37 59 -104 14 43 -97 6 83 -80 -13 73 -74 -33 90 -60 -45 90 -54 -60 80 -28 -68
4854 -68 71 -21 -67 87 0 -89 63 10 -83 57 25 -95 54 28 -92 29 46 -95 19 52 -91 11 73 -81
4878 -81 -15 79 -67 -17 73 -68 -38 76 -63 -48 78 -34 -52 71 -28 -73 77 -6 -78 79 11 -76 53 17 -81
4903 -81 63 34 -86 35 41 -76 39 36 -94 19 56 -83 -8 59 -69 -15 72 -64 -23 75 -58 -41 84 -32 -55
4928e5J26r6m2J49r8l9J26o5p4J32m8q7J19k6j02J27j6j15J09J5j21J03K4j19
4952g3P9M5j20O3O4j23N1P5j16K0J05j07LJ03j01j3J14r0k6J15p9n1J22n1p2J18
4978E5m0q1J10j4j02J08Mj22J07J9j17Q6M7j26O1N6j17N4O1j01K5R3j14J6J07
5003G5j15JJ07r0k4J11p4n1J21o3n6J05l4p2J07k6r2J07%j11J05Qj17R5L5j30
5029g8Q0N5j19N7M9j08N1Q0j23K7R1j05MR6q6j1J03q6l6J15o2m0J03o2m8J15m1
5056B1q0J00k2q1R2Mr6R0Mj07Q3L3r0M0M7r2M8N3r5K8P2r1mR8r0JQ5p1l3J08o6
5087a1m1R8n9l4R4n1n7R9k7o2Q5j3q0Q6Mq9O7L2q6M2L5p7N7L0r2K7P5r1J6O1q4
5118d6J6P7q1j8J07o8k9R1o5k6R1m3o2J04l3p1Q9j1p3Q0%r3O6L6q7N9K5r5O8K9
$$ plain form
4928 -55 71 -25 -67 82 -16 -55 71 6 -68 64 16 -71 48 22 -80 47 31 -84 25 40 -81 22 46 -73
4952 -73 6 51 -69 -6 58 -65 -14 61 -55 -35 70 -37 -34 69 -32 -45 69 -21 -47 68 -11 -62 60 9 -63 55
4978 55 15 -66 44 30 -72 36 40 -82 25 44 -73 13 60 -66 -5 51 -66 -12 49 -52 -27 66 -48 -32 75
5003 75 -40 -39 68 -22 -46 65 -9 -60 61 -2 -58 47 13 -59 48 22 -70 37 37 -74 31 39 -78 17 52 -78
5029 -78 2 57 -62 -5 44 -64 -13 67 -56 -29 62 -43 -39 57 -29 -40 63 -23 -59 56 -6 -46 57 -5 -53 62 21
5056 21 -59 41 19 -62 30 34 -62 28 32 -75 8 41 -49 -9 38 -54 -6 47 -48 -20 52 -39 -43 55 -35 -34 51 -20 -53 55 -11
5087 -11 -52 46 -13 -47 47 -4 -61 38 11 -51 34 21 -59 27 31 -58 9 41 -45 -3 32 -45 12 42 -50 -23 52 -39 -23 38 -46
5118 -46 -30 47 -34 -52 55 -13 -42 49 -16 -42 49 6 -56 48 15 -56 33 22 -51 29 29 -64 2 38 -49 10 35 -60 8 37
5148C7p6J7P6j09L0O3q1J0Q0p6kP7o1k3P3n3k9R1m9n1R1j5o8Q9l2n6Q8j8q3P8
5178A8J7j06Q1K3q0O1K1r1N1M8q2K1N7p9J7P2p8%Q0q2j0R2o3k6R3o3l0P1k1n1
5208c9P5k7n8R1k5o1O6No1O1K9j28J03K2j32P7K9m8rQ2j43N1M6q3N6R9j32PJ08
5237F1r8pQ1o3k3R8o2n6J19l4n1O9j3q8N3N6r4P6J3q9P7Mp0O0J5p3M3L7r2N0N0
5268D9r3L1O5r6K2Q0r4J8P7r2j3J01q6j6J04o4m3J01m5n9J00l6p8J06j7q5R4k1
5296A0o6P7J6r9P2K7r2N9L7q5L6N6q7K5N7q7J6Q4q6kQ3q8mR6p4l3R2n8l0R9o0
5327im3J02l5p5R4j0p4R2k2r0R8J3r0N8M3r8N6L0j31M8Q2n6j9R1j01J3P6o1j5
5356c3J05j04j2Q7o3j5Q2n9m2J04n7m1R0l9n0Q2j3q3Q9Kr9Q5J4q9P2L0j02O2M6
$$ plain form
5148 37 -39 -22 54 -55 -25 38 -43 -33 47 -29 -31 46 -15 -38 35 -18 -47 44 -5 -56 35 20 -48 41 9 -47 41 23 -60 18
5178 18 35 -71 10 33 -47 14 35 -56 -5 43 -39 -18 39 -40 -23 49 -29 -29 51 -31 -41 51 -12 -38 55 -8 -38 33 12 -39
5208 -39 36 9 -49 42 17 -44 22 27 -34 27 56 -72 31 53 -79 -2 27 -21 -30 52 -91 -40 6 -77 -21 78 -54 -47 61
5237 61 -37 -44 37 -26 -49 49 -13 -69 50 16 -35 34 21 -67 -14 42 -52 24 37 -52 25 29 -41 19 34 -39 4 41 -51 -1 49
5268 49 -44 -13 52 -44 -22 58 -36 -18 59 -33 -46 55 -31 -47 57 -7 -50 51 6 -53 47 11 -67 39 22 -63 31 10
5296 10 -56 21 37 -62 10 37 -55 4 41 -44 -8 48 -39 -14 43 -44 -28 56 -30 -32 51 -37 -41 55 -19 -52 40 -18 -48 51 -9
5327 -9 -52 50 15 -60 34 24 -50 42 20 -70 28 41 -49 9 52 -46 10 40 -91 -43 39 -17 -36 55 -46 -33 43 -18 -33
5356 -33 72 -32 -44 43 -20 -35 47 -12 -54 50 -7 -48 42 3 -47 35 22 -61 28 30 -69 16 30 -59 13 43 -59 3 49
5385D9r6M2M6q1J7P0r1J3Q5q9NP5p8qJ00o9l2Q8m7m4R4m4m7R5m2o5R1pp5P4lp6
5417e0P6Kq5O7L2q8N1L4q6L6M9r3L4P3j01K3P2q7LR3q5rQ6o2l0Q4m6m1R3m0o0
5448e5R4k1p1O9lo8P9Qq4P4K1r3N7L3p9M6L4q8L4N4q7M0O5r7K8N7q1PP5p2j0P7
5480D3n7k3Q2n3m5J05m0n6Q8l1o8J00j7p9P6J6r2N9K7q9O4K3q1M1M9r1L4M6p0
5509c9K4M7p4J3P6p4j3Q7o6l9J13p7k6R6m9n4J07n1o1J05l7o9R7j2q4R3lq4P2
5538A8J8q0N0M6j06N4M3r1M1N7q7K2O3r2J7P1o9nP7p5j9R4n6m2Q2l4n2Q3k4n8
5568e4Q0j3p0R8j9p6Q4Jq4P0K5q7N5L8r8N7L4q1L3M8q4J8P2q0JP9p9oP7o6k0R5
5600D8n9k6Q1l7m5P4l7n2P3kp1Q9j0o8P2kq9P8J9r2O6L0p9L9N1r7L0P2r8K5N9
$$ plain form
5385 49 -47 -5 41 -40 -23 47 -44 -31 54 -35 -30 45 -33 -41 59 -10 -42 46 -1 -45 49 5 -42 53 11 -54 37 30 -45 29 26 -50
5417 -50 26 28 -57 10 42 -46 5 39 -47 -11 38 -55 -21 52 -49 -26 46 -41 -38 55 -30 -39 47 -15 -45 39 -7 -48 45 5 -55
5448 -55 39 18 -53 16 13 -55 24 32 -52 22 43 -50 7 40 -39 7 41 -47 -13 41 -46 -6 59 -38 -10 47 -34 -27 48 -24 -34 43
5480 43 -14 -37 45 -8 -53 52 12 -44 44 13 -55 45 28 -51 25 41 -51 8 35 -54 10 33 -48 -7 42 -49 -15 31 -39
5509 -39 -15 32 -42 -29 47 -27 -40 47 -19 -58 55 -22 -48 48 -1 -55 52 1 -60 45 8 -61 36 24 -60 33 30 -54 18
5538 18 36 -44 6 52 -54 0 43 -48 -7 50 -37 -15 48 -44 -27 44 -25 -30 47 -28 -47 47 -9 -51 31 -3 -55 28 4 -54
5568 -54 26 13 -57 41 22 -54 30 31 -53 17 42 -45 10 48 -50 7 41 -40 -7 41 -43 -25 47 -33 -32 47 -32 -38 39 -27 -47 48
5600 48 -11 -37 44 7 -38 36 -1 -53 20 18 -53 36 26 -42 30 28 -61 17 36 -56 10 40 -39 0 51 -46 -16 56 -42 -17 42
5631D2q3OP5o8nP8o3l0R0n7l8Q5l4m9Q7l4n4Q0k2m8O3Lo7N9J7p6N3K4p0M0M1p6
5663c1K6M6p4J6N4p0K1N4p6J1P3o3k1P3n4l6R3m2n0Q5m0n1R0k4o0P7j9o0P5Op6
5694d7O2J8p0M9K7q3M4L1o7L3M2o2NN2o7kP8p1jO4n7nO7n1l7Q1m4k7O9j9n9P8
5726C1k6n7Q8k1o7O7J2o8N8K3q8M8L8p5L7N1p6J5N0p4J5O0n3j9P3n7j1N9m9k0
5756c6P1l5m2P6k3o3Q5k7m8P6j4o8O8Kn4M9K3q8N2L7p9L7L8o6L1M7q5L5N5q2j
5787b9P9o2j6O5o1j6Q1n7l2P7l8m6Q3j6o4Q0j3o2N9J7o7N1J8p4N2K6o2L8L2q7
5817d4M4M3p8K4N9p3PO6o9KO0o4j5Q3o4l0Q4m7l9Q4l3o0R2j8o3P2ro7P0J1p3O1
5849A6J2p0N3L5q5K9M7o8K1N6p9K0N6p0MP5o8j6P5o2k2Q5n0m5R7o3m4J05m4n3
$$ plain form
5631 42 -41 -35 40 -28 -33 45 -18 -48 42 -15 -53 32 -2 -51 36 2 -52 28 6 -42 21 24 -43 16 33 -43 10 34 -36 4 45 -31
5663 -31 -5 41 -33 -17 37 -33 -12 42 -34 -23 50 -13 -34 39 -15 -51 42 0 -50 35 -5 -56 34 10 -50 27 8 -52 23 29 -47
5694 -47 15 33 -37 12 39 -44 0 31 -36 -3 39 -23 -18 34 -33 -35 43 -28 -29 35 -22 -27 40 -11 -48 33 -11 -38 31 12 -47 31
5726 31 5 -52 36 15 -52 15 27 -41 17 40 -48 0 38 -37 0 51 -25 -10 40 -34 -19 41 -12 -31 42 -15 -26 33 -16 -36
5756 -36 35 0 -42 34 11 -52 33 6 -42 34 20 -48 20 22 -32 17 40 -48 4 41 -38 -1 37 -29 2 49 -36 -1 54 -28 -29
5787 -29 50 -12 -28 37 -24 -40 41 -16 -48 29 -9 -55 28 12 -52 28 15 -47 12 29 -38 13 31 -43 9 35 -27 11 43 -44
5817 -44 0 43 -35 -11 48 -25 -18 48 -21 -19 41 -23 -38 45 -19 -49 35 -12 -51 33 0 -60 32 14 -49 23 14 -53 17 28 -45 16
5849 16 28 -42 11 46 -39 -10 37 -31 -10 46 -33 -13 43 -27 -23 52 -16 -32 43 -19 -41 44 -6 -51 46 -17 -61 44 0 -53
5879e3R0k2p0Q6lq5P6Rq3P8Lp3M9L6q0M4N2r3L2M3p3J7O4p3J5N8p4lP7o2k0P7
5911C9o4k7Q8m5n0R8m9m5Q0j6o5P0pp1Q2%p6P3K2r8O4L3q7N1L7q7L6N3q2J3P7
5942D7q4QP5p8pP5n9k2R2n9m0R5n2m8R4l2n9P6j8o7Q4kq5Q0K7r3P1J2p9N8K8q1
5974d3M1M3p2J2O6r0L2O9r4J2O6p7QP5o8j7P8n3l9R7n4m3Q5l4p0R4j5o7O7Op1
6005e6O9J5q4P6J2p3L6M8q4M0M4r4M5N5q0K0O4q4J2O8p9kQ2o0k7P6n5k6P1k9m6
6036d6Q4l3n3O7oo4Q2j2o5O1Qo9M7L0p1M9L4q7L0P0q6J5N5p8PP6q1LQ7p9j4R3
6068E4p2j7P7n3l5Q2l1n8P9k9m7Q7k4o4P9j0p3O8J8q6P3Nq1O1M9q9K0O2q6L1O4
6099E4r4K1O7o3j0P9p3j3Q1o5l3Q8n8l0Q0m2m1Q2k6o6R0k2o1P6j0p1P4J5r1P2
$$ plain form
5879 -53 37 15 -55 31 28 -57 19 28 -55 23 26 -47 2 38 -42 2 54 -39 -7 36 -37 -20 44 -29 -14 44 -30 -33 44 -18 -38 39
5911 39 -25 -52 36 -9 -59 39 -10 -55 25 9 -56 14 7 -64 18 18 -58 15 37 -61 3 36 -51 0 37 -50 -14 39 -43 -30 47
5942 47 -37 -29 46 -32 -39 36 -23 -45 47 -12 -52 43 -9 -57 37 5 -54 22 4 -63 21 19 -66 14 41 -52 19 31 -48 10 38 -43
5974 -43 -2 41 -31 -19 47 -43 -11 58 -36 -24 42 -35 -27 48 -20 -37 41 -12 -51 46 -8 -51 34 0 -70 24 9 -58 9 15 -56
6005 -56 13 28 -56 20 32 -41 -5 43 -41 -1 43 -51 -6 49 -31 -11 53 -31 -19 49 -30 -32 50 -10 -37 39 -16 -42 29 0 -46
6036 -46 38 5 -48 19 13 -51 31 19 -46 15 23 -46 1 31 -40 9 43 -44 -14 56 -30 -15 40 -38 -31 45 -36 -33 54 -25 -39 54
6068 54 -18 -35 42 -11 -46 36 5 -53 26 -3 -50 37 13 -51 28 18 -55 13 31 -55 18 23 -58 3 52 -37 -17 45 -41 -10 54
6099 54 -40 -19 48 -15 -25 54 -19 -32 49 -16 -49 39 -19 -49 31 -11 -52 30 4 -62 28 6 -55 21 11 -60 14 29 -62 10
6129A0K3p8M8L7r1N6M2q4K7N9q4RP0p6J7O8p1rP2o0k7R0o3k9Q6m9m6P8k4o5Q7
6160B3j0p3P5Jp4P5Qq4P4J7r6P4K9q6M7M6r3L2O7q8J7O4p2nR3q6jP9p7j4P4n2
6192a6l6R4m6m5Q7l9n5P6j3o6Q0np7Q0%p3P3K2q6N4L4q4L8M4p9L0O0q7J5P6q7
6223c1PP0p2j2Q5o7k1R2p2k2Q1m4m5Q1k9n6O8on9O8po7O5J8p7O1J9p7N3K8p9M6
6255aL0o8K3O2p8J1P6q3J1N6o5%P4p6JP1o3k1P4n5k5P7m4l5Q0k7n6Q0j5o4P3r
6287A4n0M2K2p6N5K9p2M2L6p6K1N5p2J4O4o7PN4p1oO8n6j7P6m9k2O6m4l9Q4m7
6318a5l8O8k0n1P9j6n7P5po1N1J6p4N4L0p6M5L3p1L5M0o6J7N2p8J5P1o5oN1n3
6349b2%N2m1j6O3l9l2O3l3l7O2k1n0O9qn6N9Ko2N9On7L8K1o5M8L3o9L3L5o5K5
$$ plain form
6129 10 33 -45 3 40 -51 5 47 -37 -10 49 -35 -26 44 -32 -15 53 -18 -27 45 -15 -42 48 -15 -44 42 -7 -53 25 1 -64 23
6160 23 13 -60 15 16 -58 17 25 -59 15 32 -64 10 39 -47 0 46 -47 -15 52 -36 -19 45 -27 -32 61 -25 -26 53 -24 -38 36 -16
6192 -16 -52 42 -4 -49 38 -1 -56 20 7 -59 21 16 -61 19 19 -54 19 41 -45 9 43 -41 -3 41 -38 -8 52 -35 -20 56 -31
6223 -31 -24 46 -26 -38 47 -20 -41 51 -21 -43 38 -6 -51 30 1 -55 13 7 -52 16 9 -58 7 25 -52 9 28 -49 4 32 -47 -1
6255 -1 29 -39 -16 46 -32 -21 55 -28 -17 39 -26 -26 48 -28 -27 44 -19 -40 34 -21 -46 31 -13 -48 32 5 -51 29 14 -50 23 14
6287 14 -36 6 28 -48 7 36 -36 6 42 -34 -13 42 -30 -16 48 -19 -12 42 -29 -35 33 -23 -40 36 -13 -35 31 -13 -52 32 -15
6318 -15 -53 15 -5 -56 23 7 -50 25 18 -43 8 24 -50 4 34 -42 3 36 -35 0 40 -26 -9 43 -35 -20 51 -14 -20 31 -22
6349 -22 -22 30 -11 -27 36 -3 -35 28 -5 -42 20 -1 -51 18 10 -46 13 15 -47 12 18 -39 -1 20 -45 3 36 -33 0 35 -30 -5
6381eL6o7K4N3p0J2N3n6j3N8m6j0O0m7k6P0l1m1O9l8l5O5j1m9N4J2o7N3J8p0N3
6412HJ5n5M3J2n0L1K7n9K7M5o5PN2p2K5M0n3nM8m2j8O8m3k9P3l7k5M7j7l8O2j9
6444Cm7O9j8n5M8Km4M0J9n9M4K9o4L8K4o9L1L6n4J9L8o1NN3m0j2N3m2j9N9m5j8
6476c7O5m1k7N0j5l7N8j1n4O5nm7N1lm5L5K8p3N1K3n9L4K2o2L7K5o3K1M4n9J8
6507a1M5m6nM8n0mM8l9j2N2l7k4O4l2l5P4m2m5N9qm4O3qn9O0J1n9M3J5n7M1K1
6539B7p0M2L0o0K2M7n6%N8o9J5M3m4qM9m9MM9m1k3M9j8l7N7j9l3O5l1l5N5j3m9
6571d3O1km6M7J1o4M6J4o6M4J7m8K3M1p0K8M1o3J0M5m2j1O1n2j2N6m2j9O2m0k5
6602c8N7k0l2N6j5n4N3Jm6N0J1o3L8J7n2M0K4o2K9L6o3L6L4o5K2L4o5K2N5o8j
$$ plain form
6381 -5 31 -36 -12 41 -29 -17 36 -20 -33 25 -21 -31 29 -18 -44 26 -5 -46 23 -15 -50 15 4 -45 9 21 -46 7 25 -45 8
6412 8 23 -32 11 23 -27 4 31 -28 -1 44 -21 -14 38 -34 -9 31 -22 -27 21 -21 -39 29 -14 -43 30 -7 -32 15 -2 -40 22 3
6444 3 -44 25 7 -48 0 2 -42 -2 17 -42 2 31 -33 5 29 -40 -9 27 -27 -8 30 -31 -26 27 -13 -25 28 -14 -33 26 -19 -37
6476 -37 28 -13 -40 10 -5 -42 16 5 -49 16 11 -36 15 12 -33 2 30 -43 8 31 -28 6 28 -34 3 28 -35 -14 30 -29 -11
6507 -11 34 -12 -17 31 -19 -23 25 -14 -26 26 -11 -35 29 -3 -38 36 -6 -51 8 0 -44 19 11 -48 12 23 -36 7 22 -35 6 27
6539 27 -43 -1 29 -31 -9 38 -18 -18 40 -29 -14 29 -15 -23 26 -23 -19 30 -11 -34 15 -3 -40 17 -2 -35 30 -1 -36 19 6 -43
6571 -43 18 16 -30 17 28 -36 10 24 -42 2 19 -29 -6 35 -35 -7 34 -29 -19 26 -16 -27 34 -18 -30 26 -16 -35 27 -13 -38
6602 -38 19 -1 -33 23 8 -46 7 8 -38 12 23 -40 -2 15 -37 3 27 -35 -6 30 -33 3 37 -28 -6 28 -37 -15 40 -28 -29
6633b9N4l7j5M1l8nM9l0l9O6j6m5N6j1l5M8%n5M2J3m0L5Pn5M2J2n4M2K4o2L7K4
6665B6n8K6K9n3J3N2n4pM8m5j1N0k5k1M5k2l4N8k8l0O0j7m6O6j1n5N1J2m8L6J7
6696B4n2L9K5o4J8L6m7J9L7o0J0M4n8KN8m7nM8n0rN7l9k6O8l6l1N2k3l5O4rn0
6728d0M4J2n1L9J6n4L5K9n6L3K3o3L2L6n9K0M0o1J8K9l8rN0l8j1O2o0j1N1k7l2
6759d1P0k9m5O4k3l6N8j5n1N8ln3N6J4n7L9J7o0M0K6o2K9L5n1J8L5n6NN1n2jM9
6791B9n5rN6k9l2O6m0k3O0k5m1O4on1M5nn6O6jo4N4J5n2M7J3n5L0K9p1L5M6p6
6823c6J5N5n8J6M7o1jN3m2l3Q0n3j9O6m0l4P2k0n6O3j4l8N1j2m3N0J1o4N6K2p1
6854c8M2J7n9L4L7o4K6L6o5K1N0p5K3N5p7J2O1n4j3N3l9k0O1l6l8P2l4l6P0k7
$$ plain form
6633 -29 25 -12 -27 14 -24 -29 20 -10 -49 17 1 -44 12 1 -34 14 14 -41 1 14 -26 9 16 -39 3 15 -39 3 27 -35 2 26
6665 26 -32 -6 23 -30 -17 35 -19 -26 22 -23 -34 16 -9 -30 15 -7 -41 17 -11 -41 19 2 -44 22 11 -44 7 19 -29 7 24
6696 24 -28 11 36 -28 -10 26 -21 -2 35 -25 -15 29 -29 -27 31 -16 -21 27 -23 -32 25 -14 -40 28 -8 -39 13 -10 -45 19 10 -40
6728 -40 4 16 -35 4 20 -34 1 30 -26 7 30 -33 -1 35 -24 -4 36 -25 -7 22 -16 -25 25 -13 -24 38 -22 -33 18 -9 -41
6759 -41 29 0 -45 19 -4 -40 18 3 -48 10 7 -46 10 24 -33 6 23 -37 3 29 -33 -4 31 -20 -2 33 -23 -18 33 -19 -20 29
6791 29 -26 -35 21 -8 -40 26 -14 -37 23 -2 -43 21 15 -36 9 4 -52 14 13 -51 3 18 -34 13 26 -29 1 30 -41 -6 40 -36
6823 -36 -21 34 -24 -8 39 -22 -23 30 -12 -45 35 -18 -37 29 -11 -45 27 7 -49 14 0 -38 13 1 -42 8 19 -45 11 33 -38
6854 -38 4 21 -38 -4 33 -31 -5 31 -34 -13 37 -38 -15 40 -37 -25 36 -18 -31 22 -17 -37 24 -12 -50 22 -12 -48 22 -5
6884em8P6j9n7N9J5o8O1Ro2M7K8p5L6K2n4K9M0o2J2N7p0PO7o9j0P1o1k6P6m5k5
6916d4P4m3l6P8l5m6P1j1n7O2qn8O9no8P5Qn9L4K5n8L0L8o9L7L5o9J4N2n3NM8
6948C6o2OP0p2j7O7m1l5P3k5l6O3l5l3O3j9m4O6k2m7O3lo7P2jo1M8K8p4M1L8o4
6980b4K2L6n8ON0o8J9N9n8k1O3n1j0O0m3j8O6l0m1O9k8m0O1k2l8N3J5p7N7J4p0
7011d7N9Qo4N2K0p0L6M1p2L5M1o4J0N6p1K0N6o6KO4n9j2O1p0JM9ql1N8k5n2J8
7043b4K4l7J16p0lNk9p7J06k0k6P3k4o0L1N5n8L5N4o2o0J09m0jJn4OJ01r0mM4
7074B1n0JN4m6l4P8l3l7P7k1r8J01np5P9Oq7R1Mp5N7J1m5L4K2q0O1K0r5N0P5j05
7106d4M9L3l5k9P7o9k8N9J2o5R7m4o7J34o1q4Q5k7r3J26l2k7P2l1q5J33o3n9J48
$$ plain form
6884 -5 -53 23 4 -53 6 21 -47 14 23 -39 8 36 -39 -3 19 -35 -6 34 -28 -16 41 -29 -22 45 -24 -34 37 -24 -50 26 -19 -44
6916 -44 30 -13 -49 29 -6 -52 19 8 -49 13 5 -53 16 11 -57 18 26 -33 1 26 -32 -2 36 -33 4 39 -30 -16 36 -17 -12 36
6948 36 -26 -20 50 -22 -39 28 -13 -48 25 0 -36 27 -8 -41 22 3 -41 25 3 -44 19 16 -51 21 20 -41 7 35 -39 2 40 -24
6980 -24 -2 34 -24 -18 32 -36 -17 42 -16 -37 26 -25 -35 25 -18 -36 30 0 -41 28 0 -40 21 -1 -39 14 29 -48 9 23 -47
7011 -47 12 20 -44 8 28 -42 -6 35 -37 -2 39 -25 -15 41 -30 -10 46 -20 -18 46 -13 -25 36 -34 -33 16 8 -23 35 10 -42 -24
7043 -24 0 -37 79 9 6 11 -18 -95 11 -9 -35 38 14 -46 -15 40 -18 17 71 9 -51 58 18 17 18 -36 -30 71 -19 -23 21
7074 21 -29 -28 26 -20 -54 24 -9 -46 31 10 -88 13 8 -67 12 18 -69 22 26 -49 8 19 -26 8 30 -50 11 31 -64 -14 61 -44
7106 -44 5 38 3 -26 51 -18 -46 13 25 -40 57 13 -54 80 19 -65 20 -7 -100 26 -6 -33 39 8 -77 56 -7 -66 82
7135H2l1r3O1Ql8J3J8l6PJ10j13JM7m9nN4o7L7N1o9k9R6j01%R8o6n7J07mn6M4
7166B0j7j7P3m3p1N6K9p0Q6l5p9P2K3o5L9M8r6L7N2o0%N7n5%O1o9jO7o4j7O8l6
7198gl3O1l8l1P6l1m4O8j2n9O1J0o2N2Op7O2K9o1M8J8q2M1L7o3K5M7p3J5N3o2
7229b6PN4o3%O3m1l4O9m2k6O3k5m2P8l3m1N5j0m3M7Lo6O6J1o6M6K5p0M5K3o2L4
7261aL6o6K5L9n7QN4o9ON7o3JO4o2qO7l5l2N2l1l4P1k9l7O2k2l9O2ko5N6Po4N1
7295BK0o0L7K5o5M0K8o8L7M2p2K3M0o2J9M5n7kO5o3j8P6n9qO2l9l5O8l1l2O1k6
7327gl6O4j7m8M7Lm7M7Oo6N0K3n6K8L9p7M5K6n1QM9n2NM2o2PN8n5oO6n5k3O2l3
7361a6k8O7k6m2O8k0n6O5rm8N8jn3N1Nn0M6J8o2L3K0n5L3K3n3K6L9n1MO4q1qP4
$$ plain form
7135 82 51 -42 19 27 -11 2 20 -16 -9 101 -12 -11 36 -13 -18 36 -31 6 57 -12 -41 55 -46 -46 52 -14 -71 36 32 -24 20
7166 20 3 -14 59 16 -55 1 30 -40 46 11 -68 4 27 -38 1 49 -47 -10 42 -18 -18 39 -16 -16 45 -24 -25 42 -22 -39 29 -7
7198 -7 -40 21 -17 -48 28 -3 -47 21 9 -50 11 21 -41 11 17 -60 2 31 -30 18 36 -46 -5 32 -31 -6 41 -32 -17 36 -26
7229 -26 -19 35 -28 -28 35 -6 -40 29 -13 -39 24 -1 -43 35 2 -39 16 6 -37 10 13 -53 13 24 -42 4 29 -41 4 27 -35 -1
7261 -1 35 -31 -6 33 -24 -16 38 -31 -25 32 -31 -30 34 -28 -36 31 -4 -36 16 -15 -49 22 -7 -44 18 -4 -43 19 17 -48 8 15 -49 2
7295 2 22 -38 -1 24 -41 -1 27 -41 -4 38 -34 -11 29 -33 -14 31 -26 -28 37 -26 -44 32 -27 -35 27 -12 -47 21 -10 -42 19 -7
7327 -7 -43 21 4 -44 3 6 -41 6 12 -54 -4 19 -37 -9 30 -47 -2 24 -27 -19 30 -22 -17 25 -37 -30 28 -27 -33 33 -22 -45 17 -16
7361 -16 -44 23 -3 -45 23 3 -53 12 3 -45 13 12 -41 10 15 -35 11 29 -33 0 20 -35 -2 21 -32 -6 33 -18 -14 50 -31 -39 35
7394C5n3kM7l6k4N7m0k9P5l8l9O2k3l6O4j0n3O5qn7N5Jn1M3K3o4L0M0o5L3L2o2
7426b8K3K9n9J6O2o8J1M7n7pO3n9LM5k5l1N1k4l3O3k4m2P1k3l6M1%m1M1Nm7M6
7458A3J0o3M3L6p5L9K8n0J6L1n2J5L8n3J7M0n8JN5m7j8O9m7j8N3l6k0O9m5k6N2
7489A7k0m2O5Ko1O0Lo8N4%m6M4K3o0K6L7o6L7K9o6K0M1n2JM7m3JM7m9pO1n0j9
7522c4O3l9k9N5k4k7M9j4l6O4k5l4N3j1m0M1Qn4M7Pl9K7K0o4K9L6o2K8L9n5jO4
7554D2o5mO1m3k5N3k8k8N9m2k1N5j7n0N6nk8M4j3l8O5j5m5M2J1n5N6%m3K8K1n9
7586c1L0K8o1K6L8n7J3L3m1LM1m1j2N9m8%M4l5k1M4j1l6M5j5l2M9j5m5O6j0l6
7617b8L9Jl1L3kl5L2Rn7M0K7n3J9L7n8J1M1m6LM7n6LM5m7qM9k7j9L9k6k0N3k2
$$ plain form
7394 35 -18 -20 27 -9 -33 24 -16 -45 30 -8 -47 15 -8 -44 20 10 -43 22 14 -43 12 13 -38 5 28 -36 -6 34 -31 2 34 -28
7426 -28 -5 24 -35 -19 43 -25 -14 33 -24 -31 32 -27 -24 21 -4 -35 16 -8 -41 22 -2 -44 27 4 -32 9 9 -32 9 14 -33 13
7458 13 23 -40 3 39 -36 3 31 -19 -3 28 -24 -9 29 -24 -7 33 -25 -24 31 -16 -34 35 -12 -30 23 -13 -33 36 -9 -35 17
7489 17 -3 -45 20 22 -39 21 24 -44 10 10 -36 8 31 -29 -3 34 -32 5 34 -32 -12 29 -23 -22 25 -18 -17 30 -19 -26 35 -15 -34
7522 -34 29 -10 -39 16 -8 -35 14 0 -36 28 3 -31 22 11 -29 12 20 -34 13 20 -19 8 28 -36 -7 29 -33 -5 34 -21 -22 42
7554 42 -23 -27 34 -9 -34 19 -9 -37 22 -20 -41 14 -3 -53 3 -2 -30 14 1 -37 28 13 -32 10 21 -34 22 22 -21 7 28 -31
7586 -31 -1 27 -34 -8 30 -27 -14 19 -22 -19 22 -19 -31 28 -20 -20 24 -11 -32 12 1 -35 10 -5 -37 12 -3 -48 18 8 -28
7617 -28 11 12 -19 14 12 -23 9 18 -39 1 28 -25 -6 31 -27 -16 25 -21 -18 29 -27 -24 21 -26 -34 15 -12 -31 8 -18 -38 15 -7
7650gk7M4pl6N0j7l5M6Ml7K3J5m2K7J9m2K4K2m6K5J8m4J6L2m4RL5m9KL8m1j3N1
7683A3l1j6K5kj7L6j6l5N1rl0L8Ml9L2Om9L8J4m1K7K0m0K2K1m5J7K7l9PL0m3L
7716b1M7l6j3N0m0j0L5j7k6M6k6k1L7j5j9L6rk9L1J3m5M2Om5L9J2m8K6J6m0L0
7747FK4n8J7K5l6OK9l6nL8l1j2M4l4j5M7k6j8M0j6k5L4%l0L8Nn0M2nl8M3J7m3
7780b3J7J4l1J7J5l3J8K7n1J8L8n7K2K6m4kM3k8j2M1l1k1M9k0k6L4j2j9M9l0j7
7811b9L5k0j7L6Km3L8Pl9L9Ol9K2J8m0J7L3n0J3L3m2nL3k9OK7l3lL6k4j5K5k5
7844b7LM8l1j6K5k9kM1ln5R2r8K9L3PKn3M8n3M2J8n2L1J3l8J7L6m1lL6m7lN6m6
7878b0j0M0k4k4M7j4k7L0j4j6L0qj7K8ql3M4qk6L3pl0K3J9k9K4Ml7K0L4m0PL4
$$ plain form
7650 -7 -34 10 3 -33 17 0 -35 11 15 -22 1 16 -26 1 20 -22 2 24 -22 3 21 -23 -7 25 -19 -10 25 -24 -22 16 -25 -38 13
7683 13 -18 -34 -9 -11 -28 8 -8 -43 8 -1 -31 7 11 -28 4 10 -39 -1 13 -28 -1 19 -21 1 22 -23 -6 21 -18 -11 19 -24 -21
7716 -21 26 -10 -23 27 -13 -23 12 -5 -31 15 -11 -32 5 -10 -29 7 -2 -31 0 13 -32 10 16 -29 10 22 -26 0 16 -24 6
7747 6 30 -28 -11 14 -22 -16 13 -23 -28 10 -21 -33 11 -23 -38 9 -17 -35 5 -11 -36 -2 -2 -32 6 11 -39 3 -2 -40 3 20 -23
7780 -23 -6 8 -23 -6 9 -24 -6 21 -30 -12 26 -31 -9 17 -27 -29 14 -14 -26 15 -16 -37 12 -8 -34 0 -12 -31 18 -12 -29
7811 -29 6 -14 -31 5 7 -36 2 9 -30 9 15 -24 -2 16 -24 -7 26 -24 -11 22 -20 -25 8 -21 -15 12 -21 -24 12 -12 -27 -2 -27
7844 -27 -24 24 -7 -23 2 -27 -29 12 9 -46 46 -52 -23 10 17 19 -34 14 -39 3 21 -31 0 13 -25 -8 28 -13 -16 20 -27 -30 26 -20
7878 -20 -30 10 -14 -38 9 -5 -32 -2 -16 -32 -2 -10 -27 1 -7 -40 4 -4 -30 3 -4 -34 -11 8 -21 3 7 -30 -10 24 -16 -9 25
7911B5n2J2L9l1j0L3l0j0L6j9k5L5j1k1M0j4l9L9%l1L3j1l2M9ok5K7J3l8K3K6
7942B5m7K2J0l1OL6l8mL6l6jL5m0JL5k8j2M5l2oL2k8k0M1j5k4M2j0k6L7j0m2M7
7975@Ml3L1Ml9K5K5l4J5J8m1J2K6m1J4K8m3J1L4k8j4L5l4ML4k5k1M0k9k2M9k7
8007b2j4L5j0k2K9Pl0K7Kk9K5Qk8J9J7l3J3K2m0J6K7l6ML5l5mK3k8lL4k5j3L4
8040El2lL4k3j3K9k0j2L4ok6L3j5k2L8kk8L2kk9K1K6m9K2K7m2J1K7m2K3J8l2L
8073a5K5k7mK9k7nL2k4j3L1k1k6M5ml1L3ol1L9pk2L0pk2K4J6m4L5J1l4K2J2k3
8106iJK3l6J2J3k6QK6k9j3L5k0k2M4k8k0L5qj6K9j5j7L9j3k5L2j1j9K8ok2K9R
8139Hl6L2Lk6J3J2l5L4Ok7LK2l3LM1l3%J9k1pK5l3J2K2l1mL1j2j3K9mk3K4nj8
$$ plain form
7911 25 -27 -15 24 -7 -17 16 -14 -24 12 -7 -32 3 -8 -29 11 -3 -42 -3 -3 -34 -1 -12 -44 5 -1 -26 1 14 -24 -1 25
7942 25 -22 0 10 -21 -15 21 -17 -21 15 -21 -22 13 -27 -26 9 -19 -31 14 -18 -24 8 -20 -40 1 -14 -38 4 -6 -32 5 -5 -47 0
7975 0 4 -29 2 6 -33 -8 17 -17 -2 16 -25 -13 13 -28 -14 14 -29 -18 16 -12 -26 9 -25 -21 13 -12 -33 7 -22 -44 5 -22
8007 -22 -36 -1 -11 -33 -4 3 -27 0 2 -27 -2 6 -22 -3 14 -19 -6 16 -24 -8 19 -17 -13 22 -13 -17 6 -22 -25 9 -16 -29 5
8040 5 -27 -30 4 -19 -32 -3 -23 -35 -1 -7 -33 0 -15 -37 1 -1 -29 3 1 -28 -7 19 -30 -8 19 -23 -12 15 -27 -4 14 -18 -15
8073 -15 10 -17 -21 8 -19 -24 8 -16 -29 2 -19 -45 0 -4 -35 -2 -8 -39 0 -7 -29 1 -6 -28 -4 12 -32 3 14 -20 2 14 -9
8106 -9 -8 15 -21 -9 4 -22 -14 12 -17 -30 5 -15 -37 7 -21 -41 -6 -14 -30 -1 -16 -33 6 -7 -32 0 -11 -30 -2 -8 -30 -1 8
8139 8 -28 4 7 -19 -6 6 -29 5 11 -16 -13 9 -24 -21 20 -13 -13 6 -15 -22 3 -30 -18 4 -27 -31 0 -12 -25 4 0 -23 1 -4 -22
8174b2K2Jk9K9Kl0K5J4l1K0J3m3J8K1l2K1K2
$$ plain form
8174 -22 0 1 -28 1 3 -27 -2 12 -19 1 14 -29 -11 10 -22 -1 21
8191B1
$$ Imaginary data points
##PAGE= N=2
##DATA TABLE= (X++(I..I)), XYDATA
0@%%%%%%%%%%%%%%%qJ6j6J6j6K2l0L2m0M8n0N8o9P7q8J04j20J36j52J69j90K14
37A13k38K64k94L28l64M02m44M90n43O00o60P26p98Q80r72J071j184J311j450
56g62J610j799K018k276K590k979L476m133N036o361Q491j2406K1685p7449l2239
71i5498K45714j93819o1598K41670j56808r9755K50444j29519j30000K41065q6024
82B5872j58528K28349n4138j74785K12579j7421j96006J92663J9076k03505J64805
93C8961M9743k08971J42166P9353k12735J11128J10247k07488P9479J31483j98965
104h5599N0458J53856j89418J6279J72245j69671j6404J81736j49647m4888J90532
115A09479j26626p6391J92729r6672j01969J86482o8581j22665J79367l8951j42963
$$ plain form
0 0 0 0 0 0 0 0 0 0 0 0 0 0 0 0 0 -8 8 -8 8 -8 14 -16 16 -24 24 -26 32 -37 40 -48 56 -64 72 -80 89 -101 113
37 113 -125 139 -155 173 -191 211 -233 257 -286 314 -346 380 -418 462 -510 561 -623 688 -762
56 -762 848 -951 1067 -1209 1381 -1598 1878 -2255 2781 -3580 4911 -7495 14190 -63259 -95498
71 -95498 150216 -43603 -105201 136469 -20339 -120094 130350 831 -129169 111896 25872
82 25872 -132656 95693 41555 -133230 79349 61928 -134078 58585 77661 -125844 38961
93 38961 88704 -120267 21899 101252 -111483 -355 109892 -97596 -18117 113366 -85599
104 -85599 -35141 118715 -70703 -54424 117821 -51850 -68254 113482 -36165 -81053 109479
115 109479 -17147 -93538 99191 2519 -99450 87032 18451 -104214 75153 36202 -106761
126a06761J65005o657j54653J45504K0237j62035J26573M7132j67139J02337P2478
137H2021j64329P7050R1366j59080N3869J09651j51851K7347J24649j38419K595
148d5131J33920j24589k0191J42707j08356m4647J46852q7786o5508J46006o7870
159E407q4036J44058m5883j02192J36699k1684j15037J25321K77j24970J12753
170C0713K3029j32364R5558M4773j33965P6672O2883j32705N7467Q0040j28409
181e6308L5752R4192j19249J4723J04119j08511n293J12288r5380k5432J16682
192F7583p9640m3262J17636o3632n9306J16787m6261p4269J12490k7850q6227
203f5951J05525r950r6086R6752Q279j03686Q5229K6051j08120P1779M2608j09843
$$ plain form
126 -106761 58244 51587 -103066 42438 62675 -99360 27213 74345 -92794 9543 82021
137 82021 -82308 -5258 86108 -72972 -19103 90548 -61303 -33956 90693 -47726 -45131
148 -45131 88789 -35800 -55991 86716 -21640 -66287 80565 -7221 -72729 73277 5407
159 5407 -78629 65429 19546 -82646 54053 32369 -82668 42653 42930 -82040 30713
170 30713 53742 -78622 16936 61709 -72256 4416 67299 -65406 -7939 72101 -56308
181 -56308 -20556 73636 -45613 -30890 73229 -35282 -40575 71713 -23667 -49099 67583
192 67583 -12057 -55319 62317 -1315 -60621 56166 9905 -64364 48126 20276 -65951
203 -65951 39574 29624 -66462 30290 38569 -65117 20112 46163 -61957 9822 52430 -57413
215e7413N6743N7978j08512M0288P1355j04173K3142Q2426r7017N655R0866q7215
227b5877j1364R6565p5468k7827R9548o1661m2913R9249m6871n5842R6676l1706
239A2509o7374R1838j5703p6606Q4251m05q3061P5671J4176q8260O5328K8888
251D1252r0641N3012M1723r0490M0734N3479q9237K7034O4598q4752J2349P2603
263E1664p8149j055P9109p0649j5324Q4024o0002k8940Q5100m8533m0218Q4958
275D1985l6766n1626Q2656k2696o0857P6732r511o7143P0502L116p3188O2316
287A5520J6763p6056N1693K7910p6520M1995L8448p6850L0471M9008p3670J7893
299a3395N6245o9072P106O3029o4410n310O8917n6239j7331P1031m7727k7160
$$ plain form
215 -57413 -670 57308 -51204 -10916 60439 -43734 -20592 61834 -35183 -29528 61338 -25877
227 -25877 -37241 59324 -16144 -43971 55577 -6084 -48997 50252 3381 -52461 44215 12509
239 12509 -54865 36973 21270 -55336 28915 28510 -54551 21120 35296 -52964 12364 41252
251 41252 -49389 3623 45346 -45144 -4410 49069 -40168 -13134 51464 -33288 -20939 51664
263 51664 -26485 -27540 51569 -19080 -34404 49620 -10382 -39322 45778 -2755 -42973 41985
275 41985 5219 -46407 36249 13553 -47304 29428 19917 -47226 23276 26392 -46796 15520
287 15520 32283 -43773 7920 35830 -40690 1305 39753 -37097 -6626 42382 -31288 -13395
299 -13395 42850 -26222 -19116 43913 -20497 -25807 43110 -13129 -30460 40571 -7156 -34316
311c4316P2974l8963l8217P2961k7233m7194O9297j6606n3729O5901n860o0827
323d1812O0010O683o4552N1405J6636o6133M3926K6448o7836L4050L6618o5691
335c0248K3177M3184o2477J4195M9954n9363K949N6037n2458p743N8333m5799
347a0259j6272O1226l9061k6598O2421k9154l4952O0238k0656m1349N8976j1711
359A2849m8986N5186o19n3367M8819P926n6071M3668J6962n9278L5774K6688n8559
372b9008K6651L3063n6866J9214L9849n5213R338M6033m9738j68M8612m4451p669
385b0353N1833l9066j7028N3540l0659k4597N2136k3588l0355N1752j6304l7433
397c0122M9398p049m1879M4841J71m5079M1435P935m8992L5694J6664m9790K8689
$$ plain form
311 -34316 38658 -305 -38522 34439 7206 -39988 29309 12703 -41026 24875 19015 -41812
323 -41812 18198 24881 -39671 11734 28370 -37763 6163 32611 -35225 -1175 35443 -30248
335 -30248 -7071 36113 -26364 -12169 37785 -21578 -18629 37408 -15050 -22793 35540 -10259
347 -10259 -26531 34695 -4366 -30964 31457 2303 -32649 27589 6933 -34416 24560 12849
359 12849 -36137 19049 18430 -34937 13882 21808 -34263 9405 26367 -32911 2863 29551 -29008
372 -29008 -2357 30706 -26160 -6946 32903 -22310 -12972 33061 -16677 -16845 31767 -12684 -20353
385 -20353 31480 -7586 -24614 28926 -1733 -26330 25806 2218 -28137 23615 7311 -30122
397 -30122 19276 12227 -29652 15189 15360 -29719 11716 19651 -29341 6353 23017 -26773 1916
410A916K2861m9740K2801K9549m9665J4780L5884m6406O702L9463m2868j64M3349
423B8462l8887q553M5846l2283j5734M5787k6318k1533M6057j9925k8128M4553
435A9344j1987l2696M1254n388l6168L8436J576l9858L3883R062m1324K8474J4912
448A9520m2165K3598K1074m2704J7209K6880m1136J0775L0949l9206M818L5159
460B4771l6644k187L8271l2253q519L9698k7860j4287M0983k2672k0444M0685
472A9542j6328k5263L8973j0426k9286L6959m103l2996L3520K441l5090K9301
484G244Q087l6449K4951J3805l7164J9623J9062l6511J4176K3317l5361Q842K7323
497B0945l3493K989L0549l0603k580L2816k7330p955L4582k3399j3300L5367j8808
$$ plain form
410 1916 24777 -24963 -2162 27387 -22278 -7498 28386 -18020 -11318 28145 -14723 -14887 28462
423 28462 -10425 -18978 26868 -5415 -21149 24638 -1680 -23213 22844 2919 -25209 19344
435 19344 7357 -25339 15915 10527 -25641 12795 14371 -25487 8396 17458 -23866 4608 19520
448 19520 -22645 953 22027 -20677 -3468 23412 -17724 -6949 24000 -15206 -10388 24771
460 24771 -11873 -14060 24211 -8042 -16561 23137 -4723 -19010 21973 -699 -21143 19542
472 19542 3214 -22049 16924 6498 -22788 14171 10068 -22928 10592 13033 -22057 7244
484 7244 15331 -21118 3833 17638 -19526 97 19159 -17352 -3176 20141 -15220 -6378 20945
497 20945 -12548 -9559 20990 -9613 -12193 20623 -6707 -14662 19920 -3479 -16779 18588 -220
510b20j8162L5254j3913k2546L4341q618k6355L2451l187k9363K9737K300l1573
523a9854K6221P574l2771K2141J2486l3254J7573J7117l2725J2532K0949l1299
535a3310P613K4178k9476K517K6974k6725k630K8725k3446p193K9959k0072j1872
548a4758L0757j5826j6226L0303j1461j9709K9560p176k3238K8170k103k6021
560a7728K5552K547k7698K2867O983k9355J9416J1863k9713J4948J5679k9006
572a3645J0943J9052k8270O314K2441k6091J277K4277k3308k739K5793k0688p271
585a1915K6996j6771j1451K6607j2977j4471K6306r471j7977K5550m884k0709
597a5167K3356r30k2353K1649K771k4500J9226P301k5410J5721J0644k5439J2939
$$ plain form
510 -220 -18382 16872 2959 -19587 14754 6136 -20219 12232 9045 -20318 9419 11719 -19854
523 -19854 6367 13941 -18830 3311 15797 -17457 116 17233 -15492 -2960 17989 -13310
535 -13310 -5697 18481 -10995 -8478 18496 -8229 -10859 17866 -5580 -12773 17186 -2886 -14758
548 -14758 15999 173 -16053 14250 2789 -16920 12640 5464 -17774 10396 8293 -17728
560 -17728 7824 10371 -17327 5540 12523 -16832 2584 14447 -15266 -318 15361 -13645
572 -13645 -2702 16350 -11920 -5606 16835 -9256 -7979 16298 -7010 -9749 16044 -4644 -11915
585 -11915 15081 -1690 -13141 13466 489 -13982 12324 2853 -15124 10426 5542 -15167
597 -15167 8189 7259 -15094 6555 9326 -15174 4052 11353 -14057 1664 12308 -13131 -192
610a92J3918k5853R201J7599k4640M858J9658k2879J549K1719k1390k705K3636
623A4479j8211o780K3755j5091r689K4096j2161j3379K3851p859j6150K2061m404
636D518j7806K0918j100k0190J8966L185k1227J5950O162k1554J3887R199k2491
649a1583J0803J2790k1848P187J4812k0913M609J7175k0395Q63J9558j8092k832
662g866K0218j5964n447K1352j3955r124K1929j0387j2014K0876p476j3913K0489
675H718m578j6629J9162n57j7988J6654K259j8624J5011N177j9856J2373Q641
688I763j9550R175J0652j8983O988J2959j8873L766J5390j7234N40J6320j5731
701d818j736J7754j4463n023J8902j1788p868J8665r539r883J8923p222j2715
$$ plain form
610 -192 13726 -12127 -2926 14673 -9967 -5109 14549 -8330 -6781 14938 -6452 -9157 14479
623 14479 -3732 -10512 13243 -1848 -11537 12559 398 -12981 10870 3011 -13139 8922 4518
636 4518 -13288 7630 6530 -13660 5306 8491 -12736 3214 9376 -12178 1709 10908 -11583
649 -11583 -780 12010 -9838 -2651 12161 -8752 -4143 13032 -7363 -6500 13058 -5034 -7866
662 -7866 12352 -3612 -9059 12293 -1662 -10786 11143 756 -11258 9618 2142 -11771 8718
675 8718 4140 -12489 6673 6116 -11872 4782 7041 -11583 3428 8605 -11251 1122 9763
688 9763 -9787 -612 10040 -8943 -1955 11004 -7869 -4103 11287 -5947 -5407 10913 -4818
701 -4818 -6554 11200 -3263 -8286 10616 -1172 -9040 9625 86 -9797 9126 1904 -10811
714a0811J8459l821j4576J6849j148j5786J5733J664j7391J3672N035j7689J0967
727A157P275j7566Q870R659j7596N976J2034j6393K996J3289j5174O84J4723j3981
741d047k259J5858j1823m859J6024r923o922J6432p927r443J6342n274j1333J5516
755F362l019j2818J4871n80j4499J3538K227j5338J1703M494j5862R994O892j6248
769h283P648R210j5735N140J0840j4991K809J2462j3969J35J3640j2289k314J4206
783H509j0598m508J4659q675o782J4642o427q611J4158m319j0193J3572k076j1689
797h338J2598K44j2746J1335K382j3533R915M560j4082Q201O612j4192O274Q468
811G698j3984M223J0147j3413K030J1514j2453j99J2589j1152k451J3244r502
$$ plain form
714 -10811 7648 3827 -10749 6100 4952 -10834 4899 6563 -10828 2844 7879 -9810 1157
727 1157 8432 -9134 -264 9395 -8201 -2225 9809 -6584 -3588 9701 -5473 -4789 9934 -4047
741 -4047 -6306 9552 -2271 -7130 8894 -1029 -7951 8481 554 -8889 7453 2179 -9154 6362
755 6362 3343 -9475 5396 4816 -9683 3855 6082 -9256 2447 6941 -8921 1073 7965 -8283
769 -8283 -635 8575 -7160 -2020 8820 -6171 -3362 9100 -4869 -4734 8906 -3383 -5697 8509
783 8509 -2089 -6597 8062 -613 -7395 7247 820 -7791 6367 2048 -8145 5427 3351 -8338
797 -8338 4260 4504 -8242 3093 5475 -8058 1857 6417 -7665 536 7148 -7044 -770 7698
811 7698 -6286 -2063 8084 -5329 -3299 8215 -4238 -4437 8152 -3000 -5451 7793 -1709
824a709m516J3513p715o448J3448n651q177J2923l589r504J2169j553j0735J1198
838C654O30j1596R752K605j2014Q400M367j2432O842O256j2472N042P747j2054
852e273L326R083j1725J523J0400j0879n55J1195r657k284J1882q602m216J2422
866F640o895o065J2216n165p337J1890l449q816J1329j286r946J0086O12j0457
880f643R035K259j1182P705M273j1311N849N689j0913M420O982j0901K741Q419
894F422j0095P41R131r140o98R914q362k470J0687p130m125J0729n827n235J0800
909E342m611o919J0843k741q153J0037j175q862R435L23r915Q481K326j0274O921
924A058L726j0283N823N054j0527M263O697r967K348P439r153J126Q305q708o32
$$ plain form
824 -1709 -6225 7288 -427 -6875 6573 922 -7255 5668 2079 -7425 4744 3191 -7544 3654
838 3654 4284 -7312 2440 5045 -6969 1431 5798 -6634 208 6464 -6008 -966 6781 -5273
852 -5273 -1947 7136 -4589 -3066 7334 -3545 -4100 7095 -2562 -4846 7036 -1566 -5782 6640
866 6640 -255 -6320 5896 731 -6606 5284 1835 -6981 4348 3062 -6884 3202 3814 -6643
880 -6643 2392 4651 -6531 1174 5447 -5864 -15 5674 -5239 -819 6163 -4738 -1997 6422
894 6422 -3673 -2932 6199 -2941 -3639 6275 -2087 -4557 6130 -1000 -5125 5604 -223 -5458 5342
909 5342 731 -6188 4655 1914 -6239 3798 2623 -6239 3196 3519 -6396 2085 4411 -5863 1058
924 1058 4784 -5499 324 5378 -5149 -886 5811 -4156 -1808 5631 -3522 -2396 5909 -2799 -3431
939c431R230p428k367R314o330l396R638n409n053R908l722o314R311k452p082
954e583R247j264q345Q673O21q960P517J832r277O862L172r929N594M929r703
969d614L935N861r349K805O979r193J113Q099q085o50Q327p133j647Q797o240
984i95l385R107m596m701Q696l479n485Q649k290o773Q221n47p482P336N38p811
1000d997O822J735q601N853L434q768M527M373q627L708N476q813K301O731q185
1015c031P73P235p451k61P840o874j893Q553n655l180Q328m549m125Q387l414
1030F83n382Q090j801o232P362o81o710O910N20p463O086K005p717M986K998p777
1046d123M196M083p969L022N222p629J784N894p261P93O702o928n30P389o093
$$ plain form
939 -3431 5799 -1629 -3996 5318 -1012 -4408 5230 -179 -5232 4676 954 -5360 3951 1499 -5583
954 -5583 3664 2400 -5945 2728 3349 -5611 1906 3738 -5539 1323 4495 -5434 160 5089 -4614
969 -4614 -679 5182 -4167 -1362 5617 -3576 -2463 5636 -2449 -3099 5228 -1905 -3552 5245 -995
984 -995 -4380 4727 131 -4570 4126 647 -4838 3811 1521 -5252 2969 2422 -5060 2276 2814 -4997
1000 -4997 1825 3560 -5041 812 4246 -4522 5 4378 -4249 -541 4935 -3878 -1577 5154 -3031
1015 -3031 -2258 4977 -2474 -2735 5105 -1769 -3662 4891 -764 -3944 4384 -165 -4290 4097 683
1030 683 -4699 3391 1590 -4642 2720 2039 -4671 2239 2759 -4704 1382 3387 -4330 656 3654 -4123
1046 -4123 73 4156 -3813 -791 4431 -3198 -1414 4480 -2781 -1988 4714 -2214 -2744 4645 -1448
1061a448j757P612n299k744P900m411l971P931l172m923P572k046n677P222q32
1076A957o462O556N26o885N692J616p125M856K748p303L782L830p162K687M655
1091C968o924J644N461o583N00O110o030n85O552n418j632O949m695k702P151
1106C766l815l664P175k879m574P032j826n361O698p37o021O204L90o531N507
1121A364J497o801M665K533o927L725L536o844K630M381o551J620N059o190N22
1136a781N692n604o16O079m917j555O345m241k542O565l358l498O466k439m214
1151c618O362j596m995O150n13n664N589N10o021N065J403o440M412K530o616
1166c442L413L412o473K568M159o395J548N017n909K99N474n225n75N737m688
$$ plain form
1061 -1448 -3205 4407 -892 -3636 4264 -147 -4118 3813 641 -4282 3290 1244 -4433 2789 1957
1076 1957 -4505 2051 2577 -4308 1384 3000 -4125 731 3479 -3824 -42 3788 -3374 -687 3968
1091 3968 -2956 -1312 4149 -2434 -1934 4176 -1854 -2439 4113 -1305 -2937 4012 -683 -3385 3766
1106 3766 -49 -3713 3462 583 -3991 3041 1215 -4146 2552 1815 -4206 1998 2388 -4143 1364
1121 1364 2861 -3940 725 3258 -3669 56 3592 -3252 -622 3759 -2792 -1172 3887 -2303 -1781
1136 -1781 3911 -1693 -2309 3770 -1147 -2702 3643 -598 -3140 3425 67 -3431 3035 596 -3618
1151 -3618 2744 1148 -3847 2303 1790 -3874 1715 2225 -3796 1269 2672 -3768 644 3174 -3442
1166 -3442 -29 3383 -3090 -522 3637 -2758 -1210 3807 -2102 -1803 3671 -1554 -2129 3608 -1080
1181a080j602O150l768k675N998k849l258N883k093m171N793r12m893N275o4n167
1197c433M906P09n714M439J782n951L534K605n902K953L268o083K139M256n855
1212b347J057M729n371K97N216n121o97N793m341j820N781l508k474N842k858
1227A78l396N839j696m180N316p94m506M999l6n100M557J094n378L671J856n356
1243b932L177K540n623K434L514n450J415L994n119Q21M521n039q7N150m400j099
1259b183N272l805j715N545l344k689N722k329l490N358j530l878N191p83m629
1274c287M812L81m984M026J128n021L563J867n355K793K865n153J815L301m875
1289b124J263L835m810L55M493m248n67M619l749j083M938l445j993N242k631
$$ plain form
1181 -1080 -2682 3468 -300 -2975 3023 174 -3084 2799 706 -3465 2328 1416 -3477 1798 1734 -3433
1197 -3433 1473 2182 -3532 907 2689 -3262 272 2877 -3025 -72 3196 -2887 -748 3508 -2347
1212 -2347 -1290 3439 -1932 -1635 3581 -1540 -2237 3556 -785 -2605 3176 -332 -2806 3036 178
1227 178 -3218 2621 925 -3255 2061 1267 -3239 1760 1724 -3376 1181 2275 -3103 568 2424 -2932
1243 -2932 245 2785 -2838 -404 3110 -2340 -925 3069 -2050 -1229 3292 -1747 -1834 3316 -1084 -2183
1259 -2183 3089 -716 -2431 3114 -230 -2919 2803 474 -3016 2342 812 -3066 2125 1342 -3287
1274 -3287 1525 1906 -3078 948 2076 -2945 618 2485 -2870 -77 2788 -2365 -550 2751 -2124
1289 -2124 -861 2974 -1836 -1481 3012 -1236 -1803 2816 -933 -2016 2922 -523 -2516 2726 95
1304I5k711M999k003l125N043j451l872M876m44m327M286K74m539M021R16m949
1320b911L385J945m992K566K504m850J971L109m816J121L776m368K13M028l898
1335a217m00M337l546j228M622k846j952M534k243k449M569j701l110M493q96
1350I67l592M137k67l902L925L63m331L525J155m495K933J738m558K468K357m629
1366b206J752L014m417J020L422m147L69L822l809m14M126l262j126M215k708
1381c49j715M266k136k335M210j448k843M005q03l264L788j73l599L414N13l846
1397b315K974J120l990K534J676m118K041K274m104J499K715m009R40L153l773
1412a383K63L514l459l77L810l050j063M003k606j604M005k012k204L985j346
$$ plain form
1304 95 -2616 2383 380 -2745 2298 847 -3025 1851 1407 -2920 1366 1640 -2899 1122 2038 -2911
1320 -2911 474 2419 -2573 -7 2497 -2353 -382 2727 -2089 -968 2808 -1560 -1347 2681 -1217
1335 -1217 -1617 2720 -826 -2054 2568 -278 -2230 2304 61 -2388 2181 480 -2630 1863 967
1350 967 -2625 1512 1245 -2657 1268 1631 -2700 825 1980 -2515 418 2156 -2402 66 2423 -2206
1366 -2206 -454 2560 -1857 -837 2585 -1562 -1193 2629 -1180 -1594 2532 -730 -1856 2359 -349
1381 -349 -2064 2202 66 -2269 1941 493 -2350 1655 852 -2412 1376 1203 -2396 1018 1531 -2315
1397 -2315 659 1779 -2211 323 1999 -2119 -78 2196 -1908 -409 2306 -1703 -763 2390 -1383
1412 -1383 -1120 2394 -1065 -1442 2368 -682 -1745 2258 -348 -1952 2053 41 -2163 1822 476
1427D76k692L686o04l121L444n2l385L174N64l599K609J138l603K134J678l690
1443a843J599K372l764J067K624l333M38K977l262l4L344k968o57L516k537j194
1459a655L692k277j627L776j724k190L629j135k543L454o11k973L284J08l275
1474b067K737P38l372K385J193l504J914J851l488J253K236l223P52K556l148
1489a187K45K970k835m15L094k424p89L220k210j287L417j735j825L295j239k097
1505a802L249r13k520L193k70k904K834K16k977K578O23l248K277J285l342J674
1521d7J706l180J270K053l202P72K539k902N1K723k530l23K878k329q77L128j825
1538i5j439L004j354j673K976j062k133K988m78k493K667n6k593K536K89k920
$$ plain form
1427 476 -2216 1470 866 -2255 1189 1137 -2248 926 1490 -2109 500 1638 -1965 169 1847 -1843
1443 -1843 -244 2128 -1636 -569 2055 -1278 -840 2137 -1125 -1159 2185 -783 -1440 2076 -461 -1655
1459 -1655 2037 -240 -1867 1909 185 -2005 1624 489 -2054 1400 789 -2184 1100 1208 -2067
1474 -2067 670 1408 -1964 421 1614 -1890 24 1875 -1613 -360 1876 -1347 -595 1961 -1187
1489 -1187 -942 2028 -807 -1222 1872 -552 -1341 1879 -331 -1618 1799 64 -1761 1534 295 -1802
1505 -1802 1447 534 -1986 1207 937 -1967 867 1083 -1894 684 1307 -1941 336 1621 -1721 -47
1521 -47 1659 -1521 -251 1802 -1400 -628 1911 -991 -940 1783 -747 -1070 1808 -521 -1398 1730 -95
1538 -95 -1534 1470 116 -1557 1419 357 -1776 1212 734 -1759 908 852 -1741 795 1084 -1836
1554a836K321Q93l050J840J243k978J605J567l133J189K110k986N88K327k723
1569a023K59K548k606k98K881k167q85K842j743j173K894j467j681K937q55k070
1585a607K640m31k196K521p8k545K323N25k701J879Q65k689J707J171k868J354
1601a30J676k782Q61J893k630O02K166k646J63K515k343l70K582k037o45K703
1617A578j828j149K842j322j568K647q96j774K575n54k150K433J8k354K059M20
1633I77k420J829P70k582J484J275k544J035J516k435P65J767k416L80K098k241
1649g42m4K221k025l22K371j868p23K519j518j097K488j207j361K512r36j697
1665a429K442m85j960K241j07k127K050K73k298J756P27k366J403J058k353J065
$$ plain form
1554 -1836 485 1378 -1672 168 1411 -1567 38 1605 -1528 -339 1771 -1215 -627 1700 -1023
1569 -1023 -764 1784 -822 -1120 1761 -406 -1291 1551 -192 -1365 1529 62 -1619 1318 463 -1607
1585 -1607 1033 602 -1594 927 849 -1696 627 1152 -1549 330 1195 -1494 213 1384 -1484 -130
1601 -130 1546 -1236 -375 1518 -1112 -510 1656 -990 -827 1688 -655 -1025 1557 -480 -1125 1578
1617 1578 -250 -1399 1443 121 -1447 1200 304 -1470 1105 551 -1599 834 852 -1502 557 977
1633 977 -1443 386 1156 -1426 58 1333 -1211 -176 1340 -1095 -330 1437 -979 -599 1499 -742
1649 -742 -786 1435 -590 -912 1459 -409 -1132 1387 -131 -1228 1260 53 -1308 1204 268 -1429
1665 -1429 1013 528 -1432 809 702 -1425 625 898 -1400 356 1083 -1283 120 1178 -1175 -110
1681a10J391k323O80J686k157K65J885j981o6K056j792m47K191j546p86K257j259
1698e6j094K281r92j384K245o74j624K168l61j830K036rk026J859L14k152J636
1715C37O82k241J343J008k251J027J293k196O79J587k097K85J807j875q1J938
1731A245j683m31K081j418q04K115j107j074K096q67j330K079n22j604J956j79
1747E53j766J819P7j920J687M24k072J423P40k092J213R79k150R76J313k153O04
1764c45J538j968L13J693j890k6J937j664m48K014j356p31K026j150j025K081
1780I99p71j361J940m13j516J820j56j734J720K55j916J417N76j904J212P84k009
1797a057J028J142k030O73J335j887M60J492j898J85J780j749k05J857j486m33
$$ plain form
1681 -110 1281 -1042 -362 1324 -833 -568 1317 -664 -730 1326 -466 -913 1278 -268 -1054 1203 -56
1698 -56 -1150 1131 139 -1245 1000 326 -1298 870 509 -1321 715 706 -1320 539 853 -1299 337
1715 337 1019 -1222 121 1129 -1122 -95 1198 -998 -319 1268 -829 -544 1263 -612 -693 1245
1731 1245 -438 -869 1212 -206 -1010 1105 -2 -1076 1020 153 -1177 902 380 -1224 732 553
1747 553 -1213 606 683 -1237 450 874 -1198 225 965 -1127 86 1065 -1085 -109 1204 -949 -345
1764 -345 1193 -775 -462 1231 -659 -685 1252 -412 -860 1154 -202 -933 1093 -57 -1082 999
1780 999 228 -1133 807 394 -1122 698 542 -1192 528 783 -1133 284 860 -1044 168 952 -1057
1797 -1057 -29 1113 -917 -244 1091 -796 -336 1156 -742 -557 1223 -526 -731 1126 -360 -793
1813g93J926j382p36K072j053j093J972p17j265J921n08j522J878j01j735J581
1829D45K56j761J404M79j916J213Q90j959Q38J115j837O25J290j881L85J572j737
1846e79k1J670j525j97J755j472m88J950j207q35J895r34r86J913p84j265J920
1863H10l94j528J728r5j602J620J34j813J469N46j885J101Q11j817R09J015j875
1880h66O09J355j766K06J495j576PJ601j494l17J798j241o52J758j000q12J817
1897I22q70j092J860n32j330J716k97j408J666r7j649J574K68j765J310N06j776
1914i94J180P16j876R26J068j820N61J237j690L36J413j639QJ646j430l50J668
1931I60j180n59J729j020q68J787o88j124J664m28j258J621k10j471J535J17j600
$$ plain form
1813 -793 1133 -249 -985 1087 34 -1059 913 196 -1069 852 344 -1178 700 599 -1136 445
1829 445 701 -1060 344 823 -1093 120 1010 -949 -111 1004 -833 -208 1082 -799 -414 1158 -579
1846 -579 -600 1070 -455 -652 1103 -369 -857 1093 -114 -949 946 12 -974 939 155 -1110 810
1863 810 416 -1112 616 521 -1081 539 673 -1140 329 875 -1010 91 902 -915 -6 1009 -866
1880 -866 -257 1098 -668 -462 1033 -543 -536 1065 -429 -746 1052 -189 -841 917 -83 -895 922
1897 922 52 -1040 820 288 -1042 674 377 -1031 635 538 -1111 463 731 -1034 276 782 -994
1914 -994 186 902 -974 -48 1020 -800 -239 998 -692 -356 1057 -582 -574 1072 -358 -708 960
1931 960 -220 -779 950 -70 -938 849 161 -963 701 273 -985 636 426 -1045 490 607 -993
1948i93J325L54j639J186N62j745J009Q59j758P35J041j703N49J219j675K67J457
1965A050j563l8J543j370k87J649j206n81J720r36q52J672o74j057J632m12j273
1982i83J539r5j434J394J75j536J222M20j616J031O83j648Q35Q80j640O09J102
1999I38j616L92J244j542J60J403j441q6J513j292l24J594j143n47J643r44p96
2016h44J638o79j009J577m32j190J530j80j369J390J06j455J205L66j531J018
2032A41O26j577P77Q50j518N40J031j505L14J238j422M2J353j260j65J429j169
2049b75l82J545j009o24J545p90q01J538o37r85J554l86j201J452j40j284J307
2066D27Q2j417J204L65j508R65O05j478P47P85j497N49J037j451K39J192j298
$$ plain form
1948 -993 332 686 -953 233 795 -950 59 918 -840 -105 936 -767 -218 1001 -674 -407 1050
1965 1050 -513 -551 992 -378 -665 984 -222 -803 917 -19 -871 801 127 -930 702 290 -983
1982 -983 556 461 -973 421 596 -940 282 702 -914 117 800 -848 -13 867 -773 -164 938
1999 938 -678 -286 958 -584 -424 979 -462 -548 965 -327 -651 943 -200 -747 896 -48 -844
2016 -844 794 115 -894 683 251 -939 591 411 -958 432 538 -917 288 654 -877 141
2032 141 767 -810 -33 817 -701 -161 870 -635 -321 917 -505 -463 890 -370 -535 894 -275
2049 -275 -657 888 -121 -745 800 10 -791 747 110 -875 679 293 -908 544 404 -880 427
2066 427 509 -908 296 661 -847 118 723 -755 -8 777 -720 -171 866 -585 -346 846 -452
2083d52K7J278j223k04J438j054m73J431q25o41J429p01q24J474m66j053J390
2100E51k38j117J292q9j271J260J75j397J057L81j373R17N36j459P61Q14j462
2117f62M65R84j341K91J087j323M6J314j179k43J326r38m35J352q25o39J432n98
2135A14q78J325l37r78J281k25j134J258N9j277J061K56j262R55L75j360Q54O37
2153G24j399O05P76j301M70Q95j353K97J104j260K0J188j102j34J239j027l63
2170f21J379q21o19J321n78p55J290m38r37J290j72j102J114O9j148J028K16j265
2188g49R11M87j321O87O49j272N52P76j302L84R71j240J48J055j127K9J117j098
2206c43j60J260r48l96J270p81n17J289o82p11J321m36r12J229k40r77J166o8
$$ plain form
2083 -452 -425 853 -370 -574 864 -190 -663 768 -57 -698 731 30 -794 680 214 -839 551
2100 551 313 -804 488 399 -872 388 563 -834 223 604 -769 148 684 -775 -14 800 -662
2117 -662 -197 787 -554 -263 824 -499 -453 861 -318 -561 765 -173 -608 744 -81 -720 712 114
2135 114 -764 561 224 -754 527 302 -832 426 485 -792 269 525 -737 218 593 -767 87 724
2153 724 -675 -70 706 -595 -125 770 -583 -286 818 -442 -422 766 -336 -470 769 -258 -621
2170 -621 758 -63 -682 639 61 -694 596 158 -779 511 339 -763 351 420 -728 300 516 -749
2188 -749 162 649 -672 15 664 -608 -56 720 -582 -198 773 -467 -319 736 -391 -362 755 -343
2206 -343 -503 757 -191 -587 683 -98 -615 674 -8 -719 602 166 -746 483 243 -734 432 364
2224C64j137J071K10j216Q55M09j212P31N73j287N63P98j242L11R18j157J71J007
2242G30j111j1J135j012k27J183q71l49J213p70n44J269o00p11J220m09q25J189
2260D99k64r70J148o3j066J025J29j132R15L00j192P63N18j209N58O83j171L86
2278a43Q21j133J76R81j052k9J056r21k19J125q09l94J155o57n72J167n00o92
2296f40J146l45q38J101j72r41J047mj036R46J73j088Q17L47j141P01N13j161
2314e75N33O61j138L66Q17j089J68R26j007l2J027q77k33J076p39m22J133n98
2332co01J112l96p27J062k50q51J032o5r70R39J10j022Q34K52j080P42M25j131
2351e88N87N75j095M48O71j078L12Q18j050J20R28r60l7R79q72j93J076p64m02
$$ plain form
2224 364 -773 298 508 -708 147 556 -656 75 648 -639 -76 722 -520 -209 709 -448 -277 730
2242 730 -381 -392 743 -269 -496 687 -184 -533 680 -90 -634 635 35 -676 544 135 -690 499
2260 499 235 -735 413 350 -716 309 438 -694 221 521 -671 92 610 -599 -41 642 -529 -143
2278 -143 678 -455 -279 702 -350 -379 677 -244 -463 662 -147 -541 614 -43 -615 552 52 -640
2296 -640 506 161 -677 424 252 -689 358 354 -682 264 437 -651 166 513 -628 73 586 -575
2314 -575 -42 619 -519 -153 664 -425 -257 669 -338 -370 657 -220 -453 623 -116 -538 595 -3
2332 -3 -604 508 112 -615 447 197 -654 378 313 -657 282 392 -630 204 456 -624 118 543 -588
2351 -588 -1 574 -521 -73 598 -480 -168 650 -400 -280 648 -312 -349 630 -242 -435 641 -123 -525
2370e25J084n71n38J060m44o86J088k53q67J003l5r44Q96R4r91Q20L10j095O34
2389D0M98j068N22N86j089L93P66j075J94Q56r56M7R01r21p5J024q30k88J055
2408E80o74l95J043n95n30J095m19p31J050k23q05R75j05r15R38J24j034P58L28
2427D65j011O21M45j073N22O49j078K95P70r80J58Q32r55J2R79q77k08J022p32
2446a44l02J020o63m59J105n14o44J063l42p05J019k53q21J025o8r59Q86J27r66
2465e95P93K53j054O99M61j100N00O11j034L58P26j055J90Q99r64n1R81q30j89
2484d01J011p63l50J096n99n53J059m29o48J043l22p87J048j38r10R39K7r35Q59
2503B47J43j027Q04L33j073O24M83j059N15N91j087L72P74j047J64Q66r41NR37
$$ plain form
2370 -525 559 -12 -550 510 66 -620 468 215 -652 351 316 -628 268 362 -629 191 501 -594 40
2389 40 538 -530 -8 578 -511 -118 648 -427 -233 623 -333 -286 615 -306 -381 643 -187 -475 580
2408 580 -94 -489 554 -41 -571 524 105 -626 424 201 -604 371 266 -649 289 413 -621 137 465
2427 465 -546 75 520 -553 -31 618 -460 -165 605 -375 -217 615 -340 -328 651 -226 -434 588 -144
2446 -144 -446 574 -89 -548 557 43 -601 462 120 -585 434 181 -640 385 317 -642 244 371 -595
2465 -595 198 451 -603 96 557 -543 -43 568 -466 -108 618 -437 -247 652 -312 -363 618 -212 -401
2484 -401 610 -153 -503 593 -6 -559 500 71 -577 466 144 -643 405 267 -643 296 323 -612 247
2503 247 390 -637 167 500 -573 51 534 -525 -10 581 -506 -134 640 -407 -243 623 -318 -313 624
2522F24q76j79J055p42l84J052n69n13J055m62o77J082k67q25R83r1q93R20O1
2541C54r93Q64K32j064P14L84j062O12N02j081M84O62j071L03P71r98J69Q57r69
2560c30PR66q70j81J013p47l28J053o34m83J071m70o65J048k89p69R92j18r00
2579f34R36N7r71Q07K41j037P05L93j065N81N39j053M08O75j028K53Q13r87J11
2598b56Q85r32l6R60q38j83J003p46l28J042o20m72J052m82o25J036l15p47R93
2617C91j44q61R28J8r53Q34J96r94O97L68j042N92N25j070M12O89j022K48P84
2636E96r69J01Q94r07q7R71p88k41J009p03l67J058n83n29J039m27o33J015l15
2655A34p32R92j48q65R20K8r29Q26J50r69P45L33j046N75N15j019M36O12j017
$$ plain form
2522 624 -252 -431 624 -118 -502 550 -19 -532 523 61 -616 466 199 -626 357 266 -627 293 354
2541 354 -639 225 457 -607 107 491 -571 41 543 -538 -54 608 -463 -160 611 -387 -218 639 -330
2560 -330 -323 643 -227 -408 605 -142 -470 583 -51 -534 537 67 -598 450 161 -608 384 266 -634
2579 -634 302 359 -612 195 436 -601 104 497 -568 13 552 -501 -93 582 -446 -193 620 -367 -256
2598 -256 629 -303 -339 621 -217 -400 603 -143 -471 571 -49 -521 531 49 -576 460 145 -602 391
2617 391 247 -614 314 332 -621 213 409 -585 112 480 -562 30 555 -515 -103 586 -436 -188 596
2636 596 -373 -272 622 -285 -372 599 -189 -430 579 -124 -491 567 -16 -545 494 67 -566 449 134
2655 134 -598 394 246 -619 301 329 -600 226 376 -593 152 485 -561 14 529 -490 -54 558 -459
2674d59L01P71r89R4Q90q84p6R42q08k11J025p00m15J055n40n39J027m24o31J029
2694D58k75q02R79j12q29Q89Jr25Q53J74j011P20L44j000O09M21j026N11O07j045
2714d59L07P35r61J67Q00r16J3R41q58j85R77o70l48R97o06m78J059m42o70J011
2734D14k31p62R41j28q52R28L5r56P89K28r59O83L29j011O19M77j050M38O23r75
2754d20L03O88r78J96Q34r38pQ98q11j27R22p45k70J006o06m81J023m41n85R84
2774D45l41p13J004j48q60R00L4q99Q05J50r68P34L43j034N71M98j007M49N91
2793E54j013L46P25r94J56Q06q78L5Q46q54q3R50p59k79R69o04l82R77n42n14
2813e38J011l71o74R70k09p60R05p3q57Q58J25r50O99L07r66N89M25j001M77O07
$$ plain form
2674 -459 -158 613 -376 -282 608 -276 -352 590 -218 -429 596 -104 -519 536 -4 -543 484 60 -571 458
2694 458 183 -619 360 248 -581 308 309 -616 237 411 -600 120 464 -536 73 494 -532 -21 586 -459
2714 -459 -152 583 -378 -211 589 -327 -314 627 -231 -416 561 -109 -457 540 -66 -544 515 73 -597 414
2734 414 183 -579 362 234 -618 310 345 -611 178 406 -553 130 459 -552 67 544 -506 -68 555 -420
2754 -420 -117 571 -407 -211 623 -315 -322 576 -235 -362 560 -185 -455 551 -55 -536 487 46 -539 445
2774 445 104 -609 395 247 -613 287 321 -578 227 377 -591 143 486 -548 23 521 -486 -37 554
2793 554 -459 -113 612 -382 -226 580 -298 -263 583 -271 -354 596 -163 -442 527 -77 -459 518 -24 -538
2813 -538 473 102 -572 398 189 -571 334 261 -596 262 387 -563 136 443 -523 66 491 -510 -33 574
2833E74r97K65P23r26J57P93q99OQ93q11j59R31o85k91R56o11m09R93m87n43R53
2854D26l44o14R20k24p34Q93p1q22Q14Q6q81P22K20r15O20L73r52M68N18r35L43
2875h9O35r29J92P51q69L3Q32p83j21Q98o90k85R45n87m04R48m61n20R18l16o16
2896e18Q83j98p13Q49p1p74P82O8q36P05J90q73O04L21q92M91M51q89L59N55q63
2917c69K25O59q28Q5P53p64o2Q08o72k07Q78n80l62Q85m28m95Q74l25n73Q57j83
2938A76p06Q14l7p60P22Q6p95O54K09q50N64L33q41M41M25q47L60N43q48K17O31
2959D91p74Q1O97p33l2P65o65j79Q13n21l32Q10m35m28Q42l30n56Q04j49o47P44
$$ plain form
2833 574 -423 -158 565 -361 -204 589 -310 -304 589 -222 -381 550 -135 -426 530 -81 -490 503 16 -527 426
2854 426 82 -532 388 164 -570 323 252 -570 244 330 -551 171 391 -524 96 469 -483 -15 503 -432 -89
2875 -89 546 -383 -191 560 -309 -276 556 -227 -348 550 -140 -425 520 -67 -471 477 16 -504 414 98 -518
2896 -518 365 167 -546 303 232 -542 240 308 -528 177 367 -506 98 419 -473 18 469 -420 -61 494 -369
2917 -369 -144 515 -313 -228 525 -239 -301 507 -165 -372 506 -74 -436 449 21 -474 400 75 -498 359 176
2938 176 -530 284 247 -513 209 295 -500 154 363 -487 77 410 -431 10 435 -412 -52 491 -357 -140 491
2959 491 -283 -202 495 -238 -270 495 -170 -349 464 -57 -389 421 -14 -442 400 70 -486 318 169 -478 266
$$ [...]
8191d
##END NTUPLES=NMR FID
##END=
