##TITLE=1H_LY-15Dix.5.B
 CD3CN, 8 sc, 
 4.06.2021
##JCAMPDX= 6.0         $$ Bruker NMR JCAMP-DX V2.0
##DATA TYPE= NMR FID
##DATA CLASS= NTUPLES
##ORIGIN= UXNMR, Bruker Analytische Messtechnik GmbH
##OWNER= root
$$ XWIN-NMR		Version 3.5
$$ Fri Jun  4 11:38:24 2021 Russian Standard Time (UT+4h)  she@DPX200
##.OBSERVE FREQUENCY= 200.131506
##.OBSERVE NUCLEUS= ^1H
##.DELAY= (6, 6)
##.ACQUISITION MODE= SIMULTANEOUS
##.ACQUISITION SCHEME= undefined
##.AVERAGES= 8
##.DIGITISER RES= 18
##SPECTROMETER/DATA SYSTEM= spect
##.PULSE SEQUENCE= zg30
##.SOLVENT NAME= CD3CN
##.SHIFT REFERENCE= (INTERNAL, CD3CN, 0, 15.7039)
##AUDIT TRAIL= $$ (NUMBER, WHEN, WHO, WHERE, WHAT)
$$ ##TITLE= Audit trail, XWIN-NMR		Version 3.5
$$ ##JCAMPDX= 5.01
$$ ##ORIGIN= Bruker BioSpin GmbH
$$ ##OWNER= she
$$ F:/spectra/data/she/nmr/H-F/1/audita.txt
$$ ##AUDIT TRAIL=  $$ (NUMBER, WHEN, WHO, WHERE, WHAT)
(   1,<2021-06-04 11:37:15.26 +0400>,<she>,<DPX200>,
      <created by zg, POWCHK disabled, PULCHK disabled
       configuration hash MD5:
       00 E9 B6 7A A2 85 ED C7 34 08 36 98 17 FE 4E 26
       data hash MD5: 16K
       C2 32 FF BC 0B 05 A9 55 87 3A ED D7 AE 64 33 11>)
$$ ##END=
$$ 
$$ hash MD5
$$ C3 05 AC 0A 9F E5 3D 17 A4 C3 3C 87 95 55 44 02
##$RELAX= 
##$RELAX= 
##$RELAX= 
##$RELAX= 
##$RELAX= 
##$RELAX= 
$$ Bruker specific parameters
$$ --------------------------
##$DU= <F:/spectra>
##$EXPNO= 1
##$NAME= <H-F>
##$PROCNO= 1
##$TYPE= <nmr>
##$USER= <she>
##$AMP= (0..31)
100 100 100 100 100 100 100 100 100 100 100 100 100 100 100 100 100 100 
100 100 100 100 100 100 100 100 100 100 100 100 100 100 
##$AQSEQ= 0
##$AQ_mod= 1
##$AUNM= <au_zg>
##$AUTOPOS= <>
##$BF1= 200.13
##$BF2= 200.13
##$BF3= 200.13
##$BF4= 200.13
##$BF5= 200.13
##$BF6= 200.13
##$BF7= 200.13
##$BF8= 200.13
##$BYTORDA= 1
##$CFDGTYP= 0
##$CFRGTYP= 5
##$CHEMSTR= <none>
##$CNST= (0..31)
1 1 145 1 1 1 1 1 1 1 1 1 1 1 1 1 1 1 1 1 1 1 1 1 1 1 1 1 1 1 1 1 
##$CPDPRG= <>
##$CPDPRG1= <>
##$CPDPRG2= <>
##$CPDPRG3= <>
##$CPDPRG4= <mlev>
##$CPDPRG5= <mlev>
##$CPDPRG6= <mlev>
##$CPDPRG7= <mlev>
##$CPDPRG8= <mlev>
##$CPDPRGB= <>
##$CPDPRGT= <>
##$D= (0..31)
0 1.2 0 0 0 0 0 0 0 0.06 0 0.03 0 0 0 0 0.0002 0 0 0 0 0 0 0 0 0 0 0 0 
0 0 0 
##$DATE= 1622792234
##$DBL= (0..7)
120 120 120 120 120 120 120 120 
##$DBP= (0..7)
150 150 150 150 150 150 150 150 
##$DBP07= 0
##$DBPNAM0= <>
##$DBPNAM1= <>
##$DBPNAM2= <>
##$DBPNAM3= <>
##$DBPNAM4= <>
##$DBPNAM5= <>
##$DBPNAM6= <>
##$DBPNAM7= <>
##$DBPOAL= (0..7)
0.5 0.5 0.5 0.5 0.5 0.5 0.5 0.5 
##$DBPOFFS= (0..7)
0 0 0 0 0 0 0 0 
##$DE= 6
##$DECBNUC= <off>
##$DECIM= 32
##$DECNUC= <off>
##$DECSTAT= 4
##$DIGMOD= 1
##$DIGTYP= 9
##$DL= (0..7)
0 120 120 120 120 120 120 120 
##$DP= (0..7)
150 150 150 150 150 150 150 150 
##$DP07= 0
##$DPNAME0= <>
##$DPNAME1= <>
##$DPNAME2= <>
##$DPNAME3= <>
##$DPNAME4= <>
##$DPNAME5= <>
##$DPNAME6= <>
##$DPNAME7= <>
##$DPOAL= (0..7)
0.5 0.5 0.5 0.5 0.5 0.5 0.5 0.5 
##$DPOFFS= (0..7)
0 0 0 0 0 0 0 0 
##$DQDMODE= 0
##$DR= 18
##$DS= 0
##$DSLIST= <SSSSSSSSSSSSSSS>
$$ [...]
##$SUBNAM2= <"">
##$SUBNAM3= <"">
##$SUBNAM4= <"">
##$SUBNAM5= <"">
##$SUBNAM6= <"">
##$SUBNAM7= <"">
##$SUBNAM8= <"">
##$SUBNAM9= <"">
##$SW= 20.0188882624521
##$SWIBOX= (0..15)
0 0 2 0 0 0 0 0 0 0 0 0 0 0 0 0 
##$SW_h= 4006.41025641026
##$TD= 16384
##$TD0= 1
##$TE= 0
##$TE2= 300
##$TE3= 300
##$TEG= 300
##$TL= (0..7)
0 120 120 120 120 120 120 120 
##$TP= (0..7)
150 150 150 150 150 150 150 150 
##$TP07= 0
##$TPNAME0= <>
##$TPNAME1= <>
##$TPNAME2= <>
##$TPNAME3= <>
##$TPNAME4= <>
##$TPNAME5= <>
##$TPNAME6= <>
##$TPNAME7= <>
##$TPOAL= (0..7)
0.5 0.5 0.5 0.5 0.5 0.5 0.5 0.5 
##$TPOFFS= (0..7)
0 0 0 0 0 0 0 0 
##$TUNHIN= 0
##$TUNHOUT= 0
##$TUNXOUT= 0
##$USERA1= <user>
##$USERA2= <user>
##$USERA3= <user>
##$USERA4= <user>
##$USERA5= <user>
##$V9= 5
##$VALIST= <valist>
##$VCLIST= <CCCCCCCCCCCCCCC>
##$VD= 0
##$VDLIST= <DDDDDDDDDDDDDDD>
##$VPLIST= <PPPPPPPPPPPPPPP>
##$VTLIST= <TTTTTTTTTTTTTTT>
##$WBST= 1024
##$WBSW= 4
##$XGAIN= (0..3)
0 0 0 0 
##$XL= 0
##$YL= 0
##$YMAX_a= 78708
##$YMIN_a= -85712
##$ZGOPTNS= <>
##$ZL1= 120
##$ZL2= 120
##$ZL3= 120
##$ZL4= 120
##$ABSF1= 10
##$ABSF2= 0
##$ABSG= 5
##$ABSL= 3
##$ALPHA= 0
##$AQORDER= 0
##$ASSFAC= 0
##$ASSFACI= 0
##$ASSFACX= 0
##$ASSWID= 0
##$AUNMP= <proc_1d>
##$AZFE= 0.1
##$AZFW= 0.1
##$BCFW= 1
##$BC_mod= 2
##$BYTORDP= 1
##$COROFFS= 0
##$CY= 11.3945322036743
##$DATMOD= 1
##$DC= 2
##$DFILT= <>
##$DTYPP= 0
##$F1P= 15.9154993809931
##$F2P= -4.1035820241983
##$FCOR= 0.5
##$FTSIZE= 0
##$FT_mod= 4
##$GAMMA= 1
##$GB= 0.15
##$INTBC= 1
##$INTSCL= 1
##$ISEN= 128
##$LB= 0.24
##$LEV0= 0
##$LPBIN= 0
##$MAXI= 10000
##$MC2= 0
##$MEAN= 0
##$ME_mod= 0
##$MI= 1.114404
##$NCOEF= 0
##$NC_proc= 0
##$NLEV= 6
##$NOISF1= 3.799351
##$NOISF2= 2.8
##$NSP= 1
##$NTH_PI= 0
##$NZP= 0
##$OFFSET= 15.70392
##$PC= 1
##$PHC0= -11200.34
##$PHC1= 10.00099
##$PH_mod= 1
##$PKNL= yes
##$PPARMOD= 0
##$PSCAL= 0
##$PSIGN= 0
##$REVERSE= no
##$SF= 200.130013532006
##$SI= 16384
##$SIGF1= 3
##$SIGF2= 2
##$SINO= 400
##$SIOLD= 16384
##$SREGLST= <1H.CDCl3>
##$SSB= 0
##$STSI= 0
##$STSR= 0
##$SW_p= 3612.71676300578
##$SYMM= 0
##$S_DEV= 0
##$TDeff= 0
##$TDoff= 0
##$TI= <>
##$TILT= no
##$TM1= 0
##$TM2= 0
##$TOPLEV= 0
##$USERP1= <user>
##$USERP2= <user>
##$USERP3= <user>
##$USERP4= <user>
##$USERP5= <user>
##$WDW= 1
##$XDIM= 8192
##$YMAX_p= 0
##$YMIN_p= 0
$$ End of Bruker specific parameters
$$ ---------------------------------
##NTUPLES= NMR FID
##VAR_NAME=  TIME,          FID/REAL,        FID/IMAG
##SYMBOL=    X,             R,               I
##VAR_TYPE=  INDEPENDENT,   DEPENDENT,       DEPENDENT
##VAR_FORM=  AFFN,          ASDF,            ASDF
##VAR_DIM=   8192,          8192,            8192
##UNITS=     SECONDS,       ARBITRARY UNITS, ARBITRARY UNITS
##FACTOR=    0.0002496,     1,               1
##FIRST=     0,             0,               0
##LAST=      2.0444736,     0,               0
##MIN=       0,             -85712,          0
##MAX=       2.0444736,     78708,           0
$$ Real data points
##PAGE= N=1
##DATA TABLE= (X++(R..R)), XYDATA
0 0 0 0 0 0 0 0 0 0 0 0 0 0 0 0 0 0 -8 8 -8 8 -8 12 -16 16 -18 24 -25 32 -34 41 -48 56 -60 69 -81 89 -98 112
38 112 -123 139 -155 171 -190 211 -233 258 -284 313 -346 380 -420 461 -509 563 -620 687 -762
57 -762 847 -947 1063 -1202 1373 -1583 1857 -2223 2745 -3547 4948 -8088 29388 -45405 -78241
72 -78241 72489 43857 -73214 -20174 78708 -11313 -69406 33881 59233 -54140 -38111
83 -38111 62813 13182 -69828 14811 67167 -40303 -62751 59745 48426 -71725 -30860
94 -30860 76102 6569 -74765 15572 66018 -38267 -54043 53504 37760 -61338 -16195 62031
106 62031 -7119 -57184 30244 47409 -49028 -33175 62991 17342 -67420 2442 65739 -21573
118 -21573 -56440 40701 44034 -54864 -27921 63130 10936 -62500 8668 56363 -26460 -44210
130 -44210 41871 28161 -53528 -11203 58370 -5990 -55843 22656 46511 -38512 -34030 49624
142 49624 17666 -57125 -2177 57006 -13972 -51532 27502 39707 -39419 -24991 46989 7862
154 7862 -50931 7564 48193 -22057 -39806 34693 27712 -43515 -12586 48615 -3124 -48849
166 -48849 17997 44612 -29390 -33922 39338 20841 -44539 -4852 46646 -10047 -43350 23821
178 23821 36088 -34050 -24309 41192 10512 -43638 4818 42345 -19262 -37538 30233 27983
190 27983 -38325 -15761 42310 1668 -42535 11780 37816 -24775 -30858 33430 19943 -38978
202 -38978 -7623 39805 -5998 -37336 18382 31160 -28750 -22485 35329 11256 -38324 1061
214 1061 37617 -12784 -32543 24015 25266 -32090 -15453 36713 4412 -36940 7837 34365
226 34365 -18244 -27489 27486 18590 -33344 -7667 35849 -3629 -34302 14820 29498 -24223
238 -24223 -21668 31193 11886 -34834 -1220 34398 -10139 -31247 19662 24578 -27286 -15698
250 -15698 31858 5116 -33598 5056 31046 -15447 -26193 23607 18628 -29305 -9493 31657
262 31657 -733 -30993 10659 27212 -19432 -20926 26098 12876 -29651 -3280 30613 -5957
274 -5957 -27801 15127 22697 -22564 -15432 27857 7286 -29489 2191 28699 -10867 -24513 18790
287 18790 18043 -24947 -10004 28593 1375 -29030 7328 26295 -15396 -20877 21935 13229 -26722
300 -26722 -4962 28279 -3924 -27203 11847 22872 -18699 -16230 23601 7655 -26870 697
312 697 26941 -8805 -24204 15775 18858 -21050 -11463 24417 3005 -25631 5331 24447 -12475
325 -12475 -20463 18280 14382 -21942 -6309 24113 -1906 -23906 9663 21501 -15875 -16588 20473
338 20473 10050 -22642 -1892 23102 -6319 -21646 13378 18000 -18694 -12355 21904 5193
350 5193 -22925 2677 21790 -10430 -19025 16549 14224 -20803 -8194 22396 771 -21905 6814
363 6814 19426 -13788 -15528 18751 10059 -21667 -3664 22005 -3260 -19988 10206 16385 -16056
376 -16056 -11666 19935 6076 -21355 202 20406 -6536 -17227 12749 12882 -17505 -7561 20397
389 20397 1946 -20729 3886 18654 -9552 -14545 14778 9526 -18525 -3992 20059 -1771
401 -1771 -19357 7216 16260 -12249 -11437 16463 5775 -19222 -164 19677 -5352 -17900 10131
414 10131 13792 -14300 -8347 17353 2259 -18833 3517 18237 -8638 -15487 12641 10761 -15648
427 -15648 -4792 17572 -1240 -17776 6675 16138 -11127 -12679 14214 7600 -15986 -1540 16651
440 16651 -4317 -15843 9328 13543 -12980 -9560 15129 4323 -15941 1501 15565 -6941
452 -6941 -13857 11386 10786 -14309 -6590 15494 1237 -15321 4450 14010 -9496 -11543 13247
465 13247 7904 -15464 -3403 15752 -1785 -14593 7013 12296 -11512 -9049 14562 4929 -15747
478 -15747 -323 15196 -4715 -13089 9329 10035 -12995 -6280 15124 2005 -15540 2365 13973
491 13973 -6839 -11172 10734 7600 -13497 -3456 14834 -810 -14376 4981 12221 -8842 -8931
504 -8931 11904 5030 -13773 -819 14178 -3275 -12923 6998 10266 -10304 -6484 12699 2437
517 2437 -13633 1946 13323 -5748 -11331 9120 8119 -11618 -4088 13159 -228 -13347 4385
530 4385 12098 -7982 -9522 10689 5796 -12469 -1544 12998 -2809 -12369 6609 10388 -9722
543 -9722 -7345 11657 3317 -12685 758 12340 -4821 -10910 8159 8326 -10596 -4904 11847
556 11847 864 -12068 3114 11122 -6678 -9105 9470 6207 -11153 -2573 11790 -1207 -11201
569 -11201 4950 9643 -8017 -7054 10323 3920 -11371 -202 11402 -3447 -10254 6770 8132
582 8132 -9321 -5159 10940 1712 -11381 1920 10657 -5407 -8966 8187 6234 -10256 -3042
595 -3042 11103 -576 -10956 3980 9581 -7079 -7406 9233 4355 -10566 -1027 10721 -2450
608 -2450 -9878 5568 8041 -8103 -5471 9731 2384 -10320 1013 9979 -4135 -8564 6936
621 6936 6472 -8813 -3635 9878 593 -9786 2693 8876 -5550 -7013 7953 4649 -9361 -1768
635 -1768 9807 -1310 -9229 4302 7739 -6929 -5591 8768 2864 -9739 -13 9442 -3043
648 -3043 -8336 5691 6235 -7999 -3802 9300 927 -9718 1815 8866 -4559 -7205 6797 4785
662 4785 -8464 -2048 9285 -714 -9005 3385 7789 -5643 -5633 7531 3107 -8582 -266 8955
676 8955 -2273 -8160 4655 6564 -6444 -4146 7781 1465 -8374 1305 8219 -3739 -7131 5724
690 5724 5163 -7184 -2648 7964 -213 -8151 2835 7444 -5132 -6036 6648 3713 -7679 -1100
704 -1100 7856 -1833 -7548 4287 6345 -6310 -4593 7415 2124 -7888 577 7590 -3257 -6661
718 -6661 5512 5175 -6955 -3078 7648 647 -7476 2069 6787 -4403 -5422 6351 3779 -7317
732 -7317 -1599 7582 -713 -6953 3146 5837 -5203 -4242 6710 2378 -7341 -243 7129 -2034 -6231
747 -6231 4163 4723 -6017 -2998 7046 963 -7385 1038 6674 -3201 -5446 5016 3601 -6523
761 -6523 -1676 7186 -419 -7072 2381 6038 -4273 -4406 5821 2412 -6838 -306 7141 -1641 -6527
776 -6527 3490 5200 -4961 -3223 6167 1146 -6694 1011 6637 -2792 -5678 4352 4142 -5456 -2067
791 -2067 6206 -50 -6363 2037 5898 -3647 -4753 4844 2984 -5652 -943 5939 -1231 -5834 3045
806 3045 5056 -4491 -3769 5326 1861 -5812 152 5714 -2248 -5232 3884 4158 -5092 -2643 5640 702
822 702 -5714 1366 5312 -3258 -4440 4731 3209 -5552 -1512 5799 -352 -5405 2335 4674 -3949
837 -3949 -3465 5183 2089 -5659 -359 5599 -1400 -4906 3115 3880 -4466 -2531 5317 1025 -5537 583
853 583 5102 -2227 -4229 3640 2931 -4762 -1533 5255 -42 -5252 1526 4573 -3011 -3507 4151 2051
869 2051 -4968 -575 5172 -990 -4842 2387 3914 -3646 -2606 4555 1082 -5015 508 4976 -1947
884 -1947 -4313 3257 3230 -4173 -1726 4799 190 -4857 1400 4497 -2722 -3552 3809 2315 -4465 -781
900 -781 4754 -743 -4517 2164 3872 -3295 -2808 4067 1433 -4499 10 4423 -1501 -3994 2717 3087
916 3087 -3699 -1959 4203 524 -4398 838 4073 -2198 -3433 3227 2353 -3976 -1116 4253 -292
931 -292 -4157 1644 3613 -2824 -2698 3714 1553 -4165 -186 4262 -1140 -3846 2400 3133 -3322 -1998
947 -1998 3981 747 -4158 626 3972 -1870 -3345 2925 2413 -3667 -1226 4029 -81 -3993 1336
962 1336 3541 -2444 -2800 3238 1704 -3780 -514 3841 -784 -3618 1914 2960 -2901 -2125 3484 979
978 979 -3773 209 3641 -1423 -3204 2446 2432 -3209 -1440 3617 286 -3627 952 3312 -2056 -2623
994 -2623 3000 1787 -3523 -684 3707 -434 -3456 1609 2914 -2556 -2052 3313 1050 -3625 59
1009 59 3540 -1150 -3100 2149 2311 -2985 -1401 3455 333 -3583 664 3257 -1684 -2673 2467 1719
1025 1719 -3130 -745 3372 -314 -3330 1248 2829 -2107 -2096 2749 1107 -3173 -83 3297 -882
1040 -882 -3028 1727 2429 -2402 -1522 2905 503 -3114 573 3083 -1457 -2628 2243 1932 -2744 -944
1056 -944 3028 -124 -3044 1146 2773 -1986 -2199 2557 1333 -2917 -331 2954 -764 -2808 1681
1071 1681 2334 -2411 -1676 2782 751 -2947 219 2765 -1240 -2437 2025 1849 -2579 -1098 2813 202
1087 202 -2761 753 2459 -1643 -1972 2327 1356 -2690 -555 2792 -280 -2526 1182 2119 -1932 -1502
1103 -1502 2504 803 -2726 7 2663 -827 -2295 1612 1706 -2276 -1042 2650 252 -2734 526
1118 526 2457 -1302 -1952 1948 1231 -2464 -477 2664 -322 -2577 1033 2159 -1690 -1521 2199 746
1134 746 -2518 11 2557 -744 -2299 1373 1778 -1866 -1051 2241 274 -2409 496 2340 -1129 -1974
1150 -1974 1669 1401 -2016 -637 2233 -137 -2253 854 2031 -1448 -1588 1878 936 -2119 -166 2190
1166 2190 -607 -2100 1250 1735 -1772 -1228 2051 503 -2188 261 2080 -1021 -1821 1624 1357 -1994
1182 -1994 -723 2146 49 -2084 700 1871 -1359 -1481 1845 952 -2102 -313 2120 -326 -1949
1197 -1949 1019 1582 -1599 -1095 1947 503 -2085 36 2019 -706 -1723 1267 1268 -1796 -767 1943
1213 1943 184 -1958 412 1761 -1046 -1410 1500 857 -1863 -330 1942 -264 -1853 755 1624 -1257
1229 -1257 -1072 1684 479 -1856 16 1858 -623 -1704 1149 1314 -1504 -773 1797 163 -1873 447
1245 447 1747 -946 -1474 1370 1011 -1672 -428 1792 -167 -1748 703 1548 -1195 -1162 1514 624 -1714
1262 -1714 -91 1743 -479 -1607 955 1266 -1332 -883 1581 342 -1669 216 1594 -680 -1345 1185
1278 1185 1015 -1447 -522 1645 0 -1608 573 1461 -965 -1133 1372 687 -1562 -202 1631 -312
1294 -312 -1499 875 1313 -1247 -824 1502 329 -1600 207 1527 -660 -1348 1099 1032 -1330 -500 1474
1311 1474 58 -1505 469 1357 -853 -1041 1265 673 -1416 -261 1564 -210 -1416 683 1183 -1043
1327 -1043 -778 1304 432 -1440 36 1385 -501 -1237 924 978 -1206 -573 1406 163 -1407 303
1343 303 1271 -760 -1046 1099 690 -1340 -317 1402 -151 -1336 577 1105 -992 -798 1243 407 -1402
1360 -1402 -22 1371 -402 -1202 796 901 -1110 -541 1329 152 -1359 230 1281 -632 -1035 944
1376 944 698 -1177 -323 1325 -68 -1285 440 1127 -757 -818 1024 468 -1187 -64 1244 -314 -1174
1393 -1174 637 958 -916 -630 1109 215 -1214 166 1178 -536 -1032 823 755 -1034 -373 1143 -45
1410 -45 -1166 443 1058 -771 -854 1010 545 -1122 -123 1152 -269 -1066 651 898 -916 -626 1081
1427 1081 292 -1123 102 1077 -481 -921 805 721 -1011 -435 1099 102 -1077 275 949 -630 -763
1444 -763 899 504 -1057 -225 1095 -126 -998 469 822 -761 -588 989 310 -1086 -5 1063 -324
1461 -324 -903 630 677 -888 -371 1049 75 -1080 232 987 -531 -783 788 503 -981 -192 1061
1478 1061 -137 -1040 422 857 -680 -603 882 294 -1017 24 1023 -333 -949 581 734 -781 -446
1495 -446 914 117 -969 198 940 -463 -792 696 552 -834 -249 920 -59 -927 374 856 -610
1512 -610 -657 793 403 -880 -78 900 -230 -830 535 697 -739 -478 872 198 -906 117 860 -426
1530 -426 -755 668 548 -834 -315 903 7 -890 298 776 -571 -606 776 380 -890 -109 901 -159
1548 -159 -809 449 682 -662 -475 829 235 -863 52 842 -298 -704 557 532 -721 -295 846 68
1566 68 -849 204 765 -425 -608 628 380 -775 -150 831 -98 -788 342 663 -569 -484 713 229
1584 229 -821 27 812 -282 -741 481 556 -663 -331 758 69 -798 201 750 -418 -616 608 432
1602 432 -725 -174 789 -73 -750 329 668 -508 -479 660 290 -727 -29 738 -223 -678 428 540
1620 540 -604 -348 704 128 -744 99 685 -346 -598 508 408 -653 -220 695 -26 -701 244 603
1638 603 -460 -479 605 268 -692 -58 703 -177 -658 371 543 -553 -348 666 133 -699 106 674 -296
1657 -296 -568 499 420 -617 -203 698 0 -668 223 626 -402 -474 563 305 -644 -91 655 -138 -618
1676 -618 330 516 -503 -359 590 160 -645 20 621 -230 -536 416 408 -553 -240 619 42 -629 161 572
1696 572 -360 -452 513 300 -610 -96 648 -83 -590 301 504 -437 -335 578 170 -615 37 621 -207 -535
1716 -535 389 402 -523 -227 601 40 -623 144 567 -307 -435 450 285 -547 -118 582 -77 -595 239 497
1736 497 -379 -369 489 183 -563 -7 567 -165 -523 321 415 -436 -247 524 74 -537 108 540 -281 -449 414
1757 414 317 -493 -141 537 -36 -519 230 473 -358 -372 472 207 -527 -24 526 -160 -486 313 390 -448 -280
1778 -280 510 115 -525 50 492 -248 -411 378 296 -470 -166 517 17 -491 151 437 -300 -340 417 231 -478
1799 -478 -72 506 -70 -438 228 374 -346 -248 458 116 -504 27 474 -162 -419 311 304 -422 -158 498 44
1820 44 -499 128 441 -256 -354 344 230 -476 -95 450 -142 -471 167 396 -324 -260 415 171 -426 27 408
1841 408 -92 -373 295 283 -377 -217 408 57 -436 110 426 -226 -342 322 243 -388 -101 405 -45 -404 176
1862 176 353 -286 -279 361 158 -396 -13 394 -124 -377 244 296 -343 -209 388 77 -406 67 376 -205 -317
1883 -317 307 241 -378 -106 417 3 -385 155 349 -260 -253 356 166 -380 -37 398 -85 -347 206 297 -294
1904 -294 -196 371 82 -393 17 363 -144 -326 239 235 -336 -133 362 16 -388 80 335 -193 -265 283 165
1925 165 -356 -54 379 -45 -347 167 294 -245 -202 325 99 -352 38 364 -121 -307 243 247 -292 -132 339
1946 339 32 -352 94 334 -196 -265 268 181 -317 -64 343 -45 -334 155 280 -237 -214 298 122 -328 -22
1967 -22 335 -100 -314 189 247 -265 -156 309 65 -320 58 310 -142 -253 232 193 -279 -92 317 -1 -315
1988 -315 91 286 -183 -212 264 134 -296 -22 317 -68 -290 169 253 -225 -170 283 74 -317 23 294 -120
2009 -120 -263 208 189 -264 -111 298 0 -304 83 276 -181 -217 231 146 -278 -52 290 -33 -270 129 241
2030 241 -210 -162 254 96 -265 0 276 -80 -237 180 191 -239 -120 274 52 -257 60 244 -131 -206 200
2051 200 132 -254 -65 270 -31 -257 107 226 -184 -165 233 78 -258 -9 256 -78 -227 160 180 -210 -95
2072 -95 261 37 -258 51 254 -117 -196 197 140 -216 -60 258 -13 -242 89 224 -144 -157 202 102 -223
2093 -223 -13 239 -57 -224 123 195 -175 -116 205 49 -243 24 218 -110 -205 148 150 -198 -86 231 -2 -218
2115 -218 81 211 -141 -160 190 104 -214 -26 228 -45 -193 127 177 -176 -117 208 61 -221 30 213 -88
2136 -88 -175 161 130 -184 -83 216 18 -195 43 180 -123 -149 170 94 -214 -53 203 -33 -204 89 165 -157
2158 -157 -118 181 60 -220 -8 201 -68 -182 124 140 -161 -73 214 20 -199 34 199 -95 -157 152 99 -157
2180 -157 -24 213 -18 -198 86 168 -141 -113 167 60 -191 5 188 -61 -174 111 141 -159 -96 176 13
2201 13 -194 27 184 -89 -167 132 102 -166 -54 186 -27 -196 63 159 -108 -159 159 86 -157 -19 196 -35
2223 -35 -148 122 125 -151 -70 150 88 -136 30 160 -42 -129 95 132 -173 -57 195 -5 -204 64 142 -106 -125
2246 -125 159 78 -176 -12 156 -65 -157 77 113 -126 -91 152 57 -148 17 169 -68 -123 107 117 -91 -45 155
2269 155 17 -173 21 162 -62 -121 110 93 -140 -49 153 -14 -156 56 133 -127 -108 115 34 -150 7 144
2291 144 -52 -132 93 98 -135 -67 139 23 -151 26 138 -77 -112 120 83 -135 -26 139 -6 -141 59 139
2313 139 -97 -91 116 72 -126 -6 146 -27 -130 105 156 -107 -65 127 -8 -115 38 123 -46 -138 67 74 -79
2336 -79 -36 82 28 -101 67 72 -40 -133 110 108 -91 -36 93 -34 -113 86 42 -110 -88 127 55 -96 7 153
2360 153 -39 -90 72 80 -93 -23 140 -4 -126 63 104 -57 -102 89 66 -113 -7 123 -38 -107 64 77 -71
2383 -71 -90 111 37 -112 -37 60 -48 -114 78 73 -99 -48 102 3 -128 21 98 -45 -78 100 42 -101 -44 133 -4
2408 -4 -107 61 121 -63 -73 120 57 -112 13 133 -33 -104 69 74 -69 -40 99 10 -102 4 99 -51 -98 61
2432 61 61 -93 -36 89 -12 -118 17 103 -81 -91 84 13 -115 -14 108 -15 -103 51 74 -70 -43 82 13 -103
2456 -103 24 100 -21 -77 67 74 -84 -36 95 3 -103 38 77 -71 -76 93 48 -91 -7 94 -23 -92 50 72
2480 72 -90 -48 88 28 -100 0 89 -38 -78 59 48 -88 -39 87 8 -85 25 94 -44 -57 80 44 -89 -14
2504 -14 92 0 -84 33 79 -55 -35 84 30 -81 -5 84 -22 -78 46 49 -77 -33 73 2 -88 15 84 -40 -69
2529 -69 49 35 -94 -28 87 -18 -79 33 69 -52 -57 73 34 -78 -9 91 -26 -61 61 66 -62 -43 86 20 -58
2554 -58 15 81 -31 -64 73 46 -67 -27 78 3 -78 28 69 -48 -49 65 37 -73 -11 74 -22 -75 31 63 -65 -44
2580 -44 58 16 -76 19 56 -28 -57 49 44 -64 -17 76 2 -64 27 72 -38 -38 59 31 -53 -5 76 -12 -46 36 54 -51 -26
2609 -26 67 16 -63 11 60 -25 -59 32 37 -54 -16 63 0 -64 20 57 -38 -47 42 29 -58 -18 62 -11 -68 30 54 -43 -30 62 23
2640 23 -61 10 68 -26 -39 49 46 -49 -12 72 15 -50 27 58 -30 -46 45 33 -55 0 53 -13 -58 26 43 -49 -41 52 13 -50 0
2671 0 63 -28 -60 36 33 -55 -19 69 5 -59 12 50 -26 -38 54 28 -42 -2 57 8 -46 23 46 -34 -20 51 28 -48 6 59 -9
2702 -9 -52 36 31 -51 -16 53 6 -64 5 41 -42 -39 37 10 -58 -17 45 -18 -45 15 36 -43 -42 41 9 -48 -2 50 -14 -42 48 38
2734 38 -31 -10 45 7 -53 11 50 -12 -24 41 29 -42 -17 51 -8 -45 18 47 -33 -24 49 11 -47 -8 54 -23 -37 24 28 -43 -31
2765 -31 49 5 -42 4 23 -25 -26 29 18 -32 -9 48 -1 -46 19 49 -27 -16 36 30 -29 4 58 1 -27 27 37 -24 -12 43 22
2796 22 -43 7 31 -19 -29 30 24 -36 -20 35 5 -41 -3 33 -32 -32 36 25 -47 -17 46 -17 -50 19 28 -36 -26 39 19 -35 20 51
2828 51 -12 -19 42 34 -16 -1 52 12 -45 12 46 -11 -25 46 17 -35 -4 50 -11 -38 16 25 -25 -30 21 8 -45 -7 36 -18 -41 23
2860 23 16 -35 -32 25 -8 -41 3 20 -21 -30 33 16 -35 1 40 -3 -34 15 31 -14 -15 39 20 -20 9 38 -8 -29 27 31 -24 -1 34
2893 34 6 -38 1 35 -23 -25 16 22 -35 -3 31 -14 -43 0 26 -37 -25 36 26 -41 0 18 -13 -29 22 33 2 34 31 26 -26 27
2925 27 -7 -26 -32 -13 -21 -25 54 3 4 18 14 24 -3 -56 30 9 -63 -12 59 -2 -57 -11 44 4 29 36 -44 -14 47 -26 -47 -63 -43
2958 -43 45 -6 -27 7 -7 -27 -7 42 11 -52 37 -13 -7 -24 44 -16 -17 8 20 7 11 4 9 -13 -11 9 7 -25 56 41 4 2 36 17
2992 17 -24 -4 26 -31 -42 21 -10 -22 -23 31 -8 -37 18 2 1 -10 29 2 -4 9 42 16 -1 28 -1 -30 -8 62 -4 -44 16 68
3024 68 13 -1 13 8 -56 -28 23 11 -62 11 8 -46 12 -7 -3 -41 -2 16 -27 -35 -11 0 -14 -12 42 10 -42 -23 50 -25 3 63 17
3057 17 -34 7 30 -3 -42 32 13 24 -1 24 -19 -9 43 20 23 0 -18 -3 -49 -18 20 5 -19 -51 66 19 -30 74 12 9
3087 9 -17 27 -30 -27 12 11 -26 -56 18 24 -60 -46 41 -28 3 -36 32 -17 -64 53 7 -52 -47 34 -9 1 16 31 -7 57 35 -71
3119 -71 -32 14 89 47 -36 -20 -14 -77 57 53 4 -27 -20 34 -55 -20 8 15 -31 -48 15 -94 -86 -11 -30 21 -36 39 52 -29 -6 -69
3151 -69 -14 15 8 26 -59 7 -19 -45 -72 -11 49 -67 -35 23 16 46 25 47 10 -31 -14 -53 3 11 59 -15 5 3 11 4 -30 -42 -35
3184 -35 -8 -15 13 -42 -61 17 -9 -71 -71 8 30 -31 4 26 25 -63 18 37 -47 34 -1 -9 5 6 56 -37 6 25 39 4 -46 38 -11
3217 -11 -29 -12 10 7 -6 -5 -18 -36 2 16 -23 -11 -17 7 -25 -33 7 -12 -30 -6 22 -15 -22 13 12 -23 -12 17 -11 -18 2 22 -12 -6
3251 -6 20 1 -24 6 27 3 -10 17 29 -8 -11 38 10 -19 2 24 -5 -16 16 14 -26 -19 18 -8 -27 -6 11 -27 -11 8 3 -28 -4
3284 -4 24 -11 -37 12 2 -28 -11 28 4 -19 16 22 -6 -6 19 15 -21 -1 22 -3 -20 7 28 -9 -11 21 13 -22 3 25 -3 -30 11
3317 11 17 -16 -19 11 -9 -47 -3 16 -14 -24 4 7 -30 -18 17 -2 -21 -3 17 -11 -13 19 14 -19 3 22 -1 -23 18 25 -20 -12 30 9
3351 9 -19 -3 23 -7 -11 27 14 -15 -3 26 -7 -28 12 26 -9 -24 19 8 -28 -5 13 0 -29 11 7 -33 -18 20 -8 -24 -13 17
3383 17 -12 -13 10 -5 -24 -10 22 2 -29 11 22 -11 -18 26 12 -11 8 25 -2 -13 16 21 -16 -10 33 6 -18 0 15 -5 -24 9
3415 9 14 -28 -14 25 -6 -14 -1 11 -10 -29 12 7 -36 -9 13 -12 -24 -3 15 -13 -18 26 5 -27 9 19 -9 -15 23 19 -10 -13 23 3
3449 3 -23 3 32 -17 -12 33 24 -13 -4 21 6 -20 3 13 -10 -13 18 10 -20 -18 13 -15 -27 12 22 -21 -13 16 -5 -18 -1 18 -18 -4
3483 -4 14 16 -19 10 29 -2 -15 10 32 -11 -12 26 19 -12 1 26 4 -7 17 15 -7 -9 12 -1 -23 -4 16 -23 -15 8 7 -19 -13 10 -2
3518 -2 -10 7 14 -9 -13 15 11 -24 -7 25 -2 -8 13 24 -5 10 32 16 -8 9 32 -8 -10 24 16 -9 -3 19 4 -18 4 13 -10 -15 7 12
3554 12 -12 -10 21 -11 -10 -4 8 -29 -15 -6 7 -11 -11 20 -5 -4 9 12 16 16 9 25 -16 8 17 32 -19 18 40 11 7 21 12 13 -18 12 -15
3591 -15 7 28 26 -10 7 -11 -7 28 10 22 -25 -15 -4 -1 -37 5 1 -22 -8 -15 4 -7 -4 -13 -11 -25 -19 -15 -10 -26 46 16 -21 17 28 -20
3627 -20 -10 38 -30 -19 4 15 -23 3 8 4 -21 -19 12 10 -21 24 6 -6 -13 18 11 -29 -36 11 19 -39 15 -19 -45 -47 20 -26 -5 -34 -19
3662 -19 -6 -37 -42 12 2 3 12 29 -12 16 1 1 16 9 18 -43 -31 -19 -10 -25 18 26 24 10 19 9 29 -12 -12 -18 -28 -12 36 -4 -14 11
3698 11 36 -41 0 21 -8 -28 7 -4 -11 -19 3 13 -32 -8 31 -5 -29 26 10 -5 -10 17 -3 -15 -8 23 6 3 10 28 -16 -1 20
3731 20 20 -12 5 17 0 -5 14 20 -5 -2 12 8 -15 5 14 -9 -20 10 -1 -26 -10 17 -5 -27 5 12 -16 -15 4 0 -21 2 23 5 -7
3766 -7 11 17 -18 8 28 12 -7 19 23 2 -6 24 7 -5 -1 28 4 -7 11 16 -26 -18 12 -3 -17 -4 27 8 -12 -13 -1 -19 2 34
3800 34 1 -44 11 27 -1 12 23 33 -41 8 9 8 19 0 -20 -6 -17 -17 -17 -57 115 -35 65 32 3 32 60 -16 20 53 -8
3831 -8 -35 55 13 -77 9 -3 -9 -24 16 1 -10 0 10 -21 -12 8 -12 -23 -1 5 -5 -12 1 11 -12 -13 15 1 -12 3 25 -9 3
3864 3 9 12 -2 -6 21 6 -12 7 33 3 -10 17 11 -21 5 16 0 -17 5 8 -20 -10 12 7 -20 -3 -8 -10 -12 3 7 -24 -6 -1 0 -7 10
3901 10 9 5 -16 15 4 -9 1 19 -2 -6 17 14 2 2 28 16 -9 15 25 -2 -16 3 14 -14 -5 19 -5 -12 -5 17 -11 -6 7 11 -15
3936 -15 -12 11 -3 -31 0 5 -19 -17 8 -3 -14 -4 10 -10 -14 8 13 -8 -7 11 5 -10 1 14 3 -7 16 30 -13 -7 16 14 -4 -3 13
3971 13 -12 -8 13 6 -13 2 15 -4 -6 11 10 -14 3 8 -3 -21 3 15 -5 -24 4 -8 -24 -6 11 -10 -8 0 4 -4 -12 13 13 -4 -6 18
4007 18 3 -12 14 13 -6 -9 7 13 -12 7 14 -5 -7 2 8 -2 -2 8 1 -16 1 3 -14 -17 1 7 -24 -9 1 -9 -20 -2 8 -6 -11 10 0
4044 0 -20 -2 18 10 -10 6 8 -3 -9 12 4 -1 4 21 8 -3 16 16 -7 10 31 -9 -5 12 20 -12 -5 6 9 -19 1 -12 -16 -12 24 17 -27 -8
4082 -8 6 -32 -30 -2 -10 -13 4 23 -16 5 -10 18 24 -42 30 14 -11 7 -18 23 9 9 -22 21 37 24 12 1 -4 -12 -85 -33 -5 -13 19
4117 19 -3 21 -2 -13 -5 12 -9 -13 5 8 -17 -15 11 11 -8 -5 9 -14 -17 -9 11 -9 -15 6 5 -7 0 4 -8 -9 9 4 -3 1 14 4 -10 -7 10
4156 10 -3 -16 8 8 -15 2 4 -16 -10 -3 2 -20 -8 10 1 -19 -15 8 -14 -17 2 2 -16 -7 4 -2 -8 1 7 -5 -9 3 17 -13 6 13 3 -4 14
4195 14 17 5 -2 16 18 -11 8 24 3 -4 3 14 -9 -1 13 -2 -2 3 6 -5 -14 11 1 -11 -6 3 -6 -10 -10 5 -7 -15 1 -1 -22 -23 1 -2 -12 2
4235 2 6 -4 -11 16 10 -17 4 10 -7 4 14 9 -5 -1 19 -2 -8 3 15 -3 -2 16 16 -9 6 12 -9 -7 6 11 -3 -9 4 -3 -17 -7 7 -6
4273 -6 -2 0 9 -4 -11 8 -2 -15 -3 9 -7 -11 7 19 -1 -4 9 5 -3 6 23 6 4 17 15 2 9 9 9 -5 6 10 -17 -6 5 11 -19 4 4
4312 4 -9 -18 1 -4 -13 -3 0 -7 -25 -4 5 3 -8 7 12 -14 -1 6 2 -7 11 16 -10 -15 19 18 -10 11 25 7 0 5 17 -9 -11 21 5 -6 10
4351 10 11 -6 -16 13 7 0 -8 11 -1 -11 -9 -4 -5 -10 16 6 -18 -2 10 -5 -19 -9 13 -9 -11 15 8 2 12 11 18 -4 23 20 -1 2 21 9
4389 9 -2 13 2 6 -11 1 7 -3 14 12 10 0 5 4 -12 -20 6 -1 -14 -20 13 -9 -17 1 1 -13 -10 12 -10 -4 1 9 -12 -12 10 11 0 -1 13 -2
4429 -2 3 7 19 -5 -1 16 10 -4 8 17 -6 -6 10 14 -17 -6 8 2 2 -2 8 -8 -11 7 4 -15 -22 16 -5 -9 3 7 -8 2 3 9 -20 -11 12 0
4469 0 -18 0 7 -1 -9 14 -5 -11 13 9 -4 -10 18 17 -6 -7 17 5 -5 4 9 -8 -5 6 -2 1 -10 9 0 -7 -13 -20 -58 -34 -4 8 9 24 25 -4
4509 -4 -12 4 -5 -15 -5 15 -1 -12 1 21 1 6 21 5 2 8 18 10 6 13 12 -2 -6 7 19 -9 7 11 -6 -8 9 -7 -13 78 23 -2 3 -3
4547 -3 -1 -7 -11 9 -2 -15 -16 0 -12 -15 -4 8 6 -1 -2 -4 -2 6 16 10 -12 14 4 0 -2 17 12 7 -1 28 10 10 8 7 -15 -2 11 -5 4 7 19 -7
4589 -7 -12 3 8 -10 -5 -1 -2 -11 -3 -6 -4 -6 -4 -1 -15 -1 9 -2 0 4 10 -6 -8 3 7 -3 3 4 -5 -12 17 23 -5 3 15 7 -5 15 16 4 7 6 4 5 0 14
4635 14 -6 -6 -6 4 -9 -12 4 -4 -1 -6 -1 -8 -10 3 0 -8 -11 10 -6 -4 -2 17 1 1 4 0 1 0 6 1 -6 12 14 -4 -3 14 18 -3 13 13 -3 -5 11 3
4679 3 -5 -14 10 -4 -9 -7 8 -12 -16 12 0 -24 -8 7 2 -11 -11 -3 -1 1 11 1 -11 -5 15 2 -8 -4 14 -5 -4 12 4 -10 7 9 -9 -10 8
4718 8 16 -8 -5 19 0 -6 9 6 -3 -8 -3 -1 -3 -13 2 -11 -14 4 -3 -5 -3 -2 -6 -16 -22 -8 -9 -7 -9 -3 -6 -3 7 7 4 5 6 -2 9 9 9 3 3 14 4 -5 15
4765 15 2 0 1 12 12 5 0 19 -3 -14 -3 -2 -8 -7 -2 -10 -14 -4 -6 -15 -9 10 3 -17 -11 -7 -11 -11 -10 0 -16 -9 4 15 -2 3 1 1 -3 10 8 11 1 8
4809 8 -5 5 5 18 -1 -1 6 8 -10 -4 -3 -3 -5 -1 8 -12 -9 0 -13 -20 -13 -6 3 -13 0 -4 -7 -15 -4 0 -16 -11 -8 -14 -9 3 1 -4 -4 12 -11 -9 6 5 -8
4854 -8 -15 9 -9 -10 5 0 -8 8 6 13 -12 0 -2 5 -18 -8 -5 -7 -13 25 25 -25 27 6 -11 -20 2 21 7 -60 -47 -11 -30 -16 10 18 -20 3
4892 3 8 4 -12 23 33 4 44 13 -51 41 11 12 23 -29 66 -29 29 38 -5 -14 14 -16 11 -37 36 -9 -5 -12 0 -4 -11 -16 -4 0 -12 -16 9
4929 9 -6 -6 -3 -1 -9 -14 -10 -11 -24 -5 0 -2 -2 13 4 -6 2 10 1 6 5 11 2 -3 12 4 -3 2 18 4 -8 2 16 -1 -3 12 -1 -11 8 8 -16 -1 -2
4972 -2 6 -3 -3 6 9 -13 -3 -3 1 -1 -1 7 -8 2 8 -5 -1 8 7 2 5 16 7 0 8 22 3 7 4 21 -2 -7 11 2 -17 8 4 5 5 0 5 -2 -1 3 -16 -6
5018 -6 -4 -5 -11 -15 -2 -3 -7 -7 0 -7 -8 -7 7 -3 -4 6 11 -5 9 3 9 11 5 9 -1 6 15 -4 -4 1 7 -2 -3 3 9 4 -2 9 -2 -9 -4 -14 -8 -4 -3 -14 -8 -13 3
5067 3 -1 -12 -3 -14 -15 -9 -3 0 -17 -4 -6 -14 -2 4 4 -9 -2 18 1 1 -1 4 7 -18 9 12 0 -3 -2 9 -11 6 8 3 -8 -14 3 -1 0 4 -1 -4 -4 -5 -7
5112 -7 0 6 -5 -13 2 -5 -9 -6 3 2 -11 2 8 0 -1 -5 -3 -6 -1 15 14 -2 12 9 1 2 12 12 5 19 4 7 35 -3 -36 15 -15 51 -14 2 61 8
5154 8 -51 -58 18 25 -73 -48 10 -22 37 14 -5 14 -38 11 36 -34 26 -31 -24 -4 -25 10 -3 -1 10 4 -8 12 9 11 5 6 6 12 13 0 11
5191 11 -1 7 4 10 0 5 4 4 3 11 0 2 -12 11 -6 -10 -10 -3 -8 -21 -12 -8 -8 1 2 -9 -7 3 5 -2 -17 4 -4 -3 8 6 -1 2 2 -1 2 7 14 3 7 2 9
5238 9 2 2 16 1 5 12 2 6 4 0 -1 -4 5 2 -6 -15 13 3 -4 -1 2 -22 -14 -8 -8 3 6 21 -9 -12 4 30 8 -2 30 -16 -2 4 -19 -29 -24 11
5280 11 42 43 -13 3 17 -33 16 18 -29 35 18 1 43 5 26 46 -7 -4 -10 11 -11 -6 -5 -18 -21 -12 -12 -5 -7 -4 -4 -8 2 4 -3 2 12 4 1 -8
5320 -8 14 0 -6 3 6 0 7 3 22 9 10 17 0 4 4 1 -12 -2 3 8 -11 -7 5 -3 -4 -2 -12 -2 -9 -4 -7 -8 -7 -1 -6 -5 -2 -7 -3 -4 13 -6 -7 2 12 3 -3
5367 -3 6 -3 2 5 4 13 2 14 11 12 8 13 2 -2 10 1 -3 -1 -1 -8 -7 -5 -4 -10 -8 5 2 -15 -19 2 2 -10 -11 -4 -17 -9 -4 4 -10 -5 -6 1 -5 10 -2 10 -6
5414 -6 4 6 -6 13 11 4 7 1 8 1 14 12 6 1 0 12 -4 2 8 15 7 4 -9 -6 -13 -3 3 -4 -10 3 -6 -13 -14 -2 5 -11 -5 -8 -3 -8 -13 10 3 -5 17 0 -12
5461 -12 -2 3 10 5 11 10 -4 14 21 -11 2 9 10 5 3 10 16 -1 -1 -2 -3 -3 11 2 -4 9 -1 3 -6 0 1 -5 0 2 -1 -3 -16 0 5 2 1 1 6 9 -1 7 3 11
5509 11 4 16 5 7 17 7 8 22 8 17 11 16 9 8 9 11 -1 0 5 5 0 5 3 -13 -2 11 5 13 -5 -4 -2 -4 6 1 1 -4 10 5 -8 0 4 5 3 7 10 4
5555 4 15 16 14 -1 19 17 6 9 5 5 14 19 17 11 -2 7 28 7 7 1 -4 0 4 2 -6 -5 -3 6 -6 3 0 2 -4 -7 3 8 6 5 -8 1 -5 9 1 -9 -3 -5 6 -1
5603 -1 -1 3 -2 1 12 8 -1 5 9 11 16 19 11 7 11 13 6 6 3 9 2 -1 3 -1 -4 -5 -6 -2 -12 2 7 -11 9 -8 -11 -6 0 -9 -16 -3 -7 -10 -5 7 2 1 -2 13 -1 -2 6
5654 6 -4 11 13 11 6 11 0 2 -5 8 7 -1 3 -8 5 1 -11 -14 -12 -9 3 -10 -3 3 -15 -1 1 -11 -2 -5 -5 -11 -7 11 -14 -5 -2 -9 -6 -2 8 6 1 3 3 -9
5700 -9 -3 10 2 2 0 11 10 -11 6 10 1 8 13 2 8 1 4 -8 -8 -4 4 -4 0 -3 2 -9 -18 5 -15 -1 -3 -5 -1 -11 -6 -3 -2 -4 -2 -4 -15 7 3 4 7 12 -11
5747 -11 -6 0 2 -4 2 6 11 7 1 4 13 2 3 0 10 7 3 1 2 -4 -13 -8 -2 -4 -14 -5 -2 -11 -7 -3 -11 -7 -13 -1 2 -2 -3 0 -16 -3 -4 1 5 -12 -9 3 7 11 5 0 14
5798 14 4 19 4 -3 7 14 8 0 0 1 -1 1 1 -7 -16 -5 8 -6 -10 -10 -8 -9 1 -9 -7 0 -14 -6 -8 -13 -6 -4 -6 -4 10 -5 -2 5 1 -8 -2 8 9 3 0 15
5844 15 3 5 0 9 9 3 9 16 10 -1 38 27 -15 17 -21 -29 4 -7 12 25 -11 18 -28 -20 -61 -23 32 14 34 15 25 -17 14 -52 -26
5879 -26 -50 3 -54 21 10 8 -7 15 -1 11 16 8 -4 5 -1 14 5 -3 4 -3 0 -3 1 7 6 12 6 -2 -6 0 -1 6 -4 -4 -7 -10 3 -1 -20 -10 1 -11 -8
5922 -8 -19 6 -1 -6 -8 -10 -3 -4 -1 1 2 -2 -4 3 13 11 -5 10 9 10 2 -1 13 7 -3 -9 12 -6 -5 7 3 -11 -2 5 -8 -12 0 4 -13 0 -2 -11 -13 -13 -5 -4
5968 -4 -22 -7 1 -2 -5 4 -4 -9 4 -2 1 3 -2 15 -5 8 12 13 10 2 5 -4 5 13 11 1 -6 7 -12 -6 -10 -2 1 -13 4 -5 -8 -9 -12 -9 -1 -10 -18 -9 8 -9 3
6015 3 -8 6 -1 -13 -1 4 6 -8 0 -2 4 -3 3 8 2 1 -2 5 -1 14 5 2 11 3 7 1 13 -5 -1 0 -13 -6 0 5 -8 1 -9 -13 -5 -11 -11 -5 -6 -16 -17 -11 1 -9
6063 -9 -6 -8 -4 -2 -6 2 6 1 7 3 -4 5 -1 1 -7 6 11 -4 5 2 13 4 -2 6 -4 -5 4 -3 0 -6 -3 -3 -12 -4 -5 0 -13 -4 -11 -12 -15 -8 -12 -7 -6 -1 -11 -4 -8 1 -10 -7 1 -7
6117 -7 -9 6 12 7 -2 11 5 -3 9 2 6 -3 2 11 11 -7 5 -6 13 7 -5 -1 -2 -3 -4 -5 -5 -8 -1 -4 -10 -8 -10 -14 -1 -1 -18 -4 -2 -10 -17 -10 -10 -4 3 2 -12 -16 -8
6166 -8 6 6 13 8 9 12 11 10 4 -4 4 7 9 9 14 3 7 9 4 1 -1 -3 -1 -10 -2 -18 -20 -1 -10 -1 -7 -9 -4 -13 -9 -13 0 -2 -2 -4 -2 -7 -9 -2 -5 2 0 5 -9 -4 2 1 -9 8
6220 8 -2 1 8 -1 6 1 1 3 4 4 -3 6 -8 -6 11 -3 -14 -4 -12 -7 -7 -16 -8 -9 -9 -19 -11 -2 -6 -8 -9 -5 -1 -1 -1 -8 -5 6 7 2 1 7 2 6 0 8 10 6 8 -4 12
6271 12 7 12 18 6 2 1 4 -3 0 -4 1 2 2 3 0 -2 -6 -11 0 0 3 -7 0 -10 -10 5 -1 -8 -3 -2 -4 -10 -5 -3 16 0 8 1 2 14 14 4 14 3 12 14 0 8
6319 8 7 -1 12 5 2 -1 1 1 -5 -9 -4 -1 -17 -8 -1 -8 -1 -1 -14 -13 -8 -11 -17 -9 -6 -5 4 -2 -8 -2 -5 3 -8 6 0 7 14 8 5 15 19 3 19 15 7 4 -3 -3 7 12 12 18
6371 18 9 9 12 -16 6 1 -9 -5 1 11 -22 5 -28 5 -12 -17 0 -8 -6 -21 2 -35 -19 -6 -14 23 21 -2 -2 -4 -11 16 23 -4 -25 -24 -20 8 19
6410 19 -16 9 -11 4 -14 9 6 15 2 -19 24 -46 4 19 -14 1 -7 -16 -8 -17 -5 -38 -32 -22 -27 30 9 -7 26 3 -24 -10 2 11 5
6445 5 13 15 14 10 21 32 -7 -4 -21 3 1 -4 -16 -13 9 5 -1 2 -6 -12 11 2 8 -12 2 -3 -12 -12 -3 -12 -7 -18 -10 -11 -4 -3 4 2 -2 -3 -9 -10 -3 6 -3 0 1 1 4 2
6495 2 -2 7 5 15 8 14 15 5 11 10 8 10 6 8 9 1 1 7 6 2 1 -6 7 6 1 -12 -1 -6 3 -12 1 -6 4 -4 -9 -7 -6 -2 -8 1 -2 -2 -1 -4 -8 1 -4 -3 3 8 0 1 13
6548 13 7 7 5 2 11 5 4 14 -1 4 -5 2 15 -7 5 1 -4 -5 -3 -3 -5 -14 -9 -8 -17 -9 -13 -8 -2 4 -13 -4 9 6 -5 -1 7 -13 11 1 -1 4 -3 -1 2 6 2 2 1
6597 1 11 6 11 7 10 5 3 5 4 4 0 2 1 -2 5 -9 -9 -4 -5 2 0 -34 -13 -27 -8 8 19 25 -10 25 12 2 -3 -3 -29 10 -10 -6 9 -14 7 13 20
6640 20 2 6 21 12 14 -18 26 1 22 10 42 -14 -35 -29 7 -9 4 -1 26 1 -29 6 13 -12 -12 -6 -14 -5 -9 -17 -10 -7 -8 -14 -11 -4 10 -10 -8 -7
6680 -7 -2 -6 2 1 13 1 6 6 4 0 8 0 12 -7 -3 -3 3 -5 10 16 3 -11 -10 1 1 7 1 -1 -4 -6 -3 -9 0 -7 -11 -10 -14 -6 -12 -14 -3 -7 -11 3 0 -6 -2 0 -6 -3 -1
6731 -1 -2 4 1 11 4 14 5 7 -5 7 13 -6 5 -5 -4 11 3 1 -4 4 3 1 -11 -8 -8 -7 -5 -11 -9 -13 -5 -13 -15 -5 -7 -5 3 -5 -4 -5 -10 3 5 8 1 -5 0 2 -2 11
6781 11 2 4 12 7 11 7 10 4 4 11 2 0 0 2 11 1 -5 2 -2 -13 -13 -8 -9 4 0 -8 -2 -5 -12 -7 -14 -12 -8 -10 -13 4 -3 -4 3 15 -6 -3 3 -3 10 1 5 1 9 14 7 0 14
6834 14 5 -4 8 6 9 14 -4 7 -5 -4 -4 -6 2 -9 -1 -12 -4 15 -9 -10 5 -14 -17 -2 -9 -3 0 -10 9 4 5 -8 -2 11 1 -7 -14 9 3 12 2 -10
6876 -10 8 2 -4 7 32 -18 -5 19 1 3 16 6 -20 -20 -11 13 18 3 14 -18 -4 -14 -6 -3 -14 31 -7 -35 16 1 -23 -22 -18 11 -16
6911 -16 -12 19 32 54 -29 16 0 9 -37 -19 31 27 11 -2 13 -5 -10 -29 29 19 -5 43 7 1 -22 -45 -6 -32 -2 8 40 -28 22
6944 22 -11 24 22 -24 28 40 10 -21 16 -16 39 40 51 2 85 -26 -31 1 -18 -20 39 21 -12 -40 21 26 -8 7 15 25 4 7 -2 -29
6978 -29 -27 -21 -38 24 48 -28 35 -59 -4 50 -89 29 9 0 -25 -5 -25 13 23 -38 29 -42 -38 16 -42 48 8 52 22 50 -41
7009 -41 -17 -2 -56 -34 60 -3 16 -7 16 -2 -29 38 -35 27 39 -48 -28 31 59 -17 45 24 -12 18 -38 3 3 18 5 -5 3
7040 3 -18 -3 -13 -3 -29 -36 1 4 -65 -8 21 28 -30 -37 -5 2 -19 14 13 -18 -27 -4 6 26 -86 -33 51 -20 36 11 -43 -130 27
7073 27 17 -58 31 -13 22 -30 12 17 35 -14 -26 5 -38 -19 -1 -33 -21 -21 -2 -33 -7 -1 -11 -4 -5 5 -11 -2 -19 -2 -1 7 2 7 5 -4
7109 -4 1 -6 -9 7 2 4 -4 4 2 3 -11 6 2 -7 -12 0 0 -1 -6 -10 -3 -9 -15 -11 -13 -20 -8 -6 -14 -9 -9 -9 -9 -11 -9 -6 -5 -4 -2 0 -2 -3 -7 3 -3 8 7 -2 1 -5 5 0 3
7162 3 3 -8 -1 3 0 5 -1 -3 -2 -5 -7 -4 -3 -12 -7 -14 -3 -11 -9 -23 -15 -12 -16 -8 0 -13 -4 -4 -8 -10 -1 -3 -3 -3 3 3 -8 -4 3 -10 8 11 -5 2 13 0 6 7 -2 13
7212 13 7 2 -1 6 11 -6 -1 -13 7 -4 3 -5 -10 0 -10 -17 -5 -3 0 -14 -1 -13 -16 -16 2 3 0 -4 4 1 -11 1 -16 7 8 -2 6 1 5 3 -1 2 0 -2
7256 -2 7 7 6 2 0 -1 15 -4 1 -1 -2 1 3 2 -3 0 -10 -14 -3 -19 -8 -6 -6 -8 -3 -17 -13 -5 -1 -16 -7 -2 0 -11 -8 1 1 -4 5 3 -1 8 4 5 10 4 6 3 6 0 2 7
7308 7 -4 14 -4 0 4 -11 -1 -4 -15 0 -5 -3 -5 -9 -10 -11 -14 -20 -12 -13 -13 -5 -1 -6 -2 -4 -1 -1 -7 -5 -7 -1 -10 -6 1 0 3 0 14 8 0 7 10 -5 7 4 -1 5 -2 -2 5
7359 5 -4 -6 -5 0 -2 -7 -15 -9 -9 -13 -6 -5 -9 -10 -12 -4 -5 -9 -5 -2 1 0 -2 -6 -6 9 10 0 5 -2 1 -10 1 1 -4 5 13 6 -2 -1 -3 12 2 4 2 0 7 0 0 2 6 7 -8 1
7413 1 -15 -7 -6 -10 -5 -17 -6 -15 -17 2 -11 -2 -8 3 -8 -7 -8 -10 0 1 6 2 1 7 4 2 -3 10 15 -5 -3 5 3 0 2 13 8 12 -1 3 7 -7 -11 0 9 4 5
7460 5 -1 -21 12 -4 23 -24 45 2 -19 6 -27 -7 -1 12 -9 -12 -12 -3 -4 -4 4 -15 -2 8 4 8 6 10 -1 4 7 -2 23 7 19 11 6 13 4 5 -3
7501 -3 -8 0 -8 2 5 -3 -9 0 -3 -8 -2 -1 -6 -9 6 -5 -6 -6 -17 -3 -8 2 -9 -2 0 -7 -5 -4 7 6 -6 4 9 -1 5 4 7 23 -7 21 11 6 30 13
7545 13 3 1 -37 20 -20 18 2 0 -45 -21 -13 33 1 14 13 -70 56 -26 71 -26 30 -83 -11 -21 -86 2 -37 -20 1 -5 -10 -9 2
7578 2 -6 8 9 0 8 -1 1 7 -2 6 9 8 7 2 5 1 0 7 7 8 1 6 -10 2 0 -4 4 -10 -15 -1 -11 -14 -1 -5 -9 -2 -1 6 -5 -8 0 -3 0 -4 9 -11 3 -3 6 6
7628 6 -5 13 11 6 7 15 4 5 5 6 3 5 5 2 15 0 -5 4 15 -2 -3 -8 -2 -7 -8 -7 -8 -4 -12 -11 -9 -9 -12 -8 -21 -11 -1 -6 -3 7 -1 8 9 4 0 9 -10 3
7676 3 1 1 11 13 2 1 11 1 7 1 2 0 0 3 3 14 -7 -10 -5 -4 1 1 3 -1 -2 -3 0 -1 -2 -11 0 -4 -3 -3 -4 5 -16 -10 -2 -5 -7 13 7 4 1 2 4 2 7 8 11 4
7728 4 15 19 7 -4 16 6 -6 1 -2 -1 3 -6 2 -7 -11 1 -4 0 -5 -6 -11 -4 -6 -3 -10 -9 -9 8 -5 -9 3 2 6 -11 0 -2 -5 1 -7 -7 10 0 1 5 9 -4
7774 -4 6 12 5 3 5 8 10 10 -4 5 8 5 1 -6 -3 0 2 -10 -12 -9 -2 1 -17 -9 -12 2 -1 9 -3 -4 1 2 -1 -4 5 3 7 14 5 -6 -5 8 11 11 4 9 9 4 10 1 9 9
7826 9 -6 5 2 4 -5 -8 0 5 -1 -5 -6 -7 -11 -13 -9 -13 -3 -11 -3 -1 27 9 0 -16 3 -34 4 -14 -6 29 65 44 25 -36 0 20 49 31 -30 2
7866 2 17 -9 61 -39 -24 -37 30 40 -3 -17 -2 -35 20 24 -30 -3 13 18 -6 7 12 12 0 -12 -48 -22 -3 -26 32 12 -30 -9
7898 -9 -26 -17 -4 -3 -27 10 -1 -3 -7 7 19 1 16 11 12 5 4 3 7 22 20 -13 -2 2 0 3 4 8 -9 -5 -9 2 -11 -3 -8 -15 -4 -1 -12 -3 -8 -4 -12 -17
7942 -17 -5 -8 1 0 2 -15 -2 2 -8 -7 -9 -6 2 7 5 4 6 2 0 0 8 11 1 14 3 -8 13 10 6 4 -3 -9 14 4 -6 -6 -3 6 -8 -3 0 -10 -7 0 -9 -3
7988 -3 3 -14 13 -17 -1 -9 -6 1 19 6 -6 -3 -2 3 -1 -1 3 18 20 11 3 19 21 8 -3 0 -13 -15 6 -9 0 -36 -4 23 -16 -9 -7 35 15 -3
8028 -3 -10 9 26 -12 4 10 14 -12 7 2 -6 -15 -21 -7 -12 13 -30 -10 38 1 -22 14 7 31 12 5 27 -12 -14 -14 -15 -32 26 6 -10 41 9
8065 9 38 24 -40 27 -12 -16 -10 -32 51 48 11 41 4 -34 38 -13 -7 16 31 -19 11 -8 4 18 -21 -10 16 6 23 20 30 -10 17
8098 17 3 1 37 15 0 -35 -15 14 45 30 7 13 -22 6 -4 -6 -4 -9 -16 -1 28 5 -30 12 16 11 -4 -22 6 1 19 10 -26 -24 -16 -17 -11
8135 -11 45 11 -16 15 17 15 3 52 21 -4 46 -3 4 -21 11 7 -16 -8 -9 -5 0 8 24 8 0 32 9 -4 -3 -34 -17 17 -16 7 -31 -71
8171 -71 -28 33 -6 4 -35 -22 -14 -1 -4 -26 -12 5 24 29 0 -7 -19 16 -1 -2
8191b
$$ Imaginary data points
##PAGE= N=2
##DATA TABLE= (X++(I..I)), XYDATA
0 0 0 0 0 0 0 0 0 0 0 0 0 0 0 0 0 0 0 -1 8 -8 8 -8 8 -9 16 -16 16 -22 24 -26 32 -34 40 -46 50 -57 65 -73 81 -89
40 -89 98 -110 121 -134 148 -164 180 -200 219 -243 267 -293 325 -357 395 -437 487 -543 612 -691
60 -691 790 -910 1066 -1273 1563 -2004 2734 -4173 8015 -38541 -85712 64336 58156 -71760
74 -71760 -34128 77885 2838 -74262 22061 65453 -45987 -49385 58490 26342 -67715 977
86 977 68734 -27906 -66059 51151 56163 -66411 -40477 75014 18929 -76103 4610 71535
98 71535 -27174 -60226 47059 46851 -58176 -27077 62655 4940 -59977 19287 53142 -39797
110 -39797 -40400 57241 25853 -65985 -7649 67530 -12013 -61762 31388 50550 -48501 -36289
122 -36289 59938 19514 -63883 -1468 59832 -18142 -51184 34311 36121 -48686 -19965 56636
134 56636 2349 -58305 14117 51514 -31171 -40897 44461 25976 -54170 -9872 57925 -5902
146 -5902 -54880 21110 46322 -33687 -32496 43870 16648 -49401 344 50654 -14790 -44307
158 -44307 28961 34426 -39397 -20214 46792 4880 -49198 10993 47585 -23898 -39757 34784
170 34784 27693 -42467 -13028 46062 -2884 -45711 17155 40176 -29447 -30750 37966 17445
182 17445 -43144 -3110 43182 -12564 -40631 25001 33119 -34804 -22267 40700 8667 -43076
194 -43076 5031 40518 -18623 -34703 29645 25805 -36644 -13884 39993 903 -38908 12520
206 12520 34739 -23830 -26997 32673 17268 -37105 -4929 38681 -6816 -35361 18733 29296
218 29296 -28385 -20522 34998 10171 -37218 1807 36121 -13259 -31366 23083 23190 -30954 -13394
231 -13394 34957 1914 -35666 9216 32166 -19924 -26045 27934 16809 -33636 -6804 34917
243 34917 -4639 -33293 15099 28247 -23824 -20419 29917 10451 -33194 -13 32793 -10318
255 -10318 -28839 19936 22779 -26723 -14129 30995 4530 -31617 5886 29567 -15147 -24220
267 -24220 23230 17233 -28130 -8057 30603 -1329 -29570 10664 25553 -19075 -19222 25604 11496
280 11496 -29075 -2608 29397 -6700 -27050 14903 21430 -22214 -14235 27059 5648 -29307
292 -29307 2926 27948 -11583 -23990 18787 17146 -24714 -9222 27845 485 -28123 8017
304 8017 25391 -15455 -19811 21374 12064 -25498 -3371 27374 -4747 -25838 12543 21912 -18572
317 -18572 -15291 23053 7363 -25226 1327 25459 -9000 -22710 15661 17722 -20300 -10462 23258
330 23258 2158 -24297 5911 23003 -12980 -19329 18395 13487 -21866 -6144 23021 -2374
342 -2374 -22713 9976 20052 -16342 -15463 20536 8875 -22735 -1362 22545 -6711 -20668 13706
355 13706 16844 -18975 -11376 21936 4607 -22410 3062 20884 -10468 -17671 16567 13016 -20470
368 -20470 -6899 22184 324 -21207 6827 18322 -13337 -14082 18381 9058 -20941 -2977 21221
381 21221 -3369 -19038 9736 15159 -15358 -10332 19224 4770 -20914 960 19968 -6762
393 -6762 -16817 12247 12072 -16926 -6848 19560 1072 -20026 4528 18065 -9827 -14025 14462
406 14462 8634 -18110 -2948 19771 -2642 -19065 7818 16122 -12307 -11199 16043 5322 -18340
419 -18340 677 18827 -6159 -17120 10800 13374 -14237 -7821 16804 1712 -17925 4028
431 4028 17212 -9039 -14623 12843 10357 -15212 -4628 16446 -1476 -16463 6957 14873 -11320
444 -11320 -11762 14279 7060 -15678 -1450 15896 -4360 -14839 9364 12486 -13113 -8816 15108
457 15108 4026 -15570 1589 14798 -7089 -12916 11563 9837 -14624 -5796 15834 894 -15367
470 -15367 4463 13533 -9384 -10809 13193 7080 -15382 -2733 15662 -2157 -14186 7045 11659
483 11659 -11311 -8185 14283 4111 -15610 168 15014 -4639 -12662 8936 9435 -12365 -5594
496 -5594 14361 1299 -14774 2915 13486 -6960 -10690 10572 7064 -13025 -2972 14189 -1308
509 -1308 -13829 5249 11607 -8677 -8449 11625 4546 -13359 -192 13618 -3902 -12566 7585
522 7585 9940 -10472 -6176 12491 1985 -13493 2322 12838 -6325 -10957 9409 7748 -11751
535 -11751 -3724 12856 -668 -12875 4765 11537 -8304 -9021 10799 5436 -12330 -1289 12692
548 12692 -2823 -11761 6608 9745 -9486 -6684 11397 2955 -12074 1180 11773 -4946 -10209
561 -10209 8216 7779 -10440 -4445 11633 686 -11642 3154 10552 -6579 -8453 9296 5540
574 5540 -11017 -2114 11492 -1675 -10994 5145 9273 -8185 -6755 10234 3433 -11355 62
587 62 11136 -3745 -9953 6862 7684 -9356 -4706 10810 1240 -11171 2311 10405 -5598 -8590
601 -8590 8276 5978 -9997 -2682 10825 -698 -10397 4104 9095 -6905 -6814 9074 4011 -10125
615 -10125 -665 10308 -2580 -9369 5619 7602 -7993 -5119 9466 2127 -9972 1051 9438
628 9438 -4198 -8077 6809 5867 -8828 -3296 9669 193 -9683 2800 8546 -5726 -6770 7932
642 7932 4246 -9423 -1475 9719 -1545 -9016 4415 7372 -6920 -5046 8776 2397 -9624
655 -9624 476 9443 -3184 -8113 5769 6097 -7689 -3396 9030 694 -9244 2115 8550 -4545
669 -4545 -6774 6684 4434 -8133 -1669 8884 -1029 -8686 3509 7471 -5644 -5448 7137 2812
683 2812 -8210 -100 8381 -2614 -7821 4749 6190 -6558 -3997 7619 1189 -8172 1542 7877
697 7877 -4065 -6858 5956 4951 -7261 -2450 7865 -372 -7777 3143 7058 -5366 -5525 6998
711 6998 3441 -7727 -772 7842 -1922 -7172 4497 6036 -6309 -4164 7436 1927 -7631 722
725 722 7210 -3268 -6156 5469 4647 -6952 -2745 7540 440 -7363 1917 6425 -4262 -5112 6017
740 6017 3323 -7173 -1365 7312 -924 -6786 3090 5494 -5175 -3917 6609 1989 -7344 25
754 25 7124 -2145 -6139 4151 4565 -5840 -2647 6961 637 -7214 1431 6683 -3338 -5274 5113
769 5113 3460 -6376 -1322 7124 -648 -6909 2608 5972 -4245 -4252 5638 2203 -6503 -46 6758 -1943
785 -1943 -6263 3615 4975 -4960 -3156 5858 981 -6389 1045 6194 -2935 -5441 4267 3896 -5324
800 -5324 -2013 5823 -184 -5981 2162 5500 -3837 -4497 4968 2876 -5632 -881 5815 -1217 -5527
815 -5527 3131 4776 -4542 -3435 5462 1726 -5731 363 5592 -2333 -4904 4097 3904 -5192 -2380
830 -2380 5770 624 -5646 1370 5105 -3181 -4090 4646 2807 -5512 -1260 5682 -527 -5319 2259
845 2259 4409 -3868 -3267 4928 1771 -5547 -254 5375 -1439 -4752 2928 3583 -4278 -2282 5063 737
861 737 -5358 785 4963 -2303 -4076 3625 2807 -4615 -1304 5155 -195 -5068 1722 4470 -3027 -3282
877 -3282 4183 1885 -4823 -263 5091 -1230 -4692 2658 3834 -3742 -2504 4552 974 -4879 612
892 612 4726 -2092 -4096 3292 2956 -4211 -1575 4634 -19 -4720 1468 4229 -2801 -3411 3713 2113
908 2113 -4368 -732 4501 -793 -4267 2137 3573 -3258 -2562 3992 1258 -4348 171 4307 -1537
923 -1537 -3778 2783 2947 -3638 -1742 4196 428 -4232 1004 3963 -2251 -3175 3335 2170 -3980 -856
939 -856 4288 -474 -4102 1792 3530 -2900 -2602 3692 1381 -4128 -80 4097 -1283 -3727 2405 2892
955 2892 -3370 -1869 3875 569 -4073 690 3795 -1942 -3242 2876 2270 -3567 -1129 3858 -133
970 -133 -3773 1372 3325 -2445 -2574 3240 1585 -3664 -374 3776 -811 -3433 1998 2873 -2846 -1944
986 -1944 3477 882 -3649 344 3532 -1504 -2989 2572 2229 -3306 -1258 3658 110 -3652 1021
1001 1021 3210 -2123 -2512 2960 1532 -3538 -531 3607 -630 -3392 1648 2727 -2613 -1883 3242
1016 3242 858 -3579 161 3465 -1206 -2996 2115 2222 -2837 -1231 3316 225 -3387 808 3126
1031 3126 -1690 -2489 2468 1627 -2972 -589 3290 -387 -3196 1343 2778 -2082 -2008 2675 1028 -3038
1047 -3038 35 3135 -1036 -2901 1871 2304 -2533 -1475 2913 418 -3082 646 2946 -1606 -2544
1062 -2544 2279 1795 -2786 -855 2959 -234 -2912 1233 2603 -2081 -2021 2636 1236 -2889 -277 2877
1078 2877 -727 -2610 1673 2174 -2325 -1487 2744 665 -2811 285 2645 -1208 -2237 2020 1705 -2546
1094 -2546 -966 2772 142 -2700 730 2357 -1585 -1840 2251 1163 -2661 -410 2726 -414 -2518
1109 -2518 1230 2017 -1977 -1390 2506 639 -2732 140 2634 -915 -2236 1642 1602 -2250 -845 2602
1125 2602 75 -2653 695 2407 -1367 -1860 1971 1155 -2380 -352 2575 -380 -2458 1081 2079 -1634
1141 -1634 -1430 2088 663 -2350 120 2408 -825 -2172 1429 1706 -1858 -1028 2152 251 -2280 515
1157 515 2187 -1179 -1848 1675 1292 -2027 -569 2195 -221 -2154 950 1940 -1550 -1491 1949 869
1173 869 -2131 -117 2146 -627 -1963 1342 1629 -1832 -1048 2128 393 -2138 328 2030 -1100 -1723
1189 -1723 1646 1220 -1983 -649 2126 15 -2059 668 1749 -1316 -1335 1795 831 -2054 -229 2031
1205 2031 -426 -1837 991 1505 -1432 -1062 1859 459 -2040 167 1937 -781 -1564 1225 1213 -1643
1221 -1643 -643 1936 89 -1990 536 1812 -1068 -1366 1543 884 -1800 -274 1867 -356 -1821
1236 -1821 906 1534 -1355 -1087 1675 452 -1914 113 1877 -706 -1624 1172 1255 -1567 -726 1741
1252 1741 121 -1806 462 1668 -985 -1353 1391 923 -1612 -366 1772 -178 -1695 718 1453 -1172
1268 -1172 -1064 1472 634 -1655 -47 1666 -487 -1533 978 1217 -1331 -765 1548 259 -1639 291
1284 291 1576 -730 -1299 1197 970 -1492 -424 1640 -141 -1597 616 1393 -1025 -1051 1357 613 -1639
1301 -1639 -136 1565 -426 -1488 924 1186 -1198 -709 1512 280 -1516 207 1462 -643 -1262 1125
1317 1125 920 -1344 -476 1469 11 -1413 492 1243 -862 -1016 1216 646 -1386 -179 1425 -263
1333 -263 -1339 697 1120 -1061 -770 1340 340 -1406 89 1360 -522 -1194 931 889 -1224 -506 1379
1350 1379 93 -1378 350 1228 -810 -988 1129 613 -1337 -232 1408 -206 -1325 600 1064 -946
1366 -946 -751 1214 369 -1349 61 1325 -442 -1152 800 869 -1077 -493 1266 124 -1316 267 1213
1383 1213 -604 -990 885 647 -1108 -276 1229 -132 -1219 498 1083 -785 -797 1029 426 -1158 -27
1400 -27 1209 -363 -1116 691 906 -941 -567 1101 159 -1168 243 1125 -614 -980 899 702 -1064
1417 -1064 -345 1147 -75 -1130 460 1001 -798 -789 1014 468 -1128 -102 1099 -298 -1016 640 826
1434 826 -918 -583 1071 267 -1112 109 1029 -445 -864 783 643 -987 -369 1098 57 -1050 305
1451 305 932 -624 -716 889 447 -1056 -155 1088 -151 -991 479 790 -763 -534 982 226 -1091
1468 -1091 69 1036 -395 -907 659 651 -903 -347 1033 22 -1075 271 955 -553 -753 789 449
1485 449 -950 -135 1032 -178 -995 461 844 -683 -589 874 292 -953 46 975 -330 -881 596
1502 596 692 -758 -417 888 91 -932 222 882 -506 -765 697 529 -847 -251 899 -81 -886 381
1520 381 778 -649 -602 810 337 -906 -42 885 -282 -823 565 663 -765 -436 885 166 -891 155
1538 155 839 -442 -689 696 504 -828 -250 915 -25 -867 315 749 -563 -565 753 358 -867 -95
1556 -95 861 -180 -785 420 608 -641 -418 797 158 -871 51 812 -322 -723 526 495 -720 -280
1574 -280 807 11 -829 222 738 -465 -575 656 355 -777 -103 835 -142 -789 400 653 -572 -450
1592 -450 721 198 -786 69 793 -317 -686 535 531 -670 -298 758 38 -781 210 710 -427 -582 596
1611 596 378 -702 -170 728 -100 -718 325 612 -532 -455 654 239 -725 -21 713 -233 -653 427 508
1630 508 -583 -325 679 103 -710 144 668 -347 -538 549 388 -645 -166 725 -52 -690 289 609
1648 609 -463 -442 614 234 -684 -9 701 -214 -634 407 503 -565 -339 670 93 -687 104 635 -328
1667 -328 -561 485 385 -618 -198 655 -29 -649 233 572 -420 -444 563 277 -628 -64 649 -122 -586
1686 -586 342 483 -479 -322 598 147 -624 76 612 -256 -510 445 380 -565 -209 637 8 -623 187 554
1706 554 -375 -425 520 252 -617 -67 637 -139 -588 305 460 -475 -310 574 124 -619 53 601 -238 -507
1726 -507 379 369 -497 -210 571 17 -582 184 532 -319 -435 437 282 -534 -94 572 -82 -535 256 463
1746 463 -392 -330 488 163 -536 17 540 -211 -503 350 382 -463 -248 519 49 -537 137 492 -302 -428 426
1767 426 290 -508 -126 529 -65 -519 245 447 -377 -330 486 198 -514 -30 515 -142 -453 322 361 -420 -244
1788 -244 509 88 -511 62 479 -221 -388 365 265 -468 -168 492 1 -479 139 406 -302 -310 399 201 -483
1809 -483 -45 506 -94 -444 226 349 -364 -219 480 69 -461 44 489 -218 -400 331 285 -429 -104 462
1829 462 -22 -480 162 442 -266 -359 348 110 -563 -29 433 -59 -416 214 348 -310 -248 400 90 -453 56
1850 56 431 -182 -378 274 299 -368 -170 392 33 -415 118 392 -240 -308 335 231 -378 -87 414 -48 -391
1871 -391 197 343 -290 -251 374 151 -402 7 403 -130 -349 261 274 -347 -185 398 52 -406 74 367 -215
1892 -215 -318 303 200 -376 -99 393 -39 -376 129 328 -252 -249 348 127 -387 -26 386 -81 -344 201 280
1913 280 -287 -181 353 77 -377 45 359 -147 -289 252 222 -312 -115 364 4 -374 108 340 -211 -242 286
1934 286 155 -336 -36 361 -76 -332 178 274 -276 -193 327 63 -359 31 341 -158 -320 225 231 -302 -132
1955 -132 332 17 -344 103 312 -199 -256 270 175 -313 -61 332 -34 -313 144 272 -231 -199 286 111 -317
1976 -317 -1 332 -103 -282 193 239 -263 -139 306 48 -321 47 299 -143 -254 230 168 -287 -96 304 -21
1997 -21 -313 128 270 -199 -208 269 116 -295 -13 314 -77 -280 167 224 -232 -144 283 59 -296 46 299 -127
2019 -127 -246 211 190 -248 -102 289 13 -293 87 252 -174 -201 231 137 -261 -47 272 -44 -258 135 217
2040 217 -210 -156 249 79 -271 -1 266 -96 -234 172 168 -229 -96 277 19 -259 81 248 -142 -185 223
2061 223 140 -257 -43 281 -31 -258 117 211 -174 -141 246 68 -258 14 255 -84 -222 150 174 -206 -95
2082 -95 239 29 -249 39 234 -119 -195 175 124 -214 -62 234 -27 -235 89 216 -146 -162 193 88 -218
2103 -218 -15 224 -54 -211 134 183 -171 -103 224 43 -219 54 219 -110 -170 173 136 -205 -73 226 -7
2124 -7 -217 91 182 -146 -153 183 77 -227 -20 222 -63 -204 126 167 -174 -112 210 53 -219 6 201 -88
2146 -88 -175 159 130 -201 -52 219 15 -201 71 188 -107 -128 174 105 -196 -25 213 -28 -197 96 163 -137
2168 -137 -107 192 44 -197 20 205 -79 -179 124 121 -172 -86 187 9 -201 51 190 -118 -145 150 94 -187
2190 -187 -25 208 -41 -193 99 167 -132 -123 167 57 -184 15 199 -55 -163 123 152 -145 -89 194 20 -174
2212 -174 29 173 -79 -139 134 98 -167 -45 170 -50 -189 26 152 -134 -145 97 74 -179 14 144 -73
2233 -73 -150 115 158 -142 -100 135 42 -135 56 171 -85 -143 158 87 -152 -57 172 -1 -191 62 160 -106 -119
2256 -119 152 59 -170 -25 138 -17 -152 92 114 -118 -78 114 37 -160 -6 139 -29 -141 82 95 -140 -86
2278 -86 145 -15 -160 24 146 -88 -126 161 75 -133 -53 161 -34 -161 84 128 -109 -74 175 31 -138 13
2300 13 136 -44 -121 98 81 -125 -68 153 13 -140 59 134 -70 -122 122 70 -161 -50 170 -27 -150 24
2322 24 126 -91 -98 86 77 -123 -18 125 -56 -93 69 154 -120 -120 131 72 -118 102 168 -64 -41 77 84 -121 17
2347 17 148 10 -121 30 62 -106 -114 133 59 -118 -28 162 -28 -128 55 117 -115 -69 104 10 -142 -19 109
2370 109 -57 -103 96 67 -120 -94 117 -23 -127 39 113 -94 -118 96 75 -124 -4 81 -34 -95 88 126 -98
2393 -98 -70 60 18 -83 5 123 -54 -105 73 71 -108 -41 121 15 -138 16 94 -72 -65 83 46 -124 -25 112
2417 112 -49 -106 42 79 -83 -83 120 4 -129 -4 111 -40 -104 69 66 -88 -48 112 7 -105 30 130 -59
2440 -59 -99 88 60 -86 -46 107 -18 -131 32 111 -56 -76 79 39 -106 -13 65 -34 -91 50 65 -106 -57 91
2464 91 7 -99 12 90 -55 -82 80 46 -84 -24 114 -5 -109 27 88 -61 -64 82 34 -80 2 110 -19 -81
2488 -81 57 73 -82 -51 92 19 -102 13 85 -42 -78 67 51 -83 -33 81 3 -89 11 69 -53 -65 62 32
2512 32 -94 -19 79 -27 -81 32 58 -60 -52 76 32 -89 9 85 -26 -67 48 49 -63 -27 89 11 -82 27 90 -44
2538 -44 -61 54 44 -77 -8 85 -18 -81 27 59 -43 -56 72 25 -84 -12 59 -31 -82 35 52 -70 -33 64 9 -80
2564 -80 19 58 -41 -68 56 37 -61 -23 73 -9 -61 29 67 -52 -55 63 27 -70 -12 74 -11 -62 37 51 -55 -40 70 10
2592 10 -65 20 67 -43 -66 45 24 -63 -23 58 -14 -79 9 36 -63 -47 41 15 -76 -24 53 -26 -55 33 56 -49 -33 61 14
2621 14 -69 -3 62 -26 -46 47 40 -56 -21 72 -4 -57 28 63 -35 -49 50 23 -63 -10 59 -20 -59 30 45 -50 -42 57 4 -61 10
2652 10 56 -46 -48 36 31 -59 -26 61 -16 -67 21 51 -36 -41 50 18 -56 5 66 -15 -51 46 49 -29 -28 63 28 -39 10 62 -10 -47
2684 -47 31 33 -55 -20 50 -6 -58 12 35 -29 -42 43 30 -55 -13 46 -15 -64 22 39 -41 -30 39 17 -57 7 56 -19 -41 43 33
2715 33 -44 -5 51 -6 -61 20 53 -25 -31 54 24 -46 -8 53 -3 -55 30 42 -28 -36 42 10 -54 -8 37 -10 -45 27 35 -51 -22 38
2747 38 6 -63 8 29 -29 -41 31 17 -37 -15 43 -6 -43 19 42 -31 -23 47 19 -43 6 50 -4 -38 24 32 -34 -15 53 15 -38
2778 -38 16 48 -23 -41 39 25 -49 -18 44 -3 -38 15 36 -40 -35 27 5 -48 2 32 -16 -53 29 35 -33 -18 34 3 -32 15 42
2809 42 -21 -29 31 30 -30 -9 51 1 -45 16 46 -27 -17 42 15 -43 -4 38 -8 -39 15 21 -44 -27 42 -1 -42 -6 34 -31 -40 16
2841 16 20 -38 -21 32 4 -50 6 35 -29 -24 31 14 -47 -12 39 -2 -47 29 35 -22 -18 38 18 -41 1 47 -5 -25 30 29 -32 -13 46
2874 46 -2 -43 12 29 -19 -32 19 14 -41 -10 28 -14 -51 11 25 -33 -28 22 10 -45 -10 21 -28 -35 22 26 -24 -21 37 16 -36 14 40
2907 40 -16 -29 35 34 -27 -16 38 -2 -30 -2 32 -5 -47 39 -10 -42 -7 15 -13 -77 33 61 -75 -30 41 -30 -10 -1 80 -16
2937 -16 -37 -11 6 -27 -57 36 -5 -54 -10 73 -52 -35 60 75 -34 -8 -2 -6 -10 -6 30 -6 -6 40 -47 -41 -24 77 -20 -21 4 25
2969 25 -11 -30 33 -15 -44 14 22 -31 -59 8 -15 -29 -40 34 22 -42 25 16 -29 -19 47 -1 -21 10 24 -24 -26 52 13 -32 0 47
3001 47 7 -29 -2 47 -15 -14 22 18 -25 -1 39 -32 -46 36 39 -21 -38 24 -17 -60 5 -2 8 -45 39 0 -20 -20 24 -23 -12 -26 16
3034 16 -31 21 -8 -22 -62 -32 22 -9 0 15 -6 -41 37 16 7 -11 14 38 5 -15 49 26 -3 -32 38 1 -38 1 27 0 7 28
3066 28 5 -37 -37 21 -48 -61 -19 11 -30 -26 59 -8 -53 24 62 3 -22 -1 -13 -16 -7 12 29 -68 -20 2 -14 -20 33 1 -27 -44 55
3099 55 65 -44 50 24 -44 -9 10 -55 -14 46 24 -47 -5 88 9 -8 -63 13 -18 -12 25 54 -24 -13 -4 13 -48 69 -10 19
3129 19 -87 -89 63 -33 -40 12 -15 -35 4 33 57 -5 58 54 -45 0 6 -2 -61 53 -1 -84 -13 35 45 24 -4 16 -6 -33 12
3160 12 17 -47 -4 -52 -13 -50 -43 13 -36 -47 0 -34 -13 -12 -34 -30 -15 -13 19 -1 -12 -15 52 18 7 13 38 29 -46 9 -14 -16 -9 29 -8
3195 -8 18 3 -4 -2 -4 -60 -22 -14 1 20 18 19 24 -37 -24 42 64 -20 -4 6 29 -55 10 19 -32 -6 19 21 -48 -27 2 -7 -15 -10 37 -9 1
3232 1 25 8 -14 14 34 -11 -13 19 21 -11 6 21 -1 -22 10 27 -15 -24 17 16 -22 0 24 -16 -24 12 17 -29 -28 14 6 -35 -4 23 -11
3267 -11 -25 10 7 -25 3 33 1 -21 8 18 -12 -14 30 12 -13 6 36 13 -15 23 32 0 -4 21 4 -13 5 30 5 -19 22 9
3299 9 -20 -5 25 -13 -24 1 12 -17 -22 13 5 -24 -7 18 -8 -14 7 14 -16 -15 24 5 -16 7 13 -19 -13 11 19 -16 -3 31 8 -10 12
3334 12 30 -15 -2 28 23 -21 2 30 3 -28 2 26 -7 -10 20 -1 -21 2 22 -13 -25 6 6 -24 -7 24 -2 -15 5 31 -11 -10
3366 -10 22 12 -28 -9 21 -3 -24 18 27 -10 -7 25 8 -16 2 25 -3 -2 14 17 -16 -9 28 16 -20 2 23 -5 -25 17 16 -17 -12 10
3400 10 7 -15 2 9 -13 -18 15 1 -26 -7 14 -10 -22 3 10 -25 3 22 3 -26 6 34 -3 -17 13 13 -22 -2 24 3 -13 18 18
3433 18 -11 -15 18 21 -20 -8 21 -1 -25 0 14 -11 -16 5 3 -23 -7 8 -14 -23 1 10 -26 -9 8 5 -27 -1 20 0 -7 6 13 -22 -2
3468 -2 19 -1 -17 20 26 -12 -5 21 4 -8 4 20 -7 -10 18 24 -18 -23 23 -4 -16 -4 12 -19 -27 5 -3 -15 -8 19 2 -21 5 13 -25
3503 -25 -21 11 0 -23 9 23 -5 -23 9 24 -18 -11 17 -1 -17 -4 25 -5 -16 8 11 -15 -7 28 -7 -15 9 11 -14 -14 24 17 -16 -3
3537 -3 11 -10 -19 3 15 -6 -12 20 9 -22 0 27 -12 -18 2 11 -18 -8 19 0 -29 4 20 -4 -23 -1 -1 12 -4 27 8 -15 0
3570 0 30 -5 -10 14 3 -45 20 7 -5 -6 11 4 -30 -10 -1 3 -33 -20 14 -10 -16 0 -2 -18 -23 18 11 -4 -28 6 -31 -4 42 33 -34 -34
3606 -34 37 5 12 22 9 17 -17 39 17 -5 11 -15 0 24 55 18 -32 -22 4 -19 -27 4 29 -25 5 0 3 -18 -10 50 -10 -33 -37 -7
3640 -7 -17 -10 42 -43 -36 -35 8 18 -1 14 -14 -8 6 53 19 -9 -18 20 -21 -4 19 42 -12 -34 36 20 -41 33 42 -23 22 -8 15 17
3674 17 22 20 -58 -70 3 23 -12 0 -4 3 -21 6 58 -38 -19 2 16 -30 11 -4 8 -29 27 47 16 -3 30 17 -24 1 32 -1
3706 -1 15 9 28 -19 -1 17 2 -3 0 13 -11 -14 21 12 -17 -6 5 -4 -22 4 -5 -11 -16 12 -11 -25 -7 10 -20 -23 9 9 -24 -11 17 -5
3742 -5 -16 4 3 -13 -17 12 14 -15 -10 21 8 -15 11 15 -4 -16 9 7 -9 0 10 5 -8 4 22 -5 -7 6 -10 -19 1 12 -14 -12 15 5
3778 5 -21 -11 12 -4 -18 5 21 -19 -13 15 10 -17 -5 16 -7 -18 10 19 5 -15 21 15 -3 9 12 11 -16 41 13 -18 -20 39 19 0
3812 0 -50 -42 -25 -33 27 2 -64 -6 65 15 -26 14 30 12 -14 1 -7 -10 -5 33 1 -36 10 40 -24 -1 4 4 -21 4 12 -6 -11 24 9
3847 9 2 0 20 6 -24 3 14 -6 0 24 6 -10 2 3 -9 -22 7 0 -15 -17 5 1 -19 -3 17 -10 -17 6 6 -9 -6 16 0 -16 8 19
3883 19 -8 -18 2 2 -19 7 27 -5 -8 -2 16 -11 -12 12 10 -10 4 26 -8 -4 15 21 -13 -5 15 5 -23 2 12 -11 -12 7 -3 -25 -4
3918 -4 10 -22 -18 -1 1 -11 -16 16 -2 -7 7 18 -3 -6 8 6 -10 -6 15 2 -16 12 14 -6 -13 8 20 -11 11 21 -7 -4 12 24 -5 0
3954 0 18 9 -17 2 15 0 -6 14 10 -11 -4 13 3 -23 8 14 -10 -23 -1 0 -18 -1 13 -4 -9 5 7 -21 -12 25 8 -14 7 14 -14 -4
3990 -4 7 18 -6 5 28 11 4 4 16 -3 -11 14 12 -5 -1 9 1 -12 6 13 -23 -10 19 -1 -9 -3 12 -16 -29 -10 13 -19 -10 -3 1 -23 -1
4027 -1 11 -9 -6 12 11 -10 -4 16 -2 -13 2 9 -12 -12 14 2 -5 -1 11 -16 -25 2 4 -16 -14 6 2 -27 -2 -6 -9 -12 5 8 -19 -17 10 -6 -28
4066 -28 -11 13 -23 -26 9 12 -9 -14 6 -36 1 8 -11 4 -15 28 -12 -25 -2 17 4 -30 15 41 -3 -7 7 4 11 -2 12 15 -46 -9
4100 -9 14 -25 31 7 -72 31 23 -67 -8 -21 -9 -1 -60 6 24 14 -22 0 -37 -38 -33 18 16 -26 -7 14 -9 -20 -3 6 -9 -4 13 10
4134 10 -6 5 11 -6 -4 12 7 -21 -9 11 -6 -14 0 7 -18 -7 18 2 -23 -6 8 -3 -14 1 5 -19 -2 0 -5 -12 2 4 -8 -14 2 6
4170 6 -14 -3 2 0 -13 4 10 -8 -7 13 8 -9 3 19 -9 -9 7 12 -9 -13 16 2 -19 -2 6 -14 -6 4 5 -15 -13 3 -6 -12 -2 4 -13 -5 1
4209 1 5 -8 -4 -1 -5 -12 -13 6 -10 -9 16 3 -6 17 15 9 -10 14 8 -9 10 18 13 -8 2 10 -13 -1 -4 1 -18 -14 13 4 -14 8 -2 -8 -17 -3 2
4250 2 -30 -12 8 -9 -28 -9 -9 -16 -5 0 -3 -9 -3 -1 -10 -1 10 11 -3 -2 20 -1 -17 4 7 -10 -6 17 1 -7 -11 7 -9 -12 2 10 -10 -5 5 -7
4290 -7 -6 3 -1 -16 -14 0 3 -9 -8 9 -8 -22 -10 2 -10 -13 5 -3 -16 5 16 1 -4 3 8 -6 -1 15 15 -11 -3 15 -9 0 4 7 -13 -4 11 7
4330 7 0 5 8 -11 -16 1 3 -21 -19 -6 -18 -14 -6 3 -20 -8 -4 -7 -29 0 -1 -5 -12 1 6 -11 -10 11 2 -9 -4 17 5 -8 9 0 -19 -5 19 -11
4370 -11 -12 3 -1 -10 -6 8 8 -21 -8 14 -1 -8 7 -3 -21 -16 9 -8 -18 -7 -4 -13 -28 4 3 -13 -14 7 -7 -12 -1 11 -10 -6 0 -2 -8 5
4408 5 25 -2 -6 10 6 -9 -10 11 2 -14 -1 7 -5 -6 1 7 1 -3 5 -11 -20 -3 9 -5 7 -5 -15 -20 -10 11 -9 -14 -6 2 -15 -8 9 2 -21 -1
4448 -1 -6 -15 -15 -2 -2 -7 3 6 -3 -14 7 19 -6 -10 8 13 -16 -4 17 -3 -16 8 12 -16 -5 6 5 -14 -9 1 -13 -14 -14 -5 -17 -14 8 -4 -10
4487 -10 -5 7 1 -22 8 -3 -12 5 -3 -12 -17 1 -3 -22 -15 15 -7 -41 -20 -11 -24 -9 -5 24 -5 -4 3 8 -9 4 13 5 -6 9 16 -3 -2 2 -5 -19
4527 -19 4 5 -16 -9 -6 6 -19 0 2 -10 -13 -3 -5 -15 8 73 96 7 18 7 -15 -2 4 3 -7 -4 -2 9 -3 2 4 5 -2 -1 2 -1 -13 14 2
4566 2 -4 11 2 -4 -11 6 10 -2 0 6 1 -21 2 -3 -9 -20 -2 -3 -10 -6 9 -15 -10 13 12 -12 5 4 1 -4 7 10 -2 7 17 15 -4 2 19 5 -1 11
4608 11 7 -5 -16 13 -10 -6 5 -1 -9 -8 0 -6 -28 -10 -4 2 -13 -1 0 -5 -9 2 -1 -10 -14 -1 3 -8 10 11 -10 -15 11 8 -10 -2 21 -2 -1 5 10 -5
4650 -5 -3 20 0 -11 3 17 7 -8 10 12 -2 -12 21 2 -4 3 8 -5 -3 3 -9 -18 6 -2 0 -10 7 5 -14 -17 -3 0 -11 -7 9 -7 -4 13
4688 13 4 -8 6 9 7 -1 6 3 -2 -2 3 17 4 5 3 5 -6 -8 -5 1 6 16 9 3 0 -1 -2 -19 3 5 -15 -13 -6 -13 -10 -6 -6 -7 -8 8 2 -20 -4 7 7 -15
4734 -15 -7 -2 6 -2 5 -6 -10 10 11 -1 -6 7 15 -9 10 11 10 9 5 3 3 -2 -1 3 0 -11 5 -2 -9 5 4 -10 -5 12 -5 -5 -8 6 -15 -17 -5 -5 -8 1 8
4779 8 2 -13 3 13 -7 -7 3 13 1 2 15 3 -6 2 13 10 9 6 10 1 11 -2 -1 -11 -2 4 0 -1 3 0 -11 2 -8 -1 -12 -1 -1 -4 4 -4 -5 -9 -2
4822 -2 -4 -4 -6 1 9 8 -6 15 7 -2 16 7 6 2 5 9 5 5 5 3 -1 9 13 -7 -3 6 7 -5 1 9 2 -4 7 -2 -25 -22 7 10 -26 -27 25 -16 -14 -2 12 -18
4868 -18 -16 4 -29 9 2 -15 20 15 6 -3 -21 -7 -5 8 4 33 13 32 25 32 -5 3 26 -35 -8 -21 6 -35 42 1 -7 10 63 25 -63 17
4904 17 18 38 -82 -15 -20 -46 -36 -59 21 -5 -13 6 -1 3 13 0 9 5 6 10 3 10 9 6 4 15 10 10 12 8 7 12 1 2 20 4 3 12 4 -5 -5 4 2 -9
4948 -9 -10 -3 -10 -12 -6 -1 -15 -1 -4 1 -6 -4 -4 -11 -4 2 0 -11 6 10 3 -3 0 6 0 -7 11 -2 6 13 10 2 10 4 13 4 -10 12 1 4 2 9 -6 12 9 9 -2 3 0
4997 0 -2 -1 -4 12 -8 1 -2 -2 -5 -4 7 -2 -13 10 5 -2 2 1 12 1 3 5 3 1 10 7 -1 9 17 -1 -7 5 15 10 -5 11 0 -7 2 17 11 -12 0 6
5041 6 -13 -3 -3 -7 4 1 4 -5 -3 3 -1 -3 -8 1 2 -1 -4 11 -4 -11 -2 18 8 2 20 13 -2 14 10 5 7 4 -1 -6 4 7 -1 -8 7 7 -1 -2 10 0 -9 -1 2
5088 2 -2 -5 -10 -10 -23 -6 -8 -6 -22 -7 -8 2 -8 13 -2 -10 -6 6 -8 -12 11 4 -5 0 9 1 -6 10 9 -3 -3 12 9 -7 -7 10 1 -5 5 -9 -1 -3 15
5131 15 -5 -18 -5 5 -6 -10 3 2 -11 -8 9 -11 -19 -50 -19 57 48 11 -26 -35 -20 90 5 16 69 1 1 19 19 47 18 7 -3 -35
5165 -35 9 57 -23 -38 -10 13 50 1 -8 9 -15 -6 -1 -3 8 0 -3 -3 2 5 6 -12 -7 1 1 -11 -8 -5 -4 -6 6 5 -6 0 0 -6 -8 -5 9 4 -13 2
5207 2 13 3 3 11 12 2 10 14 5 14 4 -3 3 2 5 5 -6 1 8 -3 -1 -2 -4 -6 -2 -1 -11 -11 2 -7 -11 -8 -2 5 -5 -8 6 -5 -7 2 1 -2 -7 12 6 5 -4 1 6
5256 6 -8 -8 3 4 2 8 15 24 -11 5 43 -14 -2 13 -4 -16 -7 34 -25 -39 1 -11 22 -3 -32 18 -6 -13 16 -57 -1 11 11 -4 34
5291 34 -19 -8 20 13 10 -5 5 9 8 1 5 5 -5 8 18 3 6 17 3 5 12 9 -1 0 18 5 3 10 7 7 6 5 8 -9 -4 4 -10 -11 -2 -3 1 -7 5
5334 5 2 -15 2 -2 4 -1 10 -2 3 -2 -2 4 -10 1 11 -2 0 13 11 -10 2 10 1 18 -2 6 4 -7 1 2 -14 -10 -3 1 -2 3 6 -3 -7 -7 -3 -16 2 -3
5378 -3 -2 -10 -5 -2 -6 3 7 -2 -1 14 5 12 -18 7 1 5 -3 2 6 1 10 6 7 -2 7 9 9 -5 7 5 -8 3 -7 -8 4 9 0 -8 -11 0 15 0 9 6 0 -11 7
5425 7 3 -18 9 4 -7 -7 6 7 4 -3 8 2 0 10 1 2 -5 1 5 2 2 -6 12 13 10 13 8 7 10 13 -7 6 5 -1 -10 3 11 -7 -1 -1 -1 2 -1 9 -7 -10 -4 11
5473 11 -8 -5 3 -11 -2 -9 -6 -10 -6 -2 2 2 -3 3 -1 2 2 -2 -4 4 -3 2 -3 1 8 1 0 -7 5 -8 3 10 18 -9 -3 2 -5 2 8 4 -10 -14 -2 -6 -6 -3 -9 -7 -8 -3 4 -23
5525 -23 -13 2 4 -13 -4 1 -6 -5 14 -5 5 8 9 10 3 6 12 7 8 6 20 1 7 7 5 -3 3 7 7 -2 -1 4 3 8 2 -7 -8 2 -4 -1 -7 -1 -3 -7 -3 8 -6 -11 -1
5574 -1 4 -9 -8 -1 -2 -11 -8 5 12 -9 9 -1 9 3 12 2 -3 12 6 -1 8 4 -2 3 -2 9 4 12 -13 10 -1 -7 -2 -9 -2 -2 -5 -8 -2 -7 -7 -3 -6 -3 5 -8 -7 -10
5622 -10 -12 -13 -3 -4 -3 3 5 -1 -4 10 4 -2 -1 12 -8 6 -1 13 4 3 5 5 -2 -2 8 1 -2 -6 1 -8 -3 -6 -11 -5 -15 -9 -14 -15 -1 -10 -9 -13 3 -12 -20 -6 -1 -7
5670 -7 0 -4 -5 -10 1 -3 -1 4 11 2 1 7 4 7 7 5 7 13 -7 17 4 8 7 9 0 1 3 -2 -4 -3 6 6 -14 -9 -2 4 -4 -5 -9 -1 -2 -5 -10 -4 -5 -4 -3 -8 0 -7 -5 -1 6 2 -3 10
5726 10 4 2 -2 5 3 7 2 10 3 1 3 4 -6 -10 -6 1 -4 -3 -6 -2 -3 0 -6 -13 -16 -6 -13 -7 -16 16 3 -17 -2 -7 -9 -11 0 -11 8 -5 3 3 -7 4 2 -8 9
5773 9 1 13 -2 6 8 -1 1 3 5 6 5 2 -5 17 4 3 -3 -5 5 -7 2 3 -1 -10 -3 -2 3 -12 -10 -13 -3 -5 7 -13 -5 1 -4 -3 -10 -3 -1 -8 -13 -8 2 -9 6 1
5821 1 -12 -1 10 13 -5 -7 5 -3 -5 17 1 11 0 3 6 -10 -5 -7 -5 -8 11 -7 -8 -5 -9 -9 -12 3 -7 1 -8 -18 -10 -25 17 8 -10 13 -13 5
5861 5 -10 -26 1 20 6 1 19 -15 37 22 69 -24 -23 22 89 -5 -18 -8 33 -7 8 44 21 2 8 -14 -1 -4 -19 4 -4 -3 3 -1 -8
5896 -8 -5 -18 -14 -13 -6 1 1 0 -4 -5 -11 0 1 -5 3 19 -18 -4 -9 3 10 1 10 10 4 7 7 -5 -4 -7 7 1 3 0 0 -8 -13 -2 -1 -1 -4 -1 -3 -5 -2 -4 -7 4 0 -13
5946 -13 -1 7 4 -1 -3 -6 -8 -2 6 -5 1 -6 -1 -3 9 1 5 1 4 3 -2 -2 4 -1 1 1 10 -3 6 8 4 2 -13 1 7 -1 -3 -2 -6 -7 -15 4 -12 -4 -5 -1 0 -12 -1 -3
5996 -3 -3 10 4 -7 -8 -9 -11 -5 8 2 2 2 -5 -1 -7 2 4 10 -5 -6 7 4 4 8 2 -7 2 -1 2 -7 -13 -10 4 3 0 -9 3 -2 2 -7 -11 -7 -12 -6 -6 -9 4 -1 -2 -15 -4
6047 -4 4 10 -6 -1 -14 5 -1 2 3 -8 13 7 -1 4 0 9 12 -6 6 1 -2 2 -4 5 0 -7 3 8 1 -4 -12 0 -13 -11 -2 0 -8 -13 -4 -6 -8 -13 4 -7 -6 -3 -4 -2 2
6096 2 0 0 1 8 2 7 4 2 9 2 5 9 -8 2 4 6 0 -8 -6 -5 -2 3 -5 -4 -3 8 8 -7 -12 -5 6 -8 0 1 -6 -7 -6 -11 -6 1 0 -12 -4 4 -5 6 1 -1 1 -3 2 6 -7
6149 -7 3 12 2 1 15 3 0 7 8 4 5 1 -8 9 -1 5 6 0 3 7 11 9 12 9 -9 -9 0 -4 2 -12 -3 13 -2 -10 0 4 4 1 7 5 3 8 3 5 3 6 7 -4 -1
6198 -1 11 7 6 10 9 5 -1 6 5 4 -2 -3 6 -7 -3 -2 -12 -1 -7 -6 -7 -14 -11 -3 -1 6 -6 -10 1 1 -11 -6 2 -8 -3 -8 0 -5 1 2 -3 -2 4 -4 -1 5 7 4 15 2 11
6249 11 -5 -2 12 5 3 -3 3 2 -2 0 2 12 -8 -2 -4 -8 -1 5 -1 -7 -14 -10 -11 -13 -1 -4 -2 -19 1 -7 -4 -6 3 -15 3 3 -3 1 -4 1 12 -1 4 6 0 8 -3 -4
6297 -4 -5 -4 2 5 8 1 18 3 0 5 -6 2 -8 5 0 -4 5 13 -6 1 2 2 -11 -4 -11 1 2 0 -9 1 3 5 2 0 -1 3 7 -2 3 9 7 6 10 12 2 14 -1 6 -1
6346 -1 4 1 2 4 3 1 0 11 6 6 -1 7 -12 7 -7 -4 -8 7 12 2 -3 22 -3 -4 -3 -6 -9 -5 -2 15 16 4 0 13 11 17 12 24 9 -2 4 12 -4 -8 16
6391 16 11 5 -7 13 -52 11 29 -3 7 3 13 13 -10 -6 -10 -17 -9 5 -5 -3 5 -8 14 -14 -2 27 0 -3 -6 -15 -1 -8 3 7 18 9 11 11 -27
6430 -27 25 13 6 5 -7 12 52 -24 11 25 -28 18 -10 5 9 -1 11 12 16 4 -1 -2 8 7 7 -4 -8 -15 -1 1 -23 -3 9 -1 -17 -8 6
6467 6 3 1 5 3 -2 -3 0 7 0 3 -5 8 7 0 -1 -6 -6 -3 1 4 -2 -2 -5 9 -5 4 7 9 -3 7 -10 -5 3 -1 -2 -3 -12 -13 -5 4 -1 -10 4 5 -12 4 -2 -6 -3 2 -13
6518 -13 -1 -5 -1 5 -2 5 11 7 1 -5 -3 7 2 6 -2 5 4 3 6 6 -1 -1 -7 4 10 1 -4 5 -8 7 -9 -12 -7 6 3 5 0 -2 4 -7 -6 2 -7 -6 5 -3 8 5 -12
6567 -12 12 6 9 4 17 14 -2 11 10 0 7 -6 6 5 17 -6 7 -11 21 34 2 13 -12 0 4 4 2 4 4 2 -7 1 -3 -2 -8 -1 -4 -2 2 0 0 2 -7
6610 -7 0 2 -4 -10 -4 13 -2 13 -23 3 -8 -10 24 -3 -32 0 -6 -17 -32 -22 19 -15 -2 -3 -24 -17 8 10 2 -4 -10 23 -9 -32 -5 24 -2
6647 -2 -35 -56 13 -17 2 -1 13 31 13 0 -12 7 -13 -18 -12 11 14 9 -4 10 8 0 9 11 8 -1 0 3 0 8 4 0 -2 -4 6 1 -1 2 7 -11 -6 -14 0
6690 0 -2 -16 -5 -14 -11 -13 -14 -3 -8 -8 -7 0 6 1 -5 -14 7 2 6 3 0 -1 7 10 0 7 5 6 -1 6 8 7 0 4 4 -6 -8 -15 6 -2 -2 -10 0 -3 1 -7 -1 -1 -12 1 7
6741 7 -6 -4 -5 -10 -6 -5 -4 4 7 -13 4 5 -8 0 8 -1 -5 -1 0 -3 5 -6 6 4 1 4 7 7 3 7 0 -1 1 -4 -4 2 -11 -6 -14 -9 -2 2 -3 -11 -16 -1 -12 -14 -4 -14
6791 -14 -4 -13 3 -13 -12 -9 -4 -4 2 -1 -2 -1 4 -3 -9 14 2 -17 9 7 10 3 1 -8 -2 -1 -7 -1 -8 5 1 -2 4 1 -1 0 -12 2 -8 -2 -6 -3 -16 -10 -11 4 -4
6838 -4 -14 -12 -4 -3 0 -8 -8 6 1 -5 7 -4 -2 7 9 3 -14 7 5 5 -5 0 0 -1 -15 3 -2 -5 -15 0 -5 2 -11 17 -3 -10 -5 2 5 -6 -2 -24 5 -2
6882 -2 -5 -29 12 4 -7 -7 13 17 -26 19 5 1 -35 8 -20 -1 -2 20 -8 6 -34 -29 -9 20 21 -30 12 14 -11 -5 33 27 29 -13 -17 -14 23 20
6920 20 -17 25 -4 9 20 -16 -25 7 -39 -4 24 -22 -20 5 -10 -46 16 -27 -13 -25 -3 -17 2 30 19 1 9 -1 4 10 -13 -67 -1
6953 -1 -19 -22 21 -15 58 -73 23 -2 -29 -34 -2 -32 26 -45 -8 -33 -49 14 -60 -54 3 16 -31 7 16 -11 12 31 -27 -33 -39 -50 -43 -30
6987 -30 -57 41 -22 -13 -15 90 1 68 18 23 -48 2 20 56 92 8 23 91 -36 -5 -44 35 -84 -10 -23 13 25 -40 -3 -3 78
7018 78 24 -12 3 -5 36 -33 -67 -8 6 -31 -18 -33 26 -31 11 9 6 18 25 -6 9 -7 41 -6 -4 7 -12 3 -5 27 -7 2 6 14 -13
7053 -13 -11 13 35 -15 5 -6 35 -7 -25 -22 0 -37 -28 30 9 -64 -40 32 37 57 43 -21 -25 19 -73 20 -19 10 -17 52 20 -76 -26
7086 -26 -36 -3 -11 24 -2 2 -9 -2 3 -23 5 0 -9 -4 -12 1 6 -3 -2 4 -1 -5 -2 -10 -9 -7 -3 -8 -7 -10 -10 -6 -4 -7 -5 -3 1 -10 -10 -14 -8 0 6 -8 -2 -2 -10 -5 -1 6
7136 6 0 -6 -5 1 -1 -3 7 0 -5 12 2 -7 6 -2 -6 3 3 7 -4 2 -2 -3 -12 -13 -3 0 -11 -4 -1 -7 2 -3 -1 0 -4 1 -1 -7 -4 0 5 11 2 -5 0 0 4 -1 6 0 10 -6
7188 -6 -2 8 1 3 7 10 -2 7 5 5 3 1 -5 -15 3 -7 1 -7 -7 -5 -1 2 -12 -1 2 3 1 -12 0 -9 0 -9 0 -6 7 2 -3 3 5 8 -11 0 1 1 -7 2 4 3 -8
7237 -8 2 6 2 0 -4 -5 2 8 -3 -5 -8 2 -5 -5 -11 -8 -10 -5 -15 -6 2 -10 -13 -7 -1 -4 -14 -13 -13 -12 1 -6 0 4 -9 -6 7 -3 -1 -3 3 -5 8 8 2 -1 1 -3 -3 5
7287 5 2 9 -1 -8 5 -2 -2 7 0 -2 -6 -2 -10 -9 0 -1 -10 -2 -4 -11 -8 -4 -8 -8 -9 3 -8 -2 1 12 -3 3 -11 0 -6 6 -1 13 1 3 3 -18 -1 1 3 4 -1 8
7335 8 11 -1 6 6 -15 -5 -7 -7 -14 -12 1 -3 -3 -11 -5 -6 -6 -3 -6 -9 -10 -3 -11 -5 -12 6 -4 8 -4 -1 6 -8 5 -2 -4 0 4 7 7 7 6 -6 -2 -7 2 7 8 -4 4
7384 4 -3 -16 2 4 9 9 0 -4 -8 -6 1 -2 -1 10 -6 -2 -10 -1 1 -5 -4 1 6 -5 -7 -4 11 4 -4 3 7 10 8 5 -3 -3 -2 8 11 12 3 2 4 -5 1 -2 -7 -5 -2 -2 -4 0 -12
7437 -12 3 -4 -15 1 -11 -5 -8 2 -11 -7 -2 -21 -11 -6 0 -5 -6 3 -1 -9 -13 -43 -29 -17 52 9 10 -14 -2 21 -9 -7 -11 -2 6 2 -2 -3 -2 -2 -4 -4 5
7480 5 -2 -14 -5 -10 3 2 -14 2 -9 -4 -12 -22 -6 -12 -11 -10 -1 -10 -1 -10 -12 -8 1 -9 0 -2 -1 8 -4 -11 -4 -4 -8 1 1 8 -3 4 1 4 13 -3 -12 2 8 0 -6 -3 -11
7529 -11 -1 8 -1 -6 -3 -3 -3 -6 -5 -11 26 15 -8 1 -13 -25 -6 7 -26 -6 -3 -24 -30 6 29 6 -10 0 12 40 -42 -6 -27 -50 -51 -34 36
7566 36 48 5 -47 0 -19 50 -24 -27 -5 -12 8 -9 -26 2 -7 -9 -12 -2 -3 -3 -17 -14 -1 -1 -6 7 3 11 2 -7 -2 -18 -3 -5 4 -7 -8 -1 1 1 0
7607 0 -11 2 -4 1 8 1 11 3 3 -7 2 -1 4 4 0 0 -14 -1 -8 -4 -2 -5 10 -2 -10 -15 -12 -9 -7 -11 -7 -8 -11 -5 -10 -7 -13 2 -3 4 0 -12 -2 -5 -7 5 0 1 -1
7656 -1 7 9 11 4 2 5 8 7 10 1 -9 9 5 3 -16 -2 -2 -5 -9 -12 3 -15 -7 -8 -7 -9 -9 -15 2 -15 -7 -8 -3 2 -4 -9 9 4 8 -6 -2 1 -13 -3 3 0 -1 8 3
7705 3 -2 3 -2 1 -4 2 -7 6 2 -6 4 1 -11 -13 -8 -9 0 1 -4 -8 -3 -13 1 3 -2 -15 -3 -6 -4 -7 -3 -3 -9 -4 -5 -5 10 -4 10 14 12 -1 0 10 4 9 8 19
7753 19 7 1 -9 -2 -6 6 -9 4 3 4 -4 -3 1 -4 1 -1 -5 3 8 -3 8 1 4 -3 5 0 -3 -14 -6 -13 -5 -11 3 0 0 -3 6 -2 2 -1 1 -5 6 -5 -18 3 -2
7800 -2 0 -2 7 1 -4 5 -2 0 -6 0 3 -5 -11 -11 5 -16 -6 2 -10 -4 -8 -4 2 -10 1 -1 1 -16 -1 -5 2 -6 -10 -1 -2 7 13 -1 -2 1 -3 14 1 0 2 8 4 10 0
7849 0 4 9 24 -17 -19 9 -46 18 23 -4 -6 28 -53 -56 42 2 -7 -70 9 -20 47 54 11 -59 11 -23 24 27 -2 10 6 12 -19 24 -18 -3
7885 -3 -9 35 -13 21 -17 17 6 15 8 -39 18 -15 -1 6 -10 -13 -10 -11 -11 -6 10 -2 -13 -24 -17 -9 -13 3 -17 5 -20 2 -26 -63 -12 -11 -8 -8
7923 -8 -6 -7 -7 -9 2 -11 -9 -3 2 9 4 0 3 -1 1 -1 -3 -6 4 -3 5 -12 7 -11 1 -3 -16 5 -7 -4 -6 -4 -5 -9 -3 -12 -5 -6 -12 -15 1 -9 -6 -10 -11 5 2 -5
7971 -5 -4 -6 -6 -2 -7 -7 -8 -8 -1 -15 12 -1 3 1 11 16 3 7 11 -1 3 -2 5 -4 3 4 -3 -7 -4 -12 -12 6 -6 -12 -17 -1 -7 4 -5 -3 2 -10 -19 -12 3 1 -23 -33
8019 -33 18 -18 -6 21 26 11 14 -22 2 -12 22 -4 13 12 0 0 -29 -19 18 28 -19 -18 -29 19 -30 -6 -6 -50 17 -4 -7 1 1 28 7
8054 7 36 -32 -19 -2 -2 12 -13 0 37 -22 18 -31 -27 60 53 8 -14 14 -5 14 0 12 17 7 20 2 -9 11 -13 -33 -3 39 -11
8087 -11 -5 -14 15 -3 -30 46 -51 16 -11 -13 -8 6 -27 6 -29 -19 0 -12 -32 -2 -34 29 -7 -9 -31 -23 -22 10 23 -3 -12 -8 -8 -23 -16 24
8123 24 11 18 21 -4 8 -18 3 18 -21 41 -7 -5 -51 12 -7 3 -7 -41 -8 -33 -13 -15 17 6 -3 13 -27 10 -14 -53 -47 -14 -4
8156 -4 -27 0 -12 -4 -42 -15 -48 -8 -21 0 22 -21 3 8 25 1 -6 7 0 13 8 14 -14 -30 -15 -18 -32 -6 -12 1 20 -13 -12 22 17
8191A7
##END NTUPLES=NMR FID
##END=
