##TITLE=1H_LY-15Dix.4.B
 CD3CN, 8 sc, 
 4.06.2021
##JCAMPDX= 6.0         $$ Bruker NMR JCAMP-DX V2.0
##DATA TYPE= NMR FID
##DATA CLASS= NTUPLES
##ORIGIN= UXNMR, Bruker Analytische Messtechnik GmbH
##OWNER= root
$$ XWIN-NMR		Version 3.5
$$ Fri Jun  4 10:05:55 2021 Russian Standard Time (UT+4h)  she@DPX200
##.OBSERVE FREQUENCY= 200.131506
##.OBSERVE NUCLEUS= ^1H
##.DELAY= (6, 6)
##.ACQUISITION MODE= SIMULTANEOUS
##.ACQUISITION SCHEME= undefined
##.AVERAGES= 8
##.DIGITISER RES= 18
##SPECTROMETER/DATA SYSTEM= spect
##.PULSE SEQUENCE= zg30
##.SOLVENT NAME= CDCl3
##.SHIFT REFERENCE= (INTERNAL, CDCl3, 0, 15.7039)
##AUDIT TRAIL= $$ (NUMBER, WHEN, WHO, WHERE, WHAT)
$$ ##TITLE= Audit trail, XWIN-NMR		Version 3.5
$$ ##JCAMPDX= 5.01
$$ ##ORIGIN= Bruker BioSpin GmbH
$$ ##OWNER= she
$$ F:/spectra/data/she/nmr/H-F/1/audita.txt
$$ ##AUDIT TRAIL=  $$ (NUMBER, WHEN, WHO, WHERE, WHAT)
(   1,<2021-06-04 10:04:38.59 +0400>,<she>,<DPX200>,
      <created by zg, POWCHK disabled, PULCHK disabled
       configuration hash MD5:
       00 E9 B6 7A A2 85 ED C7 34 08 36 98 17 FE 4E 26
       data hash MD5: 16K
       6C EB FF 54 EE 51 45 C6 B9 16 3C 68 E1 CA 0A 8E>)
$$ ##END=
$$ 
$$ hash MD5
$$ 7F 30 33 73 DE A2 82 E4 47 20 80 36 1B 2F A3 02
##$RELAX= 
##$RELAX= 
##$RELAX= 
##$RELAX= 
##$RELAX= 
##$RELAX= 
$$ Bruker specific parameters
$$ --------------------------
##$DU= <F:/spectra>
##$EXPNO= 1
##$NAME= <H-F>
##$PROCNO= 1
##$TYPE= <nmr>
##$USER= <she>
##$AMP= (0..31)
100 100 100 100 100 100 100 100 100 100 100 100 100 100 100 100 100 100 
100 100 100 100 100 100 100 100 100 100 100 100 100 100 
##$AQSEQ= 0
##$AQ_mod= 1
##$AUNM= <au_zg>
##$AUTOPOS= <>
##$BF1= 200.13
##$BF2= 200.13
##$BF3= 200.13
##$BF4= 200.13
##$BF5= 200.13
##$BF6= 200.13
##$BF7= 200.13
##$BF8= 200.13
##$BYTORDA= 1
##$CFDGTYP= 0
##$CFRGTYP= 5
##$CHEMSTR= <none>
##$CNST= (0..31)
1 1 145 1 1 1 1 1 1 1 1 1 1 1 1 1 1 1 1 1 1 1 1 1 1 1 1 1 1 1 1 1 
##$CPDPRG= <>
##$CPDPRG1= <>
##$CPDPRG2= <>
##$CPDPRG3= <>
##$CPDPRG4= <mlev>
##$CPDPRG5= <mlev>
##$CPDPRG6= <mlev>
##$CPDPRG7= <mlev>
##$CPDPRG8= <mlev>
##$CPDPRGB= <>
##$CPDPRGT= <>
##$D= (0..31)
0 1.2 0 0 0 0 0 0 0 0.06 0 0.03 0 0 0 0 0.0002 0 0 0 0 0 0 0 0 0 0 0 0 
0 0 0 
##$DATE= 1622786678
##$DBL= (0..7)
120 120 120 120 120 120 120 120 
##$DBP= (0..7)
150 150 150 150 150 150 150 150 
##$DBP07= 0
##$DBPNAM0= <>
##$DBPNAM1= <>
##$DBPNAM2= <>
##$DBPNAM3= <>
##$DBPNAM4= <>
##$DBPNAM5= <>
##$DBPNAM6= <>
##$DBPNAM7= <>
##$DBPOAL= (0..7)
0.5 0.5 0.5 0.5 0.5 0.5 0.5 0.5 
##$DBPOFFS= (0..7)
0 0 0 0 0 0 0 0 
##$DE= 6
##$DECBNUC= <off>
##$DECIM= 32
##$DECNUC= <off>
##$DECSTAT= 4
##$DIGMOD= 1
##$DIGTYP= 9
##$DL= (0..7)
0 120 120 120 120 120 120 120 
##$DP= (0..7)
150 150 150 150 150 150 150 150 
##$DP07= 0
##$DPNAME0= <>
##$DPNAME1= <>
##$DPNAME2= <>
##$DPNAME3= <>
##$DPNAME4= <>
##$DPNAME5= <>
##$DPNAME6= <>
##$DPNAME7= <>
##$DPOAL= (0..7)
0.5 0.5 0.5 0.5 0.5 0.5 0.5 0.5 
##$DPOFFS= (0..7)
0 0 0 0 0 0 0 0 
##$DQDMODE= 0
##$DR= 18
##$DS= 0
##$DSLIST= <SSSSSSSSSSSSSSS>
$$ [...]
##$SUBNAM2= <"">
##$SUBNAM3= <"">
##$SUBNAM4= <"">
##$SUBNAM5= <"">
##$SUBNAM6= <"">
##$SUBNAM7= <"">
##$SUBNAM8= <"">
##$SUBNAM9= <"">
##$SW= 20.0188882624521
##$SWIBOX= (0..15)
0 0 2 0 0 0 0 0 0 0 0 0 0 0 0 0 
##$SW_h= 4006.41025641026
##$TD= 16384
##$TD0= 1
##$TE= 0
##$TE2= 300
##$TE3= 300
##$TEG= 300
##$TL= (0..7)
0 120 120 120 120 120 120 120 
##$TP= (0..7)
150 150 150 150 150 150 150 150 
##$TP07= 0
##$TPNAME0= <>
##$TPNAME1= <>
##$TPNAME2= <>
##$TPNAME3= <>
##$TPNAME4= <>
##$TPNAME5= <>
##$TPNAME6= <>
##$TPNAME7= <>
##$TPOAL= (0..7)
0.5 0.5 0.5 0.5 0.5 0.5 0.5 0.5 
##$TPOFFS= (0..7)
0 0 0 0 0 0 0 0 
##$TUNHIN= 0
##$TUNHOUT= 0
##$TUNXOUT= 0
##$USERA1= <user>
##$USERA2= <user>
##$USERA3= <user>
##$USERA4= <user>
##$USERA5= <user>
##$V9= 5
##$VALIST= <valist>
##$VCLIST= <CCCCCCCCCCCCCCC>
##$VD= 0
##$VDLIST= <DDDDDDDDDDDDDDD>
##$VPLIST= <PPPPPPPPPPPPPPP>
##$VTLIST= <TTTTTTTTTTTTTTT>
##$WBST= 1024
##$WBSW= 4
##$XGAIN= (0..3)
0 0 0 0 
##$XL= 0
##$YL= 0
##$YMAX_a= 76570
##$YMIN_a= -85716
##$ZGOPTNS= <>
##$ZL1= 120
##$ZL2= 120
##$ZL3= 120
##$ZL4= 120
##$ABSF1= 10
##$ABSF2= 0
##$ABSG= 5
##$ABSL= 3
##$ALPHA= 0
##$AQORDER= 0
##$ASSFAC= 0
##$ASSFACI= 0
##$ASSFACX= 0
##$ASSWID= 0
##$AUNMP= <proc_1d>
##$AZFE= 0.1
##$AZFW= 0.1
##$BCFW= 1
##$BC_mod= 2
##$BYTORDP= 1
##$COROFFS= 0
##$CY= 11.3945322036743
##$DATMOD= 1
##$DC= 2
##$DFILT= <>
##$DTYPP= 0
##$F1P= 15.9154993809931
##$F2P= -4.1035820241983
##$FCOR= 0.5
##$FTSIZE= 0
##$FT_mod= 4
##$GAMMA= 1
##$GB= 0.15
##$INTBC= 1
##$INTSCL= 1
##$ISEN= 128
##$LB= 0.24
##$LEV0= 0
##$LPBIN= 0
##$MAXI= 10000
##$MC2= 0
##$MEAN= 0
##$ME_mod= 0
##$MI= 1.114404
##$NCOEF= 0
##$NC_proc= 0
##$NLEV= 6
##$NOISF1= 3.799351
##$NOISF2= 2.8
##$NSP= 1
##$NTH_PI= 0
##$NZP= 0
##$OFFSET= 15.70392
##$PC= 1
##$PHC0= -11204.18
##$PHC1= 14.00099
##$PH_mod= 1
##$PKNL= yes
##$PPARMOD= 0
##$PSCAL= 0
##$PSIGN= 0
##$REVERSE= no
##$SF= 200.130013532006
##$SI= 16384
##$SIGF1= 3
##$SIGF2= 2
##$SINO= 400
##$SIOLD= 16384
##$SREGLST= <1H.CDCl3>
##$SSB= 0
##$STSI= 0
##$STSR= 0
##$SW_p= 3612.71676300578
##$SYMM= 0
##$S_DEV= 0
##$TDeff= 0
##$TDoff= 0
##$TI= <>
##$TILT= no
##$TM1= 0
##$TM2= 0
##$TOPLEV= 0
##$USERP1= <user>
##$USERP2= <user>
##$USERP3= <user>
##$USERP4= <user>
##$USERP5= <user>
##$WDW= 1
##$XDIM= 8192
##$YMAX_p= 0
##$YMIN_p= 0
$$ End of Bruker specific parameters
$$ ---------------------------------
##NTUPLES= NMR FID
##VAR_NAME=  TIME,          FID/REAL,        FID/IMAG
##SYMBOL=    X,             R,               I
##VAR_TYPE=  INDEPENDENT,   DEPENDENT,       DEPENDENT
##VAR_FORM=  AFFN,          ASDF,            ASDF
##VAR_DIM=   8192,          8192,            8192
##UNITS=     SECONDS,       ARBITRARY UNITS, ARBITRARY UNITS
##FACTOR=    0.0002496,     1,               1
##FIRST=     0,             0,               0
##LAST=      2.0444736,     0,               0
##MIN=       0,             -85716,          0
##MAX=       2.0444736,     76570,           0
$$ Real data points
##PAGE= N=1
##DATA TABLE= (X++(R..R)), XYDATA
0@%%%%%%%%%%%%%%%%qJ6j6J6j6J8k6L2l3M1m9N7o5P4q9J01j12J27j45J66j86K06
38A09k32K61k92L25l58L97m40M84n35N93o56P21p94Q75r63J061j170J294j435
57g55J595j777J990k245K550k927L406m038M919o228Q409j2898L7074p4777l2735
72g8437J49999k6490j16412M9382R8528q5413n8638R8050K6914j07760J3781R5453
84E8957m7243p8234Q2564M8670j06127k0083J21976j2021j20695M0044J08364
95G6172o7394q3367Q7382N3190j00981j8826J03713j2491r4928M1847P3812o6438
107h309m5056Q5706J1957r6311K1058R7706n0516q7712P4164O7529r1399l9613
119f0796J01041Q325j02673K1664R4665m6789p6499O5819M9710p8119j8137Q2428
$$ y = [0, 0, 0, 0, 0, 0, 0, 0, 0, 0, 0, 0, 0, 0, 0, 0, 0, -8, 8, -8, 8, -8, 10, -16, 16, -17, 24, -25, 32, -33, 41, -48, 53, -59, 68, -77, 89, -97, 109, -123, 138, -154, 171, -187, 210, -230, 254, -281, 312, -344, 377, -417, 458, -505, 556, -614, 680, -755, 840, -937, 1053, -1192, 1358, -1569, 1837, -2201, 2718, -3510, 4899, -7999, 29075, -45702, -78437, 71562, 45072, -71340, -21958, 76570, -8843, -67481, 30569, 57483, -50277, -36496, 58957, 11714, -66520, 16044, 64714, -41413, -61496, 60480, 48459, -72236, -32192, 76172, 8778, -74589, 12793, 65983, -34998, -53824, 49889, 37398, -57530, -15683, 58129, -8309, -53365, 32341, 44298, -52013, -30955, 66751, 16235, -71477, 2687, 70216, -21183, -60796, 40245, 48570, -54103, -32439, 62226, 15437, -61062, 4757, 54467, -23652, -41789, 40639]
131D0639j5112p9345M5296O8605o8776m9920Q4116K4500r1727L787R1202l1409
143B1856q3098N4574O7668p0648m5608P8704J8941p8686R603P1526l6562n8350
155e0080N8264L9976p1976j6596P7966r020p6118L4224O7248n6238n2660P2360
167A7350L3922q0032j1524P9391j2448p1249L5261N6717n4171l7575O6553J5120
179C7315p1098Q757O7576l2024n6979N2311M0703o7868k1503P5891N37p5587K0619
192b1350O7655l9878n3418N4921L4236o4531j2770O7292q826o2356K9109N0742
204D0826m6245l3961N8888J4319o5478O150O5130k5537n7829M2571M4873n5161
216a1454k7297O2652P425o4280J2218N9267k9907m7823M4515L1699n4398j2536
$$ y = [40639, 25527, -53818, -8522, 60083, -8693, -58613, 25503, 50003, -41724, -37937, 53265, 21856, -61242, -6668, 61000, -9648, -55256, 23448, 42389, -36297, -26694, 44832, 8270, -50080, 8184, 48160, -23816, -40412, 37554, 28534, -47584, -13360, 53888, -2350, -55010, 17350, 51272, -28760, -40284, 39107, 26659, -44590, -9329, 47388, -6783, -44358, 22195, 37315, -33783, -25026, 42550, 10526, -46453, 5858, 46561, -21307, -42810, 33081, 33618, -41969, -21350, 46305, 6427, -46991, 7930, 42166, -22365, -35135, 32157, 23331, -39025, -9916, 40826, -5419, -39380, 19508, 33827, -31651, -25501, 39629, 14092, -43737, -1166, 43707, -11454, -38751, 23901, 31326, -32954, -20736, 38531, 8624, -39199, 5316, 37015, -17383, -29919]
228b9919N8507p824n6808K6967M9151m3182l6332N5015J9669o1487j166O1882
240C4473j7262n6264L3483M4736m6393k9055N4522J0952n6778Q020N3134k5947
252G621m4314M0652L0812n1050j4164N6527l405n6106K0338M9951l5072l8751
264c6961M6381K3948n3050p112N4553r774n0377K5368M1248l7962k7810M6518
276A4970J1424n0716N811N0015k1838m3973L5455L3247m5569j9116N1026K726
288B3462n1860J3790M7880k8424l9210L9587K6310m6596j0504M8889o564m6664
300b9904K2624L9943l5876k9167M5012J5345m9134M56M8302j6646m3329L0943
312a431L4690m1287k2629M7048Q298m7732P063M3702k1909l5840L4401K5142m2678
$$ y = [-29919, 28588, 20764, -36044, -9077, 40074, -3108, -39440, 15575, 35244, -26243, -27409, 34473, 17211, -39053, -5570, 39166, -7227, -36282, 18240, 29192, -27586, -19566, 33568, 7621, -36693, 3959, 34771, -16279, -30443, 26084, 22679, -33427, -13089, 36862, 1790, -36961, 9420, 33368, -19682, -26794, 27759, 17985, -32392, -7024, 34224, -3738, -31548, 14970, 26394, -24322, -18511, 31504, 9666, -34307, 1148, 34395, -11174, -30290, 20736, 23462, -28398, -14608, 33272, 4848, -34362, 5225, 31535, -15061, -25565, 23324, 16760, -29904, -7280, 32663, -3213, -32380, 12632, 27977, -21157, -20701, 27601, 10955, -32374, -1431, 33259, -8028, -30657, 16391, 24689, -23043, -15980, 27722, 5813, -30027, 4374, 29516, -13162]
325a3162j2240M5922k008m4031J6595L7940k9942k8807M0080J7430m5704m575
337b2502M6261q783m1752K1767L3076l3248k1966M1267R388m4505L888M2561j6960
350H492l5894K8782K5524l8301j3185M4000J58m4810J2476M0415k3976l1387L3683
363E977J9355m0523o132M3237o920m1130J8831L4353k8596k3468L5974J0213m0372
376a9201L271M0838j5413l6712K5486K8272l2939j6490L7655L081l9335R912L7409
389B5834k1005l1553K9208K1879l4392r292L6755m267l6277J6669L2338k6598
401g01k4917L3277J4352l6457j575L6590j1599l3982K3021K8351l1231j9633L5664
414A1160Q260l6387M640L4039j7223k9053K7559K1597l4265j1949L6689N20l5105
$$ y = [-13162, -25402, 20520, 18512, -25519, -8924, 29016, -926, -29733, 10347, 27777, -17927, -22502, 23759, 14976, -26776, -5009, 28067, -5181, -27147, 14120, 23508, -20997, -17109, 25452, 8492, -27402, 1380, 26904, -11397, -24582, 19418, 19576, -25234, -12758, 27657, 3681, -27706, 5977, 25332, -15191, -21323, 21914, 14994, -26136, -7305, 27048, -1548, -25016, 10958, 21171, -19201, -15930, 24908, 9495, -27217, -1731, 26541, -6398, -22888, 14767, 17848, -21487, -11575, 25834, 4829, -26724, 2484, 24363, -10029, -19321, 17434, 13167, -23110, -6441, 25897, -701, -25618, 7659, 22011, -14446, -16021, 20569, 8970, -25012, -1991, 26360, -4871, -24504, 11160, 19420, -16967, -12327, 21712, 4489, -24564, 2995, 24592, -9673, -21622, 15067, 15587, -19518]
427a9518J1777L0610k3085k3933L1582J5367l6114n426L6289n406l2479J6390
439c946K5929k6057j7761L2776Q537l5419J319L3734j1464k8379K1191K0621k9177
452h096j1581L4101K046l5056P387L1689j6485k4717K4762J5630l1016n751L4046
465A6959m127l3134J3298K8109k1389j9765K8018R617l2305Q74L3333j0588l0537
478b1637J8894K3934k5521j4527L0170L879l2251O616L1149j5741k6664K2735
490A036J8886k7554q777L0150j979l0161J1957K7248k0131k1434K5861J3044k9045
503a0899k973K9724p241k7903J6364K3549k3293j6629K7483P643k9008K433K8007
516A7257j2182k4515K0450J8738k6255j1004K9017J718k8874Q097K6145j7108
$$ y = [-19518, -7741, 22869, -216, -24149, 7433, 22800, -13314, -18740, 17549, 12143, -20336, -3946, 21983, -4074, -21835, 10941, 19478, -15941, -14622, 19112, 7648, -20731, 460, 21081, -8096, -19677, 14424, 16470, -18586, -11199, 20490, 4005, -20712, 4050, 19680, -11336, -17087, 16959, 12832, -20302, -7004, 21105, -284, -20049, 7969, 17586, -14719, -13845, 19488, 8900, -21637, -2743, 21191, -4330, -18857, 11313, 15192, -17059, -10443, 20706, 4965, -21699, 1036, 19922, -7632, -16409, 13741, 11762, -18399, -6442, 20806, 675, -20759, 5102, 18146, -10899, -13872, 15852, 8611, -19292, -2928, 20621, -2672, -19301, 8182, 15825, -13183, -10750, 17257, 5075, -19440, 1010, 19748, -6507, -17511, 11506, 13224, -15650, -7553, 18592, 1484]
528A484k1115K4146J4123k8433n636K9482l735k7547J2953K3041k0894j6496K6521
541G894Q504k9083L02K8391r309k4866J7511J9065k3843j1586K7651L180k8389
554a4578N467K6030j3663k1088K0609J4335k5412o348K7507k032k6614J0166K2924
567A7303j7393j6907K2898R369k6108j018K6629p257k4304J4770J9407k0945j2568
580a6124K4966M570k6483L853K5253j1804k1448J8506J5353k3412p771K5890n36
593A0813k5764Q744K2942j6021j7789K1639J0889k5074k989K5894n108k4053J2663
606c214J9828j8812j3648K3101O244k5021J623K4346r158k1109J5833J5821k0897
619e063r003K3864J513k4393N945K2377j2725j7978J8240J1768k2033m520K3733
$$ y = [1484, -19631, 4515, 18638, -9795, -15431, 14051, 10316, -17231, -4278, 18763, -2131, -18627, 7894, 16398, -12685, -12383, 16008, 6699, -18167, -656, 18409, -5434, -17020, 10631, 13811, -14578, -9111, 16919, 3256, -17832, 2777, 17112, -8300, -14648, 12859, 10827, -15787, -5621, 17303, -90, -16997, 5901, 15270, -10838, -11856, 14773, 7516, -16788, -2018, 17389, -3556, -16124, 8842, 13412, -13071, -9218, 16035, 4231, -17217, 1289, 16642, -6770, -14541, 11349, 10813, -14951, -6207, 16735, 714, -17075, 4564, 15453, -9621, -12610, 13284, 8176, -15877, -3214, 16614, -2198, -15846, 7255, 13499, -11522, -9899, 14447, 5289, -15820, 13, 15834, -5063, -14066, 9798, 11311, -13082, -7137, 15240, 2515, -15463, 2777, 14545, -7488, -12008, 11725]
632A1725l018k3038R980J9823j5948j4436K0375P485k2941R9K3317p485k1376
645a5438J3818J6986j8683j0653K1776L135k2950M604K2011j1563j8894J7052
657A201J3610k0625o681K2283j041k1894Q555J9629j4797j5416J9187R514k1415
670g890k330K1632n167j9954J2052J6648j7337j1755K0449N546k1322J535K0139
683A2246q669j7296J4833J3092j9215p725K1160J376k0786N413J8351j2022j4456
696a3698J7399R458k0767l721K1558k606j9880Q985J6211j4834j1241J9261N566
709A1691k1449M79K1024o562j8103J2363J3421j7214p665K0444J667k1289M259
722f934J9588r770j5497J4649R928j8360l741K0384k281k0090P687J7371j2364
$$ y = [11725, 8707, -14331, -4351, 15472, -476, -14912, 5463, 12948, -9993, -9894, 13423, 5938, -15438, -1620, 15366, -3317, -13970, 7806, 10941, -12009, -7405, 14606, 3043, -15851, 1201, 14811, -5814, -12495, 9788, 8747, -13147, -4592, 15037, 240, -15176, 4011, 13525, -7890, -10220, 11412, 6245, -13709, -1657, 14991, -2346, -14101, 6348, 11894, -9428, -7893, 12246, 3577, -13719, 1114, 14206, -5009, -12734, 8426, 9802, -10984, -5571, 12780, 758, -13698, 3701, 13159, -7608, -11329, 10229, 7623, -12257, -3272, 12939, -1895, -13136, 6125, 11691, -9758, -9279, 11745, 5183, -12920, -557, 12864, -4350, -12015, 8429, 10096, -11193, -6934, 12654, 2884, -12613, 2036, 11964, -6396, -10137, 10247, 7966, -12124, -4437, 12934, 570]
735E70j2587J6110O532j8688k13J9524n641j8263J0514J4735j4453r366J7199
748E973K978j8692L351J8475q931j6266J3199J1968j6166o075J7845n42j8174
761a1057O861J6889j1987j3736J5558Q816j7488k511J7989m132j7079J0159J4775
774A3057j4592j0822J7157N459j7866Q94J7115p247j5064J2638J1857j6254p469
787a1137J7772J991j7395M052J5536r862j2662J4440Q843j7135m261J7648j103
800F727j6273O686J3481j1915r847J5777N581j7667q63J7286m267j4977R362J1368
814A0459j3789o999J6790K308j7696K545J6373p318j3122J1844Q718j5388l763
827i038J7406j150j7237N800J4957r990j0888J3565N819j6032n32J6919m378j5823
$$ y = [570, -12017, 4093, 10625, -8063, -8276, 11248, 5607, -12656, -2142, 12593, -1860, -11226, 5973, 8951, -9741, -6390, 12085, 3154, -13112, 87, 12055, -4111, -10186, 7659, 7117, -11057, -4196, 12693, 706, -13030, 2528, 11344, -6144, -8655, 9334, 5202, -11877, -1718, 13057, -1535, -12357, 4800, 10259, -7607, -6713, 10402, 3155, -11909, 729, 12586, -3668, -11137, 6635, 8626, -8769, -4717, 10819, 957, -11705, 2735, 11578, -5557, -9818, 7830, 6727, -9546, -2860, 10621, -1294, -11141, 4636, 10217, -7450, -8313, 8973, 4706, -10271, -909, 10459, -3330, -10329, 6461, 8769, -8927, -6382, 9991, 2673, -10449, 1395, 10113, -5275, -9038, 8368, 7218, -10019, -4219, 10738, 748, -10140, 3425, 9244, -6788, -7320, 9599, 5221, -10602]
841a0602Q571J2753j2042q193J4536K899j5901K353J5715p005j3842J0637J0198
854A0077j3272n362J4781J0j5138N025J4074r258j1475J2312P466j4166k489J4800
868G385k775j4197P600J2325j1308r048J3688M631j4658N08J4372n589j2756J0011
882A89J0034j3150o202J4753J574j4799L411J3496q045j1010J1760P506j4076
895d559l268J4811j445j4012O028J1862j0044q739J2946M820j4371n13J4192l958
909C750j2643Q038R873j1322o250J3395K113j4034K183J3124o298j0898R845P657
923H533j2370l727J3648n04j3424M739J1806q449q986J1342N301j3096j044J3516
937G285l191j2469P162J0142j0402o830J2598K813j3455J464J2936n593j1094
$$ y = [-10602, -2031, 10722, -1320, -9513, 5023, 7922, -7979, -5626, 10089, 3084, -10758, -121, 10077, -3195, -8557, 6224, 6234, -8904, -3879, 10195, 937, -10538, 1774, 9240, -4926, -7415, 7385, 4610, -9587, -1987, 10338, -970, -10018, 3670, 8301, -6357, -5849, 8523, 2934, -9822, 189, 10223, -2927, -9129, 5624, 7198, -7601, -4190, 9306, 1261, -9749, 2011, 9517, -4559, -7827, 6984, 5539, -8473, -2445, 9417, -627, -9366, 3580, 8400, -5971, -6484, 7708, 3750, -8893, -855, 9018, -2304, -8554, 4841, 6954, -7080, -4897, 8227, 1929, -8969, 876, 8533, -3837, -7564, 6084, 5580, -7844, -3105, 8701, 252, -8734, 2608, 7909, -5187, -6231, 7285, 4094, -8375, -1213, 8929, -1473, -8303, 4295, 7108, -6347, -4883, 8053, 2460, -8634]
950h634R115Q132j1725m407J3062K37j3050L866J1699p600r207J0555N849j2447
964d555k034J2943j970j2139N757J0089q951p074J1288L448j2478L75J2340m103
978B936j0864P496Q284j0170m885J1894J184j2379K593J1505o037r369Q975O235
992G398j1076k475J2201j363j2043M917J0478p962p716J0284M097j1669j12J1992
1006F951l736j1126O984Q938r455n714J1009J808j1653K188J1242n768r742Q535
1020D61P089j0335l637J1130l06j0983M154J0002p377q019R562N141j0694j531
1034e343J0809k290j0056N958Q529q729o208J0387L141j0846N01J0224m197q839
1048f959P579O741r972m028J1074Q33j0847K603R552o100p479R052M850j0793
$$ y = [-8634, 481, 8613, -3112, -7519, 5543, 5780, -7270, -3404, 8295, 695, -8512, 2043, 7892, -4555, -6589, 6354, 4384, -7755, -1998, 8091, -860, -7934, 3354, 6802, -5676, -5301, 7039, 2936, -7928, -432, 7852, -2318, -7203, 4691, 5875, -6504, -3911, 7594, 1557, -7812, 1163, 7398, -3678, -6153, 6048, 4685, -7358, -2441, 8037, 75, -7641, 2643, 6740, -4929, -5041, 6951, 3215, -7911, -927, 8011, -1444, -7158, 3851, 5659, -5994, -3806, 7436, 1668, -8074, 461, 7550, -2785, -6422, 4708, 4402, -6581, -2427, 7575, 198, -7821, 1741, 6882, -3812, -5343, 5466, 3176, -6880, -922, 7607, -1122, -7330, 3057, 6198, -4648, -4147, 6077, 1880, -6959, 620, 7361, -2611, -6639, 4435, 5268, -5579, -2976, 6576, 476, -7003, 2049, 6899, -3894]
1062c894j964J1166j247j0297M553Q355p668n700R974K770j1159K77J0911l285
1076B792r315O083O848q639l876J0353Q02j0756K040J0045m838p926P181N004
1090E798r132j692J0130j023j0269L781Q954o102o571Q025L441r356j40R919k840
1105B923r393N394P668p426m902Q907J382r521J780R591m823q360O923O310q487
1120b034l210R271l81r422L794Q630o426o993Q155M496r122j179R216k276q663
1135f144N325P483p610n433Q900K649r045M88Q597l814p550O586N932q375l759
1150e770R208J011q878J957P910n020o372P495M397q930j972R147p13q431L632
1165a329O966o410n015Q435K671r292k52R113k431p821N112N763p464l420R002
$$ y = [-3894, -5858, 5308, 4061, -6236, -1683, 6672, -996, -6696, 3278, 6048, -5111, -4834, 6077, 2792, -6523, -440, 6408, -2231, -6107, 4246, 5048, -5708, -3668, 6377, 1539, -6387, 794, 5798, -3334, -5026, 5104, 4081, -6188, -2407, 6547, 445, -6126, 1899, 5340, -4016, -4156, 5763, 2923, -6470, -1076, 6592, -834, -5736, 3171, 4553, -4968, -3188, 6403, 1580, -6780, 143, 6453, -2034, -5244, 4027, 3646, -5776, -1982, 6648, 222, -6771, 1384, 5880, -3242, -4421, 4795, 2519, -6144, -819, 6664, -946, -6379, 2521, 5170, -3875, -3387, 5210, 1396, -6154, 432, 6364, -2011, -5770, 3438, 4449, -4429, -2472, 5438, 418, -5954, 1541, 5938, -2992, -4964, 4183, 3470, -4961, -1329, 5637, -773, -5788, 2647, 5318, -3974, -4226, 4887, 2456, -5365, -253, 5510, -1954, -5374, 3628]
1180C628R17r400J630Q607m070o802O308M384q147j737R175q87r083L258P852
1195E633n399n488P096K848q362j37Q712k360q184M655O532o292m162P600J384
1210D076q265J336Q174l755p204N664N279p020k706P832k06q037L026P382n167
1225D09o043O748L797p574j160P894j622p651M371O428o344m649P591K264q038
1240c579N50P788l360o769N575N279p277l108Q027O35p974K033P170m472n772
1255e254O436L832p626j593P974q89p492L357O307n441m616O952K463p730j08
1270c428P655k275o739M394N264o117l324P310R90p644J417P148l668n926N588
1285F45M147o952j891P561n23p413K854O470m931m844O518K760p390l87P487k066
$$ y = [3628, 4545, -4855, -3225, 5382, 1312, -5490, 818, 5202, -2945, -4682, 4493, 3606, -5477, -2219, 5633, 234, -5254, 1842, 4690, -3672, -3809, 4903, 2543, -5641, -986, 5546, -746, -4908, 2692, 4076, -4189, -2853, 5321, 1566, -5638, 26, 5305, -1715, -4421, 3411, 3205, -4832, -1806, 5576, 409, -5634, 1114, 4911, -2663, -3823, 4071, 2449, -5202, -831, 5597, -747, -5396, 2195, 4459, -3579, -3029, 4759, 1399, -5370, 205, 5484, -1793, -4901, 3126, 3761, -4213, -2180, 4990, 518, -5254, 1182, 5014, -2612, -4205, 3769, 2880, -4612, -1255, 5052, -389, -5005, 1947, 4410, -3320, -3428, 4227, 1952, -4787, -393, 4871, -1246, -4570, 2740, 3730, -3914, -2497, 4651, 983, -4943, 645, 4792, -2160, -4051, 3510, 2987, -4426, -1572, 4898, -33, -4877, 1641, 4401, -2989, -3376, 4111, 2045]
1301B045o853M277N512o012l626P118J393p474R74P046l272n926N201M269o627
1316a955k238P331K5p206K220O349m250m950N874L076o890r51P201j191o694L277
1332i72N474n077l777O416J771p086L73O986k441o075M322M520n845k544O853
1347B898L18p126J796O586l687n250N283L308o452j091P002j181o839L185N923
1362D673m807m258N967K067o643K47O750k427o205M211M945n475l070O269Q30
1377C074o552J473O274l473n447M975M020n877j981O266l11o137K532N555m402
1392a1m477N693K851o257p21O159j416n724L602M713n282l383O240J654o545N91
1408b313N845k665n004M732L679o168k114O703L34o424J726N517l765m193N422
$$ y = [2045, -4808, -531, 4981, -1031, -4657, 2461, 3854, -3620, -2646, 4400, 1128, -4798, 403, 4672, -1955, -4193, 3138, 3163, -4043, -1823, 4526, 276, -4674, 1200, 4276, -2614, -3565, 3636, 2445, -4249, -972, 4502, -575, -4352, 2064, 3835, -3251, -2878, 4108, 1667, -4408, -86, 4434, -1411, -3955, 2898, 3216, -3910, -2114, 4472, 785, -4465, 818, 4126, -2326, -3417, 3585, 2404, -4435, -1250, 4673, -134, -4392, 1575, 3642, -3001, -2754, 3996, 1569, -4636, -425, 4520, -955, -4025, 2244, 3074, -3478, -2005, 4269, 796, -4651, 324, 4344, -1533, -3514, 2752, 2441, -3696, -1164, 4391, -11, -4488, 1205, 4056, -2201, -2922, 3237, 1821, -3903, -301, 4412, -870, -4253, 1987, 3641, -2904, -2313, 3532, 867, -4137, 595, 4274, -1894, -4008, 2695, 3029, -3395, -1669, 3848, 83, -4110, 1312]
1423A312K644o499r32O690q94o006K734M802m534l156N889J479o590K31O437j907
1439A700n481L558L982n002k152O034L40o418J317N976k850m755M264L022n433
1454a898j057O131q22o196K425N438l791l976M900K013n710J18O032k054n718
1469d165L561M639m715k926N492Q29n866J328N735l145n035M452L683n259j766
1484c158N659l73n636K452N151m048m174N079K685n558p36N553j345n145L268
1499c26M403m678l235N433J646n616K61N290k247m593M013L547n194k252N701
1514B153N75n567J299M915l176l895M698K608n616j110N802o30n326K443M312
1529C485m127k975N381J493n925Q1N731j747m866L360L536m718j952N637L72n877
$$ y = [1312, 3956, -2543, -3475, 3215, 2321, -3685, -951, 3851, -683, -3839, 2050, 3529, -3061, -2830, 3607, 1700, -3781, -223, 3759, -1243, -3395, 2639, 2979, -3439, -2122, 3854, 1004, -3751, 513, 3535, -1898, -2955, 3176, 2354, -3842, -1417, 4021, 230, -3746, 1154, 3167, -2543, -2425, 3607, 1553, -4165, -604, 4035, -680, -3606, 1886, 2715, -3151, -1823, 3912, 767, -4268, 184, 3867, -1392, -3158, 2501, 2128, -3508, -1056, 4095, 47, -4127, 952, 3637, -1921, -2657, 2896, 1551, -3594, -326, 4077, -601, -3836, 1597, 3243, -2373, -2112, 3178, 931, -3662, 351, 3898, -1296, -3548, 2153, 2728, -2839, -1540, 3375, 199, -3696, 1002, 3610, -2006, -3116, 2686, 2056, -3270, -827, 3485, -642, -3617, 1764, 3257, -2668, -2587, 3144, 1397, -3469, -109, 3427, -1291, -3243, 2394, 2766, -3111]
1545c111J210N354k671m241M032K729n105j005N634n92n527K063M758l348l491
1560c311M467J750n159o9N472j511n131K849M155m022k648M791Q87n255R00N150
1576C315k402m539L696L341m663j675N115j65n172J964M756l420l808M469K400
1591C212n065o54N191j211m857K915M100m161k885M953J337n221M18M995k139
1606I28m352L637L314m633j971N142L81n119J279M602k840l706M086K449m866
1621a669r84N146o25m875K160M104l539k982M515J589n012k6M981j567m455L024
1637b15L429m173k083M875N56n080J072M752k560l906L789K695m671j149N025
1652B356m69m848K076M222l430l139M403J778m929k03M910j360m440K830L547
$$ y = [-3111, -1901, 3453, 782, -3459, 573, 3302, -1803, -2808, 2826, 2234, -3293, -1230, 3528, 180, -3311, 1156, 2906, -2253, -2322, 3150, 1639, -3492, -643, 3512, -510, -3158, 1633, 2520, -2735, -1835, 3315, 913, -3626, 70, 3411, -1252, -2927, 2188, 2023, -3149, -1185, 3571, 151, -3657, 812, 3212, -1853, -2507, 2684, 1473, -3384, -469, 3631, -530, -3415, 1538, 2875, -2346, -1928, 3067, 928, -3424, 213, 3527, -1106, -3077, 2065, 2446, -2673, -1394, 3208, 368, -3338, 748, 3197, -1669, -2653, 2493, 1868, -3007, -847, 3257, -282, -3264, 1251, 2840, -2172, -2198, 2783, 1216, -3239, -215, 3214, -959, -3042, 1833, 2389, -2691, -1619, 3133, 573, -3333, 456, 3151, -1520, -2669, 2356, 1887, -2961, -885, 3337, -93, -3232, 1171, 2949, -1980, -2183, 2727, 1367, -3073, -243, 3304]
1667C304l978k360M692R33m907N70M615k095l882L383K829m337j529M803R0m786
1683b655J362M228k767l249L873K042m610o64M813p85m482K200L638l426k426
1698b908M358J058m828M00M736j738m089K969K973l971j546M632O1m768J372M383
1714C094k605l483L598K145m299o32M656q58m546K148L916l179k835L908J369
1729B397m332J65M428j627m106K780L319l598k119M063O32m275R31M129k287l610
1745c110L311K676l915j369M152j81m086J745L702k988k979L846J918m204n24
1760b006M169j039l767K510L135l627k228M253J058m326L24L964j818l296L137
1775D43K424m059j427M438K54m273J042L639k381k760L500J756m225o81M385m61
$$ y = [3304, -674, -3034, 1658, 2591, -2316, -1746, 2869, 774, -3108, 275, 3104, -1233, -2762, 2041, 2131, -2655, -1293, 2935, 168, -3081, 792, 2834, -1776, -2440, 2373, 1588, -2894, -694, 2944, -482, -2908, 1450, 2508, -2320, -1920, 2816, 1078, -3011, -42, 2931, -1040, -2586, 2046, 2107, -2661, -1289, 3094, 489, -2994, 604, 2749, -1550, -2182, 2474, 1616, -2930, -782, 3134, -45, -2880, 1028, 2397, -1935, -1770, 2658, 1031, -3075, -295, 3024, -574, -2693, 1370, 2002, -2273, -1342, 2787, 500, -3110, 201, 2877, -1038, -2407, 1745, 1564, -2522, -777, 2925, -63, -3042, 804, 2722, -1482, -2006, 2163, 1124, -2643, -133, 3002, -625, -2853, 1400, 2458, -1868, -1544, 2420, 602, -2694, 443, 2867, -1192, -2619, 1819, 2073, -2200, -1158, 2481, 100, -2660, 840, 2596, -1629, -2310, 2075, 1614]
1791A614l990J657L170k832k156L784J065m294J8M254j075l658K153K661l175
1806h04j438L923K90m260Q36M008j817l224K735K061l523p05M010n51m079J641
1822h97L620k531k636L219J319l742Q8L945j360l762K351L091l055j992L528N85
1838A771l756Q11L697j995l299K835K492l351j307L580q8l574J424L340k501k788
1854b709L184J928l512p25L548o39l340J928K897k903k192L465J239l627J0L452
1870B004j325l030K504K387l339j531L706M81l645P40L216j983k545K999J709
1885B348l646p47L784l11l487J463K834k538j995L334J074l752p0L673r43l171
1901b150J958K374k880j418L489M45l704N37L472j497k808K364J902l064q86L519
$$ y = [1614, -2376, -719, 2451, -381, -2537, 1247, 2312, -1982, -1964, 2290, 1215, -2443, -290, 2371, -804, -2242, 1681, 1971, -2289, -1453, 2555, 738, -2486, 249, 2310, -1213, -1918, 2092, 1541, -2538, -897, 2723, 192, -2444, 775, 2094, -1648, -1560, 2385, 1025, -2737, -386, 2705, -350, -2342, 1186, 1771, -1985, -1174, 2523, 528, -2771, 64, 2556, -795, -2102, 1478, 1390, -2184, -760, 2580, 79, -2709, 475, 2403, -1109, -1834, 1714, 1075, -2265, -337, 2560, -343, -2535, 930, 2169, -1458, -1448, 2004, 679, -2351, 153, 2540, -799, -2330, 1376, 1857, -1788, -1048, 2168, 185, -2360, 639, 2348, -1298, -2045, 1739, 1428, -2059, -596, 2238, -300, -2295, 1039, 2113, -1639, -1709, 1964, 1021, -2150, -192, 2182, -698, -2116, 1373, 1818, -1886, -1349, 2123, 626, -2182, 182, 2084, -980, -1866, 1653]
1917A653j52l552J113L143j959k366K696J346l237k47L469p91l322J708K762k478
1933b14j845L026P25l333M18L332j455k950K268K215k874j186L232K2l308J095
1949h32L084k034k527K717J661l108n98L240n57l078J594K666k425j991K967J088
1965A867l211l0L164j029k847J980K262k674j472L076N10l176N28K980j513k508
1981b093K353J791k922q99L180j10l093J103K710k005k067K688J221l086k39L159
1997A691p75k888J707K336k451j546K949N90l147M21L012j371k594K167J916k743
2013g26j027L025L1l013R67K715j861k164K518J426k917n29L020m47k823J391
2029d14K395k180j760K720R61k976k5K891r30k542J821J983k513j264K922M29
$$ y = [1653, 1501, -2051, -938, 2205, 246, -2120, 576, 1922, -1315, -1562, 1907, 1116, -2206, -498, 2264, -214, -2059, 967, 1692, -1641, -1223, 2109, 654, -2296, -28, 2187, -687, -1873, 1359, 1381, -1927, -832, 2252, 218, -2309, 408, 2069, -1039, -1637, 1603, 1046, -2032, -438, 2228, -197, -2188, 779, 1867, -1344, -1374, 1790, 761, -2086, -106, 2156, -518, -1990, 1086, 1596, -1580, -1052, 1928, 415, -2093, 260, 2051, -871, -1770, 1410, 1300, -1793, -690, 2020, 15, -2052, 636, 1857, -1229, -1468, 1691, 916, -1972, -265, 2071, -380, -1926, 1023, 1613, -1534, -1113, 1899, 528, -2066, 101, 2017, -726, -1753, 1272, 1303, -1710, -743, 1972, 111, -2053, 465, 1891, -1026, -1555, 1465, 1018, -1805, -414, 1981, -199, -1959, 761, 1722, -1254, -1279, 1612, 682, -1860, -39, 1944, -569, -1833, 1089, 1518]
2045A518k997M85K738j402k198K199J502k790o69L022j92k893J071K437j894j763
2061a826K574R39k970q9L018p41k719J526K078k205j269K734L71k973M71K892
2077A811j241k423J885J690k431q00K794r0k909R13K681j599k105K143J273k553
2093i61l17K763o04k718J387K367j968j718K395P97k635J96K693j106k511J848
2109i2K000k295j224K536K39k608P94K491j685k143K280J556k583p06K612k75
2125H97k484J282K158k064j704K563J033k700j95K581p73k270J678J828k358j278
2141a806K709N91k702K31K423j146j973J973J435k567q11K790J28k663O76K235
2157A523j496j652K229J004k705l16K801l63k528J111J948j851j206K450M46k779
$$ y = [1518, -1479, -994, 1744, 342, -1856, 343, 1845, -945, -1614, 1408, 1216, -1677, -606, 1831, -63, -1826, 748, 1687, -1283, -1372, 1646, 905, -1814, -288, 1790, -415, -1684, 1050, 1421, -1552, -1081, 1811, 570, -1853, 32, 1722, -709, -1509, 1285, 1195, -1714, -801, 1880, 281, -1824, 319, 1592, -961, -1278, 1485, 881, -1837, -450, 1917, -51, -1769, 626, 1423, -1212, -1016, 1677, 571, -1940, -92, 1908, -387, -1611, 925, 1164, -1444, -650, 1841, 156, -1987, 293, 1849, -734, -1440, 1172, 897, -1587, -305, 1853, -211, -1915, 648, 1681, -1019, -1214, 1367, 594, -1676, 2, 1830, -528, -1806, 903, 1494, -1208, -977, 1446, 300, -1673, 300, 1735, -832, -1643, 1147, 1275, -1388, -712, 1523, 27, -1625, 604, 1608, -1097, -1413, 1388, 1025, -1503, -392, 1556, -295, -1501, 949, 1395, -1384]
2173a384K71K725r43k276J566J581k166p34K579r0k721P84K519j392j942J905
2189B82J130k333k34K564n63k584J230K262j748j615K118P49k367J64K461r70
2205E46k328J591J918k005j216K260L49k376N74K320j345k074J898J576k230p84
2221a326K330j16k276J010K073j746j687K206J090k412k67K356o19k135J445J765
2237A691k075j242K390N63k430K25K236j070j872J792J400k313p94K490J06k390
2253a293O50K061j389j593K004J032k375m01K461k75k252R91J842j665j275K193
2269G16O55k445kK420o82k095J337J580j902r25K295K18k411M61K224j103j805
2286a464J682J194k138m97K381k36k344Q90K025j486j465J935P63k231k2K317
$$ y = [-1384, -1113, 1612, 669, -1607, -41, 1540, -626, -1360, 1219, 1129, -1592, -808, 1711, 319, -1623, 282, 1412, -921, -1155, 1409, 846, -1738, -508, 1754, 6, -1609, 509, 1258, -1109, -945, 1516, 546, -1782, -191, 1727, -278, -1494, 766, 1115, -1261, -687, 1633, 288, -1786, 112, 1688, -542, -1326, 1004, 888, -1388, -378, 1695, -51, -1738, 468, 1558, -854, -1121, 1235, 616, -1519, -74, 1691, -384, -1626, 764, 1327, -1103, -878, 1358, 288, -1584, 208, 1608, -705, -1499, 991, 1097, -1293, -643, 1418, 29, -1564, 440, 1472, -903, -1304, 1157, 882, -1370, -379, 1463, -202, -1477, 716, 1371, -1074, -1076, 1344, 662, -1433, -96, 1484, -418, -1343, 952, 1170, -1241, -780, 1444, 341, -1464, 218, 1412, -726, -1223, 1158, 922, -1422, -532, 1493, 7, -1458, 477, 1240, -991, -1013, 1304]
2302A304o87k158J300J728j782j105K116L70k250L73K200j041j910J587J408j956
2318e03p40K180Qk192P08K027j338j638J821J074k116l84K216l44k120J048J807
2335A514j617j307J982O71k188M8K152p75j909J383J504j884r08K151K05k204
2351a182M92K044j158j665J680J120k045m40K188k62k120R27J831j481j354J902
2367D77P64k124o1K147o24j963J241J590j696j047K003L91k106L04K029r77j774
2384a426J531J331j890p54K055P4k051O46J849j295j507J762R89k031l74K095
2400A004l38j928J013J626j622j166J987O00k122O4K010p45j707J374J282j867
2416e35p43K118J65k110M65J873j079j445J637R39k014l85K156j83k026P55J677
$$ y = [1304, 617, -1541, -241, 1487, -295, -1400, 716, 1086, -1164, -791, 1409, 368, -1542, 45, 1453, -503, -1243, 937, 945, -1247, -539, 1488, 150, -1488, 333, 1407, -709, -1093, 1123, 779, -1341, -293, 1514, -103, -1410, 572, 1243, -945, -897, 1255, 480, -1429, -46, 1458, -426, -1334, 817, 1022, -1182, -690, 1354, 196, -1469, 211, 1331, -714, -1154, 1034, 772, -1348, -421, 1410, -71, -1425, 477, 1241, -883, -944, 1203, 579, -1384, -143, 1447, -249, -1296, 707, 1098, -1008, -704, 1325, 348, -1426, 105, 1436, -454, -1208, 847, 921, -1130, -484, 1365, 70, -1437, 325, 1314, -717, -1091, 1004, 666, -1262, -249, 1377, -245, -1411, 576, 1176, -946, -882, 1128, 383, -1324, 50, 1332, -535, -1278, 840, 1005, -1105, -640, 1233, 154, -1291, 346, 1285, -729, -1114, 1042, 859, -1167, -412, 1265]
2433A265j306j162J774N81k075k4K129n19j918J033J490j518q98J883K74k087
2449a078L08K026q46j726J309J185j686n36J975j40k044O95J894j171j478J543
2465B30Q48j798j38J952n43j914J104J636j492j118J716M68j858K94J847r16j697
2482a379J401J350j699p88J801J25j819O04J709j220j460J615J058j821m91J833
2498H19j70j747Q68J540j447j217J775P79j885j91J784m93j581J172J259j655
2514c90q82J914M11j927J69J712q16j366J414R68j844n02J991J5j876N44J538
2531A073j119j082J639N99j961r7J993l66j767Q48J340j341p98J747K52j947K39
2548g48J916p00j603J113J095j509n18J801m3j907N14J799r40j419J295Q54j608
$$ y = [1265, -41, -1203, 571, 1152, -923, -947, 1182, 663, -1255, -222, 1268, -250, -1148, 735, 1009, -1078, -770, 1256, 410, -1316, -7, 1178, -508, -1044, 931, 791, -1253, -558, 1336, 165, -1313, 230, 1078, -720, -858, 1094, 551, -1363, -259, 1377, -115, -1233, 483, 951, -907, -613, 1234, 318, -1379, 22, 1372, -327, -1115, 686, 811, -1008, -404, 1305, 85, -1375, 240, 1298, -523, -1014, 819, 649, -1098, -230, 1310, -137, -1354, 421, 1200, -685, -876, 908, 415, -1166, 6, 1265, -390, -1272, 642, 1053, -874, -705, 1007, 191, -1175, 239, 1207, -637, -1139, 852, 867, -1009, -465, 1073, -46, -1128, 511, 1110, -851, -948, 1045, 679, -1088, -240, 1100, -241, -1039, 708, 960, -987, -748, 1168, 468, -1135, -22, 1073, -436, -954, 847, 804, -1103, -589, 1210, 270, -1149, 146, 1000, -608]
2565f08k30J803l62j829Q61J594j216j160J490N53j681J16J742p01j647J166J344
2582A235j467q34J628J85j667M89J596j039j383J448J004j651m59J696j79j631
2598a029Q02J422j278j123J607O74j709j34J676m98j501J059J230j493q44J702
2614E63M05j757J45J607p25j350J235R98j608n59J766P3j724M61J511r93j172
2631a124J430P35j697k38J777k80j619P74J325j242q89J593L90j754J24J710o21
2648C94j453J078J064j451n85J686M7j715M46J565q96j237J283P81j568k75J675
2665H39k39j641P25J419j139j030J443N41j625k5J657m87j524R39J222j305p74
2682a004J534K79j656K69J586p56j354J177R79j469n00J634m5j613N86J420j031
$$ y = [-608, -838, 965, 603, -1226, -365, 1229, 13, -1147, 343, 896, -785, -669, 1073, 372, -1275, -109, 1235, -232, -1066, 562, 747, -920, -431, 1165, 126, -1257, 191, 1195, -456, -915, 781, 602, -1029, -227, 1195, -83, -1206, 401, 1075, -634, -768, 908, 410, -1091, -32, 1198, -295, -1139, 563, 968, -789, -644, 963, 238, -1112, 123, 1121, -487, -1046, 720, 793, -931, -470, 1041, 48, -1124, 306, 1041, -656, -894, 883, 603, -1016, -242, 1083, -159, -1048, 545, 935, -819, -695, 1015, 394, -1059, 19, 1083, -368, -953, 733, 780, -935, -489, 1076, 180, -1057, 226, 1007, -561, -836, 839, 600, -1041, -316, 1103, -36, -1066, 377, 918, -707, -732, 925, 438, -1086, -147, 1075, -230, -1004, 530, 809, -847, -578, 1008, 252, -1102, 75, 1054, -415, -915, 719, 674, -939, -353, 1067, 36]
2699C6j089J369O37j568j19J625l93j511Q79J219j272q11J511L06j601K09J546
2716I73o91j333J107R60j397n25J574Mj586M82J467r14j187J261P51j486k56J569
2734G73k39j519P24J325j113r76J374N11j519K8J526n39j403R88J143j308p38
2751i62J492K19j508L16J421q37j186J214Q53j444m07J514j20j453O38J271j116
2768i5r45J409N71j519j32J487l86j304Q84J023j291o80J524K95j568J42J443
2785H58o17j174J056Q29j388m58J577M9j557L86J340q20r91J212O02j503j90J609
2803H20k20j500O23J195j005p78J317L27j530J08J551n21j351Q75R83j178n19
2820h03J432Qj535M38J451p99j163J082P18j277k15J416k94j422P10J281j017
$$ y = [36, -1053, 316, 953, -615, -734, 891, 498, -1013, -134, 1085, -187, -998, 513, 819, -782, -573, 973, 282, -1051, 56, 1016, -381, -906, 668, 672, -914, -432, 1035, 121, -1066, 195, 946, -540, -796, 773, 534, -985, -261, 1064, -49, -1025, 349, 860, -659, -631, 895, 356, -1047, -59, 1084, -224, -962, 530, 749, -759, -443, 978, 141, -1045, 169, 1022, -422, -829, 685, 565, -888, -250, 1021, -95, -1040, 369, 940, -579, -711, 776, 390, -914, -30, 993, -298, -978, 546, 841, -727, -585, 858, 241, -933, 123, 952, -436, -894, 683, 732, -825, -439, 901, 81, -910, 302, 904, -599, -789, 820, 600, -900, -277, 918, -87, -865, 452, 779, -751, -643, 908, 387, -964, -89, 894, -284, -803, 629, 637, -898, -460, 991, 192, -971, 111, 829, -448, -663, 753, 459, -963, -253, 1028, 11]
2837A1r52J224M78j347N4J390n34j334R18J127j163p68J298K83j357K69J324p67
2855A54j194J105R43j294n43J357L6j330M91J227r68j026J270P12j398k81J383
2872F44k52j229P45J058j189p57J418M28j470M1J340n30j069R63P57j298m68J505
2890F37J00j429K55J246o87r58J135N68j442j94J490j06j457N56J035p85p87J315
2908D92K70j491R6J434m04j304P71R37j085n09J359R9j480K77J435o27j169R21
2926B2P70j182k61J348j81j414N88J274q75r67J119N14j270k1J345m53j288Q19
2944a13J070j065p06J221K35j288K51J274o93j149J003Q79j209m86J276K2j268
2961g46M62J175q66r84J169O48j288k64J313k04j235O76J053j039p96J275M47
$$ y = [11, -941, 283, 761, -586, -532, 858, 324, -1010, -92, 1035, -128, -896, 402, 685, -672, -403, 921, 154, -1040, 65, 1008, -286, -829, 528, 564, -766, -275, 952, -16, -1042, 228, 940, -458, -739, 644, 392, -837, -92, 966, -223, -980, 438, 866, -604, -563, 777, 247, -822, 141, 898, -400, -868, 637, 737, -692, -437, 809, 122, -836, 299, 867, -575, -769, 721, 615, -842, -286, 749, -36, -823, 492, 762, -729, -633, 801, 397, -907, -136, 801, -284, -793, 566, 665, -815, -538, 897, 270, -899, 22, 792, -390, -651, 697, 516, -898, -310, 964, 89, -878, 241, 755, -515, -536, 809, 356, -932, -113, 957, -108, -814, 407, 642, -646, -395, 879, 186, -963, 40, 919, -290, -776, 500, 522, -746, -284, 891, 25, -959, 210, 858, -430, -694, 619, 415, -820, -144, 909, -130, -926, 349, 796]
2978G96j358j5J297m26j136Q56Q90j178n60J366J74j379K55J248o96r75J051O42
2996H52j280k84J368j29j296N37J074q99p70J180L93j337J0J324l98j190P70R16
3014H41j084n45J262J66j333K37J252o03j058R43P36j180l53J317m9j333M56J183
3032H55p98r18J081N55j248j54J327k71j224O50J028r80p18J213L24j311Q2J293
3050G86m98j113Q35Q31j126m40J265K6j274L54J168p15r36J029N76j223j87J287
3068F45k06j228N83J040r02p30J132L56j260L3J279m21j153P62Q98j028n45J202
3086D57J52j291K56J244o12j053R13P40j123l55J250p6j259M83J147q24q91J064
3104B22N36j206j09J250l28j169O97R82r93o90J167K78j211J69J168o12j003R25
$$ y = [796, -562, -577, 720, 294, -842, 14, 904, -274, -834, 532, 706, -673, -418, 830, 134, -841, 210, 852, -428, -712, 656, 527, -769, -232, 842, -57, -827, 353, 746, -591, -581, 743, 345, -845, -75, 841, -243, -788, 474, 640, -693, -456, 796, 193, -865, 78, 814, -366, -719, 598, 549, -784, -328, 855, 57, -861, 220, 775, -473, -627, 700, 429, -795, -145, 883, -97, -815, 398, 722, -589, -507, 786, 288, -825, 10, 841, -285, -725, 540, 566, -708, -354, 814, 99, -837, 192, 768, -455, -642, 645, 439, -789, -206, 834, -68, -798, 334, 690, -570, -537, 742, 321, -832, -70, 828, -200, -745, 457, 609, -682, -426, 818, 206, -847, 66, 806, -317, -672, 578, 502, -757, -274, 873, 49, -842, 222, 758, -448, -557, 693, 365, -804, -107, 875, -118, -808, 359, 637, -574, -405, 763, 151, -852, 73]
3122G3Q06j138m67J216K6j192M04J061p99q49J073N85j213k40J219j62j132O03
3140a26R29r50o96J194M01j284m4J227l56j039P50Q02j081n01J277J73j283J74
3158d33J162n57r16R20N91j187k67J317p6j268M28J031p48p05J036L36j237K0
3176e53J280l47j150O44Q67r16n12J137J14j250K49J221n43j038P89O97j000k98
3194f09J168j05j231M82J153p56r09R54N55j100j18J185l17j151O71J016r14p42
3212g68J063L33j134J07J143n33j059Q56Q54j052n36J146R8j137L53J046p56q86
3230h62J033O26j156k84J155j51j051N77Q94r33o74J145L96j201m9J119l48r48
3248g12P43P27j037m76J224J77j218J81J068n39q39Q78N85j139k93J250j8j202
$$ y = [73, 879, -259, -726, 490, 516, -676, -272, 789, -10, -859, 214, 799, -414, -654, 565, 403, -729, -126, 803, -147, -843, 351, 752, -532, -576, 651, 295, -744, 6, 808, -273, -774, 503, 676, -607, -433, 729, 172, -744, 176, 767, -420, -687, 630, 554, -714, -286, 745, -3, -708, 328, 664, -573, -553, 727, 380, -770, -126, 741, -175, -687, 450, 564, -686, -437, 784, 241, -797, -8, 689, -311, -609, 559, 454, -777, -295, 858, 102, -807, 147, 702, -398, -516, 669, 352, -799, -128, 888, -26, -768, 295, 628, -506, -399, 744, 211, -848, 8, 862, -190, -726, 420, 518, -619, -266, 780, 24, -862, 171, 797, -359, -643, 512, 361, -690, -113, 781, -152, -826, 319, 715, -486, -535, 584, 236, -712, 31, 758, -279, -755, 469, 646, -572, -391, 677, 138, -701, 177, 762, -377, -670, 580, 562, -640]
3266f40L54R88o90p03R95L81j198p9J255k34j141N53Q66q47n33J087J75j226J62
3285d75J200m72j013P49O81r70l00J120o9j181M03J090o69q50Q85N02j021j00
3303d90J099k80j086O04R49q25o74R81L11j064R0J093m67j002P46Q18r54n24J064
3322C89J30j087K62J036o38q83Q97O51j064l15J102p5j048M54R28p98p29J017
3340B29M44j116r9J092k54r87O38P66r14m96J079K00j120J44J029m85q51P85O12
3359F96r99l07J104k2j080L60R45o59p16R00M41j066j22J104k20j026N21Q57p85
3378g4o07R93K77j099P1J063l84r50O62P59r31m38J066J02j095K43J016n66q34
3397g26Q35N70j009k56J088j03j028M27Q85p16o53R39L66j060k4J055k99r44O03
$$ y = [-640, -286, 702, 12, -691, 304, 685, -513, -592, 663, 429, -712, -159, 707, -140, -673, 414, 589, -637, -475, 725, 253, -760, -11, 670, -300, -600, 520, 451, -730, -327, 763, 94, -756, 129, 631, -390, -490, 609, 329, -757, -153, 796, -29, -703, 278, 589, -475, -385, 708, 241, -761, -15, 803, -151, -675, 389, 519, -568, -306, 730, 92, -791, 106, 757, -307, -622, 480, 405, -643, -189, 739, -59, -788, 229, 673, -443, -542, 550, 296, -691, -53, 713, -201, -697, 382, 582, -538, -394, 635, 150, -701, 84, 696, -303, -610, 494, 472, -608, -248, 697, 38, -678, 222, 663, -403, -525, 579, 359, -667, -146, 711, -74, -681, 312, 589, -510, -439, 624, 240, -710, -48, 711, -220, -658, 408, 510, -585, -342, 674, 108, -726, 109, 679, -330, -586, 502, 399, -629, -202, 683, -33, -686, 253, 619, -441, -465, 590, 291, -653, -50]
3416e0P41q51m65J005J55j046J55R95m81q15P43N66r35k94J061m1j042L26R19
3435F46n99p11Q44M25r92j18J060k02r99M86Q32p31n79R19K64j043R0J044l99
3454B37r25O50P00q54l71R68M2j019K90R67n73p95P84N21r20j79R72j49r80M93
3474a41Q33p16o25Q58L22r27PR44l50q74O50P13q31m84R23J70r34J79Q84n02p82
3495f83P70N85r07l27R61or15L35Q32o56o67Q88M48r94j76R74j45q85M86P05p72
3516a49m99R62K52j015L5R35l35p72O27N63q81l02R98N2r84K19Q43m88o18P41
3536A84L59r32j00J007j28r68L88P68o25m90Q18K13r60P2R79k97q92N12O77p23
3556a38l64Q75N0r68K22R47m61q03O51N40p95k19Q99j06r48M16Q57o07o84P69
$$ y = [-50, 691, -160, -625, 380, 535, -511, -356, 639, 158, -657, 86, 652, -283, -577, 484, 443, -599, -273, 646, 47, -664, 180, 605, -387, -505, 555, 353, -646, -160, 672, -59, -638, 281, 545, -498, -408, 636, 237, -688, -38, 662, -192, -563, 405, 447, -572, -282, 685, 112, -683, 101, 622, -298, -477, 495, 346, -634, -141, 692, -24, -649, 209, 531, -396, -389, 555, 205, -669, -19, 694, -137, -621, 302, 472, -462, -283, 601, 99, -683, 87, 672, -235, -562, 399, 393, -522, -187, 645, -11, -678, 210, 658, -336, -512, 462, 317, -568, -82, 623, -149, -648, 314, 566, -449, -414, 521, 186, -586, 41, 604, -277, -579, 419, 471, -513, -294, 549, 61, -557, 184, 543, -389, -489, 518, 390, -578, -190, 578, -47, -537, 281, 494, -466, -394, 585, 288, -604, -92, 585, -138, -502, 373, 423, -545, -323, 624, 163, -640, 11, 551, -244, -463, 436, 330, -618, -202, 655, 48, -636, 133]
3576A33L98q82j3Q76k67q95N63P49p30m91P70K21q09J09Q20m60p26P03N38p89
3596a82l50Q44L7q24L11P65n76o61P78M62q35k30Q56j09p89M09P08p24n22Q92
3616B60K99r01n4Q80k81p37N65N76q39l70R62J50r92J17Q65l97o58O67M56q79
3636c11k04R63n8q91K92P37n39n11P67K41q97jR32k43q20M64O13o70l42Q15Q1
3657D18q91J58Q74l88p31N79M90p31k08Q40p0q81L21Q09n43o27P06L68q04p4Q66
3678D81k17q47M62P25o40n14P67K33q41Q7Q30l73p56O05N93p69l41Q34N7q32K46
3699b10P51n03o30O99M26q18j61Q38j17p85M12O56o24m91P88K56q39NQ10k73p10
3720e20N12N56p23l26Q17J01q49J63P87m21o47O48M49q06k04Q54m0q39L01P46
$$ y = [133, 531, -351, -364, 512, 245, -650, -87, 662, -68, -559, 211, 432, -377, -268, 552, 92, -634, 69, 607, -182, -532, 312, 349, -475, -164, 601, 25, -636, 142, 604, -231, -461, 395, 286, -503, -94, 614, -110, -632, 260, 559, -342, -396, 484, 203, -534, 31, 607, -232, -602, 360, 510, -482, -365, 500, 103, -555, 112, 568, -311, -515, 448, 390, -501, -209, 528, -11, -522, 245, 486, -411, -412, 520, 277, -543, -79, 534, -136, -478, 337, 418, -473, -315, 559, 171, -560, 19, 509, -222, -430, 410, 340, -541, -220, 589, 46, -581, 125, 493, -311, -385, 481, 264, -583, -121, 604, -36, -550, 217, 450, -391, -304, 526, 153, -603, 2, 595, -174, -515, 319, 376, -456, -210, 541, 38, -592, 107, 533, -285, -446, 392, 275, -510, -98, 558, -66, -557, 231, 487, -352, -347, 463, 190, -520, -8, 548, -175, -501, 316, 417, -432, -269, 518, 97, -550, 98, 547, -259, -463, 391, 351, -488, -187, 559]
3740E59n58n49P17L24q35m9Q47k24p78M60O46o72m21P97J62q43J08Q12l91o65
3760e53O01M92p57k43Q18k2p96K80P02n13n60P11L48q11r7Q23j66p38M04O03o26
3781a00m14P76J83q32M6Q10k94o84N22N01p16k83Q23M9q45J89P66m21o15O31L90
3802D82p83j38Q47j12q06L31O95n46m84P21K20q00K5Q34k69p44M75N74o26l27
3822d31P50M2p98K12P62m20o47N89M36p06j79P56r1p51L42O80n36n38O63L10p47
3843c02k5P47k46p09M70O28o54m36P15J98p51J02P27l83o48O03N10p37l05P87
3863B91M6p51K44O71n01n56P06L73p83j46P80j08o92L75N60o03m08P60K03q00
3883c39RP55k60o12M82M34o81k50P98N4q00J39P11l97n07N87L09p51r6Q18r5p81
$$ y = [559, 1, -548, 169, 493, -342, -391, 456, 232, -546, -86, 560, -112, -533, 264, 426, -417, -309, 503, 112, -553, 48, 540, -217, -460, 358, 336, -460, -180, 522, 9, -551, 160, 508, -303, -400, 423, 257, -481, -77, 526, -100, -514, 262, 445, -387, -341, 469, 175, -509, 13, 514, -202, -485, 338, 387, -458, -269, 497, 76, -539, 92, 482, -301, -439, 408, 296, -510, -179, 516, -30, -514, 207, 427, -373, -348, 486, 217, -527, -52, 522, -104, -431, 319, 361, -437, -225, 537, 117, -530, 59, 495, -211, -390, 366, 275, -476, -134, 546, 10, -528, 135, 445, -302, -327, 420, 174, -535, -65, 563, -91, -527, 188, 386, -365, -263, 464, 81, -567, 36, 546, -191, -496, 291, 337, -414, -170, 501, 0, -556, 150, 523, -260, -406, 374, 266, -426, -51, 509, -94, -502, 258, 461, -339, -330, 425, 165, -447, 35, 469, -212, -462, 336, 390, -410, -271, 440, 43, -464, 123, 432, -319, -415, 403, 308, -473]
3905d73K89O52m88m39O58J96p85L9Q17k31p45M33N51n85l00P18M6p83J67Q01l86
3926A52o62N38M44o50j79P35j02p48L30O81n04n34O18L01o94k0P06k52o85M70
3946e5N75o00m09O72J66o99J32O68l85n93N62M88o83k81P10L0o94K49O42m99n18
3967e22O44L75p40j49P32q9o78L56N78n91m28P30K49p70k2P42k49o21M86M45o58
3988a80k86P66Q8p78J42O70l69n14N76L26p27j23P70p6p13K72N85m69l91O31J95
4009C95p51L1P53k26o59L97N06n67k89O84P1p51J53P20l47n87M97M03o29j83P26
4030C47o6p40K86O73m52n25O00K90o93l5P16j98o95M10N78n49m03O46J72p10J04
4051b44O83l39o05N19M66o44k54O92K1o80K27O14m36m95N93L26o86j18P00j23
$$ y = [-473, -184, 468, -20, -459, 199, 395, -390, -351, 466, 235, -510, -77, 474, -111, -411, 307, 353, -430, -263, 538, 152, -510, 28, 472, -178, -357, 378, 276, -472, -142, 539, 35, -499, 119, 420, -274, -294, 412, 160, -525, -55, 520, -80, -489, 183, 349, -350, -218, 450, 65, -528, 34, 522, -161, -442, 268, 298, -396, -147, 495, -4, -522, 122, 497, -243, -392, 340, 251, -427, -71, 507, -84, -512, 218, 467, -303, -325, 417, 168, -453, 33, 478, -180, -466, 300, 388, -390, -248, 422, 53, -461, 115, 441, -286, -409, 361, 285, -428, -156, 429, -40, -431, 200, 395, -356, -325, 428, 202, -457, -60, 446, -121, -410, 274, 345, -406, -253, 467, 120, -467, 30, 433, -196, -379, 347, 281, -459, -173, 500, 48, -477, 123, 413, -280, -315, 401, 203, -492, -82, 496, -53, -456, 190, 362, -348, -244, 439, 100, -505, 14, 480, -164, -418, 274, 295, -385, -158, 456, 20, -475, 118, 444, -242, -360, 340, 217]
4071B17o50L41N48n29l99O52K20p06mP04k44o03M48M72o12k85P10P0p22J46O69
4092D43l65n49N30L89o54j82P23m9p06K84N96m65m59O11K52o94k2P02k09o31M04
4113e1N21n66l31O54J20o97J19O41l40n34N02M03o34k08O87k4o52K31N85m25m67
4134d66N92L04o87r9P03j23o30L41N18n35l60O63J68p09K7O92k37o03M48M42o19
4155a70k42P04M8p28J62O49l58m89N21L02o55j09P23r5o98K85N74m46l91N69J84
4176C40o68K4O94k21o22L87M77n19k76O30N3o79J74O56l58n33M73L86n75j65O37
4197C15p8o56K97O06m54m87N74K86o40n2O55j91o26M03N41n54l95O28J86o60P1
4218b31O19l10n55N14M33o35k58O66L0o22K00N55m18m46N77L05o53j28O43p9n68
$$ y = [217, -433, -92, 456, -73, -472, 180, 400, -306, -310, 394, 150, -453, -5, 467, -145, -430, 280, 350, -372, -226, 443, 78, -471, 59, 448, -206, -388, 335, 286, -420, -136, 460, -5, -464, 147, 399, -295, -317, 385, 176, -455, -51, 470, -96, -427, 227, 347, -350, -231, 410, 70, -464, 38, 441, -193, -401, 286, 262, -390, -159, 426, 1, -466, 126, 430, -257, -356, 347, 224, -406, -65, 453, -82, -442, 221, 389, -320, -293, 399, 162, -441, 7, 449, -170, -412, 292, 340, -388, -226, 423, 65, -424, 97, 399, -256, -365, 358, 263, -435, -150, 424, -22, -413, 156, 340, -328, -304, 390, 169, -453, -66, 411, -108, -384, 246, 299, -380, -206, 450, 92, -441, 32, 418, -157, -322, 315, 237, -419, -122, 484, 30, -457, 117, 403, -237, -289, 366, 175, -451, -48, 493, -61, -456, 172, 358, -302, -231, 388, 78, -477, 37, 470, -165, -423, 243, 273, -349, -149, 406, -12, -458, 119, 424, -229, -357, 286, 207, -361]
4239c61L20M59n12l26O28J74o66JO38k04n27M11L76n70k39O85N6o92J26O13l22
4260F8m64M92K95o52r7P03o3o90K47N59m20l70N63J62o55K7O98j99o40L49M89
4281D02m81k91O19L2o54J39O55l11n50M39L76n37j43O16j07o08K75N81m12m55
4301d15N01K66n50m3N91k05n71L74N08n16l44N53J49n81O6N68k75n28M78M19n77
4322a32k69O24N9o00J92N31m11m46N60L28o40j50O38p8n58L07M64m88l40N93J77
4343C61o31%N97j85n16L89L70n38k24O00Q4o24J23N75l55m25M89K87o19r4O29
4364B93o3o23K42N17l62l52N20J62o12L1N75k00n31L21N54n25l14O08J77q21J88
4385b15N81j64n59K86N04n70j99O02K0o72K27N55l50m19M54K95o00k5N42j47n23
$$ y = [-361, -41, 418, -94, -420, 208, 382, -284, -283, 355, 151, -376, 35, 411, -159, -398, 287, 343, -349, -223, 390, 68, -396, 96, 391, -261, -358, 345, 282, -408, -161, 398, -22, -392, 171, 333, -322, -295, 403, 204, -436, -87, 402, -79, -370, 249, 281, -373, -234, 421, 110, -440, -1, 375, -162, -305, 311, 204, -404, -129, 452, 40, -415, 86, 352, -198, -241, 350, 145, -426, -52, 456, -60, -404, 149, 298, -283, -217, 351, 76, -452, 26, 445, -132, -401, 223, 282, -318, -126, 405, -6, -452, 108, 436, -204, -354, 284, 206, -352, -45, 419, -69, -409, 184, 361, -270, -270, 327, 142, -374, 15, 385, -153, -377, 223, 307, -317, -194, 381, 26, -399, 90, 377, -242, -336, 293, 230, -393, -151, 366, 4, -348, 172, 334, -278, -247, 328, 128, -403, -82, 472, -53, -367, 241, 418, -403, -215, 366, 202, -357, -71, 433, -137, -336, 266, 286, -386, -159, 396, 46, -373, 81, 376, -224, -249, 293, 146, -377]
4406c77K53N64m58l54N27J72n72J6N72k57m63L45M00m56k53N51L5n30J28M87k83
4427D7m42M82K92n46j36N80m6n35J97N12m25l23M78J82n59j0N89j88n08L34M43
4448D18m99l32O54O4o18J23N23k75m34M35K59m96j21N57o3n05J83M90l48l81M26
4469F0K08m75q2N37j30n08L32M03m51k28N01J04n21Q3M74k09m45M29J94l51k30
4490c05N58l9n20J62M80k53m50M48K74n55j57O00l1n38K55L98l69l16M91K08n79
4511b38p0N91j26m92L07L72m49k36N58O8n82R1N16k28m21L86K68m98j11N60l8
4532B28n51J88M73l23l40M35J79n14k0N55j28n23K67M22l92k65M76P4n16O8N36
4553C29k24m97L52L73m49j77N03j5n37J92N20l33m25M27K86m94q6N17j12n10K93
$$ y = [-377, -124, 440, -18, -372, 155, 327, -245, -229, 343, 86, -377, -32, 368, -88, -341, 210, 245, -285, -157, 330, 47, -395, 87, 379, -167, -303, 277, 231, -304, -107, 405, -20, -343, 135, 317, -242, -252, 337, 149, -359, -25, 418, -81, -413, 241, 305, -313, -190, 333, 58, -376, 59, 318, -178, -299, 258, 195, -310, -127, 363, 15, -366, 60, 268, -207, -289, 248, 118, -390, -58, 345, -106, -334, 167, 271, -250, -167, 307, 98, -347, 82, 276, -75, -305, 253, 214, -306, -144, 336, 83, -367, 81, 355, -200, -357, 243, 212, -326, -71, 327, -42, -358, 133, 341, -238, -308, 283, 157, -335, -28, 344, -105, -341, 217, 285, -297, -206, 310, 82, -339, 47, 315, -183, -294, 266, 228, -323, -135, 338, 15, -325, 110, 289, -225, -245, 310, 182, -341, -74, 348, -44, -309, 167, 241, -275, -207, 329, 105, -392, -40, 333, -116, -293, 210, 195, -342, -150, 370, 37, -388, 39, 325, -169, -255, 262, 150, -360, -67]
4574f7M48m06l49M95J68m98K2M85k26m30L61L60m65k42N09P5m79R4M46k78l71
4595c48M24K77n11j37N23m5m57J95L94l70l05M95J93n33p0N24j09m37K67L62m46
4616a14k27N38J03n64N3N05j99m04L52K66m79j34N64on57J39M69k68l42M10J69
4637B74m90l5N48j16n08K34M11l28k76M44P9m98P5N08k02m59L09L30l84j69M61
4658B08k0m96J73M72k81m08L79K60m18j12M85r2m79K50M40l89l20M62J88m93o
4679a97M71j89m38L38L84m66k76N52Q9m71K4N11l33l97M46K37l94k05N20L4n53
4700c13J69N65m38l52M68K72n26q8M99j37l93K19L55m13k24M83J35n02oN21k21
4721G3l52L26K56m49j48N03K9n13J36M37k78l37L96K05m87o4N18p4m95K26L98
$$ y = [-67, 381, -25, -374, 121, 289, -209, -187, 298, 72, -358, 3, 363, -102, -344, 165, 240, -239, -145, 301, 23, -348, 76, 353, -158, -295, 228, 183, -274, -79, 315, -55, -360, 135, 328, -205, -275, 249, 140, -297, -30, 332, -114, -341, 197, 300, -264, -211, 294, 95, -309, 43, 309, -170, -304, 260, 254, -303, -164, 305, 37, -305, 105, 274, -216, -251, 297, 181, -327, -93, 318, -10, -286, 158, 237, -261, -186, 322, 120, -339, -30, 300, -84, -253, 208, 188, -308, -135, 337, 56, -352, 27, 287, -131, -243, 242, 150, -329, -79, 361, -28, -348, 114, 302, -191, -197, 274, 85, -353, -15, 369, -97, -373, 179, 268, -203, -179, 332, -1, -398, 48, 285, -109, -314, 206, 240, -313, -144, 421, -17, -369, 99, 371, -155, -243, 256, 119, -274, -55, 300, -113, -337, 146, 281, -221, -227, 294, 73, -279, 47, 303, -146, -294, 209, 238, -275, -139, 298, 20, -317, 79, 284, -203, -267, 251, 177, -318, -92, 306]
4742C06l46k75M48J21m97J9N21j65m63L00L38l88j90M71J4m92J24M67k35l88L74
4763F4K29m12j05M60p0m67K27L84l12l17M11J71m66mM85j74m36K83L36l75k07
4784b95M35K7m33J09M83k82l44L65K54m61j17M51m0m16J62M02l09l11M25K15n07
4805a87m1M80r9m25K02L81l64k17M36O9m49L1M91k02m12L47K32m08j18M40k2m23
4827b58J15L92k10l65L72J92m24l4M45j13m12K48L59l37k85M23J17m46L1M11j38
4848H3m44M08K72m26j82M59Q2m74J04M16k57l68L97J96l93j35M79m6m07J73L59
4869B96l60k26L94J70m80QL90q3l66K16K86l47j33L86L7m56J07L78j57l13K69
4890A6K45l60j37M38l0m31J40L57k35k68L45J64m15JM18j02m04J59L64k95k02
$$ y = [306, -40, -315, 133, 254, -243, -224, 297, 132, -331, -31, 307, -81, -271, 200, 214, -278, -154, 313, 78, -310, 64, 293, -119, -224, 236, 166, -301, -74, 310, -2, -319, 92, 263, -203, -207, 278, 104, -332, -49, 287, -88, -295, 140, 167, -266, -157, 326, 44, -300, 65, 319, -142, -259, 192, 152, -264, -102, 300, -9, -320, 105, 320, -187, -228, 252, 153, -272, -70, 311, -53, -270, 166, 235, -214, -183, 308, 106, -306, 41, 273, -135, -253, 187, 165, -258, -143, 249, 39, -326, 46, 238, -186, -220, 225, 112, -300, -52, 307, -30, -315, 108, 225, -221, -190, 221, 83, -361, 47, 319, -107, -289, 170, 252, -222, -118, 298, 41, -327, 70, 266, -127, -262, 217, 171, -236, -63, 296, -64, -290, 104, 274, -206, -198, 192, 109, -257, -41, 245, -102, -235, 151, 188, -268, -161, 217, 60, -253, 16, 261, -99, -236, 202, 172, -259, -119, 238, 3, -265, 80, 244, -171, -170, 248, 146, -258, -99, 265, -30, -232]
4911b32L76O3m27N2M75k10m08K97K90l45j71M11km35J42M13k58l49L38K37l91
4932a34p2L87o7l84K05L57l24k68L74J67m02KL89j80l42K55L57m15j75L87P6m10
4954b17R1L49k50k27L34K14m25j11M09Nl93J55L26k93k51M02J56m41o3M32q8l64
4976b50K29K80l56j69M33O0m57M3M07j44l33K80K21l86r7M30Nm30J07L67k13k56
4998b29L06J40m05j0M26p9m00J72L17k69j85L41N6m00N8M18j62l69K37K82l23
5019g8j31L63Km00J29L98k40l29L05K26l58p6L79p6l83K06L50k91k81L44J53l73
5041a61J1L74j50l55K65K96l29k02L66Q0l86P2L60k10k99K96K22l57j34L90jl54
5063b06J22L24k71k29L41J42l69m6L83r0l34K07K64l06j84L76Q5l96K4L74j32
$$ y = [-232, 144, 207, -220, -168, 307, 97, -311, -14, 276, -69, -240, 171, 169, -266, -124, 289, 31, -318, 20, 257, -134, -206, 181, 114, -270, -65, 292, -32, -300, 74, 241, -161, -159, 230, 50, -292, -37, 320, -95, -270, 117, 193, -217, -126, 223, -27, -254, 80, 294, -131, -242, 167, 172, -221, -66, 260, -33, -284, 118, 274, -167, -230, 202, 114, -250, -21, 259, -97, -266, 167, 227, -230, -187, 220, 76, -257, 23, 244, -142, -239, 191, 196, -234, -127, 240, 27, -229, 77, 217, -188, -198, 228, 149, -251, -79, 238, -31, -216, 125, 181, -219, -161, 257, 95, -274, -37, 245, -78, -209, 154, 156, -244, -115, 283, 43, -286, 19, 245, -113, -189, 190, 114, -269, -63, 287, -4, -285, 59, 212, -161, -150, 224, 74, -281, -16, 280, -49, -251, 115, 195, -191, -119, 241, 31, -268, 28, 250, -107, -241, 149, 148, -206, -84, 240, -31, -260, 81, 223, -146, -192, 191, 101, -233, -26, 238, -68, -252, 124, 209, -187, -163, 211, 79]
5084G9l25K59K20l41j18L88J7m05J13L48k15k66L17J55l70o1M02n0l77J68L02
5105B40k60k20L47R5l85J9L72j22l37K27K51l04j42L55L1l78Q2L53j87k90K72
5126A9K05l37p8L57l7l45J45L16k50k43L16J46l68qL56q9l45K03K76k98j71L55
5148A25N0l54M7L58j68l06K62K21l45j07L76ml80J31L13k23k21K64J43l39k3L58
5170A78p9l42J91K71k62j91L26P9l43L6L47j36l18K40K28k89j40L34K7l53J00
5191i6L24j95k83K85J81l26p6L50m3l46J68K96k60k31L35J21l49j9L63j34l15
5212b50K36K57l04j87L60O4l51N5L24j81k69K75K11l45j10L63kl39J10L02k31
5233a2k18L10J45l64m2L58o8l06J62K48k79j57L45P1l75K9L52j27k88K19J85k96
$$ y = [79, -246, 13, 233, -108, -226, 162, 179, -226, -113, 235, 20, -246, 71, 226, -144, -205, 197, 147, -230, -62, 240, -20, -240, 107, 202, -183, -164, 208, 86, -251, -24, 227, -77, -219, 136, 167, -211, -129, 224, 37, -253, 19, 224, -113, -191, 166, 129, -216, -71, 245, -5, -248, 68, 214, -154, -162, 194, 105, -240, -37, 239, -59, -230, 125, 175, -179, -132, 226, 58, -248, 14, 235, -110, -217, 159, 155, -225, -94, 219, -4, -225, 39, 182, -157, -180, 178, 99, -243, -52, 219, -43, -234, 92, 171, -172, -136, 211, 75, -243, -3, 225, -64, -204, 130, 157, -196, -96, 228, 33, -250, 35, 216, -110, -186, 164, 121, -225, -57, 239, -21, -252, 83, 204, -145, -164, 199, 65, -250, -14, 243, -61, -248, 112, 176, -175, -120, 204, 23, -246, 29, 240, -105, -215, 148, 146, -193, -83, 219, -12, -230, 80, 225, -139, -181, 177, 109, -197, -35, 213, -66, -223, 122, 193, -182, -153, 199, 72, -216, 3, 188, -108]
5255a08r7L66jl81R9L35j93k53K83J48l46k3L77p1l63J50L13k48k01L03Q0l51
5277a82M2L71j43l45K25K62k72j44L20Ml38J13L33j97l05K77J90k99q1L20o4l08
5299b21J69K89k57k26L09J31l26j2L20j21k92K22K60k91j88L32P3l21M8L18j96
5320B0k66L01J98l46j19L59Ml35J14K77k31k13L27J34l68n4L66n6l19J84K30k89
5342h2j53L56O8l84L6L42j19k79K22J79l08q9L53Ml55R0L14j88k23K67J36l33
5364a46j7L58o7l44J53K89k32j75K85O3l38M9L46j35l23K17K37k69j36L22jl57
5386b21J21L46k19k85K71J92l17n9L30n6l42J88K96k70k19L14J22l33j7L32j16
5407E8k87K18K39k88j61L26O0l39P3L03j82k48K78J81l33q7L34jl23J32K63k39
$$ y = [-108, -205, 161, 160, -221, -122, 213, 20, -233, 50, 198, -148, -171, 206, 135, -228, -78, 235, -13, -214, 89, 169, -182, -140, 231, 88, -257, -32, 230, -42, -186, 134, 138, -200, -87, 246, 49, -256, 21, 211, -88, -169, 151, 87, -221, -52, 237, -20, -246, 63, 194, -132, -144, 176, 55, -237, -15, 245, -46, -234, 98, 171, -150, -102, 216, 20, -246, 55, 253, -93, -212, 147, 151, -184, -70, 207, -24, -237, 90, 224, -144, -198, 168, 112, -207, -23, 207, -82, -235, 121, 189, -195, -159, 183, 64, -215, 7, 186, -122, -211, 142, 146, -209, -119, 195, 7, -216, 51, 187, -146, -163, 195, 128, -216, -63, 226, -6, -181, 104, 167, -171, -122, 224, 89, -234, -17, 220, -49, -185, 137, 136, -221, -100, 246, 27, -258, 13, 205, -112, -171, 159, 103, -239, -51, 245, -25, -244, 70, 192, -141, -158, 174, 58, -229, -11, 228, -60, -221, 105, 165, -174, -101, 202, 20, -228, 50, 231, -102, -189, 145, 144, -179, -47, 216, -23]
5429b3j98L12J16l51l1L44p8l00J70K51k89j50L41O8l68L7L41j39k85K53J83l11
5451a07j06L74j2l53J06L14k06k46K90J53l45n0L69p5l26J84K43k65j71L30J14
5472B15l65K6K99r5l35K52K11l20m9L58Kl52K7K94j19l19L27J63k66j40K81Rl32
5495b28J64K27k27j78L11J78m16M9K98j37l01K31K51k87q9K99O6m10Q8L74k20
5516D3k37K26J70k94m0K93o3k65J12K78k26k08K75J37l56M4L08j09l29K34K16
5537B09k79j13L00M8l43N3L05j45k74K24K09k86r4K93K0l26J17L02k16k37K94
5558F1J50l39l8L41q6l04J99K51k75j86L36P2l46M2L23j51k74K44K08l06j34L40
5580A28J4l09Q8K83k10k09K95J29l27n8L22k5l02J28K59k63j50L17P8l61K8L24
$$ y = [-23, -221, 91, 207, -144, -175, 169, 91, -209, -39, 212, -77, -227, 114, 182, -186, -149, 192, 53, -232, 21, 204, -107, -213, 161, 149, -204, -98, 216, 10, -236, 54, 207, -138, -188, 181, 106, -220, -36, 207, -58, -229, 101, 215, -150, -124, 175, 80, -255, -3, 208, -112, -161, 197, 199, -153, -126, 168, 49, -270, 57, 220, -46, -186, 95, 104, -228, -64, 163, -64, -242, 69, 247, -169, -120, 178, 41, -260, -29, 222, -65, -154, 145, 211, -199, -111, 263, 43, -194, 32, 202, -92, -132, 161, 98, -167, -55, 223, -3, -211, 64, 201, -155, -111, 197, 88, -241, -7, 209, -70, -183, 117, 165, -178, -125, 180, 35, -239, -15, 194, -92, -186, 107, 127, -199, -82, 220, 4, -233, 61, 211, -128, -166, 175, 89, -215, -16, 235, -40, -226, 110, 182, -164, -122, 201, 50, -224, 20, 228, -78, -212, 128, 142, -167, -79, 204, -6, -215, 80, 209, -118, -176, 146, 121, -181, -53, 206, -57, -207, 110, 188, -173, -145, 179]
5602A79j06k68J91J96k70j06L23Nl33P9L22j64k58K51J40k99n3L50m3l52J26K98
5624B08k15j95K67J04l32K2L41j11l23J97K56k44j69L09K6l22R5L03j67k82K42
5645A0J97k70j06L17l7l35J59K65j80k72K96J18k59m4K68l0l07K44K09k55k06
5666b18L21O1l02O8K38j52k24K36K08l37j17L59m1k64L1L20j64k49K70J36k86
5687a06m9L24l6l12J56K41l21p8L10Q4l64jL53j34k30J57J85k81o1L13J5l37O4
5710a08K91j57k12K22J32k96l0L22l0l18J09K59k00j76K47R7l13J5L28j10k97
5731b25J88K31k32j43K84L4l25R8L04j73k62K24K04k77r0K94j8l05J42K78k25
5752Fk25K54J49k93k6K90p8k87J88K32k60j60K77Q8l04M0K77j43k25K15J89k82
$$ y = [179, 73, -195, -4, 192, -78, -184, 139, 144, -189, -110, 212, 48, -210, 41, 181, -118, -171, 179, 136, -216, -90, 208, -7, -202, 65, 169, -163, -141, 200, 89, -234, -37, 219, -25, -194, 115, 141, -181, -86, 217, 50, -232, 10, 207, -63, -169, 148, 111, -224, -65, 200, 20, -252, 44, 162, -97, -141, 127, 97, -210, 34, 243, -12, -218, 103, 164, -138, -70, 168, 16, -208, 28, 236, -101, -218, 141, 100, -164, -133, 187, 23, -226, 44, 180, -106, -155, 169, 133, -179, -23, 218, -103, -181, 129, 213, -151, -152, 201, 67, -163, -6, 179, -102, -163, 150, 165, -172, -108, 183, 26, -186, 36, 168, -128, -158, 164, 134, -184, -75, 184, -16, -192, 55, 152, -161, -146, 182, 72, -225, -37, 194, -38, -181, 103, 137, -188, -90, 214, 41, -221, 3, 207, -70, -160, 134, 116, -189, -47, 231, 6, -219, 35, 184, -109, -135, 155, 77, -210, -22, 210, -50, -210, 67, 155, -149, -109, 168, 25, -200, 15, 204, -78]
5774g8j12K90K6k87Q6K63j88k12K62J39l07m9K99l6k87J57K25k18j66K95Q7l28
5796a39QL18j10k64J87K02k71j15L09K6l23P1K76j51k25K24J59k99m5L04l4l05
5818a97J28K57k03j78K57Q5k83KK85q3k60J66K11k40j23K73N0k96M6K66j26k44
5840b07K18J82k69r5K99kk93J04K66j93k05K62J20k95k9K94p1k74J60K16k20j62
5862a94K75O6k93L0K90j11k56J95J81k55j07L00Qk97P7K69j52k09K17J39k64l2
5884a23K67m9k66J17K27j58j89K48N9k63j5L40j24k21J67J59k11j26K73K2k86
5905a52O0K67j46k31K16J60k58p5K80l0k82J42K28k04j82K61J12k72k6K70p9k38
5927a79J70J93k18j50K72N5k63L3K44j25k07K04J54k51r0K64J8k79R4K10j50j61
$$ y = [-78, -190, 100, 126, -161, -75, 188, 0, -212, 50, 189, -118, -167, 132, 96, -191, -34, 191, -27, -193, 102, 189, -139, -131, 187, 77, -187, 0, 202, -69, -184, 125, 151, -172, -101, 175, 24, -201, 23, 182, -117, -162, 142, 108, -197, -69, 188, -15, -193, 64, 149, -134, -132, 153, 70, -190, -24, 187, -53, -176, 97, 147, -149, -103, 163, 37, -207, 11, 193, -76, -171, 128, 126, -167, -63, 203, 10, -195, 67, 187, -108, -137, 157, 86, -188, -28, 188, -32, -194, 81, 147, -146, -116, 174, 63, -193, 2, 183, -72, -179, 121, 129, -168, -91, 178, 26, -183, 34, 173, -91, -123, 144, 95, -171, -54, 173, 15, -174, 74, 133, -130, -145, 195, 71, -150, 17, 176, -35, -161, 112, 134, -152, -92, 175, 29, -202, 14, 174, -84, -159, 121, 91, -191, -49, 179, -25, -207, 54, 166, -106, -132, 138, 59, -179, -9, 184, -34, -184, 88, 143, -120, -87, 157, 32, -175, 29, 183, -68, -158, 106, 124, -155, -61, 149, -1, -162]
5949a62K11J18k74m8K81l5k50J17K00k05j26K67N0k94K3K66p7k30J72J47k27q9
5971a65K78Rk77O1K62j30j99J89J13k43k3K75m8k77J30K31j75j72K20P9k51J6
5993i7K56r0k58J45K03j92j13K30J2k39O6K37j31k14J85J61k26n8K17k7k25J14
6015d4K17j74j77K26J03k39j7K30p8k07J57J89k18j45K52P4k66M8K16j14j97J97
6037C3J60k54r2K65J4k55P3K06j48j64K20J13k70n6K62k3k17Q9J80j78j17K30
6059G1O5k63J2K33n9k08J51J34k00p5K44K1k58L5K38j10j79J67J15k19m1K60l8
6082I6k51R9K12j49j51K03O4k42J8K64r9k29J34J80j85j03K21K1k42N3K51j36
6104B9j98J66J43k11o1K27j9k26R9K08j58j71K07J02k11j9K14o2k06J39J78j94
$$ y = [-162, 49, 167, -107, -155, 126, 91, -159, -42, 158, -47, -173, 94, 144, -150, -127, 139, 62, -168, 4, 151, -76, -165, 113, 122, -155, -94, 168, 38, -161, 28, 141, -102, -125, 150, 102, -175, -45, 186, 11, -161, 59, 138, -113, -97, 159, 69, -189, -44, 159, -33, -146, 84, 96, -143, -77, 160, 29, -185, 0, 161, -65, -123, 94, 67, -158, -44, 173, -1, -178, 48, 151, -88, -105, 125, 47, -160, -3, 186, -32, -177, 75, 149, -117, -69, 147, 33, -164, 33, 193, -61, -153, 112, 126, -129, -56, 150, 2, -162, 58, 171, -99, -155, 107, 84, -133, -44, 136, -42, -159, 71, 136, -127, -115, 118, 59, -149, 2, 136, -64, -139, 105, 126, -132, -97, 141, 31, -148, 19, 134, -85, -126, 134, 96, -155, -56, 156, 7, -144, 59, 123, -119, -101, 163, 64, -165, -31, 149, -36, -139, 82, 103, -139, -86, 165, 29, -169, -3, 140, -71, -132, 95, 76, -150, -51, 157, -1, -172, 35, 137, -74, -93, 121, 59, -147, -8, 170, -24]
6126b4j32K23N2k38L1K20j15j77J81J27k04r5K38J1k22P2K07j51j67K04J09k45
6148i5l8K41l4k27J14J82j78j23K18N9k43PK33q3j90J60J38k02q1K43Rk36N4K20
6172A48j26j63J77R2k05m1K33l6k16R8J88j59j39K07O2k27RK17o5k04J35J67j99
6195d7r7K18L8k30L8K14j03j86J69J32k23n2K18kk27Q4J90j41j34K02O9k20j3
6218a03K39o8k07J21J64j83r5K19L2k31L6K07r3j80J53J26k09n2K11Ok22P3K03
6241A47j45j52J77R6k04k4K16m4k17J14J89j60j33J95O6k25L2K21j06k04J61J40
6263A40j78q7K03K0k25P4K03j52j54J89J08k10m5K15k4k14J16J71j78j19K02O5
6285A20k09nK00p6j72J37J48k02r6K25L9k18L7J81r5j48J74R4k00n5K27j3k30
$$ y = [-24, -156, 67, 119, -119, -88, 132, 17, -160, 21, 148, -56, -151, 87, 98, -124, -52, 155, 4, -163, 41, 150, -95, -133, 108, 74, -153, -39, 143, -35, -158, 60, 119, -124, -117, 116, 33, -157, 3, 141, -61, -142, 101, 110, -126, -72, 148, 22, -141, 36, 128, -77, -118, 115, 79, -137, -39, 149, -10, -149, 58, 120, -107, -98, 119, 54, -150, -15, 152, -47, -144, 74, 112, -118, -80, 134, 31, -155, 14, 146, -77, -129, 89, 87, -140, -56, 134, -7, -141, 61, 130, -90, -103, 136, 68, -139, -18, 146, -37, -132, 87, 119, -112, -76, 131, 38, -142, 11, 137, -72, -124, 87, 93, -129, -56, 147, 2, -150, 27, 123, -81, -105, 111, 67, -150, -36, 153, -7, -140, 55, 121, -104, -72, 149, 43, -161, 0, 140, -38, -125, 78, 98, -127, -53, 150, -2, -156, 33, 141, -69, -114, 101, 77, -137, -21, 150, -28, -147, 55, 120, -89, -94, 106, 30, -142, -5, 143, -59, -155, 70, 109, -109, -72, 109, 14, -134, 40, 134, -66, -121, 106, 93, -137]
6308a37R9J78j52j17K00N3k22qK31o0j98J07J51j73q5K24J7k33M3K14r8j83J62
6331A3J07j93m5K20l0k28Q9K06j35j37J64P8k02kK20p0k12J29J75j62j07J86M1
6354A05k10M2J96r0j93J52J43j83p1J92pk02Q2J95j54j71J81J21j94m3K05m7j97
6377a48J20J72j73j33K11O0k03OJ96q4j84J63J50k04j01K26K1k06M0J91j23j39
6399a42J90R1k16n4K37rk07P6J76j62j03J96P4k38pK15n5j96J24J19j71o5K12
6422H5K8k39L2K17r6j68J50J08k01l5K24l1k14P0J92j21j33J62Q8k16nK26o0k23
6446a60J25J73j53j08J80M3k18O1K11j07j93J68J15j76o9K08j7k01P5K02j49j49
6468a39J57J13k07j4J95n8j83J03J60j55j27J97O1k01J8J86r0j55J46J36j90p9
$$ y = [-137, -38, 140, -12, -129, 71, 124, -98, -106, 125, 65, -133, -26, 125, -48, -133, 91, 108, -125, -82, 132, 34, -149, 13, 120, -73, -118, 102, 72, -156, -67, 139, 4, -133, 31, 109, -93, -95, 125, 55, -157, -28, 147, -15, -122, 64, 105, -105, -63, 133, 43, -150, 2, 145, -38, -109, 83, 76, -126, -44, 151, -3, -174, 7, 128, -66, -109, 96, 49, -148, -28, 144, -29, -162, 49, 109, -94, -88, 108, 24, -160, 3, 153, -51, -152, 74, 95, -111, -71, 120, -3, -142, 48, 139, -77, -131, 106, 97, -110, -34, 142, -20, -123, 73, 147, -91, -98, 117, 62, -134, -10, 109, -62, -127, 85, 113, -126, -94, 123, 27, -141, 9, 117, -84, -119, 105, 74, -140, -70, 122, 1, -132, 30, 118, -98, -103, 123, 63, -160, -35, 138, -15, -123, 57, 100, -118, -57, 154, 47, -146, 22, 137, -39, -108, 100, 83, -118, -43, 159, 10, -139, 18, 131, -76, -90, 105, 47, -136, -33, 127, -28, -155, 42, 103, -98, -80, 106, 16, -139, 7, 143, -47, -126]
6490a26K00K5j98N5J75j21j50J71J04k00m6K09j6j92Q4J62j52j15K01N1k12oK06
6513A09o5j74J31J29j74q0K04L1k21L1K06j05j54J48J04j81n3K02j0j96O1J84
6535A27j37j13J68N7j87k0K05m2j83J02J60j62j05J89M1j95L2J88j06j49J27J36
6557A33j92n9K02pj99P5J76j30j43J77Q2k04j2J99m5j80J03J50j58j09J99M7k06
6580a01K6J89p8j73J35J20j60p4J89J2j88L7J91j11j41J57Q7j84l3J97k0k05Q6
6603d2J67j17j21J46N7j81NJ92p9j75J34J41j54r8J86K1j85M3J75q4j78J52J26
6626A31j78j4J39j9j66P1J61j50j33J94J09k75J4K30r1j37J21J32j86p3J49O7
6648I6j48L3P5q4q5J48Q3j33j19K20O2k91R7J22o7j59K12J7j78j0K17l8j89R0
$$ y = [-126, 74, 99, -99, -44, 131, 10, -140, 31, 135, -65, -111, 98, 82, -110, -26, 136, -16, -131, 70, 121, -91, -97, 109, 44, -130, 1, 130, -44, -124, 80, 111, -110, -79, 127, 22, -132, 16, 120, -61, -114, 88, 78, -118, -57, 127, -10, -123, 45, 102, -85, -105, 100, 58, -125, -23, 137, -25, -130, 59, 100, -95, -63, 125, 19, -130, -3, 133, -59, -118, 84, 77, -122, -47, 129, -1, -144, 33, 115, -89, -101, 98, 53, -127, -24, 126, -32, -141, 58, 105, -101, -75, 114, 36, -137, -2, 118, -42, -116, 73, 85, -103, -66, 125, 14, -127, 30, 117, -67, -100, 97, 77, -128, -42, 125, 8, -113, 33, 90, -91, -86, 106, 27, -148, -14, 127, -27, -125, 61, 82, -103, -60, 115, 31, -147, 5, 131, -47, -61, 78, 59, -107, -36, 125, -25, -158, 36, 145, -130, -116, 114, 23, -114, 7, 139, -47, -120, 29, 96, -52, -19, 56, -28, -113, 35, 118, -15, -134, 86, 148, -143, -46, 76, 9, -150, 62, 79, -99, -109, 108, 70, -119, -29]
6672b9J48j47q4J78M0k04J1K01o1j67J19J13j62n4J93k2j91N5J86r2j52J42P5
6695I6j60k6J82k8j99R1J70j23j12J36N8j65QJ85o4j68J01J35j43q3J58K2j70
6718i9L9J74j00j58J42J18j56p4J83qj72Q1J59j29j26J62Q2j70l6J79m4j64J07
6741a0J26j43j09J94L6j77J2J68p1j57J41J09j60q5J89K7j86M9J35q8j15J46P6
6764A07j71n6K06k6j58O2J36j20r6J69M2j81rJ87m0j52Q8J11j34o5J80J4j93L7
6788f2J56o1j42J24Q3j59k1J66l0j74O3J60j19r9J43N7j66kJ83m8j85J07J33j23
6812a6q0J42K3j59K8J62p5j41J05J27j56o7J65kj51N3J51j11j21J27R6j69j1J58
6836G8l5j49Q2J26j28r8J62M0j52oJ76p8j37J13R9j36q6J79J9j69M3J55j04j21
$$ y = [-29, 119, -28, -112, 66, 106, -98, -87, 114, 53, -114, 5, 118, -44, -98, 95, 73, -118, -63, 123, 31, -121, 21, 96, -64, -90, 92, 64, -135, -44, 126, 3, -109, 27, 85, -80, -72, 113, 49, -119, -18, 117, -26, -109, 49, 71, -99, -60, 114, 14, -144, -2, 116, -40, -114, 69, 61, -111, -30, 129, 0, -126, 36, 118, -52, -88, 91, 47, -117, -10, 116, -27, -136, 58, 94, -83, -71, 97, 26, -131, 10, 119, -41, -126, 63, 90, -96, -47, 88, 0, -115, 31, 107, -64, -120, 86, 60, -98, -36, 100, -20, -116, 53, 95, -86, -95, 92, 52, -100, -12, 99, -35, -100, 80, 94, -99, -62, 94, 33, -109, 15, 98, -61, -82, 84, 54, -120, -57, 103, -16, -115, 28, 85, -81, -83, 100, 52, -133, -26, 107, -16, -96, 46, 69, -90, -62, 100, 25, -116, -11, 116, -40, -107, 58, 56, -95, -42, 109, -2, -123, 4, 100, -69, -80, 78, 43, -106, -24, 102, -26, -124, 38, 78, -74, -80, 96, 18, -119, -6, 93, -43, -129, 50, 69, -100, -57, 98, -6, -127]
6860a27J40R2j63k8J71k3j63P5J27j17r3J50O2j66j3J54m0j40Q3J15j28p5J62
6883E5K5j68L5J43p4j24J15P8j31m8J50Kj63M5J51j00j03J28O3j42l4J73m4j40
6907a08P1J41j35q2J56K7j71M4J39m2j66J23J17j35p2J65jj47J7J42r6p9J18N6
6931H2j18m8J39Mj54N1J16n5j46K27K9k37J1J65k7j62P1J26j28o0J59L1j42j8
6955h4J81j01o4R5O9j31q9K06j3j77P4J59o5j77J24O4j06k0R3Jj25J64K5j38O
6980b9J12J7j80RJ55n7j25R1J02j34q1J39L0j47P0J43j33r3J44M8j07l3J24l6
7004B9r5O1R9j19p6J41M2j53K7J31o4j20J09J15j69m9J52K0j33pJ58j35o3J37
7028C8M3j52j1J51j4j44N7J30j39p2J41L9j51lJ67n9j44J16Q8j44n5J83%j51N4
$$ y = [-127, 13, 105, -58, -86, 85, 62, -101, -26, 101, -16, -109, 41, 103, -63, -76, 78, 38, -102, -19, 96, -32, -107, 55, 80, -88, -53, 90, 16, -108, 7, 85, -46, -94, 56, 58, -105, -60, 91, -9, -112, 16, 79, -63, -97, 76, 32, -108, -37, 104, -31, -113, 43, 70, -101, -57, 82, 40, -126, -3, 114, -21, -93, 72, 71, -76, -59, 83, -13, -92, 26, 82, -36, -84, 55, 59, -95, -44, 72, 17, -129, 98, 127, -110, -99, 66, 39, -123, -52, 74, -54, -114, 45, 76, -66, -84, 97, -4, -68, 27, 96, -35, -124, 82, 69, -108, -34, 125, 60, -117, 7, 71, -35, -55, 38, 39, -86, 78, 103, -35, -29, 83, 100, -80, -71, 84, 27, -98, -7, 95, -39, -120, 19, 49, -98, -28, 115, -18, -111, 33, 81, -26, -59, 65, 29, -66, -5, 94, -25, -101, 40, 82, -71, -44, 87, 23, -97, 12, 127, -42, -91, 61, 81, -52, -59, 99, -36, -99, 38, 81, -71, -82, 69, 55, -89, -32, 98, -41, -113, 28, 67, -84, -87, 80, 21, -123, -7, 81, -63, -118, 65, 65, -86, -32]
7053c2J41p3j13P8O6j25K7J05l5j31N9J42j01o1J00k7q6J4J41p7j14R3P2r5n9
7078i1J41M3j68J3J13p3m7P2O0m1m7O5j0j32Q6J05j02r1J36M3j27rJ30m7j12Q9
7104aR1j15o8J31L9j38QJ36o3j09J09N3j19l9J50j4j33N0J05q4o6J06N3j34k0
7129g2J29rj27O6Q0r3o0J26K2j41QJ48m7j26Q8P7j18l3J41jj42L2J42p3j04J09
7155B2N4j29KJ31l2j31O7J15j11o9J09L8j45K7J33o5j12P4J07j15m7J06J8j25
7179g8L5J23q0j04R9Q2j18k7J28j9j19O5R5q9q5J21M3j28oJ33m6j10P4J01j10
7204b0p3J35K6j28RJ27o7j00J04O1j21l3J29Oj34M6J11q6q6J08N6j30j9J34k3
7229C2j23O6R3j00n3J21L4j39K1J28o2q9P2P5r7m1J13lj20M1J08p5q6J14K0j02
$$ y = [-32, 109, 36, -77, 1, 67, -58, -31, 74, 39, -92, -33, 109, 8, -53, 47, 20, -66, -52, 89, 12, -102, -9, 63, -32, -91, 50, 93, -75, -62, 51, -22, -69, 3, 63, 22, -25, 40, 30, -102, -16, 89, -13, -104, 32, 75, -52, -61, 69, 22, -90, -1, 90, -25, -93, 38, 77, -61, -53, 83, 20, -89, 20, 73, -46, -85, 65, 51, -82, -32, 73, -11, -77, 29, 82, -52, -72, 57, 48, -79, -13, 67, -26, -86, 40, 62, -79, -71, 77, 30, -96, -8, 69, -49, -82, 59, 58, -84, -52, 90, 17, -87, 22, 76, -53, -51, 80, 48, -83, -16, 99, -12, -81, 28, 66, -79, -52, 81, 16, -96, -22, 85, -30, -77, 29, 47, -78, -43, 80, 0, -104, -5, 77, -41, -68, 60, 41, -78, -13, 82, -7, -92, 29, 72, -56, -62, 71, 25, -85, -11, 90, -20, -93, 42, 68, -60, -51, 76, 9, -91, 13, 74, -47, -80, 49, 55, -79, -33, 78, -8, -94, 14, 70, -60, -79, 55, 32, -91, -25, 68, -32, -85, 36, 70, -69, -48, 80, 18, -71, 1, 76, -21, -62, 51, 48, -72, -31, 77, 2, -84, 30, 50, -52]
7255e2J1J52k4k45J70N3j38j5J58J7j24m5J57m4j35J45M7j17n5J19K3j56M1J22
7279F5o6r8R7O9j17k7J29j4j27Q1P3p9o7J09L8j19rJ29m1j08O4R3r8n8J16J3j33
7306h5L4J24o5r2Q1O7j08l2J26j5j24M3J21p9q6J03M9j18nJ22l3j20Q2Q9r3q2
7332i6J24K4j26L1J23o4j08R4P2j04l5J22pj17M5J02q4p2R6N9j19j4J08l1j05
7357h2P3Q4j11n9J20M3j29KJ07m6p9P2P8j12m5J36J2j33L7R0n8r0J30K1p1l4Q8
7384D4J6j40P2P0q0n9J25K3j29J5J14l4j01N6Q3j04k6J12nj24L1J10n5q9P7N8
7410F0r9k4J13k1j07M7J03q4n4P6L9r4%J08m4r8P5P4p8n2J02Pj00K8J10q2j01
7437i6J04P1j11l7J10pj03N4J03j01o8J12L9j11rR3j6r6P1Q2j09o8J22K6j20K8
$$ y = [-52, -41, 111, 87, -158, 12, 65, -73, -88, 70, 87, -37, -82, 75, 31, -104, 41, 88, -29, -84, 35, 58, -98, -57, 65, -1, -99, -2, 67, -50, -77, 52, 38, -89, -8, 65, -14, -81, 28, 66, -53, -62, 67, 26, -82, -18, 75, -23, -81, 35, 48, -85, -51, 73, 8, -84, -3, 64, -44, -76, 50, 35, -89, -46, 75, -4, -90, 13, 62, -56, -61, 61, 28, -92, -10, 79, -14, -96, 28, 52, -74, -43, 80, 16, -92, 2, 74, -30, -65, 57, 50, -67, -22, 80, -4, -76, 20, 79, -40, -54, 54, 23, -82, -9, 75, -36, -95, 25, 68, -61, -59, 48, 2, -77, -5, 73, -39, -84, 52, 64, -69, -32, 58, 0, -90, 40, 61, -10, -44, 44, 60, -80, -8, 62, -18, -77, 48, 71, -58, -43, 71, 37, -64, -8, 75, -29, -55, 57, 52, -72, -41, 69, 14, -75, 2, 60, -39, -63, 50, 29, -78, -31, 72, -12, -66, 10, 49, -45, -45, 63, 19, -79, -4, 70, -8, -60, 42, 49, -51, -23, 87, 5, -96, 8, 79, -32, -69, 41, 34, -69, -15, 88, -13, -81, 31, 70, -41, -50, 43, 27, -69, 2, 84, -25, -93, 29, 55, -65, -37]
7463c7Q6m7q3R6N6j07l8J23Jj07K7R0p2n7R7M7j22j0J24j9j08L8Q0q0m0Q3L0j00
7491d9j1J14k5r6N8Q3r8k0R9m0q4M3Q3q5l5L3P1j05K3R7j7j29Q2P2r2l7N6K1o9
7520e7QJ09k0j06J4J07q8j7J28o9p8M2R2l4j01M0J13j04o9J06j9j9q3J24j26J05
7546bqR1p8o6J29l3q8K7N1l2n0O3O1j85P7J75j05r9J05Q6j87LP8O7r7K2L3n6o0
7575g8J47l2j08M5Q9Lr6L4N3p8o9R9J1p4M1P1Oj43K1J10j22p8J20j0%n4J70q5
7603gm6N8J30j68NK7K0r3M7Q5j14L7KR2j41N3M5N6j25M4K9p6J6N5J0j03nQ7j5
7632Eq0L1R0p8k2J42m3q7oJ15j21k9Q2Q5j05p0J40q4n6M9M8j6r8J39J4j41M5Q4
7660C3l1r8J02Q2j32nN6nm9j4J07k1j22J30J2l8j2O3m4p5P4O6o4r5J35l5p2M6
$$ y = [-37, 49, 2, -81, 15, 71, -36, -74, 49, 50, -57, -30, 60, -12, -69, 28, 75, -47, -57, 67, 48, -60, -22, 58, -22, -62, 21, 51, -49, -60, 54, 29, -67, -9, 74, -24, -44, 55, 15, -69, -26, 57, -28, -63, -30, 41, -64, -41, 56, 39, -90, -8, 64, -28, -65, -9, 12, -57, -49, 60, 40, -66, -52, 55, -33, -50, 78, 9, -69, -27, 65, 31, -70, -30, 83, -21, -90, 16, -3, -22, -105, 19, -107, -2, -10, 81, 3, -63, 66, 33, -55, -28, 23, -9, -59, 4, 65, -120, -43, 132, 27, -72, 33, 119, -68, -65, 13, 80, -17, 5, 38, -18, -78, 69, 37, -71, -26, 63, 66, -30, 4, 57, -21, -90, 9, 20, -54, -13, 58, 64, -79, -58, 52, -70, -148, -28, -38, -38, -92, 78, -7, -53, 5, 135, -33, -28, -1, 19, -74, -27, 58, -56, -19, -17, 75, -66, -13, 32, 88, -37, 7, 36, -40, -24, 31, 41, -62, -67, 20, 5, -75, -44, 46, -32, -54, 88, 45, -42, -48, 67, -54, -83, -1, 84, -21, -91, 49, -35, -91, -42, 6, -10, -108, 31, 45, -96, -51, 33, 2, -96, 6, 88, -44, -49, 7, 2, -47, -61, 46, 25, -97, 33, 45, 7, -5, 58, 14, -61, 13, 79, 15, -80, 55, 20, -52, -6]
7688fK0m0k1L6R0p0l8O9m0m9L8O5m5o3L7Q3r0j3O1Nr7J28n2%j44K08j0n9o1M4
7718a4M2l6M5J4rj37J28K0n8%P6j09O0n7N8n2mN3n2Nj2P7l0p7N6O7j61O1J24m1
7748C7p7O4Rn8l5J18o3j1m8R8l8p6J22j8r8k2J03K5m7rQ9o8q7J60Qj09L8L0o9
7777c2q1J21K3n2m4Q1Pp9oQ2k5o5P8M4p7m0R6on9kO9k8m6N7K8o4k0O4j7p5M6K7
7809Eo1J2N3M4p7K4J8k8n2Q3N2j19k9R6Rr3N0M0l1l3L8L2p1j5N6Nm7L5L1l7n5
7840f5J10k6p5J3M5qk9PM5n4j2L3L4o5k3J45n4q5P3rl4kQ4n6n4L9Q3n5o4O9K1
7871C1o0pO1%r0M7M4n1m9Q9j1J3k4J5qm9L6M4p9L8R7n9j01Q6L0n6j7N5nn4k3P5
7903A8J9p1N0M2n9l7O2J2m8lO2l9l8L2J8o9K3P0l3n8L9M4n4k2N7Oq0K9N9k1n0
$$ y = [-6, 14, -26, -47, -11, 79, 9, -29, 40, 0, -49, -11, 54, 9, -54, -17, 66, -24, -37, 24, 29, -68, 60, 8, 8, -136, 72, 62, 3, -58, -14, 28, -8, 37, 51, 42, -95, 33, 53, -5, -5, 71, -38, 22, -35, 23, -29, -33, 20, -32, -27, -39, 38, 8, -69, -13, 54, -107, -46, 78, 37, -40, 24, 33, -25, -60, 58, -5, -16, -64, 34, -4, -80, 42, 24, -74, -96, 7, 32, -15, -24, 65, -3, -90, 70, 78, -31, 7, 37, -32, -113, 8, 31, -21, -65, 16, 23, -56, -62, 20, -5, -70, 8, 52, -25, -65, 31, 25, -34, -36, 33, 5, -41, 16, 44, -20, -40, 24, 7, -68, -22, 5, -56, -44, 9, 53, -24, 0, 18, -10, -62, 21, 73, -46, -75, 21, 30, -63, -13, 27, -4, -37, 1, 33, -38, -53, 3, 8, -39, -4, 27, -10, -65, 45, 19, -56, -43, 2, -6, -35, -28, 17, -37, -49, -16, 18, -47, -70, 75, 21, -64, 9, 0, -34, -36, 48, -8, -62, -23, 60, 5, -59, 10, 31, -29, -36, 25, 25, -65, -18, 26, -25, -74, 15, 4, 17, -7, 8, 0, -49, -13, 31, -48, -10, 87, 28, -73, 13, 43, -13, -30, 25, 20, -34, -57, 18, 37, -34, 16, 58, -1, -38, 24, 36, -12, -15, 47, 8, -30, 2, 20, -49, -26, 44, 11, -47, -8, 36, -18, -40, 17, 23, -57, -28, 31, 10, -40]
7934d0K4O4m7o8Q1Lm9NO4k4n5L9K9m3j7N3J1o0J5M8m1l1N4J9o0%M4pn6K7M9m2
7966a1k7N5Mo2NO5m7l3M8Ol8j7O2Rp4MP9l8j0L0j6ml1P6pp9M4O4q8k1P7Nm9m1
8000f0Q4M1j34M0O6l2OR%j7j9L9k7m2M6K8n0j2O3k1n4L1M7n5k0M7lm4J8M9k9m6
8032e1M8L0m9j4N7Ln8J6L9k4j3L3K2m9l7P6j0m5mN8k2n6O7Lm4NL8mn3M7L0l0m7
8065c8L4K7p8J9M2j0l8M0K1o3L4J7qm2N1j3k6l3N5L9m3oL2K7o6J2M8l7lL8K6p7
8097a9K4K4j5Jl0P3p4J1O8o7n8M0L7j1j3Mj0Ok9M7J3q5O3K1Kq3R7Np0J3M3n1J
8130b2J9NkJ7j3kl0pJ13q2l8L5N9q2K4j6J0oJ3L9j9l0JN2o1qM7l5k6K3K2j3k6
8163c9O2l5JK0l4L5k2J8j8oPL3J1n5K1K8m8j7M4L8o0j8N5ok6PK0j5
$$ y = [-40, -16, 48, 1, -67, 14, 17, -32, -27, 37, 13, -42, -3, 26, -17, -34, 19, 30, -30, -15, 33, -8, -39, 15, 34, -26, -26, 18, 11, -45, -18, 31, -11, -38, 17, 21, -41, -36, 29, -18, -51, -3, 3, -35, -52, 10, 19, -55, -51, 28, -10, -20, 10, -6, -10, -41, 35, 28, -51, -7, 57, -31, -52, 25, 30, -19, -60, 24, 65, -69, -29, 37, 5, 11, 20, 20, 3, -16, 23, -4, -46, 0, 28, -22, -34, 29, 8, -46, -15, 32, -23, -43, 4, 1, -43, -25, 24, -5, -51, -3, 27, -22, -36, 21, 24, -34, -18, 21, -3, -16, 17, 39, -10, -47, 29, 19, -26, -30, 28, 6, -50, 17, 20, -24, -19, 19, 15, -38, 9, 39, 9, -38, -4, 23, -55, -36, 6, -4, -42, -2, 19, -44, -10, 7, -1, -43, 8, -5, -31, -64, -9, 30, -13, -19, 13, 40, -26, -14, 34, -3, -6, 32, 58, -19, 5, 29, 14, 15, -15, 58, -16, -5, 63, -4, -62, -22, 15, 4, -9, -5, -15, -9, -38, 9, 22, -63, 0, 21, 23, -60, 37, 42, -28, -15, 28, -23, -22, -3, 2, 0, 17, 4, 2, -28, -35, 78, -4, -42, -7, 52, -30, -6, -22, -12, -18, -5, 34, 15, -15, -14, 38, -23, -31, 16, -19, -45, -22, 0, -13, -39, 23, -12, -11, 9, -25, 10, -12, 6, -12, -18, -11, 22, 33, -22, -1, 27, -21, -38, 6, 44, -16, -34, 21, 15, -11, -4, 16, 1]
8191A
$$ Imaginary data points
##PAGE= N=2
##DATA TABLE= (X++(I..I)), XYDATA
0@%%%%%%%%%%%%%%%%%jRj6J6j6J6j7K5l2L2l8M6n0N8o6P4q6R6j07J22j38J54j71
40i0J90k11K35k60K86l16L50l85M23m66N13n66O23o88P62q43R36j043J168j318
60g00J499j719J996k362K868l607M789o976J2284m6828m6960J49766n247j29095
74g0292L4558J11492p0902p7120R1403M4478j06003n341J02229k9764q8822O6396
86B312O3443r4857l5105J16254L506j22690K5934J16446n4564r6604P8038O9185
98G1298r5449l5825J03624K994j01044K7712Q5528n4631o0262P7073K8699r2099
110d2382M736R8358l6494r4119O3054P8757q3729n4304R7130K4045j03016P086
122d0878R9927l4996q6876N7052O3902p2916l4354Q1251J418q1805L0899P4980
$$ y = [0, 0, 0, 0, 0, 0, 0, 0, 0, 0, 0, 0, 0, 0, 0, 0, 0, 0, -1, 8, -8, 8, -8, 8, -9, 16, -16, 16, -22, 24, -26, 32, -34, 40, -46, 50, -57, 65, -73, 81, -90, 100, -111, 124, -136, 150, -166, 184, -201, 222, -244, 269, -297, 326, -362, 400, -443, 493, -550, 618, -700, 799, -920, 1076, -1286, 1582, -2025, 2764, -4212, 8072, -38756, -85716, 64050, 58803, -70292, -35734, 75758, 4856, -72264, 19139, 63617, -42386, -47727, 54502, 24738, -64084, 2312, 65755, -29102, -64207, 52047, 55553, -67137, -41203, 75243, 20679, -75925, 2113, 71298, -24151, -59976, 43648, 46642, -54402, -26690, 58838, 4207, -56055, 21018, 49717, -42382, -37646, 60712, 24218, -69901, -6847, 71910, -11819, -66123, 31007, 55052, -47964, -40878, 59049, 24053, -62823, -5771, 58131, -14785, -49139, 32112, 33530, -48275, -17376, 57604]
134E7604n8049o0231P7472L7872q8863j0476R2509j7883q8026M3821P6312o3562
146a500n7329P5737L2735p9653m668P5937k3495o5580M8302M9835o6150k8773
158d4602P5924L883p8022K1843P2467m5814o0568O5218M3736p7329k3090Q0690
170C4336m73p6225K4127O4657m5394m7670O1279K6651o9847l248P0278k0639o3122
183d5290M2633M9369o0869l1363P2933J1183p6754J0152P2496l0654o1257M8041
195F20M4324o0489k3602O6900J918o5731J9276N7331l8158m2829N3255K4383o3005
208b5807m051O6243j6052o2269L4500N1986m9478l6559N9570J7450o4282K554
220b6195O2612k1379n4293L7664M0207n0159k2433N7146K336n8435J7649N3686
$$ y = [57604, -445, -60676, 16796, 54668, -34195, -44671, 47838, 29955, -58071, -14250, 62062, -1500, -58829, 16908, 49643, -30010, -34678, 41259, 17764, -47816, 486, 50321, -15829, -44602, 31322, 35205, -42817, -20974, 51493, 5679, -54889, 10329, 54065, -23264, -46354, 34336, 33863, -42362, -18235, 46422, 1028, -46642, 14637, 41288, -28559, -31807, 38471, 17832, -45290, -2657, 46712, -14157, -45520, 27413, 38596, -38158, -28006, 44490, 13836, -47421, 620, 44944, -15545, -39147, 27753, 29671, -36060, -16784, 40547, 2389, -40440, 12815, 37198, -25807, -29858, 36385, 20333, -41936, -7436, 44550, -4928, -41487, 18083, 35533, -28749, -26195, 36417, 15038, -39255, -1591, 38616, -11543, -33976, 23170, 25506, -32929, -15280, 38406]
232C8406l5553m3337M9720K8357n8993j0527O2445q206n9817K5733N1188m0424
244a008l7284N1188K0218n6383j452N5657j7261m9314L3829L8088m6417k2702
256c2841N4487N397n7072J2051N3722k8066m4894M1241L1706n0356j5648N4513
268B4240j422n3179J7842M6389l2142l5023M2739J9875m9203k777N1029j4073
280A4295m7676K8994L9119m1046k6583M8885J1087n2041N663N0472k1461m4143
292c4435L4503L3210m3670j8672M8330J980m8314J4865M3867k9668l5002M1042
304H036K2574m7708p604M9319q627m6263K4195L9490l6667k9020M4787J5665m8035
317a9858o35M6259j4666m0184K8581L0803l9142j8933M4940N213m5597R320M1422
$$ y = [38406, 2853, -40484, 9236, 37593, -21400, -31927, 30518, 22312, -37505, -11772, 39416, -1008, -38292, 12896, 33114, -23269, -24721, 30936, 13675, -35639, -1810, 36278, -10139, -32841, 21646, 27043, -30029, -17978, 35744, 7678, -37216, 4025, 35731, -14625, -30273, 24240, 22818, -30361, -12519, 33870, 1728, -33295, 9444, 29319, -19884, -22661, 28368, 14295, -33381, -4387, 34732, -6314, -32897, 15988, 27075, -24966, -19303, 31169, 9708, -34435, 68, 33278, -10392, -29064, 19266, 21246, -27068, -12203, 31664, 1996, -33006, 8036, 30610, -17098, -24702, 24617, 15990, -30273, -6078, 33412, -3255, -32275, 12512, 28177, -19858, -20493, 25766, 11100, -29084, -503, 30300, -8842, -27775, 17165, 22378, -23219, -13899, 27523]
330B7523k3560l3707L5513K3346m3523j1133M6620k109m4616J5369L7821k7822
342b78k7752L7819J5820m3537k775M4188j0508l9779K3092L1078l3923j9505M1714
355A5654O712m5056O285M3245j8408l6396K9111K5637l7541j2808M2473m64m2777
368b4333J3078L8315k4001k9359L2610J6986l8594l391M1163r570l9337K0747
380e686L2988k9552k2715L5648R833l8915L586L8842j5762l4986K5493K7148l2179
393f257j5845L5890K484l6909J0707L4762k1992k9046L0370K0009l5309q137L6880
406A7607n109l5657J7664L1578k7589k4356L3942J4245l6453j903L5573j1095
418H447l1874K2782K5626l1423j7032L6023O423l6347N633L3151j7689k7526K7780
$$ y = [27523, 3963, -29744, 5769, 29115, -14408, -25541, 21079, 18970, -25646, -10277, 27544, -278, -28030, 9789, 25609, -17928, -20703, 23485, 12977, -26802, -3710, 27368, -6555, -26060, 15654, 22366, -22690, -16405, 26840, 8432, -27964, 1147, 26784, -10757, -23565, 18908, 18444, -24333, -11255, 27060, 3059, -26300, 6310, 23296, -15298, -18689, 22474, 12904, -26433, -5686, 27302, -2250, -24965, 10683, 20516, -18399, -14813, 24029, 8267, -26719, -1226, 25922, -6257, -22102, 13788, 16272, -20637, -9930, 24832, 2840, -26206, 4164, 24173, -11136, -19273, 17607, 12498, -23159, -5495, 26083, -1506, -25862, 8080, 22325, -14128, -16031, 19542, 8447, -23427, -645, 24981, -6442, -23474, 12549, 18972, -17375, -11742, 21409, 3720, -23806, 3974]
431C974J9851l4392j0539L6758P5l4821J0953K9459k1500k1991K9861J3249l4641
444a3704l667L5105o391l1437J6467K4721k5495j6210L2088O835l5117K702L3898
457A9795j1981k8561K0786K0323k8224j0745L3004P58l4100Q826L1093j7492k4273
470b0791K4929J4828l0526m346L3274n864l2432J4936K7672k2419j9487K8138
482G912R263l1581J460L2126j1390k9352J9521K3156k5418j4002K9143L376l0502
495a6288P136K9077j6324k4710K3325J7518k7763q123K9700k195k9154J2028K6057
508B0284k0163k0385K5733J2330k8558k647K8828p433k6583J6582K1893k3724
520c843j5111K8021O501k9282L211K7798j2780k3915K0926J7842k6682j0031K9371
$$ y = [3974, 23825, -10567, -21106, 15652, 15727, -19094, -8141, 21318, -182, -22173, 7688, 20937, -13704, -17371, 17734, 11343, -20094, -3627, 21094, -4401, -20611, 11477, 18312, -16805, -14103, 19795, 7814, -20747, 39, 20362, -7862, -18607, 14397, 15155, -18945, -10119, 20974, 3482, -20791, 4138, 18966, -11560, -15906, 17368, 11504, -20928, -5992, 21680, -739, -20226, 7912, 17175, -14406, -12946, 19180, 7790, -21562, -2041, 21115, -4303, -18305, 10838, 14214, -16288, -9152, 19925, 3601, -21109, 2216, 19734, -8029, -16152, 13548, 11353, -17801, -5773, 20284, 121, -20264, 5469, 17799, -10759, -13406, 15422, 7989, -18594, -2012, 19881, -3843, -18954, 9067, 15568, -13714, -10503, 17295, 4515, -19400, 1526, 19368, -7314, -17345, 12026]
533A2026J001k8902Q450K5587j7156j9972K4058J2650k8217m172K9148m838k6952
546a7289J3593K2235k0962j5490K6120P441k8406J155K7591r668k3844J7353J7928
559A7757k3337j0448K6827K167k7439O156K5104j3956k0170K0390J3294k4842
571h497n249K6721l174k5819J1126K2150j8090j6182K3243Q672k6067l58K6196
584A4672p932k3654J5354J8631k1229j1690K4990L666k6171M700K4673j2518k0641
597a7149J9094J4520k3662o998K5827j092k5275R026K2220j5947j6942K1245J0048
610A4915k4385k318K5018n452k3043J2674J8664j8589j2543K2634N294k4455K266
623i320K3684r437k0471J5654J5065k0394q242K3163P05k3705O600K1723j3121
$$ y = [12026, 13027, -15875, -7425, 18162, 1006, -18966, 5092, 17742, -10475, -14647, 14501, 9663, -17289, -3696, 18539, -2423, -17913, 8207, 15648, -12758, -11603, 15988, 6320, -17524, -171, 17757, -5580, -16028, 10799, 12966, -14473, -8317, 16787, 2831, -17339, 3051, 16345, -8497, -13746, 12975, 9801, -16018, -4892, 17258, -832, -17014, 6229, 14901, -11166, -11524, 14672, 6740, -16914, -1560, 17071, -4158, -15848, 9142, 12808, -13363, -8663, 16010, 3492, -17149, 1945, 16465, -7197, -14195, 11632, 10540, -14735, -5709, 16511, 564, -16378, 4867, 14915, -9470, -11788, 13230, 7778, -15265, -2591, 16073, -2516, -15059, 7575, 12869, -11586, -9320, 14364, 4927, -15544, 110, 15175, -5219, -13461, 9702, 10407, -13298, -6698, 15025, 1904]
636A904j7381J8383J1103k1927l715K3428l883k2651J0820J9487j6449j4035K0489
649E573O996k2612P86K2770q235k0717J4550J6496j9072j0304K1710K886k2342
662a1515M889K1021j1890j7771J7262J2672k0584o031K1760j418k1039Q734J8496
675A4586j4946j4405J9161Q807k1185k078K0940n148j8920J1914J5351j7306j0553
688a3782K0506M640k1276K007J9809q821j6557J4922J2076j9388o650K1491O28
701I605k1012N831J8280j2022j3846J7296Q486k0676k541K1565l532j9842R550
714b858J5945j4931j0607J9080M658k1187J331K0760p071j7790J2290J2847j6694
727d227o870J9620O70k0558N051J9022j0158j5202J4351R654j7595l358J9334
$$ y = [1904, -15477, 2906, 14009, -7918, -11633, 11795, 7912, -14739, -3919, 15568, -881, -14916, 5573, 12569, -10043, -9257, 13513, 5278, -15439, -889, 15607, -3465, -13769, 7941, 10827, -11515, -6626, 14395, 2505, -15266, 1996, 14668, -5916, -11947, 9813, 8395, -12644, -3910, 14586, -360, -14765, 4396, 13203, -7982, -10060, 10880, 5732, -13188, -1274, 14077, -3229, -13782, 6724, 11364, -9912, -7905, 11904, 3083, -13474, 1448, 13524, -5864, -12514, 8977, 9605, -11407, -5576, 12704, 682, -13164, 4132, 12618, -8058, -10599, 10966, 7434, -12408, -2858, 13087, -1844, -12451, 6629, 11287, -9900, -8569, 12191, 5120, -12670, -380, 12467, -4227, -11097, 8523, 9193, -11365, -6314, 12708, 2550, -12652, 1699, 11353, -6242, -9600, 9734]
740I734k812j9187Q199J6757j2618j2231J5959O256j8118K50J8829o278j7614
753a2874J1225J4379j4824r183J7192K808j8184L803J7784r604j5555J3997J1504
766A2468j6715n786J7930q28j7701P281J6130j2604j3016J6123Q298j7729k361
779h510J7655m157j6252J0122J3596j4706r850J7270M846j7800R78J6610p051
792B751j4229J2357J0851j6063o656J7650J664j7180L915J5018r410j1743J4055
805B980P794j6986l259J7757j678j6324O877J3313j1699r240J5536M682j7522
818g769J19J7319m937j4949R674J1010j3772o279J6637J299j7611L503J6350p969
832B625j3108J1882Q405j4978l169J6692k010j6624O545J4494j0411j0636J3431
$$ y = [9734, 6922, -12265, -4066, 12691, 73, -12158, 3801, 10057, -8061, -7811, 11018, 4740, -12874, -1649, 12730, -2094, -11277, 5915, 8723, -9461, -5658, 12126, 2522, -13033, 964, 12468, -4247, -10033, 7897, 7069, -10632, -3351, 12779, 175, -12841, 3282, 11580, -6149, -8510, 9145, 4988, -11264, -1142, 12454, -2252, -12102, 5168, 10014, -7786, -6808, 9802, 2751, -11478, 879, 11730, -4333, -10989, 6661, 8325, -8855, -4940, 10078, 668, -11075, 2980, 10774, -6212, -9471, 8286, 6608, -9716, -2839, 10474, -1225, -10465, 5071, 9753, -7769, -7650, 9669, 4732, -10217, -543, 10467, -3305, -9584, 7053, 8352, -9259, -5756, 10594, 2625, -10483, 1399, 9804, -5174, -8343, 8349, 6339, -10285, -3740, 10754, 343, -10293, 3138]
845C138N567j5390k42J6023m787j5008Q951J2216j2084p893J4179K718j5148K597
859e163J4815p255j2965J0958R629j3372n038J4642j60j4647N289J3441r588j0849
873a0263J2663O965j4329k122J4691l086j3721P919J1534j1776q243J4141L964
886H337j4979R01J4314n817j2407J0056R358j3124n469J4619R30j4602L776J3083
900H976q158j0416J1667O867j3863k712J4477j749j3571O080J1404r796q146J2529
914C589M238j3901M9J3767m283j2150Q171R414j1240n752J3191J628j3706K654
928d331J2779o678j0531J0024P238j2375l209J3472j087j3190N235J1455q910
941a08q605J1658M877j3227o78J3380l614j2165P443R722j0577o341J2565K343
$$ y = [3138, 8705, -6685, -6927, 9096, 4309, -10699, -1748, 10468, -1616, -9509, 4670, 7388, -7760, -5163, 9652, 2397, -10568, 390, 10019, -3353, -8391, 6251, 6091, -8556, -3267, 10174, 586, -10263, 2400, 9365, -4964, -7086, 7605, 4519, -9202, -1283, 10251, -1525, -9768, 4373, 8337, -6642, -5741, 8573, 2756, -9651, 405, 9763, -3361, -8830, 5789, 6719, -7883, -4107, 8976, 818, -9598, 2069, 8936, -4927, -7639, 6838, 5089, -8482, -2402, 9002, -794, -8940, 3589, 7827, -6074, -6025, 7742, 3459, -8691, -520, 8894, -2346, -8098, 5093, 6721, -6985, -4331, 8448, 1770, -8761, 1263, 8501, -3874, -7083, 6389, 5302, -7888, -2653, 8802, -108, -8713, 2945, 7822, -5405, -6083, 7297, 3683, -8482, -1039, 8683, -1894, -8235, 4330, 6673]
955F673j3237J842J2529n798j0577R199P602j1661l955J2854L4j2683L926J1254
969H002p433q684J0258N313j2042j540J2592k242j1748N861R700q936o658J1177
983C620L059j2306P18J2118m376j0595P612P905j0156m408J1784N43j2320L196
997c606J1421o524r234R221N986j1112k135J1963j857j1733N448J0174q312p453
1011g753J0361L804j1452K42J1562m061j0638P273Q556r554n455J0876J711j1165
1025e693K265J0625n869r132Q590O655j0216l360J0858l89j0500M210R333p484
1039a07p433R703M766j0732j439J0645k301r648N973P901q918n560J0675K527
1053F052j1141Q54J0369m431q568P668O209j0115l431J1148L70j0868K938R404
$$ y = [6673, -6564, -4722, 7807, 2009, -8568, 631, 8233, -3428, -7383, 5471, 5505, -7178, -3252, 8002, 569, -8115, 2143, 7456, -4586, -6126, 6466, 4224, -7524, -1663, 8037, -899, -7557, 3620, 6679, -5627, -4909, 7209, 2833, -7762, -150, 7755, -2401, -6809, 4975, 5518, -6802, -3606, 7815, 1291, -7943, 1278, 7264, -3848, -5983, 5980, 4123, -7610, -2162, 8012, -300, -7753, 2608, 6412, -5040, -4798, 6764, 2703, -7935, -662, 7894, -1660, -7115, 3761, 5472, -5693, -3428, 7197, 1328, -7804, 786, 7441, -2775, -6135, 4723, 4334, -6166, -1956, 7377, -107, -7540, 2163, 6929, -3803, -5242, 5403, 3102, -6546, -573, 7328, -1590, -7150, 3525, 6052, -5089, -4235, 6134, 1703, -6865, 803, 7012, -3103, -6534, 4614, 4984, -5884, -2946, 6458]
1067F458o198p065Q965M245j0723j252J1215j747j0259M657Q177p372n336R564
1081C329K246j0633O70J0561l517r158O129O498q100l531R781M55j0487K550R749
1096F542n124p900P342M976q894j726R834j430r930M340Q598o496o351Q126L242
1111E149r248K15R637l389r185O028P506p885m783R023J354r410K162R149n223
1126A100p971P492N780q769k854R229n11r066L912Q096o566o430Q315M116r043
1141c170j199Q950k125q162N234O899p683m931Q961K413r146M32Q536l597p193
1156e781O383N420q335l263R173P16q940K171P778n088o012P509L898r043j473
1171d887R374j087q599L794O863o412m581Q396K211r375L25R157k825p888N300
$$ y = [6458, 260, -6805, 2160, 6405, -4318, -5570, 5645, 3898, -6361, -1704, 6473, -899, -6235, 3329, 5575, -5058, -4388, 6173, 2656, -6502, -373, 6125, -1975, -5506, 4275, 4730, -5757, -3207, 6542, 1418, -6482, 860, 5836, -3058, -4784, 5050, 3620, -6310, -1970, 6628, 132, -6219, 1907, 5149, -4099, -3884, 5753, 2364, -6821, -793, 6713, -1172, -5955, 3068, 4422, -4988, -2826, 6323, 1100, -6871, 621, 6401, -2368, -5222, 4007, 3496, -5570, -1658, 6438, -128, -6558, 1757, 5873, -3170, -4369, 4581, 2456, -5706, -472, 6427, -1256, -6187, 2774, 5187, -3959, -3527, 5009, 1412, -5781, 602, 6022, -2313, -5576, 3597, 4313, -4627, -2456, 5322, 234, -5778, 1731, 5629, -3414, -4887, 4487, 3400, -5199, -1405, 5458, -954, -5535, 2861, 5072, -4303, -3978, 5179, 2354, -5534, -234]
1186b34N651p368l054Q807L38r145K021Q583m297o771O255M257p794j536Q661
1201D374j194q543L530P465n429n540P013K821q072J37Q310k583p800M776O226
1216E491o337m089P493J289q007J524P871m130o803O097M965p219k614P925l52
1231C104p827L091P096n390n679P103L523p924q52P933j969p350M531O137o548
1246a021m252P756J921q115P00P663l297o552N541M848p148k739P915L69p830
1261d241K159O958m451n523O286L569p429j308P805j067p302L422O078n425m328
1276d797O847K166p577K25P473k568o612M691N101o368l057P348P02p599J703
1291b322P033l935n725N797L850p064j596P543q53p269L221O245n207m627O658
$$ y = [-234, 5417, -1951, -5005, 3802, 4140, -5005, -2984, 5599, 1302, -5469, 786, 5043, -2751, -4287, 4374, 3180, -5363, -1833, 5632, 203, -5337, 1676, 4497, -3575, -3438, 4872, 2289, -5511, -735, 5491, -846, -4935, 2558, 3847, -4160, -2636, 5235, 1105, -5698, 399, 5364, -1855, -4469, 3456, 3104, -4723, -1632, 5464, 74, -5605, 1498, 5021, -2903, -3755, 4178, 2209, -5141, -610, 5527, -1021, -5273, 2483, 4404, -3711, -3011, 4652, 1355, -5197, 344, 5192, -1956, -4695, 3220, 3589, -4241, -2082, 4876, 425, -5098, 1188, 4757, -2672, -3980, 3825, 2758, -4544, -1122, 4956, -469, -4797, 2050, 4216, -3361, -3136, 4337, 1769, -4843, -152, 4949, -1419, -4476, 2872, 3574, -4025, -2322, 4711, 776, -4949, 848, 4698, -2366, -3962, 3581, 2728, -4541, -1320, 4925, -282, -4909, 1749]
1306A749K547p397k16P347k133o563M302N138n992l269P072J143p365J099O882
1321D344l281n706N128M047o454k026P147j28p039K253O167m235m680N828K801
1336D166o843p03P136j432o635L421N359n145l555O405J442p079P48O959k786
1351A458o008M531M334n931k229O802o5p007K232O480m035n172N435L226o381
1366b330r13O790j378o559L377N676m910m065N930J992o473L26O491k537n930
1381d513M303M820n492l057O109Q54o278J445N920l501n097N102L786o066j915
1396c580O286l59o028K659N279m556m147N843K635o463o86O346j599n554L787
1411a37M369n540k939O483J332o649O66N986k691m908M684L409o051j756O707
$$ y = [1749, 4296, -3101, -3317, 4030, 1897, -4666, -364, 4774, -1218, -4487, 2585, 3728, -3637, -2538, 4344, 1063, -4643, 485, 4532, -1922, -3948, 3199, 3071, -3968, -1715, 4452, 217, -4463, 1365, 4166, -2677, -3380, 3756, 2324, -4311, -890, 4469, -676, -4231, 2174, 3616, -3463, -2715, 4244, 1458, -4550, -19, 4315, -1616, -3845, 2957, 2892, -4115, -1883, 4597, 562, -4610, 825, 4051, -2330, -3243, 3547, 2169, -4390, -1013, 4663, -247, -4312, 1618, 3610, -2863, -2537, 3954, 1417, -4513, -210, 4610, -882, -3939, 2170, 3024, -3254, -1809, 4111, 610, -4487, 615, 4401, -1665, -3580, 2706, 2347, -3681, -1022, 4257, -299, -4446, 1397, 4032, -2431, -3117, 3229, 1630, -3924, -137, 4232, -1308, -4247, 2236, 3568, -3081, -2415, 3571, 880, -4028, 656, 4065, -1986, -3742, 2965]
1426B965j3o416J802N468l650m013N278K328o344o24O615j054o052K750M786m317
1442d91l095N586J234o325N04O300k098n459L568L942m912k035N843Q5o266J664
1458a955N937l158m802M390L024n352r25N931j123n974K877N275m193l842N156
1473A266J909n726K70N865k298n458L874M452m914k790N525P20n708J444N453
1488C884l311m745M647L499n386j753N619l11n403K359M804m047l885N122K490
1503C583n585p14N501j265m991L173M104m704k936N532J453n713L46N305k258
1518H31m445M016L273n260j887N816K65n652J548M889l311l679M825K259n736
1533b248p37N923q83n366K565M252m087k756N256J158n853M17N699j952m848L374
$$ y = [2965, 2952, -3464, -1662, 3806, 156, -3857, 1421, 3749, -2595, -3219, 3396, 2342, -3710, -960, 3826, -491, -3586, 2000, 3234, -3091, -2587, 3713, 1615, -3844, -276, 3666, -1246, -3281, 2562, 2647, -3619, -1955, 3982, 824, -3978, 412, 3436, -1916, -2841, 3090, 1967, -4007, -1130, 4145, -48, -3890, 1266, 3175, -2551, -2281, 3584, 1286, -4172, -298, 4154, -760, -3550, 1975, 2695, -3013, -1569, 3884, 573, -4172, 475, 3974, -1412, -3165, 2454, 2143, -3260, -901, 3903, -144, -4029, 1093, 3583, -2002, -2716, 2785, 1520, -3471, -298, 3806, -898, -3834, 1698, 3151, -2562, -2216, 3089, 831, -3614, 402, 3675, -1585, -3472, 2344, 2609, -3043, -1495, 3394, 83, -3596, 1229, 3488, -2248, -2985, 2938, 2055, -3311, -746, 3506, -581, -3337, 1919, 3077, -2776, -2359, 3340, 1388, -3460, -86]
1549h6L505m613j863N446K02n711J319N279k771m200L953K683m870r37N409q19
1565A926n362K253M733l516l491M484J842n110J7N260j724m891L134L931m146
1580f60k529M899P80n194J098N035k745m342M010L137m809j548N183k91n070K113
1596i33M530l611l519M608K141n152m74N169j293m724K926L864m211k656M948
1611A613J187n203M38M901k093m182L516L105m552j745N083J67n066J412M546
1626C127k888l594M105K308m839q06N077p87m768K321L993l638k780M597J337
1641B765n050K79M984j829m403L232L340m295j926M898L49m995J302M573k794
1656D30l729L967K472m720j004M988n99m746K128M034l456k989M383J657m870
$$ y = [-86, 3419, -1194, -3057, 2389, 2591, -3120, -1801, 3478, 707, -3493, 460, 3143, -1727, -2664, 2745, 1926, -3436, -1183, 3550, 34, -3457, 1027, 2869, -2241, -2224, 3036, 1312, -3579, -445, 3486, -660, -3189, 1710, 2490, -2704, -1606, 3429, 684, -3658, 352, 3489, -1320, -2868, 2315, 2024, -3046, -933, 3597, -14, -3533, 1075, 3216, -1936, -2410, 2759, 1466, -3258, -332, 3532, -679, -3335, 1613, 2800, -2403, -1965, 2936, 843, -3339, 177, 3282, -1270, -3015, 2068, 2235, -2831, -1419, 3127, 239, -3355, 750, 3058, -1781, -2587, 2490, 1703, -3065, -744, 3249, -389, -3169, 1428, 2765, -2285, -2006, 2978, 1149, -3254, -22, 3318, -977, -2903, 1995, 2344, -2651, -1349, 3224, 430, -3299, 668, 3140, -1580, -2584, 2404, 1805, -2941, -813, 3221, -235, -3224, 1159, 2816, -2054]
1671b054j81M825j351m292K767L375l903k195M620Q16m849O49M560k063l785L363
1687C02K684m311j339M778p3m697J507M111k821l066L945J758m659l40M872j088
1703A563m493K401L571l509k279M338Q01m766O69M651k028m002L141K843l993
1718a092j403M531j36m671J519M295k695l433L571K135m137o23M430r21m318K245
1734g03L778l245k763L885J405m208J58M262j641l930K856L207l670k053M087
1749A425O03m140R63L940k415l389L489K499m090j263M233k58m002J808L484l131
1765b44k722M003J678m362l98M181j075l658K512K882l673j943M332Q55m434L86
1781a680L994j716l226K991K260l930j209M372J18m240J063L607k251k663L349
$$ y = [-2054, -2235, 2590, 1239, -3053, -286, 3089, -814, -3009, 1611, 2427, -2422, -1773, 2787, 724, -3061, 302, 2986, -1325, -2664, 2114, 2041, -2656, -1149, 2962, 141, -2925, 1020, 2778, -1881, -2221, 2651, 1563, -2930, -529, 3042, -467, -2746, 1592, 2393, -2373, -1704, 2947, 919, -3083, 58, 2901, -1092, -2495, 2036, 1900, -2771, -1252, 3043, 348, -3085, 486, 2621, -1516, -2139, 2291, 1370, -2948, -703, 3075, -170, -2933, 952, 2357, -1851, -1693, 2569, 928, -3002, -146, 3061, -609, -2662, 1425, 2028, -2112, -1149, 2791, 376, -3013, 476, 2975, -1115, -2378, 1855, 1597, -2405, -597, 2887, -244, -2966, 1037, 2715, -1647, -2045, 2136, 1061, -2597, -85, 2797, -876, -2819, 1513, 2368, -2066, -1680, 2314, 598, -2628, 363, 2623, -1307, -2516, 1856, 1974, -2266, -1203, 2404, 153, -2510, 839]
1796H39J605m083n26M349n47m014J629L186k675k064L600Q54m158K96M206j348
1812A149l690K302K672l149j404L811N8m110J123L909k095l193K889K006l515
1827a237o09L881p66l905J893L486k744k586L309J302l655J34L768j444l556K480
1843b49K949l128j940L487O30l585P51L509j996l115K890K405l393j344L571M0
1859A482l470J291L166k455k603L241J746l595o26L569o68l278J940K741k971
1874d90j995L573J033l721J26L449j367k917K530K154l372j259L778K45l710Q97
1890a046L199k011k460K986J561l611n71L771m33l468J472K789k435j899L209
1905A053R34l639M4L648j018l184J926K393k743j396L332L56l580O39L392j549
$$ y = [839, 2444, -1639, -2165, 2184, 1637, -2377, -748, 2438, -237, -2301, 1299, 2153, -2005, -1709, 2497, 1149, -2541, -239, 2433, -716, -2120, 1691, 1749, -2361, -1238, 2671, 576, -2617, 272, 2278, -1237, -1846, 2035, 1269, -2636, -743, 2743, -1, -2587, 722, 2024, -1631, -1497, 2271, 827, -2729, -249, 2700, -428, -2368, 1119, 1749, -1836, -1085, 2424, 428, -2687, 203, 2608, -785, -2129, 1442, 1482, -1988, -697, 2469, 14, -2589, 652, 2398, -1197, -1823, 1746, 1078, -2200, -260, 2481, -490, -2485, 1088, 2121, -1600, -1474, 1975, 608, -2309, 221, 2375, -997, -2256, 1522, 1767, -1943, -1046, 2153, 142, -2318, 668, 2229, -1382, -1953, 1818, 1385, -2083, -611, 2178, -257, -2156, 1053, 1987, -1652, -1608, 2040, 1022, -2162, -236, 2157, -586, -1982, 1350, 1706, -1874, -1235, 2157, 608]
1921F08k786K348J879l011p88L394k92l451J267L100k102k351K776J289l205j56
1937a481L384r46l203J876K647k597j746L090O11l306N39L234j578k849K406K130
1953B211k948j140L207J9l193J102K898k045k360K740J551l122n59L225n14l035
1969a963J523K593k362j889K906J025l176QL101j040k758J960K167k676j348L082
1985A153M04l172O11K940j573k426K373J657k916p44L174k78l059J240K647k103
2001g2j960K740J066l071r8L121r06k838J790K295k501j478K909N42l053M78K904
2018A868j440k481K231J813k753r86K994N0k949R15K645j806k108K508J367k895
2034a027m98K965m44k748J388K296k207j637K763Q38k993K3K906r44k500J823
$$ y = [608, -2178, 170, 2049, -962, -1750, 1644, 1352, -2099, -832, 2268, 166, -2185, 591, 1880, -1325, -1481, 1903, 957, -2246, -370, 2277, -320, -2066, 1024, 1635, -1671, -1132, 2102, 524, -2325, 81, 2211, -737, -1877, 1330, 1349, -1844, -742, 2156, 111, -2249, 491, 2042, -1080, -1639, 1586, 1072, -1963, -440, 2153, -209, -2098, 808, 1833, -1343, -1335, 1766, 726, -2032, -72, 2095, -581, -1929, 1153, 1557, -1615, -1004, 1936, 363, -2063, 310, 1967, -949, -1693, 1481, 1203, -1856, -616, 2031, -72, -2032, 708, 1774, -1297, -1395, 1726, 820, -2018, -228, 2067, -434, -1912, 997, 1539, -1514, -1036, 1868, 428, -2053, 178, 1991, -762, -1748, 1246, 1296, -1653, -738, 1907, 101, -2007, 501, 1868, -1027, -1525, 1440, 996, -1752, -364, 1932, -275, -1912, 851, 1689, -1304, -1281, 1625, 681, -1819, 4]
2050DJ871k542j093K949K50l019O40K719j509k123K266J346k806n14L057l45k915
2067a764J148K427j878j691K505Q07k900P1K973q74k687J559K101k169j267K652
2083A013L38k880N22K835j279k423J891J706k359q15K686j49k777J014K594j708
2099B09k078K210J276k543l02K687o75k622J508K281k085j657K451P44k605K95
2115i06K567j267k346K016J888k469j164K633K13k560P87K328j690j950K353J391
$$ y = [4, 1875, -667, -1760, 1189, 1439, -1580, -940, 1779, 270, -1853, 413, 1759, -1047, -1561, 1496, 1151, -1764, -616, 1811, -67, -1758, 747, 1554, -1346, -1275, 1698, 824, -1863, -304, 1797, -372, -1639, 1013, 1351, -1529, -1007, 1828, 549, -1874, 17, 1723, -636, -1451, 1235, 1086, -1691, -677, 1917, 209, -1869, 341, 1617, -926, -1228, 1459, 784, -1838, -330, 1951, -134, -1791, 660, 1404, -1201, -906, 1661, 394, -1952, 64, 1952, -517, -1681, 952, 1165, -1395, -608, 1720, 30, -1920, 433, 1824]
$$ [...]
8191a9
##END NTUPLES=NMR FID
##END=
