##TITLE=1H_LY-15Dix.3.B
 CD3CN, 8 sc, 
 3.06.2021
##JCAMPDX= 6.0         $$ Bruker NMR JCAMP-DX V2.0
##DATA TYPE= NMR FID
##DATA CLASS= NTUPLES
##ORIGIN= UXNMR, Bruker Analytische Messtechnik GmbH
##OWNER= root
$$ XWIN-NMR		Version 3.5
$$ Thu Jun  3 10:14:18 2021 Russian Standard Time (UT+4h)  she@DPX200
##.OBSERVE FREQUENCY= 200.131506
##.OBSERVE NUCLEUS= ^1H
##.DELAY= (6, 6)
##.ACQUISITION MODE= SIMULTANEOUS
##.ACQUISITION SCHEME= undefined
##.AVERAGES= 8
##.DIGITISER RES= 18
##SPECTROMETER/DATA SYSTEM= spect
##.PULSE SEQUENCE= zg30
##.SOLVENT NAME= CD3CN
##.SHIFT REFERENCE= (INTERNAL, CD3CN, 0, 15.7039)
##AUDIT TRAIL= $$ (NUMBER, WHEN, WHO, WHERE, WHAT)
$$ ##TITLE= Audit trail, XWIN-NMR		Version 3.5
$$ ##JCAMPDX= 5.01
$$ ##ORIGIN= Bruker BioSpin GmbH
$$ ##OWNER= she
$$ F:/spectra/data/she/nmr/H-F/1/audita.txt
$$ ##AUDIT TRAIL=  $$ (NUMBER, WHEN, WHO, WHERE, WHAT)
(   1,<2021-06-03 10:12:14.95 +0400>,<she>,<DPX200>,
      <created by zg, POWCHK disabled, PULCHK disabled
       configuration hash MD5:
       00 E9 B6 7A A2 85 ED C7 34 08 36 98 17 FE 4E 26
       data hash MD5: 16K
       13 A8 A5 16 FB 47 CB 3B 76 4D 4C C0 0E 10 97 25>)
$$ ##END=
$$ 
$$ hash MD5
$$ 24 E0 31 63 78 B2 AD 73 64 16 10 89 50 BC C9 25
##$RELAX= 
##$RELAX= 
##$RELAX= 
##$RELAX= 
##$RELAX= 
##$RELAX= 
$$ Bruker specific parameters
$$ --------------------------
##$DU= <F:/spectra>
##$EXPNO= 1
##$NAME= <H-F>
##$PROCNO= 1
##$TYPE= <nmr>
##$USER= <she>
##$AMP= (0..31)
100 100 100 100 100 100 100 100 100 100 100 100 100 100 100 100 100 100 
100 100 100 100 100 100 100 100 100 100 100 100 100 100 
##$AQSEQ= 0
##$AQ_mod= 1
##$AUNM= <au_zg>
##$AUTOPOS= <>
##$BF1= 200.13
##$BF2= 200.13
##$BF3= 200.13
##$BF4= 200.13
##$BF5= 200.13
##$BF6= 200.13
##$BF7= 200.13
##$BF8= 200.13
##$BYTORDA= 1
##$CFDGTYP= 0
##$CFRGTYP= 5
##$CHEMSTR= <none>
##$CNST= (0..31)
1 1 145 1 1 1 1 1 1 1 1 1 1 1 1 1 1 1 1 1 1 1 1 1 1 1 1 1 1 1 1 1 
##$CPDPRG= <>
##$CPDPRG1= <>
##$CPDPRG2= <>
##$CPDPRG3= <>
##$CPDPRG4= <mlev>
##$CPDPRG5= <mlev>
##$CPDPRG6= <mlev>
##$CPDPRG7= <mlev>
##$CPDPRG8= <mlev>
##$CPDPRGB= <>
##$CPDPRGT= <>
##$D= (0..31)
0 1.2 0 0 0 0 0 0 0 0.06 0 0.03 0 0 0 0 0.0002 0 0 0 0 0 0 0 0 0 0 0 0 
0 0 0 
##$DATE= 1622700734
##$DBL= (0..7)
120 120 120 120 120 120 120 120 
##$DBP= (0..7)
150 150 150 150 150 150 150 150 
##$DBP07= 0
##$DBPNAM0= <>
##$DBPNAM1= <>
##$DBPNAM2= <>
##$DBPNAM3= <>
##$DBPNAM4= <>
##$DBPNAM5= <>
##$DBPNAM6= <>
##$DBPNAM7= <>
##$DBPOAL= (0..7)
0.5 0.5 0.5 0.5 0.5 0.5 0.5 0.5 
##$DBPOFFS= (0..7)
0 0 0 0 0 0 0 0 
##$DE= 6
##$DECBNUC= <off>
##$DECIM= 32
##$DECNUC= <off>
##$DECSTAT= 4
##$DIGMOD= 1
##$DIGTYP= 9
##$DL= (0..7)
0 120 120 120 120 120 120 120 
##$DP= (0..7)
150 150 150 150 150 150 150 150 
##$DP07= 0
##$DPNAME0= <>
##$DPNAME1= <>
##$DPNAME2= <>
##$DPNAME3= <>
##$DPNAME4= <>
##$DPNAME5= <>
##$DPNAME6= <>
##$DPNAME7= <>
##$DPOAL= (0..7)
0.5 0.5 0.5 0.5 0.5 0.5 0.5 0.5 
##$DPOFFS= (0..7)
0 0 0 0 0 0 0 0 
##$DQDMODE= 0
##$DR= 18
##$DS= 0
##$DSLIST= <SSSSSSSSSSSSSSS>
$$ [...]
##$SUBNAM2= <"">
##$SUBNAM3= <"">
##$SUBNAM4= <"">
##$SUBNAM5= <"">
##$SUBNAM6= <"">
##$SUBNAM7= <"">
##$SUBNAM8= <"">
##$SUBNAM9= <"">
##$SW= 16.9725357007746
##$SWIBOX= (0..15)
0 0 2 0 0 0 0 0 0 0 0 0 0 0 0 0 
##$SW_h= 3396.73913043478
##$TD= 16384
##$TD0= 1
##$TE= 0
##$TE2= 300
##$TE3= 300
##$TEG= 300
##$TL= (0..7)
0 120 120 120 120 120 120 120 
##$TP= (0..7)
150 150 150 150 150 150 150 150 
##$TP07= 0
##$TPNAME0= <>
##$TPNAME1= <>
##$TPNAME2= <>
##$TPNAME3= <>
##$TPNAME4= <>
##$TPNAME5= <>
##$TPNAME6= <>
##$TPNAME7= <>
##$TPOAL= (0..7)
0.5 0.5 0.5 0.5 0.5 0.5 0.5 0.5 
##$TPOFFS= (0..7)
0 0 0 0 0 0 0 0 
##$TUNHIN= 0
##$TUNHOUT= 0
##$TUNXOUT= 0
##$USERA1= <user>
##$USERA2= <user>
##$USERA3= <user>
##$USERA4= <user>
##$USERA5= <user>
##$V9= 5
##$VALIST= <valist>
##$VCLIST= <CCCCCCCCCCCCCCC>
##$VD= 0
##$VDLIST= <DDDDDDDDDDDDDDD>
##$VPLIST= <PPPPPPPPPPPPPPP>
##$VTLIST= <TTTTTTTTTTTTTTT>
##$WBST= 1024
##$WBSW= 4
##$XGAIN= (0..3)
0 0 0 0 
##$XL= 0
##$YL= 0
##$YMAX_a= 101835
##$YMIN_a= -80769
##$ZGOPTNS= <>
##$ZL1= 120
##$ZL2= 120
##$ZL3= 120
##$ZL4= 120
##$ABSF1= 10
##$ABSF2= 0
##$ABSG= 5
##$ABSL= 3
##$ALPHA= 0
##$AQORDER= 0
##$ASSFAC= 0
##$ASSFACI= 0
##$ASSFACX= 0
##$ASSWID= 0
##$AUNMP= <proc_1d>
##$AZFE= 0.1
##$AZFW= 0.1
##$BCFW= 1
##$BC_mod= 2
##$BYTORDP= 1
##$COROFFS= 0
##$CY= 11.3945322036743
##$DATMOD= 1
##$DC= 2
##$DFILT= <>
##$DTYPP= 0
##$F1P= 15.9154993809931
##$F2P= -4.1035820241983
##$FCOR= 0.5
##$FTSIZE= 0
##$FT_mod= 4
##$GAMMA= 1
##$GB= 0.15
##$INTBC= 1
##$INTSCL= 1
##$ISEN= 128
##$LB= 0.24
##$LEV0= 0
##$LPBIN= 0
##$MAXI= 10000
##$MC2= 0
##$MEAN= 0
##$ME_mod= 0
##$MI= 1.114404
##$NCOEF= 0
##$NC_proc= 0
##$NLEV= 6
##$NOISF1= 3.799351
##$NOISF2= 2.8
##$NSP= 1
##$NTH_PI= 0
##$NZP= 0
##$OFFSET= 15.70392
##$PC= 1
##$PHC0= -11553.63
##$PHC1= 1.40099
##$PH_mod= 1
##$PKNL= yes
##$PPARMOD= 0
##$PSCAL= 0
##$PSIGN= 0
##$REVERSE= no
##$SF= 200.130013532006
##$SI= 16384
##$SIGF1= 3
##$SIGF2= 2
##$SINO= 400
##$SIOLD= 16384
##$SREGLST= <1H.CDCl3>
##$SSB= 0
##$STSI= 0
##$STSR= 0
##$SW_p= 3612.71676300578
##$SYMM= 0
##$S_DEV= 0
##$TDeff= 0
##$TDoff= 0
##$TI= <>
##$TILT= no
##$TM1= 0
##$TM2= 0
##$TOPLEV= 0
##$USERP1= <user>
##$USERP2= <user>
##$USERP3= <user>
##$USERP4= <user>
##$USERP5= <user>
##$WDW= 1
##$XDIM= 8192
##$YMAX_p= 0
##$YMIN_p= 0
$$ End of Bruker specific parameters
$$ ---------------------------------
##NTUPLES= NMR FID
##VAR_NAME=  TIME,          FID/REAL,        FID/IMAG
##SYMBOL=    X,             R,               I
##VAR_TYPE=  INDEPENDENT,   DEPENDENT,       DEPENDENT
##VAR_FORM=  AFFN,          ASDF,            ASDF
##VAR_DIM=   8192,          8192,            8192
##UNITS=     SECONDS,       ARBITRARY UNITS, ARBITRARY UNITS
##FACTOR=    0.0002944,     1,               1
##FIRST=     0,             0,               0
##LAST=      2.4114304,     0,               0
##MIN=       0,             -80769,          0
##MAX=       2.4114304,     101835,          0
$$ Real data points
##PAGE= N=1
##DATA TABLE= (X++(R..R)), XYDATA
$$ [...]
$$ plain form
1988 -50 -1020 1002 163 -1129 859 344 -1157 715 490 -1186 572 652 -1179 401 781 -1149 221
2005 221 901 -1090 46 995 -999 -131 1089 -889 -319 1137 -719 -495 1147 -568 -620 1165 -404
2022 -404 -799 1126 -194 -919 1034 -8 -992 955 170 -1111 824 397 -1116 656 522 -1112 546
2039 546 684 -1162 332 866 -1054 121 886 -994 16 1002 -962 -218 1096 -790 -390 1052 -678
2056 -678 -477 1125 -571 -696 1135 -313 -815 1010 -178 -840 1024 -35 -1026 933 241 -1045 743
2073 743 344 -1050 678 515 -1153 480 749 -1043 252 766 -991 184 912 -1016 -86 1045 -800
2090 -800 -279 987 -734 -353 1078 -671 -607 1099 -400 -714 970 -331 -753 1044 -184 -977 951
2107 951 119 -969 771 178 -965 792 344 -1125 600 604 -1024 404 630 -1002 361 803 -1057
$$ packed form
1988e0r70K022q39j292J988n15j501J872k25j676J758Q0j831J580L80j930J370
2005B21O80j991J136R49j994Q68J220j978N70J456j856K24J642j715n2J785j569
2022d04l95J925j320p25J953j042r84J947p85j281J935m27j513J772j34j634J658
2039E46J38j846J494N34j920J175P65j880J010R86j964P44J314j886M00J442j730
2056f78K01J602j696j25J831j448n02J825j188o62J864j059r91J959o92j286J788
2073G43l99j394J728j63j668J633K69j792J295N14j757J175P28j928R30J131j845
2090h00N21J266j721L81J431j749O4J706j499l14J684j301m22J797j228p93J928
2107I51q32j088J740n93j143J757m48j469J725Mj628J428K26j632J363M42j860
$$ plain form
2124 -1057 71 977 -840 -123 910 -791 -181 1054 -746 -477 1086 -472 -597 955 -422 -648
2140 -648 1052 -291 -916 970 3 -907 784 59 -921 829 235 -1110 664 494 -1000 475 508
2157 508 -982 471 687 -1055 213 868 -874 31 815 -849 -13 991 -824 -317 1053 -568 -454
2174 -454 937 -510 -527 1044 -391 -790 974 -115 -836 828 -63 -880 857 124 -1050 680 372
2191 372 -967 533 403 -977 519 590 -1053 292 771 -896 148 767 -885 72 918 -845 -179
2208 -179 982 -649 -289 920 -601 -388 1024 -493 -624 982 -251 -700 880 -175 -783 900
2224 900 -3 -935 755 206 -919 628 288 -965 573 477 -1030 367 636 -903 234 686 -890
2241 -890 137 827 -845 -69 913 -697 -178 903 -640 -303 985 -529 -492 960 -352 -560 893
$$ packed form
2124a057J128R06j817P17J033j701O10J235j800K69J563j558j25J552j377k26
2140f48J700j343o25J886r67r10J691p25r80J750n94j345J774j70j494J475L3
2157E08j490J453K16j742J268O55j742R05P84j664Q36J004j815N07J370j621J14
2174d54J391j447j7J571j435l99J764j089p21J664q91q17J737p33j174J730l08
2191C72j339J500j30j380J496P1j643J345M79j667J044O19j652R57Q46j763O66
2208a79J161j631L60J209j521K13J412j517j31J606j233m49J580j055o08J683
2224I00r03r32J690n49j125J547l40j253J538r6j507J397K69j539J137M52j576
2241h90J027O90j672P76R82j610N19J081j543L37J288j514L7J452j312k08J453
$$ plain form
2258 893 -280 -673 909 -123 -823 810 48 -844 709 163 -906 645 331 -952 488 480 -921
2275 -921 358 566 -921 242 716 -876 61 798 -770 -80 851 -684 -216 915 -584 -368 924
2292 924 -456 -467 915 -351 -595 896 -210 -711 829 -65 -783 761 66 -849 678 193 -872
2309 -872 586 325 -914 474 466 -901 332 579 -853 216 676 -832 58 777 -742 -100 811 -650
2327 -650 -217 873 -565 -380 904 -399 -518 855 -283 -594 844 -184 -723 804 6 -780 684
2344 684 108 -802 641 221 -896 534 403 -867 371 464 -823 313 566 -864 167 720 -746
2361 -746 -7 727 -675 -68 794 -654 -256 870 -459 -401 794 -386 -446 846 -292 -626 829 -70
2379 -70 -709 686 28 -713 673 124 -844 571 326 -829 408 379 -802 386 495 -865 210 659
$$ packed form
2258H93j173l93J582j032p00J633p62q92J553n46j069J551l14j283J440qj401
2275i21J279K08j487J163M74j592R37P37j568O90R31j535M68J131j499K16J292
2292I24j380j1J382j266k44J491j106n01J540q94p18J544o95r15J527m85j065
2309h72J458k61j239J388qj367J233K47j432J069M60j508Q90P19j519O42R11j461
2327f50M33J090j438J85J284j303j19J373j138l11J438j028n39J527p98p86J464
2344F84n76r10J443m20j117J430j31j270J238R3j287J136K53j430J031N53j466
2361g46P39P34j402O07Q62j448L98J126j329N8J195j180o0J292j138l34J455q99
2379g0o39J395o58p41J386n49r68J415k45j155J237k9j181J188J09j360J075M49
$$ plain form
2397 659 -737 58 652 -676 31 747 -682 -160 825 -493 -288 747 -441 -329 829 -389 -541
2414 -541 802 -159 -598 670 -110 -613 715 -7 -778 620 220 -754 465 261 -750 446 377 -841
2432 -841 275 549 -735 115 532 -701 112 664 -719 -99 775 -530 -227 688 -485 -234 788 -438
2450 -438 -434 793 -214 -490 683 -189 -520 734 -90 -695 648 125 -677 494 147 -680 510 271
2468 271 -800 380 442 -713 222 446 -696 189 568 -729 1 683 -573 -126 631 -530 -149 734
2486 734 -493 -354 761 -296 -421 676 -242 -455 732 -147 -602 669 28 -610 560 58 -642 558
2504 558 170 -746 434 327 -692 309 348 -686 273 479 -713 122 568 -608 10 578 -582 -60
2522 -60 672 -529 -232 709 -389 -317 663 -338 -374 708 -233 -520 662 -76 -568 605 -4 -602 595
$$ packed form
2397F59j396P95N94j328P07P16j429N22R85j318K05J035j188J12J158j218j52
2414e41J343r61m39J268p80n03J328p22p71J398m00r74J219k04j011J196o9j218
2432h41J116K74j284Q50M17j233Q13N52j383O20Q74j305L03R15j173K51J022j226
2450d38MJ227j007k76J173q72l31J254q24o05J343n23q02J171l47q27J190k39
2468B71j071J180O2j155R35K24j142Q85L79j297P30O82j256M47P57j161L81Q83
2486G34j227J39J115j057j25J097r18k13J187q79m55J271o41o38J170n02p00J200
2504E58l88r16J180j07j019J001L9j034R59K06j192Q35M46j176O18N68j160N22
2522f0P32j201K97R41j098P2R80j001l6J082r41k87J182p38m92J173o09n98J197
$$ plain form
2541 595 117 -684 481 244 -657 390 285 -678 333 408 -699 195 490 -644 106 518 -614 21
2559 21 611 -576 -121 638 -469 -191 635 -418 -284 682 -327 -414 654 -195 -480 624 -104 -548 606
2578 606 14 -621 520 143 -650 456 232 -675 381 333 -681 271 423 -653 174 482 -615 91
2596 91 557 -595 -33 599 -532 -129 631 -454 -225 649 -368 -314 657 -270 -403 636 -184 -476 593
2615 593 -83 -539 561 12 -616 516 150 -641 414 234 -649 351 320 -666 247 443 -634 131 503
2634 503 -594 52 558 -576 -66 633 -475 -184 618 -403 -234 656 -342 -358 675 -216 -442 598
2652 598 -135 -475 597 -57 -576 546 99 -599 423 165 -600 400 223 -675 313 386 -642 168 414
2671 414 -589 138 493 -610 2 605 -499 -140 577 -430 -172 643 -398 -312 672 -233 -414 595
$$ packed form
2541E95m78q01J165k37r01J047j05r63J011P5j107Q94K95j134P50M12j132O35
2559B1N90j187M55P59j107K78Q26j053J34R66j009q7J068q49k85J104p28m44J154
2578F06n92o35J141l77p93J106k24r07J056m8j014R52J52j076Q27L08j097P06
2596I1M66j152N62O32j131M03P60j085K29Q74j017N4R71r27j33J039q20k92J069
2615E93o76m56J100n49o28J132l66p91J055j80q83J000l1r86R13J96j077P65L72
2634E03j097O46N06j134N10O99j108K91Q02j021J69Q90r98j6J033q91k26J040
2652E98p33l40J072o54n19J122m47o98J022k58p65J000j77q98R88P3j028Q10K46
2671D14j003P27L55j103O12O03j104L59P17j007K58Q15j041Q6R84r05j81J009
$$ plain form
2689 595 -168 -423 621 -111 -538 592 62 -562 468 117 -555 453 187 -658 357 333 -623 205 342
2708 342 -581 209 423 -644 63 537 -536 -65 516 -483 -87 604 -447 -237 658 -286 -315 580 -240
2727 -240 -347 636 -173 -509 610 14 -537 480 62 -536 497 137 -648 399 293 -601 267 304 -588
2746 -588 253 380 -635 102 501 -528 -8 462 -497 -32 553 -515 -191 617 -344 -275 542 -295 -292 613
2766 613 -236 -426 600 -50 -468 506 -15 -478 524 64 -599 440 244 -573 312 253 -576 299 346 -635
2786 -635 162 474 -543 45 448 -522 16 522 -518 -146 582 -385 -225 537 -346 -256 585 -290 -367 572
2806 572 -132 -422 515 -82 -434 532 5 -541 457 164 -532 366 188 -553 348 276 -597 227 395 -545
2826 -545 121 408 -532 60 497 -513 -76 538 -420 -162 527 -383 -224 568 -317 -347 563 -204 -393 518
$$ packed form
2689E95p63k55J044p32m27J130n30o24J030l51o72J008k66q45J015k4r56Q28J37
2708C42r23P90K14j067P07M74j073M71N81r99L96O91j051K10Q95r44k9Q95q20
2727b40j07R83q09l36J119n96n51J017m18n98J033l60p85J047j06q94Q68L7q92
2746e88Q41J27j015P37L99j029N20M70r59M65N85j068L24Q08r61O9Q17q37LR05
2766F13q49j90J026o50m18R74n21m63J002m60o63J039j96q17Q85n9q29Q75M7r81
2786f35P97L12j017N88M03r70N38N06j040L72P28r67J60P62q83R0Q41q75p7R39
2806E72p04k90R37n97l52R66n27n46R98k93o96Q98j78p41R01p2q73Q24J68r40
2826e45O66K87r40N92M37j010M37O14r58K58O89r10J59P92q85l0R10p67j89R11
$$ plain form
2846 518 -147 -426 509 -40 -495 460 63 -502 405 125 -523 371 221 -550 286 309 -521 195 352 -520
2866 -520 124 433 -509 19 472 -446 -70 500 -413 -151 543 -336 -255 534 -262 -319 522 -175 -384 517 -101
2887 -101 -457 484 -8 -482 433 80 -520 373 165 -524 323 251 -528 249 318 -527 166 380 -490 85 422
2908 422 -478 -5 459 -429 -104 487 -366 -166 500 -320 -245 511 -232 -327 493 -147 -391 492 -84 -445 466
2929 466 27 -487 388 106 -483 352 169 -527 285 275 -527 198 338 -482 135 366 -490 60 447 -439
2949 -439 -46 438 -386 -91 464 -366 -191 512 -266 -271 457 -207 -299 476 -161 -390 467 -32 -434 394 30
2970 30 -429 392 106 -508 319 234 -500 221 273 -463 202 322 -515 113 424 -461 -8 406 -396 -38 457
2991 457 -391 -160 503 -281 -235 460 -223 -238 483 -203 -363 483 -67 -406 396 -21 -395 407 39 -471 359
$$ packed form
2846E18o65k79R35n49m55R55l97n65R07k80o48Q94j50p71Q36K3q30P16J57q72
2866e20O44L09r42N28M53r18L76N70r13K62O94q79Q1P89p96n7Q41o97k09R01o18
2887a01l56R41m92m74R15l53o00Q93k08o89Q47p2p79P77O9q45O93K14q70N75L37
2908D22r00M73M64q88L25N91q53K00O66q20P5P56p43r5Q20o40k44Q83n76l61R11
2929D66m39n14Q75k82n89Q35j83o96Q12j0q02P25J40q20O17K31q56N50L87q86
2949d39L93M84q24K95N55q30J75P03p78nP28o64r2P75o37k29Q57m99m02Q28l64
2970C0m59Q21k86o14Q27q5p34P21N2p36O65J20q37O28L11q85M53M14q02L58M95
2991D57q48K31O63p84M6O95o83j5P21o86j60Q46n50l39Q02m17l74Q02l68n10Q30
$$ plain form
3012 359 164 -455 261 187 -446 256 266 -502 157 375 -441 35 358 -405 30 418 -416 -82 481 -319 -182
3033 -182 445 -279 -201 479 -239 -319 482 -111 -356 398 -66 -362 415 -33 -460 365 103 -451 283 123 -435
3054 -435 287 194 -488 201 314 -426 114 301 -404 100 376 -426 -16 436 -341 -100 405 -303 -127 442
3074 442 -277 -244 471 -175 -297 401 -136 -316 447 -78 -426 405 49 -423 314 76 -418 319 139 -485
3094 -485 239 249 -446 155 253 -427 149 332 -437 35 385 -361 -34 384 -326 -70 424 -316 -176 442 -216
3115 -216 -231 405 -186 -273 431 -136 -361 409 -27 -382 337 12 -399 345 81 -459 280 182 -452 220 217 -434
3137 -434 178 280 -446 99 354 -398 25 357 -374 -17 414 -335 -97 438 -273 -160 417 -239 -208 430
3157 430 -171 -288 424 -106 -340 388 -41 -370 362 27 -424 320 109 -420 276 172 -436 227 235 -449 153
$$ packed form
3012C59j95o19P16p4o33P02J0p68O59K18q16M76L23p63M35L88q34L34N63q00J37
3033a82O27p24P8O80p18q0Q01n93k45P54m64k96P77m48m27Q25k62n54P34j60n58
3054d35P22r3o82O89J13p40N40J87p05N04K76q02M10M52p77K41N05p08J76N69
3074D42p19L3P15o46j22O98n37j80P63n25l48Q31l56m72P37k38m94P37j80o24
3094d85P24J0o95O01R8o80N76J83p69M72L50p46L27M18p10K56M94p40J40O18o58
3115b16j5O36n91q7P04n67k25P70m36l55P19l25m11P44k64n40P39r8o34O72lo51
3137d34O12J02p26N45K55p52M23L32p31L57M31p49K38N35p11J13N77o56L1O38
3157D30o01j17P12n30k34P28m29l29P32l35m51P44k11n29O96j04o08O63Qo84O02
$$ plain form
3178 153 296 -425 94 345 -396 17 380 -367 -52 416 -311 -113 426 -269 -162 445 -211 -233 426 -155
3198 -155 -284 421 -74 -328 389 -18 -367 350 32 -400 317 109 -424 256 178 -421 212 227 -432 161 286
3219 286 -408 72 335 -376 21 372 -369 -60 416 -311 -147 417 -264 -190 424 -221 -253 438 -130 -316 398
3240 398 -61 -332 390 -17 -395 367 70 -420 284 122 -396 259 164 -435 206 270 -424 130 289 -401 82
3261 82 326 -389 -4 400 -326 -95 390 -284 -119 404 -270 -201 442 -174 -277 391 -112 -302 398 -73 -384
3282 -384 382 37 -396 308 77 -396 287 127 -449 240 228 -417 139 243 -392 126 297 -414 45 360
3302 360 -346 -40 358 -309 -57 390 -312 -148 426 -201 -221 388 -159 -235 400 -142 -326 397 -23 -370 323
3323 323 19 -362 323 66 -435 268 192 -414 182 219 -395 188 263 -419 105 356 -367 15 340 -326 -10
$$ packed form
3178A53J43p21N19K51p41M13L63p47L15M68p27J98N39o95J07O07o56k2O59n81
3198a55j29P05m95k54P17m07l49P17l18m32P17k08n33O80p8n99O33J5o59N93J25
3219B86o94M80K63p11L97L51p41L09M76p27J64N64o81P4O14o45l2O91n68j86P14
3240C98m59k71P22m07l78P62k97m90P04j62n18O55r5n99O41O4o94N54J59o90M83
3261H2K44p15L85M04p26K31M85o74J65N23o74O9O43o16j03O68n03j90P00m71l11
3282c84P66l45m33P04k31m73O83j60n76O89j2o45N56J04o35N18J71p11M59L15
3302C60p06L06L98o67K52M47p02J64N74o27k0O09n47p6O35n42j84P23m20l47O93
3323C23l04l81O85k57n01P03p6o06N96L7o14N83P5o82N24K51p23L82L25o66L16
$$ plain form
3344 -10 386 -329 -107 436 -239 -161 383 -193 -178 417 -160 -289 400 -67 -327 330 -23 -326 339 20 -408
3365 -408 288 122 -396 212 150 -389 212 213 -424 129 305 -368 58 303 -340 42 354 -352 -62 416 -264
3386 -264 -126 380 -232 -145 405 -199 -243 413 -107 -289 353 -62 -295 350 -23 -375 315 70 -374 252 105
3407 105 -366 235 151 -416 161 231 -374 91 248 -367 74 305 -356 -10 373 -290 -71 366 -248 -103 387
3428 387 -216 -184 410 -141 -237 374 -122 -263 368 -68 -332 339 27 -350 281 60 -361 268 117 -397 207
3449 207 174 -380 144 204 -372 103 266 -369 35 301 -325 -22 334 -294 -70 350 -251 -117 373 -191 -167
3470 -167 373 -148 -210 378 -87 -280 357 -40 -310 318 20 -348 291 78 -358 247 123 -381 193 188 -375
3491 -375 136 231 -362 82 265 -353 30 305 -314 -20 321 -271 -72 344 -242 -116 373 -183 -182 353 -131
$$ packed form
3344a0L96p15K22N43o75P8N44n76J5N95n77j29O89m67k60O57l53l03O65l19m28
3365d08O96j66n18O08o2n39O01Jo37N53J76o73M26K45o43L82L12p06K90M78o80
3386b64J38N06o12Q7N50o04m4O56n20j82O42m15k33O45l73l52O90k45m44O26j47
3407A05m71O01q4n67N77P0o05M65J57o15M41K31o61L46L83o63K19M37o14J45M90
3428C87o03L2N94n51r6O11m96j41O31m36k64O71l12l77O31k21m21O29j51n14O04
3449B07l3n54N24O0n76M75J63o35M04K66o26L03L56o28K24M20o01J34M90n64K4
3470a67N40n21o2N88m65j93O37l97k70O28k98l68O39k13m36O05j24n04N74nn63
3491c75N11R5n93M44J83o18L83K75o19K94L41n92J99M16n86J26M89n56JN35m84
$$ plain form
3512 -131 -210 353 -87 -265 353 -6 -305 308 35 -315 279 79 -356 231 143 -356 178 189 -359 137 231
3533 231 -366 91 295 -332 12 303 -291 -20 322 -279 -75 354 -215 -149 352 -174 -165 350 -142 -223 374
3554 374 -65 -265 309 -19 -267 315 23 -327 271 105 -343 211 132 -340 187 172 -370 131 244 -344 54
3575 54 259 -313 43 302 -323 -44 354 -244 -108 329 -209 -127 352 -184 -202 378 -107 -250 323 -54 -255
3596 -255 329 -37 -305 300 62 -325 232 99 -310 226 137 -357 173 210 -344 97 216 -319 68 260 -335
3617 -335 5 315 -278 -62 293 -241 -79 342 -234 -149 376 -146 -210 329 -108 -210 352 -81 -293 323 16
3638 16 -300 264 47 -306 257 98 -357 210 173 -338 135 174 -311 123 223 -340 52 290 -286 -22 268
3659 268 -265 -35 308 -259 -108 345 -175 -164 321 -147 -170 342 -125 -249 342 -15 -274 294 14 -268 286
$$ packed form
3512a31p9N63m40j78O18l59k99O13k73l50N94k00m35N87q8m99N34J1n48M96R4
3533B31n97M57K04o27L44K91n94K71L42o01K04M29n69O6N01n26RN15m92q1N97
3554C74m39k00N74l28k48N82k92l50N98j66m48N54p9m72N27j5n42N01J13n88L98
3575E4K05n72L56K59o25K79L98n98J36M37n38Q2M79n36j8N80m85j43N73l77k01
3596b55N84l66k68O05k38l87N57j33m09N36q9m94N30L7n54M41J19n35L87J92n95
3617c35L40L10n93K16L55n34J62M21n76Q5N25n22o4N39m37j02N62m33k12O16l07
3638A6l16N64k17l53N63j59m55N67l7n11M73L9m85M34J00n63L92K38n76K64K90
3659B68n33K30L43n67J51M53n20J1M85m68k3N12m67j24N91l57k59N68k80k82N54
$$ plain form
3680 286 49 -337 238 130 -341 157 145 -326 158 197 -345 95 262 -317 22 253 -285 11 289 -279 -73
3701 -73 316 -211 -119 299 -196 -136 324 -158 -204 330 -66 -236 280 -36 -249 292 5 -288 267 80 -315
3722 -315 210 112 -313 190 158 -341 134 214 -325 73 224 -292 44 264 -302 -24 298 -259 -77 302 -208
3743 -208 -101 307 -186 -171 320 -121 -203 297 -89 -217 293 -36 -250 282 19 -274 244 69 -291 216 111
3764 111 -307 173 169 -316 129 203 -307 76 233 -299 21 266 -271 -33 294 -242 -73 314 -210 -122 315
3785 315 -162 -167 315 -106 -203 300 -73 -227 285 -20 -262 270 29 -283 232 75 -281 201 110 -289 162
3806 162 173 -298 113 200 -287 63 226 -287 26 257 -267 -31 266 -229 -75 276 -213 -115 313 -156 -157 300
3828 300 -97 -193 294 -76 -227 289 -16 -266 244 41 -268 224 55 -291 200 120 -282 144 143 -281 122
$$ packed form
3680B86k37l86N75j08m71M98j2m71M84L9n42M40J67n79L39K31n38K96K78n68K06
3701g3L89n27R2M18m95O0M60m82m6N34l96j70N16l16k13N41k87k93N55j87l95
3722c15N25r8m25N03l2m99M75Q0n39L98J51n16L36K20n66K78L22n57J82L79n10
3743b08J07M08m93J5M91m41q2N00l86j28N10l29k14N32k63k93N18j75l60N07j05
3764A11m18M80mm85M45P4n10L83J57n32L20K45n37K38L27n36J69L87n24Q8M37
3785C15m77nM82m21r7N03l73j54N12l05k42N32k41l12N15j57l56M82r1l99M51
3806A62J1m71M11Q7m87L50J63n13L13K31n24K36K97m95J54L51m89R8M28m69jM57
3828C00l97r6M87l70j51N16l05k50N10k03l09M92j69l46M91q0m02M26jm24M03
$$ plain form
3849 122 181 -288 79 229 -267 10 238 -231 -21 246 -224 -65 291 -182 -131 275 -141 -137 295 -118 -189 301
3871 301 -53 -226 260 -14 -228 258 17 -266 241 99 -278 176 122 -271 166 150 -305 121 209 -274 52
3892 52 211 -245 32 228 -245 -21 283 -197 -75 261 -175 -78 271 -164 -139 289 -87 -184 256 -53 -187
3913 -187 264 -30 -237 255 46 -254 193 73 -240 198 111 -286 157 166 -285 89 177 -263 76 212 -268
3934 -268 25 253 -228 -47 245 -191 -54 272 -205 -108 310 -129 -145 262 -101 -166 261 -80 -211 269 14
3955 14 -236 204 23 -231 210 69 -264 177 134 -260 126 140 -253 117 164 -280 64 238 -241 5 220
3976 220 -225 -7 242 -230 -82 291 -165 -114 261 -128 -136 272 -115 -188 287 -41 -197 241 -15 -206 240
3997 240 31 -261 210 83 -252 158 98 -237 150 125 -274 102 184 -236 52 190 -225 25 225 -237 -35
$$ packed form
3849A22N9m69L67J50m96K77K28m69K10K67m70J59L56m73N1M06m16MM32m13p1M90
3871C01l54j73M86k74k14M86k41k83N07j42l77M54n4l93M37j6m55M26Q8m83L26
3892E2J59m56K77J96m73K24L04m80J22L36m36R7L49m35K5M28l76r7M40l09j34
3913a87M51k94k07M92k09l00M47j20l13M38q7l97M43Rm51L74Q8m40L39J36m80
3934b68K93K28m81J81K92m36J37L26m77R7M18m39j6M07l63o5M27l41j31M80k55
3955A4k50M40j81k54M41j41l33M41m3l94L86J4l93L70M7m44L44J74m79K46K15
3976B20m45K18K49m72J48L73m56N1L75l89qM08l87p3M75l28j56M38k56j91M46
3997B40k09k92M71j27l35M10o0l35L87k5l99L76Q2m20K88J38m15K50K00m62K02
$$ plain form
4018 -35 248 -207 -80 241 -169 -111 267 -150 -168 262 -86 -174 247 -56 -195 254 -10 -228 233 35 -235
4039 -235 197 65 -244 179 105 -268 137 154 -249 103 162 -237 68 198 -229 13 226 -208 -28 230 -194
4060 -194 -63 244 -172 -111 246 -132 -139 249 -98 -170 248 -59 -188 246 -7 -218 222 41 -216 205 82
4081 82 -236 176 113 -250 134 151 -239 103 176 -249 48 189 -232 23 216 -209 -28 232 -190 -58 234
4102 234 -172 -105 234 -126 -135 241 -85 -166 235 -56 -198 218 -16 -223 199 27 -217 183 60 -236 169
4123 169 115 -240 129 149 -225 95 162 -234 56 206 -217 2 216 -191 -26 219 -178 -68 244 -146 -110
4144 -110 242 -103 -132 221 -96 -163 239 -44 -192 191 0 -192 194 18 -232 190 73 -229 135 112 -213
4165 -213 114 126 -235 99 181 -224 35 189 -196 32 211 -202 -28 249 -164 -81 217 -139 -92 230 -129
$$ packed form
4018c5K83m55J27L21m10N8L78m17j8M30l48q8M21l03j39M49k64k18M61j98k70
4039b35M32j32l09M23p4l73M05J7m03L52N9l99L05J30m27K42K13m34J80K58m24
4060a94J31L07m16O1L57l78pL88l47p2M18l07j29M34k53k11M40j81k57M21j23
4081H2l18M12o3l63L84J7l90L42P3m25K97J41m21K55J93m25J81K60m22J32K92
4102B34m06O7L39l60rL76l26q1M01k91j42M16k34k07M22j72k44M00j23k96M05
4123A69n4l55L69K0l74L20O7l96K90J50m23K19K14m07J65K45l97J10L12l90L6
4144a10L52l45k9L53l17o7M02k83j48L83j91j92L86j76k50M22j17l02L64k3l25
4165b13L27J2l61L34Q2m05K59J54l85K28J79m13J74K77m13Q3K98l56M7L22l59
$$ plain form
4186 -129 -139 241 -70 -180 205 -44 -168 212 -22 -207 209 40 -220 148 57 -198 147 83 -237 121 150
4207 150 -215 61 155 -201 67 177 -204 14 218 -170 -34 201 -154 -38 228 -156 -98 240 -103 -133 212
4228 212 -77 -151 217 -66 -191 212 8 -213 177 25 -205 185 58 -220 153 114 -206 93 121 -187 86
4249 86 141 -214 34 181 -205 -10 174 -161 -4 199 -170 -68 219 -116 -99 206 -99 -123 211 -92 -171 208
4271 208 -22 -186 171 3 -175 175 19 -222 165 80 -205 122 99 -204 124 121 -221 70 171 -192 26
4292 26 169 -176 15 187 -184 -35 204 -134 -69 190 -110 -89 208 -99 -139 207 -39 -149 183 -30 -152
4313 -152 180 -11 -203 163 48 -203 120 68 -199 116 98 -215 92 140 -198 58 145 -185 38 184 -183
4334 -183 -15 190 -153 -46 189 -136 -72 193 -126 -110 196 -79 -141 187 -61 -141 171 -15 -176 172 23
$$ packed form
4186a29j0L80l11j10L85k49j24L80k34j85M16j69k60L68r1k55L45o4l20L58K9
4207A50l65K76R4l56K68J10l81K18K04l88J36K35l55J16K66l84N8L38l43l0L45
4228B12k89p4L68k83j25M03k04k21L90j52k30L90j27k78L73l9l20K99K8l08K73
4249H6N5l55K48J47l86J95J84l35J57K03l69J02K87l35J7L05l05k4L34l03p9L79
4271B08k30j64L57j68j78L50j56k41L87q5k85L27k3l03L28ll42K91J01l63K18
4292B6J43l45J91J72l71J49K39l38O5K59l00K1K97l07m0L46k46j10L32k13j22
4313a52L32j91j92L66j15k51L23n2k67L15j8l13L07M8l38K56Q7l30K23J46l67
4334a83J68K05l43J07K35l25O4K65l19J6L06k75o2L28k48q0L12j86j61L48j49
$$ plain form
4355 23 -175 134 28 -179 128 61 -199 99 105 -194 72 129 -180 55 150 -178 28 170 -153 -9 186 -149
4377 -149 -38 195 -124 -60 197 -99 -100 191 -81 -127 182 -54 -162 167 -25 -170 163 11 -183 135 46 -183
4399 -183 124 81 -190 95 92 -194 74 119 -164 48 141 -165 17 176 -151 -16 181 -132 -39 188 -127 -74
4421 -74 201 -103 -108 183 -65 -122 178 -57 -149 167 -13 -173 146 18 -186 130 44 -186 121 77 -199 86
4443 86 93 -174 59 115 -176 41 150 -175 -8 157 -140 -24 154 -141 -48 181 -108 -96 172 -84 -96 176
4465 176 -72 -126 184 -34 -158 149 -6 -157 139 6 -179 135 55 -196 103 93 -174 81 91 -190 66
4486 66 140 -172 22 152 -148 7 153 -143 -22 177 -122 -70 170 -103 -74 171 -93 -108 183 -49 -145 151
4508 151 -19 -125 154 -11 -165 141 40 -173 104 62 -171 105 65 -198 84 113 -189 24 120 -165 27
$$ packed form
4355B3j98L09j06k07L07o7k60K98Ok99K66N7l09K35R5l28K06J42l23J44J95l35
4377a49J11K33l19O4K57k96jK91k72m6L09k36j08L29j92j45L33j52j94L18q9k29
4399a83L07m3k71K85lk86K68M5k83K12R3l06J82J59l27J35J97l13R3K27l15N3
4421g4K75l04nK91k48n7L00k35r2L16j80j60L19j28k04L16q6k30L07m4k76K85
4443H6Pk67K33N6k91K17J09l25J67J65k97J16J78k95R3K29k89J2K68k56j2K72
4465A76k48n4L10k18j24L07j55j51K96j33j85L14q0k51K99j0k67K55J0k81K56
4486F6P4l12J94J30l00J55J46k96J21J99k99N2K40k73K9K45k64j5K91k32r6K96
4508A51j70j06K79j65j54L06j01k13K77m2k33K76m0k63K82K9l02K13R6k85J92
$$ plain form
4529 27 154 -178 -1 178 -128 -41 173 -104 -57 165 -101 -80 170 -63 -126 163 -51 -122 150 -34 -148 162
4551 162 19 -163 118 43 -161 116 54 -179 94 98 -165 46 107 -149 52 124 -175 19 155 -146 -26 151
4573 151 -118 -31 168 -117 -59 183 -76 -103 169 -63 -96 167 -53 -147 151 4 -150 126 14 -154 122 32
4595 32 -174 109 72 -166 67 90 -156 59 111 -166 36 136 -148 -1 139 -139 -13 158 -125 -44 169 -99
4617 -99 -76 158 -77 -101 172 -67 -118 168 -22 -142 144 -5 -150 131 18 -162 110 48 -169 89 65 -169
4639 -169 84 98 -175 60 128 -141 29 138 -137 7 145 -129 -25 169 -100 -44 158 -82 -64 158 -74
4660 -74 -94 154 -36 -118 155 -24 -138 142 6 -148 122 36 -162 105 61 -172 84 67 -169 57 93 -171
4682 -171 37 119 -145 25 134 -138 -10 148 -115 -27 168 -102 -48 155 -79 -86 163 -51 -97 158 -37 -128
$$ packed form
4529B7J27l32J77J79l06Q7K14k77M7K22k66K1K50k33o3K89k14p1K72j84j14L10
4551A62j43j82K81p5k04K77o2k33K73Mk63K11O1k56K01P2k99J94J36l01J20J77
4573A51k69Q7J99k85N8K42k59k7K72k32l3K63k20r4K98j47j54K76j12j68K76r0
4595C2k06K83l7k38K33K3k46K15N2k77K02J00k84J47J40k78J26J71k83Q1K13k68
4617i9K3K34k35k4K73k39n1K86j90j20K86j49j45K81j13j80K72o2k17K58k4k34
4639a69K53J4k73K35O8k69J70J09k75J44J38k74J04J94k69N6K02k40J8K22k32
4660g4k0K48j90q2K73j79j14K80j36j54K70q6j98K67m4k33K56j7k36K26L6k64
4682a71K08Q2k64J70J09k72J28J58k63Q8J95k70N4K03k34pK49k14m6K55j95r1
$$ plain form
4704 -128 145 -7 -142 127 15 -156 116 37 -154 90 57 -166 77 77 -162 58 106 -164 15 118 -150 -3
4726 -3 120 -140 -15 143 -122 -55 155 -91 -48 157 -77 -83 175 -37 -113 149 -19 -114 132 -15 -136 119 31
4749 31 -155 92 42 -133 89 58 -155 74 90 -150 40 99 -139 27 111 -138 11 145 -130 -40 138 -92
4771 -92 -37 145 -99 -70 163 -63 -99 144 -24 -96 138 -26 -112 150 10 -146 116 40 -131 95 38 -148 85
4794 85 77 -161 45 79 -148 36 88 -153 8 120 -126 -28 123 -106 -31 138 -101 -47 151 -84 -84 140 -49
4817 -49 -84 140 -31 -111 145 1 -125 128 22 -108 117 38 -151 101 78 -155 63 85 -139 49 80 -154
4839 -154 43 121 -147 -9 120 -118 -18 134 -114 -38 155 -85 -65 128 -56 -73 139 -64 -100 140 -13 -123
4861 -123 111 3 -115 120 6 -146 114 50 -144 66 62 -132 76 80 -164 50 120 -131 23 109 -122 -10
$$ packed form
4704a28K73j52j35K69j12j71K72p9j91K44l3k23K43%k39K20M8k70J79J03k68J47
4726cJ23k60J25J58k65O7K10k46M3K05k34oK58k12p6K62j68r5K46j47j21K55q8
4749C1j86K47n0j75K22l1k13K29J6k40J90N9k38J66Q4k49J49J34k75R0J78k30
4771i2N5J82k44K9K33k26l6K43j68p2K34j64q6K62j40j56K62p6j71K26n7j86K33
4794H5qk38K06L4k27J84N2k41J61J12k46R8J51k29P5J69k39N4J98k35%K24j89
4817d9l5K24j71q0K56j44j26K53j06j30K25p9j89K52k3k33K18K2k24J88L1k34
4839a54J97P8k68J38J29k38J00J52k48P6J93k40K0J93j84j7K12k03l6K40j53j10
4861a23K34j08j18K35j14j52K60o4j94K10mj94K08Mk44K14P0k51J54Q6k31J12
$$ plain form
4883 -10 119 -129 -28 131 -91 -56 140 -72 -58 126 -63 -87 136 -17 -107 133 -15 -86 153 -5 -139 97
4905 97 48 -143 89 52 -163 88 62 -151 77 84 -137 -1 108 -123 37 122 -135 -20 111 -120 -11 147
4927 147 -101 -32 175 -74 -65 140 -61 -98 141 -82 -80 128 -27 -105 99 38 -100 160 49 -74 97 79 -73
4950 -73 119 39 -198 50 84 -161 -3 97 -163 -24 125 -107 3 143 -97 -46 168 -100 -82 155 -80 -69
4972 -69 172 -56 -81 143 -32 -86 131 -10 -120 119 15 -127 107 47 -127 86 58 -127 63 87 -137 40
4994 40 89 -135 13 106 -129 -7 109 -110 -36 118 -99 -45 119 -81 -56 131 -59 -80 128 -33 -91 119 -30
5017 -30 -118 123 -2 -125 99 36 -123 88 44 -127 88 77 -136 53 82 -127 36 89 -131 21 109 -131 -16
5040 -16 126 -98 -23 116 -92 -47 135 -66 -76 129 -40 -77 127 -37 -101 127 -8 -115 106 27 -109 99
$$ packed form
4883a0J29k48J01J59k22L5J96k12J4J84j89k4K23j53r0K40j48p1K39j58j34K36
4905I7m9j91K32l7k15K51k6k13K28Pk21J36J09k31J60Q5k57J15J31k31J09J58
4927A47k48O9K07k49RK05k01l7K39k23KK08j55p8K04o1j38K60j11j23J71j8j52
4950g3J92q0k37K48L4k45J58J00k60J39J49k32J10J40k40N1K14k68J8K37k35J1
4972f9K41k28k5K24j75n4K17j41j10K39j04j42K34o0j74K13k8j85J90K4k24J77
4994D0M9k24J48R3k35J22J16k19P4J54k17N4J64k00K5J87j90k1K08j61n8K10j49
5017c0q8K41j25j23K24o3j59K11m4j71K15j1k13J89K9k09J63N3k20J52Q8k40J15
5040a6J42k24P5J39k08M5J82k01j0K05j69l7K04j64o4K28j35j07K21p9j36K08
$$ plain form
5062 99 21 -126 97 68 -136 61 78 -115 55 84 -129 34 113 -131 -5 119 -105 -12 129 -106 -35 133 -84
5085 -84 -79 122 -67 -73 133 -56 -85 137 -19 -106 104 16 -108 102 11 -126 113 57 -125 78 71 -105 52 73
5109 73 -132 29 99 -129 8 107 -100 -4 118 -112 -29 135 -100 -53 129 -76 -60 120 -65 -85 134 -43 -113
5132 -113 118 -17 -107 104 -8 -126 96 37 -137 73 54 -113 77 60 -131 56 98 -130 15 107 -107 14
5154 14 108 -114 -21 117 -105 -44 104 -82 -44 118 -76 -75 117 -59 -93 113 -35 -96 120 -35 -123 100 16 -130
5178 -130 86 37 -129 86 44 -136 74 76 -131 42 86 -111 27 89 -117 3 121 -107 -35 105 -87 -36 111
5201 111 -89 -70 112 -55 -87 108 -49 -94 118 -27 -97 105 3 -114 92 13 -125 90 35 -121 85 67
5223 67 -134 64 61 -117 47 84 -128 22 105 -110 -2 110 -102 -15 125 -93 -41 123 -71 -66 117 -55 -67
$$ packed form
5062I9p8j47K23k9k04J97J7j93J70K9k13J63P9k44J26J24k24R3J41k35P1J68k17
5085h4NK01j89oK06j89k9K22j56q7K10q8j24K10r1j37K39n6j82K03pj76J57K1
5109G3k05J61P0k28J37R9k07R6J22k30Q3J64k35M7J82k05J6J80j85k0K19j77p0
5132a13K31j35r0K11j12j18K22n9j74K10j9j67J90j7j91J87M2k28J45R2k14J21
5154A4R4k22R3J38k22O1J48j86L8J62j94JJ92j76l4K06j48o1K16j55q8K23q4j46
5178a30K16m9j66K15m2j80K10Kk07J73M4j97J38O2k06J20J18k28P2J40j92N1J47
5201A11k00J9J82j67l2J95j57m5K12j45p0K02j02j17K06p9j38K15n5j56K06j8
5223F7k01J98lj78J64L7k12J50Q3k15J08J12k12Q7J40k18N2J64j94NJ83j72j2
$$ plain form
5246 -67 119 -54 -104 117 -14 -119 92 5 -121 93 20 -123 86 52 -126 53 51 -129 50 83 -135 22 96
5269 96 -121 7 105 -125 -6 112 -113 -34 110 -103 -62 123 -80 -73 116 -60 -86 115 -32 -106 105 -27 -125
5292 -125 97 1 -127 87 19 -125 76 54 -131 60 69 -116 55 82 -121 33 102 -105 5 98 -108 -13 106
5315 106 -98 -36 126 -86 -61 126 -73 -82 109 -55 -96 116 -46 -118 92 -13 -108 96 -5 -139 89 25 -147
5338 -147 60 55 -128 56 66 -124 48 93 -116 17 109 -100 10 97 -101 -19 115 -86 -39 113 -76 -60 119
5361 119 -69 -76 114 -50 -104 109 -28 -95 108 -22 -129 108 24 -140 79 32 -128 57 42 -136 64 70 -141
5384 -141 38 84 -126 18 112 -112 13 132 -102 -24 119 -78 -35 120 -77 -63 133 -47 -101 111 -32 -77
5406 -77 113 -28 -119 108 9 -135 80 25 -133 80 34 -138 84 63 -131 42 80 -121 50 84 -136 20 111
$$ packed form
5246f7J86j73n0K21j31j05K11q7j26K14p3j43K09l4j78J79kj80J79L3k18J57P4
5269I6k17J28R8k30J19J18k25P9J44k13M1J85k03PJ89j76k6K01j47p4K11j32r8
5292a25K22r6j28K14o8j44K01k2j85J91Rj85J71K7k03J54O9k07J10R3k06R5J19
5315A06k04O2J62k12K5J87j99rJ91j64m1K12j62p2K10j05r5K04j01j34K28o4j72
5338a47K07nj83J84J0j90J72M5k09J33R2k09J10Q7j98Q2J34k01M7J52j89J6J79
5361A19j88pJ90j64n4K13j37o7K03j30j07K37q4j64K19m7j60J85j5j78K00Ok11
5384a41J79M6k10J44R4k24J25J19k34P8J43j97M3J55j97J4J96j80n4K12j43m5
5406g7J90j41r1K27r9j44K15n5j58K13m6j72K22k1j94J73L8k01J71L4k20J56R1
$$ plain form
5429 111 -115 -21 107 -93 -10 122 -88 -42 148 -69 -73 120 -41 -76 115 -43 -109 115 -5 -120 100 11 -125
5452 -125 87 9 -148 93 64 -137 59 68 -120 47 79 -140 31 113 -120 -7 116 -114 -7 132 -97 -25
5474 -25 133 -75 -59 130 -53 -67 132 -43 -96 134 -20 -105 121 -8 -114 107 11 -134 87 35 -145 59
5496 59 43 -130 58 68 -133 28 93 -130 9 112 -112 7 119 -99 -20 135 -89 -42 133 -73 -62 131
5518 131 -71 -91 143 -33 -98 123 -24 -107 117 5 -120 103 19 -134 84 47 -132 72 63 -147 52 73 -142
5541 -142 22 89 -120 8 108 -119 -17 126 -104 -31 131 -74 -47 142 -57 -69 130 -53 -99 123 -33 -97
5563 -97 109 -11 -116 104 3 -121 94 22 -131 82 58 -134 56 69 -136 42 92 -137 25 103 -118 -3
5585 -3 105 -111 -27 126 -99 -40 128 -80 -57 134 -62 -70 125 -40 -98 130 -7 -118 119 -7 -134 104 10
$$ packed form
5429A11k26R4J28k00Q3J32k10M6J90k17mJ93j61l5J91j58o6K24j20j15K20q9j36
5452a25K12p8j57K41k9k01J96Rj88J67L2k19J71Q2k33J13J23k30J07J39k29P2
5474b5J58k08J6J89j83j4J99j75n3K30j54q5K26j29j06K21r6j45K21n2j80K04
5496E9j6j73J88J0k01J61O5k23J39J03k24J19J12k18P9J55k24M7J75k06J1J93
5518A31k02k0K34j76o5K21j47q3K24j12j25K23q4j53K18l7j79K04rk10J99K1k15
5541a42J64O7k09J28J00k27J02J43k30P3J62k05K7J89j99j2J99j83m6K22j56o4
5563i7K06j20j05K20j01j24K15p2j53K13k4j92J90J3k05J78N0k29J62P8k21J15
5585cJ08k16Q4J53k25N9J68k08K3J91j96qJ95j65n8K28j37j11K37j26j27K38r4
$$ plain form
5608 10 -130 86 37 -143 65 52 -146 57 76 -144 36 99 -137 17 105 -135 5 116 -120 -32 122 -95
5630 -95 -52 120 -82 -54 137 -71 -96 124 -40 -101 131 -19 -107 120 6 -122 98 32 -123 75 32 -147 81
5653 81 57 -144 34 72 -125 36 97 -133 11 109 -118 -23 123 -102 -25 115 -103 -37 135 -82 -82 130 -45
5676 -45 -74 124 -52 -103 128 -5 -127 105 7 -129 98 13 -138 94 59 -140 57 81 -130 47 82 -139 30
5699 30 104 -134 -10 122 -106 -18 109 -108 -32 132 -74 -67 134 -68 -60 133 -61 -85 143 -24 -115 116 -10
5722 -10 -100 113 -2 -127 105 45 -133 70 57 -122 65 57 -139 50 96 -134 9 97 -112 17 101 -124 -27
5745 -27 133 -106 -64 126 -81 -52 121 -68 -72 139 -41 -96 128 -8 -97 125 -15 -118 114 21 -135 81 36
5768 36 -122 82 49 -137 65 69 -133 26 86 -126 14 105 -128 2 123 -110 -27 127 -97 -41 127 -97 -67
$$ packed form
5608A0j40K16m9j80K08j3j98K03J9k20J80O3k36J54Q8k40J40J11k36Q8J54k17
5630i5M3J72k02K8J91k08k5K20j64o1K32j50q8K27j14j28K20o6j55J98m3j79K28
5653H1k4k01J78L8j97J61O1k30J44R8k27R5J46k25P7J40k18O6J72k17%K12j75
5676d5k9J98j76n1K31j33j22K32r8j36K27q5j51K32l5j99J97K4k11J77L5k21J69
5699C0P4k38J24J32k28Q8J27k17P6J64k06PK01k02QJ93j94k4K28j67r1K31j26
5722a0r0K13j15j25K32o0j78K03j3j79J87qj96J89M6k30J43Q8k09J29Q4k25R7
5745b7J60k39M2J90k07K9J73j89mK11j80n5K24j36q9K22j40j03K32r3j56K16m5
5768C6j58K04l3j86K02Mk02J59O0k12J40R1k33J30J21k33Q3J54k24N6J68k24L0
$$ plain form
5791 -67 145 -46 -82 127 -27 -103 121 -28 -121 118 11 -115 91 24 -123 83 45 -145 81 70 -145 44
5813 44 66 -133 36 80 -142 10 107 -121 -17 118 -113 -24 123 -99 -44 134 -75 -67 130 -69 -78 130 -43
5836 -43 -105 134 -10 -118 123 10 -117 110 33 -126 101 53 -136 73 71 -130 57 71 -134 32 98 -132 6
5859 6 113 -118 -5 121 -113 -38 133 -93 -56 141 -84 -63 143 -56 -76 144 -35 -102 140 -16 -114 112 5
5882 5 -129 101 34 -126 87 59 -138 64 77 -125 45 90 -128 28 103 -140 2 100 -127 -20 117 -115 -35
5905 -35 122 -101 -69 137 -70 -64 130 -54 -88 142 -23 -95 132 7 -101 117 15 -116 110 37 -135 91
5927 91 63 -125 79 76 -136 71 95 -139 30 109 -127 8 120 -128 -20 128 -115 -43 126 -79 -68 119 -80
5950 -80 -83 140 -43 -103 139 -14 -103 126 -7 -120 133 31 -120 98 46 -136 88 46 -142 74 83 -141 39
$$ packed form
5791f7K12j91l6K09j54p6K24j49r3K39j07j26K06o7j47K06l8j90K26j1k15J89
5813D4K2j99J69M4k22J52R7k28J04J35k31Q9J47k22N5J78k09QJ97j99rK08j73
5836d3o2K39j44j08K41j13j27K27p7j59K27m8j89K09kk01J87J4k05J66O6k30J38
5859FJ07k31J13J26k34P5J71k26L7J97k25K1K06j99k0K20j79o7K42j56r8K26j07
5882Ej34K30o7j60K13k8j97K02J3k02J70M5k18J56P5k43J42R8k27J07J37k32Q0
5905c5J57k23L2K06k07OJ94j84l4K30j65p2K27j25j08K18j02j31K26p3j72K26
5927I1k8j88K04lk12K07K4k34J69P9k36J35J12k48J08J48k43P2J69k05J1J87j99
5950h0lK23j83o0K42j53q9K29j33j13K53j02j51K18n2j82K24m2j88K16Rk24J80
$$ plain form
5973 39 91 -142 29 90 -138 13 125 -121 -26 128 -96 -31 130 -103 -54 152 -79 -92 133 -45 -100 120 -42
5996 -42 -102 146 -1 -124 116 35 -112 98 45 -133 100 82 -134 66 81 -131 41 81 -141 21 112 -134 -20
6019 -20 110 -117 -25 106 -118 -40 128 -93 -71 128 -54 -75 133 -67 -103 135 -22 -121 101 1 -106 113
6041 113 20 -130 107 52 -143 64 70 -129 72 84 -144 51 111 -133 16 109 -118 -3 118 -129 -31 128 -111
6064 -111 -61 127 -73 -60 132 -70 -86 144 -45 -104 122 -27 -111 124 -4 -120 117 26 -133 85 42 -133
6086 -133 82 56 -145 66 98 -123 48 97 -121 24 106 -118 -3 132 -106 -40 133 -100 -45 134 -86 -76
6108 -76 139 -54 -86 128 -45 -94 120 -26 -114 132 16 -123 105 27 -122 102 46 -138 84 74 -131 50
6130 50 90 -130 42 108 -117 18 120 -115 -11 119 -93 -34 132 -99 -50 142 -73 -67 126 -52 -91 130 -37
$$ packed form
5973C9N2k33J71O1k28J51J12k46R5J54k24O5J61k33M9K06k31j3K25j78n5K20j62
5996d2o0K48j47j23K40q1j47K10n3j78K33j8k16K00J5k12J72M0k22J62R1k46J14
6019b0J30k27R2J31k24P8J68k21K2J99j82k1K08k00l6K38j57r9K22j00j07K19
6041A13r3j50K37n5j95K07Oj99K01J2k28J95O0k44J49R3k27J15J21k47R8J59k39
6064a11N0J88k00J3J92k02j6K30j89n9K26j49q4K35j28j16K37r1j59K18m3j75
6086a33K15k6k01K11L2k21J71M9k18J45Q2k24J15J35k38O6J73k33N5J79k20J0
6108g6K15j93l2K14j73m9K14j46q8K46j16j39K28p8j49K24n6j84K22j0k05J81
6130E0M0k20J72O6k25J35J02k35J04J30k12N9J66k31M9J92k15OJ93j78l9K21j67
$$ plain form
6153 -37 -121 109 -15 -123 122 0 -141 96 57 -141 96 47 -150 76 67 -140 46 84 -133 30 100 -164 26
6176 26 99 -132 -24 133 -114 -18 106 -139 -55 135 -72 -72 134 -51 -94 111 -26 -104 119 -15 -127 106 6
6199 6 -140 98 27 -134 87 52 -140 72 80 -124 56 88 -131 43 106 -131 6 112 -112 -19 111 -117 -35
6222 -35 125 -112 -62 131 -71 -73 120 -64 -89 134 -36 -98 135 -9 -113 105 -7 -132 103 32 -143 80
6244 80 53 -116 68 64 -123 54 100 -126 34 108 -113 18 117 -112 8 127 -104 -41 120 -86 -45 121 -77
6267 -77 -74 132 -49 -99 122 -29 -96 104 -11 -118 118 15 -114 95 30 -118 91 53 -132 73 80 -137 42
6290 42 101 -110 28 94 -125 6 125 -113 -32 128 -90 -25 125 -99 -47 138 -67 -79 116 -54 -90 123 -45
6313 -45 -109 120 -9 -121 101 8 -117 91 37 -127 89 68 -137 51 78 -121 53 85 -134 26 106 -120 -19
$$ packed form
6153c7q4K30j24j08K45j22j41K37l9j98K37m9j97K26rk07J86L8k17J63P0k64J90
6176B6P3k31J08J57k47R6J24k45Q4J90k07%K06j85m3K05j37p8K23j34j12K33j00
6199Fj46K38p1j61K21l5j92K12Qk04J80L2k19J74O3k37J37J06k24R3J30k28Q2
6222c5J60k37N0J93k02kJ93j84k5K23j70o2K33j44j04K18j12j25K35p1j75K23
6244H0k7j69J84mj87J77M6k26J60P4k21J31R9k29J20J19k31O3J61k06M1J66j98
6267g7LK06j81n0K21j51o7K00j15j07K36j03j29K09o5j48K09l8j85K05Pk17J79
6290D2N9k11J38O6k19J31J19k38Q1J60k18O5J50k24N2J85k05j2J95j70l6K13j68
6313d5o4K29j29j12K22r3j25K08n4j64K16k1k05J88K7j99J74L2k19J60Q0k26J01
$$ plain form
6336 -19 118 -103 -6 118 -108 -39 137 -85 -70 120 -57 -69 111 -53 -93 120 -20 -118 108 -14 -108 99 8
6359 8 -131 94 39 -147 66 66 -121 51 72 -129 55 102 -122 28 103 -103 3 101 -107 -15 122 -103 -51 121
6383 121 -75 -50 124 -67 -76 127 -36 -91 103 -15 -95 109 -15 -117 99 32 -127 75 44 -129 68 49 -126
6406 -126 48 80 -127 29 86 -117 19 106 -112 -4 111 -103 -21 113 -87 -44 119 -80 -61 129 -57 -82
6428 -82 112 -44 -95 112 -26 -111 102 1 -110 67 18 -120 71 42 -128 63 73 -136 38 80 -118 36
6450 36 91 -97 5 83 -94 -15 106 -82 -37 112 -69 -59 124 -44 -73 109 -74 -66 91 -43 -90 76 -23 -121
6474 -121 99 -5 -104 101 23 -136 82 35 -117 64 58 -126 46 70 -127 23 89 -121 21 109 -127 -43 104
6497 104 -95 -28 111 -55 -34 136 -47 -67 120 -41 -83 110 -40 -100 107 -20 -114 90 14 -121 78 19 -130
$$ packed form
6336a9J37k21R7J24k26O9J76k22J5J90j77j2J80j64m0K13j40r8K26j22r4K07r1
6359Hj39K25n5j86K13%j87J72K1k01J84M7k24J50P5k06J06R8k08R2J37k25N2J72
6383A21j96K5J74j91rK03j63n5J94j18q0K04j24j02K16o7j59K02l1j73J97j9j75
6406a26J74L2k07J56N7k03J36Q7k18J08J15k14Q2J34k00M3J63j99J9J90j86k5
6428h2J94j56n1K07j38q5K13j01j11J77m9j38J91k9j70J91J0k09J74M2j98J54
6450C6N5j88J02P8j77P9J21j88M5J49j81J0J83j68k9J82j83QJ57j34m7J66r9r8
6474a21K20j04r9K05p8j59K18m7j52J81oj84J72K4j97J50O6k10J42Q8k36Q4J47
6497A04j99O7J39j66K1J70j83k0J87j61m2J93j50o0K07j27r4K04p6j35J99n9j49
$$ plain form
6520 -130 67 40 -129 59 77 -116 42 81 -107 36 99 -108 1 113 -92 -10 106 -78 -26 125 -78 -61
6542 -61 120 -53 -72 111 -41 -81 109 -23 -97 96 -5 -101 75 19 -120 86 47 -124 56 48 -120 41 64
6565 64 -119 40 91 -109 19 104 -86 8 103 -96 -7 129 -76 -49 116 -62 -49 106 -59 -65 117 -29 -89 99
6589 99 -8 -85 92 -3 -101 95 25 -118 60 48 -108 61 50 -128 57 75 -121 19 77 -86 18 83 -88
6612 -88 -1 113 -84 -20 116 -62 -22 104 -76 -42 130 -41 -73 108 -26 -75 96 -24 -105 102 6 -108 80
6635 80 24 -106 73 23 -119 67 56 -130 22 65 -103 18 74 -109 3 110 -105 -25 101 -75 -34 107 -71
6658 -71 -37 137 -61 -52 126 -13 -45 122 -48 -92 106 -26 -108 74 -6 -98 95 10 -96 76 50 -126 25 20
6682 20 -100 64 78 -91 -18 113 -160 -28 33 -99 -74 122 -109 -26 133 -68 -54 93 -47 -30 126 -13 -71
$$ packed form
6520a30J97k7j69J88J8j93J58L9j88J43O3k07J09J12k05Q2J16j84N2J51k03J7
6542f1J81j73j9J83j52m0J90j32p4J93j01r6J76n6j39K06l9j71J80qj68J61K3
6565F4j83J59N1k00J28Q5j90R4R5j99Q9J36k05K7J65j78J3J55j65oJ82j46o0J88
6589I9j07p7J77r5r8J96p0j43J78j2j56J69j1j78J85J8j96J40N8j63J04O5j71
6612h8Q7J14j97O4J36j78M0J26j80L4J72j71l2J81j34m9J71j20q1K07r6j14J88
6635H0n6j30J79n0j42J86j1j86J52M3j68J21N6j83J12J07k15Q0J26j76M1J41j78
6658g1L4J74j98RJ78j39l2J67j70m4J98j32q2J82q0r2J93q5j06J72k6j76J51n
6682B0j20J64J4j69P3J31k73J32O1j32K5J96k31Q3J59k01J4J47j40J7J56j39n8
$$ plain form
6705 -71 115 -17 -83 105 -3 -88 87 -13 -116 78 17 -106 55 39 -117 52 50 -110 35 70 -113 16 72
6728 72 -87 17 86 -83 -12 112 -67 -35 112 -61 -38 117 -50 -59 111 -25 -71 105 -2 -84 103 4 -87 97
6752 97 7 -89 75 27 -105 59 36 -103 54 61 -100 32 66 -102 11 74 -98 0 95 -82 -6 98 -71 -23
6776 -23 111 -55 -44 98 -44 -59 108 -29 -81 108 -17 -78 92 -7 -90 81 22 -96 67 38 -92 55 47 -113
6800 -113 46 75 -103 24 78 -89 6 75 -93 -5 90 -82 -19 97 -66 -24 101 -61 -34 119 -43 -65 101
6823 101 -20 -65 100 -14 -76 94 -3 -97 86 21 -99 67 29 -98 54 43 -107 38 60 -91 30 63 -92
6846 -92 19 89 -93 -17 86 -67 -24 99 -75 -37 109 -47 -58 94 -34 -49 99 -37 -61 109 -5 -80 91
6869 91 14 -87 61 6 -96 68 33 -106 35 49 -95 37 57 -93 37 72 -95 2 90 -71 -9 78 -82 -18
$$ packed form
6705g1J86j32o6J88j08q5J75j00j03J94o1j23J61j6j56J69kj60J45L5j83J29N6
6728G2j59J04O9j69P1J24j79L2J47j73K3J55j67rJ70j36m6J76j07q2J87r9r1J84
6752I7r0r6J64m8j32J64k3j39J57Pj61J32L4j68J13O3j72R8R5j77P6J04j69M8
6776b3J34j66J1J42j42j5J67j37n2J89j25o1J70r9q3J71n9j18J63k9j30J47qj60
6800a13J59K9j78J27N4j67R5O9j68Q8R5j72O3J16j63M2J25j62K7J53j62k2J66
6823A01j21m5J65j14o2J70r7r4J83o5j20J66l8j27J52j1j50J45K2j51J21L3j55
6846i2J11P0j82P6J03j53M3J23j74L8J46j56j1J52j28j5J48j36k4J70j14p5J71
6869I1p7j01J48n5j02J64l5j39J41J4j44J32K0j50J30L5j67R7Q8j61O2Q7j60O4
$$ plain form
6893 -18 101 -73 -42 100 -35 -49 98 -42 -61 93 -21 -85 81 -9 -76 78 -2 -86 92 27 -98 62 48 -96
6917 -96 44 47 -120 44 62 -94 14 73 -83 19 79 -99 -10 97 -73 -34 100 -51 -26 98 -45 -43 107 -19
6941 -19 -66 97 -19 -70 91 -13 -86 91 11 -91 76 43 -79 57 44 -104 46 60 -96 39 76 -86 22
6964 22 67 -96 4 86 -85 -22 77 -67 -28 99 -62 -41 101 -38 -56 104 -25 -45 89 -12 -76 102 9 -90
6988 -90 74 22 -81 70 32 -85 65 49 -99 31 54 -87 36 71 -90 20 78 -82 -1 75 -72 -11 80 -78
7012 -78 -30 94 -54 -50 93 -37 -51 105 -23 -51 95 -7 -68 84 11 -80 78 11 -80 67 31 -95 52 48 -97
7037 -97 40 46 -93 23 68 -90 10 78 -89 -3 81 -71 -15 94 -58 -41 96 -56 -52 89 -41 -53 94 -21
7061 -21 -59 82 -8 -74 86 10 -84 76 11 -82 67 25 -86 59 46 -85 48 55 -89 24 67 -81 12 74 -73
$$ packed form
6893a8J19j74L1J42j35j4J47j40j9J54j14o4J66r0o7J54q0q4J78o5j25J60j4j44
6917i6J40Lj67J64J8j56J08N9j56J02O0j78Q9J07j70L9J34j51K5J24j43KJ50j26
6941a9m7J63j16n1J61j04p3J77q0j02J67l3j22J36j3j48J50J4j56J35L7j62J08
6964B2M5j63J00Q2j71O3R9j44L9J27j61K1J42j39j8J60j29k0J34j01o4J78r3r9
6988i0J64n2j03J51l8j17J50j6j48J30K3j41J23L5j61J10N8j60Q1P6j47O1R1j58
7012g8M8J24j48MJ43j30j4J56j28k8J46j02o1J52p3r1J58o7r1J47l6j26J47mj45
7037i7J37Oj39J16M5j58J00O8j67Q6Q4j52N6J09j52J7J37j52MJ41j30j2J47j15
7061b1l8J41r0o6J60p6r4J60o5r3J49m2j11J45j3j31J33Pj44J13M3j48R3O2j47
$$ plain form
7086 -73 -3 76 -69 -10 83 -59 -30 92 -51 -49 89 -33 -57 92 -18 -71 87 -4 -81 78 10 -82 65 26 -93
7111 -93 53 38 -102 56 47 -86 39 50 -72 -2 60 -74 6 77 -62 -12 102 -84 -2 72 -81 -33 100 -25
7135 -25 -52 49 -18 -132 75 18 -68 39 -41 -123 37 6 -85 88 56 -85 47 29 -88 47 61 -85 26 76
7159 76 -76 7 85 -119 0 122 -84 -12 73 -68 -29 66 -49 -48 95 -52 -36 102 -42 -36 56 -33 -70 71 -17
7184 -17 -82 100 23 -67 85 28 -82 58 60 -134 56 56 -54 28 78 -69 28 76 -155 -65 30 -94 19 51 -72
7209 -72 -66 89 -64 -78 65 -35 -50 83 -30 -56 59 -30 -53 81 12 -77 87 43 -60 64 6 -94 51 46 -84
7234 -84 33 53 -84 29 61 -99 -1 61 -85 -5 58 -75 -24 83 -67 -54 81 -42 -57 86 -54 -58 90 -31
7258 -31 -72 69 -9 -66 73 1 -81 67 16 -90 55 43 -76 47 44 -87 45 60 -85 29 73 -71 11 79 -85
$$ packed form
7086g3P0P9j45N9R3j42K9J22j43KJ38j22k4J49j10n3J58r1p7J59o8r2J47l9j19
7111i3J46j5j40J58rj33J25J1j22P0O2j34Q0P1j39N0J14j86Q2P4j53M8J33j25
7135b5k7J01o7j14K07n7q6J07q0q2J60l1r1J73l2j41J32j8j17J35J4j46J11N0
7159G6j52Q3P8k04J19J22k06P2Q5j41L9R5j15JJ43j47J6J38j44OR2q9l7J41q8
7184a7o5J82p7r0J52n7j10J40Kj94J90%j10Q2N0j47R7M8k31R0R5j24J13L2j23
7209g2OJ55j53j4J43j00j5J33j13k6J15q9k3J34o9q9J64m4j03J24n8j00J45nj30
7234h4J17K0j37J13L2j60R8O2j46Q0O3j33N1J07j50J3J35j23j5J43j40mJ48j21
7258c1m1J41p8n7J39p2q2J48n1j06J45j2j19J23lj31J32J5j45J14M4j44Q2O8j64
$$ plain form
7283 -85 -2 78 -63 -44 71 -46 -43 86 -63 -52 93 -44 -79 71 -18 -72 67 -5 -73 82 9 -83 64 36 -93
7308 -93 53 38 -89 55 42 -80 33 59 -78 37 40 -76 12 73 -48 -17 76 -60 -31 58 -84 -41 92 -57
7332 -57 -48 60 -39 -66 47 -25 -47 46 -3 -89 79 25 -77 34 25 -76 80 26 -84 16 86 -54 43 25 -63 25
7358 25 73 -82 -51 92 -61 1 84 -114 -6 64 -99 -47 99 -58 -10 103 -59 -53 35 -49 -87 103 43 -96 60
7383 60 13 -74 79 5 -54 43 38 -71 24 41 -75 38 58 -58 28 77 -83 6 72 -62 -14 65 -63 -24 89 -53
7409 -53 -37 90 -36 -48 76 -32 -58 75 -20 -68 63 -3 -66 59 11 -72 67 26 -74 47 52 -75 43 43 -72
7434 -72 33 62 -79 3 81 -68 -3 72 -64 -17 84 -71 -35 92 -57 -45 67 -51 -56 83 -29 -72 72 -20
7458 -20 -72 59 -12 -74 68 3 -93 52 23 -80 37 28 -82 37 44 -81 26 62 -74 10 63 -65 9 74 -72
$$ packed form
7283h5Q3Q0j41J9J15j17LJ29j49J1J45j37l5J50q9n4J39p2o8J55p3r2J47k8j29
7308i3J46j5j27J44j3j22J13K6j37J15Lj16Q8O1j21L1R3j36K9Q9j42M3J33j49
7332e7RJ08r9k7J13p2k2R3m9q6J68n4j02J11rj01J56n4j10J00P0j40R7j8q8Q8
7358B5M8j55L1J43j53O2Q3j98J08P0j63N2J46j57M8J13j62OQ8q4l8J90o0j39J56
7383F0m7q7J53p4n9R7nj09R5J7j16J13K0j16Q6M9j60Q9O6j34M8P9j28L9J13j42
7409e3J6J27j26j2J24j08k6J33r5m8J31o6o3J25m8q3J39m1j00J21Nj27J18%j15
7434g2J05K9j41Q2P8j49O5P5j36M7J01j55L6J27j49J2J12j18nJ39j12m3J44r2
7458b0n2J31p1o2J42o5r6J45k9j03J17rj10J19Pj25J07L6j36Q4N3j28P4O5j46
$$ plain form
7483 -72 -27 68 -53 -27 75 -52 -39 81 -42 -75 63 -15 -65 68 -21 -70 65 -7 -88 58 19 -80 50 12 -87
7508 -87 50 26 -93 27 50 -77 18 54 -73 5 64 -71 -12 69 -56 -11 73 -57 -21 77 -49 -50 61 -42 -51 56
7534 56 -32 -59 70 -9 -79 56 2 -74 56 17 -72 54 34 -95 46 47 -78 35 40 -75 24 66 -66 2 69 -58
7560 -58 -2 70 -57 8 83 -52 -37 75 -39 -43 81 -39 -46 74 -15 -69 66 -7 -62 61 -9 -69 28 24 -47 41 45 -100
7588 -100 103 47 -98 39 67 -73 15 67 -68 13 53 -74 -7 86 -62 -12 88 -56 -24 71 -49 -40 82 -32
7612 -32 -52 65 -16 -62 62 -21 -69 64 3 -65 54 16 -73 26 18 -93 43 40 -75 21 43 -69 21 50 -67 12 72
7639 72 -67 5 78 -61 -13 83 -56 -36 68 -38 -52 71 -32 -59 72 -7 -55 60 -6 -69 61 7 -75 52 15
7664 15 -74 48 18 -80 35 33 -86 31 53 -70 20 67 -62 11 62 -58 -3 82 -47 -18 76 -48 -23 83 -31
$$ packed form
7483g2M5R5j21K6J02j27J3J20j23l3J38p8n0J33q9m9J35p2q1J46l9r9J30l8r9
7508h7J37k4j19J20K3j27R5L6j27P8N9j35N9Q1j25M5Q4j30L6R8j26jJ11j03rJ07
7534E6q8k7J29p9p0J35n4p6J30l9q9J26k0j29J41Jj25J13Nj15R9M2j32O8O7j27
7560e8N6P2j27O5P5j35J5J12j14mJ24j20pJ20q9n4J35p3n5J23p0o0R7mp1Q8Mj45
7588a00K03n6j45J37K8j40Q8N2j35Q1M0j27O7R3j48N0J00j44L2R5j20RJ22j14
7612c2k0J17q1m6J24q3m8J33o1o8J19l8q9R9qj11J36lj15R6K2j12R0K9j17P9O0
7639G2j39P2P3j39M8R6j39K0J04j06j4J23j03k7J31p9m8J15o6o3J30n4q2J27l7
7664A5q9J22l0r8J15kj19J17K2j23R0M7j29P3N1j20N5Q5j29K9R4j24K5J06j14
$$ plain form
7689 -31 -46 87 -28 -56 76 -22 -61 60 -9 -69 50 13 -83 50 13 -72 40 29 -78 34 39 -85 24 30 -77
7714 -77 8 64 -73 -6 69 -59 -4 73 -49 -24 72 -46 -29 78 -29 -41 59 -31 -51 78 -21 -70 54 -4 -72 52
7740 52 6 -80 57 19 -95 38 32 -81 31 47 -80 24 57 -73 5 63 -54 -1 62 -62 -9 67 -58 -28 80
7765 80 -27 -27 64 -34 -42 76 -18 -66 58 -6 -54 57 -12 -71 56 9 -90 44 20 -68 24 25 -78 30 47 -84 11
7792 11 52 -61 10 65 -64 0 66 -68 -24 67 -50 -60 74 -12 -22 76 -27 -55 76 -12 -64 62 -11 -67 65 10
7818 10 -86 52 18 -73 35 15 -71 28 35 -82 9 34 -70 10 48 -66 9 56 -66 -8 73 -37 -14 65 -48 -19 91
7845 91 -41 -45 65 -17 -39 66 -21 -68 61 -3 -75 50 15 -65 57 7 -69 45 31 -79 26 30 -77 13 36 -65
7871 -65 8 43 -69 -16 60 -52 -18 55 -61 -16 76 -42 -30 82 -27 -34 72 -17 -53 65 -18 -67 69 0 -76 53
$$ packed form
7689c1j5J33j15k8J32r8l9J21o9o0J19l7r6J33l7q5J12j1j07J12Nj24J09Oj07
7714g7Q5N6j37O7P5j28N5P7j22K5R6j18J7J07j07j2J00r0k0J29r9m9J24n8o8J24
7740E2m6q6J37l8j14J33oj13J12J6j27J04L3j30P8N8j17N3O3j24N3P6j25L0J08
7765H0j07%R1r8qJ18r4m8J24o4m8J11o9n9J27m7r9J34k4q8R2Jj03J08J7j31R5
7792A1M1j13P1N5j29O4O6j34M4R1j17j0J34q6j0R8j03k8J31q8n2J26p3n6J32n5
7818A0r6J38l4r1J08k0q6R9Pj17R1K5j04Q0L8j14P5M7j22N8Q1j10K3P9j13K9J10
7845I1j32mJ10q2k2J05q7m7J29o4p2J25l5q0J22n0p6J14j4j10J05Mj07R0K3j01
7871f5P3L5j12N3P6j12L4P3j16M5R2j18J2J12j09pJ06q9l6J18q3m9J36o9p6J29
$$ plain form
7897 53 8 -76 44 11 -78 23 27 -75 19 23 -79 11 39 -64 -7 59 -72 3 54 -53 -8 58 -40 -30 73 -30 -38
7924 -38 70 -24 -41 68 -20 -53 77 -3 -68 81 7 -70 50 9 -78 47 19 -75 29 31 -77 22 41 -80 13 47
7950 47 -68 9 55 -66 -2 59 -43 -7 70 -38 -30 71 -41 -27 74 -30 -32 73 -14 -49 74 1 -57 64 5 -57
7976 -57 51 11 -58 49 26 -69 35 28 -72 24 43 -81 1 50 -84 -9 49 -67 -4 69 -48 -26 72 -45 -28 65
8002 65 -40 -26 67 -18 -51 72 -13 -46 68 -4 -44 62 11 -67 40 20 -60 31 17 -69 45 29 -74 13 38 -80
8028 -80 -2 39 -63 7 53 -72 -22 52 -57 -21 54 -47 -29 63 -31 -35 68 -11 -40 64 -12 -52 63 4 -73 62 15
8055 15 -65 41 17 -63 45 34 -78 20 38 -59 7 42 -69 10 50 -80 -8 55 -52 -20 50 -50 -21 67 -41 -30
8081 -30 68 -28 -37 67 -21 -34 78 -6 -46 69 17 -50 55 3 -62 51 27 -70 33 41 -66 13 36 -59 22 48 -71
$$ packed form
7897E3m5q4J20l3q9J01Mj02R4Mj02R0K8j03N7O6j31P5N1j07M5O6r8J0J03j03q
7924c8J08r4j7J09q8l3J30q0o5J49p4p7J20m1q7J25k8r4J04Kj08R9J9j21R3L4
7950D7j15P7M6j21O4O1j02L6P7j08QJ01j12J4J01j04kJ05q7l5J23p3n8J21n9o2
7976e7J08m0o9J07k3r5J04pj00R6J9j24Q2M9j34P5N8j16O3P3j17K2R8j17J7R3
8002F5j05J4R3q5l3J23q5l3J14p2m0J06n1p8J07k0q0R1j4q6J14j6j03Q7K5j18
8028h0P8M1j02P0M6j25N0P4j09L6P5j01J8R2r4mJ03p9k9J04p6m0J15n9p7J35m7
8055A5q0J06k4q0J08j1j12R8J8r7O6L5j11P9M0j30P2O3j07L2P0j00K9Q8j08J1
8081c0R8r6rJ04q8j3J12q4m0J15n2o7J05n2o5J13k4r7J03Qj07P9K3r5Q1K6j19
$$ plain form
8108 -71 4 50 -52 0 53 -61 -10 63 -59 -25 57 -28 -42 49 -33 -37 69 -19 -49 61 3 -41 54 1 -56 55 22 -63
8136 -63 50 21 -58 35 21 -71 32 39 -80 4 34 -60 -8 48 -75 -9 52 -59 -23 57 -50 -17 63 -37 -21 63 -28
8163 -28 -45 65 -13 -44 61 -13 -53 61 5 -61 49 18 -49 44 16 -54 44 33 -68 32 34 -55 8 37 -65 4 50
8190 50 -68
$$ packed form
8108g1P5M6j02N2N3j14N1P3j22L4Q2q5j4R1q2mJ06q8l0J10n8m4R5n3n7J11l3q5
8136f3J13k9p9R3j4r2J03Pj19Q4L0r4N2N6j23O6O1j11L6Q0j07L3Q0j00J6Q4r1
8163b8j7J10p8l1J05p4m0J14n6o6J10l1o7R3k8p0R8j1j01J00Kq9O3K9j02O9M6
8190E0j18
8191f8
$$ Imaginary data points
##PAGE= N=2
##DATA TABLE= (X++(I..I)), XYDATA
$$ plain form
0 0 0 0 0 0 0 0 0 0 0 0 0 0 0 0 0 0 8 -8 8 -8 8 -8 16 -16 16 -22 24 -26 32 -35 41 -48 51 -58 66 -74 83 -94
38 -94 106 -116 131 -145 160 -176 193 -214 236 -260 285 -316 348 -383 423 -468 517 -575 639 -714
58 -714 802 -908 1036 -1197 1403 -1679 2068 -2652 3617 -5488 10319 -46016 -68871 101835
72 101835 -22936 -72290 82037 -5183 -78258 74879 9718 -80769 55956 24365 -73364
83 -73364 46777 24515 -74151 43721 38836 -78755 29147 50254 -71844 16485 56748
94 56748 -69207 5065 68203 -60405 -15404 69203 -43552 -23533 63530 -35593 -28945 63946
106 63946 -26924 -37816 58795 -16793 -39240 55090 -14348 -45191 57429 -3859 -55126 50308
118 50308 8890 -57123 42161 16840 -59512 35251 28694 -59343 21394 35390 -51561 13400
$$ packed form
0@%%%%%%%%%%%%%%%%Qj6J6j6J6j6K4l2L2l8M6n0N8o7P6q9R9j09J24j40J57j77
38i4K00k22K47k76L05l36L69m07M50m96N45o01O64p31Q06q91R85j092J214j353
58g14J516j710J944k233K600l082L747m720O269r105J5807n6335k2855J70706
72A01835j24771m9354J54327q7220p3075J53137o5161r0487J36725l1591r7729
83g3364J20141k2262r8666J17872m885j17591J07902K1107j22098Q8329M0263
94E6748j25955P4272O3138j28608M5001Q4607j12755K0019Q7063r9123O648R2891
106F3946r0870j0892R6611p5588k2447R4330o9438l0843J02620o1288n1267J05434
118E0308m1418o6013R9284k5321p6352R4763o557q8037Q0737J3996q6951O4961
$$ plain form
130 13400 36364 -48566 8299 41492 -45069 -398 43571 -39050 -5021 44832 -37564 -11522
142 -11522 50698 -31407 -22225 50670 -22230 -28532 48618 -15334 -34866 47057 -5358 -40302
154 -40302 39893 2639 -39991 34873 6402 -41919 32007 13047 -43971 26037 18846 -43466
166 -43466 21244 23530 -44879 15552 31380 -43234 6333 35843 -38378 -882 38046 -34106
178 -34106 -7568 40407 -27799 -14367 39190 -21359 -17692 37880 -17435 -21640 37832 -12009
190 -12009 -25979 36074 -6466 -29214 34152 -1360 -33365 31560 5969 -35997 26119 12099
202 12099 -36202 20612 16750 -35858 15340 21086 -34454 10013 24135 -32532 5452 26889
214 26889 -30792 549 29582 -28149 -4296 31927 -24865 -9616 33358 -20594 -14868 33600
$$ packed form
130A3400K2964q4930N6865L3193q6561M4671M3969q2621L4029M9853q2396K6042
142a1522O2220q2105R182P2895p2900o302P7150o3952j9532Q1923n2415l4944
154d0302Q0195l7254m2630P4864k8471m8321P3926j8960n7018P0008p191o2312
166d3466O4710K286o8409O0431J5828p4614M9567K9510p4221L7496L8928p2152
178c4106K6538M7975o8206J3432N3557o0549L667N5572n5315m205N9472m9841
190a2009j3970O2053m2540k2748O3366l5512l2005O4925k5591m1966O2116j4020
202A2099m8301N6814l862n2608N1198N746n5540M4467J4122n6667L7984K1437
214B6889n7681L1341K9033n7731K3853L6223n6792J5249M2974n3952N726M8468
$$ plain form
226 33600 -15342 -19162 32739 -9909 -23035 30432 -4265 -25209 27263 59 -26562 24829
238 24829 4243 -28265 21717 8707 -29053 17966 12279 -29541 14838 16765 -30031 9670
250 9670 20976 -28160 4402 23118 -25966 467 25634 -23812 -4774 27224 -19668 -8830
262 -8830 26781 -16725 -11586 27719 -13652 -15863 27561 -8809 -18730 25658 -5516 -20868 25311
275 25311 -1128 -24372 22481 4498 -25015 18370 7511 -25034 16065 11218 -25924 11717
287 11717 15031 -24056 7745 16098 -23329 5548 19195 -22983 691 21775 -19755 -3158
299 -3158 21856 -18083 -5781 24112 -15784 -10860 24522 -10965 -13589 22876 -8453 -15539 23275
312 23275 -5007 -19136 21376 -200 -19763 18697 1691 -20909 18147 5503 -23229 14665
$$ packed form
226C3600m8942l820N1901m2648j3126N3467l4697k0944N2472k7204k6621N1391
238B4829k0586l2508M9982j3010l7760M7019n687m1820M4379J927m6796L9701
250I670J1306m9136L2562J8716m9084K6433K5167m9446J9038L1998m6892J0838
262h830L5611m3506N139L9305m1371k211M3424l6370r921M4388l1174j5352M6179
275B5311k6439k3244M6853j7983k9513M3385j0859l2545M1099m847l7142L7641
287A1717L314l9087L1801Q353l9427K8877J3647m2178K3674K1084m1530J6597
299c158K5014l9939J2302K9893l9896M924L5382l5487k624L6465l1329p086L8814
312B3275k8282j4129M0512k1576j9563L8460j7006k2600L9056j2644k8732L7894
$$ plain form
324 14665 9923 -22309 11110 11440 -22366 9172 15174 -22455 4137 17842 -19190 829 17720
337 17720 -18180 -1180 20282 -16765 -6022 21001 -12498 -8248 19838 -11253 -10221 21467
349 21467 -8514 -14475 20396 -3920 -15581 18393 -2278 -17293 18570 1705 -20273 15272
361 15272 6005 -19361 12448 7100 -19976 11473 10783 -21039 7159 13812 -18606 4381 14207
374 14207 -18488 2523 17388 -17634 -2415 18676 -13758 -4786 17883 -12708 -6752 19756
386 19756 -10269 -11118 18917 -5893 -12146 17159 -4606 -13673 17706 -1417 -16731 15322 2551
399 2551 -16447 13172 3735 -17603 12593 7352 -19213 8853 10611 -17553 6180 11424 -17551
412 -17551 4492 14380 -17132 274 15896 -14249 -1942 15868 -13448 -3964 17800 -11523
$$ packed form
324A4665m742l2232L3419L30l3806L1538O002l7629K6592J3705l7032K0019J6891
337A7720l5900J7000K1462l7047J0743K7023l3499M250K8086l1091J032L1688
349B1467k9981n961L4871k4316j1661L3974k0671j5015L5863j6865k1978L5545
361A5272r267k5366L1809n348k7076L1449o90l1822K8198O653l2418K2987R826
374A4207l2695K1011J4865l5022J5219K1091l2434Q972K2669l0591N956K6508
386A9756l0025q49L0035k4810o253K9305k1765r067L1379j9123j5314L2053j2771
399B551j8998K9619r437k1338L0196n241k6565K8066J758k8164K3733N244k8975
412a7551K2043R888l1512J7406J5622l0145J2307J7810k9316R484K1764k9323
$$ plain form
424 -11523 -7906 17642 -7904 -9364 16604 -6454 -11144 17099 -3545 -13972 15317 1 -14374
437 -14374 13457 1694 -15412 12561 4769 -16627 9638 7417 -15773 7539 8653 -16039 5881
450 5881 11306 -15905 2516 13010 -14119 295 13771 -13378 -1929 15468 -11744 -5158 15719
463 15719 -9184 -6928 15516 -7632 -8917 15928 -5092 -11308 14787 -2296 -12260 13648 -355
476 -355 -13490 12700 2368 -14552 10595 4731 -14521 8836 6579 -14847 6908 8932 -14552
489 -14552 4184 10447 -13492 2104 11543 -12750 -42 12885 -11495 -2546 13517 -9873 -4565
502 -4565 13913 -8282 -6658 14171 -6240 -8628 13806 -4121 -10158 13236 -1978 -11546 12369
515 12369 324 -12585 11083 2511 -13276 9521 4689 -13507 7707 6549 -13374 5884 8209
$$ packed form
424a1523L617K5548k5546j460K5968k3058m690K8243k0644j0427K9289j5316j4375
437a4374K7831j1763j7106K7973p792k1396K6265k221k3190K3312J114k4692K1920
450E881N425k7211J8421J0494k7129J4414J3476k7149J1449J7397k7212O586K0877
463A5719k4903K256K2444k3148j285K4845k1020o216K6095j7083r964K5908j4003
476c55j3135K6190j0332j6920K5147n864j9252K3357k257k1426K1755K024k3484
489a4552J8736O263k3939J5596R439k4293J2708J2927k4380Q949J6063k3390N308
502d565J8478k2195J624K0829k0411k388K2434j7927o037K3394j5214r568K3915
515A2369j2045j2909K3668q572j5787K2797m832j8196K1214j158j9923J9258K325
$$ plain form
528 8209 -13173 3786 9834 -12349 1575 10859 -11340 -376 11837 -10270 -2685 12497 -8473
541 -8473 -4633 12396 -6935 -6092 12603 -5432 -8081 12352 -3151 -9380 11402 -1468 -10261
554 -10261 10952 359 -11657 9747 2768 -11954 8073 4156 -12095 7154 6025 -12691 5078
567 5078 8130 -11790 2929 8843 -11057 1694 10153 -10690 -696 11266 -8883 -2639 11097
580 11097 -7724 -3824 11761 -6585 -6188 11711 -4168 -7445 10616 -2917 -8159 10677 -1379
593 -1379 -9975 9671 1119 -10290 8053 2179 -10515 7644 3926 -11555 5819 6111 -10812
606 -10812 3977 6658 -10508 3282 8272 -10684 942 9752 -9051 -882 9666 -8248 -1836
619 -1836 10744 -7452 -4270 11001 -5161 -5478 10112 -4274 -6289 10596 -2812 -8384 9706
$$ packed form
528H209k1382J6959O048k2183J3924R284k2199J0964J2213k2107P585J5182k0970
541h473L840J7029j9331Q43J8695j8035k649K0433j5503o229K0782j2870q793
554a0261K1213j0593j2016K1404o979j4722K0027l917j6251J9249j129j8716J7769
567E078L052j9920J4719N914j9900J2751Q459k0843R994J1962k0149O244J3736
580A1097j8821L900J5585j8346L97J7899j5879l277J8061j3533n242J8836j2056
593a379q596J9646q552j1409J8343n874j2694J8159l718j5481J7374K92j6923
606a0812J4789K681j7166J3790M990j8956J1626Q810j8803Q169J0548j7914O412
619a836J2580j8196L182J5271j6162l17J5590j4386k015J6885j3408n572J8090
$$ plain form
632 9706 -321 -8718 8184 493 -9116 8048 2203 -10373 6317 4315 -9769 4677 4784 -9789
646 -9789 4157 6552 -10130 1886 7977 -8611 420 7918 -8276 -285 9361 -7776 -2692 9899
660 9899 -5720 -3788 9296 -5130 -4635 10172 -3817 -6800 9498 -1518 -7182 8324 -938
673 -938 -7823 8490 761 -9309 6875 2840 -8824 5390 3241 -9041 4972 4963 -9540 2816
687 2816 6364 -8239 1496 6373 -8118 830 7887 -7757 -1455 8507 -5895 -2465 8065 -5445
701 -5445 -3194 9040 -4423 -5182 8754 -2424 -5684 7974 -1884 -6411 8299 -366 -7901 7087
715 7087 1502 -7712 5911 1969 -8120 5606 3525 -8794 3824 4941 -7961 2543 5183
728 5183 -7882 1779 6477 -7643 -126 7139 -6260 -1128 6960 -5815 -1924 7835 -4987 -3623
$$ packed form
632I706j0027q397J6902p691r609J7164n845j2576J6690k002j4084J4446J07j4573
646i789J3946K395j6682J2016O091j6588R031P498j6194P991R646j7137N084J2591
660I899j5619J932J3084j4426M95J4807j3989k983J6298j1016n664J5506r262
673i38o885J6313p729j0070J6184m035j1664J4214k149j2282J4013rj4503J2356
687B816L548j4603R735M877j4491Q948P057j5644O302R962j4402L430J0530j3510
701e445K251J2234j3463p59J3936j1178l260J3658r858m527J4710q665p535J4988
715G087n585r214J3623l942j0089J3726k081j2319J2618J117j2902J0504K640
728E183j3065R661M698j4120P517P265j3399N132Q088j2775L891R759j2822J364
$$ plain form
742 -3623 7841 -3385 -4299 7393 -2707 -5027 7637 -1450 -6216 6952 48 -6447 6215 750
756 750 -6943 5915 2064 -7628 4658 3362 -7358 3583 3969 -7424 2793 5045 -7363 1442
770 1442 5783 -6749 275 6145 -6261 -728 6833 -5474 -2127 6987 -4334 -2975 6917 -3523
784 -3523 -3837 7010 -2440 -4800 6664 -1211 -5353 6210 -245 -5911 5768 913 -6364 4978
798 4978 1937 -6514 4237 2795 -6701 3416 3757 -6708 2395 4533 -6487 1402 5207 -6171
812 -6171 348 5736 -5648 -681 6133 -5061 -1697 6439 -4258 -2686 6480 -3369 -3524 6444 -2436
827 -2436 -4364 6218 -1291 -4963 5723 -342 -5339 5331 605 -5865 4723 1789 -6024 3816
841 3816 2563 -5982 3166 3367 -6115 2217 4250 -5776 1192 4670 -5467 480 5255 -5287 -697
$$ packed form
742c623J1464j1226r14J1692j0100k320J2664r087m766J3168o904o495J2662n465
756G50p693J2858l851r692J2286j296j0720J0941L86j1393J0217K252j2408Q805
770A442M341j2532P024N870j2406N533P561j2307L347R114j1321J359R892j0440
784c523l14J0847r450k360J1464p875m142J1563o455n666J1679m855p277J1342
798D978l041q451J0751j442r496J0117L41j0465R103K138j1020P889L805j1378
812f171O519N388j1384M967O814j1194L364Q136j0697J572R166r849j55R968q880
827b436j928J0582p509l672J0686o065m997J0670m726o470J0588k934p813R840
841C816j253q545R148K01r482Q332K033j0026O968L478j0137N947M775j0542M590
$$ plain form
856 -697 5799 -4433 -1678 5731 -3831 -2275 6010 -3287 -3391 6082 -2084 -4086 5566 -1321 -4454
871 -4454 5512 -493 -5303 4995 869 -5447 4065 1469 -5419 3757 2288 -5886 2836 3431 -5491
886 -5491 1750 3723 -5190 1290 4418 -5217 99 5122 -4331 -887 4950 -3895 -1287 5457 -3610
901 -3610 -2534 5670 -2409 -3251 5148 -1868 -3549 5348 -1236 -4596 5010 86 -4813 4198 550
916 550 -4928 4144 1404 -5614 3287 2636 -5247 2253 2866 -5057 1977 3666 -5253 814 4487 -4410
932 -4410 -139 4365 -4054 -526 4966 -3782 -1798 5205 -2603 -2427 4718 -2248 -2733 5069 -1675 -3846
948 -3846 4803 -425 -4066 4109 -95 -4285 4195 712 -5045 3432 1848 -4776 2641 2036 -4813
963 -4813 2506 2914 -5148 1390 3755 -4418 565 3718 -4239 225 4428 -4054 -1013 4736 -2986
$$ packed form
856f97O496j0232K755P409r562J556Q285r297j04R473q166k002R652o887l133
871d454R966o005m810J0298m126o316R512k596o888R176j469q174Q722N95q922
886e491P241J973q913O480L128r635N316N023r453L444N837q845K608O744r067
901c610J076Q204q079q42Q399p016j681Q897o584l360R606m924m899R011l648
916E50n478R072k740p018Q901o51p883P500O13p923P034J689q919O067L673q897
932d410M271M504q419L528N492q748J984P003p808J76P145o966m85P802o744k171
948c846Q649n228l641Q175m204m190Q480l483n757Q477j584o624P417o05o849
963d813P319M08q062O538K365q173M983L153p957M464M203q482L041N749p722
$$ plain form
978 -2986 -1584 4394 -2728 -1959 4861 -2129 -3124 4606 -919 -3320 3993 -666 -3583 4165 108 -4401
994 -4401 3484 1173 -4213 2813 1362 -4366 2723 2231 -4744 1714 3014 -4171 1051 3031 -4153
1009 -4153 772 3799 -4110 -365 4216 -3232 -940 4021 -3022 -1335 4536 -2532 -2394 4413 -1486
1024 -1486 -2675 3971 -1204 -3008 4152 -486 -3787 3602 517 -3753 3004 824 -3908 2847 1564
1039 1564 -4239 2057 2282 -3910 1456 2478 -3889 1119 3124 -3860 189 3549 -3265 -367 3546
1054 3546 -3063 -796 3948 -2711 -1624 4031 -1983 -2075 3864 -1607 -2492 3940 -995 -3112 3622 -212
1070 -212 -3300 3242 229 -3529 3017 902 -3827 2439 1574 -3748 1884 1977 -3723 1421 2509 -3629
1086 -3629 734 2918 -3315 176 3138 -3059 -341 3451 -2707 -986 3584 -2238 -1483 3611 -1796
$$ packed form
978b986J402N978p122P69O820o990r95P730n525k401P313m659k917P748m057m509
994d401P885k311n386P026j451n728P089m92o975O458J300p185N222J980p184
1009d153M925L027p909L745M581p448K292M961p043J687N871p068J38O807n899
1024a486j189O646n175j804P160m638l301P389l085m270O757k180m732O755j283
1039A564n803O296K25o192N366J022o367N008K005o984M049L360o814K898L913
1054C546o609K267M744o659J087N655o014r2N939n471q85O432m935k117O734l834
1070b12l088O542l013l758O546k115m729O266q65n322N632R3n700N144J088o138
1086c629M363K184o233L491K962o197K718L792o158J721M570n822P55N094n407
$$ plain form
1101 -1796 -1968 3606 -1290 -2424 3489 -785 -2787 3317 -237 -3121 3043 358 -3358 2679 906
1116 906 -3502 2259 1442 -3533 1746 1899 -3472 1297 2328 -3392 721 2784 -3117 81 2995 -2769
1132 -2769 -361 3192 -2488 -930 3373 -1980 -1462 3292 -1534 -1804 3290 -1163 -2327 3231 -509
1147 -509 -2660 2873 -86 -2798 2733 312 -3171 2434 969 -3246 1920 1311 -3194 1682 1744 -3380
1163 -3380 1141 2331 -3105 521 2446 -2844 273 2784 -2795 -390 3149 -2231 -959 3011 -1854
1178 -1854 -1188 3169 -1589 -1838 3191 -836 -2181 2787 -503 -2278 2819 -139 -2822 2546 639
1193 639 -2894 1958 872 -2819 1875 1250 -3162 1389 1899 -2927 777 1978 -2778 648 2348 -2884
1209 -2884 -19 2811 -2337 -561 2658 -2057 -683 2944 -1948 -1377 3103 -1198 -1738 2731 -896
$$ packed form
1101a796j72N574m896j134N913m274k002O104l554k884O164k685l716O037j773
1116I06m408N761q17m975N279J53n371M769J031n720M113K063n901L198K914n764
1132b769K408L553n680J558M303n353N18M754m826k70N094m453j164N558l740
1147e09k151N533k959k712N531k421l483N605j465m215N166o09m505M876O2n124
1163c380M521J190n436L626J925n290L117K511n579K405L539n380J272L970m865
1178a854O66M357m758k49N029m027j345M968l290j775N097k958k683N368j907
1193F39l533M852j086l691M694o25m412M551N10m826L704J201m756L426J700n232
1209b884K865K830n148J776L219m715J374L627m892N71M480m301n40M469l627
$$ plain form
1224 -896 -1837 2864 -574 -2448 2653 215 -2525 2106 410 -2506 2115 801 -2941 1641 1491 -2749
1240 -2749 1048 1557 -2637 949 1939 -2809 324 2411 -2337 -169 2290 -2180 -277 2658 -2124
1255 -2124 -980 2866 -1466 -1334 2589 -1240 -1446 2813 -964 -2060 2703 -253 -2198 2298 -47
1270 -47 -2277 2361 389 -2736 1917 1066 -2581 1397 1152 -2551 1320 1605 -2766 683 2070 -2356
1286 -2356 206 2008 -2262 32 2401 -2197 -666 2591 -1616 -966 2391 -1474 -1123 2676 -1219
1301 -1219 -1746 2608 -550 -1889 2290 -388 -2023 2413 46 -2495 2061 654 -2393 1676 773
1316 773 -2471 1629 1261 -2699 1057 1758 -2389 613 1766 -2337 419 2164 -2294 -239 2386 -1815
1332 -1815 -605 2273 -1672 -854 2532 -1394 -1447 2485 -803 -1640 2235 -619 -1807 2324 -237 -2219
$$ packed form
1224h96r41M701l438j874N101k438k740M631j696k916M621j314l742M582j50m240
1240b749L797N09m194L586R90m748L133K087m748K168K459m470J903K935m782
1255b124J144L846m332J32L923l829k06M259l777j096M763k956j945M496k345
1270d7k230M638j972l125M653q51l647L978k45l703L871K85m371L449J387m426
1286b356K562J802m270K294K369m598J531L257m207O50L357l865L51L799l895
1301a219n27M354l158j339M179k678j635M436k367k541M556j407l047M069r03
1316G73l244M100l68l960L756P01m147L002J153m103K756J745m458K055K625m201
1332a815J210K878l945Q18L386l926n3L932l288q37L875k854j188M131k561j982
$$ plain form
1348 -2219 2094 329 -2247 1776 547 -2337 1672 975 -2529 1255 1416 -2363 908 1554 -2333 677
1364 677 1923 -2311 159 2173 -1985 -229 2215 -1816 -540 2391 -1557 -1027 2397 -1140 -1313 2290
1380 2290 -869 -1583 2292 -502 -1924 2113 -44 -2074 1855 280 -2177 1677 638 -2292 1393
1395 1393 1002 -2300 1099 1309 -2264 800 1611 -2192 444 1848 -2053 114 2060 -1870 -241 2189
1411 2189 -1650 -577 2291 -1408 -954 2327 -1078 -1299 2239 -752 -1539 2163 -438 -1820 2020 -28
1427 -28 -2015 1754 310 -2095 1553 630 -2222 1292 1056 -2203 901 1288 -2097 665 1532 -2087
1443 -2087 340 1845 -1886 -61 1924 -1673 -287 2075 -1532 -676 2227 -1184 -1007 2115 -914
1458 -914 -1170 2157 -727 -1553 2109 -250 -1782 1819 15 -1842 1723 284 -2122 1493 760 -2106
$$ packed form
1348b219M313j765k576M023j229k884M009o97l504L784J61l779L271O46l887L010
1364F77J246m234K470K014m158J756K444m031J276K931l948N30L424l537j73L603
1380B290l159p14L875k794j422M037k157k030L929j575k457L854j039k930L685
1395A393l91l302L399K10l573L064Q11l803K636J404l901K167J946l930J629K430
1411B189l839J073K868l699M54L281l405k21L538k991p87L702k601j382L840k048
1427b8j987L769j444k405L648r23k852L514k36l259L104L87l385K762Q67l619
1443b087K427J505l731J825J985l597J386K362l607Q56K903l411J77L122l029
1458i14k56L327k884q26L662k359j532L601j804j857L565j439k406L615p33k866
$$ plain form
1474 -2106 1066 940 -2030 938 1209 -2149 543 1637 -1888 91 1650 -1678 -26 1837 -1648
1489 -1648 -449 2082 -1232 -797 1925 -1012 -895 2046 -877 -1328 2068 -358 -1527 1752 -183 -1545
1505 -1545 1794 22 -1926 1607 541 -1949 1181 672 -1895 1140 921 -2114 778 1377 -1886 326
1521 326 1380 -1734 274 1614 -1786 -209 1916 -1362 -591 1767 -1137 -654 1917 -1033 -1105 1976
1537 1976 -514 -1303 1677 -339 -1326 1774 -143 -1721 1607 388 -1727 1237 471 -1685 1241 709
1553 709 -1971 916 1135 -1799 532 1145 -1719 481 1401 -1819 26 1690 -1451 -301 1581 -1310
1569 -1310 -371 1790 -1238 -830 1888 -762 -1053 1664 -592 -1109 1764 -365 -1496 1615 125 -1531
1585 -1531 1297 233 -1550 1319 509 -1820 1013 914 -1673 684 941 -1637 624 1205 -1741 218
$$ packed form
1474b106L172j26k970K968K71l358K692J094l525J979J559l328J652J863l485
1489a648J199K531l314M35K722k937J17K941k923m51L396k426j169L279j935j362
1505a545L339j772j948L533j066k490L130n09k567L035k19l035K892N99l263K212
1521C26J054l114K008J340l400J577K125l278P71K358k904M83K571k950p2L081
1537A976k490p89K980k016r87L100j917j578L328j219k115K964p66k156K926n32
1553G09k680K887K19k934K331O13k864K200R20l220J845J664l141J150J882k891
1569a310R39K161l028M08K718k650k91K717k256n17K873k129j131L111j490j656
1585a531K828j064j783K869q10k329K833r9k587K357K57k578K261N81k946J959
$$ plain form
1601 218 1454 -1468 -55 1399 -1395 -148 1630 -1336 -584 1738 -934 -782 1582 -808 -880 1724
1617 1724 -622 -1261 1626 -181 -1348 1406 -49 -1420 1414 238 -1667 1139 635 -1568 842
1632 842 709 -1573 784 999 -1669 403 1256 -1438 132 1264 -1379 2 1469 -1314 -380 1577
1648 1577 -1012 -577 1479 -894 -712 1617 -726 -1028 1574 -383 -1153 1429 -221 -1260 1422 32
1664 32 -1462 1236 345 -1485 1023 492 -1521 916 759 -1593 617 1008 -1477 354 1114 -1400 179
1681 179 1276 -1346 -124 1416 -1132 -361 1431 -977 -576 1516 -793 -811 1492 -559 -987 1435
1697 1435 -353 -1134 1371 -140 -1287 1282 109 -1387 1143 339 -1438 963 547 -1474 792 744
1713 744 -1498 588 947 -1451 334 1109 -1356 122 1242 -1278 -136 1374 -1086 -399 1398 -890
$$ packed form
1601B18J236k922J413J454k794J247J778k966P52K322k672J52K364k390p2K604
1617A724k346o39K887j807j167K754j455j371K834j176j905K806n04k203K410
1632H42j33k282K357K15k668K072Q53k694J570J132k643J381J467k783R34J957
1648A577k589M35K056k373J82K329k343l02K602j957p70K582j650j039K682j390
1664C2j494K698q91j830K508n31k013K437j57k352K210L91k485J831P60k514J579
1681A79J097k622J222J540k548P71J792k408M01K092k309j8K303k051m28K422
1697A435j788p81K505j511j147K569j173j496K530q04j777K401m16k021K266m8
1713G44k242K086L59k398J785P75k465J478J120k520J142J510k460O87J797k288
$$ plain form
1729 -890 -574 1424 -747 -802 1468 -485 -1004 1353 -247 -1106 1297 -79 -1270 1204 215 -1342 993
1746 993 405 -1336 901 550 -1466 731 825 -1433 448 946 -1325 319 1056 -1354 91 1260 -1187
1763 -1187 -199 1261 -1031 -305 1343 -971 -584 1459 -676 -827 1323 -471 -876 1329 -340 -1137
1779 -1137 1306 16 -1248 1063 195 -1222 1016 344 -1408 863 702 -1367 542 785 -1268 497
1795 497 916 -1379 251 1183 -1215 -74 1148 -1067 -117 1257 -1077 -426 1400 -777 -659 1250
1811 1250 -628 -672 1339 -567 -981 1366 -178 -1120 1095 -20 -1090 1120 111 -1339 1006 499
1827 499 -1310 692 568 -1236 676 738 -1384 418 1066 -1224 83 1019 -1093 70 1152 -1145
1843 -1145 -233 1347 -861 -505 1211 -723 -531 1312 -684 -837 1347 -336 -969 1136 -225 -971
$$ packed form
1729h90L16J998k171n5K270j953n19K357j600q59K403j376j191K474r89j557K335
1746I93n88j741K237l51k016K197R4k258J881M98k271J644P37k410J445J169k447
1763a187R88J460k292P26J648k314L87K043k135j51K150j794m05K205j669p97
1779a137K443j290j264K311q68j417K238o72j752K271j61k069J909K43k053J765
1795D97M19k295J630R32k398J141J222k215R50J374k334O51J826k177J18J909
1811A250j878m4K011j906m14K347j544r42K215j115j070K210j009j450K345n07
1827D99j809K002j24j804J912O2k122J802O48k290J307R36k112J163J082k297
1843a145R12J580k208L56J716j934J92J843j996j53K184j683o33K105j361p46
$$ plain form
1859 -971 1201 -99 -1234 1106 285 -1251 840 371 -1205 833 541 -1381 598 864 -1253 312
1875 312 864 -1165 261 1033 -1225 -40 1254 -964 -299 1168 -837 -368 1275 -769 -670 1317 -465
1892 -465 -829 1160 -361 -873 1216 -225 -1141 1116 113 -1167 900 190 -1165 906 373 -1328
1908 -1328 711 662 -1239 483 715 -1213 422 915 -1252 132 1101 -1040 -85 1077 -960 -183 1220
1925 1220 -883 -493 1292 -603 -648 1177 -482 -735 1240 -315 -990 1160 -44 -1029 978 92 -1083
1942 -1083 931 268 -1283 785 542 -1238 543 576 -1197 513 763 -1244 265 949 -1109 103
1958 103 973 -1052 -46 1155 -980 -299 1208 -814 -484 1165 -634 -593 1226 -481 -808 1189 -227
1975 -227 -921 1089 -67 -1006 1016 125 -1140 878 355 -1158 716 491 -1179 586 650 -1195 390
$$ packed form
1859i71K172j300j135K340q21j536K091m69j576K038k92j922J979K66k117J565
1875C12N52k029J426P72k258J185J294k218O65J467k005M69J643k044R9J987j782
1892d65l64J989j521n12K089j441r16K257j003j280K067p10j355K071n33j701
1908a328K039m9j901J722K32j928J635M93k167J384R69k141R55J162k037P77J403
1925A220k103L90J785j895m5J825j659k53J975j555o75K150j204r85K007q86j175
1942a083K014o63j551K068k43j780J781L3j773J710K50k007J509O84k058J212
1958A03Q70k025J006J201k135O81J507k022L30J649j799M1J819j707l27J997j416
1975b27o94K010j156r39K022q91j265K018n23j513J874k25j670J765O4j845J585
$$ plain form
1992 390 822 -1134 196 923 -1071 37 1023 -983 -155 1098 -862 -321 1144 -735 -480 1182 -587
2009 -587 -635 1175 -416 -787 1137 -225 -904 1052 -35 -978 972 128 -1081 869 355 -1140 683
2026 683 510 -1132 545 656 -1165 359 827 -1092 134 907 -997 7 1000 -962 -212 1106 -793
2043 -793 -415 1090 -638 -500 1121 -551 -674 1157 -329 -832 1046 -153 -871 1014 -34 -1024 964
2060 964 225 -1072 764 359 -1035 691 475 -1135 544 728 -1098 298 785 -999 192 887 -1026
2077 -1026 -30 1050 -858 -280 1006 -713 -342 1058 -685 -561 1141 -428 -742 1005 -255 -751
2093 -751 1015 -176 -930 988 113 -1000 781 226 -974 779 325 -1113 650 617 -1071 393 670
2110 670 -971 351 773 -1059 150 979 -896 -110 927 -780 -157 1015 -795 -419 1121 -524
$$ packed form
1992C90M32j956J330P27j994J108R86k006Q28J253j960N41J465j879K55J662j769
2009e87m8J810j591l71J924j362o79J956j087r43J950q44j209J950n14j495J823
2026F83j73j642J677J11j821J524M68j919J226P73j904J004R93j962P50J318j899
2043g93L78J505j728J38J621j672j23J831j486n03J878j199p18J885j048r90J988
2060I64p39j297J836m05j394J726k16j610J679J84j826J396M87j784J191O95j913
2077a026R96J080j908N78J286j719L71J400j743J24J702j569l14J747j260m96
2093g51J766j191p54J918q75j113J781n55j200J753m54j438J763l3j688J464K77
2110F70j641J322M22j832J209Q29j875P86J037j707O23J172j810L76J540j645
$$ plain form
2126 -524 -619 973 -389 -623 1031 -335 -872 1033 -4 -950 805 105 -905 830 205 -1086 699
2143 699 505 -1045 451 548 -956 440 661 -1077 258 891 -923 8 861 -821 -20 962 -848
2160 -848 -261 1080 -616 -470 957 -505 -485 1019 -457 -750 1037 -164 -858 826 -45 -837 859
2177 859 72 -1026 771 364 -1018 525 427 -953 519 573 -1059 312 795 -931 102 778 -843
2194 -843 65 907 -863 -155 1018 -669 -333 939 -578 -384 1012 -503 -610 1019 -260 -716 885
2211 885 -174 -756 902 -60 -936 810 195 -953 638 274 -936 591 420 -1027 412 633 -931
2228 -931 238 679 -881 153 821 -894 -56 934 -709 -227 901 -628 -306 980 -537 -506 982
2245 982 -348 -605 899 -270 -670 914 -114 -838 827 75 -870 704 161 -895 661 299 -976
$$ packed form
2126e24r5J592j362k34J654j366n37J905j037r46J755p00j010J735o25j291J785
2143F99j94j550J496R7j504J396K21j738J335O33j814R31Q53j682Q01R82j810
2160h48N87J341j696J46J427j462K0J504j476k93J787j201o94J684q71p92J696
2177H59p87j098J797m07j382J543r8j380J472N4j632J371M83j726J033O76j621
2194h43R08Q42j770P08J173j687L36J272j517J94J396j515j07J629j279m56J601
2211H85j059n82J658r62q76J746o15j148J591l64j210J527j71j447J439K21j564
2228i31J169M41j560J034O68j715Q38R90j643M82J128j529L22J286j517L1J488
2245I82j330k57J504j169m00J584j028p24J665p52r45J574n43j056J556l62j275
$$ plain form
2262 -976 508 476 -934 365 567 -916 279 697 -895 84 807 -796 -68 831 -706 -171 912
2279 912 -626 -368 945 -467 -482 915 -347 -597 903 -211 -713 845 -48 -794 772 69 -857
2296 -857 695 211 -902 593 348 -928 454 470 -908 343 575 -877 223 677 -841 74 776
2313 776 -767 -72 831 -667 -204 864 -576 -346 899 -445 -495 876 -293 -579 852 -194 -709
2330 -709 819 -17 -795 698 134 -814 626 228 -889 548 399 -893 386 491 -838 314 575
2347 575 -861 168 721 -781 -20 740 -664 -84 788 -661 -230 886 -520 -394 830 -384 -446
2364 -446 833 -319 -586 841 -120 -701 699 9 -703 678 89 -829 622 300 -861 422 401 -812
2382 -812 360 471 -860 250 648 -790 39 674 -677 -4 738 -689 -157 851 -536 -326 775
$$ packed form
2262i76J484l2j410J299K02j483J195M18j592R79P23j603P28Q99j537N35J083
2279I12j538K58J313j412j5J397j262k50J500j114n02J558q93p46J566p03r26
2296h57J552m84j113J495k45j276J382J6j378J251K32j452J100M54j518R15P02
2313G76j543O95R03j498M63J068j440K30J245j344n0J371j169k86J431j046n15
2330g09J528q36p78J493n64r48J440l98j117J437j49j292J279J05j329J152K61
2347E75j436J029N53j502P61P60j404N80Q72j449M31J116j406J26J224j214o2
2364d46J279j152k67J427r61n81J400o90p12J381n89r18J451l22j161J283k1j213
2382h12J172J11j331J110L98j438Q29O35j351O73P42j427N32J008j387K10J101
$$ plain form
2399 775 -412 -348 804 -386 -495 842 -190 -628 717 -87 -601 711 -26 -763 670 202 -795 464
2417 464 263 -735 453 335 -850 341 537 -773 133 562 -689 102 630 -724 -57 777 -573 -253
2435 -253 708 -464 -251 761 -456 -435 828 -249 -551 687 -150 -527 708 -119 -686 685 113 -725
2453 -725 511 163 -689 504 223 -807 407 448 -764 217 455 -682 196 523 -749 43 681 -623
2471 -623 -123 649 -521 -142 708 -510 -323 786 -321 -442 682 -233 -455 712 -180 -606 692 16
2489 16 -663 543 95 -642 546 158 -758 456 348 -723 286 368 -685 267 446 -737 144 581
2507 581 -648 -18 574 -569 -51 640 -567 -204 713 -415 -326 665 -335 -355 704 -268 -502 704
2525 704 -84 -568 599 -4 -580 580 85 -685 513 241 -690 377 312 -675 334 398 -723 202 522
$$ packed form
2399G75j187O4J152j190j09J337j032m38J345q04n14J312p37p37J433m68r97J259
2417D64k01r98J188j18j185J191J96j310R06M29j251P91N28j354O67Q34j350L20
2435b53R61j172K13J012j217K1J263j077l02J238q37l77J235q27n67J371n72q38
2453g25J236l48q52J193k81j030J214M1j212R81K38j137Q78L27j272P92O38j304
2471f23N00P72j170L79Q50j218J87J109j107j21J124r15k22J167q92m26J298o76
2489A6o79J206m48p37J188l88r16J214j08j071J009Q2j053R52J79j183Q81M37
2507E81j229O30N92j143N18O91j207L63R17j128Q9R91j000k0J059r72k34J206
2525G04p88m84J167o03n76J160m95p70J198k72r31J067o5r87J009O4j121R25L20
$$ plain form
2544 522 -649 74 523 -606 17 598 -593 -116 648 -474 -219 632 -417 -286 671 -338 -408 676
2562 676 -197 -476 618 -124 -528 613 -21 -624 551 113 -642 461 200 -665 390 312 -696 282
2580 282 414 -655 177 485 -628 92 569 -599 -43 620 -520 -147 641 -458 -228 652 -387 -329
2598 -329 654 -283 -413 645 -192 -498 614 -79 -546 566 12 -595 520 126 -627 437 214 -646
2616 -646 366 305 -658 266 413 -644 149 488 -592 58 536 -579 -43 617 -499 -175 636 -412
2634 -412 -264 648 -354 -358 671 -229 -451 608 -130 -497 588 -73 -575 563 77 -630 466 163 -617
2653 -617 396 226 -653 325 366 -659 181 422 -590 144 474 -610 48 604 -523 -116 591 -436
2671 -436 -162 607 -413 -274 681 -279 -404 622 -154 -426 605 -125 -542 607 48 -612 462 124
$$ packed form
2544E22j171P23M49j129O23N81j191M77P64j122K55Q51j049J31R57j009p0J084
2562F76q73k79J094p42m04J141o34o03J175m38p55J103k61q65J055p8j008R78
2580B82J32j069Q32L08j113P20M77j168N56O63j140L73P88j099K30Q80j039N8
2598c29R83r37j30J058q37l06J112o93m67J112n54o07J115l94p53J064k23q60
2616f46J012o1r63R24J47j057P93L39j080O50M78j115N36O60j116L24Q11j048
2634d12J48R12j002mJ029r00k22J059p38l67J085o61n02J138m86p07J096l03p80
2653f17J013j70q79R78M1j025Q40K41j012P34L30j084O58N56j127M07P07j027
2671d36K74P69j020J39R55r60j25J026p76k72J031p30m17J149n59o60J074l38
$$ plain form
2689 124 -579 426 170 -664 376 328 -656 223 375 -589 188 423 -629 96 541 -552 -66 536 -461
2708 -461 -83 572 -463 -191 673 -335 -341 589 -228 -342 598 -205 -457 623 -22 -532 495 58 -522
2727 -522 494 99 -643 435 283 -639 267 327 -582 242 372 -642 132 519 -565 -25 496 -495 -39
2746 -39 550 -508 -160 641 -362 -298 569 -276 -279 590 -255 -404 619 -84 -482 510 -10 -468 511 38
2766 38 -586 462 218 -588 313 249 -551 292 301 -632 203 458 -576 31 454 -512 2 500 -532 -111
2786 -111 590 -402 -234 546 -323 -255 585 -313 -380 610 -147 -456 519 -64 -440 520 -23 -526 490 137
2806 137 -551 375 199 -531 345 257 -585 253 384 -542 117 401 -507 86 451 -532 -35 553 -443 -165
2826 -165 530 -376 -213 551 -333 -323 581 -210 -395 533 -122 -423 522 -59 -494 491 74 -527 414 149
$$ packed form
2689A24p03J005k56q34J040m8r84Q79J52r64P77K35j052P25M45j093M86O02r97
2708d61L78O55j035K72Q64j008oR30q17j14R40q03k52J080o45n10J027m37n80
2727e22J016l95p42J078j52r22R06O0r09Q24J30j014P74L87j084N40N21r91M56
2746c9N89j058L48Q01j003O4Q67q45lQ69q45j49J023p03l98R92n20m58R79m73
2766C8o24J048k44q06R01o4q00Q43Rr33Q35K55j034O07M23r66N14M98j032M21
2786a11P01r92J68P80q69O8Q40q98o7R90p57l09R75n83l76R60n43n03J016l53
2806A37o88R26j76p30Q76q8q42Q38J31r26O59K84r08N93L65r83M97N88r96K78
2826a65O95r06J63P64q84J0R04p91j85R28o55l01R45n81m35R85m17o01R41k65
$$ plain form
2846 149 -533 383 217 -556 284 327 -534 199 363 -525 137 424 -512 40 489 -453 -70 505 -405 -128
2866 -128 525 -358 -235 547 -270 -318 529 -190 -384 524 -114 -446 493 -2 -492 444 93 -525 396 178
2886 178 -538 323 263 -545 255 333 -536 175 388 -506 77 436 -465 9 466 -422 -82 503 -368 -168 516
2907 516 -304 -231 523 -239 -324 500 -166 -368 480 -91 -431 468 0 -472 410 89 -504 354 168 -524 300
2928 300 267 -518 200 346 -496 147 363 -498 80 454 -447 -40 480 -381 -102 493 -356 -179 524 -262
2948 -262 -276 500 -194 -292 483 -155 -375 489 -43 -441 418 43 -435 385 85 -483 348 203 -504 241 274
2969 274 -476 192 310 -496 136 418 -462 -3 431 -385 -33 457 -391 -114 516 -312 -237 492 -226 -268 471
2990 471 -198 -353 503 -75 -409 412 2 -394 401 29 -473 384 165 -480 262 219 -433 238 249 -489 184
$$ packed form
2846A49o82R16j66p73Q40M3q61P33J64q88O62K87r36N52M49r42L83N75r10K77
2866a28O53q83J23P82q17m8Q47p19j94R08o38l32R39m95m90R36l51o18R21k18
2886A78p16Q61o0q08Q00P8q69P11K13q94N83L59r01M74M57q88L40N85q71K00O84
2907E16q20P3P54p62q5Q24o66k02Q48n71l40Q99m68m72Q82l21n93Q58j86o92Q24
2928C00l3p85P18J46q42O43K16q61N78L74r01M07N20q61K79N95q49J77P03p86
2948b62j4P76o94r8P75o38k20Q64n32l98Q59l75m78Q20l00n68Q31j45p07P45L3
2969B74p50O68J18q06O32K82q80M59M34q16L52M90q48K77O30q28P5P29p18m2P39
2990D71o69j55Q56n78l34Q21m10l96P95l72n02Q57k19o45P42m3o52O71J1p38O73
$$ plain form
3011 184 361 -453 63 374 -386 40 395 -407 -52 490 -329 -176 453 -253 -197 461 -241 -290 495 -121 -375
3032 -375 415 -55 -363 422 -21 -443 402 122 -470 293 155 -429 278 198 -487 225 316 -459 102 331 -401
3053 -401 95 360 -430 1 447 -360 -111 421 -290 -110 441 -291 -205 479 -176 -297 411 -113 -303 437
3073 437 -88 -397 423 36 -430 329 92 -417 322 138 -477 274 259 -462 155 295 -415 144 316 -443
3093 -443 61 412 -374 -55 403 -312 -60 431 -300 -159 466 -226 -238 424 -173 -249 427 -141 -334 429 -25
3114 -25 -378 355 27 -370 342 70 -442 296 181 -444 208 224 -427 186 276 -436 110 364 -412 23 380
3135 380 -358 -12 408 -342 -95 444 -275 -172 443 -219 -206 441 -174 -278 435 -91 -328 385 -27 -360
3155 -360 372 22 -402 334 110 -413 269 156 -430 234 209 -438 166 278 -412 85 330 -397 42 379
$$ packed form
3011A84J77q14N16L11p60M26L55q02L55N42q19J53O29p06N6O58p02m9P85o16k54
3032c75P90m70l08P85m43m22Q45k80n92P63j38n84P07q0o85P12R1p75N61K29p32
3053d01M96K65p90M31M46q07K49N32p11J80N51p32Q6O84o55j21P08n24j90P40
3073D37n25l09Q20l87m66P59k37n09P39j84o15P51j5p21O17J40p10N59J72p59
3093d43N04L51p86L19M58p15K52M91p31J41O25o92j2O62n97p6O76n68j93P63m54
3114b5l53P33l28l97P12k72n12P38j15o25O52J6o51O13R0p12N46K54p76M35L57
3135C80p38L46M20p50K47N39p19J03O15o62J3O47o15j04P13n26k37P13m12l33
3155c60P32l50m24P36k24n23O82j13n86O64k5o47O04J12o90M97K45p27M39L37
$$ plain form
3175 379 -364 -29 421 -325 -98 445 -269 -168 450 -213 -233 441 -156 -298 433 -90 -335 402 -18 -377
3195 -377 360 40 -400 318 105 -423 267 174 -428 214 226 -431 164 289 -413 91 331 -385 30 368 -340
3216 -340 -38 405 -310 -104 431 -252 -166 438 -206 -237 450 -130 -303 423 -59 -339 393 -12 -378 370 74
3237 74 -428 306 137 -411 254 178 -426 214 263 -435 132 305 -385 77 330 -380 19 396 -346 -76 404
3258 404 -291 -110 399 -266 -181 431 -178 -259 401 -105 -273 379 -91 -345 404 12 -404 318 92 -393 289
3279 289 124 -430 244 223 -438 159 270 -401 124 291 -413 66 388 -371 -47 384 -295 -69 377 -291
3299 -291 -130 440 -220 -222 399 -157 -237 387 -135 -308 405 -35 -365 320 39 -348 305 58 -405 291 165
3320 165 -424 192 225 -375 175 242 -414 111 340 -377 3 354 -321 -26 375 -328 -87 438 -256 -186 411
$$ packed form
3175C79p43L35M50p46K27N43p14J01O18o63k0O74n97j42P31n23k45P37m20l59
3195c77P37l20m40P18k13n28O90r3o02O42J2o57N95J25p02N04K40p16M15L38p08
3216c40L02M43p15K06N35o83Q6O04o44l1O87n80j73P26m82k80P32m05l66P48k96
3237G4n02P34j69n48O65p6o04O40M9o98N67J73o90M62K53p10L99L77p42K70M80
3258D04o95J81N09o65Q5O12o09q1O60n06j68O52m70k54P49l92m16P22k26m85O82
3279B89j65n54O74k1o61N97J11o71N25J67p04M79L22p59L24M31o79K26M46o68
3299b91J61N70o60kO21n56q0O24n22j73P13m40l30O85k81l87O53k47m63O96j26
3320A65n89O16L3o00N50O7o56N25K29p17L80L51o75K95M01p03K41N25o94P0N97
$$ plain form
3341 411 -186 -196 403 -175 -277 423 -77 -329 344 -25 -320 333 11 -383 323 118 -408 218 167 -381 200
3362 200 192 -413 151 293 -390 48 306 -344 31 342 -360 -38 406 -284 -138 381 -218 -156 407 -208 -235
3383 -235 429 -114 -290 356 -54 -302 347 -27 -364 332 79 -392 239 107 -369 225 146 -399 193 239 -392
3404 -392 104 263 -352 74 301 -364 13 361 -303 -64 359 -243 -91 383 -247 -168 413 -152 -235 384 -111
3425 -111 -271 373 -65 -323 349 21 -363 292 73 -359 274 107 -399 212 190 -394 151 217 -375 104 261
3446 261 -374 53 313 -330 -27 336 -282 -62 351 -252 -120 373 -203 -174 371 -143 -206 368 -94 -262 357
3467 357 -40 -305 327 25 -329 287 73 -359 253 130 -370 200 177 -366 144 234 -377 84 279 -353 32
3488 32 316 -318 -22 329 -280 -77 348 -236 -126 364 -193 -180 382 -136 -217 364 -88 -249 360 -30 -294
$$ packed form
3341D11n97j0N99n78j02P00n00k52O73l69k95O53l22l94P06k05n26O26n1n48N81
3362B00qo05N64J42o83M38K58o50L75L11p02L22M44o90J46N19n99O2N63o15k7
3383b35O64n43j76O46m10k48O49l74l37O96k53m71O31j32m76N94p9n45N92M6o31
3404c92M96J59o15M26K27o65L77L48o64K39M23o02J52M74o30P9N81n65q3O19m95
3425a11j60O44m38k58O72l28l84O55k19m32O33j67n06O11k2n84N45O6n92M79J57
3446B61o35M27K60o43L03L63o18K20M13o03J32M93n76K9N45n14o3N74m62j68O19
3467C57l97k65O32l02l54O16k14m32O12j23n00N70k3n43N10R0o11M61J95o32L85
3488C2K84o34K96L51o09K03M25n84J10M90n57J3N62n18q1N81m52j61O09l90k64
$$ plain form
3509 -294 313 28 -321 279 70 -334 245 141 -357 187 186 -353 126 222 -349 82 272 -354 17 295 -311
3530 -311 -31 317 -287 -93 352 -246 -161 354 -177 -179 351 -138 -227 364 -69 -268 320 -8 -273 301 26
3551 26 -314 277 87 -346 221 150 -316 195 160 -359 155 240 -340 65 262 -298 23 288 -306 -31 342
3572 342 -262 -105 333 -207 -125 346 -192 -185 383 -121 -258 338 -52 -254 320 -34 -307 319 45 -341 233
3593 233 106 -323 221 123 -360 191 208 -354 93 232 -309 68 247 -327 29 313 -287 -62 305 -230 -88
3614 -88 325 -241 -148 358 -154 -211 316 -89 -216 328 -81 -282 345 9 -325 265 64 -302 254 88 -347
3635 -347 227 174 -358 140 196 -325 108 219 -345 69 294 -308 -21 290 -251 -42 298 -263 -100 343 -194
3656 -194 -166 317 -136 -174 321 -129 -248 339 -47 -287 279 10 -274 270 36 -325 252 124 -335 168 154
$$ packed form
3509b94O07k85l49O00k09m04N79j04m98N44jn39M79R6n71M31J90o26L71K78o06
3530c11K80L48o04J94M45n98Q5N15n31kN30m89q9N91m33j99N88l28k65N74k75
3551B6l40N91j90m33N67p1m66N11l5n19N14Q5n80M05J97n60L21K65n94K75L73
3572C42o04J57M38n40Q2M71n38PN68n04j37N96l90k02N74l54k73O26k74l86N74
3593B33j27m29N44r8m83N51J7n62M47J39n41L77J79n74L56K84o00K25L67n35J42
3614h8M13n66R3N06n12n7N27m05j27N44m09k01O27l36l34N90k01l66N56j66m35
3635c47N74n3n32M98N6n21M33J11n64M14K25o02K87L11n41K09L40n61J63M43n37
3656a94K8M83m53l8M95m50j19N87l86k40N66k69k84N44k34l61N77j28m59N03j4
$$ plain form
3677 154 -319 162 198 -349 113 260 -318 18 268 -288 9 287 -282 -55 346 -229 -126 308 -182 -148 317
3698 317 -161 -204 330 -76 -239 296 -36 -244 286 -11 -299 276 75 -315 195 101 -304 198 138 -335 135
3719 135 210 -318 66 238 -286 53 261 -303 -6 313 -252 -76 304 -213 -117 314 -195 -172 325 -132 -219
3740 -219 308 -81 -229 299 -45 -265 292 22 -289 241 70 -288 229 104 -312 185 153 -311 123 190 -289
3761 -289 81 229 -289 31 258 -272 -32 283 -248 -68 294 -213 -124 316 -171 -167 312 -125 -210 300 -76
3782 -76 -240 299 -19 -268 267 26 -289 242 92 -295 208 123 -302 170 168 -301 125 201 -292 75 215 -283
3804 -283 22 252 -259 -26 278 -231 -68 273 -207 -112 295 -166 -170 291 -114 -202 282 -74 -230 278 -30
3825 -30 -269 249 46 -265 236 60 -276 211 123 -298 152 167 -285 119 191 -286 90 232 -279 8 247
$$ packed form
3677A54m73M81L6n47M62J47n78L36K50n56K97K78n69K27M01n75J03M34m90L4M65
3698C17m78m3N34m06j63N35l32k08N30k97k88N75k01l90N10r4m05N02o0m73M70
3719A35P5n28L84J72n24L39K08n64K97L19n65J76L80n17R6M31n09K3M97m57q7
3740b19N27l89j48N28l44k20N57k70l11N30j71l58N17j25m16M97l2m64M34O7m79
3761b89L70J48n18L20K27n30K40L15n31J80L62n07Q9M40m87MM79m37q5N10l76
3782g6j64N39l18k49N35k41l15N31j50l87N03q5m25M72km69M26P6m93L67J40m98
3804b83L05K30n11K33L04n09J63L41m80R5M07m61mM61m05q8M84l56j56N08l08
3825c0k39N18k03l11N01j76l36M87q8m21M50J5m52M04P2m77L76J42n11K87K39
$$ plain form
3846 247 -235 -28 256 -229 -52 285 -196 -132 280 -145 -155 271 -111 -183 285 -73 -227 250 -9 -231 245
3867 245 20 -270 232 77 -289 178 114 -271 145 142 -283 129 203 -278 56 230 -235 31 240 -259 -1
3888 -1 290 -224 -90 270 -175 -96 265 -161 -129 299 -112 -200 268 -39 -194 254 -42 -233 257 28 -260 187
3910 187 74 -249 176 96 -283 167 163 -284 92 195 -257 56 205 -269 39 253 -240 -31 247 -205 -57
3931 -57 262 -194 -110 299 -139 -163 276 -83 -161 266 -79 -211 275 -4 -246 218 38 -233 212 54 -264
3952 -264 189 124 -276 120 149 -240 106 170 -273 70 225 -254 9 230 -205 -22 243 -214 -66 292 -172
3973 -172 -119 269 -129 -136 273 -108 -180 277 -33 -213 244 -8 -216 239 15 -256 221 92 -253 160 108 -243
3995 -243 142 135 -277 99 190 -262 35 186 -238 22 211 -231 -34 241 -204 -89 244 -166 -100 248 -143
$$ packed form
3846B47m82K07K84m85J77L37m81O4M12m25j0M26l82p2M68l58j54M77k59k22M76
3867B45k25k90N02j55l66M67o4l85M16lm25M12P4m81L34J74m65K66K09m99K58
3888aK91n14J34L60m45P9L61m26L2M28m11q8M68l07j55M48k96j91M90k29k88M47
3910A87j13l23M25q0l79M50mm47L76J03m52L13J49m74L08K14m93K09K78m52J48
3931e7L19m56Q4M09m38k4M39l59p8M27l45j32M86k79k42M64j80k71M45j58l18
3952b64M53o5m00L96K9l89L46O4m43L43J55m79K63K21m35J83K65m57J48L58m64
3973a72N3L88l98pM09l81p2M57l10j80M57k52k08M55k24k71M77j29l45M13n2l51
3995b43L85pm12L76R1m52K97J51m24K60J89m42J97K75m45J15L33m10O6L48l91
$$ plain form
4016 -143 -146 270 -92 -181 236 -52 -188 247 -30 -228 237 37 -246 192 78 -250 186 93 -266 147 151 -256
4038 -256 99 183 -243 73 194 -248 19 232 -210 -39 225 -192 -71 243 -180 -104 243 -133 -135 230 -94
4059 -94 -156 234 -76 -201 237 -16 -221 206 29 -233 205 65 -242 178 107 -261 137 146 -258 94 167 -245
4081 -245 59 200 -225 24 223 -209 -12 247 -189 -63 245 -167 -107 241 -130 -152 229 -93 -162 223 -66
4102 -66 -192 216 -12 -222 209 32 -218 187 65 -237 160 116 -245 130 157 -238 89 168 -237 55 207
4123 207 -226 8 224 -200 -40 221 -185 -69 242 -156 -115 243 -122 -143 244 -97 -173 227 -55 -214 213
4144 213 3 -218 187 6 -225 184 69 -242 139 104 -223 118 128 -226 92 177 -228 41 191 -191 13
4165 13 194 -198 -19 233 -179 -71 223 -148 -101 231 -124 -131 258 -89 -185 217 -41 -184 201 -31 -217 209
$$ packed form
4016a43lM16l62q9M17k88j36M35k77j98M65k00k83M38j14l28M36r3l59M13Mm07
4038b56L55Q4m26L16J21m42K67K13m42J71K64m17J21L14m23P6L47l76kL65l24
4059i4o2L90l10j25M38k53k05M27j77k62M38j40l07M20p1l68L98Rm04L52P3m12
4081b45L04J41m25K49J99m32J97K59m36J26L08m12O0L48l71k2L81l22o9L85k89
4102f6j26M08k28k10M31j77k50M05j22l02L97m4l61L75K7l95L27P9m05K92J52
4123B07m33K34K16m24J60K61m06J16L11l98M1L58l65k1L87l41p6M00k82j59M27
4144B13k10k21M05j81k31M09j15l11L81l5l27L41J0l54L18Q5m05K69J50l82K04
4165A3J81l92J79K52m12J08K94l71M7L32l55pL89l47r6M02k58j43L85k32j86M26
$$ plain form
4187 209 24 -241 161 73 -220 142 90 -234 131 144 -230 65 157 -195 49 162 -205 9 215 -180 -51
4208 -51 211 -137 -51 211 -153 -97 238 -110 -145 205 -63 -149 215 -55 -167 223 -8 -223 172 19 -200 166
4230 166 36 -234 133 91 -239 95 139 -223 80 134 -220 71 185 -198 -13 195 -172 -5 195 -169 -47
4251 -47 233 -123 -104 219 -98 -115 204 -88 -146 214 -31 -195 176 6 -180 167 10 -210 148 63 -226 105
4273 105 96 -215 99 112 -238 78 168 -215 9 172 -171 9 190 -185 -10 216 -157 -73 206 -115 -84 196
4295 196 -104 -120 219 -68 -175 186 -20 -163 171 -11 -196 167 46 -204 124 69 -203 113 80 -209 95
4316 95 136 -206 47 145 -181 32 163 -192 -9 193 -157 -39 197 -147 -67 205 -134 -105 210 -78 -138 186
4338 186 -48 -146 176 -37 -183 169 8 -196 137 32 -189 122 66 -205 102 93 -194 74 123 -173 55 142
$$ packed form
4187B09j85k65M02q8k93L62n2l24L65J3l74K95R2l52K44J13l67K14K06l95J29
4208e1K62l48Q6K62l64N6L35l48l5L50k68q6L64k70j12L90k31k15L95j53k19L66
4230A66j30k70L67m2l30L34M4l62L03N4l54K91J14l83J85K08l67J67K00l64J22
4251d7K80l56J9L23l17j7L19k92n8L60k45j64L71j70j86L47j57k20L58q5k89L31
4273A05rl11L14J3l50L16R0l83K24J63l43J80J81l75J75K26l73Q4K79l21L1K80
4295A96l00j6L39k87j07L61k06j43L34j82j85L63j21k50L28n5k72L16l3k89L04
4316I5M1l42K53R8l26K13J31l55J83K02l50J18K36l44Q0K72l39K9L15k88o0L24
4338A86k34r8L22k13j46L52j61k04L33j05k21L11n6k71L07rk87K68M9k96K28Q7
$$ plain form
4360 142 -190 20 171 -163 -12 181 -138 -36 196 -126 -70 199 -91 -102 203 -76 -132 199 -43 -151 178
4381 178 -19 -166 169 13 -188 139 40 -187 126 64 -200 102 93 -198 66 126 -171 42 141 -172 13 169
4403 169 -152 -23 171 -128 -42 183 -113 -69 186 -91 -106 184 -56 -123 164 -45 -144 175 -12 -171 153 14
4425 14 -182 127 39 -202 117 81 -204 90 103 -187 58 107 -181 46 140 -190 0 170 -141 -15 165 -126
4447 -126 -37 187 -115 -80 178 -82 -98 175 -56 -118 173 -37 -166 151 -1 -156 131 20 -182 132 46 -200
4469 -200 93 76 -178 65 90 -189 57 130 -181 24 144 -154 6 150 -160 -23 184 -136 -69 182 -87
4490 -87 -75 179 -93 -98 191 -52 -140 163 -14 -135 146 -21 -161 147 27 -182 107 60 -173 94 65 -200
4512 -200 76 106 -189 24 129 -157 13 131 -156 6 179 -139 -36 176 -104 -52 173 -108 -78 193 -65
$$ packed form
4360A42l32K10J51l34J51J93l19J02K32l22N6K69k90j1L05k79n6L31k42j08L29
4381A78j97j47L35j56k01L27r9k27L13o2k64L02rk91K64O0k97K13R9l13J85J56
4403A69l21J29J94k99Q6K25k96M4K55k77j5K90k40o7K87k09r9L19j87j59L24j39
4425A4j96L09q8k41L19l6k85K94J3k90K45M9k88K27R4l30J90J70l11J26J80k91
4447a26Q9K24l02L5K58k60j6K73k31o2K91k10j29L17j52j55K87j11k02L14q6k46
4469b00K93j7k54K43K5k79K46P3l11K05J20k98J60J44l10J37K07l20O7K51k69
4490h7J2K54k72nK89k43q8L03j77j21K81j67j40L08j20k09K89m7k33K67k9k65
4512b00K76L0k95K13J05k86J70J18k87J62J73l18J03K12k80N2K25k81L0K71k58
$$ plain form
4533 -65 -113 171 -40 -126 156 -35 -144 165 9 -176 133 48 -164 110 48 -182 98 87 -182 51 110 -159
4555 -159 45 115 -164 24 160 -142 -29 168 -119 -31 165 -115 -56 190 -82 -97 163 -52 -102 169 -43 -131
4577 -131 168 5 -150 140 29 -142 135 36 -181 114 69 -187 77 87 -176 58 97 -171 36 143 -157
4598 -157 -5 143 -124 -14 144 -132 -49 177 -104 -85 157 -74 -99 161 -59 -113 172 -23 -135 134 -3
4619 -3 -140 131 11 -171 121 59 -173 89 81 -165 77 90 -172 49 129 -162 23 129 -147 4 137 -140
4641 -140 -30 167 -108 -50 163 -88 -71 162 -78 -93 162 -33 -115 151 -21 -122 149 1 -151 122 31 -167
4663 -167 104 53 -172 83 76 -175 67 93 -161 43 108 -143 8 136 -145 -3 142 -135 -31 155 -109 -58
4685 -58 159 -85 -74 158 -54 -99 159 -33 -128 145 -5 -126 139 17 -142 122 42 -155 86 52 -161 73
$$ packed form
4533f5m8K84k11q6K82j91j09L09j56j85L09q5k12K74o2k30K80j1k69K33N9k69
4555a59K04P0k79J88J36l02J13J97k87Q8J96k80N9K46k72j5K60k15n0K71k12q8
4577a31K99j63j55K90j11j71K77r9k17K95m5k56K64J0k63K34L9k68K07J07l00
4598a57J52J48k67J10J58k76Q3K26k81J9K42k31k5K60k20n4K85j95j12K69j37
4619cj37K71j20j82K92o2k32K62qk46K42J3k62K21Q0k91J85J06k76J51J33k77
4641a40J10J97k75N8K13k51J7K33k40j5K55j95q2K66j72j01K71j48j52K73r1j98
4663a67K71n1k25K55pk51K42K6k54K04O5k51J51J28k81J42J45k77J04J86k64N1
4685e8K17k44J1K32k12m5K58j92r5K73j50j21K65j22j59K64q0j97K41l4k13K34
$$ plain form
4707 73 69 -158 53 102 -159 27 118 -140 1 135 -130 -16 147 -112 -49 157 -88 -67 156 -76 -83 163 -51
4730 -51 -111 145 -19 -118 143 -6 -135 134 21 -156 104 62 -146 94 57 -152 77 82 -162 37 105 -139 20
4753 20 100 -140 -1 110 -133 -40 132 -100 -54 130 -97 -64 157 -70 -105 155 -24 -102 134 -25 -101 152 6
4776 6 -140 125 34 -137 103 32 -155 92 68 -154 61 95 -140 33 86 -159 18 123 -146 -21 128 -104
4798 -104 -29 119 -119 -44 153 -81 -85 131 -39 -78 137 -47 -110 150 -11 -127 128 30 -116 110 33 -135 105
4821 105 60 -141 75 86 -133 54 84 -152 41 119 -143 -13 138 -114 -9 118 -124 -50 145 -104 -68 136
4843 136 -67 -78 135 -60 -98 150 -25 -113 127 11 -103 121 17 -125 119 49 -147 87 69 -127 65 78
4865 78 -142 59 106 -145 19 109 -105 -11 114 -138 -24 136 -102 -55 137 -79 -69 136 -91 -91 150 -52 -115
$$ packed form
4707G3mk27K11M9k61J86R1k58J41J34k65J14J63k59O3K06k45K1K23k32pK46k14
4730e1o0K56j64r9K61j49j29K69j13j77K60m2k08K40l7k09K29Nk44J99O8k44J59
4753B0Q0k40J39J11k43R3J72k32M6J84k27L3K21k27l5K60j79p8K36j59p6K53j46
4776Fj46K65r1j71K40p1j87K47k4k22K15L4k35J73N3k45J77J05k69J25J49k32
4798a04P5J48k38P5J97k34mK16j70l9K15j84o3K60j61j16K55r8j46K26p7j68K40
4821A05m5k01K16J1k19J87L0k36J93P8k62J30J51k52J05J27k42P4J95k49L6K04
4843A36k03j1K13j95l8K48j75q8K40j16j14K24j04j42K44p0j96K34j8j96J92J3
4865G8k20K01M7k51J64R0k14R4J25k52J14J60k38M7J92k16J0K05k27%K41k02o3
$$ plain form
4888 -115 130 -18 -104 117 4 -133 123 29 -132 98 55 -129 95 75 -128 75 101 -132 31 100 -144 62
4910 62 110 -110 -15 115 -109 0 115 -109 -48 147 -68 -66 136 -50 -109 138 -8 -81 120 -10 -124 139 -18
4933 -18 -150 122 42 -145 89 50 -160 63 88 -138 -7 120 -135 -3 149 -113 16 116 -162 -62 101
4954 101 -108 -31 128 -156 -89 131 -56 -52 113 -74 -89 108 -64 -68 111 -17 -81 126 41 -129 103 19 -131
4977 -131 71 54 -135 62 75 -133 54 101 -134 23 114 -124 9 131 -117 -19 125 -102 -46 129 -89 -59
4999 -59 115 -69 -95 118 -43 -104 127 -20 -110 106 -2 -135 100 17 -119 91 42 -123 78 67 -133 55
5021 55 84 -122 29 89 -138 23 110 -127 -11 124 -103 -20 123 -91 -51 132 -84 -67 134 -59 -91 110 -39
5044 -39 -100 111 -14 -129 102 24 -115 103 22 -122 100 59 -128 70 71 -118 45 87 -120 43 119 -124 11
$$ packed form
4888a15K45j48q6K21j13j37K56r4j61K30m3j84K24k0k03K03K6k33J63O9k44K06
4910F2M8k20R5J30k24J09J15k24O1J95k15KK02j86n9K47j46p3K01j30j14K63j57
4933a8j32K72q0j87K34l9k10K23K5k26J31J27k55J32J52k62J29J00k78J00J63
4954A01k09P7J59k84O7K20j87MJ65j87j5J97j72mJ79j28o4K07q5j70K32q4j50
4977a31K02j7j89J97J3k08J87M7k35J57R1k38J33J22k48R8J44k27N6J75k18L0
4999e9J74j84k6K13j61o1K31j47r0K16j08j33K35q3j36K10m9j65K01j1k00J88
5021E5K9k06J51O0k27J61Q7k37J16J35k27Q3J43k14M0J83k16J7K01j93l2K01j49
5044c9o1K11j25j15K31p8j39K18q1j44K22m1j87J98Jj89J63M2k07J63P6k43J35
$$ plain form
5067 11 124 -107 -10 114 -104 -28 134 -87 -54 128 -59 -70 121 -62 -97 130 -31 -118 118 0 -116 96
5089 96 10 -119 91 29 -144 67 64 -124 55 61 -127 54 107 -115 14 111 -91 6 116 -91 -6 136 -85 -43
5113 -43 131 -70 -62 115 -67 -74 133 -37 -108 115 -7 -106 109 -1 -125 114 30 -136 75 57 -118 69 51
5136 51 -123 68 88 -128 23 111 -109 20 109 -106 3 124 -90 -31 124 -77 -47 116 -69 -64 128 -61 -99
5159 -99 118 -32 -98 94 -25 -103 104 1 -131 90 34 -121 69 51 -123 72 70 -136 37 94 -119 33 88
5182 88 -114 12 108 -103 -22 124 -74 -30 120 -84 -41 133 -55 -76 119 -27 -73 115 -29 -104 111 5 -112
5205 -112 92 21 -120 87 30 -124 78 66 -130 49 77 -115 44 93 -122 27 111 -107 2 111 -103 -16
$$ packed form
5067A1J13k31R7J24k18P6J62k21L3J82j87j1J91j83l5K27j61q7K36j18j16K12
5089I6q6j29K10o2j73K11lj88J79Oj88J81N3k22J29R7k02R7J10k07Q5J42k21M2
5113d3J74k01QJ77j82pK07j70p1K23j22r9K15j10j24K39q4j66K11j8j75J87j8
5136E1j74J91K0k16J51Q8k20J29Q9k15J09J21k14N9J55k01L0J63j85NJ92j89l8
5159i9K17j50o6J92j19p8K07j03j32K21n6j55J90j8j74J95kk06J73N7k13J52N5
5182H8k02J26R6k11Q1J46j98M4J50k04M3J74j88k1J95j46m6J88j44p5K15j06j17
5205a12K04p1j41K07n7j54K02j2j96J79K8j92J59M9k15J49Q4k18J09J09k14Q7
$$ [...]
8191d2
##END NTUPLES=NMR FID
##END=
