##TITLE=1H_LY-15Dix.2.B
 CD3CN, 8 sc, 
 2.06.2021
##JCAMPDX= 6.0         $$ Bruker NMR JCAMP-DX V2.0
##DATA TYPE= NMR FID
##DATA CLASS= NTUPLES
##ORIGIN= UXNMR, Bruker Analytische Messtechnik GmbH
##OWNER= root
$$ XWIN-NMR		Version 3.5
$$ Wed Jun  2 10:17:34 2021 Russian Standard Time (UT+4h)  she@DPX200
##.OBSERVE FREQUENCY= 200.131506
##.OBSERVE NUCLEUS= ^1H
##.DELAY= (6, 6)
##.ACQUISITION MODE= SIMULTANEOUS
##.ACQUISITION SCHEME= undefined
##.AVERAGES= 8
##.DIGITISER RES= 18
##SPECTROMETER/DATA SYSTEM= spect
##.PULSE SEQUENCE= zg30
##.SOLVENT NAME= CDCl3
##.SHIFT REFERENCE= (INTERNAL, CDCl3, 0, 15.7039)
##AUDIT TRAIL= $$ (NUMBER, WHEN, WHO, WHERE, WHAT)
$$ ##TITLE= Audit trail, XWIN-NMR		Version 3.5
$$ ##JCAMPDX= 5.01
$$ ##ORIGIN= Bruker BioSpin GmbH
$$ ##OWNER= she
$$ F:/spectra/data/she/nmr/H-F/1/audita.txt
$$ ##AUDIT TRAIL=  $$ (NUMBER, WHEN, WHO, WHERE, WHAT)
(   1,<2021-06-02 10:15:58.03 +0400>,<she>,<DPX200>,
      <created by zg, POWCHK disabled, PULCHK disabled
       configuration hash MD5:
       00 E9 B6 7A A2 85 ED C7 34 08 36 98 17 FE 4E 26
       data hash MD5: 16K
       E4 52 DC D0 DA A5 61 36 B4 AF 86 25 7A 12 C5 26>)
$$ ##END=
$$ 
$$ hash MD5
$$ FA 5B D9 5C E3 A4 F0 4A 6C A1 8D B1 8B 5E 10 7C
##$RELAX= 
##$RELAX= 
##$RELAX= 
##$RELAX= 
##$RELAX= 
##$RELAX= 
$$ Bruker specific parameters
$$ --------------------------
##$DU= <F:/spectra>
##$EXPNO= 1
##$NAME= <H-F>
##$PROCNO= 1
##$TYPE= <nmr>
##$USER= <she>
##$AMP= (0..31)
100 100 100 100 100 100 100 100 100 100 100 100 100 100 100 100 100 100 
100 100 100 100 100 100 100 100 100 100 100 100 100 100 
##$AQSEQ= 0
##$AQ_mod= 1
##$AUNM= <au_zg>
##$AUTOPOS= <>
##$BF1= 200.13
##$BF2= 200.13
##$BF3= 200.13
##$BF4= 200.13
##$BF5= 200.13
##$BF6= 200.13
##$BF7= 200.13
##$BF8= 200.13
##$BYTORDA= 1
##$CFDGTYP= 0
##$CFRGTYP= 5
##$CHEMSTR= <none>
##$CNST= (0..31)
1 1 145 1 1 1 1 1 1 1 1 1 1 1 1 1 1 1 1 1 1 1 1 1 1 1 1 1 1 1 1 1 
##$CPDPRG= <>
##$CPDPRG1= <>
##$CPDPRG2= <>
##$CPDPRG3= <>
##$CPDPRG4= <mlev>
##$CPDPRG5= <mlev>
##$CPDPRG6= <mlev>
##$CPDPRG7= <mlev>
##$CPDPRG8= <mlev>
##$CPDPRGB= <>
##$CPDPRGT= <>
##$D= (0..31)
0 1.2 0 0 0 0 0 0 0 0.06 0 0.03 0 0 0 0 0.0002 0 0 0 0 0 0 0 0 0 0 0 0 
0 0 0 
##$DATE= 1622614557
##$DBL= (0..7)
120 120 120 120 120 120 120 120 
##$DBP= (0..7)
150 150 150 150 150 150 150 150 
##$DBP07= 0
##$DBPNAM0= <>
##$DBPNAM1= <>
##$DBPNAM2= <>
##$DBPNAM3= <>
##$DBPNAM4= <>
##$DBPNAM5= <>
##$DBPNAM6= <>
##$DBPNAM7= <>
##$DBPOAL= (0..7)
0.5 0.5 0.5 0.5 0.5 0.5 0.5 0.5 
##$DBPOFFS= (0..7)
0 0 0 0 0 0 0 0 
##$DE= 6
##$DECBNUC= <off>
##$DECIM= 32
##$DECNUC= <off>
##$DECSTAT= 4
##$DIGMOD= 1
##$DIGTYP= 9
##$DL= (0..7)
0 120 120 120 120 120 120 120 
##$DP= (0..7)
150 150 150 150 150 150 150 150 
##$DP07= 0
##$DPNAME0= <>
##$DPNAME1= <>
##$DPNAME2= <>
##$DPNAME3= <>
##$DPNAME4= <>
##$DPNAME5= <>
##$DPNAME6= <>
##$DPNAME7= <>
##$DPOAL= (0..7)
0.5 0.5 0.5 0.5 0.5 0.5 0.5 0.5 
##$DPOFFS= (0..7)
0 0 0 0 0 0 0 0 
##$DQDMODE= 0
##$DR= 18
##$DS= 0
##$DSLIST= <SSSSSSSSSSSSSSS>
$$ [...]
##$SUBNAM2= <"">
##$SUBNAM3= <"">
##$SUBNAM4= <"">
##$SUBNAM5= <"">
##$SUBNAM6= <"">
##$SUBNAM7= <"">
##$SUBNAM8= <"">
##$SUBNAM9= <"">
##$SW= 16.9725357007746
##$SWIBOX= (0..15)
0 0 2 0 0 0 0 0 0 0 0 0 0 0 0 0 
##$SW_h= 3396.73913043478
##$TD= 16384
##$TD0= 1
##$TE= 0
##$TE2= 300
##$TE3= 300
##$TEG= 300
##$TL= (0..7)
0 120 120 120 120 120 120 120 
##$TP= (0..7)
150 150 150 150 150 150 150 150 
##$TP07= 0
##$TPNAME0= <>
##$TPNAME1= <>
##$TPNAME2= <>
##$TPNAME3= <>
##$TPNAME4= <>
##$TPNAME5= <>
##$TPNAME6= <>
##$TPNAME7= <>
##$TPOAL= (0..7)
0.5 0.5 0.5 0.5 0.5 0.5 0.5 0.5 
##$TPOFFS= (0..7)
0 0 0 0 0 0 0 0 
##$TUNHIN= 0
##$TUNHOUT= 0
##$TUNXOUT= 0
##$USERA1= <user>
##$USERA2= <user>
##$USERA3= <user>
##$USERA4= <user>
##$USERA5= <user>
##$V9= 5
##$VALIST= <valist>
##$VCLIST= <CCCCCCCCCCCCCCC>
##$VD= 0
##$VDLIST= <DDDDDDDDDDDDDDD>
##$VPLIST= <PPPPPPPPPPPPPPP>
##$VTLIST= <TTTTTTTTTTTTTTT>
##$WBST= 1024
##$WBSW= 4
##$XGAIN= (0..3)
0 0 0 0 
##$XL= 0
##$YL= 0
##$YMAX_a= 87691
##$YMIN_a= -77483
##$ZGOPTNS= <>
##$ZL1= 120
##$ZL2= 120
##$ZL3= 120
##$ZL4= 120
##$ABSF1= 10
##$ABSF2= 0
##$ABSG= 5
##$ABSL= 3
##$ALPHA= 0
##$AQORDER= 0
##$ASSFAC= 0
##$ASSFACI= 0
##$ASSFACX= 0
##$ASSWID= 0
##$AUNMP= <proc_1d>
##$AZFE= 0.1
##$AZFW= 0.1
##$BCFW= 1
##$BC_mod= 2
##$BYTORDP= 1
##$COROFFS= 0
##$CY= 11.3945322036743
##$DATMOD= 1
##$DC= 2
##$DFILT= <>
##$DTYPP= 0
##$F1P= 15.9154993809931
##$F2P= -4.1035820241983
##$FCOR= 0.5
##$FTSIZE= 0
##$FT_mod= 4
##$GAMMA= 1
##$GB= 0.15
##$INTBC= 1
##$INTSCL= 1
##$ISEN= 128
##$LB= 0.24
##$LEV0= 0
##$LPBIN= 0
##$MAXI= 10000
##$MC2= 0
##$MEAN= 0
##$ME_mod= 0
##$MI= 1.114404
##$NCOEF= 0
##$NC_proc= 0
##$NLEV= 6
##$NOISF1= 3.799351
##$NOISF2= 2.8
##$NSP= 1
##$NTH_PI= 0
##$NZP= 0
##$OFFSET= 15.70392
##$PC= 1
##$PHC0= -11560.13
##$PHC1= 9.40099
##$PH_mod= 1
##$PKNL= yes
##$PPARMOD= 0
##$PSCAL= 0
##$PSIGN= 0
##$REVERSE= no
##$SF= 200.130013532006
##$SI= 16384
##$SIGF1= 3
##$SIGF2= 2
##$SINO= 400
##$SIOLD= 16384
##$SREGLST= <1H.CDCl3>
##$SSB= 0
##$STSI= 0
##$STSR= 0
##$SW_p= 3612.71676300578
##$SYMM= 0
##$S_DEV= 0
##$TDeff= 0
##$TDoff= 0
##$TI= <>
##$TILT= no
##$TM1= 0
##$TM2= 0
##$TOPLEV= 0
##$USERP1= <user>
##$USERP2= <user>
##$USERP3= <user>
##$USERP4= <user>
##$USERP5= <user>
##$WDW= 1
##$XDIM= 8192
##$YMAX_p= 0
##$YMIN_p= 0
$$ End of Bruker specific parameters
$$ ---------------------------------
##NTUPLES= NMR FID
##VAR_NAME=  TIME,          FID/REAL,        FID/IMAG
##SYMBOL=    X,             R,               I
##VAR_TYPE=  INDEPENDENT,   DEPENDENT,       DEPENDENT
##VAR_FORM=  AFFN,          ASDF,            ASDF
##VAR_DIM=   8192,          8192,            8192
##UNITS=     SECONDS,       ARBITRARY UNITS, ARBITRARY UNITS
##FACTOR=    0.0002944,     1,               1
##FIRST=     0,             0,               0
##LAST=      2.4114304,     0,               0
##MIN=       0,             -77483,          0
##MAX=       2.4114304,     87691,           0
$$ Real data points
##PAGE= N=1
##DATA TABLE= (X++(R..R)), XYDATA
$$ [...]
1967d12l11J781j392n01J979j247r33K013q37j139J877o35j345J897l06j638J703
$$ -412 -723 1058 -334 -835 1144 -103 -1036 977 140 -999 878 243 -1102 795 489 -1149 554
1984E54J15j773J521L49j850J320O79j947J033R84j929P84J194j885N23J442j838
$$ 554 669 -1104 417 766 -1084 236 915 -1032 1 985 -944 -160 1034 -851 -328 1114 -724
2001g24K35J604j699p0J758j514l76J837j295o46J907j086r27J917p67j191J836
$$ -724 -489 1115 -584 -654 1104 -410 -786 1051 -244 -890 1017 -69 -996 921 154 -1037 799
2018G99m94j390J792k09j634J649K02j766J367M78j803J216P32j924R52J101j880
$$ 799 305 -1085 707 498 -1136 513 715 -1051 316 794 -1009 207 939 -985 -33 1068 -812
2035h12N80J267j758L89J454j762M7J718j521l09J699j305m47J808j245p85J928
$$ -812 -232 1035 -723 -334 1120 -642 -595 1123 -398 -707 992 -313 -760 1048 -197 -982 946
2052I46q64j083J780o39j141J806m79j487J762j7j623J455J74j609J423L94j897
$$ 946 82 -1001 779 140 -1001 805 326 -1161 601 584 -1039 416 590 -1019 404 798 -1099
2069a099J212Q76j834P64R95j710O64J230j860L01J594j584j17J534j384k09J739
$$ -1099 113 989 -845 -81 914 -796 -132 1098 -762 -461 1133 -451 -568 966 -418 -627 1112
2086A112j401o56J933r30r84J683p22r73J799o36j392J795j11j533J453J7j481
$$ 1112 -289 -945 988 58 -926 757 35 -938 861 225 -1167 628 517 -1016 437 454 -1027
2103a027J528J81j831J336P07j769R07P28j640R49R62j921N84J397j623J29J340
$$ -1027 501 682 -1149 187 894 -875 32 760 -880 69 1031 -890 -306 1091 -532 -403 937
2120I37j494J12J579j575l65J840j100p05J587r30o90J776q74j214J831l02j366
$$ 937 -557 -445 1134 -441 -806 1034 -66 -771 816 -114 -804 972 98 -1116 715 413 -953
2137i53J448j72j321J590qj735J410N18j662R96N56j596J075P80j896P42J236
$$ -953 495 323 -998 592 584 -1151 259 777 -885 111 667 -929 146 926 -970 -228 1008
2154A008j627L30J159j518L53J378j657o6J681j260m10J508j128m49J724j078
$$ 1008 -619 -289 870 -648 -295 1083 -574 -640 1041 -219 -629 879 -249 -698 1026 -52
2170e2r32J795n64j103J498m43j139J637k38j574J498K86j568J125L71j544J160
$$ -52 -984 811 247 -856 642 199 -940 697 459 -1115 383 669 -899 226 597 -947 213
2187B13O34j808Q30J062j614M80J026j550M70J297j664M9J567j316k45J447j223
$$ 213 847 -961 -131 931 -683 -203 823 -727 -257 1040 -624 -575 992 -324 -569 878 -345
2204c45k78J637j164p16J723p54q95J520o17r98J654m20j368J524M0j393J240
$$ -345 -623 1014 -150 -866 857 103 -792 728 111 -887 767 347 -1021 503 543 -850 390
2221C90J09j448J290L82j653R58P97j564O60Q72j574N91J148j606J98J362j336
$$ 390 499 -949 341 723 -930 28 825 -739 -79 793 -781 -190 958 -648 -450 912 -424
2238d24n2J331j300j62J566j198n70J625q33p39J497p10q79J636n57j152J500
$$ -424 -476 855 -445 -607 959 -239 -809 816 -17 -756 741 31 -848 788 231 -921 579
2255E79k03j224J344n0j378J342K10j534J112N15j489Q49O48j504P62Q79j560
$$ 579 376 -848 496 446 -932 410 620 -914 198 713 -776 73 721 -783 -21 858 -702
2272g02M55J105j389J61J242j348pJ379j193l75J477r35n79J476p78p39J479o08
$$ -702 -247 858 -531 -370 872 -476 -483 896 -297 -672 805 -130 -709 767 -11 -750 729 121
2290A21r78J488m01j079J367j39j221J240J05j363J150K99j407J001M98j459Q35
$$ 121 -857 631 230 -849 518 379 -842 398 503 -860 290 589 -818 183 681 -778 57
2307E7O74j437O44Q75j479M40J046j347J70J176j255OJ273j186k47J416r76n17
$$ 57 731 -706 -62 813 -666 -226 820 -527 -357 819 -436 -430 843 -343 -590 826 -150 -667
2325f67J408p82o80J433o10r30J436l16j110J262q7j166J211P8j349J125L84j403
$$ -667 741 -41 -721 712 102 -828 608 292 -818 444 357 -809 402 480 -869 256 640 -763
2343g63Q61N36j343P54O85j443N64R60j347K69J014j221J74J112j245q2J341j031
$$ -763 98 634 -709 45 730 -713 -149 811 -536 -267 747 -474 -300 812 -433 -515 826 -205
2361b05l69J274q55m32J336q00p09J426m78r36J251k99r37J267j80j231J225K18
$$ -205 -574 700 -155 -587 749 -51 -760 666 188 -748 503 204 -733 534 354 -877 348 566
2379E66j317R20L54j227Q81M80j426P08Q50j347L72Q75j218L28J006j320Q3J254
$$ 566 -751 169 523 -704 177 657 -769 -61 789 -558 -186 689 -529 -201 805 -515 -432 822
2397H22j087k21J163r40k23J275r57n45J419o16p77J220m57p40J284m00j065J276
$$ 822 -265 -486 677 -263 -486 789 -168 -713 706 90 -687 533 76 -664 620 220 -845 431
2415D31J3j157R83J30j114J032K48j370Q56O61j302N04O93j176M82Q62j353K09
$$ 431 444 -713 270 400 -714 318 566 -804 52 713 -589 -85 608 -568 -86 776 -577 -368
2433c68J179j124j10J087r84j04J220j024m55J392o62o82J178n47o29J278n00
$$ -368 811 -313 -423 664 -320 -424 796 -228 -683 709 47 -635 543 -4 -633 645 145
2450A45r66J300j05j055J010j8j008J081J01j281R49M67j218O34M95j159O82O52
$$ 145 -821 479 374 -681 329 311 -697 384 485 -796 153 620 -598 36 531 -628 54 706
2468G06j339L89J001j157Q7R54j048P1J106j096k64J305p95m90J148o70n20J280
$$ 706 -633 -244 757 -400 -313 641 -407 -336 770 -326 -590 715 -80 -570 578 -92 -612 668
2486F68n99q57J295k13r73J047j10r68J129J4j221R89L62j180P20M10j159P41
$$ 668 69 -788 507 294 -679 368 258 -710 419 433 -788 201 563 -617 103 513 -646 95
2504I5N76j304M86Q53j148K49Q43j101K03J010j138r3J189r00l17J126p96l96
$$ 95 671 -633 -147 706 -442 -193 650 -451 -248 762 -376 -469 720 -180 -497 629 -167 -563
2522e63J242o85p16J265l84q16J103k68q99J170q0j145J029K35j151Q36L10j168
$$ -563 679 -6 -722 543 159 -657 446 178 -721 449 369 -776 253 488 -663 173 483 -685
2540f85Q00N22j272N76P39j183L77P80j146K78R66j147OJ116r80j64J075q93k67
$$ -685 115 637 -635 -59 680 -503 -126 654 -492 -214 752 -395 -389 727 -253 -417 658 -235 -502
2559e02J195p91n26J214n46o72J153m31p85J175k23j008J086J6j047R46J57j111
$$ -502 693 -98 -624 590 44 -628 525 94 -691 484 261 -747 339 355 -692 254 411 -700
2577g00Q69L91j212O62O20j206M95P44j181L35R05j140J07J032j020q1J093r42
$$ -700 169 560 -652 10 630 -576 -81 663 -518 -183 722 -418 -311 721 -299 -380 713 -229
2595b29k46J171q13m41J196o35o17J176m66p53J149l08q71J100j27r86J014P7
$$ -229 -475 696 -117 -558 638 3 -614 562 96 -657 492 184 -687 413 286 -700 314 391
2613C91j085Q86K59j112P66M41j190O16O63j182M07P80j104K52R09j102M0J081
$$ 391 -694 192 451 -661 105 546 -644 -28 635 -547 -140 640 -464 -212 697 -405 -365 716
2631G16r63j94J108q23l29J155p40n37J218n10p22J114l35p89J114k27r83J083
$$ 716 -247 -441 667 -156 -485 670 -70 -607 611 101 -621 493 158 -631 483 256 -727 356
2649C56M6j071Q85J86j043Q33K94j167P18N66j156M55O68j077L87P77j138J71
$$ 356 402 -669 216 402 -641 192 486 -681 37 603 -553 -98 570 -507 -120 657 -481 -310
2667c10J006r87r8R85q45j38J062q49l96J206n85o32J089m29o62J124l43r14J128
$$ -310 696 -291 -389 596 -249 -387 675 -174 -570 636 51 -581 508 79 -583 541 198 -716 412
2686D12k8j033R04J11r92Q96K10j184P87N19j148N11N55j051M96O68j170K97R18
$$ 412 384 -649 255 366 -626 270 480 -704 83 602 -546 -35 520 -531 -35 633 -537 -240 678
2705F78j023K9Q86r04K0R92r58k37J145o65m87J032n56m67J111n32p48J149j79
$$ 678 -345 -316 570 -334 -314 678 -280 -517 628 -37 -524 508 -48 -515 596 64 -684 465 286
2724B86r03R30m7q79R75N1j129Q74M05j118N91M50j039O01N81j215M07Q68j060
$$ 286 -617 313 266 -613 362 413 -716 158 563 -555 36 486 -553 48 629 -586 -179 689 -371
2743c71J19Q16r46J14R54j024j34J118p62l57R94o63l45J112o51o32J150l11p65
$$ -371 -252 564 -382 -268 686 -338 -472 646 -116 -473 521 -142 -487 625 -26 -658 492 181 -584
2762e84R49k30p35J024j26j010R62K18j042P19K70j000P29M33j192N23P30j046
$$ -584 365 135 -600 424 298 -712 250 468 -574 145 415 -585 144 577 -615 -92 638 -408
2780d08K42P29r87K37Q62j064qJ054q39k43R82p38k59J070p04n33J126m22o60
$$ -408 -166 563 -424 -187 675 -389 -397 657 -182 -425 557 -181 -440 630 -74 -607 519 97 -563
2799e63R86l42o73J051k44q98R82N3r33P87J32r31P99K67j078O36N18j025M36
$$ -563 423 81 -592 459 215 -683 299 352 -581 206 338 -593 206 473 -605 31 549 -476 -40
2818d0N54r87L80P21j048J51R02r01m2Q93q25j30J002p82l56J063n68n03J011
$$ -40 514 -473 -93 628 -420 -269 633 -268 -310 583 -242 -372 630 -152 -508 555 -13 -516 495
2837D95m69o01J057l38p87R97j01q52Q89j7q76Q44J73j018P22L28r68N77M19r90
$$ 495 26 -575 482 144 -643 354 253 -599 290 273 -603 241 414 -604 118 446 -522 55 474 -516
2857e16N16N35r92K95P08r16J68P88q88k3Q61p51k17J039o85l41R18n58l93R54
$$ -516 0 535 -457 -162 546 -370 -202 586 -302 -325 536 -215 -432 607 -78 -419 499 -59 -452 502
2877E02m19o35R67k39p44R25j35q38R11J7r30Q15J40q68O38L12r39N15M25q85
$$ 502 83 -552 415 176 -568 357 222 -616 295 312 -618 197 337 -531 107 419 -520 -5 420 -465
2897d65L87O28r93K85P11r12J30P71q21j9Q63p68j41R14o39l78R42n05m33R25
$$ -465 -78 550 -443 -158 553 -359 -229 542 -279 -298 565 -203 -344 570 -69 -447 495 -10 -443 482
2917D82m24o25J002k74p87R76j17p74Q53Rq89P32K55r63N94L92r38N05M99j000
$$ 482 58 -567 435 161 -626 350 233 -541 312 321 -568 164 419 -544 50 442 -496 9 508 -492
2937d92L73O78r33J62P36q47Q1Q16q42r2R39p11k61Q88n80l24R22n26n00R68l26
$$ -492 -119 559 -374 -212 524 -323 -242 574 -268 -360 579 -132 -393 495 -85 -409 513 -13 -513 455 129
2958A29o35Q57j94o61Q56j18q24Q25J33q87O29K55q61O10L41r79M82N83r35K60
$$ 129 -506 351 157 -504 352 234 -590 235 368 -519 110 365 -496 114 455 -524 -42 541 -394 -134
2978a34O14q48K12P14r00L0R04p61j91Q45o30k10Q93o18m28J000m07n69Q56k84
$$ -134 480 -368 -156 558 -342 -312 592 -169 -360 485 -145 -355 538 -80 -508 492 85 -484 372 88
2998H8n70Q92k29p70Q80K6q16O69J17p83O98J79r28N73M62r01L55M83q32L53N84
$$ 88 -482 410 181 -589 291 317 -499 170 287 -496 202 381 -547 26 488 -413 -58 425 -407 -54 530
3019E30r30J59P81p54n3P32o82o9Q46p16l06R70m68m89Q44l76m79R04l28o94R02
$$ 530 -400 -241 540 -214 -267 465 -217 -286 560 -156 -462 508 40 -449 395 19 -460 444 116 -578 324
3040C24n1p64P08Qp27P60Q9r15O62L55q78M27L85q13M46M79r27K68O97q03O2O57
$$ 324 273 -491 217 225 -502 258 347 -568 94 449 -429 -2 383 -430 16 495 -432 -164 533 -270 -208 449
3062D49p28N7P71p63j76Q83n34l37P97m73l47Q95m34o02R16j59o93P47q6o76P85
$$ 449 -279 -222 549 -214 -390 493 -41 -378 419 -54 -401 494 60 -542 374 215 -478 269 183 -493 292
3083B92Nq70P00K80q62N00L06q14N15M25r52L44O42q20J43O11p70J41P18q00o8
$$ 292 297 -573 127 407 -455 45 351 -463 52 477 -475 -131 511 -309 -166 445 -325 -184 534 -266 -334
3104c34Q35o13k26P68n48k45Q45m84m81Q82k92n47P65j93n99Q00q1p83P38J39
$$ -334 501 -112 -338 430 -118 -363 482 -2 -483 399 107 -440 325 132 -467 333 252 -531 207 346
3124C46q05N73K20q06N51L61r04L95N41q35K39N73q04J87O80q03oP98o82j23P67
$$ 346 -459 114 334 -472 79 440 -464 -69 472 -363 -124 449 -355 -168 512 -291 -297 501 -181 -304 463
3145D63o15k05Q41n35l72Q51l71m75P90k93n48Q36k02o83P74k6o77O46R7p90O01
$$ 463 -152 -357 484 -51 -423 428 57 -418 372 79 -469 367 165 -518 256 230 -447 199 296 -494 107
3166A07K78q36M65L98q11L66M48q44L27N61p98J16O86p16kP30o90r3P94n65k93
$$ 107 385 -451 14 412 -399 -33 415 -429 -102 459 -339 -223 463 -253 -255 475 -215 -308 486 -79 -372
3187c72Q40m82m01Q31l88m73Q04k11o12P65q1o93P66n4p45O86J39p65N73K48q51
$$ -372 468 -14 -415 416 28 -445 359 148 -464 301 220 -473 293 239 -506 180 319 -446 127 375 -476
3208d76N18L65p86L50M61p48J97N57p43J11O85p05l2P10o20j80P81n32k93P99
$$ -476 42 407 -379 -29 432 -316 -119 438 -305 -194 491 -214 -246 464 -156 -336 445 -87 -380 419
3228D19m46l69Q05l44m83P77k27o10P80l3p74P08L1o87O16J40p78N54L29q12L95
$$ 419 -27 -396 409 65 -418 359 132 -478 302 269 -505 203 234 -453 163 303 -475 79 408 -404 -9
3249iL98p52L44M86q35K20O32p15j1O87o52l1P01o42j79Q00m80l82P75l61l89
$$ -9 389 -363 -19 467 -368 -148 484 -231 -242 445 -207 -238 463 -179 -358 442 -38 -420 355 -6 -395
3270c95P87l06n75P96r4o52O53j5o46O83J5p58O49K38p79M30L31p55M36L98q51
$$ -395 392 86 -489 307 213 -439 214 199 -447 236 251 -507 142 380 -399 31 362 -393 43 441 -410
3291d10L08N86p20P9N73o58O6O55o92j35Q29n39k96P30m39k77P55m35m48Q19j80
$$ -410 -102 484 -236 -157 416 -242 -176 479 -213 -348 481 -58 -354 376 -63 -340 415 -20 -468 351 171
3312A71n99O62j06n45O97m0p48O61J74p28M73K41p20M86L09q23L49N45p53J72
$$ 171 -428 234 128 -417 280 240 -508 153 327 -401 72 313 -407 79 388 -435 -86 459 -294 -122
3332a22N33o94J46O28p50l7P81n78k08P03n16j77P68n20m06Q45k81m96O83k18
$$ -122 411 -283 -137 491 -259 -296 485 -93 -301 402 -114 -291 477 -43 -449 396 115 -381 302 84
3352H4n04P37j33o76O95R0o94N30J20o66N54K13q03M36M47p52K44M56p06K53N49
$$ 84 -420 317 184 -492 203 293 -401 129 249 -417 137 350 -453 -17 430 -322 -78 378 -328 -75 474
3373D74p88P3P16o27j00O67n74j27P68n72l27Q25l49m38P10k82m43P82k46o34
$$ 474 -314 -241 475 -152 -252 415 -159 -286 482 -90 -417 408 59 -379 331 49 -394 388 142 -492
3393d92P51no72O03L9o60O18J38p88N23L27p45L57L54p24L52M63p93J91O14o92
$$ -492 259 254 -418 185 224 -436 182 320 -468 55 382 -363 -6 348 -376 -24 439 -354 -163 451 -241
3414b41L6O12o29j1P12o45j86P74m52l17P24l83l81Q01l28n49P84j26o21O79n1
$$ -241 -205 407 -222 -233 479 -166 -352 422 -30 -347 377 -6 -387 414 86 -463 321 195 -426 253 202
3435B02o49O76O0p43N83K19p49M66K93p53M12L99p83K67N28p27J49N63o72O4O41
$$ 202 -447 229 289 -454 129 348 -401 65 358 -395 17 416 -367 -100 428 -299 -150 413 -259 -195 446
3456D46o50p6P01n34j95P22m83k76P36l72m22P48k47n04P19j71n77O94k5o71O42
$$ 446 -204 -280 421 -113 -308 414 -69 -345 391 19 -403 345 98 -406 313 142 -435 259 234 -437 205
3477B05Q7p12N47K14p46M68L26p64L50M41p54K49N17p09J20O10o78NO49n93j14
$$ 205 292 -420 127 341 -405 63 389 -375 -25 416 -338 -89 428 -281 -161 449 -229 -224 425 -168 -282
3498b82P03n35k14P09m30l10P34l88l79P20k18n24P08j43o02P02l4o61O23Q9o96
$$ -282 421 -114 -328 381 -49 -359 375 -13 -392 328 110 -414 294 151 -451 251 217 -444 179 268 -428
3519d28N38J83o99M51L49p94L56M58p38J57O06o99J11N95o66m4P11n73j63O89
$$ -428 110 293 -406 45 394 -400 -44 414 -324 -167 439 -260 -149 446 -220 -264 447 -126 -289 400
3539D00n25j84O72m85k98Q04k69n04O94k12m91P33j49p18P94mo84N63J24o46M99
$$ 400 -125 -309 363 -122 -420 384 115 -389 305 93 -398 335 186 -532 262 258 -426 137 261 -385 114
3560A14J59p55N28L16o79K72L58o77L13M59p80J89O26o00j09O79n66j37O64n40
$$ 114 273 -482 46 362 -317 -45 313 -364 -51 408 -372 -183 443 -157 -266 413 -153 -290 374 -166
3580a66k24P60k84m11O94l43m27P22k58o42Q53p4o04N47P3n77N56L8o65N26K91
$$ -166 -390 370 86 -325 369 26 -401 321 63 -579 274 200 -404 143 216 -361 195 233 -432 94 385
3601C85p26L67L07p01L89L01o58K03N80o48QN89p27R4O86n71k04P10m69j85N78
$$ 385 -341 26 333 -368 21 322 -336 -133 447 -201 -193 396 -331 -237 449 -122 -326 384 -85 -270 308
3622C08k96k96P15l67n17Q03k31m70N08K0n33O32o0p17O15J43n48L24J83o00M79
$$ 308 12 -284 431 64 -453 350 119 -351 157 177 -356 276 216 -501 114 257 -291 33 216 -384 95
3643I5K69p21K64M84o44J30M12n44J10N52o17m6O56m87j59N71m15j98O20l54l53
$$ 95 364 -357 -93 391 -253 -123 289 -255 -145 407 -210 -256 400 -87 -246 325 -90 -288 332 -22 -375
3664c75P12k38m42N77j51m24O25j21n84N90J09o18M52J35n98M67K11p26L79M17
$$ -375 337 99 -343 234 83 -341 284 163 -421 169 278 -340 112 247 -351 116 327 -399 -20 397
3684C97o67J88M24o18J99M70o38P2N04m70r0N80m60j23O12m72k72O79l10l08N36
$$ 397 -270 -82 342 -276 -77 393 -245 -173 331 -139 -229 351 -109 -232 380 -92 -364 315 5 -303 233
3705B33k28l37O56k39m95O44o4m91M63L6n59N82J09p40M82K89o15K86K95o22L12
$$ 233 5 -332 324 85 -410 234 170 -321 142 178 -381 201 310 -430 52 341 -274 12 307 -315 -3
3726cM13o89J64M42n29j4N57n18j6N66m75k02P23m43k51N44k48l56O01j95l95
$$ -3 410 -279 -115 327 -202 -216 341 -177 -193 373 -102 -304 419 -24 -275 269 21 -335 266 71 -324
3747c24O05j46m31M82p1m96N50O9o49M98J68n42L66J47n25L41L24o41K02M35n75
$$ -324 281 135 -296 186 115 -381 169 238 -411 87 255 -287 79 226 -299 42 366 -275 -73 362 -213
3768b13R2M69n28J8N28n12p5N70m47j71O22l85k70O13l12l45O49k20m40O04j02
$$ -213 -121 348 -180 -162 366 -146 -221 349 -98 -269 353 -32 -302 311 -1 -346 303 83 -357 247 145
3789A45m91N35l3n16N15Q4n70M34J68o00L71K55n90K88L28n85K12L82n46R2M59
$$ 145 -346 189 156 -360 155 239 -331 103 271 -329 42 297 -293 -5 323 -262 -50 332 -214 -122 337
3810C37n09K7M97m98o6N57m19j85N88l61k46N81k90l45O22k01m41N66p8m83N37
$$ 337 -172 -145 352 -146 -212 345 -74 -259 329 -32 -278 303 13 -332 290 89 -352 214 136 -347 190
3831A90j6n52N05J15n93M17J85n66L47K47o26L25L76o03J62M08n23J05M36n16
$$ 190 174 -378 127 242 -351 66 251 -315 32 279 -347 -22 354 -249 -87 321 -202 -97 339 -177
3851a77nN36m31j29N39l92j45N37l71k60O05k49l81N44j33l93N19j12m77N48J0
$$ -177 -182 354 -77 -206 333 -59 -204 333 -38 -298 307 58 -323 221 88 -305 214 102 -375 173 183
3872A83n05M31R8n17M16J52n99L45L21n99J79L71n19J87L92n93J15N02m89o2N00
$$ 183 -322 109 207 -310 106 258 -341 4 325 -274 -95 276 -243 -56 336 -257 -142 360 -129 -191 309
3893C09m23o9N29m34j93O06k88l11N31k29k80N31k34l94N74o1m78M43J1m28M47
$$ 309 -114 -183 346 -88 -281 325 37 -274 257 28 -252 279 45 -349 225 164 -314 129 140 -288 159
3914A59M9n52M10K05n48K63K54n09K79K92n85J77M46n26L0M40m50J3M93m84j01
$$ 159 208 -344 66 271 -277 -14 240 -269 10 302 -283 -106 340 -186 -156 284 -166 -153 340 -144 -245
3935b45N77l68k28N35k93k35N67k96l33N71j23m26M78o4l89M74m4n25M79J25m90
$$ -245 332 -36 -264 271 -22 -257 310 14 -319 252 129 -297 181 117 -272 202 158 -367 112 237 -253
3956b53L14J52n00L15K46n91K56L94n30R3L51m49R4M17n28N9N00m38j13M25l08
$$ -253 61 213 -287 28 274 -317 -61 333 -197 -104 247 -202 -108 309 -219 -160 340 -98 -211 214 -94
3977i4j25N87m02k89O29k04l97N23j36m37N98j03n25N09J31n64L82J79n41L89
$$ -94 -219 368 -34 -323 306 102 -295 228 92 -345 253 150 -375 134 265 -299 83 262 -279 110
3997A10J66n94L47K75n52K11K86m72J91L59n20O3M06m26m6M66l91m6M94l86k08
$$ 110 276 -318 29 304 -248 -37 249 -223 -32 327 -193 -130 276 -150 -196 270 -121 -167 327 -59 -267
4018b67N51k73k83N19k24l12N41j63m30N31j9m84M50K4m70M31J10n40L61K20n56
$$ -267 284 11 -272 247 23 -289 252 89 -341 190 171 -313 137 161 -309 122 232 -308 53 273 -283
4039b83K73K84n44K43L46n51R8M14n07L7N26m41o0M53l73j48N35l39k01M95k67
$$ -283 -10 274 -270 -27 319 -232 -134 280 -227 -190 336 -105 -165 288 -85 -233 302 -37 -238 257 -10
4060a0k58N20k20l36N18j15m06M84m7m46M66L5n02M07J46n27L41K12n35K77K91
$$ -10 -268 252 32 -304 214 99 -307 177 130 -316 150 185 -317 90 236 -291 50 262 -273 4 295
4081B95n38J96L67n30J10M31n04K4M71m48m9M87m04j33N18l20k34N29k52k83N02
$$ 295 -243 -47 320 -210 -100 331 -173 -149 322 -126 -175 312 -92 -225 293 -27 -261 268 16 -267 235
4102B35j79l60N00q9m23M62Jm39M16N1m87L95J51n25L17K19n08K63K72n21J92
$$ 235 56 -304 196 107 -316 146 147 -292 124 175 -312 83 234 -291 26 245 -263 0 272 -249 -57
4123e7L72n08P5M34m76K8M49m57n8N33m00j77N23l01k19N16k79k98N53j78l70
$$ -57 315 -193 -118 316 -160 -132 317 -140 -198 335 -65 -242 281 -20 -239 277 -2 -300 253 75 -295
4144b95M76p9l82M65n4m61M51O6n03L77J33m59L04J71n03K80K96m81J36L41m78
$$ -295 181 102 -280 185 131 -330 121 187 -316 61 194 -265 39 210 -293 -13 283 -198 -62 279 -199
4165a99J42L45m69M9M91m27j29M93l47j63M83l23k23N25j97l49M76j11l78N02
$$ -199 -57 288 -181 -132 359 -68 -197 296 -51 -214 269 -54 -277 248 51 -298 178 67 -311 191
4185A91p3m45M82L7m83L95P7m45L69J11n21L27K59n22J99K79m47J80L06m99R8
$$ 191 118 -327 155 192 -291 104 181 -264 105 216 -305 22 281 -241 -42 237 -210 -30 276 -223 -125
4206a25M27m25k7M04l66l1M51m03j33N28k84k57M60k12k34M86k10l58N19o5m35
$$ -125 302 -123 -150 254 -112 -143 308 -95 -228 300 16 -241 219 7 -227 259 49 -309 210 145 -290
4227b90M16Lm00M08M8n08L79J89n03K59K17m67K49K67n25J74L78m62L7L79l97
$$ -290 126 129 -271 137 185 -323 56 245 -258 1 218 -249 0 267 -258 -84 294 -168 -131 248 -149
4248a49L5M06m32n3M78l19j81M49k55j73M63k74k71N00j23l62M20p5l35M25m6
$$ -149 -114 292 -140 -193 285 -34 -215 234 -21 -194 269 -5 -276 224 101 -261 159 84 -251 174 128
4269A28m35M13R6m58L04J33m36L10J82n13K43L05m63J16L22m32J11L64m63RM51
$$ 128 -307 106 202 -256 48 181 -255 55 237 -276 -33 272 -191 -75 247 -185 -74 290 -173 -164 287
4290B87l66j06M36l26j19M63l09k07M79j78k92M19j33k81M31j06l72M16K8m10
$$ 287 -79 -185 251 -75 -194 269 -40 -247 232 54 -238 181 48 -233 198 92 -280 136 164 -246
4310b46L18P2l96L27J30m81K79K32m50J80K68m43J60L16m65O5M02l98k8L96l40
$$ -246 72 144 -252 75 205 -276 3 235 -215 -35 233 -210 -50 266 -199 -134 268 -130 -158 238 -102
4331a02p0M39l34j76M82k35k29M30j87k58M45j38l39M24l0l64L51K3l80L41O9
$$ -102 -172 267 -67 -243 239 4 -225 205 18 -240 205 67 -272 152 122 -242 109 132 -248 93 162
4352A62m23L08J58m35K37J99m15J84K69m36J01L53m19M5L57l65j3L87l42r0M24
$$ 162 -261 47 205 -230 7 206 -209 -25 244 -192 -91 262 -157 -112 245 -120 -133 254 -88 -178 246
4373B46k82j63M35k46k17M45j89k70M36j20l24M14o1l62L88J3l96L48O5l99K88
$$ 246 -36 -199 236 -10 -227 218 29 -241 195 75 -249 165 104 -258 130 143 -253 95 160 -239 49
4394D9J52m27K30K06m04J64K46m00J16L12l88L3L49l49j2L61l33o7L96k59j66
$$ 49 201 -226 4 210 -194 -30 216 -184 -68 244 -144 -111 238 -111 -123 238 -95 -162 234 -25 -191
4415a91M04k09k01M12j86k63M27r9l41L87k6l48L58J0l84L35J04m26K61J66l99
$$ -191 213 4 -197 215 29 -234 193 94 -247 140 114 -234 124 134 -250 85 189 -237 24 190 -209
4436b09K17J95m20J83K78m09O5L21l54L1L35l61j5L82l09j07L79k29j43L89k36
$$ -209 8 203 -217 -34 244 -165 -100 221 -133 -102 233 -128 -143 239 -70 -177 202 -27 -170 219 -17
4457a7j94M21j44k91L68p1k70L41m8l39L57N8l98K81J06l62K45J34m13K24K51
$$ -17 -211 210 66 -225 143 72 -198 143 95 -244 113 171 -227 54 160 -202 43 177 -236 -12 239
4478B39m30J25K63l61J03K95l96L2L84l44o9L66k71q3L67k72j47M20j84k56L76
$$ 239 -191 -66 197 -164 -61 234 -162 -130 254 -90 -159 207 -64 -147 220 -52 -199 221 37 -219 157
4499A57j16k40L65j04l04L89ll55K89M8k99K69O9m00K64J82l86J49K10l49J48
$$ 157 41 -199 166 62 -242 147 144 -211 78 126 -173 96 165 -235 29 211 -175 -26 184 -165 -17
4520a7K43m10R6L24l51k0L34k93k6L52l30r5M18k18k02L60j57j84L65j50k80L90
$$ -17 226 -184 -88 236 -115 -135 199 -94 -120 232 -98 -193 225 7 -195 165 8 -176 189 39 -241 149
4542A49l0l24K94K2l15L04L5l73K90J46l61J59J70l27J76J79l62J00L05l41J0
$$ 149 119 -205 89 111 -204 100 135 -238 52 198 -163 -4 166 -161 15 194 -168 -68 237 -104 -94
4563i4K83k80RL08l17p0L84k39j50L43j84j54L61j87k40L90p5l05L24k6k82L26
$$ -94 189 -91 -82 226 -91 -161 223 -16 -166 177 -7 -161 200 13 -227 163 88 -217 107 81 -201 125
4585A25ql54L05R8l61K15J34l30K00J71l85J50K54l42O6K55l16N8K75l16l1L47
$$ 125 117 -237 68 166 -195 20 154 -176 24 195 -190 -40 214 -128 -62 193 -123 -65 210 -106 -137 210
4607B10k59r1L07k05j08L41k10j79L68j28k39L20q0k33L27m9l10L10L6l23K63
$$ 210 -49 -140 167 -38 -146 195 -15 -194 174 46 -193 127 47 -186 141 92 -218 92 128 -195 68
4628F8P2l36K50J24l78J89J99l43J27K16l32R2K68l45L3L12k90m0K98k44q5L50
$$ 68 140 -196 54 178 -200 -11 188 -155 -28 188 -144 -52 216 -129 -96 216 -74 -114 184 -60 -145 205
4650B05k26j50L42j65j80L31j25k10L18p6k69L24k2k90K70L2l00K50Q2l30K12
$$ 205 -21 -171 171 6 -174 157 32 -178 140 64 -205 119 97 -193 77 109 -191 59 141 -189 23
4671B3J37l54J89J84l42J29K19l32P6K72l14J4L01k93k6L17k60p5L21k11j33L32
$$ 23 160 -194 -5 179 -163 -34 185 -147 -71 201 -113 -99 202 -91 -117 200 -60 -135 186 -25 -158 174
4693A74j63j84L22j07k15L03p4k37K99k7k83K65L9k80K23P1l11K04J43l27J44
$$ 174 11 -173 149 42 -173 130 56 -181 118 91 -192 73 112 -168 55 126 -185 19 162 -165 -21
4714b1J92l20J12K11l22P7K76l05j3K89k58l1K99k44q1L33j95j70L33j43j80L19
$$ -21 171 -149 -37 174 -148 -71 205 -100 -113 176 -82 -113 186 -58 -139 194 -1 -171 162 19 -161 158
4736A58j16k32L37o3k77K78K1k75K56L6l23K46J19l33J65J50k89J39J55l10J06
$$ 158 42 -190 147 84 -193 85 106 -169 87 123 -200 46 165 -168 -3 147 -142 -3 152 -158 -52
4757e2K43l07K1K52k48kK71k66n2L23k10j25L00j51j41K98j51j95L46p6k55K75
$$ -52 191 -116 -95 157 -91 -93 178 -88 -140 183 -27 -152 148 -3 -144 154 3 -192 154 78 -177 98
4779I8j5k44K61nl02K85Q0l28J84J23k89J74J30l19J26K27l07N2K20k57L8K34
$$ 98 83 -161 100 95 -207 78 158 -170 14 137 -152 22 152 -167 -41 186 -121 -69 151 -106 -68 166
4801A66k79JK95k23j06K91j69r5K81j83j51L24j14k22K90o0k00K78n3k69K91M1
$$ 166 -113 -112 183 -40 -146 145 -24 -119 162 -21 -172 152 38 -184 106 46 -154 124 71 -198 93 134
4823A34l03K10P5k63K00Q8l22J98J66l27R2K08k79R1K05k96K4K94k55o2K70k08
$$ 134 -169 41 116 -147 53 141 -181 17 183 -144 -52 156 -123 -32 173 -123 -99 195 -60 -122 148 -60
4845f0n4K77k04j20L15j36j80K70q7j77K81q7k31K86J0k75K21N0k54K20N9l03
$$ -60 -114 163 -41 -161 154 18 -162 108 21 -156 125 38 -193 93 103 -172 49 99 -155 65 124 -179
4867a79J92J60l19J25J69k76J01J98l04N9K64k67k8K55k10m3K72k25r7L10j61
$$ -179 13 173 -146 -21 148 -128 -27 171 -133 -74 190 -77 -105 150 -60 -103 169 -56 -153 157 -4
4888dj50K74j18j48K79j02k14K91l0k45K37%k31K33L1k80K07J11k73J37J18k53
$$ -4 -154 120 2 -146 133 31 -183 108 78 -167 70 70 -161 72 103 -177 30 141 -132 5 123 -130
4910a30J30J59k95R2K07k51K0K27k41RK41k38n2K85j85j05K62j50j26K81j41j72
$$ -130 0 159 -136 -44 163 -88 -68 159 -82 -73 168 -70 -122 163 -22 -127 135 -15 -141 140 -1 -173
4932a73K79n3k11K57m1k19K46%k64K33O7k71J71R4k52J48J22k76J18J80k56M9
$$ -173 106 53 -158 99 58 -161 85 85 -179 54 121 -150 21 115 -137 11 133 -143 -25 155 -101 -52
4954e2J90k26L3K20k41j2K35j97n4K36j64q7K62j51j35K67j11j59K47o0j97K43
$$ -52 138 -88 -55 165 -76 -88 147 -50 -104 132 -32 -119 143 -8 -143 124 13 -146 101 41 -156 87
4976H7k9k23K41Nk38K06N2k51J69J00k53J37J37k63J09J57k59P5J83k25K3K09
$$ 87 58 -165 76 81 -157 49 101 -150 19 119 -134 3 140 -123 -14 143 -116 -41 142 -83 -60 149
4998A49k18k6K43j93p0K41j48r7K46j30j43K60q8j82K48m5j82K25l1k13K13L5
$$ 149 -69 -95 148 -45 -115 126 -22 -119 127 -3 -146 114 26 -156 92 47 -135 90 59 -154 59 94
5020I4k38J76O8k32J64Q5k59J48J46k61P3J68k17M8J86k34J5K30k20m9K48j68
$$ 94 -144 32 100 -132 32 117 -142 6 152 -109 -36 132 -85 -37 149 -85 -70 160 -60 -109 139 -29
5042b9o7K30j55j10K59j13j60K29m8j63K14m2j89K15Ok21J82N8k17J59P4k55J60
$$ -29 -96 134 -21 -131 128 15 -145 84 36 -127 87 45 -144 71 77 -144 38 96 -121 38 112 -143 17
5065A7J21k55Q5J69k26N7J73k37M5K10k15l0K25j75n0K25j87p1K52j28j40K28
$$ 17 138 -117 -32 137 -89 -32 141 -96 -51 159 -56 -86 139 -36 -86 139 -48 -119 133 5 -135 93
5087I3p4j40K21p2j67K36j3k15J76K9j95J63M7k38J71J03k35R7J23k13J00J31
$$ 93 19 -121 100 28 -139 97 84 -131 45 74 -121 42 89 -149 22 125 -110 -13 110 -103 -3 128
5109A28k33O6J93k26j7K17j74j3K00j94m0K43j53j18K29j01j22K27j02j60K56
$$ 128 -105 -39 154 -72 -89 128 -46 -59 141 -53 -93 150 -3 -121 108 7 -115 112 10 -150 106
5130A06m7j98J94J2j91J81K0k21J78P5k27J08J11k04J14J02k33R2J75k19J1J75
$$ 106 59 -139 55 67 -124 57 77 -144 34 109 -118 -10 101 -103 11 113 -120 -28 147 -72 -61 114
5152A14j72J3J72j83m3K41j62r3K12j04q1K02j14j26K29o5j64J84j8j56J85rk04
$$ 114 -58 -45 127 -56 -99 142 -20 -113 99 -5 -86 116 2 -124 105 40 -124 60 42 -114 71 62 -142
5175a42J91M1k13J29P8j92J24Q6k19R6J55k10K6J65j79L7J50j81j4K06j50p4J98
$$ -142 49 90 -123 6 84 -108 16 102 -117 -21 134 -76 -50 115 -64 -27 123 -58 -72 134 -16 -90 108
5198A08j10p5J88r7j25K22o5j51J87m1j42J77j1j86J71N1k06J30N7j90J25R1k16
$$ 108 -2 -77 111 14 -111 111 46 -105 82 41 -101 76 65 -121 50 101 -105 25 82 -108 17 108 -108
5221a08J01J24k06N4J40j81M2J66k12K1J91j67m6J97j27o1J87j16j08K18r0j22
$$ -108 -7 117 -89 -35 105 -76 -34 132 -80 -59 132 -35 -81 116 -11 -72 115 -1 -109 109 19 -103
5243a03J92n1j52J88k5j63J66J7j71J41M1j89J34O5j88J01R4j88O7J32j94N2J46
$$ -103 89 38 -114 74 49 -114 52 69 -102 39 80 -109 25 90 -98 3 97 -91 -24 108 -86 -34 112
5266A12j92L2J78j78k3J91j61k8J84j35p2J95j08r1J88p3j19J77m8j41J80j1j65
$$ 112 -80 -48 130 -48 -71 120 -41 -69 115 -20 -92 103 -5 -96 92 19 -100 77 29 -112 68 57 -108
5289a08J51K9j78J37M7j68J17N4j80R2J09j88O1J26j70L9J31j58NJ63j53l3J75
$$ -108 43 72 -106 31 78 -90 27 81 -99 -7 102 -86 -25 101 -69 -30 101 -57 -52 111 -42 -75 100
5312A00j14n3J66j12p6J89r2r9J67m8j27J68k1j58J57J5j81J55L7j63J16M4j73
$$ 100 -14 -67 99 -13 -89 100 8 -91 76 28 -99 69 48 -110 47 62 -119 36 73 -90 26 70 -103
5335a03J19Q8j88N9J19j59N0J20j71K3J57j47l1J60j17m9J66j14n9J80q7j05J54
$$ -103 16 104 -84 -25 94 -65 -15 105 -66 -43 114 -33 -64 96 -21 -70 96 -18 -77 103 16 -89 65
5358F5l5j22J68m4j44J80oj69J35L3j46J12L1j69J18Q0j83P7J01j53N1J09j67
$$ 65 30 -92 76 32 -112 68 62 -107 28 61 -85 27 58 -111 7 87 -96 -19 82 -71 -20 89 -78
5381g8M2J51j65j7J73j29k5J38j28l5J75j01q4J67o7q6J47o3j19J72k2j51J42
$$ -78 -36 115 -50 -67 106 -23 -48 90 -38 -73 102 1 -83 84 17 -69 78 15 -104 68 46 -105 37
5404C7J6j34J19J8j57J31M9j67P7Q9j47O0Q6j65N3J44j68kJ42j30OJ32j37k9J72
$$ 37 53 -81 38 56 -101 30 79 -88 -11 78 -69 -9 77 -88 -35 109 -59 -61 81 -49 -43 89 -48 -77 95
5429I5j17n6J51p0o3J42q3r2J71l7j40J53rj16J25qj48J34L7j49Q0O2j30P0O8
$$ 95 -22 -78 73 3 -60 82 -1 -93 78 41 -99 54 45 -71 54 46 -102 32 69 -80 0 62 -68 2 70
5454G0j53O2J14j58L1J23j23MJ20j48lJ65j32m6J55r4n2J55q8q3J66o0j09J47
$$ 70 -83 -21 93 -65 -34 89 -34 -30 90 -58 -61 104 -28 -74 81 -13 -65 90 2 -81 85 25 -84 63
5478F3l0j01J30k3j30J43J5j60J14M0j43R4N5j42N4R7j44L7J11j33J8J14j32%
$$ 63 33 -68 62 39 -91 52 67 -93 21 61 -82 12 67 -75 -21 76 -68 -31 80 -53 -35 79 -53 -53
5502e3J52j25l1J30q6n0J38r4o9J53n9r5J55l7j14J46l0j14J32K0j54J19K4j38
$$ -53 99 -26 -57 73 -13 -63 75 -19 -88 65 6 -89 66 29 -85 61 31 -83 49 69 -85 34 58 -80
5526h0J08L8j45P5Q0j44N0R4j37M4J03j42J6J39j41j5J43j14m0J47q9o9J52o5
$$ -80 28 66 -79 -4 76 -68 -18 76 -61 -17 86 -56 -40 99 -42 -57 86 -28 -68 79 -10 -79 73 8
5550Hq8J57o6q3J32k4j11J26pj27J17K3j37R9N5j46Q6N4j53Q3Q2j36M2R9j39K5
$$ 8 -80 77 11 -72 60 36 -75 51 44 -83 34 57 -80 19 74 -72 14 68 -85 -2 80 -56 -14 85 -54 -29
5576b9J10j28J0J24j28j2J37j11m2J46q4p2J43n6p3J26m1j09J42j5j13J18Pj35
$$ -29 81 -47 -37 87 -41 -53 84 -27 -69 77 -7 -79 64 8 -65 61 20 -89 53 38 -75 43 50 -85
5600h5J15L4j37J02L9j38P8P5j45M6J06j40L2R0j22J4J18j17j6J32j06l2J32q4
$$ -85 30 64 -73 29 68 -70 8 83 -62 -16 90 -50 -18 72 -50 -36 82 -35 -51 81 -25 -57 75 -9
5624im9J37q2p2J35n2p8J31m0r1J14lj28J14L3j41J01L4j41R9O8j46N4R5j36L3
$$ -9 -58 79 -3 -75 60 8 -70 61 21 -70 44 41 -87 27 60 -81 20 54 -87 12 80 -66 -12 83 -53 -20
5650b0R7j41L5J12j34kJ32r8l9J28j00l7J41p6p0J23m7p4J21m1q9J31j4j24J22
$$ -20 77 -64 -29 83 -51 -53 79 -19 -58 70 -30 -67 74 -2 -72 51 4 -70 51 10 -79 52 38 -86 36
5675C6J3j20R3L5j39J14M0j57P7P4j22M8Q1j43N2J12j37jJ26j12j1J07r8k4J31
$$ 36 49 -71 22 57 -82 32 72 -85 -8 66 -56 -8 73 -70 -18 94 -43 -44 82 -30 -41 66 -32 -56 75
5700G5q1o3J30o2n8J28o0q6J31j3j20J15Mr8J01lj26J09N0j43O7P3j32O9O1j40
$$ 75 -6 -69 61 -1 -59 69 9 -77 54 41 -79 36 40 -58 43 40 -86 23 73 -70 -3 70 -62 7 68 -72
5726g2O2R1j24J0J02j00nJ02j01j7J33r3n4J27o2o1J21o3p9J41l3j13J27jr9R8
$$ -72 -10 81 -43 -33 69 -31 -36 66 -35 -52 81 -12 -66 61 -1 -62 59 -4 -83 58 25 -88 39 38 -61 37
5752C7jj28J11N0j30O2O6j22N5O8j38N6R6j29RJ25j20J1J05j23qJ40j09m2J27
$$ 37 36 -92 19 69 -61 1 67 -55 0 68 -70 -14 82 -47 -38 87 -33 -22 83 -40 -48 92 -17 -59 68
5777F8p1n9J18o5o2J26m1q4J11k0r2J19j9j15J04M0j24Q1L6j08O3N8j35O0Q0j20
$$ 68 -3 -62 56 -9 -71 55 14 -70 41 21 -71 48 29 -86 18 58 -66 15 51 -57 6 64 -71 -11 69 -51
5803e1K6J00j11J0J01j15KJ10r6k6J12o9m5J16o8o3J23n2p0J10j8j02J27k3j04
$$ -51 -25 75 -36 -26 75 -40 -38 72 -24 -50 62 -7 -52 64 -4 -67 56 4 -66 44 26 -76 51 28 -76
5828g6J05K1j23R5M2j31O9O5j28N4Q2j31M5Q2j18J4J03j00jJ14j06k0J13q0m5
$$ -76 29 50 -73 22 64 -67 2 67 -61 -7 75 -56 -11 71 -47 -33 70 -30 -31 83 -23 -43 70 -10 -55
5853e5J11n7p1J32m6q0J13l2q5J14rj13J10Oj04Q9K0j18R1M7j23N9O5j29N2Q7
$$ -55 56 -1 -72 60 14 -66 47 15 -70 44 35 -78 32 38 -66 23 43 -75 16 63 -60 -1 64 -65 -13 74
5879G4j29K7J03j12KJ15j07j1J17j00l4J27r0m2J16m9p8J19k7r7J25lj19J15j
$$ 74 -55 -28 75 -37 -35 80 -27 -38 79 -21 -55 72 -18 -60 56 7 -71 48 21 -76 49 46 -73 42 41
5904D1j11R9K2j21P9N2j24O3O6j24M8Q6j40M6R6j16J2J10j21nJ18q8l5J21r1l5
$$ 41 -70 29 51 -70 9 61 -63 0 66 -58 -10 76 -64 -18 78 -38 -26 84 -37 -42 76 -12 -47 74 -17 -52
5930e2J21o8o6J29n1q6J22j7j05J09jj07J03J9j30R1M5j22O7O2j28N9Q6j34K8
$$ -52 69 1 -65 64 13 -73 49 32 -73 36 35 -72 31 50 -80 11 56 -66 1 63 -65 -6 80 -54 -26
5955b6J01j16J4J00j15jJ29j02l4J23o9n2J22q5o0J38n5q5J23j8j02J14j4j09
$$ -26 75 -41 -27 73 -42 -43 86 -16 -50 73 4 -48 74 -11 -71 67 12 -73 50 32 -70 44 30 -79
5979g9J09J0j13Q7M1j23Q0M0j24O8O8j13J5J02j21K8R2j06J4J14j09m0J32p7m1
$$ -79 30 40 -73 14 55 -68 12 52 -72 -4 64 -49 -34 68 -53 -25 67 -39 -25 89 -20 -60 72 -5 -46
6004d6J23r4n1J36o0r2J27j6q8J04l5r0J30qj19J00K6j12P7K8j26Q8O5j47O1Q0
$$ -46 77 -17 -68 68 8 -84 43 27 -61 43 8 -82 48 40 -79 21 47 -65 12 40 -86 2 67 -80 -19 61
6030F1j15K8R4j18K4J01j14j9J35r8l8J35r6m9J44p3p2J33n7o6J24m2j08J25J1
$$ 61 -54 -26 68 -50 -26 75 -39 -58 77 -21 -59 76 -20 -69 75 2 -70 63 6 -60 64 22 -86 39 50
6055E0j32J12K0j25J00L4j42R6N7j39N9Q8j37M8Q3j28L6J08j28oJ21j18lJ31j12
$$ 50 -82 30 50 -75 25 59 -83 13 70 -69 -10 78 -59 -11 72 -56 -20 88 -40 -46 75 -43 -46 85 -27
6080b7l8J46q0o6J34o3p7J40n0j06J49k4j22J24Qj23J00L3j37J01M7j51P9P6j44
$$ -27 -65 81 1 -65 69 6 -71 69 19 -87 62 38 -84 40 48 -75 25 58 -79 22 69 -82 -3 73 -71
6105g1O0R2j43L3J05j22MJ15j07j1J27j21l5J60j04n5J50p0q0J44n8j00J53k9
$$ -71 -11 81 -62 -29 76 -46 -42 73 -34 -45 82 -39 -74 86 -18 -73 77 7 -73 71 13 -87 66 37
6129C7j14J34j3j28J17K7j36J11K8j50J02N1j34O7Q1j55N2J10j57L8J16j32oJ33
$$ 37 -77 57 44 -84 33 60 -76 35 63 -87 15 66 -68 -1 80 -75 -23 87 -70 -32 84 -48 -54 79
6153G9j16k2J38j08l6J39q6n8J38o1q1J53o9r3J39j7j18J21Oj37J28K0j40J18
$$ 79 -37 -59 79 -29 -65 74 -12 -70 68 7 -74 79 10 -83 56 39 -79 42 48 -89 39 59 -81 37
6177C7K8j36Q0O8j46O8P9j51M5J13j35J0J34j32j2J38j19j8J44j12n0J41p6q1
$$ 37 65 -71 9 77 -69 -1 78 -73 -28 85 -50 -40 94 -38 -50 88 -31 -49 95 -17 -67 74 -2 -83
6201h3J55n7j00J49k9j33J50Kj43J25Oj42J32L3j55J05M8j42R6O6j62O3R7j47
$$ -83 72 15 -85 64 35 -98 52 54 -89 36 42 -100 32 65 -90 15 63 -79 17 83 -79 -16 81 -66
6225f6L8J17j38J7J13j28MJ37j23m1J55r6n1J49q8p8J51n0j02J40l2j20J55j5
$$ -66 -28 89 -49 -32 81 -47 -43 94 -29 -70 85 -11 -62 87 -1 -79 72 22 -80 60 28 -92 63 48
6249D8j47J51J3j48J06M6j47R6N9j62Q4R6j69M4J14j44L0J20j55J4J49j33l0J46
$$ 48 -99 52 65 -83 23 69 -78 18 77 -85 -1 95 -74 -30 84 -60 -30 90 -65 -51 98 -35 -65 81
6273H1j07l4J33q7o7J65p7r9J61m4j05J47m2j17J54qj38J01M8j36J06L8j65R9
$$ 81 -26 -60 73 -14 -81 84 7 -92 69 25 -80 67 25 -92 62 54 -84 17 65 -71 35 73 -92 7
6297GQ6j72O5R2j36L2J00j47L7J34j44qJ33j10k9J45j07n7J77j02r0J58n7r2J43
$$ 7 93 -79 -14 78 -58 -26 74 -73 -36 98 -46 -54 79 -31 -60 85 -22 -79 98 -4 -94 64 7 -85 58
6322E8l9j08J53j5j47J40%j28J29K8j54R8O0j50O5R4j55O0J04j53L3J24j45jJ38
$$ 58 19 -89 64 49 -98 42 42 -86 43 71 -83 15 75 -75 -10 84 -71 -11 93 -60 -27 97 -48 -49 89
6347H9j28pJ41j26l6J62j10o9J59p4p9J54o7r5J54l1j34J42kj19J20Pj56J41L9
$$ 89 -39 -46 95 -31 -67 95 -15 -84 75 1 -78 76 9 -86 68 37 -97 45 43 -76 44 51 -105 36 75
6372G5j59R3O2j47Q5Q0j63O3J16j50RJ35j42J3J30j36l5J56j08n8J53o9q2J63
$$ 75 -84 9 71 -76 9 89 -74 -11 105 -45 -36 99 -43 -30 100 -36 -71 85 -23 -81 72 3 -79 84
6396H4q2r3J65n3j10J35k0j17J42j7j34J37L4j49J04M6j50R5P0j65P5J02j70N2
$$ 84 2 -91 74 21 -89 46 26 -91 51 34 -100 37 71 -78 26 72 -78 17 87 -78 -3 99 -71 -19
6420a9J06j47K7J22j35jJ46j38k1J45j00n5J68r6q3J61o4j00J51k6j27J51k0j37
$$ -19 87 -60 -33 89 -46 -47 99 -39 -60 85 -15 -70 98 2 -81 80 16 -84 67 41 -86 65 45 -92
6444i2J37J6j54J22L5j57J03P1j63P5J08j74O9Q7j41K8J22j45J0J38j33j2J51
$$ -92 45 61 -93 29 64 -93 10 81 -82 -7 101 -73 -4 83 -58 -30 92 -53 -43 95 -38 -50 101
6467A01j33l8J48r3o3J53p2q7J57n8j07J52l0j17J36j1j37J38K6j53J14N2j58
$$ 101 -32 -70 78 -15 -78 75 3 -84 73 15 -92 60 30 -87 49 38 -99 39 65 -88 26 78 -80
6490h0R8N7j45P6Q9j66N4J10j45K5J22j42KJ43j29k7J37r6m9J46r4o7J68o9j04
$$ -80 18 75 -70 6 95 -71 -17 93 -52 -27 95 -47 -45 98 -31 -58 79 -17 -66 80 -14 -81 87 18 -86
6515h6J61m6j06J42k6j41J60Mj59J27L8j51J12M6j60R5Q8j74P1J12j57K9J18j55
$$ -86 75 29 -77 65 39 -102 58 62 -97 30 68 -83 29 75 -85 10 98 -76 -5 107 -50 -21 97 -58
6539e8K4J35j40%J51j37l4J59j17n6J62r0p8J48n7r5J60o1j09J50j1j38J33J4
$$ -58 -34 101 -39 -39 112 -25 -59 100 -17 -73 89 -1 -79 69 12 -83 77 16 -93 57 46 -92 41 55
6563E5j44J34J8j55J19O4j71Q1Q9j58Q2Q3j75P4J11j60J5J26j20j0J43j33k6J52
$$ 55 -89 45 63 -92 27 91 -80 1 90 -68 14 97 -78 -4 107 -53 -38 88 -32 -42 101 -32 -58 94
6587I4j07o2J65r1p7J59q0j01J74m0j21J45j5j33J34Lj46J28L4j53R2P2j49Q4
$$ 94 -13 -75 90 -1 -78 81 1 -100 74 34 -87 58 43 -90 44 47 -99 29 63 -90 2 74 -75 9
6611IQ0j79Q2J15j75L9J17j29PJ33j45j0J62j30l5J30r1m9J52q5q5J69o1j03J40
$$ 9 89 -90 -8 107 -68 -29 88 -41 -34 99 -46 -56 106 -24 -59 71 -20 -69 83 -2 -87 82 21 -82 58
6636E8k9j14J39j3j55J51K8j58J07N0j57J03O4j67R8Q9j63M6J14j53L9J20j51
$$ 58 29 -85 54 41 -114 37 65 -93 14 64 -93 10 74 -93 5 94 -69 -23 91 -62 -23 97 -54
6659e4J7J49j46k5J47j03l8J47j00p5J66p9q9J57o4r4J51m4j22J47%j42J29K2
$$ -54 -37 112 -34 -59 88 -15 -53 94 -6 -81 85 6 -83 74 10 -84 67 23 -99 48 48 -94 35 57
6683E7j46J25L1j64J10P5j67P0Q8j65P5J19j70L3J31j45j1J42j25j7J58j24o1
$$ 57 -89 36 67 -97 13 88 -79 -9 79 -86 -11 108 -62 -29 102 -43 -54 88 -37 -54 104 -20 -81
6706h1J82j04p6J65p7r3J62n4j24J72l3j28J32%j35J37Qj53J24N6j64Q9O6j55
$$ -81 101 -3 -79 86 9 -84 78 24 -100 72 39 -89 43 43 -92 45 53 -100 24 80 -84 5 71 -84
6730h4P2J04j60M5J12j59M0J33j49NJ47j45k2J64j18o3J60q5p6J53o3r6J56n3
$$ -84 -12 92 -68 -23 89 -70 -30 103 -46 -41 106 -39 -61 103 -15 -78 82 -3 -79 74 11 -85 71 18
6754A8j14J57j8j39J48Qj57J36L2j61J08O8j79R0R2j57N5J00j58M6J27j57J9J38
$$ 18 -96 61 43 -96 52 60 -97 39 71 -90 18 86 -93 -3 89 -68 -13 87 -71 -25 102 -55 -36 102
6778A02j44kJ48j32m0J74j02p8J67q4r4J65n7j22J68l2j35J54oj45J39K3j55J27
$$ 102 -42 -44 104 -28 -68 106 4 -74 93 9 -85 80 23 -99 69 37 -98 56 50 -95 44 67 -88 39
6802C9L1j61J06O5j64Q9Q3j66O3J17j72M7J25j52K1J27j32k3J57j32l6J65j01
$$ 39 70 -91 15 80 -84 5 88 -78 -15 102 -70 -23 102 -50 -29 98 -34 -57 100 -32 -68 97 -4
6825do9J62r0p9J65n9j21J63l9j19J45j2j44J37L2j60J24L9j61J01O4j74R7R9
$$ -4 -73 89 -1 -80 85 26 -95 68 29 -90 55 43 -101 36 68 -92 32 71 -90 11 75 -99 -2 97
6849I7j70O2J03j59L2J36j59J7J45j42k8J60j23k7J53j16o3J86r1j06J65n4r8
$$ 97 -73 -11 92 -67 -35 101 -58 -41 104 -38 -66 94 -29 -56 97 -19 -82 104 13 -93 72 18 -80
6872h0J49m5j30J73j7j49J20L7j33J01M9j86J19P4j62P8J00j70M6J15j63L5J55
$$ -80 69 24 -106 67 50 -99 21 58 -75 26 75 -111 8 82 -80 -2 98 -72 -26 89 -74 -39 116
6895A16j39l7J43j05j0J44j33k5J30p9o9J77j13q0J53j9j26J51l6j09J34j6j44
$$ 116 -23 -60 83 -22 -32 112 -21 -46 84 5 -64 113 0 -80 73 54 -72 79 43 -66 68 52 -92
6918i2J46Pj76J27J05k12J12J08j89O0P6j24M1R3j60O8J23j32j7J13j23k7J73
$$ -92 54 61 -115 12 117 -95 17 125 -64 -4 72 -52 -11 82 -78 -10 113 -19 -36 77 -46 -73 100
6941A00j13n4J63q6j02J57m3j10J54l4j14J31Lj32J25j9j51J69L7j80J24N9j81
$$ 100 -13 -67 96 10 -92 65 22 -88 66 32 -82 49 52 -80 45 26 -125 44 81 -99 25 84 -97
6964i7J32O4j80Q8R1j36KJ26j45J8J48j92L8J07n8r1J86j03r5J60q4r5K13o6j36
$$ -97 35 99 -81 7 98 -38 -36 90 -55 -37 111 -81 -43 64 6 -85 101 -2 -97 63 -21 -116 97 31 -105
6989a05J95n2j37J58Rj82J54qj16J00M9j47Q3P3j83J06R3j68Q3Q4j43OJ56j49
$$ -105 90 38 -99 59 68 -114 40 32 -84 16 65 -82 1 74 -109 -3 90 -78 5 89 -54 -48 108 -41
7013d1pJ63j43m2J63j17m1J69j20n7J69p8r3J39m1j09J44Mj49J37kj41J19L0j58
$$ -41 -48 115 -28 -70 93 -24 -65 104 -16 -73 96 18 -75 64 23 -86 58 62 -87 50 48 -93 26 56 -102
7038a02J32N2j75R5Q7j78P9R0j54N5J09j56L2J37j49jJ45j22l8J62j21n3J68r4
$$ -102 30 82 -93 2 89 -89 -10 80 -74 -19 90 -66 -34 103 -46 -47 98 -24 -62 100 -21 -74 94 0
7062@q7J74o5j05J58m5j17J56l8j33J64nj50J37J4j48J15N9j73J10N6j67Q4R8
$$ 0 -87 87 22 -83 75 30 -87 69 31 -102 62 57 -93 44 58 -90 25 84 -89 21 77 -90 -6 92
7086I2j58M3J24j65K5J42j53j5J65j23l5J58j09o1J66q3q4J52n9j04J44l4j15
$$ 92 -66 -23 101 -64 -39 103 -50 -65 100 -23 -58 100 -9 -70 96 13 -71 81 22 -82 62 28 -87
7109h7J53k3j38J38J4j44J16K7j62J23N8j57P5R0j59O7Q6j51M8J22j43MJ38j30
$$ -87 66 43 -95 43 57 -87 29 56 -106 17 75 -82 -7 83 -76 -9 77 -74 -26 96 -47 -43 95 -35
7133c5j5J44j31l0J61r7q1J69p8q2J51o2q9J56l3j30J35pj31J39J0j64J31N0j60
$$ -35 -50 94 -37 -67 94 -3 -84 85 7 -75 76 14 -75 81 48 -82 53 46 -85 54 64 -100 31 81 -79
7158g9R1O9j52O4Q3j58O8J17j67K4J38j46RJ38j39j4J58j26m4J49q8n2J37p7r1
$$ -79 12 81 -71 -7 76 -82 -14 103 -64 -40 98 -48 -39 99 -40 -54 104 -22 -66 83 -5 -57 80 3 -88
7183h8J65l5j31J40k4j05J37k0j29J41K4j62J08M5j39R4N6j56Q3R9j76M9J06j37
$$ -88 77 42 -89 51 27 -78 59 39 -90 51 75 -87 21 66 -73 21 77 -79 4 103 -73 -24 82 -55
7207e5L2J14j47OJ53j28l5J44j06l6J41r5o3J61q1q7J57n2r4J43m2j16J42%j44
$$ -55 -23 91 -56 -50 103 -25 -60 84 -22 -58 83 -12 -75 86 5 -82 75 23 -71 72 30 -86 56 56 -88
7232h8J20K0j29J13K7j51J02P1j67N3J06j51N6J00j51L0J38j45mJ25j14oJ40j26
$$ -88 32 52 -77 36 63 -88 14 85 -82 -29 77 -74 -18 82 -69 -39 99 -46 -50 75 -39 -45 95 -31
7256c1l6J64j02o7J50p5p2J45n6j03J49k5j26J38qj17J11Rj37J26M2j59R5O7j49
$$ -31 -67 97 -5 -72 78 3 -69 76 20 -83 66 41 -85 53 45 -72 39 48 -89 37 79 -80 15 82 -67
7281f7P6Q0j67O2J04j42J6J26j30KJ31j32k0J54j04n2J35p2p2J52p0j03J63m0
$$ -67 9 89 -78 -16 88 -54 -38 88 -42 -40 91 -41 -61 93 -11 -63 72 0 -72 80 10 -93 70 30
7305C0j20J45j6j19J33Kj36J26J9j32R2M9j49R2P1j60O4R3j52M2J10j42K4J08
$$ 30 -90 55 39 -80 53 55 -81 45 64 -68 24 73 -76 16 87 -73 -9 84 -68 -26 84 -58 -34 74
7329G4j23lJ41j36k1J59j05n4J49q3p5J39m2r8J46m0j21J44j5j15J19J1j36J22
$$ 74 -49 -52 89 -47 -68 91 -14 -68 81 -2 -77 62 20 -78 68 28 -93 51 36 -79 40 51 -85 37
7353C7L3j52J04N7j64J00N7j46O1J01j58N2R8j37K4J30j45JJ38j28j6J31r0m7
$$ 37 70 -82 22 79 -85 15 72 -74 -13 88 -70 -18 80 -57 -33 97 -48 -47 91 -37 -53 78 -12 -59
7377e9J35p6o9J47p5q2J43l8j03J36j5j31J36Oj43J17M7j50J02M5j52R4O9j50
$$ -59 76 0 -69 78 3 -79 64 26 -77 59 44 -87 49 55 -88 29 76 -74 28 73 -79 15 84 -66
7401f6O0Q8j44M5J04j42K3J12j24j0J39j17l0J37r9l2J28q4o4J41n8p9J43m5j10
$$ -66 -6 82 -62 -17 87 -55 -32 80 -44 -54 85 -32 -62 75 -24 -56 72 -12 -76 65 7 -72 71 26 -84
7426h4J44j7j27J27Lj18J04K6j34R3O0j56P8Q2j40O0Q5j45M4J07j44J6J30j27
$$ -84 60 43 -84 43 46 -72 32 58 -76 17 77 -79 -1 81 -59 1 86 -59 -15 92 -52 -36 94 -33
7450c3j1J37j24k2J49j06n6J42p0o5J38o3j00J61m0j17J28j5j02J15Qj33J26J9
$$ -33 -44 93 -31 -53 96 -10 -66 76 6 -59 79 16 -84 77 37 -80 48 33 -69 46 54 -79 47 66
7474F6j43R2O0j34P4N4j46O9Q7j32K9J06j26K3J02j30J2J16j08k7J32q7n3J44
$$ 66 -77 15 75 -59 15 69 -77 -8 79 -53 -24 82 -44 -21 81 -49 -37 79 -29 -56 76 -11 -64 80
7498H0q1o5J43n7r5J29l7q4J21j7j22J40kj35J08L4j31J02J8j18Q9O1j44O2Q4
$$ 80 -1 -66 77 20 -75 54 17 -67 54 37 -85 55 53 -82 26 60 -71 31 49 -69 20 81 -63 -1 83
7523H3j34M5Q9j40L0J12j21pJ34j05l3J33j02m6J42o0r4J35l7q2J23m8r9J26J3
$$ 83 -51 -6 83 -57 -27 85 -36 -43 91 -14 -47 86 -16 -62 80 20 -74 61 24 -58 65 17 -82 44 57
7548E7j38J19J1j20J12J3j36R4N9j37O1P7j35Q0O4j37K2J17j24NJ03j00nJ23j20
$$ 57 -81 38 49 -71 41 54 -82 12 71 -66 -5 72 -63 17 81 -56 -34 83 -41 -36 67 -33 -38 85 -35
7573c5j8J32q2o3J34p5o4J48n9r0J34j7j04J05Jj09J03J4j37J23L5j37Q1O5j47
$$ -35 -53 79 -3 -66 68 -7 -71 77 18 -72 62 45 -59 46 47 -62 41 55 -82 41 76 -61 20 85 -62
7598f2P6P9j56L3J01j14OJ24j20J6Q8j03l0J52j19k4J30r7l4J34p4r6J48m5r7
$$ -62 14 93 -63 -30 71 -43 -37 87 -33 -17 71 -32 -62 90 -29 -53 77 -20 -54 80 6 -90 58 13 -84
7623h4J23k3r7J32Oj66J35K2j22R3M3j40R4P5j82Q0Q1j25L7J01j21j1J23j23K
$$ -84 39 16 -81 51 57 -109 26 48 -74 19 62 -78 16 91 -91 -11 70 -55 -18 83 -38 -49 74 -49 -47
7648d7J20j00l7J29r1m7J34p2m5J23q0o2J31m1n9J13n8q8J22J7j53J27L3j31J02
$$ -47 73 -27 -64 65 -26 -73 61 -11 -56 67 -13 -75 56 15 -44 69 11 -77 45 62 -91 36 69 -62 40
7673D0J3j68J52K9j31J6J10j09L7R1j56L7Q1q6l2J13n3j5J08r6m9J37q2m8J16
$$ 40 53 -115 37 66 -65 -49 61 -48 -11 80 -76 -39 42 -44 -76 37 -16 -31 77 -19 -68 69 -13 -61 55
7698E5n2q4J42kj32P5J8j07J59j4j33J58Pj54L0J04j49J03P3j48N2M2o3j4N7j07
$$ 55 3 -81 61 59 -73 2 20 -87 72 58 -75 83 90 -64 -34 70 -79 24 97 -51 1 43 -20 -34 23 -84
7724h4O4J14j11p2R3l9n2J64p0o8J17m2q7Q4mr8J12l8n8J42oj61J14O7j87J32
$$ -84 -20 94 -17 -89 4 -35 -87 77 7 -61 56 14 -73 11 7 -91 21 -17 -75 67 61 -100 14 81 -106 26
7750B6J3j33J29P3j70R0P8j79J22J2j34L5J09j39o4J83q4l4J22r8OR6n9n2R9k1
$$ 26 39 -94 35 108 -62 28 106 -73 49 61 -73 -38 71 -68 -132 51 -33 -67 55 -43 -37 59 0 -52 47 26
7776B6m2M0Nj36J76Kj57N6O2j12J02m3p5Q6J08j30J3J10j30Q1N3j72R1Q5j45j2
$$ 26 -16 24 29 -107 69 71 -86 -30 32 -80 22 -21 -96 -10 98 -32 -19 91 -39 42 95 -77 14 99 -46 -58
7802e8J15m6m4J39j52K5J08p2n8L3k9k0Q9l7r4J45k1j12K16n5j39R2K1j37J15
$$ -58 57 11 -33 106 -46 -21 87 15 -43 -10 -39 -59 30 -7 -101 44 23 -89 127 72 -67 25 46 -91 24
7827B4P3j10K4J01j71N2Q2j31j1J41j44J4J51j67P3R3j34K7R8j10m1J50r9j8N6
$$ 24 97 -13 11 112 -59 -7 75 -56 -67 74 -70 -56 95 -72 1 94 -40 -13 85 -25 -66 84 -15 -33 23
7852B3o2k4J12l6r0J23m6o7J17l0j27J20M7j45J00K9r7Q7Mj28Q5Q5j33M3O2r3
$$ 23 -39 -63 49 13 -77 46 0 -67 50 20 -107 13 60 -85 15 44 -53 34 38 -90 -5 80 -53 -10 52 -41
7878d1K5R0j13KJ18j19nJ15j04rJ16q7m8J27o9o2J04l0q4J38n0r1J21j6j02R4
$$ -41 -16 74 -39 -37 81 -38 -43 72 -32 -41 75 -12 -60 67 -2 -64 40 10 -74 64 14 -77 44 28 -74 20
7904B0J9j18J04J4j17Q8N5j27O2O2j12L9Q6j26K6J03j15jJ16j01j5J05q8m1J33
$$ 20 39 -79 25 39 -78 10 65 -62 0 62 -50 -11 75 -51 -25 78 -37 -38 78 -23 -38 67 -21 -62 71
7929G1o8o8J29o2p6J19l5r0J17qj10J13Mj08R2K9j22Q1M9j27Q0M8j24O1O9j18
$$ 71 3 -65 64 2 -74 45 10 -80 37 29 -81 32 36 -72 20 49 -73 8 57 -70 10 58 -66 -5 64 -54
7955e4L8Q5j20K5R8j04j7J15q6k7J09p8m3J25o6o7J26n2o7J16l7r5J16j2j02J02
$$ -54 -16 69 -51 -26 72 -32 -49 66 -20 -47 62 -16 -59 66 0 -67 59 7 -60 56 19 -76 40 28 -74 28
7981B8Rj03P8L3j07P0M4j20O4O0j09M1P6j18L2R0j14RJ11j07j0J18j09j5J18q5
$$ 28 37 -66 12 45 -62 8 52 -68 -4 56 -53 -12 64 -54 -22 68 -46 -37 74 -33 -43 75 -34 -49 69 -16
8007a6n1J24n5o6J16n6n9J09k9q8J11j0j02J06mj00R7K5j23O6N8j19O5N3j02M3
$$ -16 -67 57 2 -64 52 -4 -63 46 17 -71 40 30 -72 34 30 -70 27 52 -71 -5 53 -66 -1 52 -50 -7
8033gP7j09NQ8q9KJ02j04j3J18r2l4J18o8n3J15o5n4J25m4p9J03j3r5J05j1j02
$$ -7 70 -39 -34 54 -35 -33 69 -35 -48 70 -22 -56 62 -6 -59 56 -9 -63 62 18 -61 42 29 -66 39 28 -74
8060g4J04J1j21Q0M6j12Q0M9j14N6O6j16K4Q4r3%R5j06OJ09q9k6J00o8k8R7p2
$$ -74 30 41 -80 0 46 -66 14 63 -51 5 71 -45 -21 63 -30 -30 65 -41 -35 74 -15 -41 59 -9 -37 60 -12
8087a2m4J26n6p2J26m6r3J09Jq6Q4Pj32J19J0q7M5L5r8R3Nj23O1J33j09M9M1j03
$$ -12 -56 70 14 -58 68 22 -71 38 39 -47 37 44 -88 31 41 -46 -1 34 -64 29 34 -89 -28 105 -4 45 86 -17
8115a7j5R4p4j4Q5o9k8J01o8m3J10o2n9J13l9p3J04l2o9J04j9r3Q9Nr3R3%j06
$$ -17 -32 62 -12 -26 59 -10 -38 63 -5 -48 62 0 -59 54 15 -58 46 14 -55 49 30 -63 26 31 -62 31 31 -75
8143g5R1K8j06N1O0j00L8O9j12L4R6j09nR8q3MR0r8j9J09o5m5J09m9p0J23n1p5
$$ -75 16 44 -62 -11 49 -51 -13 56 -56 -22 74 -35 -40 58 -25 -21 69 -29 -48 61 -4 -49 60 11 -59 64 13 -62
8171f2J17k7r1R9j1q1R4jj09R2L1j16P3M6j09N7N4j17N5O5
$$ -62 55 28 -63 36 25 -56 38 37 -72 20 51 -65 8 54 -55 2 56 -61 -6 59
8191E9
$$ Imaginary data points
##PAGE= N=2
##DATA TABLE= (X++(I..I)), XYDATA
0@%%%%%%%%%%%%%%%%%qJ6j6J6j6J6k4L2l2L5m3M9n7O6p4Q3r3J07j22J37j52J70
$$ 0 0 0 0 0 0 0 0 0 0 0 0 0 0 0 0 0 0 -8 8 -8 8 -8 8 -16 16 -16 19 -24 25 -32 34 -40 43 -50 57 -65 72 -80 90
39I0j88K08k31K56k83L12l46L82m21M65n12N61o18O83p53Q33r23J025j145J285
$$ 90 -98 110 -121 135 -148 164 -182 200 -221 244 -268 293 -325 358 -395 438 -485 540 -605 680
59F80j448J645j891K204k616L181m007N330p754J3482m8106j9783J46774j09713
$$ 680 -768 877 -1014 1190 -1426 1755 -2252 3078 -4676 8806 -39300 -59083 87691 -22022
73b2022l8293J33871q5146n5458J40317p1668p6244J32739m0246q7411J18552
$$ -22022 -60315 73556 -11590 -67048 73269 1601 -74643 58096 17850 -69561 48991
84D8991l0677q9409J19124j5493j10004J11481R942j14516R4885K4126j20449
$$ 48991 18314 -71095 48029 32536 -77468 34013 43955 -70561 24324 48450 -71999
95g1999Q9394M5690j32672O5981P3412j24646M0651Q2099j16896K5690R6804j12100
$$ -71999 17395 63085 -69587 -3606 69806 -54840 -14189 67910 -48986 -23296 73508 -38592
107c8592J38J07367r2350j8119J03800q2210k6643J11257p4082m7855J14211n3916
$$ -38592 -38454 68913 -23437 -41556 62244 -19966 -46609 64648 -9434 -57289 56922 3006
119C006o0957J08410m2012p1373J10870k5760r0574J02785n89r6915Q7773J3906
$$ 3006 -57951 50459 8447 -62926 47944 22184 -68390 34395 33806 -63109 24664 38570
131C8570j00914P9060L2346j07264O0360N0756j00598M2655N7207r6385L2837
$$ 38570 -62344 16716 49062 -58202 2158 52914 -47684 -5029 52178 -44207 -11370
142a1370O8881r4845J4888P8911q4416O73Q2296p8706j0960R1820p0864l0641
$$ -11370 57511 -37334 -22446 56465 -27951 -27278 55018 -23688 -34648 57172 -13692 -44333
154d4333R5888n4463m3987R3413m3130n5254R4553k8209o9702Q7937r795p5526
$$ -44333 51555 -2908 -46895 46518 3388 -51866 42687 14478 -55224 32713 22918 -52608
166e2608P7998J959q0096P1809J6333q5899N9606L0448q4837M8034L9545q5158
$$ -52608 25390 27349 -52747 19062 35395 -50504 9102 39550 -45287 2747 42292 -42866
178d2866L8485N1975q4806K3240O2524p7946R382O8385p1984l349P5545o3448
$$ -42866 -4381 47594 -37212 -13972 48552 -29394 -20012 48373 -23611 -26960 48585 -14863
190a4863j8663P8374n1339l0224P7727m1319m0255P7924k9636n0816P4281j7064
$$ -14863 -33526 44848 -6491 -36715 41012 -307 -40562 37362 7726 -43090 31191 14127
202A4127n7565O9285o554o3609O4683N024o9322N7478J6924p2509M9003K7914
$$ 14127 -43438 25847 19293 -44316 20367 25391 -43931 13547 30471 -42038 6965 34879
214C4879p4355L9219L8715p3613K8147M7663p0760J6717N4969o5992N302O0337
$$ 34879 -39476 -257 38458 -35155 -7008 40655 -30105 -13388 41581 -24411 -19109 41228
226D1228n9608n325O4090n2779j6029O6734m3935k6027O6494l4891l3956O6050
$$ 41228 -18380 -23705 40385 -12394 -28423 38311 -5624 -31651 34843 -48 -34004 32046
238C2046k6212m2701O4433j5158m9993N9507n012n4455N5166M619o0062M8724
$$ 32046 5834 -36867 27566 12408 -37585 21922 16910 -37545 17621 22240 -37822 10902
250A0902J6392o2207L9342K4879o1673L2400L2730o2962K3277M2251n9997J2265
$$ 10902 27294 -34913 4429 29308 -32365 35 32765 -30197 -6920 35331 -24666 -12401
262a2401M7130n5576M739N2352n2814n746N7978m5017j6318N8021l7458k2787
$$ -12401 34729 -20847 -16108 36244 -16570 -22316 35662 -9355 -25673 32348 -5110 -27897
274b7897N9665l1241l2927O0091j9651m0577N4627j0767m3840N2109l241n0476
$$ -27897 31768 527 -32400 27691 8040 -32537 22090 11323 -32517 19592 16351 -34125
286c4125M7543Q338n2827L8880J4905n2570L4828K1880n6026K7072L1941n3638
$$ -34125 13418 21756 -31071 7809 22714 -29856 4972 26852 -29174 -2102 29839 -23799
298b3799J6928L5681n0443J1976M1389n0433K130M8446m3611p886M8715l7923
$$ -23799 -6871 28810 -21633 -9657 31732 -18701 -16571 31875 -11736 -19622 29093 -8830
310h830j3151N2001l3883k3483N4004k3248l0824M9641j6514l4219M9761r971
$$ -8830 -21981 30020 -3863 -27346 26658 3410 -27414 22227 5713 -28506 21255 11284
322A1284m2559M6524J847m5464L8608P730m5999L5959J4949n0615K8284K5196
$$ 11284 -31275 15249 17096 -28368 10240 17970 -28029 7930 22879 -27736 548 25744
334B5744m8023J8894K8056m5764J5148L4222m6676N245M1202l9635l628M0602
$$ 25744 -22279 -3385 24671 -21093 -5945 28277 -18399 -13154 28048 -11587 -15215 25387
346B5387l5495p332M4719l2955j7358M7226k3335k3658M3587j8635k6796M5599
$$ 25387 -10108 -17440 27279 -5676 -23034 24192 857 -22801 20786 2151 -24645 20954
358B0954j3150l5852M3273j973l8481L6604K388l9648L5863R088m5443K9339J9135
$$ 20954 7804 -28048 15225 13252 -25229 11375 13763 -25885 9978 19066 -26377 2962 22097
371B2097m3528K1083K1674m2341J8377K7916m4047R223L4778l7816J283L4338
$$ 22097 -21431 -348 21326 -21015 -2638 25278 -18769 -9546 25232 -12584 -11301 23037
383B3037l4723j831L8870l3015j1508M1775k4127j7493L8588j9995k0307M0722
$$ 23037 -11686 -13517 25353 -7662 -19170 22605 -1522 -19015 19573 -422 -20729 19993
395A9993j5435k8665L9220n628l1424L3869j798l3058L3781M170l8863K8699J3181
$$ 19993 4558 -24107 15113 9485 -21939 11930 10132 -22926 10855 15025 -23838 4861 18042
408A8042l8124K2023J5953l7871J9852K1731m0069J2419K8252l5928N628K9250
$$ 18042 -20082 1941 17894 -19977 -125 21606 -18463 -6044 22208 -13720 -8092 21158
420B1158l3812K056L3823l2280o511L6814k5136j2180L5122k1438j5485L7063
$$ 21158 -12654 -10598 23225 -9055 -15566 21248 -3888 -16068 19054 -2384 -17869 19194
432A9194j7272k2650L6168r276k5820L2377n166k8065L1787L37l2686K7648P599
$$ 19194 1922 -20728 15440 6164 -19656 12721 7555 -20510 11277 11614 -21072 6576 14175
445A4175l2885K2699J0967l3581K0240J6480l5383J4191K2043l2992Q741K4231
$$ 14175 -18710 3989 14956 -18625 1615 18095 -17288 -3097 18946 -14046 -5305 18926
457A8926l1785M920K8407l0401j814L1212k5795o739L1558k2894j0889L3657j8952
$$ 18926 -12859 -7939 20468 -9933 -11747 19465 -6330 -13069 18489 -4405 -15294 18363 -589
470e89j7068L3384j2816k0649L1431q636k3760L0637l398k7583K7531K449k8844
$$ -589 -17657 15727 2911 -17738 13693 5057 -18703 11934 8536 -19047 8484 10933 -17911
483a7911K3956O563l0213K0952J1747l1327J5942J6374l0185J1410J9411k9429
$$ -17911 6045 12608 -17605 3347 15094 -16233 -291 16083 -14102 -2692 16719 -12710
495a2710P339K3117k8123K057K5853k5378k530K7557k2734p007K9223j9306j1744
$$ -12710 -5371 17746 -10377 -8320 17533 -7845 -10375 17182 -5552 -12559 16664 -2642 -14386
508a4386K9695j5243j5634K9484j1219j9320K8795o698k2576K7140k069k5139
$$ -14386 15309 66 -15568 13916 2697 -16623 12172 5474 -17102 10038 7969 -17170
520a7170K4784K680k6903K1635P061k7748J8279J1075k8351J4396J5326k7846
$$ -17170 7614 10294 -16609 5026 12087 -15661 2618 13693 -14658 -262 15064 -12782
532a2782R769J8516k6420N700K1242k5066J065K3950k2234l648K4870j9189p052
$$ -12782 -3013 15503 -10917 -5217 16025 -9041 -7976 15974 -6260 -9908 14962 -4227 -11279
545a1279K5968j6673j1496K6939j2299j5448K5725q404j7746K5189n107k1216
$$ -11279 14689 -1984 -13480 13459 1160 -14288 11437 3033 -14713 10476 5369 -15847
557a5847K3994L4k3308K0787L628k3965J9054P069k6137J5918J2194k5877J1139
$$ -15847 8147 8181 -15127 5660 9288 -14677 4377 11446 -14691 1227 13421 -12456 -1317
570a317J4642k4497Q576J7273k4794M297K0984k2157o46K1545j9458l112K3051
$$ -1317 13325 -11172 -2596 14677 -10117 -5820 15164 -6993 -7639 13906 -5552 -8664 14387
583A4387j8053p793K4681j3470j1760K3044j0178j3287K3289p778j7392K2858
$$ 14387 -3666 -11459 13222 -248 -12008 11036 858 -12429 10860 3082 -14310 8548
595H548k410j9630J9591O08k0056J8843L513k3001J6375Q767k2958J2034J0688
$$ 8548 6138 -13492 6099 6707 -13349 5494 9007 -13994 2381 11148 -11810 224 10912
608A0912k2135J0682J3467k3621O707J7784k1345J951J8267j9318J94K0327j8875
$$ 10912 -11223 -541 12926 -10695 -3988 13796 -7549 -5598 12669 -6649 -6455 13872 -5003
621e003m547K2552j4628q371K1150j2107r743K2217j0170j4288K2079m754j6399
$$ -5003 -9550 13002 -1626 -9997 11153 -954 -10697 11520 1350 -12938 9141 4387 -12012
634a2012J8914k305j6825J8879L36k0195J6729N516k0214J2841P043j9809J2168
$$ -12012 6902 4597 -12228 6651 6987 -13208 3521 9037 -11177 1664 8707 -11102 1066
647A066R906k1783Q468J4174j9732M388J4419j8565L373J7028j9008j282J9791
$$ 1066 10972 -10811 -2343 11831 -7901 -3513 10906 -7659 -4286 12742 -6266 -7548 12243
660A2243j5248m900J8739j3483o113K0538j2203j0821K1000p252j2991J8467n412
$$ 12243 -3005 -7905 10834 -2649 -8762 11776 -427 -11248 9752 2500 -10491 7976 2564
673B564j3714J9197k944j7583J7474K208j7859J3900L627j7731J3537O472j9961
$$ 2564 -11150 8047 5103 -12480 4994 7202 -10657 3243 6870 -10861 2676 9148 -10813
686a0813J0149J0726j8273O397J1162j7493N505J3875j8178J158J6707j4876k214
$$ -10813 -664 10062 -8211 -1814 9348 -8145 -2640 11235 -6943 -5785 10922 -3954 -6168
699f168J5964j3487l296J7930j2697p648J8915q505j0008J7153o872j1063J8119
$$ -6168 9796 -3691 -6987 10943 -1754 -9402 9513 1008 -9000 8153 1281 -9782 8337
712H337m723j4755J6981j98j5511J4210J293j5887J4012M006j8210J1267Q007
$$ 8337 3614 -11141 5840 5642 -9869 4341 5634 -10253 3759 7765 -10445 822 8829
725H829j7290P961Q984j6754O754J1498j7244L091J4027j4784P4J4001j3568j407
$$ 8829 -8461 -500 8484 -8270 -1516 9982 -7262 -4171 9856 -4928 -4854 9147 -4421 -5828
739e828J5748j2639n075J6691r328p380J5713p674q715J6391n766j1681J5777
$$ -5828 9920 -2719 -7794 8897 -431 -7811 7902 228 -8487 7904 2138 -9543 6234
752F234k343j2881J4108o52j3851J3797J831j5778J1823N010j5743R476O524j5823
$$ 6234 3891 -8990 5118 4466 -9385 4412 6243 -9535 2288 7298 -8445 1031 7555 -8268
766h268Q135Q845j6259N353J1146j5018K782J2122j4145P70J3738j3022k240J4644
$$ -8268 -133 8712 -7547 -2194 8952 -6066 -3284 8838 -5307 -4537 9201 -3821 -6061 8583
780H583j0721m483J4610r043o368J5060p009q819J4677m335j0357J3718k253j1690
$$ 8583 -2138 -6621 7989 -1054 -7422 7638 629 -8190 6487 2152 -8205 5513 3260 -8430
794h430J2969J12j3033J1523K540j3636R956M487j4167Q377O647j4395O290Q570
$$ -8430 4539 4651 -8382 3141 5681 -7955 2001 6488 -7679 698 7345 -7050 -760 7810
808G810j4042M200J0152j3460K033J1547j2495j97J2573j1266k404J3426r666
$$ 7810 -6232 -2032 8120 -5340 -3307 8240 -4255 -4452 8121 -3145 -5549 7877 -1789
821a789m645J3682p742o506J3638n865q359J3340l550r891J2329j455j0812J1464
$$ -1789 -6434 7248 -494 -7000 6638 773 -7586 5754 2204 -7687 4642 3187 -7625 3839
835C839M44j2009J0306K887j2582Q401M630j2474P040O120j2861N358Q124j2405
$$ 3839 4283 -7726 2580 5467 -7115 1286 5916 -6558 482 6602 -6259 -901 7223 -5182
849e182L127R157j1615J725J0300j1352m17J1739r811k695J1766q369l840J2276
$$ -5182 -2055 7102 -4513 -2788 7512 -3840 -4257 7482 -2329 -5024 6742 -1627 -5467 6809
863F809p477o002J2818n140p802J1779l361q483J1599k006j0238J0970P24j1007
$$ 6809 -668 -6670 6148 1008 -6794 4985 1624 -6859 4740 2734 -7504 3466 4190 -6817
877f817Q981K198j0843Q313L531j1982O850O103j1647M381O915j0776L488Q020
$$ -6817 2164 4362 -6481 1832 5363 -6619 231 6334 -5313 -932 5983 -4793 -1305 6715
891F715j1134J444R912r707r08R808q504j608J0616q273l903J1673o009n797J0705
$$ 6715 -4419 -2975 6937 -2770 -3678 6130 -2374 -3982 6634 -1639 -5542 6131 122 -5675 5030
906E030m624o215J1025l781q346J1010j096r370R282J43r381R149J416j1025P985
$$ 5030 406 -5809 5216 1435 -6911 4099 3003 -6367 2915 3058 -6323 2826 4242 -6783 1202
921A202M156j0869N633M871j0244N171O086j1091L210Q294r825Q37Q262q786K40
$$ 1202 5358 -5511 122 4993 -5251 -80 6006 -5085 -1875 6419 -3406 -2569 5693 -3093 -2853
936b853R257q781k111J0435o585l925R538n506m307J0230m872o631J0419k265
$$ -2853 6404 -2377 -4488 5947 -638 -4563 4975 -531 -4838 5392 520 -6111 4308 2043
950B043p627Q897j330p767R227k53r643Q360K372r662O453K945r488O401M328
$$ 2043 -5584 3313 1983 -5784 3443 3190 -6453 1907 4279 -5383 1070 4015 -5473 928 5256
965E256j0730M585O640r695K481O630r036K085P895r355k35R305p397k033Q657
$$ 5256 -5474 -889 5751 -3944 -1463 5167 -3869 -1784 6111 -3244 -3479 5826 -1571 -3604 5053
980E053o536k532R615n975m980R894l389n992Q488k597o199R011j540q244Q307
$$ 5053 -1483 -4015 5600 -375 -5355 4539 1150 -4842 3646 1049 -5150 3861 2321 -5923 2384
995B384J009q400O621J584q406O700K929r717N132N078q957L369N214q683L152
$$ 2384 3393 -5007 1614 3198 -5208 1492 4421 -5296 -164 4914 -4043 -674 4540 -4143 -991
1010i91O571r270J084Q084p725n67P726p097j037Q736o798l196R275m710m355
$$ -991 5580 -3690 -2606 5478 -2247 -2814 4912 -2185 -3222 5514 -1284 -4480 4795 85 -4270
1025d270Q365l909m811Q879k938o708Q443o46p170P054J17p311O994J350q511
$$ -4270 4095 186 -4625 4254 1316 -5392 3051 2405 -4765 2289 2406 -4905 2089 3439 -5072
1040e072N843L275q246M359L796q132L906N055q599K254O437p652P97O602p196
$$ -5072 771 4046 -4200 159 3955 -4177 -271 4784 -3815 -1561 4876 -2776 -1979 4623 -2573
1055b573J13P556o964j662Q302n571k935Q059m742l756Q472l789n267Q294k111
$$ -2573 -2460 5096 -1868 -3530 4772 -799 -3734 4325 -417 -4173 4299 510 -4757 3537 1426
1070A426o046P563j112o653P365J81p628O434J812p770N259K785p855M436L976
$$ 1426 -4620 2943 1831 -4822 2543 2724 -4904 1530 3342 -4428 831 3616 -4239 197 4173
1085D173q033L149N101p593J889N787p258Q19O611o760n69P202n906j751P462
$$ 4173 -3860 -711 4390 -3203 -1314 4473 -2785 -1966 4645 -2115 -2684 4518 -1388 -3139 4323
1100D323n107k823P714m196l927P737l137m885P606k028n790P258p99o477O686
$$ 4323 -784 -3607 4107 -89 -4016 3721 584 -4301 3305 1277 -4513 2745 1946 -4531 2155
1115B155L72p026N986J621p405N057K762p503M120L774p599L013M914p286J648
$$ 2155 2527 -4499 1487 3108 -4297 760 3522 -3981 139 3913 -3686 -673 4241 -3045 -1397
1130a397N598o670O20O155o291n77O848n415j902O924m471k721P083l789l853
$$ -1397 4201 -2469 -1849 4306 -1985 -2562 4286 -1129 -3031 3893 -578 -3299 3784 -5 -3858
1145c858P256k512m876O708j441n261O501o94o194O218P98o744N137J790o704
$$ -3858 3398 886 -3990 2718 1277 -3984 2517 1823 -4371 1847 2645 -4099 1038 2828 -3876
1160c876M624K599p282L779M073p110K299M635o565J695N264o683M05O433n731
$$ -3876 748 3347 -3935 -156 3917 -3193 -894 3741 -2824 -1129 4135 -2548 -2143 4290 -1441
1175a441j185O372m761j726O659m416l071P098k892m258O369j882m452O348j306
$$ -1441 -2626 3746 -1015 -2741 3918 -498 -3569 3529 637 -3621 2748 866 -3586 2762 1456
1190A456n659O183M72o226M874J273n974M682J844o830M012L505o747K519L918
$$ 1456 -4203 1980 2452 -3774 1100 2373 -3601 1081 2925 -3905 107 3612 -3135 -616 3302
1205C302o216K241M517o683J091N820n818m32N701n069o65O157n096k063O929
$$ 3302 -2914 -673 3844 -2839 -1748 4072 -1746 -2178 3523 -1546 -2211 3946 -1150 -3213 3716
1220C716l625l354O220k726l460O393k334m789O382n19n456N158K21n301N130
$$ 3716 91 -3263 2957 231 -3229 3164 830 -3959 2423 1904 -3552 1606 1827 -3474 1656
1235A656Q25o345M462K601o277K965K966n815K807L606o410J688M977n651K75
$$ 1656 2481 -3864 598 3199 -3078 -113 2853 -2962 -155 3451 -2959 -1271 3706 -1945 -1670
1250a670M896n085R7N518n250j321O367l900k477N759l240k585O181k972m005
$$ -1670 3226 -1859 -1762 3756 -1494 -2815 3552 -348 -2825 2934 -306 -2891 3290 318 -3687
1265c687O330j296m689N344p03m691N484k6n841M844J681n799L535J998n553L475
$$ -3687 2643 1347 -3342 2002 1299 -3392 2092 2066 -3775 1069 2750 -3049 486 2484 -3069 406
1281D06K762o258K351M166n570J023M124n125Q51M813n331n17N646m129j549N198
$$ 406 3168 -3090 -739 3427 -2143 -1120 3004 -2121 -1270 3543 -1788 -2305 3341 -788 -2337 2861
1297B861l668j689N760l479l080O014j986l766N251j532l848N538r46n045N168
$$ 2861 -807 -2496 3264 -215 -3295 2719 733 -3033 2218 686 -3162 2376 1430 -3615 1553
1312A553N90n205M130R80n191M138J782n979L153L165n536J954L311n233J718
$$ 1553 2143 -3062 1068 2048 -3143 995 2777 -3202 -49 3116 -2420 -466 2845 -2388 -670
1327f70M036n486M59M954m540o25M766m053r64N292l786k231N576k521k961N056
$$ -670 3366 -2120 -1661 3293 -1247 -1872 2894 -1159 -2123 3169 -617 -2848 2728 207 -2754 2302
1343B302k010l202N293j464m255N105j66m617M339L38m707M246J060n375L590
$$ 2302 292 -2910 2383 919 -3336 1769 1603 -3014 1325 1663 -3044 1202 2262 -3113 477
1358D77K167n280K716K578n208K321L309n398J346M144m870L60M335m466k20M806
$$ 477 2644 -2636 80 2658 -2550 -229 3080 -2318 -972 3172 -1698 -1338 2997 -1469 -1689 3117
1374C117m135j248N133l258k085N049k628k648N113j902l501M947q96l996M478
$$ 3117 -1018 -2266 2867 -391 -2476 2573 -55 -2703 2410 508 -2993 1954 1058 -2938 1540
1389A540j73m314M168O09m744L647J477m925L002K188m989K378K852m946J644
$$ 1540 1367 -2947 1221 1830 -2914 733 2210 -2715 287 2475 -2514 -136 2716 -2230 -586
1404e86L448m776R25L945m520J66M355m118o05M673l669j399M923l010k198M880
$$ -586 2862 -1914 -989 2956 -1564 -1398 2957 -1161 -1766 2907 -762 -2161 2762 -248 -2446 2434
1420B434k262k769M780j612l399M667p37l958M183J04m201L773P76m556L303J697
$$ 2434 172 -2597 2183 571 -2828 1839 1102 -2856 1327 1431 -2770 1003 1779 -2777 526 2223
1436B223m699K482K293m514J987K766m626J353L513m361M11L808l890o5M068l749
$$ 2223 -2476 6 2299 -2215 -228 2538 -2088 -735 2778 -1583 -1172 2636 -1254 -1319 2749 -1000
1452a000q08M547l140j661M437k526j988M530k244k745M697j282l424M150n73
$$ -1000 -1808 2739 -401 -2062 2375 -151 -2139 2391 147 -2598 2099 817 -2607 1543 970
1467I70l502L984j65m111L777R15m383K885J486m161K584J908m541J971K936m299
$$ 970 -2532 1452 1287 -2824 953 1868 -2515 370 1856 -2305 279 2187 -2354 -383 2553 -1746
1483a746R06L116l778O50L391l919j28M155l266j123L945k638j284M101k587k106
$$ -1746 -840 2276 -1502 -852 2539 -1380 -1508 2647 -619 -1742 2203 -435 -1719 2382 -205 -2311
1499b311M468j584k850L889j005k810L935q03l609L910L81l983L004Q48l724K921
$$ -2311 2157 573 -2277 1612 607 -2203 1732 929 -2680 1230 1611 -2372 632 1480 -2244 677
1515F77J164m321K462K325m177J385K495l710J229K840m050M46L758l374o18L517
$$ 677 1841 -2480 -18 2307 -1870 -485 2010 -1700 -471 2369 -1681 -1235 2523 -851 -1469 2048
1531B048k749p07L723k792j589M190j798k349L618j252k303L734j075l152L745
$$ 2048 -701 -1408 2315 -477 -2066 2124 326 -2023 1595 343 -1960 1774 699 -2453 1292
1546A292P6l483K889M38l266K932P30l957K557J822l847J605J975l507J555K352
$$ 1292 1368 -2115 774 1212 -2054 878 1608 -2349 208 2030 -1817 -212 1763 -1744 -189 2163
1562B163l915Q33L215l353p8L055k925j31L388l010j048L886k085j762L384j604
$$ 2163 -1752 -919 2296 -1057 -1135 1920 -1005 -1136 2252 -758 -1806 2080 -5 -1767 1617 13
1578A3j784L577j403k639L600l33k960K863qk861K957L63l553K535J409l446J696
$$ 13 -1771 1806 403 -2236 1364 1031 -1929 934 926 -1935 1022 1385 -2168 367 1776 -1670 26
1595B6J520l218J707J916l643J057K694l169K92K611k918K27L023l026o03L470
$$ 26 1546 -1672 35 1951 -1692 -635 2059 -1110 -818 1793 -1125 -898 2125 -901 -1504 1966
1611A966k235j211L112j917j279L409j740k117L469p86k487K898m47k498K996
$$ 1966 -269 -1480 1632 -285 -1564 1845 105 -2012 1457 671 -1816 1082 635 -1863 1133
1626A133n6l128K627Q69l103J942J065l015J886J501l374J275K221k995N85K229
$$ 1133 1077 -2051 576 1445 -1658 284 1349 -1666 220 1721 -1653 -378 1843 -1152 -567 1662
1642A662k795M47K599k857k35L005k292p89K846j999r60L093j837j602L195j142
$$ 1662 -1133 -686 1913 -944 -1179 1826 -466 -1255 1591 -408 -1368 1725 -112 -1714 1481 339
1658C39j974K856q18k111K892m50k619K722K47k771K229N95k808K046J054l044
$$ 339 -1635 1221 403 -1708 1184 734 -1885 837 1084 -1687 542 1137 -1671 375 1429 -1615
1674a615J582J611k897J029J856k751O93K198k705J50K557k378l63K633k068p35
$$ -1615 -33 1578 -1319 -290 1566 -1185 -492 1706 -999 -849 1708 -670 -1033 1600 -468 -1203
1690a203K759j765j197K839j358j559K750r54j887K690n63k187K554j18k452K340
$$ -1203 1556 -209 -1406 1433 75 -1484 1266 312 -1575 1115 552 -1635 919 801 -1651 689
1706F89L20k602K041P12k673J731J108k774J393J548k757R15J882k584M99K126
$$ 689 1009 -1593 448 1160 -1513 218 1326 -1448 -55 1493 -1264 -349 1533 -1051 -552 1574
1722A574k465O8K431k182m67K514j816p98K569j582j210K708j112j704K529o39
$$ 1574 -891 -823 1608 -574 -1041 1473 -343 -1141 1428 -154 -1364 1344 232 -1472 1057 418
1738D18j838K384l71k162K330J63k411J932N61k378J727Q01k581J487J341k596
$$ 418 -1420 964 593 -1569 761 924 -1487 445 1006 -1372 355 1156 -1425 62 1403 -1193
1754a193R24J601k364P17J735k448L69K227k227k58K268j826m53K348j776r08
$$ -1193 -269 1332 -1032 -315 1420 -1028 -659 1568 -659 -917 1351 -475 -928 1420 -356 -1264
1770a264K630j264j434K362q18j471K324o71j922K358J1k247J853L95k111J708
$$ -1264 1366 102 -1332 1030 212 -1259 1065 394 -1528 830 841 -1406 447 842 -1269 439
1786D39N92k450J525J249k465Q82J422k159P85J545k388M22K116k095k43K049
$$ 439 1031 -1419 106 1355 -1110 -228 1194 -965 -180 1365 -1023 -601 1515 -580 -823 1226
1802A226j705k77K137j829p14K499j296j264K199r17j202K261q94j727K396j64
$$ 1226 -479 -756 1381 -448 -1162 1337 41 -1223 976 59 -1143 1118 224 -1503 893 729
1818G29k065J825J65j878J808K84k318J660J025k355R81J192k035R21J340k322
$$ 729 -1336 489 654 -1224 584 868 -1450 210 1235 -1120 -139 1053 -982 -61 1279 -1043
1834a043N28J941k001j51J906j684j49J997j807o11K387j290j124K029r05j058
$$ -1043 -515 1426 -575 -726 1180 -504 -653 1344 -463 -1074 1313 23 -1101 928 23 -1035
1850a035K116r34j557K272k62j844J789k3j713J849R7k192J743P76k204J102R57
$$ -1035 1081 147 -1410 862 600 -1244 545 522 -1191 658 755 -1437 306 1082 -1122 -20 937
1867I37j996J120J113k275P28J718k032J45J660j750R6J861j850m29K233j324
$$ 937 -1059 61 1174 -1101 -373 1345 -687 -542 1118 -632 -536 1325 -525 -954 1279 -45
1883d5r35J961j016r23K080r69j452K184l77j702J800j42j640J834M0k044J668
$$ -45 -980 981 -35 -958 1122 153 -1299 885 508 -1194 606 464 -1176 658 698 -1346 322
1900C22O44k077J187P43j926J234R52k213Q81J479k014L92J448j811L33J715j947
$$ 322 966 -1111 76 819 -1107 127 1079 -1134 -253 1226 -788 -396 1052 -759 -426 1289 -658
1917f58j35K023j504n48J896j307o30K048j210j165K213o85j388J788m05j456
$$ -658 -793 1230 -274 -822 1074 -233 -863 1185 -25 -1190 1023 338 -1050 738 333 -1123
1933a123J913j74j875J705L79j904J332N42j870J270Q26k114R11J334k003N27
$$ -1123 790 616 -1259 446 825 -1079 253 795 -1075 195 1021 -1093 -182 1152 -851 -324
1949c24J361j846M40J543j883O8J834j606l01J786j438m71J983j300q67K007q62
$$ -324 1037 -809 -369 1174 -709 -641 1193 -413 -714 1072 -366 -837 1146 -154 -1021 986 124
1966A24j100J835o56j266J902m15j620J800N1j739J517K95j823J408N65j936J113
$$ 124 -976 859 203 -1063 839 424 -1196 604 655 -1084 433 728 -1095 313 878 -1058 55
1983E5R68j956P98J179j915N53J433j848K08J642j671j05J748j484l80J845j309
$$ 55 1023 -933 -135 1044 -871 -318 1115 -733 -525 1117 -554 -659 1089 -395 -775 1070 -239
2000b39o69J906j068r33J948q20j173J874n10j401J794k30j596J674J12j761J475
$$ -239 -908 998 -70 -1003 945 125 -1048 826 316 -1085 709 479 -1117 557 669 -1092 383
2017C83L94j808J280O56j908J039J014j920O70J243j778M02J413j754J13J691
$$ 383 777 -1031 249 905 -1003 36 1050 -870 -200 1043 -735 -333 1080 -674 -561 1130
2033A130j575k92J758j326m94J814j196q00J955q91j131J825n69j208J772m53
$$ 1130 -445 -737 1021 -305 -799 1015 -181 -981 974 83 -1048 777 208 -1000 772 319
2049C19j459J782m6j687J480K52j648J386L80j837J248Q09j888Q32J027j741P09
$$ 319 -1140 642 596 -1091 389 641 -1007 379 759 -1078 170 979 -909 -77 950 -791 -82
2066h2J120j844M36J539j703n0J593j407k00J652j399n30J915j044r71J747p10
$$ -82 1038 -806 -370 1169 -534 -584 1009 -398 -598 1054 -345 -875 1040 -4 -975 772 62
2083F2r88J740o31j339J827j40j612J467J30j487J418K08j789J365O91j849Q95
$$ 62 -926 814 183 -1156 671 531 -1081 386 516 -971 447 655 -1134 231 922 -927 -32
2100c2Q66j661Q58R49j887O43J402j718J32J390j455J24J481j621j93J853j270
$$ -32 834 -827 31 980 -907 -264 1138 -580 -448 942 -513 -389 1092 -529 -722 1131 -139
2117a39o84J668r35o71J690r40j084J896m42j388J529j48j299J528r4j660J515
$$ -139 -823 845 -90 -761 929 -11 -1095 801 359 -1029 500 352 -947 581 487 -1173 342
2134C42M92j776R85O75j575R97P42j856P99J264j738K77J271j464K62J372j660
$$ 342 834 -942 43 718 -857 140 882 -974 -175 1089 -649 -372 899 -565 -303 1069 -591
2151e91m4J746j327n08J586j056m68J650j130q22J878o80j170J556m07j109J590
$$ -591 -635 1111 -216 -724 862 -194 -662 988 -142 -964 914 234 -936 620 213 -896 694
2168F94l37j491J605J98j619J154L84j486J153N17j791R65J039j711M76J094j507
$$ 694 357 -1134 471 669 -950 204 588 -898 255 772 -1019 -54 985 -726 -250 844 -663
2185f63M43J222j655J22J595j384l10J498j140l39J615j181p08J798p71r97J558
$$ -663 -220 1002 -653 -531 1064 -320 -630 868 -272 -611 1004 -177 -885 913 142 -855 703
2202G03n56r92J604m73j320J605l2j465J288J38j421J282L25j697J103P35j627
$$ 703 147 -845 759 286 -1034 571 539 -926 362 500 -921 361 686 -1011 92 827 -800
2219h00P01Q57j512O51J028j647L04J407j426n7J339j242j47J505j220n39J706
$$ -800 -99 758 -754 -103 925 -722 -418 989 -437 -494 845 -397 -544 961 -259 -798 908
2236I08q97p78J495o77q40J556n66j174J556j42j321J321qj309J302J85j542J129
$$ 908 11 -767 728 51 -789 767 201 -973 583 441 -880 441 433 -876 426 611 -931 198
2254A98N29j556R04O49j500P60Q75j590M71J157j439J88J195j322N4J351j290
$$ 198 727 -829 75 724 -776 -16 859 -731 -260 897 -542 -354 841 -481 -427 924 -366
2271c66k52J475j028n30J485q51o66J527o91r84J562l98j159J392j47j250J306
$$ -366 -618 857 -171 -701 784 -67 -733 794 103 -881 681 283 -876 516 369 -881 425
2288D25O7j353J156L36j448R71N28j481Q16P60j503O29R16j469M07J070j377J96
$$ 425 492 -861 295 631 -817 154 682 -799 17 777 -726 -97 819 -650 -243 827 -550 -354
2306c54J192j278j5J302j190k37J401r95m81J411q06o55J422o49q67J454m16j065
$$ -354 838 -440 -455 847 -343 -580 821 -174 -655 756 -50 -705 717 68 -799 655 239 -826
2324h26J305j23j163J220M5j322J142L59j438Q87N75j366P43O86j445N86R72j411
$$ -826 479 356 -807 413 458 -864 278 637 -801 86 661 -705 38 724 -721 -135 837 -574
2342e74K71J095j240J12J141j225p9J352j080l88J335q44m76J331q14o68J450
$$ -574 -303 792 -448 -336 805 -420 -499 853 -227 -615 720 -124 -600 731 -83 -751 699
2359F99n44r36J294k76r70J232j95j155J245J33j330R75L63j241Q76M29j379P70
$$ 699 155 -781 513 237 -733 499 304 -851 394 527 -803 172 535 -706 170 599 -780 -10
2377a0P96j405M00R34j218K98R74j298J27J274j166k40J245q94l17J248r15n29
$$ -10 786 -619 -219 715 -503 -205 769 -529 -402 872 -294 -534 711 -183 -500 748 -167 -696
2395f96J450o64q24J268l94p93J241m01j023J337m3j229J030J69j111R73K17j317
$$ -696 754 90 -734 534 140 -653 588 187 -836 501 458 -771 259 428 -683 290 507 -810
2413h10R22O02j362N59P02j171N00P67j338L27J143j201r6J128r53j14J139j009
$$ -810 112 714 -648 -89 613 -558 -58 709 -629 -302 841 -360 -456 672 -281 -395 744 -265
2431b65l64J399p49p03J243n04o77J237n02r38J353j32j146J045N9j017J015Q3
$$ -265 -629 770 21 -682 561 57 -620 617 115 -823 530 398 -748 297 356 -661 354 437
2449D37j255J008M67j309O36N84j137O12O19j323M74R70j221J01R74j018Q1J038
$$ 437 -818 190 657 -652 -16 568 -569 43 662 -661 -187 783 -438 -337 637 -381 -300 738
2467G38j128j45J321q81m98J174o38m98J210o44p69J343k97j006J096j00r37J085
$$ 738 -390 -535 786 -95 -593 581 -57 -555 655 11 -758 585 288 -718 378 278 -659 426
2485D26k8j201J046L57j265P25M80j160P01N68j310N37Q85j232K31Q95j078J64
$$ 426 398 -803 243 600 -665 60 540 -620 81 649 -661 -124 761 -471 -240 655 -423 -259
2503b59R95j143o2J210r22l33J122p54l64J184p50o21J291m44q29J128k66q55
$$ -259 736 -407 -469 741 -181 -514 608 -146 -510 674 -76 -697 594 150 -679 449 183 -672
2521f72J137j52j095J093J80j171Q42L10j130Q06M67j295O28P59j207L44Q10j122
$$ -672 465 313 -782 311 491 -680 162 472 -658 148 615 -680 -52 707 -500 -156 654 -468
2539d68K71R49j172L3J134r94k01J105q62k93J204q09n26J254n59p00J145m18
$$ -468 -197 752 -420 -387 747 -247 -448 657 -205 -498 706 -103 -629 625 66 -634 511 93
2557I3p63J168k75r67J115nj066R67J37j093R00L28j220P25N72j195N08P03j161
$$ 93 -670 498 223 -744 371 366 -700 267 404 -689 211 539 -681 44 616 -579 -71 632 -529
2576e29L81Q59j166J72J008j041q5J096r27k45J179q28m42J212o37o10J177m88
$$ -529 -148 711 -455 -283 725 -316 -401 695 -232 -477 702 -126 -568 644 7 -603 574 86
2594H6p38J154l07q95J117j12j012J032O5j079R02K51j140P94M20j173O40O09
$$ 86 -652 502 195 -700 417 305 -707 325 390 -689 213 464 -676 118 538 -635 5 614
2612F14j186M59P66j134K87Q72j087J06J011r93j40J091q37k89J123p60m91J232
$$ 614 -572 -113 653 -481 -194 678 -409 -303 708 -285 -425 666 -171 -460 663 -97 -588 644
2630F44n69p12J161l52q04J107k30r52J093J4j107R25K13j076Q14L24j166P20
$$ 644 75 -637 524 172 -632 475 245 -707 386 400 -707 218 431 -645 169 493 -673 47
2648D7N73j194M61P03j080L52P62j126K45R65j057m0J020q66j50J034q54l23J184
$$ 47 620 -574 -113 590 -490 -138 624 -502 -257 708 -349 -389 631 -235 -385 649 -205 -528 656
2667F56o57n93J112m35o46J096l97q23J147j01j025R26J29r88Q66J69j125Q06
$$ 656 -1 -594 518 83 -563 533 136 -687 460 359 -666 260 389 -599 267 436 -689 117
2685A17N02j199N00O31j069M58O67j159L18R40j083QR73q87n1R75r41j92J166
$$ 117 619 -580 -80 551 -518 -60 607 -552 -234 706 -377 -369 604 -283 -334 641 -300 -492 674
2704F74p45m75J063n41m81J067n27o99J180k38r14R61m3q51R28oj054R28L22j146
$$ 674 -71 -546 517 -24 -505 562 35 -664 516 278 -636 325 282 -569 359 353 -701 227 549 -597
2724e97O30M82j030N77N23j181M63Q49j125J13Q69r28R1R20j011j04J153q09m24
$$ -597 33 515 -515 62 585 -596 -133 716 -409 -296 573 -355 -264 656 -355 -459 694 -115 -539
2743e39J068o05m16J091o43o13J198l39q31J000j76p65J000j57r78J015J71j085
$$ -539 529 -76 -492 599 -44 -657 541 202 -629 371 195 -570 430 273 -705 310 481 -604
2761f04P25L14r73O95L48j135O17O75j106K79P26r53K34Q06j067M8J054q87k54
$$ -604 121 435 -538 157 505 -630 -13 662 -444 -165 561 -392 -158 648 -419 -371 683 -204 -458
2780d58R98o92k84J040p21n06J188m61p18J034k86p14J026k43r01J034N4j000
$$ -458 540 -152 -436 604 -117 -623 565 104 -614 420 134 -580 446 203 -698 336 390 -610
2798f10Q08J76r39P77K49j086O88N27j081M27N98r74L76O69j046K09Q92r44m4
$$ -610 198 374 -565 212 461 -625 63 590 -491 -64 534 -440 -64 605 -441 -232 660 -284 -328
2817c28Q95q08j02R58p97l16J075n96n12J000m42n78J029l57p69J031j19q78Q85
$$ -328 567 -241 -343 615 -182 -498 577 -19 -531 469 27 -551 478 121 -648 383 264 -614 271
2836B71L6q95Q34J53j016P33L99j050N47M77r93M91N91j039L18P39r29J01Q18
$$ 271 307 -588 246 399 -617 116 515 -535 12 489 -504 -13 578 -461 -143 596 -333 -232 586
2855E86q84L2Q72q51j64J025p63k66R33n94l84R80n47n04R93k67p40Q77o9q48
$$ 586 -298 -266 606 -245 -409 616 -147 -413 520 -74 -458 522 -25 -529 464 197 -543 334 265 -583
2875e83R19p0q83Q17K08r86O98L38r84N34N34j039M36O51j000K44P63r33Q2Q42
$$ -583 336 266 -617 200 408 -578 120 458 -526 8 542 -497 -61 590 -410 -166 597 -336 -254 588
2895E88q55j20J009q36j77R57p04l34J000n34n10R97m03o12R53k55p13Q92j08
$$ 588 -267 -387 622 -214 -391 566 -138 -472 528 -6 -516 481 78 -534 419 164 -549 343 235
2914B35p77Q13Oq14P14J70q85N76L69r16N23M42r24L90O42r66K10P53q66N9Q22
$$ 235 -542 271 277 -537 177 347 -538 38 407 -509 14 456 -468 -78 564 -402 -192 561 -305 -246 576
2935E76q55p5R39p25k88R37n82l52R25n23m97J004l66o66R06j84o88Q45j00q03
$$ 576 -279 -354 585 -140 -428 509 -73 -425 500 -23 -520 484 118 -548 358 174 -514 331 231 -572
2955e72Q40J04r08O54K48q48N95K93r39N45N17r58K89O27q33J95O73q69Q8Q57
$$ -572 268 372 -536 118 366 -482 113 406 -533 12 529 -429 -140 487 -346 -151 522 -347 -259 598
2975E98q00j77Q76o30k32Q84o34l84J010m31o06R07k55n98Q49k17p50R04J6q86
$$ 598 -202 -379 497 -133 -365 519 -115 -499 511 80 -526 381 126 -472 377 160 -590 314 330 -556
2995e56P23J60q01O54J91r24O11M40r37L60N32q19L16N51r17K20P79q30n7P81
$$ -556 167 327 -474 180 371 -553 58 498 -439 -79 453 -366 -50 501 -416 -196 583 -247 -304 477
3015D77o67q7Q01p02k62R67n20m72Q53l44m80Q75l63o42R36j07p97P43N1p48P15
$$ 477 -190 -277 524 -178 -440 527 7 -465 388 44 -436 439 76 -566 370 263 -534 209 260 -488 227
3036B27Q7q87O91L52r35M52M28q19M05M71r31L20O98q52M0P05o99L5P35p67j30
$$ 227 314 -573 118 470 -465 -13 415 -404 1 472 -459 -139 559 -293 -253 452 -247 -212 523 -244 -374
3057c74R03n98l39Q23m46l51Q47m53n38R27k04p00P57p7o34P42l1q23P46K33q90
$$ -374 529 -69 -408 415 -31 -382 465 12 -526 401 197 -503 254 177 -457 285 254 -569 177 410 -480
3078d80N14L44q07M83M01r29L80O43q74J35O52p51J21P00q17n4Q86o54k68Q05
$$ -480 34 378 -429 54 455 -474 -94 549 -325 -190 462 -289 -168 532 -285 -339 547 -107 -375 430
3098D30n15k70Q21n03m40R06l14n97Q06j87n82P84j36p44P74J08q21N86K10p69
$$ 430 -85 -355 466 -37 -477 429 115 -482 324 137 -445 339 203 -541 233 341 -480 106 316 -453
3118d53N60K92q89M57N18q58K44N71p81J90O59q15L0P90o86j54P88n93k25Q38
$$ -453 107 399 -490 -33 485 -373 -129 442 -339 -149 510 -305 -275 515 -171 -325 463 -130 -355 483
3138D83n57l76Q94l92n05Q06k54n58P98j63o90P79Mp15O41J03p60N94K10p95N05
$$ 483 -74 -450 444 52 -453 353 99 -459 339 176 -514 265 269 -446 195 298 -462 132 342 -453 52
3159E2L76q31L68M56p86K53N68p73J22O85p52K9P00o68r2P91o34k35Q30m91l87
$$ 52 428 -403 -35 421 -365 -112 456 -317 -195 490 -262 -233 467 -201 -293 498 -136 -371 459 -32 -419
3180d19Q23l77m57Q10k39o22P93j16o67P14L4p69O59J43p76N89K33q07M73M19
$$ -419 404 27 -430 380 141 -481 312 196 -471 243 277 -492 167 310 -466 123 356 -451 22 441
3200D41q03L26N09q06K18O09q05J18O93p62%P15o38j45Q13o23k08P92m74m06Q14
$$ 441 -362 -36 473 -333 -115 494 -311 -193 500 -262 -262 453 -185 -330 483 -140 -348 444 -30 -436 378
3221C78l38m98Q18k39o26Q22q9o92P09K9p33O52J39p93N48L34q30M00M37p67K89
$$ 378 40 -458 360 121 -505 317 228 -464 245 274 -459 193 332 -461 87 421 -409 -9 428 -339 -50
3242e0M95q07K17O16p18RO77o31n2O89o08k06Q40n30l43P74l67l87P25l08m89
$$ -50 445 -362 -145 471 -247 -238 439 -192 -244 445 -163 -369 471 -59 -402 372 5 -382 343 35 -454
3263d54P99k01o04P06o6o19O68J3p32O30K46q22M68L25p10L90L49p73L10N75p85
$$ -454 345 144 -460 246 180 -439 229 242 -490 140 386 -436 32 357 -353 37 386 -387 -77 498 -287
3284b87R7O38o76O8O25o55j11P95n80l08P67m13k72P04m04m43Q31k54n93P33j36
$$ -287 -190 448 -228 -160 465 -190 -301 494 -86 -394 373 -40 -312 392 -12 -455 376 122 -471 262 126
3305A26n44O83j05o52O78J51p78N06K26o82M71K90q18M16N04p78J73N20o45J29
$$ 126 -418 265 160 -492 186 337 -441 65 291 -391 80 370 -448 -32 472 -306 -133 387 -258 -129
3325a29O10p48J1P65o39j96P33m93k11P57n24l71Q59l24n37P35k04n04P18j80
$$ -129 481 -267 -256 509 -130 -326 407 -86 -297 460 -64 -435 424 100 -437 298 94 -410 308 128
3345A28o51P52O4p64N75J34o50N37K08p98M74M26p86K56M72o79K42M93p60J22
$$ 128 -523 229 293 -471 104 238 -412 125 333 -465 9 435 -351 -95 377 -302 -60 433 -327 -205
3365b05P09o78r5O71n39j11P09n84k67Q24l82m49P28k76m44P59k50o16P77j5p28
$$ -205 504 -174 -269 402 -137 -248 461 -123 -390 434 52 -397 331 55 -389 370 120 -496 281 266 -462
3386d62O16P8o66O03J21p80N42L48p98L50L92p11L25M59p91K08O35p18K3O27o05
$$ -462 154 232 -434 169 290 -490 52 400 -398 -48 344 -367 -42 417 -374 -166 469 -249 -226 401 -204
3407b04j0O73o27j68P91m87l30P24l67l48P41l25n17P94j61o02O67m1o34O73K2
$$ -204 -214 459 -168 -336 455 -32 -362 362 -5 -353 388 63 -454 340 179 -423 244 203 -431 242 264
3428B64p49O25K17p82M56L24p46M03M03q05K87N36p47J41N91o88N9O67o77p7P50
$$ 264 -485 140 357 -425 31 355 -391 12 415 -390 -103 433 -314 -173 418 -270 -211 456 -221 -298 452
3449D52n60k19P18m54k75P32l95l98P43k49m98P11j62n76O96n9o50O43P7p01N42
$$ 452 -108 -327 391 -63 -338 394 -1 -399 344 95 -403 308 146 -430 266 207 -443 200 277 -424 118
3470A18J97p25M73L03p62L78M30p58K48N15p37J40O22o94J4O62o05j12P23n41
$$ 118 315 -410 63 366 -396 -18 412 -346 -98 417 -320 -180 442 -252 -238 424 -181 -293 430 -111
3490a11k27P50m66l29P55l43m35P41k26n40P09j21n95O77k8o44O66N1p17N13K07
$$ -111 -338 412 -54 -383 372 29 -406 335 109 -431 278 157 -438 239 211 -433 233 284 -433 80 287
3511B87o88M51L17p47L77M00p33K16N25o95J32N72o62L5O42o21j17P13m91k56
$$ 287 -401 50 367 -380 -3 397 -336 -120 405 -290 -158 414 -248 -213 429 -192 -309 404 -87 -343
3531c43P57m68l25P98l59m81P43k39n13P35j63n89O72K5o86N83J40p07N25K55
$$ -343 414 -54 -379 419 60 -421 322 83 -430 305 142 -447 225 250 -436 147 287 -420 105 360
3551C60p75M28L52o84K70M50p32K43M97p04J65N75o94K3N85n20j06O40n10j39
$$ 360 -415 13 365 -319 -49 401 -331 -88 409 -295 -130 445 -249 -226 359 -161 -267 373 -137 -276
3571b76P29m55l74O93k80m23P24k80m95P83j24o33N84J1n95O82k7p71P05K13p84
$$ -276 453 -2 -376 317 37 -386 338 58 -437 346 222 -411 173 184 -411 271 244 -527 178 391 -393
3592c93L53M04o84L33L37p05K41N38o59J1N84n27k0O28o38j06P44m85k51N47k84
$$ -393 -40 364 -320 13 350 -355 -114 424 -235 -224 360 -167 -187 441 -197 -303 441 -44 -295 252 -32
3613c2k85O52k83n06P44j37n04N44j00m95O06n4o75O19K27p08M62L34o49K59K91
$$ -32 -317 335 52 -454 290 153 -351 193 93 -402 204 150 -525 94 321 -387 75 409 -240 19 310
3634C10p30M45L93o49Q5M90o22J79N19o92K8O79n19j92O45m43j89O54m41k96P46
$$ 310 -420 25 418 -231 -146 344 -278 -99 420 -272 -244 435 -84 -276 369 -74 -263 391 -50 -346 400
3655D00l19m58O00j30m36N76j30n10O13N4o44M95J12n69M52J84o92M07L83o98
$$ 400 81 -377 223 93 -343 233 103 -407 206 260 -384 111 223 -346 106 290 -402 5 388 -310
3675c10K00M52n85J68M44o42O1O32n93j03O40n10r3O14m65k59P09l53l50O38k64
$$ -310 -110 342 -243 -75 369 -273 -212 420 -173 -276 364 -146 -239 375 -90 -349 360 7 -343 295 31
3696C1l52O10k12m65O51n3n92N14O2n29M88P2n83M11K51o21K53K87n37L07L16
$$ 31 -321 289 77 -388 263 210 -382 132 194 -335 153 225 -358 53 304 -317 -64 223 -314 -7 309
3717C09o49J67N11n03kM95m80p4N84n18j61O78l85k45N38k69k85N84k65l81O16
$$ 309 -340 -173 338 -165 -167 328 -152 -226 358 -160 -321 357 -28 -273 265 -4 -289 295 30 -351 265
3738B65j39m79N42m3n42N34P5n83M99J30o36L55K90n91L29L13o17J72M94o48J38
$$ 265 126 -353 189 146 -396 138 213 -370 129 259 -377 -22 268 -323 6 319 -298 -126 368 -280 -142
3759a42M87n28NN17m77j37O33m74j24N67l79k75O46l34l37O50k17m22N82j19m89
$$ -142 345 -183 -178 339 -138 -275 358 -116 -240 327 -52 -327 319 -15 -352 298 81 -341 241 122 -367
3780c67N61pn44M96J14o10M54J95o25L69K59o14K76L77o44K33M52o24J18M70n20
$$ -367 194 187 -357 139 253 -357 97 292 -333 36 295 -319 -43 334 -310 -77 375 -249 -131 339 -181
3801a81LN29m97p0N61m33j71N81l35k72N55k56l22N84j96m24N50o9m83N15kn27
$$ -181 -178 351 -146 -216 345 -88 -259 322 -13 -285 270 14 -308 276 80 -344 206 137 -346 169 167 -360
3823c60M97Q1n84M24K04n82L43K69o03K95L57o02J75M18n52R9M51n16J7N30m91
$$ -360 137 218 -366 58 262 -320 23 292 -311 -16 341 -261 -86 332 -220 -121 330 -186 -169 361 -130
3844a30j18N59l72j91N63l68k24N86l08l18N48j42m11N63j58m23N28Mn23M22J33
$$ -130 -248 311 -61 -252 311 -57 -281 305 -3 -321 227 85 -326 237 79 -344 184 188 -335 87 220
3865B20n34L96J55n82L75K72n94K11L74n13J46L98n83J22N21n52l7N19m23r6N42
$$ 220 -314 82 237 -345 30 302 -292 -81 293 -220 -74 324 -259 -137 384 -168 -205 314 -109 -205 337
3886C37m03k06O22l23l32N64k16l14N38k15l93N79o0n01M63K9m48M17O0n50M41
$$ 337 -66 -272 350 27 -305 259 43 -271 267 52 -341 238 178 -323 140 169 -279 138 198 -352 89
3907H9K04n84K68K79n13K51K83n65J94M43n52L8M52m37PM58m71o5N72m00k37N63
$$ 89 293 -291 -23 256 -257 -6 277 -288 -94 349 -203 -165 287 -150 -143 315 -156 -221 351 -49 -286 277
3929B77k81k47N27k88l22O11j63m58N21l8m30M83l6n13M97J15n60L51K08n10L02
$$ 277 -4 -251 276 -12 -334 277 114 -344 177 139 -291 192 156 -357 140 255 -305 46 254 -256 46
3950D6K13n60K62L54n62J50L68m80J13L66m73J8N35m07j89N10l00k10N36l40k45
$$ 46 259 -301 -39 315 -247 -97 271 -209 -96 270 -203 -185 350 -57 -246 264 -36 -246 290 -50 -295
3971b95O02k53l44M75j41l13M85j29m78N95J7n32L28J80m62L57J69n97L02L30
$$ -295 307 54 -290 185 44 -269 216 87 -391 204 221 -311 17 197 -265 92 261 -336 -34 296
3991B96m97J11L73m81K05K85n52J48M41m81l7M33l94J0M21l79j48N13k82k85N80
$$ 296 -201 -90 283 -198 7 292 -260 -112 329 -152 -189 244 -150 -140 281 -98 -246 267 -15 -300 280
4012B80k67l23N57j97l97N26mm79M45K7m55M18Q1n46L94K26n54K63K87n34K37
$$ 280 13 -310 247 50 -347 179 175 -304 141 168 -287 131 212 -334 60 286 -268 -5 282 -252 -15
4033a5L22n53J42M34n05J9M65m38m4M91m53r0N39l96j57M78l34j89N04k15l12
$$ -15 307 -246 -104 330 -175 -156 309 -129 -173 318 -135 -225 314 -82 -239 239 -95 -284 220 5 -307
4054c07N33j26m12M86m8m30M58K0m77M06J22n16L30K11n24K83K68n31K08L53n27
$$ -307 226 100 -312 174 126 -304 154 174 -303 103 225 -291 39 250 -274 9 277 -254 -46 307 -220
4075b20J22M08m99M0M66m60n5N11m07j38N38l43k34N51k72l13N44j85l58N07r6
$$ -220 -98 310 -189 -149 317 -143 -198 313 -94 -232 306 -37 -271 280 8 -305 239 54 -304 203 107
4096A07m26M80j4m58M39M9m88M02J42n16K99K36n10K50K72n09J90L67n21R6M22
$$ 107 -319 161 147 -311 128 177 -311 91 233 -283 16 252 -258 -8 264 -245 -55 312 -209 -113 309
4117C09m76K0M48m43n9N08l93j54N22l12k25N12k66k75N36j89l84N09p5m24M80
$$ 309 -167 -147 301 -142 -201 307 -86 -240 282 -30 -255 257 -9 -284 252 63 -321 188 113 -311 169
4138A69l5m59M55P4n24L81J67m98L06K03n12K62L02n17J62L50m62R4L83n13N9
$$ 169 134 -325 130 204 -320 61 228 -270 36 239 -273 -11 291 -226 -64 286 -176 -82 301 -212 -153
4159a53M45l81j30N00l51j26M37k94k16N42k11l58M67j01l83N54j35l48M80m0
$$ -153 292 -89 -219 281 -70 -196 241 -53 -269 273 62 -296 171 70 -313 241 106 -242 238 198
4179A98n08L80J63n26M15O1m85L51K38n36K00L03m55J52L22n05J41M14m68l4M48
$$ 198 -310 70 233 -293 122 183 -302 49 287 -249 -49 254 -201 -49 273 -232 -91 323 -145 -179 269
4200B69l71n4M34l79j32N22l07k49M91k07k44M44j93l23N05p2m48M30K0l93L96
$$ 269 -102 -156 278 -101 -233 289 -18 -267 224 17 -227 217 24 -299 206 134 -314 116 136 -257 139
4221A39J4m66L97J69n26K58K46m57K26K57n16J97L87n10M1M04l89PM01m19n7N03
$$ 139 153 -313 84 253 -273 -15 231 -226 0 257 -259 -62 325 -185 -144 260 -129 -122 279 -140 -197 306
4243C06l61j84M76k51k08M66k53k77N20j45l74M29m4l50M12n4m07M17Q3m69L03
$$ 306 -55 -239 237 -14 -222 244 -9 -286 234 89 -285 144 100 -250 162 108 -299 118 201 -268 35
4264C5J65m35K77J75m78K49L00m99J22L36m20R5L52m59K1M63l90j20M61l06j23
$$ 35 200 -235 42 217 -261 -12 288 -211 -89 247 -173 -78 274 -185 -164 299 -91 -211 250 -56 -179
4285a79M47l22k07N19k18l09M53j28l02M34j06l81M47J2m24L37Q6l96L22J04m47
$$ -179 268 -54 -261 258 40 -269 184 56 -246 188 82 -299 148 160 -264 73 159 -237 85 189 -258
4306b58K80K30m56J63K76m16J35K99m43Q3L87l91n2M07l41p0M21l33j54M80k38
$$ -258 22 252 -204 -41 235 -181 -46 253 -190 -107 280 -111 -163 244 -97 -167 254 -79 -233 247 9
4327Ik66M54j65k62M33j36l45M46l7l98L80K6l96L59O4m26L10J69m52K25K24m18
$$ 9 -257 197 32 -230 203 67 -278 168 131 -267 113 139 -257 102 166 -260 50 219 -233 -8 216 -202
4349b02J86K59m29J13L33m12M6L51l71J1L63l44p3M20k95j64M23k30k02M30j82
$$ -202 -16 243 -186 -73 260 -152 -106 245 -126 -115 248 -96 -169 251 -44 -208 215 -15 -217 213 31
4370C1k81M35j23l26M18m7l60L72K5m00L49Q2m24K95J56m29K27K07m16J81K58
$$ 31 -250 185 62 -264 154 107 -253 119 144 -256 93 175 -249 46 202 -227 0 207 -209 -28 230
4391B30m20J05L41m15M1L61l49k4L63l14q0L94k74j57M19k27k13L97j69k48M23
$$ 230 -190 -85 256 -159 -118 243 -106 -130 233 -81 -161 233 -41 -198 221 -6 -219 178 9 -239 184
4412A84j11l23L87k6l53L41K1l69L30Q8m10K65J88m15K04K09m14J80K72m32R5
$$ 184 73 -250 137 111 -242 99 120 -249 81 169 -241 24 212 -203 1 210 -204 -24 248 -184 -89
4433h9L26l68K5L44l62j6L91l21j10M00k37j61L85k23k01M26j63k89L86o1k97
$$ -89 237 -131 -106 238 -124 -140 251 -70 -180 220 -17 -178 207 -16 -217 209 46 -243 143 82 -215
4454b15L41l6l32L55L9m02K91J20l62K33J35l87K23K25m17J22K87l63Q0K85l80
$$ -215 126 90 -242 113 152 -250 41 161 -201 32 167 -220 3 228 -189 -67 220 -143 -63 222 -158
4475a58M9L57l47p5L88k71r3L57k76j38M31k14k51M10j22k53L57j07k87L89j5
$$ -158 -109 248 -99 -174 214 -57 -150 207 -69 -207 224 10 -241 169 47 -206 151 44 -243 146 131
4496A31l71L15P1l47K62Q1l71K66J71m05J72K17l35J18K24l67R8L15l59k2L38
$$ 131 -240 75 146 -201 61 142 -229 37 208 -197 -25 192 -143 -25 199 -168 -70 245 -114 -136 202
4517B02k85m4L34k96q3L94k34k01L70j53j89L46j54k46M11o6l39L30K3l19K92
$$ 202 -83 -127 207 -89 -172 222 -12 -213 157 4 -185 161 7 -239 172 106 -233 97 120 -199 93
4538I3L1l59L07J29m04J96J81l35J55J92l70J35K81l55J1L22k99JK96l13l2L63
$$ 93 124 -235 72 201 -203 -7 174 -161 -6 186 -184 -49 232 -123 -112 210 -89 -88 208 -105 -137 226
4560B26k56j52L51j85j48L46j87k23L96j05k90L34l2k72L06rl37L26R1l79K17
$$ 226 -30 -182 169 -16 -164 182 -5 -228 168 63 -227 107 75 -197 109 100 -237 89 180 -199 18
4581A8J56l47J97J64l87J80K52l68N7K76l06M7K77l37nL39k70j02L36k00j14L28
$$ 18 174 -173 24 188 -199 -19 233 -135 -78 198 -108 -61 216 -121 -126 213 -57 -159 177 -23 -137 191
4603A91k10j70L63j30k41L21p7k32L13n9l08L32L8l42K52Q3l22K29J23l55K11
$$ 191 -19 -189 174 44 -197 124 47 -185 128 69 -239 93 131 -211 41 124 -198 31 154 -201 10
4624A0J87l56J28K14l17R6K50l38L2L20l15l5L14k54p0L33k41j22L59j86j94L44
$$ 10 197 -159 -31 183 -134 -38 212 -126 -94 226 -89 -124 190 -64 -134 199 -42 -164 195 9 -185 159
4646A59j27k12L22r8k56L19j4k94K84K5k99K52O9l23K16J40l51J63J91l27J33
$$ 159 32 -180 142 44 -212 107 93 -201 83 108 -191 61 130 -193 23 163 -188 -25 166 -161 -28
4667b8K12l26Q6K69l12J2K96k92k9L26k65q2L30k20j37L39j70j80L28j19k25L24
$$ -28 184 -142 -56 213 -99 -87 209 -83 -112 214 -51 -133 197 -23 -160 179 9 -171 157 38 -187 137
4689A37p5k59L16k8l02K85L7l06K50P2l15K15J24l14J48J72l02J10K11l16P9K59
$$ 137 62 -197 119 91 -211 74 111 -195 55 127 -188 27 151 -163 -15 157 -145 -35 176 -140 -61 198
4711A98l02OK88k41o0L02k38p9L15j98j46L18j27j95L10j14k30L28o7k79K95Q
$$ 198 -104 -98 190 -51 -111 191 -47 -126 189 -9 -155 163 36 -159 151 37 -193 135 68 -211 84 92
4733I2k84K58M4l08K51R6l35J87J67l20J30J84l13J02K41l20L2K64k38k9K73k56
$$ 92 -192 66 110 -198 53 149 -186 1 168 -152 -22 162 -151 -49 192 -128 -96 168 -70 -99 174 -82
4755h2l7L03k21j20L18j60j41K88j42j78L35j01k46K82jk74K67nk78K72N7l21
$$ -82 -119 184 -37 -157 161 1 -140 148 6 -172 163 62 -184 98 97 -177 90 85 -193 79 136 -185
4777a85K01J23k91J62J43l20J49K17l38N9K57k71K4K38k78OL01k44j00L01j69
$$ -185 16 139 -152 10 153 -167 -18 199 -139 -80 177 -94 -70 168 -110 -104 197 -47 -147 154 -15
4798a5j18K79j73j41L31j21k18K93m4k24K54l4k48K80K1l03K12Q2k76J94R5l13
$$ -15 -133 146 -27 -168 163 42 -176 117 73 -151 103 69 -179 101 122 -181 31 113 -163 31 126 -187
4820a87J85J84l39J00K13k82P0K10k75M2K89k84n1K87j99o9K66k08j09L26j47
$$ -187 -2 182 -157 -57 156 -126 -56 154 -121 -79 210 -74 -125 162 -37 -106 160 -48 -157 169 22
4841B2k03L00r3j76K69q2k18K85mk79K27N8k58K02O1k82K04J32l22J09J89k56
$$ 22 -181 119 26 -150 119 37 -181 104 100 -179 48 106 -152 50 111 -171 33 165 -157 -48 141 -115
4863a15R3J77k98Q3K45k83nK55k13l0K64k23q6L06j68j50K85j24j60K87j20k05
$$ -115 -22 155 -143 -60 185 -98 -103 152 -61 -91 173 -50 -136 170 2 -148 137 13 -147 140 20 -185
4885a85L05l4k71K64J6k48K25Ok58K15R7k91J46J43k62J30J46k76R6K15k60K2
$$ -185 120 86 -185 79 95 -153 72 78 -180 35 132 -159 -13 130 -132 -2 144 -132 -36 179 -81 -59
4907e9K19k35pK36k23n9L03k02j07K90j70j12K73j45j60K82p9k16K67k8k31K49
$$ -59 160 -75 -82 154 -69 -128 175 -27 -134 156 -14 -126 147 2 -158 124 45 -171 96 68 -163 86
4929H6qk55K32O6k86J83R5k72J56J30k74J26J80k75O4J98k43K6K31k48OK41k07
$$ 86 78 -177 55 121 -165 18 113 -159 -3 127 -147 -21 159 -116 -52 146 -97 -71 160 -88 -82 159 -48
4952d8o0K42j52r7K54j52j31K66j03j70K49o6j85K44l2k09K33Rk49K11N3k55J77
$$ -48 -108 134 -18 -115 139 -13 -144 122 19 -151 98 32 -153 91 59 -150 83 92 -157 54 107 -148 29
4975B9R2k70J47J29k66J21J57k55O8J94k34J9K18k26j2K40k05m3K39j66r4K54
$$ 29 121 -149 -2 127 -139 -18 139 -116 -48 146 -88 -69 149 -77 -89 151 -54 -97 142 -24 -118 136
4997A36j40j32K60r5j67K34l6k04K21k3k03K17K2k53J94P0k38J53Q5k32J17J41
$$ 136 -4 -136 124 29 -138 96 60 -144 77 54 -149 68 90 -163 31 101 -137 16 101 -131 -14 127
5019A27k64R3J73k34M8J96k36J2K28k19l3K46j77p6K48j51j04K75j49j43K44o6
$$ 127 -137 -44 129 -105 -57 139 -97 -85 143 -76 -109 137 -40 -116 132 -19 -123 152 3 -140 104 38
5041C8j79K25m6j85K26kk44K00O2k27J57P3k30J49J05k48Q6J69k24N6J66k30M5
$$ 38 -141 84 38 -147 79 77 -167 33 95 -132 25 98 -132 17 122 -126 -40 129 -95 -39 127 -103 -58
5064e8K11k31j5K29j64o9K20j63p1K48j44j22K46r3j43K20p5j76K51l4k20K06
$$ -58 153 -78 -93 136 -28 -97 123 -40 -111 137 -7 -129 117 24 -119 101 26 -150 101 67 -153 53
5086E3L2k13J73K5k09J79R2k62J12J42k16O0J57k40P5J87k31oK07j52m0J93j65
$$ 53 85 -128 45 70 -139 40 132 -130 -18 124 -92 -32 125 -115 -40 147 -84 -90 117 -35 -75 118 -47
5109d7m4K34j57j11K38j08j00K00r2j41K44n1k10K16J1k03J84%k03J90O1k46J36
$$ -47 -91 143 -14 -125 113 5 -95 105 13 -128 116 65 -145 71 82 -121 63 63 -140 50 111 -135 1
5132AJ08k13J03J01k23R8J60k36K7J90j78%J79j80k3K23j59q9K14r1j09J99j06
$$ 1 109 -104 -1 100 -123 -25 135 -101 -74 116 -62 -62 117 -63 -86 137 -22 -111 103 12 -97 102 -4
5155dj17K19n8j69J98qj69J71j8j77J84N6k35J30J00k03J15Q1k12J01J47k26L5
$$ -4 -121 98 40 -129 69 61 -108 63 45 -132 52 108 -127 3 103 -100 15 96 -116 -15 132 -94 -59
5178e9J68j83K9J53j83nK12j63o1K00j20p9K02j14j13K25p8j57J98k1j55J75k2
$$ -59 109 -74 -45 108 -75 -80 132 -31 -92 108 -12 -91 111 -3 -116 109 31 -126 72 51 -104 71 49
5201D9j64J83L0k25J42O4j91J29P1k06J06J19j97M3J58j89L4J61j96RJ87j72m8
$$ 49 -115 68 98 -127 15 79 -112 17 88 -118 -12 107 -90 -47 111 -78 -44 117 -79 -70 117 -55 -103
$$ [...]
8191c5
##END NTUPLES=NMR FID
##END=
