##TITLE=1H_LY-13.Dix.1B
 CD3CN, 8 sc, 
 1.06.2021
##JCAMPDX= 6.0         $$ Bruker NMR JCAMP-DX V2.0
##DATA TYPE= NMR FID
##DATA CLASS= NTUPLES
##ORIGIN= UXNMR, Bruker Analytische Messtechnik GmbH
##OWNER= root
$$ XWIN-NMR		Version 3.5
$$ Tue Jun  1 10:31:16 2021 Russian Standard Time (UT+4h)  she@DPX200
##.OBSERVE FREQUENCY= 200.131506
##.OBSERVE NUCLEUS= ^1H
##.DELAY= (6, 6)
##.ACQUISITION MODE= SIMULTANEOUS
##.ACQUISITION SCHEME= undefined
##.AVERAGES= 8
##.DIGITISER RES= 18
##SPECTROMETER/DATA SYSTEM= spect
##.PULSE SEQUENCE= zg30
##.SOLVENT NAME= CDCl3
##.SHIFT REFERENCE= (INTERNAL, CDCl3, 0, 15.7039)
##AUDIT TRAIL= $$ (NUMBER, WHEN, WHO, WHERE, WHAT)
$$ ##TITLE= Audit trail, XWIN-NMR		Version 3.5
$$ ##JCAMPDX= 5.01
$$ ##ORIGIN= Bruker BioSpin GmbH
$$ ##OWNER= she
$$ F:/spectra/data/she/nmr/H-F/1/audita.txt
$$ ##AUDIT TRAIL=  $$ (NUMBER, WHEN, WHO, WHERE, WHAT)
(   1,<2021-06-01 10:30:09.64 +0400>,<she>,<DPX200>,
      <created by zg, POWCHK disabled, PULCHK disabled
       configuration hash MD5:
       00 E9 B6 7A A2 85 ED C7 34 08 36 98 17 FE 4E 26
       data hash MD5: 16K
       CD B1 8A 41 13 4A CF 1F BE 6A 33 92 D0 3E E6 F4>)
$$ ##END=
$$ 
$$ hash MD5
$$ CA A2 6D 8D 48 48 37 77 5D A5 78 47 AD D0 03 28
##$RELAX= 
##$RELAX= 
##$RELAX= 
##$RELAX= 
##$RELAX= 
##$RELAX= 
$$ Bruker specific parameters
$$ --------------------------
##$DU= <F:/spectra>
##$EXPNO= 1
##$NAME= <H-F>
##$PROCNO= 1
##$TYPE= <nmr>
##$USER= <she>
##$AMP= (0..31)
100 100 100 100 100 100 100 100 100 100 100 100 100 100 100 100 100 100 
100 100 100 100 100 100 100 100 100 100 100 100 100 100 
##$AQSEQ= 0
##$AQ_mod= 1
##$AUNM= <au_zg>
##$AUTOPOS= <>
##$BF1= 200.13
##$BF2= 200.13
##$BF3= 200.13
##$BF4= 200.13
##$BF5= 200.13
##$BF6= 200.13
##$BF7= 200.13
##$BF8= 200.13
##$BYTORDA= 1
##$CFDGTYP= 0
##$CFRGTYP= 5
##$CHEMSTR= <none>
##$CNST= (0..31)
1 1 145 1 1 1 1 1 1 1 1 1 1 1 1 1 1 1 1 1 1 1 1 1 1 1 1 1 1 1 1 1 
##$CPDPRG= <>
##$CPDPRG1= <>
##$CPDPRG2= <>
##$CPDPRG3= <>
##$CPDPRG4= <mlev>
##$CPDPRG5= <mlev>
##$CPDPRG6= <mlev>
##$CPDPRG7= <mlev>
##$CPDPRG8= <mlev>
##$CPDPRGB= <>
##$CPDPRGT= <>
##$D= (0..31)
0 1.2 0 0 0 0 0 0 0 0.06 0 0.03 0 0 0 0 0.0002 0 0 0 0 0 0 0 0 0 0 0 0 
0 0 0 
##$DATE= 1622529009
##$DBL= (0..7)
120 120 120 120 120 120 120 120 
##$DBP= (0..7)
150 150 150 150 150 150 150 150 
##$DBP07= 0
##$DBPNAM0= <>
##$DBPNAM1= <>
##$DBPNAM2= <>
##$DBPNAM3= <>
##$DBPNAM4= <>
##$DBPNAM5= <>
##$DBPNAM6= <>
##$DBPNAM7= <>
##$DBPOAL= (0..7)
0.5 0.5 0.5 0.5 0.5 0.5 0.5 0.5 
##$DBPOFFS= (0..7)
0 0 0 0 0 0 0 0 
##$DE= 6
##$DECBNUC= <off>
##$DECIM= 32
##$DECNUC= <off>
##$DECSTAT= 4
##$DIGMOD= 1
##$DIGTYP= 9
##$DL= (0..7)
0 120 120 120 120 120 120 120 
##$DP= (0..7)
150 150 150 150 150 150 150 150 
##$DP07= 0
##$DPNAME0= <>
##$DPNAME1= <>
##$DPNAME2= <>
##$DPNAME3= <>
##$DPNAME4= <>
##$DPNAME5= <>
##$DPNAME6= <>
##$DPNAME7= <>
##$DPOAL= (0..7)
0.5 0.5 0.5 0.5 0.5 0.5 0.5 0.5 
##$DPOFFS= (0..7)
0 0 0 0 0 0 0 0 
##$DQDMODE= 0
##$DR= 18
##$DS= 0
##$DSLIST= <SSSSSSSSSSSSSSS>
$$ [...]
##$SUBNAM2= <"">
##$SUBNAM3= <"">
##$SUBNAM4= <"">
##$SUBNAM5= <"">
##$SUBNAM6= <"">
##$SUBNAM7= <"">
##$SUBNAM8= <"">
##$SUBNAM9= <"">
##$SW= 16.9725357007746
##$SWIBOX= (0..15)
0 0 2 0 0 0 0 0 0 0 0 0 0 0 0 0 
##$SW_h= 3396.73913043478
##$TD= 16384
##$TD0= 1
##$TE= 0
##$TE2= 300
##$TE3= 300
##$TEG= 300
##$TL= (0..7)
0 120 120 120 120 120 120 120 
##$TP= (0..7)
150 150 150 150 150 150 150 150 
##$TP07= 0
##$TPNAME0= <>
##$TPNAME1= <>
##$TPNAME2= <>
##$TPNAME3= <>
##$TPNAME4= <>
##$TPNAME5= <>
##$TPNAME6= <>
##$TPNAME7= <>
##$TPOAL= (0..7)
0.5 0.5 0.5 0.5 0.5 0.5 0.5 0.5 
##$TPOFFS= (0..7)
0 0 0 0 0 0 0 0 
##$TUNHIN= 0
##$TUNHOUT= 0
##$TUNXOUT= 0
##$USERA1= <user>
##$USERA2= <user>
##$USERA3= <user>
##$USERA4= <user>
##$USERA5= <user>
##$V9= 5
##$VALIST= <valist>
##$VCLIST= <CCCCCCCCCCCCCCC>
##$VD= 0
##$VDLIST= <DDDDDDDDDDDDDDD>
##$VPLIST= <PPPPPPPPPPPPPPP>
##$VTLIST= <TTTTTTTTTTTTTTT>
##$WBST= 1024
##$WBSW= 4
##$XGAIN= (0..3)
0 0 0 0 
##$XL= 0
##$YL= 0
##$YMAX_a= 140024
##$YMIN_a= -123715
##$ZGOPTNS= <>
##$ZL1= 120
##$ZL2= 120
##$ZL3= 120
##$ZL4= 120
##$ABSF1= 10
##$ABSF2= 0
##$ABSG= 5
##$ABSL= 3
##$ALPHA= 0
##$AQORDER= 0
##$ASSFAC= 0
##$ASSFACI= 0
##$ASSFACX= 0
##$ASSWID= 0
##$AUNMP= <proc_1d>
##$AZFE= 0.1
##$AZFW= 0.1
##$BCFW= 1
##$BC_mod= 2
##$BYTORDP= 1
##$COROFFS= 0
##$CY= 11.3945322036743
##$DATMOD= 1
##$DC= 2
##$DFILT= <>
##$DTYPP= 0
##$F1P= 15.9154993809931
##$F2P= -4.1035820241983
##$FCOR= 0.5
##$FTSIZE= 0
##$FT_mod= 4
##$GAMMA= 1
##$GB= 0.15
##$INTBC= 1
##$INTSCL= 1
##$ISEN= 128
##$LB= 0.24
##$LEV0= 0
##$LPBIN= 0
##$MAXI= 10000
##$MC2= 0
##$MEAN= 0
##$ME_mod= 0
##$MI= 1.114404
##$NCOEF= 0
##$NC_proc= 0
##$NLEV= 6
##$NOISF1= 3.799351
##$NOISF2= 2.8
##$NSP= 1
##$NTH_PI= 0
##$NZP= 0
##$OFFSET= 15.70392
##$PC= 1
##$PHC0= -11198.81
##$PHC1= 8.000993
##$PH_mod= 1
##$PKNL= yes
##$PPARMOD= 0
##$PSCAL= 0
##$PSIGN= 0
##$REVERSE= no
##$SF= 200.130013532006
##$SI= 16384
##$SIGF1= 3
##$SIGF2= 2
##$SINO= 400
##$SIOLD= 16384
##$SREGLST= <1H.CDCl3>
##$SSB= 0
##$STSI= 0
##$STSR= 0
##$SW_p= 3612.71676300578
##$SYMM= 0
##$S_DEV= 0
##$TDeff= 0
##$TDoff= 0
##$TI= <>
##$TILT= no
##$TM1= 0
##$TM2= 0
##$TOPLEV= 0
##$USERP1= <user>
##$USERP2= <user>
##$USERP3= <user>
##$USERP4= <user>
##$USERP5= <user>
##$WDW= 1
##$XDIM= 8192
##$YMAX_p= 0
##$YMIN_p= 0
$$ End of Bruker specific parameters
$$ ---------------------------------
##NTUPLES= NMR FID
##VAR_NAME=  TIME,          FID/REAL,        FID/IMAG
##SYMBOL=    X,             R,               I
##VAR_TYPE=  INDEPENDENT,   DEPENDENT,       DEPENDENT
##VAR_FORM=  AFFN,          ASDF,            ASDF
##VAR_DIM=   8192,          8192,            8192
##UNITS=     SECONDS,       ARBITRARY UNITS, ARBITRARY UNITS
##FACTOR=    0.0002944,     1,               1
##FIRST=     0,             0,               0
##LAST=      2.4114304,     0,               0
##MIN=       0,             -123715,         0
##MAX=       2.4114304,     140024,          0
$$ Real data points
##PAGE= N=1
##DATA TABLE= (X++(R..R)), XYDATA
$$ plain form
0 0 0 0 0 0 0 0 0 0 0 0 0 0 0 8 -8 8 -8 8 -9 16 -16 24 -24 32 -33 40 -48 56 -64 72 -81 94 -105 121 -137
35 -137 153 -172 195 -217 243 -269 300 -332 369 -409 451 -498 549 -605 666 -734 808 -891 981
54 981 -1085 1200 -1329 1477 -1649 1849 -2089 2375 -2732 3190 -3796 4643 -5912 8041 -12483
69 -12483 40331 -96243 -37800 139352 -95241 -38748 125182 -73714 -62859 132778 -56741
80 -56741 -75991 116587 -34076 -81996 113330 -28422 -92657 111472 -4778 -108811 98750
91 98750 14512 -110504 86960 31475 -120742 74244 56989 -120412 46938 72623 -108449
102 -108449 30549 78775 -102823 14835 90623 -92278 -4187 91831 -79256 -12680 94337
113 94337 -76244 -26427 104012 -63768 -46233 103507 -47326 -58345 101780 -33756 -74238
$$ packed form
0@%%%%%%%%%%%%%Qj6J6j6J6j7K5l2M0m8N6o5P3q8J04j20J36j53J75j99K26k58
35a37K90l25L67m12M60n12N69o32P01p78Q60r49J047j154J271j400J542j699J872
54I81k066K285k529K806l126L498l938M464n107N922o986Q439j0555J3953k0524
69a2483N2814j36574N8443J77152k34593N6493J63930j98896J0855J95637j89519
80e6741j9250J92578j50663m7920J95326j41752o4235K04129j16250j04033K07561
91I8750q4238j25016J97464n5485j52217J94986j7255j77401J67350K5685j81072
102a08449J38998M8226j81598J17658P5788j82901Q8091R6018j71087O6576J07017
113I4337j70581M9817J30439j67780J7535J49740j50833j1019J60125j35536m0482
$$ plain form
124 -74238 98447 -11136 -85825 82972 7259 -85876 70644 18196 -88488 60048 32524
135 32524 -87543 45460 40732 -83060 37893 48086 -85239 27761 61999 -82465 11361
146 11361 70807 -74787 -1873 78228 -67901 -18580 84571 -53189 -34465 81251 -38374
157 -38374 -42141 77606 -28483 -50649 74586 -16088 -57412 67801 -6475 -61157 64501
168 64501 2240 -69154 59513 16479 -74454 48881 28894 -75387 38178 40619 -75400
179 -75400 24429 51767 -68963 9483 56319 -60125 -640 58771 -53387 -9739 61105
190 61105 -45626 -18054 61596 -39138 -25066 63986 -32878 -34987 65718 -22619 -45020 63482
202 63482 -10997 -52819 58847 1016 -58728 51155 12970 -60833 41563 22012 -60106
$$ packed form
124g4238J72685j09583p4689J68797p5713r3135J56520n2448j06684J48536k7524
135C2524j20067J33003m728j23792J20953J0193j33325J13000L4238j44464R3826
146A1361N9446j45594P2914Q0101j46129M9321J03151j37760J8724J15716j19625
157c8374l767J19747j06089k2166J25235r0674m1324J25213p4276n4682J25658
168F4501o2261p1394J28667m3034r0933J23335j9987j04281J13565K441j16019
179g5400R9829K7338j20730P8446M6836j16444N9485N9411j12158M3648P0844
190F1105j06731K7572P9650j00734J4072Q9052r6864k109J00705q8337k2401J08502
202F3482p4479m1822J11666n7831n9744J09883l8185p3803J02396j9551q2118
$$ plain form
213 -60106 32879 28775 -58649 25085 34365 -57083 18091 39923 -55822 10425 46297 -53448
225 -53448 1133 52319 -48939 -9503 57142 -41260 -20811 58332 -30846 -29553 55933 -21112
237 -21112 -35543 52598 -12018 -40088 47805 -3939 -42088 43573 1608 -45131 41081 8933
249 8933 -49454 36023 17508 -51449 29803 25112 -53325 22523 34479 -52712 11403 41181
261 41181 -47078 2007 43584 -42106 -5371 46297 -36325 -13372 46200 -29415 -17699 45402
273 45402 -26027 -22646 47828 -20261 -30592 46887 -11712 -35473 44276 -4874 -40894 41777
285 41777 5262 -45608 33747 14630 -44213 26251 19137 -43654 21004 25329 -42647 13068
297 13068 29064 -38668 8673 30653 -38895 4601 36887 -37612 -4265 40618 -32218 -10696
$$ packed form
213f0106R2985m104q7424Q3734R280r1448P5174K1832r5745O6247L5872r9745
225e3448N4581N1186j01258L9436O6645r8402K0449P9143q9178J293Q5486p7045
237b1112j4431Q8141o4616k8070Q7893n1744l8149Q5661m1965m6739Q6212l2148
249H933n8387Q5477j8515o8957Q1252m691p8437P5848J1956q7191O4115K9778
261D1181q8259M9085M1577q5690L6735N1668q2622K2953N9572p5615J1716O3101
273D5402p1429L381P0474o8089j0331P7479n8599k3761P9749m9150l6020Q2671
285D1777l6515n0870P9355j9117n8843P0464p114o2791O4658M325o7976N5715
297A3068J5996o7732M7341K1980o9548M3496L2286p4499L3347M4883p2836K1522
$$ plain form
309 -10696 42272 -28619 -18084 45416 -20927 -26974 42329 -11615 -29628 38190 -6915 -32568
321 -32568 36589 80 -35965 31143 6004 -35139 27935 8781 -37988 26066 16579 -40523
333 -40523 18550 22976 -38254 12992 26932 -38299 6480 33851 -34497 -3668 35204 -27127
345 -27127 -8083 34174 -24437 -12421 36303 -19351 -18374 34315 -14103 -19813 33945 -12606 -24906
358 -24906 36051 -5700 -31235 32115 1445 -32519 29080 6016 -36182 25769 14607 -37229
370 -37229 17192 19410 -33149 12678 20794 -32941 8872 25651 -30756 2129 26756 -26733
382 -26733 -150 27913 -27145 -4829 33036 -23147 -12830 32955 -16954 -16274 32458 -13580
394 -13580 -21618 32874 -6058 -26381 27690 -65 -25625 24773 1937 -27819 23546 7472
$$ packed form
309a0696N2968p0891J0535O3500o6343o047O9303n3944j8013O7818m5105k5653
321c2568O9157l6509l6045O7108k5139m1143O3074j9154m6769O4054r487n7102
333d0523N9073M426o1230N1246J3940o5231M4779K7371o8348L0829L8872o2331
345b7127J9044M2257n8611J2016M8724n5654R77N2689m8418n710N3758m6551j2300
358b4906O0957m1751k5535O3350l0670l3964O1599k3064m2198O1951j1162n1836
370c7229N4421K218n2559M5827Q116n3735M1813J6779n6407L2885K4627n3489
382b6733K6583K8063n5058K2316L7865n6183J0317M5785m9909O80M8732m6038
394a3580q038N4492l8932k0323N4071k7755k5560N0398k2836k9756N1365j6074
$$ plain form
406 7472 -29589 18736 11023 -28555 16899 13480 -31241 14150 20191 -31443 7078 23868 -28223
419 -28223 2626 26090 -26849 -2915 29578 -22025 -9469 28249 -16493 -11279 26998 -14586
431 -14586 -14291 27856 -10352 -18032 25892 -6505 -19349 25419 -4012 -23335 25086 2141 -26600
444 -26600 20860 7309 -26779 17537 11130 -27932 13491 16221 -26759 7812 18238 -24019
456 -24019 5030 19403 -23494 1967 22085 -21762 -2071 23167 -19734 -4797 24988 -18450
468 -18450 -9512 27195 -14208 -14599 26360 -9396 -17531 25022 -5188 -20506 22915 -64 -21881
481 -21881 19220 3370 -21651 16946 5841 -22478 14783 9165 -22820 11934 11864 -22924 9540
494 9540 15027 -23388 5800 18770 -22132 1088 21054 -19698 -3095 22377 -16798 -7039 22676
$$ packed form
406G472l7061M8325p713l9578M5454l419m4721M5391O041n1634L8521J6790n2091
419b8223L0849K3464n2939K3934L2493n1603J2556L7718m4742N214L8277m1584
431a4586K95M2147l8208p680M3924l2397j2844M4768k9431j9323M8421k2945k8741
444b6600M7460j3551l4088M4316o407l9062M1423K730m2980L4571J0426m2257
456b4019K9049J4373m2897K5461K0118m3847J9691K5238m2901J4937K9785m3438
468a8450Q938L6707m1403l91M0959l5756q135M2553l0210j5318M3421k2979k1817
481b1881M1101j5850k5021L8597j1105k8319L7261n618l1985L4754p0l4788L2464
494I540N487l8415K9188J2970m0902K3220J9966m0752J6603K5472l9175R759K9715
$$ plain form
507 22676 -13356 -9998 21964 -10525 -12053 21497 -8111 -14241 21150 -5499 -16570 20662 -2363
520 -2363 -19122 19473 1579 -21183 17174 5658 -22312 14121 9697 -22439 10076 12986 -20928
533 -20928 6258 14717 -19250 3348 16232 -17744 344 17328 -15855 -1962 18053 -14874
545 -14874 -4428 19907 -13247 -8381 20819 -9979 -11597 20420 -7037 -14471 20036 -3160 -17312
558 -17312 17678 903 -17773 15034 2990 -18239 13666 5746 -19157 10983 8402 -18447
570 -18447 8940 9866 -18952 7354 13248 -19198 3320 16002 -16970 -46 17014 -15427 -3091
583 -3091 18854 -12713 -7278 18360 -8726 -8827 16829 -7173 -10144 17173 -4858 -12732 15872
596 15872 -1996 -13350 14852 -880 -15298 15049 2609 -17895 12245 6317 -17557 9722
$$ packed form
507B2676l6032L358L1962l2489j528L3550k9608o130L5391k6649j1071L7232k3025
520b363j6759L8595j7894k2762L8357j1516k7970L6433m424l2136L2515K910l3914
533b0928K7186Q459l3967K2598J2884l3976J8088J6984l3183J3893K0015l2927
545a4874J0446K4335l3154M866K9200l0798j618L2017k7457p434L4507k3196j4152
558a7312L4990j6775j8676L2807j2044k1229L1905p920k4903L0140k581k6849
570a8447K7387R26k8818K6306N894l2446K2518J2682l2972J6924J7060l2441J2336
583c091K1945l1567N435K5638k7086j01K5656k4002k971K7317k2031p874K8604
596A5872j7868j1354K8202j5732j4418L0347j2440k0504L0140n928k3874K7279
$$ plain form
608 9722 8068 -18139 7796 11580 -17874 3489 13317 -15029 1390 13135 -14464 40 15186
621 15186 -13324 -3279 15592 -10751 -4483 15623 -10386 -6722 17653 -7738 -10701 16572 -3857
634 -3857 -11686 15015 -2222 -13413 14587 1351 -15213 11271 4155 -13971 9380 4464 -14689
647 -14689 8875 7213 -15462 5854 8963 -14164 4687 9707 -15210 3212 13221 -14697 -1076
660 -1076 14468 -11772 -2917 14460 -10935 -5094 16041 -8193 -8328 14616 -5034 -8322 13529
673 13529 -4663 -9647 14344 -2134 -11947 12459 375 -11830 11568 1251 -13692 11178
685 11178 4877 -15081 7647 7365 -13684 5638 8146 -14009 3871 10802 -13075 286 11184
698 11184 -10631 -546 10875 -10874 -1690 12956 -9739 -4594 13070 -7634 -5459 13335 -7193
$$ packed form
608I722j654k6207K5935L784k9454K1363R828k8346J6419J1745k7599J4504J5146
621A5186k8510J0045J8871k6343O268K0106k6009L664K4375k5391k963K7273k0429
634c857p829K6701j7237j1191K8000j3236j6564K6484p116j8126K3351m916j9153
647a4689K3564j662k2675K1316L109k3127J8851N020k4917J8422J0009k7918J3621
660a076J5544k6240Q855J7377k5395N841K1135k4234j35K2944j9650l288K1851
673A3529j8192m984K3991j6478r813K4406j2084j2205K3398j0317j4943K4870
685A1178o301j9958K2728k82k1049J9322K508k2155J7880O931k3877J3361J0898
698A1184k1815J0085J1421k1749R184J4646k2695N145J7664k0704K175J8794k0528
$$ plain form
711 -7193 -7714 14729 -4289 -10623 13123 -1204 -10829 11834 53 -12063 11131 2957 -12870
724 -12870 8350 4687 -11742 7094 5066 -12418 6268 7375 -12653 3638 8659 -11605 2265
737 2265 9577 -11840 225 11805 -10468 -3064 12069 -8014 -4476 11817 -6874 -6089 12236
750 12236 -4708 -7806 11172 -2848 -7985 10794 -2147 -9255 11010 -70 -10693 9806 1877
763 1877 -11128 8933 3482 -12237 7621 6055 -12445 5032 7682 -11480 3115 8563 -10882
776 -10882 1206 9594 -9640 -771 9666 -8383 -1807 9925 -7828 -3262 10688 -6600 -5071
789 -5071 10828 -5085 -6497 10900 -3484 -8162 10572 -1253 -9347 9446 717 -9797 8293
802 8293 2314 -10119 7081 3764 -10100 5855 4853 -10080 4825 5982 -10183 3581 7261
$$ packed form
711g193n21K2443j9018o334K3746j4327r625K2663j1781j2116K3194q174j5827
724a2870K1220l663j6429J8836k028j7484J8686J107k0028J6291N021k0264J3870
737B265P312k1417J2065J1580k2273P404J5133k0083L538J6293j8691P85J8325
750A2236j6944l098J8978j4020n137J8779j2941p108K0265j1080j0623K0499p929
763A877j3005K0061n451j5719J9858j566j8500J7477K650j9162J4595N448j9445
776a0882J2088Q388j9234Q869J0437j8049O576J1732j7753M566J3950j7288J529
789e071J5899j5913j412J7397j4384m678J8734j1825q094J8793q729j0514J8090
802H293n979j2433J7200l317j3864J5955j002j4933J4905J157j6165J3764L680
$$ plain form
815 7261 -10137 2053 8594 -9758 80 9750 -8691 -2035 10246 -7214 -3832 10328 -5548
828 -5548 -5397 9861 -3764 -6268 9093 -2560 -6887 8789 -1333 -7848 8226 211 -8388 7495
842 7495 1370 -9046 7028 3115 -9893 5587 5015 -9649 3956 6065 -9382 2674 7383
855 7383 -8962 718 8107 -7643 -487 8001 -7183 -1239 8800 -6712 -2946 9196 -5347
868 -5347 -4063 9057 -4670 -5260 9663 -3189 -7235 8964 -889 -7772 7675 212 -8180 7184
882 7184 1899 -8903 5516 3520 -8113 4227 3738 -8086 3974 5036 -8500 2378 6250
895 6250 -7643 1299 6582 -7739 417 8195 -7325 -1978 8757 -5452 -3146 8263 -4781
908 -4781 -3996 8804 -3566 -5687 8097 -1800 -5791 7265 -1572 -6381 7680 -219 -7784 6576
$$ packed form
815G261j7398J2190O541j8352R838R670j8441O656J2281j7460L382J4160j5876
828e548J51J5258j3625k504J5361j1653m327J5676j0122o515J6074q015q599J5883
842G495o125j0416J6074l913j3008J5480n72j4664J3605K109j5447J2056M709
855G383j6345R680P389j5750P156Q488j5184N944J0039j5512L766J2142j4543
868e347J284J3120j3727n90J4923j2852m046J6199r853o883J5447p463q392J5364
882G184n285j0802J4419j996j1633J2340m89j1824J2060J062j3536J0878L872
895F250j3893Q942N283j4321Q156P778j5520N347J0735j4209K306J1409j3044
908d781P85J2800j2370k121J3784r897l991J3056q837m809J4061p899p565J4360
$$ plain form
922 6576 1539 -7621 5651 2084 -8274 5314 4100 -8867 3111 5582 -7574 1747 5665 -7318
936 -7318 946 6932 -6725 -1068 7052 -5100 -1495 6644 -5195 -2107 7825 -4468 -4018 7677
950 7677 -2898 -4447 7374 -2622 -5597 7979 -860 -7222 6619 974 -6893 5626 1335 -7414
964 -7414 5392 3022 -7877 3521 3988 -6825 2877 3927 -7265 2533 5571 -7314 533 6256
978 6256 -6036 -221 6380 -6084 -1347 7714 -4881 -3478 7242 -2971 -3729 6590 -2695 -4459
992 -4459 7028 -1302 -5669 5921 -50 -5310 5495 -22 -6133 5806 1532 -7118 4428 2752
1006 2752 -6692 3818 3215 -7368 3169 5030 -7311 1091 5671 -6001 317 5596 -5920 -457
1020 -457 6574 -5112 -2048 6347 -3871 -2282 6227 -3845 -3179 7011 -2649 -4717 6399 -1186
$$ packed form
922F576n037r160J3272l567j0358J3588j214j2967J1978K471j3156R321L918j2983
936g318Q264N986j3657N657Q120j2152L605Q139j1839L088R932j2293M50J1695
950G677j0575j549J1821r996k975J3576q839o362J3841n645p867J2519m291q749
964g414J2806k370j0899J1398M67j0813R702J050j1192R798L038j2885P847N723
978F256j2292N815O601j2464M737R061j2595J403J0720j0213p58J0319r285j764
992d459J1487q330m367J1590n971n260J0805n517o111J1939m274q650J1546j676
1006B752r444J0510o03j0583J0537J861j2341Q402M580j1672O318N279j1516N463
1020d57P031j1686L064Q395j0218J589Q509j0072O66J0190r660k068J1116p585
$$ plain form
1034 -1186 -4959 5967 -565 -5846 5804 1100 -6548 4380 2254 -6050 3608 2588 -6293 3112
1048 3112 3738 -6261 1851 4215 -5689 1420 4514 -5999 767 5699 -5734 -705 6145 -4853
1062 -4853 -1578 6385 -4363 -2701 6810 -3168 -3906 6306 -1929 -4247 5853 -1272 -4814 5640
1076 5640 -192 -5348 4905 685 -5456 4468 1354 -5920 3973 2508 -6196 2973 3455 -6047 2073
1091 2073 4249 -5903 978 5040 -5333 -164 5338 -4627 -963 5482 -4094 -1667 5675 -3524
1105 -3524 -2377 5791 -2972 -3125 5959 -2271 -3975 5908 -1355 -4743 5661 -297 -5425 5105 841
1120 841 -5775 4259 1782 -5825 3461 2616 -5805 2530 3330 -5450 1684 3698 -5191 1136 4304
1135 4304 -5124 203 4945 -4556 -718 5238 -4088 -1537 5742 -3416 -2742 5787 -2270 -3423 5354
$$ packed form
1034a186l773J0926o532n281J1650m704p648J0928k126q304R658j020q881R405
1048C112O26r999Q112K364r904P109L094j0513O766M932j1433N029O850j0998
1062d853L275P963j0748J662R511r978p38J0212q235k318J0100p125l542J0454
1076E640n832n156J0253m220o141R924l114p274R893j465q704R169M82r502Q120
1091B073K176j0152O881M062j0373N169N502r965L664O445r576K427P342r199
1105c524J147Q168q763j53R084q230j704R883p263l388J0404n958n128J0530m264
1120H41o616J0034k477p607R286q45q421Q335Q00q780P134K014q889O327L168
1135D304r428N327M742r501L838N956r326K551P279r158O74Q529q057j153Q777
$$ plain form
1150 5354 -1584 -3847 5293 -820 -4581 4821 189 -4706 4235 556 -4966 4200 1389 -5653 3441
1165 3441 2476 -5522 2599 2945 -5614 2077 4024 -5667 637 4760 -4653 -352 4636 -4169 -814
1180 -814 5136 -3688 -1981 5162 -2555 -2366 4756 -2341 -2716 5272 -1700 -3908 5024 -411 -4175 4398
1196 4398 -26 -4575 4489 1015 -5427 3469 2260 -5013 2528 2356 -5013 2356 3209 -5272 1156
1211 1156 3853 -4480 561 3706 -4575 326 4673 -4510 -1122 5095 -3334 -1763 4833 -3038 -2315
1226 -2315 5402 -2175 -3622 4915 -719 -3633 4157 -484 -3840 4338 404 -4611 3483 1427 -4220
1241 -4220 2883 1403 -4528 2962 2438 -5087 1783 3315 -4475 1103 3348 -4628 690 4370 -4430
1256 -4430 -801 4599 -3286 -1217 4203 -3231 -1549 4854 -2687 -2695 4590 -1633 -2743 4281 -1590 -3261
$$ packed form
1150E354o938k263R140o113l761R402m632m895Q941l679n522R166k811p042R094
1165C441r65p998Q121L46q559P691J947r691O304M123r413M301M988q805L355
1180h14N950q824J707P143p717J89P122p097l75P988o972k208Q932n435l764Q573
1196D398m424m549R064l474o442Q896j209p273P541j72p369P369Q53q481O428
1211A156K697q333N041L145q281M901M347r183L388O217q429J571O596p871P23
1226b315P717p577j447Q537n634k914P790m641l356Q178l934n015Q094k056n647
1241d220P103j480n931P490n24p525O870J532p790N578K245p976N318L680q800
1256d430L629N400p885K069N420p434J682O403p541qP285o223j110P024n871j671
$$ plain form
1272 -3261 4775 -595 -4289 4039 613 -4084 3465 847 -4470 3358 2068 -4842 2009 2819 -4053
1287 -4053 1416 2682 -4162 1191 3536 -4130 0 3780 -3357 -284 3665 -3599 -732 4555 -3198
1302 -3198 -2056 4508 -2144 -2336 4245 -1998 -2903 4638 -1041 -3814 3942 1 -3590 3510 116
1317 116 -3919 3575 1073 -4376 2677 1819 -3952 2286 1968 -4274 2022 2998 -4371 802 3542 -3663
1333 -3663 179 3580 -3557 -428 4183 -3031 -1534 4025 -2163 -1767 3770 -2045 -2168 4088 -1477
1348 -1477 -2948 3784 -742 -3060 3609 -488 -3571 3684 387 -4116 3035 1220 -4025 2567 1664
1363 1664 -4186 2125 2479 -4105 1235 2906 -3619 737 3068 -3505 269 3534 -3212 -505 3695
1378 3695 -2731 -1025 3822 -2428 -1707 4028 -1796 -2456 3830 -1040 -2874 3552 -479 -3260 3267
$$ packed form
1272c261Q036n370l694Q328l426m697P549k618n317P828j290o910O851Q10o872
1287d053N469J266o844N353K345p666M130L780p137L073L949p264K867N287p753
1302c198J142O564o652j92O581o243r05P541n679k773P756l941l591P100l394
1317A16m035P494k502n449P053q58n771O238l18o242O296R76p369N173K740p205
1333c663L842L401p137L129M611p214J497N559o188L96N537n815j23O256n565
1348a477j471O732m526k318O669m097l083P255l297m503P151j815n245O592r03
1363A664n850O311L54o584N340J671o525M356K331o573L774L265o746K707M200
1378C695o426J706M847o250P21N735n824o60O286m870j834O426m031k781O527
$$ plain form
1393 3267 186 -3528 2818 744 -3595 2449 1189 -3688 2110 1688 -3727 1714 2167 -3753 1268
1408 1268 2718 -3678 670 3197 -3433 19 3564 -3039 -688 3765 -2468 -1304 3704 -1943 -1737
1423 -1737 3659 -1487 -2242 3538 -881 -2611 3243 -466 -2892 3130 48 -3362 2769 792 -3497
1438 -3497 2249 1256 -3549 1896 1837 -3680 1222 2431 -3340 616 2576 -3087 356 2921 -3004 -253
1454 -253 3214 -2515 -653 3184 -2357 -928 3577 -2120 -1730 3689 -1323 -2185 3355 -941 -2467 3406
1470 3406 -386 -3091 2944 496 -3101 2315 701 -3099 2210 1200 -3441 1545 1847 -3085 1005
1485 1005 1867 -3080 906 2465 -3227 61 3005 -2575 -499 2863 -2378 -719 3305 -2124 -1574
1500 -1574 3317 -1234 -1762 2900 -1142 -1833 3211 -806 -2559 2968 -12 -2569 2528 31 -2732
$$ packed form
1393C267l081l714O346k074m339O044j260m877N798m22n415N441M53n920N021
1408A268J450o396M348K527o630L452L545o603K351M453o233J164N008n647K06
1423a737N396n146p55N780m419j730N854l709k426O022l082l410O131j977m289
1438c497N746r93m805N445n9n517M902J209n771L956J960n663L443K565n925K751
1454b53L467n729J862L837n541J429M505n697L90N419n012q62N540m296j526N873
1470C406l792k705O035k448l597N416j614l800N309j010m641M986L02m932M090
1485A005Q62m947L986J559n692L288K944n580K076L362n241J659M024n429N50
1500a574M891m551n28M662m042o91N044m017j753N527k980k557N097k497k763
$$ plain form
1515 -2732 2714 625 -3370 2068 1467 -3081 1420 1505 -3076 1298 2146 -3236 337 2613 -2486 -153
1531 -153 2327 -2368 -192 2807 -2284 -1060 2945 -1498 -1297 2655 -1463 -1471 3122 -1059 -2339 2877
1547 2877 -142 -2328 2414 -76 -2488 2590 502 -3022 1963 1201 -2651 1480 1094 -2734 1557
1562 1557 1664 -3013 810 2105 -2521 445 2008 -2629 263 2676 -2535 -712 2839 -1715 -1018
1577 -1018 2544 -1600 -1275 2899 -1115 -2024 2552 -327 -1903 2188 -367 -2083 2430 203 -2601
1592 -2601 1905 790 -2342 1611 765 -2575 1675 1450 -2859 907 1894 -2384 574 1827 -2462 391
1608 391 2361 -2333 -400 2406 -1711 -524 2196 -1796 -720 2644 -1494 -1445 2509 -852 -1510 2302
1624 2302 -789 -1834 2520 -193 -2387 2001 472 -2207 1645 563 -2354 1572 1139 -2489 934
$$ packed form
1515b732N446k089l995N438o01m548M501Q5m581M374Q48n382L573K276n099K333
1531a53K480m695K176K999n091J224M005m443K01L952m118qM593m181j280N216
1547B877l019k186M742k490k412N078k088l524M985p62l852M131l86l828M291
1562A557J07m677L823J295m626K966J563m637K892K413n211J823L551m554O97
1577a018L562m144L25M174m014r09M576k879j576M091k555j716M513k227k804
1592b601M506j115l132L953q46l340M250k25m309L766R87m278K958J253m289K853
1608C91J970m694J933K806m117J187K720l992J076L364m138M9L954l361o58L812
1624B302l091j045M354k713k194M388j529k679L852j082k917L926m33l628L423
$$ plain form
1639 934 1483 -2096 683 1429 -2176 586 1895 -2188 -2 2085 -1809 -219 2086 -1826 -512 2449
1655 2449 -1538 -1122 2399 -1008 -1292 2215 -857 -1512 2278 -464 -1882 1998 -8 -1879 1791 152
1671 152 -2059 1705 592 -2251 1320 987 -2171 1017 1235 -2206 717 1641 -2130 205 1885 -1829
1687 -1829 -155 1956 -1618 -469 2057 -1364 -790 2058 -1108 -989 2049 -890 -1231 2078 -640 -1507
1703 -1507 2031 -324 -1747 1915 15 -1940 1729 356 -2047 1487 692 -2122 1187 1023 -2089
1718 -2089 829 1233 -1966 585 1438 -1935 257 1691 -1725 -80 1765 -1577 -329 1957 -1426
1733 -1426 -759 2101 -1007 -1110 1953 -701 -1266 1940 -446 -1577 1819 -25 -1676 1517 145 -1677
1749 -1677 1528 357 -1936 1319 769 -1904 1007 861 -1887 982 1158 -2092 557 1577 -1831 135
$$ packed form
1639I34N49l579K779P46l605K762J309m083K186K087l894J590K305l912J314K961
1655B449l987M16L521l407k84L507l072o55L790k742j418L880k006j871L670j639
1671A52k211L764j113k843L571l33l158L188K18l441K923R24l771K335J680l714
1687a829J674K111l574J149K526l421N74K848l166J19L038k939l41L309k718q67
1703a507L538k355j423L662j900j955L669j373k403L534p95k814L309j64l112
1718b089K918M04l199K551Q53l373K192J434l416J645J845l342J248K286l383
1733a426O67K860l108j03L063k654n65L206k386j131L396j844j651L193j372j822
1749a677L205j171k293L255n50k673K911j46k748K869J76l250K649J020l408J966
$$ plain form
1765 135 1571 -1670 -19 1799 -1596 -520 1938 -1100 -788 1700 -970 -829 1885 -819 -1304 1865
1781 1865 -287 -1441 1556 -157 -1491 1673 131 -1915 1387 700 -1805 973 724 -1727 1000
1796 1000 1018 -1965 571 1403 -1619 234 1247 -1557 324 1531 -1705 -170 1778 -1274 -415 1600
1812 1600 -1244 -467 1928 -1157 -1094 1931 -528 -1234 1563 -444 -1236 1730 -192 -1708 1464 396
1828 396 -1591 1061 352 -1547 1200 667 -1890 788 1136 -1598 445 1040 -1588 496 1431 -1741
1844 -1741 -81 1720 -1235 -351 1476 -1176 -330 1747 -1132 -855 1754 -629 -920 1470 -679 -930
1860 -930 1758 -495 -1448 1590 41 -1426 1273 41 -1503 1400 393 -1867 973 900 -1607 625
1876 625 835 -1587 623 1208 -1670 97 1443 -1234 -110 1277 -1238 -122 1626 -1204 -633 1700
$$ packed form
1765A35J436l241J651J818l395J076K458l038L12K488k670J41K714k704m85L169
1781A865k152j154K997j713j334L164j542k046L302o87k505K778k49k451K727
1796A000J8k983K536Q32l022J853J013k804J881J207l236J535J948l052Q59K015
1812A600k844P77K395l085O3L025k459p06K797k007p92K966j922j516L172j068
1828C96j987K652p09j899K747n33k557K678L48k734K043N95k628K084R35l172
1844a741J660J801k955Q84J827k652Q46K077k879K77K609k383k91K390k149k51
1860i30K688k253r53L038j549j467K699j232j544K903j007k260K840p3k507K232
1876F25K10k422K210N85k878J767J346k677J124J387k515J116J748k830N71K333
$$ plain form
1892 1700 -738 -767 1514 -731 -866 1735 -486 -1336 1533 -29 -1279 1279 -62 -1368 1393 238
1908 238 -1671 1052 581 -1467 829 514 -1562 871 902 -1709 420 1180 -1424 201 1154 -1455 70
1925 70 1520 -1321 -453 1577 -875 -587 1437 -806 -699 1625 -561 -1077 1480 -171 -1061 1323 -160
1942 -160 -1208 1421 118 -1507 1153 444 -1428 946 477 -1532 911 794 -1634 518 1028 -1431
1958 -1431 302 1019 -1421 180 1254 -1344 -160 1344 -1084 -301 1337 -1026 -457 1534 -826 -808
1974 -808 1528 -471 -964 1429 -295 -1117 1408 15 -1318 1208 302 -1345 1006 451 -1380 850
1990 850 667 -1434 637 839 -1390 429 955 -1384 252 1108 -1349 21 1240 -1252 -223 1356
2006 1356 -1084 -448 1401 -887 -622 1406 -701 -811 1398 -453 -956 1315 -254 -1034 1303 -53
$$ packed form
1892A700k438k9K281k245j35K601k221q50K869j562j250K558j341j306K761j155
1908B38j909K723m71k048K296l15k076K433L1k611K129P60k604J625R53k609J525
1925G0J450k841Q68K030k452K88K024k243J07K324k186n16K557j651q90K384j483
1942a60j048K629j303j625K660p09j872K374m69k009K443j17k428K152N10k459
1958a431J733P17k440J601J074k598J184J504k428P83J638k363N69J991k360J8
1974h08K336j999m93K393j724q22K525j393j333K526r06j647K351n55j831K230
1990H50j83k101K071K02k229J819N26k339J636Q56k457J370J219k492J029J579
2006A356k440O36J849k288K65K028k107j10K209j851n03K271j569p80K337j356
$$ plain form
2022 -53 -1211 1201 252 -1299 983 461 -1316 861 663 -1425 611 960 -1361 292 1037 -1245 135
2039 135 1155 -1242 -145 1289 -1015 -392 1204 -897 -423 1308 -860 -700 1411 -566 -885 1263
2055 1263 -414 -924 1314 -259 -1193 1265 145 -1226 1003 262 -1186 1001 445 -1372 772 801
2071 801 -1255 450 809 -1179 437 972 -1307 107 1242 -1069 -199 1167 -952 -259 1318 -945
2087 -945 -669 1422 -539 -862 1163 -402 -823 1256 -326 -1125 1207 68 -1133 937 85 -1088
2103 -1088 1058 240 -1360 883 633 -1243 584 615 -1181 635 827 -1372 285 1160 -1063 -27
2119 -27 1030 -961 0 1196 -1015 -428 1331 -615 -612 1090 -575 -596 1264 -504 -1009 1248 -53
2136 -53 -1069 946 1 -1038 1069 167 -1341 857 587 -1193 520 537 -1124 629 713 -1298 335
$$ packed form
2022e3j158K412r49j551K282n22j777K177j98k088K036L49k321J653P45k282J380
2039A35J020k397J097J434k304O23J596k101M74J731k168J60K111j977l19K148
2055A263j677n10K238j573r34K458j120j371K229p41j448K187n56j817K144K9
2071H01k056J705L59j988J616N35k279J414J135k311Q70J366k119O93J577k263
2087i45K76K091j961l23K025j565m21K079j582p99K332j139j201K070q52j173
2103a088K146q18j600K243k50j876J827L1j796J816J92k199J657Q75k223J036
2119b7J057j991R61J196k211N87J759j946LJ702j665k1J860j768n05K257j301
2136e3j016K015r45j039K107r02j508K198k70j780J713J7j661J753Q4k011J633
$$ plain form
2153 335 1008 -1029 100 844 -997 181 1105 -1097 -209 1268 -784 -420 1104 -713 -439 1283 -614
2170 -614 -831 1235 -179 -879 982 -99 -898 1082 22 -1182 913 439 -1143 605 383 -1112
2186 -1112 649 619 -1285 422 901 -1028 114 825 -983 161 1022 -1094 -222 1104 -761 -303 971
2203 971 -628 -408 1179 -603 -670 1171 -307 -688 996 -292 -751 1106 -160 -1014 929 211 -1009
2220 -1009 772 246 -1037 721 465 -1167 427 758 -1022 275 684 -1026 217 921 -1038 -97
2236 -97 992 -748 -204 939 -754 -299 1121 -665 -559 1061 -394 -697 1008 -303 -723 1043 -153
2253 -153 -926 913 90 -896 765 152 -931 763 312 -1051 569 529 -950 410 543 -971 319
2270 319 755 -996 74 888 -844 -110 915 -750 -257 997 -639 -478 1011 -431 -590 945 -309
$$ packed form
2153C35O73k037J129P44j841J178R24k202Q88J477k052L64J524j817K74J722j897
2170f14k17K066j414p00J861j081p99J980j060j204K095m74j582J748k22j495
2186a112J761l0j904J707M79j929J142P11j808J144Q61k116Q72J326j865M58J274
2203I71j599K20J587j782o7J841j478l81J684j288m59J857j266q54J943p18j220
2220a009J781n26j283J758k56j632J594L31j780J297M09j710J243P04j959R41
2236i7J089j740N44J143j693M55J420j786J06J620j455l03J705j311m20J766j196
2253a53p73J839q23r86J661o13j083J694m51j363J620m0j479J360J33j514J290
2270C19M36j751J070Q14j732P34J025j665M93J254j636J61J489j442j59J535j254
$$ plain form
2287 -309 -683 945 -175 -807 884 13 -858 806 135 -910 718 291 -963 597 435 -955 453
2304 453 555 -934 320 652 -890 186 733 -843 13 824 -743 -143 836 -648 -247 882 -578
2321 -578 -426 946 -401 -585 888 -239 -677 865 -117 -822 814 119 -894 649 258 -869 593
2338 593 347 -939 477 549 -900 285 597 -818 230 666 -865 89 827 -744 -120 807 -633
2355 -633 -158 851 -645 -354 945 -412 -528 813 -282 -511 822 -248 -704 824 18 -782 639
2372 639 104 -750 654 197 -934 547 491 -886 288 529 -808 285 626 -898 97 847 -735
2389 -735 -147 768 -596 -130 816 -635 -333 932 -400 -479 764 -316 -424 835 -322 -661 866
2406 866 -34 -740 639 40 -668 692 93 -885 603 393 -820 339 385 -732 374 476 -889 188
$$ packed form
2287c09l74J628j120o32J691q71q71J664o71j045J628m27j254J560j62j390J408
2304D53J02j489J254L32j542J076N47j576Q56Q11j567O00R79j484M01J129j460
2321e78J52J372j347j84J473j127m38J542r82p05J636o95j013J543l91j127J462
2338E93k46j286J416P2j449J185L12j415J048M36j531R54P38j571O24R27j440
2355f33M75J009j496K91J299j357j16J341j095k29J333j070m56J528q06q00J421
2372F39n35q54J404m57j131J481n6j377J174K41j337J093L41j524R95P50j582
2389g35N88R15j364M66R46j451L02J265j332p9J243j080j08J259j157l39J527
2406H66r00p06J379n99p08J360n99r78J488k10j213J159M6j117J106J02j365J077
$$ plain form
2424 188 733 -729 -55 648 -626 -14 774 -709 -261 923 -449 -442 781 -353 -408 837 -338 -665
2442 -665 870 -33 -719 622 -6 -624 692 35 -829 627 332 -790 390 297 -708 458 408 -858
2460 -858 288 635 -729 57 582 -637 86 690 -723 -160 842 -475 -326 707 -393 -300 788
2477 788 -392 -543 824 -115 -630 638 -79 -610 717 6 -821 626 279 -795 412 281 -736
2494 -736 437 377 -844 286 588 -709 118 526 -642 140 636 -692 -56 745 -511 -193 644 -482
2512 -482 -190 758 -468 -419 770 -235 -508 648 -174 -538 695 -74 -727 607 164 -708 465 184
2530 184 -707 474 309 -811 325 495 -720 185 495 -690 155 627 -701 -19 729 -543 -140 678
2548 678 -498 -180 758 -423 -358 733 -259 -433 659 -209 -457 679 -140 -589 625 20 -618 526
$$ packed form
2424A88N45j462O74P03j274O12P88j483M48J184j372PJ223j134n5J245j175l27
2442f65J535r03o86J341o28o18J316o57q64J456k95j122J180r3j005J166n0j266
2460h58J146L47j364P86N25j219P23O04j413N63J002j317J49J033j100R3J088
2477G88j180j51J367r39n15J268p17n31J327p11q27J447l47j074J207j31j017
2494g36J173o0j221J130L02j297Q27M08j168P82M96j328O36Q01j256L18Q37j126
2512d82K92R48j226M9J189j005k73J156q22l64J233p69o53J334m43q72J173k81
2530A84q91J181j65j120J136J70j215R05L10j185Q45M72j328O82P48j272M03Q18
2548F78j176L18R38j181O5J091r92j74J092q68k48J136q19m49J214o05o38J144
$$ plain form
2566 526 78 -657 507 208 -745 376 366 -711 254 429 -688 180 534 -675 43 631 -592 -62
2584 -62 655 -525 -140 707 -455 -262 730 -340 -339 715 -258 -437 700 -163 -528 660 -43 -584 578
2603 578 58 -623 489 141 -650 419 225 -669 333 330 -672 234 399 -639 151 480 -625 55 594
2622 594 -558 -101 627 -468 -175 672 -417 -292 717 -272 -411 667 -160 -435 643 -101 -535 638
2640 638 43 -599 518 117 -593 490 168 -675 417 325 -677 237 362 -617 202 401 -660 96 533
2659 533 -575 -67 521 -469 -82 558 -486 -207 663 -331 -341 578 -234 -336 634 -209 -486 670 1
2678 1 -583 510 97 -524 514 130 -650 455 345 -650 252 342 -579 246 398 -666 126 540 -573
2697 -573 -42 497 -490 -27 534 -529 -163 652 -373 -311 544 -282 -268 593 -282 -424 631 -56 -496 479
$$ packed form
2566E26m48p35J164k99r53J121j0j077R65J75j117Q68L54j209P18N88j223N30
2584f2P17j180L85Q47j162J93R92j070JJ054r73j79J137q63l65J188p03n41J162
2603E78n20o81J112l48p91J069j94q94J002lj002R06J65j038P90L29j105O80N39
2622E94j152M57P28j095K93Q47j089J25J009r89j39J078q27k75J078p44m34J173
2640F38n95o42J117m01p10J083l22q43J092r2j002R14J25r79Q19J99j061P56M37
2659E33j108N08N88r90L87O40j044K79Q70r94j0R19q12j02R70q43k77J156o69
2678An84J093m13o21J038l84p80J105j10r95R02R0r21Q25J52j064P92M14j113
2697e73N31N39r87M63N61j063L66Q15j025O2Q55q26J4Q61q75j42J055o87m40R75
$$ plain form
2717 479 6 -437 524 23 -593 488 248 -594 319 270 -537 338 334 -667 224 524 -589 10 476 -497
2737 -497 36 519 -560 -122 652 -400 -272 541 -320 -231 586 -349 -375 631 -143 -454 496 -77 -399 544
2757 544 -59 -558 519 160 -559 333 186 -489 369 236 -606 278 416 -544 116 392 -500 125 456 -570
2777 -570 -24 600 -438 -176 522 -374 -167 582 -380 -337 644 -202 -421 528 -118 -381 553 -90 -527 511
2797 511 89 -527 388 108 -485 411 168 -590 318 330 -541 179 325 -500 175 399 -547 56 511 -445
2817 -445 -79 473 -407 -85 544 -386 -244 594 -246 -325 514 -187 -349 556 -142 -476 535 20 -512 442
2837 442 66 -510 433 150 -591 334 287 -545 223 299 -514 190 378 -541 82 459 -461 -6 450 -418 -47
2858 -47 497 -386 -155 540 -289 -235 530 -239 -286 548 -169 -396 530 -37 -446 472 33 -477 429 120 -534
$$ packed form
2717D79m73m43R61n01o16J081k40q42R13m9q07Q75mj001Q91L00j113N99M66r73
2737d97N33M83j079M38P74j052J28Q13q61Q9Q17r35k6J006p74l11R50n73l22R43
2757E44o03m99J077l59p19Q92j47o75Q58j33q42Q84J38r60O60K76q92O25L31j026
2777e70N46O24j038K62O98q96K07P49r62M3R81q46k19R49o46k63R34o43m37J038
2797E11m22o16R15k80n93Q96k43p58R08J2q71P20J46q25O75K24r46O03M55r56
2817d45L66N52q80L22O29r30J42Q38q40p9Q39p01j62R05o98l34J011n15n32R54
2837D42l76n76R43k83p41R25m7q32P68P6q13P04J88r19O23L77r20M55M56q68L71
2858d7N44q83K31O95q29N4P65p69m7Q34p17k27R26n67m09R18m39n10R06l09o54
$$ plain form
2879 -534 364 213 -540 301 277 -549 222 352 -552 126 428 -508 32 464 -467 -47 501 -416 -128 516
2899 516 -347 -213 525 -257 -280 521 -186 -325 508 -112 -376 481 -31 -425 430 60 -450 394 126 -504
2919 -504 335 242 -520 244 311 -498 176 360 -507 97 445 -482 -28 472 -407 -79 505 -394 -174 549 -303
2940 -303 -270 511 -216 -293 515 -182 -364 526 -55 -447 422 29 -408 407 65 -483 379 200 -482 264 238
2961 238 -448 242 276 -498 170 397 -463 29 405 -410 -2 435 -433 -106 530 -338 -233 482 -264 -243 503
2982 503 -244 -354 534 -103 -440 435 -20 -391 439 4 -497 421 168 -510 292 219 -456 283 244 -527 222
3003 222 384 -469 70 377 -404 60 405 -456 -35 492 -347 -174 451 -274 -164 479 -278 -292 528 -148
3023 -148 -390 446 -76 -365 463 -51 -488 458 126 -510 307 165 -479 313 217 -544 253 370 -506 92
$$ packed form
2879e34Q98j51p53Q41k4q26P71J30r04O78L02r36N40M32r31M20N48r17K88O44
2899E16q63J34P38p82k3Q01p07j39Q33o20k64Q57n12l94Q55l70n10Q44k68o30
2919e04Q39r3p62P64O7q09O74J84q67O04L48r27M54N00q79L28N84q99K20P23q52
2940c03L3P81p27p7Q08o97j82Q90n81l92Q69l93m37Q15l42n48Q62j79o82P46k6
2961B38o86O90L4p74O68K27q60M92L76q15M08M37q68L27O36q68J05P15p46K1P46
2982E03p47j10Q88o37l37Q75m55l71Q30m35n01R18k53o78Q02p3o75P39l9p71P49
3003B22J62q53N39L07p81M64L45q61M21N27q39J73O25p25J10O43p57j4Q20o76
3023a48k42Q36n22k89Q28n14m37R46l32o36Q17j42o44P92r6p61P97J17q76N98
$$ plain form
3043 92 367 -440 112 404 -487 1 511 -378 -135 446 -316 -121 481 -330 -245 531 -172 -335 433 -128 -314
3064 -314 471 -110 -450 460 71 -482 328 106 -444 364 157 -547 294 312 -513 157 321 -469 153 391
3084 391 -518 36 498 -423 -84 452 -365 -93 495 -376 -221 546 -233 -307 463 -176 -297 486 -163 -418
3104 -418 477 -1 -442 389 45 -427 389 113 -511 321 247 -489 220 273 -457 202 343 -503 104 435 -440
3125 -440 -5 435 -395 -41 506 -399 -165 546 -282 -249 487 -249 -278 530 -187 -379 492 -64 -419 428 -17
3146 -17 -445 425 58 -493 355 167 -484 291 205 -475 263 292 -503 163 369 -450 82 384 -439 30 456
3167 456 -411 -64 489 -351 -153 501 -303 -225 514 -234 -314 509 -157 -376 484 -84 -424 465 -9 -482 413
3188 413 85 -506 370 167 -517 311 244 -505 229 309 -492 174 365 -456 90 411 -427 21 452 -401 -49
$$ packed form
3043I2K75q07N52K92q91M88N10q89K43N81p62J95O02q11Q5P76p03j63P68n61j86
3064c14P85n81l40R10l89n53Q10k22n50Q08k07p04Q41J8q25O70J64p90O22K38
3084C91r09N54M62r21L39N36q17K72N88q71J55P67p79p4P70o39j21P83o49k55
3104d18Q95m78m41Q31l44m72Q16k76o24Q32p4p36P09N3p30O59J41q46O07L31q75
3125d40M35M40q30L54N47r05K34P11q28L3P36p36k9Q08p17j92Q71n56l55Q47m45
3146a7m28Q70l67n51Q48j88o51P75q6o80P38K9p95O66K06q19N32L02q23M69M26
3167D56q67L47N53q40J98O54q04P8P39p48q0Q23o66k19Q60n68l40Q89m74m73Q95
3188D13l28n91Q76k03o84Q28o7p49P34Q0q01O66J91q21N46L21q38M48M31q53L52
$$ plain form
3209 -49 482 -351 -144 497 -293 -214 500 -240 -290 510 -157 -359 481 -75 -418 450 -19 -478 412 90 -502
3230 -502 351 155 -504 308 231 -539 250 330 -526 143 374 -453 96 428 -461 21 504 -395 -89 493 -320
3251 -320 -130 502 -297 -214 530 -199 -302 473 -130 -331 468 -105 -423 464 17 -474 367 81 -448 351
3271 351 142 -525 301 280 -529 174 309 -463 157 360 -508 86 474 -437 -40 464 -364 -67 494 -362
3291 -362 -179 554 -240 -270 500 -176 -277 496 -155 -378 485 -5 -432 389 35 -415 373 65 -496 336
3311 336 206 -498 211 236 -461 215 279 -518 136 417 -451 2 412 -395 -5 461 -412 -121 540 -294 -232
3332 -232 477 -240 -231 507 -222 -354 534 -68 -404 428 -26 -389 428 14 -501 390 155 -498 262 191 -460
3353 -460 272 237 -525 171 355 -461 53 349 -415 50 415 -438 -63 504 -330 -159 454 -278 -163 504
$$ packed form
3209d9N31q33K07O41p90P9P14p40n0Q00o67k02Q40n56l43Q68m69m59Q90l22n92
3230e02Q53j96o59Q12p7p70P89Q0q56O69K31q27N49L32q89M82M83q99L06N82q13
3251c20J90O32p99Q3P44p29j03P75o03k01P99n73l18Q87m47m91Q41k86n29P99
3271C51k09o67Q26k1q09P03J35p72O20K03q68N94L88r11L97N04q28K97N61q56
3291c62J83P33p94l0P70o76j01P73o51k23Q63m90m27Q21l54m50P88l08n61Q32
3311C36j30p04P09K5o97O76O4p97O54K81q68M53M10q07L90M66q73K91O61q34O2
3332b32P09p17RP38p29j32Q88o02l36Q32m54l63Q17m14n15Q91k35o53P60p1o51
3353d60P32l5p62O96J84q16N14K96p64M65L65q53L75N67q34J71O13p32J15O67
$$ plain form
3373 504 -271 -293 539 -130 -366 460 -78 -367 473 -18 -477 436 116 -482 323 155 -466 312 199 -536
3393 -536 229 326 -479 121 330 -455 99 384 -466 -5 473 -364 -108 437 -334 -120 488 -311 -234 503 -188
3414 -188 -299 459 -133 -326 474 -88 -420 457 34 -452 391 86 -453 371 150 -517 292 260 -503 192
3434 192 313 -488 160 362 -489 58 440 -438 -23 442 -386 -75 484 -345 -177 491 -254 -238 485 -211
3454 -211 -279 488 -151 -366 463 -54 -407 413 9 -438 388 95 -478 334 177 -487 265 239 -487 213 313
3475 313 -487 132 383 -468 51 421 -435 -28 480 -390 -111 501 -332 -188 502 -267 -266 507 -195 -326 493
3496 493 -107 -365 453 -38 -412 413 40 -441 370 103 -471 317 191 -494 237 252 -475 185 309 -471
3516 -471 100 391 -452 18 431 -400 -40 457 -365 -117 505 -301 -209 504 -227 -261 493 -170 -339 502 -80
$$ packed form
3373E04p75k2Q32o69k36Q26n38k89Q40m91m59R13l20n98Q05j68o21P78j13p35
3393e36P65R7q05O00K09p85N54K85q50M61M78q37K56N45p71K14O08p99P7P37o91
3414a88j11P58n92j93Q00n62l32Q77m23m86Q43l05n39Q24k21o67Q09l2p63O95
3434A92J21q01O48K02q51N47L82q78M15M65q28L11N59q29J68O68p45J6P23o96
3454b11o8P67o39k15Q29n17l53Q20m04m47Q26k93n73Q12j57o64P52k6p26P00J00
3475C13q00O19K51q51N19L70q56M07N08q70K79O12q33J44O90p69JP73p02j31Q19
3496D93o00k58Q18m91l74Q25l73m81Q11k67n74P88j26o85P31J5p27O60J24p80
3516d71N71K91q43M70M13q31L60M97q22K48O22q06R2P13p31l4P54o63j69Q41n82
$$ plain form
3537 -80 -408 434 4 -397 384 41 -462 379 201 -511 300 200 -490 193 219 -467 154 361 -451 75 340
3558 340 -380 23 398 -403 -58 469 -338 -156 443 -253 -181 478 -236 -280 513 -121 -358 446 -55 -376 437
3579 437 -25 -449 411 117 -482 302 159 -450 286 195 -517 229 315 -485 99 334 -431 82 372 -451 -6
3600 -6 452 -361 -101 423 -298 -115 451 -288 -218 493 -173 -292 431 -111 -294 446 -77 -395 433 57 -429
3621 -429 332 101 -419 330 151 -492 260 276 -477 141 288 -430 136 335 -477 35 441 -398 -71 403
3641 403 -340 -85 450 -334 -197 489 -219 -267 429 -163 -251 449 -132 -363 448 18 -384 346 50 -376 353
3662 353 85 -464 296 214 -459 194 239 -428 179 288 -489 81 391 -411 -13 381 -361 -35 444 -370 -147
3683 -147 487 -259 -234 443 -212 -242 471 -171 -324 472 -44 -367 393 -8 -365 397 52 -448 346 179 -436
$$ packed form
3537h0l28Q42m30m01P81l43n03Q41j78p12Q11j00o90O83K6o86O21K07q12N26K65
3558C40p20M03L75q01L45N27q07J82N99o96P2O59p14m4P93o34k37Q04n01l21Q13
3579D37m62m24Q60k94n99P84j43o09P36r1p12P46Q6q00N84K35p65N13K90q23M45
3600fM58q13K60N24p21J83N66p39P0P11o66j19P23n42j83P40n23l18Q28l76m86
3621d29P61k31n20P49j79o43P52J6p53O18J47p18N66J99q12N12M06q39L27M74
3641D03p43K55N35p84J37O86p08m8O96n92q8P00n81k31Q11m30m02P30k96m26P29
3662C53k68n49P60q2o73O53M5o67O07J09p77N70L10q02L98L94p42L26M79q14K23
3683a47O34p46K5O77o55l0P13o42j53P96n16l23P60m01l57P62l45n00P94j67o15
$$ plain form
3704 -436 233 193 -418 219 243 -464 132 336 -416 37 338 -393 18 400 -385 -81 454 -311 -165 432 -252
3725 -252 -192 462 -228 -286 478 -119 -342 421 -44 -354 425 9 -433 379 111 -434 308 146 -433 279 217
3746 217 -460 185 291 -442 116 317 -419 61 363 -395 -21 395 -353 -91 414 -294 -132 443 -256 -213
3766 -213 458 -177 -263 439 -127 -322 428 -44 -372 400 32 -396 356 99 -431 317 178 -464 247 243 -444
3787 -444 183 302 -443 111 344 -422 49 371 -398 -31 409 -357 -106 432 -283 -168 438 -235 -231 442 -173
3808 -173 -289 430 -93 -326 416 -50 -364 397 44 -403 338 110 -412 297 170 -449 251 253 -463 170 292
3829 292 -440 107 350 -435 34 398 -395 -65 409 -356 -107 420 -309 -171 458 -241 -246 428 -156 -282 425
3850 425 -114 -328 424 -11 -368 361 51 -359 348 86 -425 320 197 -440 215 237 -409 186 263 -436 114
$$ packed form
3704d36O69m0o11O37K4p07N96K04p52M53L01p31M11L82p85L04N35p65J46N97o84
3725b52O0O54o90n8P64n97k23P63m65l10P79m16m42Q12k68n45P42j62n79P12o2
3746B17o77O45J06p33N58K01p36M80L02p58L74M16p48K62N05p08J62N75o99M3
3766b13O71o35q6P02n66j95P50m72l28P72l68m28P52k57n30P48j39o42P11mo87
3787d44O27J19p45N54K33p66M71L22p69L67M40p66K51N38p15J15O06o73MO73o15
3808a73j16P19n23k33P42m66l14P61l53m47P41k28n22P09j27o19P00Kp16O33J22
3829B92p32N47K43p85M69L64p93L30M74p65K49N27p29J38O29o99nO74n84j26P07
3850D25n39k14P52m35l57P29l10m10P07k62n11P45j23o37O55K2o46N95P7o99N50
$$ plain form
3871 114 370 -415 -1 372 -371 -23 398 -371 -127 470 -275 -216 435 -215 -226 434 -186 -311 461 -74 -366
3892 -366 382 -18 -346 388 28 -424 364 154 -427 250 176 -386 254 210 -439 187 323 -410 70 311 -367
3913 -367 70 357 -396 -35 432 -322 -136 393 -275 -152 426 -276 -255 471 -149 -329 399 -88 -313 419
3933 419 -55 -407 404 75 -415 300 118 -394 300 162 -463 235 284 -414 118 283 -377 109 327 -404
3953 -404 14 400 -328 -87 374 -299 -82 404 -292 -204 443 -181 -270 384 -145 -268 426 -105 -373 404 32
3974 32 -395 325 73 -383 332 124 -455 275 233 -422 183 249 -399 159 311 -438 82 385 -365 -24 368
3995 368 -328 -37 394 -315 -137 444 -228 -191 388 -190 -223 410 -151 -314 404 -45 -343 342 -3 -354 356
4016 356 52 -433 305 167 -415 230 195 -419 211 247 -445 119 335 -393 45 348 -369 2 394 -348 -86
$$ packed form
3871A14K56p85M14L73p43L48M21p69K44N97p45N9O51o50j1O60o20j25P72n35k92
3892c66P48m00l28P34l60m52P88k10n81O77p4n62O40m4o49O26J36p33M80K41o78
3913c67M37K87p53L61M67p54J86N29o68J23N78p02K1P26o20j80P28m87k25P32
3933D19m74l52Q11l29m90P15j82n12O94j38o25O98M9o98N32J65o60M86K18p31
3953d04M18L86p28K41M61o73K17M86o96Q8O47o24q9O54n29j23O94n31k68P77l72
3974C2m27P20k52m56P15k08n79P30m2o55O05O6o48N58J52p49N20L03p50L41L92
3995C68o96K91M31p09J78N81o72L7N79n78l3O33n61j63P18m49k98O85l45l51P10
4016C56l04m85P38j38n82O45l5o14O30L6o92N64K16p28M38L03p17L71L92p42K62
$$ plain form
4037 -86 434 -287 -157 418 -232 -193 437 -185 -269 417 -102 -307 389 -54 -331 375 16 -383 323 90 -391
4058 -391 265 143 -401 242 208 -429 173 271 -408 101 309 -387 44 370 -371 -32 399 -319 -87 416 -285
4079 -285 -156 441 -226 -223 436 -151 -276 430 -81 -324 402 -19 -365 373 44 -395 328 118 -402 266 168
4100 168 -408 214 218 -405 171 285 -396 85 306 -370 27 344 -369 -38 398 -310 -114 408 -260 -169 424
4121 424 -215 -234 435 -142 -299 400 -77 -317 389 -12 -371 377 71 -401 312 127 -402 270 171 -422 222
4142 222 256 -417 130 292 -384 86 321 -386 24 380 -329 -75 378 -278 -96 390 -265 -180 421 -173 -256
4163 -256 379 -116 -269 382 -85 -331 381 21 -381 306 77 -366 300 121 -433 260 237 -412 170 259 -378
4184 -378 146 302 -412 65 377 -357 -33 350 -293 -54 377 -309 -151 426 -209 -228 367 -144 -217 385 -139
$$ packed form
4037h6N20p21J30N75o50L9O30o22q4O86n19k05O96m43k77P06l59l99P06k33m81
4058c91O56j22n44O43l4o37O02R8o79N09K08o96M31L26p41L39M31p18K32N03p01
4079b85J29N97o67LO59n87j25P06n11k43P26m21l46P38l29m39P23k10n20O68r8
4100A68n76O22Mo23N76J14o81M81K21o76L97L17p13L31M36p08J96N22o68R1N93
4121D24o39j9O69n77j57O99m77k40P06m01l59P48l06m72P13j85n29O72r9n93O44
4142B22L4o73N47J62o76M70K35p07M10L56p09K54M53o56J82M86o55Q5O01n94q3
4163b56O35m95j53O51m67k46P12l60m02O87k29m43O66j79n54O93k3o49N82Q9o37
4184c78N24J56p14M77L12p34L24L83o43K39M31o86J58N77o35j9N95n11p3O02n24
$$ plain form
4205 -139 -301 387 -24 -355 312 18 -337 313 60 -406 283 171 -393 190 210 -368 188 254 -403 114 347
4226 347 -373 19 331 -331 15 368 -340 -92 422 -245 -173 371 -202 -183 397 -185 -275 397 -69 -323 330
4247 330 -42 -301 328 4 -384 295 116 -366 216 133 -350 228 183 -397 159 292 -346 78 287 -316 61
4268 61 343 -344 -32 395 -268 -115 359 -231 -139 402 -220 -232 411 -123 -278 333 -81 -281 358 -43 -364
4289 -364 313 66 -365 250 92 -343 246 142 -392 175 230 -351 108 247 -331 87 295 -335 3 350
4309 350 -269 -59 340 -234 -78 370 -223 -170 395 -147 -222 337 -111 -249 371 -70 -316 325 27 -336 276
4330 276 67 -345 270 114 -382 218 198 -369 151 231 -341 112 274 -358 55 320 -298 -22 321 -264 -51
4351 -51 349 -238 -128 352 -186 -179 348 -137 -213 342 -101 -277 326 -31 -308 296 27 -328 277 76 -365
$$ packed form
4205a39j62O88m11l31O67k94l55O50k53m66O89j12n64N83K0n78N56O6o57N17K33
4226C47p20L92L12o62L46L53p08K48N14o67P2N44n73J9N80n82r0O72m66k54O53
4247C30l72k59O29l24l88O79j79m82N82q3m83N78m5n80N56J33o38M24K09o03L77
4268F1K82o87L12M27o63J53M74n90R2N41o22j2O43n34j55O11m14k00O39m01l21
4289c64O77k47m31O15j58m35N89j04n34N67N5n81M59J39n78M18K08o30L38L47
4309C50o19K10L99n74J56M48n93N3N65n42p5N59m48j38O20m41k46O41k98l63O12
4330B76k09m12O15j56m96O00k0n67N20Q0n72M53J62o32M13K65o18K76L43n85K13
4351e1M00n87J10M80n38PN27m85p6N55m43j76O03l57k77O04k69l55O05k01m41
$$ plain form
4372 -365 233 134 -367 190 192 -357 136 250 -354 81 279 -326 34 331 -276 -25 331 -259 -85 355 -214
4393 -214 -146 354 -165 -199 353 -126 -231 332 -78 -263 317 -21 -306 273 37 -314 242 79 -342 213 143
4414 143 -351 149 186 -327 118 225 -320 78 297 -310 6 312 -268 -28 329 -251 -86 363 -204 -160 336
4435 336 -155 -190 339 -128 -252 326 -53 -288 294 9 -279 262 29 -327 242 108 -342 170 149 -312 149
4456 149 174 -338 107 256 -311 30 260 -274 16 289 -268 -41 355 -215 -112 335 -175 -132 341 -166 -205
4477 -205 362 -94 -267 312 -45 -257 301 -20 -325 281 77 -344 208 119 -313 186 125 -363 147 223 -327
4498 -327 54 221 -285 57 254 -312 -10 318 -236 -79 300 -186 -82 326 -195 -150 365 -109 -213 308
4518 308 -71 -207 318 -58 -297 320 46 -314 229 65 -303 231 84 -369 174 196 -352 105 194 -303 97
$$ packed form
4372c65N98r9n01N57Kn49M93J14o04M35J98o05L60K97o07K51L56n90J74M40n69
4393b14O8N00n19l4N52m79j05N63m10j85N80l38k85N79k36l51N56j63m21N55p0
4414A43m94N00L7n13M45J07n45L98K19o07L16L06n80K40L57n80J65M49n67M4M96
4435C36m91l5N29m67j24N78l79k35N82k85k88N41k33l56N69j34m50N12k1m61M61
4456A49K5n12M45J49n67L41K30n34K90K73n57K27L96n70J03M47n10M3M73n07l9
4477b05N67m56j73N79l57k12N58l21l05O06k04m21N52q9m32M99o1m88N10P6n50
4498c27L81J67n06L42J97n66L02L28n54J57L79m86J04M08n21M5N15m74j04N21
4518C08l79j36N25l76k39O17k74l60N43j64l68N34j47m53N43K2n48M57Q9m97M00
$$ plain form
4539 97 223 -327 38 311 -272 -48 292 -226 -54 318 -226 -118 348 -134 -175 297 -104 -178 316 -82 -238
4560 -238 319 0 -271 251 45 -264 248 55 -340 215 156 -326 134 157 -315 131 194 -351 71 274 -305
4581 -305 -10 270 -259 -13 301 -273 -90 337 -177 -142 308 -155 -147 331 -130 -219 322 -39 -252 269 -10
4602 -10 -235 281 33 -296 243 113 -295 171 126 -294 169 167 -334 105 242 -290 38 232 -279 33 270
4623 270 -283 -54 317 -223 -91 290 -197 -119 330 -163 -182 328 -96 -221 294 -53 -227 299 -25 -281 260
4644 260 66 -293 215 91 -294 193 137 -310 151 187 -293 101 210 -273 53 238 -273 -1 266 -238 -47
4665 -47 290 -216 -81 303 -186 -132 310 -134 -171 311 -96 -210 300 -50 -243 282 -12 -271 248 50 -298
4686 -298 215 82 -305 194 134 -306 144 180 -300 101 207 -276 58 243 -260 5 265 -244 -47 269 -212
$$ packed form
4539I7J26n50L65K73n83K24L40n18J72L72n44J08M66m82m1M72m01p4M94l98j56
4560b38N57l19k71N22k06l09N12j93l95N55n9m82M60K3m72M46O3n45M22K03n79
4581c05K95K80n29K46L14n74J83M27n14L5M50m63QM78m61q9N41l61k13N21k79
4602a0k25N16k48l29N39j30m08M66m5m20M63kn01M39J37n32L28J94n11L12K37
4623B70n53K29L71n40J32L81m87P8M49m93j9N10m24j25N15l47j74N26l24k56N41
4644B60j94l59N08j24l85M87n6m47M61L6m80L94J09m83L26J85n11K72K67n04J91
4665d7L37n06J35L84m89N4M42m44l7M82m07j14N10l50j93N25k94k59N19j98l48
4686b98N13j33l87M99o0m40M50L6m80M01J06m83L34J85n03K65K60n09J97L16m81
$$ plain form
4707 -212 -85 286 -185 -128 297 -137 -181 288 -95 -210 287 -61 -242 275 -2 -278 244 58 -279 220 86
4728 86 -318 201 144 -316 123 180 -286 97 198 -302 50 263 -265 -4 264 -230 -42 277 -217 -85 323
4749 323 -163 -150 286 -108 -152 287 -96 -196 284 -35 -248 238 11 -247 234 29 -286 223 100 -311 161
4770 161 140 -290 144 159 -320 103 225 -302 28 242 -245 19 260 -270 -27 311 -201 -106 304 -155 -108
4791 -108 306 -151 -167 327 -76 -209 262 -33 -200 262 -24 -264 248 63 -293 179 99 -254 180 104 -309
4812 -309 138 190 -291 56 191 -264 48 215 -285 6 280 -232 -69 274 -176 -64 293 -188 -126 332 -119
4833 -119 -179 286 -65 -174 291 -63 -250 281 29 -265 211 56 -245 204 76 -295 178 154 -282 89 157
4854 157 -259 89 197 -287 42 249 -242 -37 241 -209 -23 254 -213 -95 300 -135 -150 280 -104 -142 293
$$ packed form
4707b12J27L71m71N7M25m34m4M69l83j15M97l48j81N17k77k76N22j86l37M99j34
4728H6m04N19n7m60M39N7m66L83J01n00L52K13n28K61K68m94J88L19m94J32M08
4749C23m86J3M36l94m4M39l83j00M80l19k13M86k27k58M81k05l15N09j23m11M72
4770A61k1m30M34J5m79M23J22n27L30K14m87K64K41n30K43L38n12R5M10m59M7
4791a08M14m57j6M94m03j33M71k95j67M62k86k40N12j85l56M72q0l53M34p6m13
4812c09M47N2m81L47J35m55L12J67n00K91K74n12J63L43m50J12L57m81O2M58m51
4833a19o0M65l51j09M65l54j87N31k52k94M76j55l01M49j28l71M73k4m36L71O8
4854A57m16L48J08m84L29K07m91K05K78m50J86K77m67J18L95m35j5M30l84l8M35
$$ plain form
4875 293 -85 -206 298 -15 -226 242 7 -228 240 32 -291 217 119 -277 126 126 -260 124 152 -292 91
4896 91 211 -250 18 220 -235 8 239 -229 -51 268 -179 -100 247 -136 -110 268 -131 -170 291 -73 -190
4917 -190 247 -23 -201 255 4 -250 234 65 -260 191 92 -261 168 127 -294 122 184 -267 71 198 -252
4938 -252 37 206 -254 -6 248 -201 -62 247 -173 -79 270 -149 -125 275 -97 -165 246 -67 -169 251 -31
4959 -31 -212 238 23 -220 200 73 -239 183 105 -248 154 134 -266 102 167 -255 71 190 -250 28 220
4980 220 -234 -9 233 -214 -52 258 -178 -90 264 -146 -122 260 -94 -164 252 -48 -178 234 -17 -201 227
5001 227 26 -226 178 62 -225 158 92 -241 133 137 -246 87 169 -227 65 179 -233 28 219 -220 -28
5022 -28 219 -187 -51 226 -172 -97 255 -138 -145 246 -84 -146 238 -58 -183 251 2 -214 198 43 -205 179
$$ packed form
4875B93l78j21N04l13k11M68k35k35M68k08l23N08r8l96M03%l86L84K8m44L83
4896I1J20m61K68K02m55K43K31m68J78L19m47P9L47l83K6L78l99l9M61l64j17
4917a90M37k70j78M56k51k54M84j69l25M51r9l53M29m1m21M16O2m51L38J27m50
4938b52K89J69m60K48K54m49J39L09m20R4L49m19K4M00l72o8M11l13j02M20k82
4959c1j81M50k15k43M20j27l12M22p8l53M02k0m00L68O5m22L26J19m40K78J92
4980B20m54K25K42m47J62L10m36Q8L54m10K4L82l54p0M16l00j30M12k51j84M28
5001B27k01k52M04j16k87L83o6l33L74Ml83L33Q2l96K92J14m12K61J91m39J92
5022b8K47m06J36K77l98P5L52l93pL91l30o2L84k96j25M34k49k16M12j55k48L84
$$ plain form
5044 179 52 -240 150 116 -240 99 141 -210 81 138 -224 52 204 -215 -19 192 -185 -30 203 -189 -65
5065 -65 240 -144 -113 229 -98 -124 224 -92 -161 253 -35 -208 207 9 -189 206 22 -219 208 83 -233
5086 -233 129 108 -208 127 115 -240 86 179 -231 14 172 -190 16 188 -205 -34 226 -154 -97 205 -126
5107 -126 -78 222 -123 -141 242 -55 -177 199 -35 -162 208 -17 -206 205 48 -222 154 79 -210 151 87
5128 87 -250 120 168 -223 61 155 -200 42 168 -222 -1 214 -182 -64 181 -147 -63 196 -151 -110 232 -78
5150 -78 -148 186 -48 -128 206 -45 -180 200 29 -201 152 49 -182 164 68 -216 132 120 -214 85 135 -186
5172 -186 80 146 -228 39 204 -195 -28 186 -169 -29 205 -180 -92 230 -119 -119 198 -84 -120 209 -72 -162
5194 -162 215 -9 -180 176 19 -162 175 41 -206 160 94 -204 106 113 -187 107 128 -211 70 185 -189
$$ packed form
5044A79j27k92L90l4l56L39M2l51K91N7l62K76J52m19J96K11l77J55K33l92J24
5065f5L05l84L1L42l27k6L48l16o9M14k88j73M15j98j98L95j84k41M27j25l16
5086b33L62k1l16L35j2l55L26R3m10K45J58l62K06J72l93J71K60l80N7L02l31
5107a26M8L00l45j8L83k97j22L76k34j27L70k25j89M11j57k70L76p5k89L61o4
5128H7l37L70M8l91K84R4l55K42J26l90K21K15l96J18K45l28Q4K59l47M1L42l10
5150g8p0L34k34q0L34k51j35L80j71k30L53j03k31L46r6k84L48j2l34K99N0l21
5172a86K66O6l74K67J65l99J67K14l55J40K34l85Q8L22l49%L17k82l6L29k81r0
5194a62L77k24j71L56j57j81L37j34k47L66o6k98L10Pl00K94K1l39K81J15l74
$$ plain form
5215 -189 17 179 -176 1 200 -179 -47 212 -147 -83 207 -124 -94 218 -104 -144 215 -49 -166 189 -26
5236 -26 -181 187 6 -208 166 49 -192 136 81 -193 126 107 -197 86 147 -186 41 160 -175 29 175
5257 175 -165 -10 186 -147 -44 191 -125 -64 201 -116 -106 207 -77 -135 197 -54 -168 186 -29 -176 177
5278 177 5 -192 166 52 -190 135 81 -206 109 110 -210 88 136 -188 54 152 -169 27 162 -168 -12 183
5300 183 -145 -56 188 -119 -82 187 -104 -93 193 -75 -130 180 -35 -145 176 -21 -161 175 28 -180 144
5321 144 48 -181 123 66 -190 116 111 -201 76 131 -182 52 150 -194 32 179 -172 -36 177 -137 -40 176
5343 176 -125 -74 198 -92 -112 178 -46 -118 170 -54 -142 181 -3 -168 147 25 -162 133 35 -190 130 91
5365 91 -206 85 115 -167 74 116 -192 54 166 -181 -16 166 -155 -18 173 -155 -45 194 -122 -106 169
$$ packed form
5215a89K06J62l55J77J99l79J32K59l59O4K90l31L0L12l22m0L59k64j17L55k15
5236b6j55L68j81k14L74j17k41L28n5k74L19j9l04K83O1l33K27J19l35K04J46
5257A75l40J55J96l33J03K35l16O1K65l17J0L13k84n8L32k51j14L54k15j47L53
5278A77j72j97L58j14k42L25n4k87L15Jl20K98M8l24K42R8l21J96J35l30J56J95
5300A83l28Q9K44l07L7K69k91J1K86k68n5L10k15j10L21j97j40L36j47k08L24
5321A44r6k29L04n7k56L06nl12K77N5l13K34R8l44K26J47l51J36K13l14R7K16
5343A76l01N1K72k90k0K90k24p2K88k24q8L23j84j65L15j22j87K95r8k25L20l9
5365I1k97K91L0k82K41M2l08K46J12l47J65J82l21J37J91l28J10K39l16J6K75
$$ plain form
5386 169 -82 -87 162 -71 -123 194 -25 -156 164 4 -137 151 17 -164 155 70 -166 88 83 -152 89 90 -175
5409 -175 72 139 -169 19 136 -144 24 151 -170 -29 201 -133 -78 167 -100 -63 184 -120 -113 196 -66 -137
5431 -137 164 -36 -127 159 -22 -169 163 47 -174 120 60 -142 125 72 -180 91 128 -169 35 123 -141 29
5453 29 118 -163 7 165 -132 -54 150 -109 -43 170 -113 -82 190 -74 -124 157 -53 -119 169 -43 -150 167
5475 167 4 -172 125 33 -152 138 38 -171 109 88 -173 73 118 -144 70 114 -168 26 158 -142 -11
5496 -11 147 -124 -23 152 -127 -58 174 -86 -89 156 -64 -94 156 -55 -119 161 -26 -142 134 8 -150 133
5518 133 24 -176 125 73 -176 78 89 -153 90 101 -173 59 138 -148 28 148 -140 -3 156 -128 -32 173
5540 173 -108 -69 162 -92 -83 155 -73 -106 146 -35 -130 140 -17 -144 143 10 -147 118 36 -156 102 62
$$ packed form
5386A69k51nK49k33n2L17k19j31L20j60j41K88j34j81L19q5k36K54nk35K41Jk65
5409a75K47O7l08J88J17k80J68J27l21J41K30l34N5K45k67L7K47l04PL09k62p1
5431a37L01k00r1K86j81j47L32j16k21K94o0k02K67n3k52K71L7k97K04Q8k64J70
5453B9Q9k81J70J58k97P8K04k59O6K13k83L1K72k64n0K81k10o6K88k12j07L17
5475A67j63j76K97r2j85K90j00k09K80k1k61K46M5k62K14M4k82J94J32l00J31
5496a1J58k71J01J75k79O9K32k60lK45k20l0K50k11o4K80j87j16K76j26j58K83
5518A33j09k00L01n2k49K54J1k42K43J1k74K32P9k86J76J20k88J37J59k84R6K05
5540A73k81L9K31k54RK38k28l3K52j81r5K70j57j27K87j33j57K65q2j92K58m0
$$ plain form
5562 62 -159 97 85 -162 70 124 -157 46 138 -145 14 150 -132 0 159 -120 -33 171 -108 -53 172 -79
5584 -79 -87 168 -71 -109 159 -40 -126 147 -8 -134 121 1 -151 110 35 -164 97 57 -153 78 79 -154 76
5607 76 117 -148 37 140 -130 22 137 -127 3 161 -117 -39 162 -104 -66 154 -85 -76 162 -66 -111 147
5629 147 -33 -107 137 -28 -143 127 7 -163 110 52 -135 80 61 -153 79 93 -139 41 105 -125 30 108
5651 108 -133 5 136 -113 -32 145 -87 -31 131 -100 -67 156 -74 -99 133 -40 -99 138 -44 -110 143 0
5673 0 -150 110 28 -132 103 33 -146 99 68 -150 49 92 -122 39 90 -131 36 133 -115 -7 126 -87 -12
5696 -12 126 -92 -39 155 -73 -87 130 -44 -78 117 -51 -101 134 -10 -129 99 14 -112 97 12 -150 105
5718 105 65 -136 62 73 -119 54 71 -146 46 118 -141 7 127 -104 2 124 -118 -30 148 -85 -65 135
$$ packed form
5562F2k21K56j2k47K32N4k81K03R2k83J59J36k82J32J59k79Q7K04k79N5K25k51
5584g9qK55k39l8K68j99q6K73j55j26K55j20j52K61p5j99K61m0k10K31Jk33K30
5607G6M1k65J85J03k70J52J15k64J30J58k78P8K01k66L8K20k39RK38k28m5K58
5629A47j80p4K44j65j15K70j20j70K73n8j87K15j9k14K32J4k32J80O4k30J55P8
5651A08k41J38J31k49Q1J77k32N6J62k31L3K23k30k5K32j73n9K37j82o6K53j43
5673@j50K60q2j60K35p0j79K45l1k18J99M3k14J61N1k21J67R7k48J08J33k13P5
5696a2J38k18N3J94k28j4K17j74l4J95j68n0K35j44j19K28q5j26K09q5j62K55
5718A05m0k01J98J1j92J73J7k17J92P2k59J48J20k31J06J22k42Q8J78k33K0K00
$$ plain form
5740 135 -60 -61 135 -65 -96 138 -19 -117 113 -2 -103 97 -8 -138 95 38 -135 67 61 -122 71 56 -143
5763 -143 55 103 -119 8 103 -97 19 111 -110 -2 140 -82 -35 134 -67 -47 123 -69 -67 147 -36 -104 127
5786 127 -14 -96 108 -15 -134 111 26 -132 70 44 -122 72 46 -149 59 75 -127 16 94 -117 22 99
5808 99 -120 -2 124 -90 -31 117 -71 -38 123 -71 -53 147 -54 -78 108 -37 -86 117 -15 -109 122 1
5830 1 -124 93 37 -116 88 37 -139 68 59 -139 39 72 -127 28 95 -123 -8 107 -105 -21 113 -95 -25
5853 -25 119 -71 -33 132 -62 -67 134 -38 -76 117 -30 -98 123 -6 -114 114 6 -117 104 24 -127 81
5875 81 46 -135 70 71 -126 45 74 -126 22 95 -124 8 102 -112 -9 123 -102 -27 120 -75 -43 133 -56
5898 -56 -68 130 -30 -72 110 -33 -95 105 2 -106 106 13 -121 88 31 -119 83 55 -139 47 62 -126 38
$$ packed form
5740A35j95jJ96k00l1K34j57r8K30j15j01K00j05j30K33n7j73K02oj83J93j5j99
5763a43J98M8k22J27R5k00J16R2k21J08J42k22M7J69k01K0J70j92KK14j83o8K31
5786A27j41q2K04j23j19K45q5j58K02k6j66J94k6j95K08J6k02J43P8k11J39P7
5808I9k19J18J26k14N9J48j88L3J61j94J8K00k01k4J86j45m9K03j32r4K31j21
5830Aj25K17n6j53K04n1j76K07rj98J78L3j99J55O7k18J15J15k12Q4J34k08P0
5853b5J44j90L8J65j94nK01j72l8J93j47o8K21j29j08K28j08j23K21q0j51K08
5875H1l5j81K05Jj97J71K9k00J48P3k19J32R4k14J03J32k25P5J47j95L2J76j89
5898e6j2J98j60m2J82j43o2K00j03j08K12r3j34K09n7j50K02k8j94J86J5j88J64
$$ plain form
5921 38 74 -125 29 104 -118 2 104 -108 -5 106 -105 -26 121 -81 -57 126 -47 -54 124 -47 -80 119 -20
5944 -20 -104 106 13 -93 88 5 -118 83 32 -133 53 62 -122 45 55 -135 58 88 -131 20 100 -102 10
5967 10 92 -110 0 128 -94 -35 121 -70 -46 117 -70 -60 137 -49 -96 109 -18 -92 112 -18 -96 117 13
5990 13 -127 74 38 -109 74 37 -116 64 65 -119 20 84 -102 19 82 -107 17 119 -90 -22 113 -76 -24
6013 -24 106 -78 -42 141 -58 -75 114 -39 -67 115 -37 -77 133 2 -107 94 24 -105 93 12 -116 95
6035 95 58 -132 47 78 -112 39 66 -112 22 99 -105 1 99 -85 -8 102 -86 -18 133 -66 -54 110 -30
6058 -30 -35 109 -40 -73 116 -14 -95 104 7 -82 105 -3 -111 91 35 -124 66 43 -112 55 46 -132 50 82
6082 82 -110 16 84 -97 21 96 -99 -7 125 -73 -46 107 -58 -41 112 -58 -51 129 -34 -76 106 -3 -71
$$ packed form
5921C8L6j99J54P5k22J20J02k12J03J11k11P9J47k02K4J83j73pJ78j71l3J99j39
5944b0q4K10r3j06J81q3j23K01n1j65J86Rj84J67J0j90J93L0k19J51Q0k02J12
5967A0Q2k02J10J28k22N9J56j91K4J63j87J0J97j86m7K05j27p4K04j30p8K13j04
5990A3j40K01l6j47J83l7j53J80Jj84J39O4j86J21O3j89J24J02k09O8J35j89N2
6013b4J30j84L6J83j99j7J89j53k8J82j52m0K10j31j09K01p0j29J98q1j28K11
6035I5l7j90J79L1j90J51K7j78J34P7k04J06R8j84P7J10j88O8J51j99J2J64j40
6058c0nJ44j49l3J89j30q1J99r7q9J87j08j08K02n6j59J90k3j55J67rj78J82L2
6082H2j92J26O8j81J18P5j95R2J32j98K7J53j65J7J53j70PJ80j63m2J82j09o8
$$ plain form
6105 -71 108 -9 -87 106 16 -109 77 27 -108 75 45 -121 62 70 -115 39 69 -112 30 90 -106 14 104
6128 104 -90 -17 99 -88 -20 120 -74 -43 121 -57 -52 125 -28 -64 111 -14 -81 111 1 -92 102 27 -94
6151 -94 83 35 -111 66 52 -115 49 70 -119 22 75 -110 20 73 -100 1 94 -89 -7 113 -79 -35 110
6174 110 -68 -40 107 -58 -56 111 -25 -76 108 -13 -90 99 6 -99 100 22 -98 81 36 -112 71 51 -110
6197 -110 55 67 -112 29 77 -109 12 95 -102 -6 97 -91 -10 98 -79 -31 118 -69 -54 117 -41 -54 109
6220 109 -38 -76 118 -9 -91 105 4 -88 96 16 -97 84 37 -109 60 54 -97 48 66 -113 37 94 -116
6243 -116 -4 85 -89 -4 79 -88 -18 113 -77 -55 113 -45 -46 114 -46 -63 120 -25 -79 105 2 -76 95
6266 95 -5 -91 103 27 -109 70 50 -96 58 35 -113 59 69 -120 14 77 -99 13 76 -101 0 104 -88
$$ packed form
6105g1J79j17p8J93r0j25J86n0j35J83l0j66J83Qj85J54L0j81J42O0j96J20R0
6128A04j94P3J16j87O8J40j94L1J64j78NJ77j53l6J75j25o7J92j10r3J94p5j21
6151i4J77m8j46J77j4j67J64K1j89J41N3j85J30N3j73J01R3j83Q2J20j92M4J45
6174A10j78K8J47j65KJ67j36n1J84j21p7J89r3j05J99p8j20J79m5j48J83k0j61
6197a10J65J2j79J41M8j86J21Q3j97R6J03j88Q1J08j77M8J49j87J5J71j58j3J63
6220A09j47l8J94j27q2J96j01r2J84q0j13J81m7j46J69oj51J45J8j79J50N7k10
6243a16J12Q9j74Q5Q3j67P0J31j90K2J68j58jJ60j60j7J83j45n4J84j03p8J71
6266I5j00q6J94p6j36J79k0j46J54k3j48J72J0j89J34O3j76J12O3j77J01J04j92
$$ plain form
6289 -88 -32 98 -55 -39 91 -62 -53 109 -37 -84 100 -15 -72 100 -9 -84 95 11 -92 89 43 -91 70
6312 70 33 -106 68 67 -119 38 75 -100 14 67 -105 17 94 -109 -32 92 -72 -28 97 -72 -23 115 -57
6335 -57 -60 103 -27 -61 94 -27 -72 104 8 -79 85 35 -86 80 26 -92 77 46 -101 47 61 -96 24 52
6359 52 -105 24 98 -96 -9 89 -77 -13 92 -85 -27 102 -65 -51 114 -32 -51 107 -43 -73 109 -4 -80
6382 -80 84 20 -65 91 22 -89 85 45 -96 62 56 -94 40 67 -108 31 84 -88 12 82 -85 -6 77 -85
6406 -85 -15 107 -69 -40 90 -52 -35 104 -46 -63 104 -21 -75 96 -11 -63 93 4 -75 88 24 -91 74
6429 74 34 -93 60 41 -95 41 63 -91 31 80 -83 15 84 -79 2 97 -70 -22 85 -58 -40 96 -58 -53
6453 -53 89 -37 -59 102 -19 -74 90 -1 -70 86 13 -77 80 20 -80 68 32 -90 59 53 -83 52 63 -93
$$ packed form
6289h8N6J30j53J6J30j53RJ62j46m7J84j15n7J72j09p5J79q4j03J81m6j34J61
6312G0l7j39J74jj86J57L7j75J14N3j72J22P7k03P7J24j64M4J25j69M9J38j72
6335e7lJ63j30l4J55j21m5J76r6q7J64n0j21J66n4j18J69l1j47J48J4j57J20K8
6359E2j57J29P4j94Q7R8j66O4J05j77N8J29j67J4J65j46j9J58j50l0J82j13p6
6382h0J64o4q5J56o9j11J74m0j41J58oj50J34K7j75J39N3j72J00P0j67P9Q3j62
6406h5P0J22j76K9J30j42J7J39j50j7J67j25n4J71j07n2J56q9p9J63o4j15J65
6429G4m0j27J53j9j36J36K2j54J22M9j63R8O9j63Q1R5j67M8J07j43J8J36j54N
6453e3J42j26k2J61j21n5J64r1o9J56p3r0J57o0j00J48l6j22J49oj36J35J1j56
$$ plain form
6477 -93 27 67 -91 8 79 -78 -6 90 -78 -27 104 -65 -27 98 -41 -47 102 -36 -55 86 -21 -64 78 -8
6501 -8 -71 84 15 -75 70 42 -78 61 47 -81 53 56 -85 39 64 -73 19 66 -74 21 72 -70 -16 84 -67
6526 -67 -24 91 -58 -26 93 -43 -54 93 -30 -58 75 -19 -56 95 -4 -79 77 12 -77 55 16 -83 62 33 -92
6551 -92 36 55 -66 37 60 -72 26 76 -81 2 80 -56 -7 78 -69 -13 82 -68 -36 86 -33 -47 86 -35
6575 -35 -39 94 -18 -59 77 18 -64 81 9 -71 84 26 -81 62 56 -72 33 43 -76 39 64 -90 21 74 -70
6600 -70 6 68 -67 -2 94 -64 -25 81 -46 -34 80 -37 -46 88 -35 -59 81 -5 -53 82 -16 -69 90 7 -73
6625 -73 78 27 -70 58 28 -77 67 53 -77 25 68 -72 19 65 -71 5 83 -75 -16 66 -53 -14 59 -52 -30
6650 -30 82 -31 -45 75 -27 -46 72 -18 -68 82 1 -70 56 12 -62 60 23 -83 53 58 -81 47 34 -80
$$ packed form
6477i3J20M0j58R9P1j57P2R6j68N1J31j69L8J25j39oJ49j38j9J41j07m3J42q6
6501ho3J55o9r0J45k8j20J39j4j28J34Lj41J24K5j37R2M7j40R5N1j42N4J00j51
6526f7M3J15j49L2J19j36j1J47j23k8J33r4l7J51r9p5J56o5q9J32l9r9J45k9j25
6551i2J28J9j21J03K3j32R8N0j57Q3P8j36M9Q5j47N6R5j50L2J22j19j4J33j21
6575c5mJ33j12m1J36n9q2J45p2q0J55n8j07J43oj28J05J0j19J15K5j54J11N3j44
6600g0P6O2j35O5R6j58L9J06j27J2J14j17rJ34j23k4J40q6m8J35r8n3J59q3q0
6625g3J51n1r7J28l0j05J44j4j30J02M3j40R1M6j36P6P8j58N9Q2j19L9P3j11K2
6650c0J12j13j4J20j02j9J18r0n0J50q1p1J26m4p4J22l7j06J36Nj39J28j3j14
$$ plain form
6674 -80 50 44 -69 8 67 -80 0 60 -64 -1 63 -67 1 76 -60 -38 72 -45 -32 69 -51 -44 89 -10 -73 64
6700 64 -16 -54 78 19 -53 56 28 -62 55 36 -80 57 3 -82 40 71 -64 2 69 -30 23 58 -69 -8 63 -70
6726 -70 -48 64 -34 -25 69 -57 -17 69 -33 -33 73 -13 -57 81 -8 -52 103 13 -55 51 28 -60 48 23 -60 51 45
6753 45 -71 32 57 -63 23 63 -63 10 72 -52 -7 63 -54 0 77 -53 -16 66 -42 -37 73 -35 -50 67 -17
6778 -17 -52 73 -11 -59 67 13 -60 67 18 -62 52 34 -70 56 50 -70 37 50 -60 20 51 -62 20 66 -57
6803 -57 -8 72 -51 -12 68 -41 -25 76 -43 -43 72 -29 -51 56 -31 -58 72 -6 -60 66 12 -62 57 21 -61 63
6829 63 35 -70 41 53 -48 36 39 -60 30 62 -68 2 64 -53 -3 64 -60 -1 70 -48 -26 72 -39 -46 58 -31 -45
6856 -45 70 -23 -61 44 3 -50 58 -15 -58 64 11 -66 45 32 -54 39 38 -64 48 45 -65 18 61 -60 17 55 -60
$$ packed form
6674h0J30oj13P7N9j47Q0O0j24O3O4j30O8P5j36K2J10j17J3J01j20PJ33r9o3J37
6700F4q0l8J32n9p2J09k8r0J17j9j16J37n4q5J22L1j35O6O7r9N3L5j27O1P1j33
6726g0K2J12r8RR4j26M0Q6j02%J06q6m4J38q9m4J55r0o8J06k3q8J08k5q3J11o
6753D5j16J03K5j20Q6M0j26P3O2j24M5P0j17N4P7j30L7Q2j08NJ10j08j5J17q4
6778a7l5J25q4m8J26n4p3J27m9q0J14j8j04J26oj20J07J3j10Q0L1j13Q2M6j23
6803e7M9Q0j23L9Q0j09J6J01j19%J15j01k2J07q7k7J30p8n4J26n4p4J19l6q2J24
6829F3k8j05J11J2j01Q4Lr9R0L2j30P0O2j17N0O7j24N9P1j18K2R8j11pJ04q9j4
6856d5J15r3l8J05m1n3J08p3m3J22n3p7J11j3q6R3jj02J12lj10Q3M3j21P7L8j15
$$ plain form
6883 -60 9 70 -57 -16 66 -43 -26 65 -34 -31 69 -43 -55 70 2 -47 55 -5 -57 67 6 -68 60 25 -62 46
6909 46 18 -62 50 47 -59 31 65 -57 33 51 -64 24 51 -67 6 61 -44 -1 62 -53 -16 69 -41 -44 66 -19 -54
6936 -54 60 -32 -44 63 -6 -53 62 7 -55 44 13 -74 51 35 -65 42 35 -65 42 42 -60 28 59 -57 8 59
6962 59 -52 1 56 -50 -6 73 -46 -21 72 -26 -27 72 -36 -46 66 -24 -50 63 -5 -60 58 0 -61 59 7 -64 50
6989 50 38 -58 36 35 -74 44 54 -66 16 59 -63 4 63 -52 0 68 -47 -8 76 -44 -15 80 -39 -35 68 -30 -45
7016 -45 74 -21 -53 60 0 -60 61 0 -59 74 10 -73 52 24 -67 56 30 -66 37 52 -60 22 56 -48 24 70
7042 70 -58 -2 58 -38 -14 68 -42 -21 82 -50 -34 64 -26 -44 60 -23 -45 71 -11 -46 68 7 -55 57 10 -61
7068 -61 51 28 -52 44 33 -57 37 54 -54 24 61 -50 16 74 -56 -1 66 -42 -22 68 -45 -14 69 -36 -36 71 -33
$$ packed form
6883f0O9O1j27M1Q2j09J7R1r9LJ00j12j2J25o8m9J02o0n2J24o1p4J28l5q7J08
6909D6k8q0J12lj06R0L4j22R0J8j15Q8K7j18P3N5j05M3O3j15L7Q5j10lJ10q5l5
6936e4J14r2j2J07o9m7J15n5o2R9l1q7J25j6j00J07pj00J07%j02Q8L1j16O5N1
6962E9j11N3N5j06M4P9j19K5R3r8jR9j08j0J12r0k6J13o8n5J18n8o1J20n2p1J14
6989E0j2r6R4jj09J18J0j20Q2M3j22O7N9j15N2O8j15L9Q4j20K9R5j19MJ03r8j5
7016d5J19r5l2J13o0o0J21o1n9J33o4q3J25k8r1J23k6r6J03J5j12Q2L4j04P2M6
7042G0j28N6O0r6K4Q2j10K1J03j32J6R8r0j8J04q3k2J16q2l5J14o1o2J12m7p1
7068f1J12k3q0R6j1r0R4J7j08P8L7j11O6N8j30N5O7j08K0R0j13L1Q3j05%J07j04
$$ plain form
7095 -33 -46 61 -17 -53 59 -3 -57 62 -1 -66 48 16 -65 45 23 -69 46 45 -58 28 48 -52 22 56 -51 20
7121 20 58 -51 -2 63 -56 -2 64 -51 -17 72 -28 -37 64 -31 -37 73 -13 -46 73 2 -61 60 -2 -58 47 18 -71
7148 -71 42 31 -66 28 44 -62 40 49 -64 18 67 -47 3 57 -50 3 75 -44 -24 60 -36 -15 65 -30 -35 77 -24
7175 -24 -55 69 -13 -57 61 -9 -55 57 10 -67 59 20 -67 37 30 -62 38 50 -72 20 52 -52 24 52 -62 19
7201 19 73 -44 -3 72 -39 -16 76 -19 -31 75 -32 -36 64 0 -42 70 -6 -47 59 -8 -77 46 18 -74 41 15
7227 15 -68 52 31 -55 36 51 -59 25 62 -52 18 59 -52 1 77 -38 -6 72 -55 -23 74 -31 -36 84 -22 -47
7253 -47 69 -15 -48 73 -4 -59 67 4 -60 52 18 -67 50 28 -65 44 38 -63 26 41 -55 22 63 -64 9 70 -54
7280 -54 0 71 -43 -7 78 -43 -28 77 -29 -38 70 -32 -49 69 -21 -58 72 1 -54 65 -10 -71 59 13 -73 50
$$ packed form
7095c3j3J07p8l6J12o2n4J19o3o5J14l2q1J10k2r2J15jj03Q6K0j00P4L4j07P1
7121B0L8j09M9O5j19N4O6j15L4Q9j00rJ01r5oJ10q6l3J19p1o3J21o2n6J05k9q9
7148g1J13j1r7R4J6j06J02Rj13Q2M9j14N0N4j07N3P2j19K0Q4r6K1Q0r5nJ12j01
7175b4l1J24q2m4J18p0m6J12m7p7J26l9q7J04pr2J00J2j22R2L2j04P6K8j14Q1
7201A9N4j17M1P5j11K3R2r5j2J06j07mJ00o4m2J12p6m1J06o7o9J23k8r2J15k6
7227A5q3J20k1q6R1J5j10Q4L7j14P0M1j11N3P6j15L2P8j27L2R7j05nJ20j06k5
7253d7J16q4l3J21p7n5J26o3o4J12l4q5J17k2r3J09oj01Q9J5r6P7M1j27P3O1j24
7280e4N4P1j14L6Q5j21J5J05j06rJ08j02j7J18r0l7J30p1n5J19p5o1J30m6q6J23
$$ plain form
7306 50 12 -66 37 23 -66 43 49 -69 23 61 -73 8 69 -67 12 68 -59 -11 86 -47 -11 73 -43 -26 64 -34 -41
7333 -41 76 -9 -49 71 -7 -64 58 9 -64 47 21 -67 41 19 -70 36 40 -75 38 45 -62 16 50 -65 9 56
7359 56 -55 -2 71 -51 -8 73 -50 -6 68 -28 -25 69 -25 -38 69 -33 -44 66 -14 -50 63 -1 -75 57 11 -60 52
7386 52 15 -67 46 39 -75 43 59 -64 32 57 -71 15 58 -64 1 77 -46 -15 80 -39 -18 70 -49 -25 80 -27
7412 -27 -40 69 -18 -38 78 -8 -65 74 -2 -62 57 11 -55 41 18 -74 41 33 -61 33 37 -63 29 54 -70 7 51 -44
7440 -44 9 63 -39 7 71 -37 -9 77 -37 -33 62 -24 -38 64 -18 -58 65 -11 -64 63 4 -56 64 3 -71 45 19
7467 19 -70 35 22 -64 38 38 -64 30 49 -55 26 54 -53 14 62 -59 -2 67 -32 -17 66 -35 -24 74 -23 -43 80
7494 80 -10 -39 68 -8 -48 62 1 -58 52 4 -65 36 16 -62 52 25 -66 34 51 -62 18 50 -61 20 41 -55
$$ packed form
7306E0l8p8J03j4q9J09Oj18R2L8j34Q1O1j36P9N6j27M8R7j33L6Q4j16J7R0r8p
7333d1J17q5m0J20p8n7J22m9p3J11k6q8J08k2q9J06Mj15J13Pj07P8L4j15P4M7
7359E6j11N3P3j22M3Q1j23M4P4r6LR4r4j3J07j02j1J10q0l6J13o4p4J32m6p1J12
7386E2l7q2J13pj14J18J6j23R6K5j28Q6M3j22O5P6j23L1R5j19K1Q8j19K4J05j07
7412b7j3J09q7k0J16q6n7J39p6o0J19m6o6R6k3r2J15qr4R4Mj00R2K5j24P7M4r5
7440d4N3N4j02M6O4j08K8Q6j14MR5q6j4J02q2m0J23p6n3J27n9o0J20o1p4J16k6
7467A9q9J05j3q6J02%j02R4J9j04Q1K8j07O7M8j21N7O9r9J5Q3j01J1R8r7k0J23
7494H0r0k9J07p6m0J10o1n9J10m8o9J01k0p8J14k7r1J00J7j13Q0L2j11Q1K1r6
$$ plain form
7520 -55 3 61 -45 -8 64 -36 -16 68 -41 -33 68 -23 -28 66 -23 -37 63 -27 -59 56 -2 -59 46 6 -56 44 10
7547 10 -68 35 30 -63 29 37 -64 22 45 -58 17 55 -65 3 56 -47 3 70 -41 -6 79 -32 -12 71 -30 -32 74
7574 74 -25 -45 70 -6 -55 51 4 -64 54 10 -57 39 19 -72 31 29 -71 28 45 -71 20 41 -56 7 54 -51 7
7601 7 60 -58 -13 63 -36 -21 72 -25 -20 68 -27 -32 73 -11 -38 55 -5 -46 54 0 -57 53 9 -57 38 20 -64 26 35 -49
7631 -49 23 36 -58 18 39 -60 12 63 -57 -4 70 -44 -8 71 -27 -13 69 -30 -31 71 -22 -37 68 -17 -50 61 -5 -57
7659 -57 56 13 -58 48 6 -54 41 24 -53 34 38 -63 17 32 -63 23 42 -58 15 47 -60 3 65 -44 0 63 -32 -11
7687 -11 69 -28 -26 76 -22 -42 70 -13 -45 64 -1 -57 54 3 -65 34 15 -59 49 16 -66 31 19 -65 19 45 -64 17
7715 17 35 -64 15 67 -54 -14 60 -45 -9 67 -27 -11 65 -28 -30 64 -16 -32 54 -7 -47 59 12 -58 49 9 -57 46
$$ packed form
7520e5N8N8j06L7P2j00K0Q4j09QJ01r1nR4q9j4J00r0l2J15n8n7J05m0o2J00l4
7547A0p8J03nr3R2Qj01Q6K3j03P5L8j20O8N3j03N0O7j11L5Q5j11K0Q3j01kJ06
7574G4r9k0J15p6m9J06m7o8J18m4o7R6k0r1J03kj00R9J7j16R1K1r7O3M7j05N8
7601GN3j18M5P6r9J5R3r7NQ8r5nJ05q4k7R3o0m1J00n4n7J10m4o6R5j8q4R0Rq4
7631d9P2J3r4P6K1r9P2N1j20N3P4j14L6P9r8J4Q2r9jJ02r3j5J05q5l3J11o6n2
7659e7J13m3p1J06m2o0R5j7p7Q7Mj01Q0J5r5Q6J9j00P3L2j07O3O2j09M4O3r5K1
7687a1Q0r7KJ02r8k0J12q3l2J09o5n6J11n1o8R9j9p4J08l3q2R7j2q4Q4K6j09Q1
7715A7J8r9P9N2j21M0P4j05L6P6r4J6P6r3kR4q0j6Q6o1m0J06m7p0J07m0o6J03
$$ plain form
7743 46 4 -61 39 25 -66 29 35 -64 18 25 -65 12 54 -54 -1 58 -43 -8 53 -53 -22 71 -36 -21 50 -30 -33 56 -21
7772 -21 -34 69 4 -53 42 -11 -52 41 -1 -59 47 13 -60 31 18 -65 18 27 -76 23 46 -68 -3 38 -59 6 49 -45 -2
7801 -2 54 -40 -13 58 -34 -17 58 -22 -28 71 -20 -37 59 -11 -36 56 1 -51 57 3 -48 39 10 -53 31 19 -62 16 30 -61 8
7832 8 30 -56 7 36 -59 -2 55 -36 -3 55 -36 -11 58 -39 -28 70 -21 -40 56 -17 -33 56 -14 -43 57 0 -44 46 4 -37
7862 -37 44 12 -48 35 31 -50 35 35 -58 14 37 -60 19 45 -52 9 49 -45 1 50 -42 -22 59 -24 -20 61 -28 -28 54 -2 -38 70
7894 70 3 -53 60 2 -45 61 13 -50 42 26 -56 43 37 -55 30 33 -46 16 38 -49 9 53 -39 12 51 -36 -9 68 -31 -18
7924 -18 55 -32 -29 66 -9 -32 62 -12 -27 55 -3 -33 56 2 -45 52 14 -66 35 17 -64 34 22 -54 26 30 -67 11 32 -54 -2
7955 -2 50 -48 -13 51 -41 -9 65 -29 -12 58 -29 -26 63 -25 -34 58 -8 -34 59 5 -44 60 -5 -55 39 14 -64 40 24 -59 25
$$ packed form
7743D6m2o5J00j4r1R5Or9Q2Pr0P7M2j08N3N9j01L5O1j06L1R3j07J5P1q0lQ9p7
7772b1j3J03o5n7R5n3m1R3m2n8J06l4p3R1j3q3Q3Rj03R9K3j14O5M1r7O5M3r4M3
7801bN6r4K7P1r2J7P5q0oR9r1j7R6p0k5R2n5n2J08n4n1Q7k9o3Q4j2q1P8J4r1O9
7832HK2q6O3K9r5N7N7r1L3N8r1K5O9r7J1R8r1j9R6p3j6Q9p0k9J00n7m4R0m2m1
7862c7Q1l2o0Q3mq1Q5%r3P2K3r7P9K6r7O1M0r4M6M9r2K0Q1q3MQ1q9%Q2n6l6J08
7894G0o7n6J13n8m7J06m8o3R2j6q2R9or2Q5Lp9O2K2q7N8M4r2N1L9q7K7P7r9J3
7924a8P3q7LR5p5k3R4p4j5Q2n8l0Q9n4m7R7l8q0J01j8q1R8j2p6Q0Mr7P8K1q6N2
7955bN2r8L5O4r2L2P4r4J7P0q7LQ9q8rR2o6k6R3n4m9J04o5n0R4k5p8J04j6q3Q4
$$ plain form
7986 25 25 -62 27 40 -64 9 32 -55 4 37 -63 -4 55 -47 -20 49 -42 -16 50 -31 -30 63 -34 -33 54 -20 -42 55 -6 -39
8016 -39 52 -6 -62 42 17 -56 46 12 -50 34 24 -62 19 35 -55 24 37 -66 2 57 -66 -1 50 -56 -13 51 -41 -22
8044 -22 62 -30 -33 54 -19 -24 59 -24 -26 66 -5 -41 49 1 -45 51 5 -58 48 14 -59 31 28 -69 27 26 -62 18 43 -53 8 52
8076 52 -45 -9 43 -58 -16 51 -41 -34 48 -31 -17 55 -23 -30 68 -12 -44 61 5 -35 61 5 -49 57 15 -59 35 17 -53 42
8106 42 25 -65 38 39 -62 20 48 -64 18 50 -58 -2 45 -50 -10 52 -37 -22 57 -41 -33 59 -25 -42 51 -9 -39 67 -4
8135 -4 -39 65 13 -48 49 14 -46 49 16 -56 39 38 -63 24 37 -62 26 44 -57 5 45 -56 -9 45 -44 -17 44 -42 -21
8164 -21 61 -29 -38 59 -20 -40 63 -16 -40 50 -3 -50 56 9 -37 51 15 -63 54 24 -58 37 30 -53 25 29 -55
$$ packed form
7986B5%q7Q9J3j04P3K3q7N9L3j00N9N9j02K7O9r1K6O6q1JR3r7JQ7p4k2R7o1l3
8016c9R1n8n6J04k5p3J02l4o2Q4j0q6Q1J6r0P9J3j03O8N5j23O5N1j06M3O4r2J9
8044b2Q4r2lQ7p3nQ3q3kR2p1l6R0m8m6R6m6o3J06l4p3R0lr7R6jq8Q0K5r6O1M4
8076E2r7L6N2j01M2O7r2PQ2p9J4P2p8pR8q0l2J05n6m0R6n6n4J06m2p4R4j8p0R5
8106D2j7r0J03Jj01Q2K8j12Q2L2j08N6M7r5M0O2q9J5P9r8QR2q4j7R3o0l0J06p1
8135dl5J04n2o1R7l5o0R5l3p2R5jj01Q7J3r9Q8J8j01O2M0j01M7N4q9K7O1q6K1
8164b1Q2r0rR7p9k0J03p9k4R0n3m7J06m7m6Q8l6p8J17l0q2R5pq3P8Mq4
8191e5
$$ Imaginary data points
##PAGE= N=2
##DATA TABLE= (X++(I..I)), XYDATA
$$ plain form
0 0 0 0 0 0 0 0 0 0 0 0 0 0 0 0 0 -8 8 -8 8 -8 11 -16 16 -20 24 -25 32 -35 40 -48 55 -62 68 -78 89 -99 111
37 111 -123 137 -152 170 -188 210 -231 255 -282 309 -341 375 -415 457 -503 554 -611 675 -753
56 -753 836 -934 1053 -1190 1361 -1573 1843 -2211 2725 -3496 4786 -7274 13705 -60920 -89995
71 -89995 140024 -38620 -96383 121016 -18606 -107606 117085 859 -116049 96667 23144
82 23144 -113126 84011 29417 -115623 77709 49798 -123715 58711 68693 -116916 40699
93 40699 80266 -116031 24481 99209 -108107 -4551 108116 -87397 -22249 105352 -74832
104 -74832 -35246 108838 -60473 -52389 103754 -42791 -58825 98040 -35787 -68307 100813
115 100813 -21005 -84391 93390 -1191 -91014 83199 13328 -98725 73549 34377 -103045
$$ packed form
0@%%%%%%%%%%%%%%%qJ6j6J6j6J9k7L2l6M4m9N7o7P5q8J03j17J30j46J67j88K10
37A11k34K60k89L22l58L98m41M86n37N91o50P16p90Q72r60J057j165J286j428
56g53J589j770J987k243K551k934L416m054M936o221Q282j2060K0979p4625k9075
71h9995K30019j78644n7763K17399j39622q9000K24691j16226j16908K12716p3523
82B3144j36270J97137n4594j45040J93332k7911j73513J82426R982j85609J57615
93D0699L9567j96297J40512P4728k07316J03556J12667j95513O5148J27601j80184
104g4832L9586J44084j69311Q084J56143j46545j6034J56865j33827l2520J69120
115A00813j21818o3386J77781r4581q9823J74213o9871j12053J72274l9172j37422
$$ plain form
126 -103045 52883 51011 -94944 36121 57839 -89571 23903 67610 -83008 8052 72151
137 72151 -72505 -1184 74242 -68840 -11257 82916 -61283 -27970 86077 -48053 -40326
148 -40326 85805 -36701 -53701 85328 -19536 -66095 75364 -2822 -69079 65314 7186
159 7186 -72130 57888 18967 -74328 47098 28192 -72938 39664 35529 -75287 31668
170 31668 47762 -75188 18056 57622 -69708 5251 64695 -63589 -8792 70866 -52340
181 -52340 -23028 70177 -39361 -31391 67019 -29809 -38105 64608 -20248 -44188 60648 -11794
193 -11794 -48622 58132 -4082 -55452 55230 7211 -61886 48125 19036 -65038 39025
204 39025 29878 -65854 28045 39707 -62913 16121 45997 -57441 6216 49598 -51857 -2035
$$ packed form
126a03045J55928j872j45955J31065K1718j47410J13474M3707j50618R1060O4099
137G2151j44656P1321P5426j43082N7583R4173j44199L3313J14047j34130P727
148d0326J26131j22506j7000J39029j04864m6559J41459p8186o6257J34393n8128
159G186p9316J30018l8921r3295J21426j8906j01130J12602m135j10816J06955
170C1668J6094j22950R3244L9566j27330P4959N9444j28284N4797P9658j23206
181e2340K9312R3205j09538P970R8410r6828q296J02713q4856k3940J04836p2442
193a1794l6828J06754o2214n1370J10682m8019o9097J10011k9089q4074J04063
204C9025r147r5732R3899J1662j02620P9034K9876j03438O3657M3382j01455M9822
$$ plain form
216 -2035 52156 -46514 -9240 54507 -41651 -16727 57359 -35778 -25386 59273 -27887 -34478
228 -34478 59389 -17704 -43241 55858 -5715 -48772 48909 4540 -50946 41725 13001 -51822
240 -51822 33995 20141 -50566 26980 24646 -49946 22104 30440 -50832 15028 37533 -49120
252 -49120 6671 42839 -46587 -1692 48911 -42134 -12916 52243 -33036 -21816 50707 -25065
264 -25065 -27375 49560 -17643 -33356 46458 -9307 -35921 42328 -4629 -38349 41533 1570
276 1570 -43863 37704 10671 -46016 31508 17295 -47524 26144 25804 -48615 16209 33478 -43682
289 -43682 6898 35434 -39341 1206 38603 -35849 -6700 40196 -29384 -11494 39104 -26829
301 -26829 -14982 42454 -23585 -23227 43708 -15736 -28863 41691 -10026 -33881 41309 -1673
$$ packed form
216b035N4191r8670L7274O3747r6158K4924P4086r3137J0392Q4659q7160o591
228c4478R3867p7093k5537R9099o1573m3057R7681m4369n5486R2671k8724o4823
240e1822Q5817j3854p0707P7546k334p4592P2050Q336q1272O5860K2505q6653
252d9120N5791L6168q9426M4895N0603r1045K9218O5159q5279J1220P2523p5772
264b5065k310P6935o7203j5713P9814n5765k6614P8249m6957l3720P9882l9963
276A570m5433Q1567k7033n6687P7524j4213o4819P3668l40p4419O4824J7269p7160
289d3682N0580K8536p4775M0547L7397p4452K9149M6896o9580J7890N0598o5933
301b6829J1847N7436o6039L58O6935n9444j3127P0554n1717k3855P5190m2982
$$ plain form
313 -1673 -40283 35453 8381 -40193 28172 12565 -39706 24612 18259 -40608 17667 23501 -37322
326 -37322 12507 24873 -37014 9611 30700 -37128 1189 35477 -31859 -5524 36512 -28650
338 -28650 -11463 40179 -22933 -20720 38891 -13493 -24133 34508 -9366 -26221 34066 -4015
350 -4015 -30664 30234 2245 -30609 27076 4260 -33195 27054 10887 -37601 21148 18244
362 18244 -36237 15520 21667 -36472 11022 28305 -35141 1757 31578 -28428 -3490 30387
374 30387 -25717 -6634 32879 -22298 -13018 32368 -16411 -15165 30865 -15041 -18547 33599 -10160
387 -10160 -25582 31342 -2439 -27567 27698 1528 -30248 25915 8559 -33017 19085 14497
399 14497 -30024 14148 15526 -29642 12112 19809 -29844 6417 22837 -26713 3240 23804
$$ packed form
313a673l8610P5736k7072m8574O8365j5607n2271O4318o353n8867N8275N834o0823
326c7322M9829J2366o1887M6625K1089o7828L8317L4288o7336K6335M2036o5162
338b8650J7187N1642o3112K213N9611n2384j0640N8641m3874j6855O0287l8081
350d015k6649O0898k7989l2854N7685k2816l7455O0249j6167m8488N8749k904
362A8244n4481N1757O147n8139M7494J7283o3446L6898K9821o0006K4938L3877
374C0387n6104J9083L9513n5177R280M5386m8779J246M6030m5906l506N2146m3759
387a0160j5422N6924l3781k5128N5265k6170l1776N6163j7356m1576N2102m588
399A4497m4521M4172J378m5168M1754P697m9653L6261J6420m9550K9953K0564
$$ plain form
411 23804 -26963 153 28795 -25423 -7326 30884 -19849 -11862 30422 -16521 -16200 31488 -10827
424 -10827 -21636 28238 -4257 -22147 24623 -1933 -23248 23879 2182 -25730 20461 6460
436 6460 -25492 17969 8783 -27316 16202 14311 -28802 10502 18924 -26662 5780 21224 -25425
449 -25425 1364 24622 -22608 -4552 25190 -18073 -7375 24466 -16125 -9883 25601 -13386
461 -13386 -13629 25261 -9971 -15854 25095 -7571 -19436 25442 -2630 -23341 22691 2815 -24530
474 -24530 19329 6839 -25423 15840 11330 -25038 11042 14089 -22988 7819 15510 -22158 5118
487 5118 17853 -21100 1604 19569 -19553 -1352 21354 -18382 -5237 23563 -15605 -9903
499 -9903 24103 -11718 -13520 23498 -7824 -16492 22091 -3742 -18365 19846 -458 -19228 18017
$$ packed form
411B3804n0767K7116K8642n4218J8097L8210n0733P987M2284m6943L21M7688m2315
424a0827j0809M9874l2495j7890M6770k6556k1315M7127k1697k7912M6191j4001
436F460l1952M3461r186l6099M3518j891m3113L9304Q422m5586L2442J5444m6649
449b5425K6789K3258m7230J8056K9742m3263J0698L1841m0591O242L5484l8987
461a3386k43L8890l5232n883M0949l2666j1865M4878k8072k0711M6032j9876k7345
474b4530M3859j2490l2262M1263m510l6368L6080L047l7077L0807P691l7668K7276
487E118J2735l8953K2704J7965l9122J8201K2706l9736J3145K8800l9168N702
499i903L4006l5821j802L7018l1322q668L8583k5833j4623L8211k0304j8770L7245
$$ plain form
512 18017 2152 -20206 16431 4930 -21246 14668 8042 -22301 12239 11659 -22702 8794 15074
525 15074 -21996 4855 17937 -20355 409 19822 -17360 -3525 20026 -14355 -6232 19973
537 19973 -11897 -8849 19724 -9188 -10882 19078 -7273 -12767 19435 -4923 -15953 18944 -969
550 -969 -18242 16914 2477 -19604 15044 6203 -20918 11670 10031 -19935 8031 11618 -18754
563 -18754 6045 13502 -18401 3039 15542 -16527 405 16074 -15564 -1396 18177 -14696
575 -14696 -5454 19746 -11282 -8828 19098 -8578 -11146 19176 -5420 -14484 17412 -1012 -15232
588 -15232 14407 788 -15274 13613 2871 -16880 11563 5892 -16580 9377 7003 -17065
600 -17065 8716 10007 -18433 5310 13460 -16733 1919 14392 -15591 -139 16646 -14288
$$ packed form
512A8017j5865k2358L6637j1501k6176L5914o626l0343L4540n80l4361L1496O280
525A5074l7070K6851J3082l8292K0764J9413l7182J3835K3551l4381Q123K6205
537A9973l1870L048K8573k8912j694K9960k6351n494L2202k4358j1030L4897j9913
550i69j7273L5156j4437k2081L4648q841k7121L2588j639k9966K7966L587l0372
563a8754K4799P457l1903K1440J2503l2069J6932J5669l1638J4168J9573l2873
575a4696R242K5200l1028K454K7926k7676k568L0322k4596r064L1896j8424j4220
588a5232K9639j3619j6062K8887j0742j9751K8443n671k2472K5957k374k4068
600a7065K5781J291k8440K3743Q150l0193J8652J2473k9983J5452J6785l0934
$$ plain form
612 -14288 -4340 17511 -10428 -6492 16027 -8858 -7278 16793 -7406 -10232 16366 -4192 -11237
625 -11237 14952 -3209 -12574 15663 -522 -15798 13561 3679 -15862 10567 5208 -16001 9298
638 9298 8098 -16729 5569 10635 -14361 2952 10327 -13667 2348 12247 -13689 -762 13700
651 13700 -11313 -2427 13534 -11062 -3723 15962 -9847 -7865 16366 -5967 -9596 14874 -4372
664 -4372 -10859 15193 -1683 -13455 12957 1757 -12864 10602 2102 -13083 10635 4215 -14747
677 -14747 8171 6815 -13759 6220 7339 -14254 5355 10266 -14713 1497 12392 -12087 -980
690 -980 12182 -11092 -2455 13804 -9537 -5795 13618 -6253 -6549 12250 -5733 -7085 13455
703 13455 -4367 -9747 12921 -1620 -10356 11915 -775 -11755 12279 2031 -14043 9830
$$ packed form
612a4288R948K1851k7939L936K2519k4885J580K4071k4199k826K6598k0558p045
625a1237K6189j8161r365K8237j6185j5276K9359r882j9541K6429n359k1209K5299
638I298j200k4827K2298N066k4996J7313P375k3994J6015R899k5936J2927J4462
651A3700k5013Q886J5961k4596P339J9685k5809J982K4231k2333l629K4470j9246
664d372o487K6052j6876j1772K6412j1200j4621K3466q500j5185K3718o420j8962
677a4747K2918j356k0574J9979J119k1593J9609M911k4979J6210J0895k4479J1107
690i80J3162k3274Q637J6259k3341L742J9413j9871k96J8799j7983j352K0540
703A3455j7822n380K2668j4541q736K2271j2690j0980K4034j0248j6074K3873
$$ plain form
715 9830 5230 -13405 7406 6109 -13424 6198 8315 -13488 3071 9716 -11446 1349 9420
728 9420 -11097 546 11017 -10688 -2158 11850 -8676 -3669 11851 -7915 -5325 13150 -5962
741 -5962 -8257 12601 -2820 -9199 11209 -1318 -9978 10799 811 -11118 9080 2804 -10732
754 -10732 7814 3434 -11225 7412 5275 -12116 5578 7094 -11741 3957 8221 -11847 2259
767 2259 10178 -11263 -586 11157 -9354 -2557 11148 -7965 -4160 11384 -6219 -5821 10806
780 10806 -4414 -6503 10283 -3409 -7460 10384 -1853 -8836 9789 40 -9675 8988 1766
793 1766 -10591 7926 3926 -11057 6093 5676 -10717 4375 6842 -10303 2774 7844 -9645
806 -9645 1235 8437 -8985 -29 9048 -8471 -1419 9779 -7726 -3019 10442 -6656 -4844
$$ packed form
715I830m600j8635K0811j297j9533J9622K117k1803J6559O645k1162J2795Q071
728I420k0517J1643J0471k1705Q530J4008k0526N007J5520j9766K590J8475j9112
741e962k295K0858j5421o379K0408j2527q660K0777r988j1929K0198o276j3536
754a0732J8546m380j4659J8637k137j7391J7694J516j8835J5698M264k0068J4106
767B259P919k1441J0677J1743k0511O797J3705j9113L805J5544j7603L98J6627
780A0806j5220k089J6786j3692m051J7844j2237o983J8625r749r715J8663p222
793A766j2357J8517m000j4983J7150m17j6393J5092K467j7145J3077N070j7489
806i645J0880P202j7422Q956R077j7519P052J1198j7505M707J3461j7098J812
$$ plain form
819 -4844 10835 -4967 -6632 10511 -2997 -7896 9771 -1068 -8807 8634 825 -9049 7266
832 7266 2052 -8982 6416 3152 -9319 5416 4569 -9276 4154 5573 -9215 3200 6910
845 6910 -9381 1427 8390 -8481 -523 8841 -7461 -1868 9403 -6528 -3697 9572 -4786
858 -4786 -4832 8801 -3835 -5274 8947 -3111 -6666 8878 -1416 -7512 8045 -385 -8102 7958
872 7958 1145 -9451 6765 3478 -9350 4852 4448 -8881 3929 5650 -8962 2115 6946
885 6946 -7646 523 6732 -6920 158 7447 -6929 -1450 8313 -5607 -2752 8050 -5036 -3506
899 -3506 8918 -4286 -5682 8949 -2011 -6676 7693 -975 -6951 7585 198 -8138 6532
912 6532 2080 -7862 5119 2356 -7748 5135 3469 -8670 3796 5196 -7987 2340 5474
$$ packed form
819d844J5679j5802j665J7143j3508m899J7667j0839p739J7441p809r874J6315
832G266n214j1034J5398l264j2471J4735q47j3845J3430J419j4788J2415L710
845F910j6291J0808O963j6871P958R364j6302N593J1271j5931K831J3269j4358
858d786m6J3633j2636j439J4221j2058l555J5544j0294o096J5557q430p717J6060
872G958o813j0596J6216l287j2828J4202m04j3329J2810J721j4612J1077M831
885F946j4592Q169O209j3652P078P289j4376N479R763j3920K855J0802j3086J530
899c506J2424j3204j396J4631j0960m665J4369q668n976J4536p387q336J4670
912F532m452r942J2981k763j0104J2883j666j2139J2466J400j3183J0327L134
$$ plain form
925 5474 -7801 1778 6944 -7861 -481 8074 -5992 -2045 7478 -5071 -2609 8022 -4272 -4396
939 -4396 7763 -2316 -4778 6683 -2069 -4982 7284 -1299 -6647 6787 577 -6860 5752 1042
953 1042 -7334 5844 2621 -8499 4169 4490 -7633 2629 4602 -7365 2234 5819 -7440 336
967 336 6622 -5873 -581 6110 -5696 -819 7219 -5454 -2765 7619 -3695 -3595 7035 -3226
981 -3226 -4320 7688 -1955 -6185 6797 215 -6131 5424 583 -6221 5431 1747 -7100 4070
995 4070 3094 -6370 3124 3002 -6589 3178 4292 -7223 1609 5509 -6287 555 5587 -6272 -92
1010 -92 6907 -5853 -2168 7239 -4033 -2972 6546 -3513 -3386 7018 -2614 -4782 6460 -1069
1024 -1069 -4848 5728 -831 -5298 6061 327 -6517 5067 1950 -6379 4015 2479 -6612 3534
$$ packed form
925E474j3275R579N166j4805P380Q555j4066L947R523j2549K462J0631j2294j24
939d396J2159j0079k462J1461q752k913J2266q583n348J3434o210p437J2612m710
953A042q376J3178l223j1120J2668L21j2123J0262J973j1967R599L585j3259P776
967C36O286j2495N292O691j1806M877Q038j2673K689J0384j1314J00J0630j0261
981c226j094J2008r643m230J2982o582o346J1555m841o804J1652l684q847J1170
995D070r76r464R494j22r591R767J114j1515Q832L900j1796O842N032j1859O180
1010i2O999j2760L685R407j1272J061R518j0059J27J0404r632k168J1242p529
1024a069l779J0576o559m467J1359n734o844J1584l117q329J0394j536r091J0146
$$ plain form
1038 3534 3865 -6892 1860 4885 -5885 788 4856 -5585 275 5622 -5277 -1040 5884 -4276
1052 -4276 -1593 5781 -4157 -2148 6561 -3608 -3599 6658 -2317 -4327 6300 -1564 -5094 6243 -276
1067 -276 -5976 5324 1057 -5929 4408 1652 -5998 3888 2575 -6172 2878 3363 -5836 2125 3832
1082 3832 -5834 1456 4728 -5687 263 5399 -5043 -784 5760 -4446 -1816 6108 -3543 -2883
1096 -2883 5991 -2528 -3504 5705 -1767 -4028 5497 -1040 -4539 5243 -332 -5036 5004 489 -5597
1111 -5597 4572 1478 -5994 3907 2484 -6214 3024 3496 -6104 1923 4199 -5665 955 4712 -5207
1126 -5207 -20 5101 -4485 -890 5142 -3867 -1435 5355 -3479 -2291 5659 -2657 -3161 5507 -1862
1141 -1862 -3789 5509 -1035 -4718 5155 247 -5147 4288 1018 -5177 3846 1676 -5571 3144 2640
$$ packed form
1038C534L31j0757Q752L025j0770O673M068j0441N860N347j0899M237O924j0160
1052d276K683P374r938K009Q709j0169RJ0257q975k010J0627p864l530J1337o519
1067b76n700J1300m267o986J0337k756p650R886j313q747R050M85r199P961J707
1082C832r666P290L272j0415N950N136j0442M259O544j0206K630P924r651O60
1096b883Q874q519r76R209p472k261R525o537l499R782n575m704J0040m515o086
1111e597J0169l094p472R901j423q698R238M72r600Q027K276r864O620L757r919
1126e207N187N121r586L595O032r009K432O790q834J188P950q316n04Q668p369
1141a862j927R298o544l683R873m908n394R435l270o195R023k170p247Q715n04
$$ plain form
1156 2640 -5398 2269 2950 -5225 1992 3566 -5543 1111 4523 -5045 59 4750 -4611 -518 5386
1171 5386 -4297 -1847 5817 -2979 -2808 5236 -2146 -3041 5245 -1574 -3939 4992 -335 -4173 4165
1186 4165 43 -4213 4271 615 -5138 3741 1937 -5156 2685 2312 -5057 2483 3110 -5550 1333
1201 1333 4226 -4806 148 4112 -4301 -55 4588 -4299 -1160 5094 -3219 -1845 4629 -2895 -1940
1216 -1940 5188 -2666 -3223 5378 -1253 -3805 4631 -672 -3971 4743 121 -4970 4012 1604 -4767
1231 -4767 2806 1804 -4489 2716 2391 -5002 1741 3346 -4359 823 3168 -4211 780 3879 -4518
1246 -4518 -415 4631 -3574 -1281 4367 -3250 -1568 4983 -2868 -2906 5022 -1448 -3254 4248 -1135
1261 -1135 -3245 4544 -613 -4188 4132 608 -4099 3397 724 -4217 3593 1557 -5008 2619 2735
$$ packed form
1156B640q038P667O81q175P217J574r109O654L412r568N104M691r361M093N904
1171E386r683K450P664q796J71Q044p382q95Q286o819k365Q931n327l838Q338
1186D165m122m256Q484l656n753Q879j804p093P841l73p369P540O27q660O883
1201A333K893r032M954L964q413M246M643q887L139O254q313J374O474p524R55
1216a940P128p854n57Q601o631k552Q436n303l299Q714m622n091Q982k408o371
1231d767P573j002o293P205l25p393O743J605p705N182K345p379M991L099q397
1246d518M103N046q205K293N648p617J682O551p851l8P928o470j806P502n383
1261a135k110P789n157l575Q320l524m707P496k673m941P810k036o565P627J16
$$ plain form
1276 2735 -4530 1656 2799 -4434 1382 3632 -4567 0 4234 -3467 -778 3774 -3191 -900 4269
1291 4269 -3020 -2008 4394 -1965 -2331 3939 -1889 -2536 4530 -1376 -3706 4299 -83 -3846 3615
1306 3615 222 -4008 3729 1082 -4673 2847 2140 -4196 2046 2134 -4132 1986 2845 -4399 956 3484
1322 3484 -3725 296 3360 -3678 2 4070 -3555 -1232 4378 -2551 -1897 4029 -2153 -2310 4274
1337 4274 -1506 -3223 3901 -427 -3293 3321 -187 -3382 3419 382 -3942 2958 1228 -3854 2469
1352 2469 1478 -4013 2343 2258 -4317 1524 3025 -3926 814 3234 -3751 298 3768 -3451 -646 3945
1368 3945 -2738 -1194 3776 -2400 -1572 3936 -1975 -2276 3853 -1287 -2691 3644 -826 -3147 3560
1383 3560 -85 -3659 3101 749 -3780 2565 1314 -3841 2099 1916 -3811 1488 2385 -3588 986
$$ packed form
1276B735p265O186J143p233N816K250q199M567M234p701K689M552o965K291N169
1291D269p289J012O402o359l66O270n828o47P066n906k330Q005m382l763P461
1306C615l393m230P737k647n755P520p07o336O242Q8o266O118Q59p244N355K528
1322C484p209M021L064p038L680M068p625K323N610o929O54N926o182j57O584
1337D274n780j717P124m328k866O614l508l195O801l037m324O900j730n082O323
1352B469r91n491O356q5o575N841J501o951M740K420o985M049L470p219K805M591
1368C945o683J544M970o176Q28N508n911l01O129n140j404O335m470k321O707
1383C560l645l574O760k352m529O345j251n155N940j83n727N299Q97n973M574
$$ plain form
1398 986 2708 -3425 549 3050 -3259 43 3360 -3030 -477 3665 -2734 -1126 3879 -2275 -1758
1413 -1758 3930 -1709 -2376 3819 -1010 -2838 3455 -400 -3075 3122 92 -3334 2793 708 -3480
1428 -3480 2302 1168 -3480 1966 1623 -3650 1484 2301 -3533 818 2659 -3255 359 3039 -3105
1443 -3105 -321 3439 -2546 -985 3351 -2066 -1220 3423 -1854 -1745 3531 -1255 -2147 3243 -932 -2324
1459 -2324 3338 -639 -2964 3236 219 -3285 2626 670 -3294 2414 1146 -3652 1837 1942 -3432
1474 -3432 1018 2087 -3083 814 2395 -3179 178 2924 -2618 -471 2789 -2300 -557 3122 -2292
1489 -2292 -1345 3470 -1472 -1927 3087 -1038 -1999 3218 -745 -2689 3060 180 -2824 2382 379 -2680
1505 -2680 2467 607 -3223 2118 1410 -3122 1444 1464 -2996 1470 1871 -3413 792 2654 -2912 -23
$$ packed form
1398I86J722o133L974K501o309L302L317o390K553M142o399J608N005o154N17
1413a758N688n639o67O195m829j828O293l855k675O197l030l426O127k085m188
1428c480N782j134m648N446l43n273N134Q17n834M351J841n914L614K680o144
1443c105K784L760n985J561M336n417Q46M643n277J09N276m786q92N390m175j392
1459b324N662l977k325O200l017l504N911j956l964N708j268m798N489J05n374
1474c432M450J069n170L897J581n574L357K746n542K147L260n089J743L679n414
1489b292R47M815m942m55N014m125r61N217l963j944N749k880l004N206k003l059
1505b680N147j860l830N341p08m532M566K0m460M466M01n284M205J862n566K889
$$ plain form
1521 -23 2547 -2566 -151 2911 -2542 -998 3238 -1611 -1527 2718 -1257 -1424 2909 -1143 -2135 2933
1537 2933 -260 -2342 2377 -58 -2319 2573 288 -3019 2213 1225 -2903 1483 1291 -2747 1497
1552 1497 1695 -3125 811 2334 -2611 179 2105 -2405 225 2451 -2568 -499 2837 -1899 -945
1567 -945 2534 -1745 -1030 2936 -1560 -1896 2966 -599 -2145 2404 -325 -2147 2514 110 -2719 2073
1583 2073 933 -2490 1459 909 -2383 1580 1307 -2777 984 1915 -2375 479 1785 -2356 482 2259
1599 2259 -2516 -299 2634 -1870 -738 2361 -1721 -834 2675 -1546 -1556 2635 -779 -1664 2205 -737
1615 -737 -1677 2473 -440 -2277 2235 300 -2255 1779 412 -2332 1833 934 -2700 1247 1585 -2343
1631 -2343 691 1568 -2232 573 1964 -2253 -92 2220 -1713 -432 2012 -1611 -493 2285 -1539
$$ packed form
1521b3K570n113K415L062n453J544M236m849Q4M245l975j67M333m052r92N068
1537B933l193k082M719k435k261M892k285l307N232r88m128M386j92m038M244
1552A497J98m820L936J523m945K790J926m510K630K226n019K069L336m736R54
1567i45L479m279P15L966m496l36M862l565j546M549k729j822M661k404k829M792
1583B073j140l423L949n50l292L963k73m084L761R31m290K854J306m141K838J777
1599B259m775K217K933m504J132L099m082Q87L509m221j0M191l414q85L869k942
1615g37r40M150k913j837M512j935k555M034j367k744M165q99l634L947L38l928
1631b343L034Q77l800K805J391m217K161K312l933J281K444l623J118K778l824
$$ plain form
1646 -1539 -1061 2384 -1037 -1323 2178 -898 -1483 2382 -591 -2020 2188 36 -2082 1815 242 -2113
1662 -2113 1734 584 -2327 1386 1041 -2179 1025 1148 -2161 879 1494 -2200 413 1819 -1956 24
1678 24 1925 -1805 -277 2158 -1585 -790 2239 -1143 -1134 2117 -817 -1359 2043 -523 -1608 1904 -187
1695 -187 -1721 1769 43 -1864 1665 335 -2018 1484 664 -2133 1254 989 -2165 957 1294 -2118
1711 -2118 643 1538 -2029 287 1782 -1829 -104 1861 -1582 -357 1922 -1410 -653 2028 -1122
1726 -1122 -985 1963 -832 -1184 1973 -609 -1532 1957 -139 -1799 1652 212 -1817 1479 457 -1983
1742 -1983 1270 869 -1964 878 1028 -1820 773 1151 -1941 541 1521 -1814 156 1551 -1638 52
1758 52 1719 -1701 -338 2033 -1341 -789 1903 -1025 -894 1928 -883 -1294 1959 -360 -1528 1585
$$ packed form
1646a539M78L445l421k86L501l076n85L865k973j429M208k152k118L897j573k355
1662b113L847j150k911L713l45l220L204J23l309L040O15l694K613J406l775J980
1678B4J901l730J528K435l743P95L029l382RL251k934n42L402k566j085L512k091
1695a87j534L490j726j907L529j330k353L502q20k797L387k65l154L122L37l412
1711b118K761Q95l567K316J495l611J725J965l443J225K279l332P57K681l150
1726a122J37K948k795l52L157k582r23L489k096j660L451j440k029L296j022k440
1742a983L253m01k833K842J50k848K593L78l092K482R80l335J970J395l189J690
1758E2J667l420J363K371l374N52K692k928J31K822k811m11L253k319j168L113
$$ plain form
1774 1585 -119 -1453 1594 9 -1794 1490 556 -1850 1033 719 -1712 1015 918 -1989 701 1454
1790 1454 -1777 176 1427 -1519 163 1565 -1633 -240 1884 -1244 -642 1637 -1024 -535 1739
1805 1739 -1123 -955 1929 -643 -1252 1612 -487 -1204 1755 -389 -1699 1691 288 -1768 1178 427
1821 427 -1586 1204 585 -1916 926 1161 -1709 406 1096 -1465 477 1269 -1698 87 1699 -1327
1837 -1327 -362 1512 -1139 -309 1701 -1222 -826 1935 -662 -1158 1545 -476 -1024 1629 -452 -1472
1853 -1472 1599 93 -1527 1172 122 -1386 1335 235 -1805 1143 810 -1710 691 816 -1582
1868 -1582 756 1072 -1815 337 1545 -1431 -123 1391 -1217 -115 1579 -1254 -586 1751 -736
1883 -736 -850 1449 -615 -789 1607 -588 -1254 1615 -67 -1376 1269 2 -1369 1364 209 -1738
$$ packed form
1774A585j704j334L047j585j803L284r34k406K883l14k431K727r7k907K690P53
1790A454l231J953J251k946J682J402l198J393K124l128O02K279k661M89K274
1805A739k862J68K884k572o09K864k099p17K959k144j310L390j403k056K946p51
1821D27k013K790o19k501K842K35k870K115O90k561J942P92k967J785J612l026
1837a327R65J874k651Q30K010k923L96K761k597m96K703k021n48K653k081j020
1853a472L071j506j620K699j050j508K721j100k040K948l33k520K401J25k398
1868a582K338L16k887K152J208k976J308J514k608J102J694k833O68K337k487
1883g36j14K299k064j74K396k195o66K869j682j309K645j267j371K733j155j947
$$ plain form
1899 -1738 1114 699 -1612 730 658 -1525 794 884 -1723 431 1234 -1431 155 1132 -1355 186 1405
1916 1405 -1413 -244 1633 -1019 -512 1485 -901 -599 1686 -744 -1064 1637 -220 -1184 1314 -106
1932 -106 -1198 1358 74 -1506 1135 480 -1445 826 486 -1449 862 725 -1651 547 1055 -1476
1948 -1476 264 1042 -1423 199 1289 -1439 -164 1481 -1101 -399 1382 -963 -475 1515 -835 -769
1964 -769 1521 -503 -904 1388 -384 -1008 1448 -179 -1282 1322 195 -1367 1086 380 -1433 936
1980 936 626 -1525 664 894 -1446 373 983 -1369 196 1122 -1312 -47 1260 -1165 -253 1312
1996 1312 -1041 -407 1385 -905 -607 1458 -711 -816 1480 -482 -994 1414 -236 -1108 1321 -15
2012 -15 -1227 1201 216 -1313 1006 403 -1315 881 563 -1400 691 822 -1403 405 985 -1312 207
$$ packed form
1899a738K852m15k311K342p2k183K319R0k607K154Q03k665J586R77k487J541J219
1916A405k818J169J877k652N07J997k386L02K285k430l20K701j857r64K498j420
1932a06j092K556j284j580K641o55j925K271l40j935K311j37k376K198N08k531
1948a476J740P78k465J622J090k728J275J645k582P02J781k345M88J990k350O6
1964g69K290k024m01K292j772o24K456j627j103K604j127j562K453p06j813K369
1980I36l10k151K189K30k340J819O10k352J565R26k434J265J307k425R12J565
1996A312k353O34J792k290K98K065k169j05K296j962n12K408j650q72K429j336
2012a5j212K428r85j529K319o03j718K196l18j963K091J31k225J808N80k297J519
$$ plain form
2029 207 1086 -1308 -50 1313 -1128 -388 1324 -890 -528 1331 -791 -742 1395 -506 -941 1253 -302
2046 -302 -943 1235 -228 -1125 1261 90 -1274 1045 284 -1224 987 390 -1394 852 749 -1379
2062 -1379 508 848 -1219 421 939 -1316 189 1220 -1148 -177 1154 -927 -231 1195 -969 -500
2078 -500 1405 -670 -816 1238 -443 -821 1261 -390 -1125 1299 54 -1279 954 232 -1128 938
2094 938 290 -1339 865 665 -1317 512 702 -1138 537 767 -1325 372 1124 -1174 -8 1062
2110 1062 -987 7 1142 -1105 -303 1405 -772 -649 1173 -539 -598 1213 -555 -905 1288 -145
2126 -145 -1103 961 -4 -976 1029 61 -1278 963 532 -1294 560 604 -1111 588 705 -1349 368
2143 368 1074 -1152 -3 995 -936 72 1047 -1073 -200 1292 -758 -464 1105 -609 -385 1167 -717
$$ packed form
2029B07Q79k394J258J363k441P40J712k214L62J859k122M9K137j901m35K194j555
2046c02o41K178j463q97K386j171j364K319p61j508K211n97j784K246j03k128
2062a379J887L40k067J640N18k255J505J031k368R71J331k081O96J426k164M69
2078e00J905k075j46K054j681l78K082j651p35K424j245j333K233p22j360K066
2094I38o48j629K204k00j982J829J90j840J675K30k092J697P52k298J166J070
2110A062k049R94J135k247Q02J708k177J23J822j712n9J811j768l50K193j433
2126a45r58K064r65r72K005r68j339K241m31j826J854M4j715J699J17k054J717
2143C68P06k226J149R98j931J008R75k120Q73J492k050K94J569j714K24J552j884
$$ plain form
2160 -717 -701 1298 -272 -941 1038 -174 -852 1062 -137 -1213 1029 337 -1200 602 392 -1067 631
2177 631 475 -1268 482 862 -1141 106 812 -998 197 958 -1080 -117 1246 -787 -435 1039 -661
2194 -661 -311 1158 -656 -638 1249 -319 -865 1047 -187 -789 1042 -140 -990 1044 204 -1037 725
2211 725 169 -1021 791 261 -1200 649 647 -1074 273 686 -1045 257 829 -1145 -36 1028 -875
2228 -875 -262 1042 -722 -281 1088 -651 -565 1140 -356 -700 983 -264 -680 1043 -221 -942 997
2245 997 140 -975 763 249 -954 753 342 -1105 605 568 -1006 371 560 -982 327 682 -1021
2262 -1021 123 859 -855 -82 861 -792 -164 947 -738 -385 1043 -516 -564 984 -355 -645 996
2279 996 -205 -823 921 25 -887 776 157 -907 721 291 -972 602 458 -971 453 553 -963
$$ packed form
2160g17J6J999j570o69J979j212o78J914j199j076K242o92j537J802k10j459J698
2177F31j56j743J750L80k003J247P06j810J195P61k038R63J363k033L52J474j700
2194f61L50J469j814J8J887j568n46J912j234o02J831j182q50K034q40j241J762
2211G25n56j190J812n30j461J849kj721J347M13j731J302N72j974J109J064j903
2228h75O13J304j764M41J369j739Q6J705j496l44J683j247m16J723j264p21J939
2245I97q57j115J738n14j203J707m11j447J710l7j574J377J89j542J309L55j703
2262a021J144P36j714P73R43j653O28J111j685L53J428j559m8J548j339k90J641
2279I96j201o18J744q96r12J663o19j064J628m30j263J574j44j429J424J00j516
$$ plain form
2296 -963 324 670 -938 176 781 -884 10 842 -784 -154 886 -694 -277 900 -589 -420 926
$$ packed form
2296i63J287L46j608J114O05j665Q94Q32j626O30J040j580M17J177j489J69J346
$$ [...]
8191b0
##END NTUPLES=NMR FID
##END=
