##TITLE=1H_LY-13Dix.5.B
 CD3CN, 8 sc, 
 4.06.2021
##JCAMPDX= 6.0         $$ Bruker NMR JCAMP-DX V2.0
##DATA TYPE= NMR FID
##DATA CLASS= NTUPLES
##ORIGIN= UXNMR, Bruker Analytische Messtechnik GmbH
##OWNER= root
$$ XWIN-NMR		Version 3.5
$$ Fri Jun  4 11:46:47 2021 Russian Standard Time (UT+4h)  she@DPX200
##.OBSERVE FREQUENCY= 200.131506
##.OBSERVE NUCLEUS= ^1H
##.DELAY= (6, 6)
##.ACQUISITION MODE= SIMULTANEOUS
##.ACQUISITION SCHEME= undefined
##.AVERAGES= 8
##.DIGITISER RES= 18
##SPECTROMETER/DATA SYSTEM= spect
##.PULSE SEQUENCE= zg30
##.SOLVENT NAME= CD3CN
##.SHIFT REFERENCE= (INTERNAL, CD3CN, 0, 15.7039)
##AUDIT TRAIL= $$ (NUMBER, WHEN, WHO, WHERE, WHAT)
$$ ##TITLE= Audit trail, XWIN-NMR		Version 3.5
$$ ##JCAMPDX= 5.01
$$ ##ORIGIN= Bruker BioSpin GmbH
$$ ##OWNER= she
$$ F:/spectra/data/she/nmr/H-F/1/audita.txt
$$ ##AUDIT TRAIL=  $$ (NUMBER, WHEN, WHO, WHERE, WHAT)
(   1,<2021-06-04 11:45:34.20 +0400>,<she>,<DPX200>,
      <created by zg, POWCHK disabled, PULCHK disabled
       configuration hash MD5:
       00 E9 B6 7A A2 85 ED C7 34 08 36 98 17 FE 4E 26
       data hash MD5: 16K
       B5 8D 75 B5 5C 95 E4 AA D7 57 A5 07 8F E4 40 61>)
$$ ##END=
$$ 
$$ hash MD5
$$ EA 29 2A CA 28 EE 4B BE FD F5 FE A6 22 D9 73 84
##$RELAX= 
##$RELAX= 
##$RELAX= 
##$RELAX= 
##$RELAX= 
##$RELAX= 
$$ Bruker specific parameters
$$ --------------------------
##$DU= <F:/spectra>
##$EXPNO= 1
##$NAME= <H-F>
##$PROCNO= 1
##$TYPE= <nmr>
##$USER= <she>
##$AMP= (0..31)
100 100 100 100 100 100 100 100 100 100 100 100 100 100 100 100 100 100 
100 100 100 100 100 100 100 100 100 100 100 100 100 100 
##$AQSEQ= 0
##$AQ_mod= 1
##$AUNM= <au_zg>
##$AUTOPOS= <>
##$BF1= 200.13
##$BF2= 200.13
##$BF3= 200.13
##$BF4= 200.13
##$BF5= 200.13
##$BF6= 200.13
##$BF7= 200.13
##$BF8= 200.13
##$BYTORDA= 1
##$CFDGTYP= 0
##$CFRGTYP= 5
##$CHEMSTR= <none>
##$CNST= (0..31)
1 1 145 1 1 1 1 1 1 1 1 1 1 1 1 1 1 1 1 1 1 1 1 1 1 1 1 1 1 1 1 1 
##$CPDPRG= <>
##$CPDPRG1= <>
##$CPDPRG2= <>
##$CPDPRG3= <>
##$CPDPRG4= <mlev>
##$CPDPRG5= <mlev>
##$CPDPRG6= <mlev>
##$CPDPRG7= <mlev>
##$CPDPRG8= <mlev>
##$CPDPRGB= <>
##$CPDPRGT= <>
##$D= (0..31)
0 1.2 0 0 0 0 0 0 0 0.06 0 0.03 0 0 0 0 0.0002 0 0 0 0 0 0 0 0 0 0 0 0 
0 0 0 
##$DATE= 1622792733
##$DBL= (0..7)
120 120 120 120 120 120 120 120 
##$DBP= (0..7)
150 150 150 150 150 150 150 150 
##$DBP07= 0
##$DBPNAM0= <>
##$DBPNAM1= <>
##$DBPNAM2= <>
##$DBPNAM3= <>
##$DBPNAM4= <>
##$DBPNAM5= <>
##$DBPNAM6= <>
##$DBPNAM7= <>
##$DBPOAL= (0..7)
0.5 0.5 0.5 0.5 0.5 0.5 0.5 0.5 
##$DBPOFFS= (0..7)
0 0 0 0 0 0 0 0 
##$DE= 6
##$DECBNUC= <off>
##$DECIM= 32
##$DECNUC= <off>
##$DECSTAT= 4
##$DIGMOD= 1
##$DIGTYP= 9
##$DL= (0..7)
0 120 120 120 120 120 120 120 
##$DP= (0..7)
150 150 150 150 150 150 150 150 
##$DP07= 0
##$DPNAME0= <>
##$DPNAME1= <>
##$DPNAME2= <>
##$DPNAME3= <>
##$DPNAME4= <>
##$DPNAME5= <>
##$DPNAME6= <>
##$DPNAME7= <>
##$DPOAL= (0..7)
0.5 0.5 0.5 0.5 0.5 0.5 0.5 0.5 
##$DPOFFS= (0..7)
0 0 0 0 0 0 0 0 
##$DQDMODE= 0
##$DR= 18
##$DS= 0
##$DSLIST= <SSSSSSSSSSSSSSS>
$$ [...]
##$SUBNAM2= <"">
##$SUBNAM3= <"">
##$SUBNAM4= <"">
##$SUBNAM5= <"">
##$SUBNAM6= <"">
##$SUBNAM7= <"">
##$SUBNAM8= <"">
##$SUBNAM9= <"">
##$SW= 20.0188882624521
##$SWIBOX= (0..15)
0 0 2 0 0 0 0 0 0 0 0 0 0 0 0 0 
##$SW_h= 4006.41025641026
##$TD= 16384
##$TD0= 1
##$TE= 0
##$TE2= 300
##$TE3= 300
##$TEG= 300
##$TL= (0..7)
0 120 120 120 120 120 120 120 
##$TP= (0..7)
150 150 150 150 150 150 150 150 
##$TP07= 0
##$TPNAME0= <>
##$TPNAME1= <>
##$TPNAME2= <>
##$TPNAME3= <>
##$TPNAME4= <>
##$TPNAME5= <>
##$TPNAME6= <>
##$TPNAME7= <>
##$TPOAL= (0..7)
0.5 0.5 0.5 0.5 0.5 0.5 0.5 0.5 
##$TPOFFS= (0..7)
0 0 0 0 0 0 0 0 
##$TUNHIN= 0
##$TUNHOUT= 0
##$TUNXOUT= 0
##$USERA1= <user>
##$USERA2= <user>
##$USERA3= <user>
##$USERA4= <user>
##$USERA5= <user>
##$V9= 5
##$VALIST= <valist>
##$VCLIST= <CCCCCCCCCCCCCCC>
##$VD= 0
##$VDLIST= <DDDDDDDDDDDDDDD>
##$VPLIST= <PPPPPPPPPPPPPPP>
##$VTLIST= <TTTTTTTTTTTTTTT>
##$WBST= 1024
##$WBSW= 4
##$XGAIN= (0..3)
0 0 0 0 
##$XL= 0
##$YL= 0
##$YMAX_a= 150257
##$YMIN_a= -161799
##$ZGOPTNS= <>
##$ZL1= 120
##$ZL2= 120
##$ZL3= 120
##$ZL4= 120
##$ABSF1= 10
##$ABSF2= 0
##$ABSG= 5
##$ABSL= 3
##$ALPHA= 0
##$AQORDER= 0
##$ASSFAC= 0
##$ASSFACI= 0
##$ASSFACX= 0
##$ASSWID= 0
##$AUNMP= <proc_1d>
##$AZFE= 0.1
##$AZFW= 0.1
##$BCFW= 1
##$BC_mod= 2
##$BYTORDP= 1
##$COROFFS= 0
##$CY= 11.3945322036743
##$DATMOD= 1
##$DC= 2
##$DFILT= <>
##$DTYPP= 0
##$F1P= 15.9154993809931
##$F2P= -4.1035820241983
##$FCOR= 0.5
##$FTSIZE= 0
##$FT_mod= 4
##$GAMMA= 1
##$GB= 0.15
##$INTBC= 1
##$INTSCL= 1
##$ISEN= 128
##$LB= 0.24
##$LEV0= 0
##$LPBIN= 0
##$MAXI= 10000
##$MC2= 0
##$MEAN= 0
##$ME_mod= 0
##$MI= 1.114404
##$NCOEF= 0
##$NC_proc= 0
##$NLEV= 6
##$NOISF1= 3.799351
##$NOISF2= 2.8
##$NSP= 1
##$NTH_PI= 0
##$NZP= 0
##$OFFSET= 15.70392
##$PC= 1
##$PHC0= -11202.99
##$PHC1= 13.20099
##$PH_mod= 1
##$PKNL= yes
##$PPARMOD= 0
##$PSCAL= 0
##$PSIGN= 0
##$REVERSE= no
##$SF= 200.130013532006
##$SI= 16384
##$SIGF1= 3
##$SIGF2= 2
##$SINO= 400
##$SIOLD= 16384
##$SREGLST= <1H.CDCl3>
##$SSB= 0
##$STSI= 0
##$STSR= 0
##$SW_p= 3612.71676300578
##$SYMM= 0
##$S_DEV= 0
##$TDeff= 0
##$TDoff= 0
##$TI= <>
##$TILT= no
##$TM1= 0
##$TM2= 0
##$TOPLEV= 0
##$USERP1= <user>
##$USERP2= <user>
##$USERP3= <user>
##$USERP4= <user>
##$USERP5= <user>
##$WDW= 1
##$XDIM= 8192
##$YMAX_p= 0
##$YMIN_p= 0
$$ End of Bruker specific parameters
$$ ---------------------------------
##NTUPLES= NMR FID
##VAR_NAME=  TIME,          FID/REAL,        FID/IMAG
##SYMBOL=    X,             R,               I
##VAR_TYPE=  INDEPENDENT,   DEPENDENT,       DEPENDENT
##VAR_FORM=  AFFN,          ASDF,            ASDF
##VAR_DIM=   8192,          8192,            8192
##UNITS=     SECONDS,       ARBITRARY UNITS, ARBITRARY UNITS
##FACTOR=    0.0002496,     1,               1
##FIRST=     0,             0,               0
##LAST=      2.0444736,     0,               0
##MIN=       0,             -161799,         0
##MAX=       2.0444736,     150257,          0
$$ Real data points
##PAGE= N=1
##DATA TABLE= (X++(R..R)), XYDATA
$$ [...]
2279A229k93k000r4J900M86j830p28J741R96j600j281J380J553j102j725Q03J801
2296A236n17j869K47J954P8j959m39J868P73j713j043J533J281j316j550J041
2312c95J763o97j863L04J882Nj838l24J794O25j675r49J516J233j282j443J006
2329c38J607p41j762M32J869r6j855k65J799N57j685p89J544J036j372j293J200
2346a52J486r45j647O81J765l97j850R7J852K38j826n44J715Q53j567j090J356
2363B5J302j129j476Q79J616o23j734L01J820N6j830l95J718P09j550r92J374
2380G1J213j148j414Q81J580n83j661L04J696l3j720k63J707N82j621q76J433
2397A48J129j185j312R98J447p85j603N14J709k04j714p5J669L03j619n57J574
$$ y = [1229, 936, -1064, -1158, 742, 1228, -602, -1330, 411, 1407, -193, -1474, -94, 1459, 357, -1368, -565, 1236, 719, -1150, -903, 1051, 1129, -830, -1269, 599, 1372, -341, -1384, 149, 1430, 114, -1436, -395, 1368, 671, -1192, -888, 994, 999, -839, -1163, 631, 1256, -419, -1368, 148, 1381, 99, -1344, -338, 1269, 528, -1234, -802, 1067, 971, -884, -1149, 650, 1207, -478, -1267, 277, 1313, -59, -1352, -152, 1334, 389, -1258, -577, 1188, 791, -1059, -962, 890, 1128, -698, -1242, 473, 1326, -241, -1331, 25, 1327, 198, -1278, -399, 1217, 594, -1140, -839, 981, 1037, -793, -1188, 530, 1239, -311, -1303, 71, 1284, 136, -1278, -397, 1183, 600, -1061, -757, 939, 906, -814, -1077, 630, 1212, -409, -1285, 148, 1277, 92, -1220, -222, 1225, 440, -1163, -649, 1060, 856, -858, -933, 736, 1039, -580, -1137, 437]
2414D37Q35j498j125J265J346r65j484P35J569m84j679J98J728J39j688m67J560
2431D22P03j418r06J296J165j115j403P95J570m55j613J86J600P5j616l39J592
2448E39O64j462r53J231J122j028j221Q74J379o67j581M04J655o3j645k08J561
2465F01M20j525o30J445R30j296j174J022J307p94j380O28J453m24j599J33J687
2482H04K19j592n13J435P28j321r14J202J173r81j398O59J477l60j454J48J480
2499G92L5j520l43J525O94j350r64J099J118r14j219P56J368n48j535K33J548
2516G75Q1j444k80J380M17j382o60J349R48j163j177R04J281o68j328M88J418
2533I39k91j514j8J533K98j392n20J284O84j204q86J115J147q82j341N63J387
$$ y = [437, 1272, -226, -1351, -86, 1260, 295, -1189, -454, 1115, 631, -1048, -850, 878, 1017, -671, -1138, 422, 1125, -293, -1199, 97, 1262, 147, -1256, -461, 1109, 654, -959, -773, 827, 902, -714, -1053, 539, 1203, -259, -1212, 19, 1141, 113, -1108, -234, 1145, 478, -1103, -699, 956, 893, -752, -960, 601, 1021, -504, -1134, 311, 1241, -55, -1229, -207, 1100, 306, -1074, -446, 1007, 583, -1016, -883, 804, 1023, -569, -1082, 353, 1081, -240, -1154, 48, 1221, 240, -1158, -499, 978, 618, -836, -688, 792, 827, -693, -1036, 489, 1183, -167, -1131, -32, 1086, 172, -1047, -291, 1077, 529, -1006, -773, 775, 856, -588, -868, 512, 929, -453, -1113, 236, 1184, 21, -1156, -252, 1029, 361, -967, -479, 939, 648, -866, -884, 649, 947, -445, -965, 319, 1003, -201, -1087, 28, 1175, 293, -1048, -485, 902]
2550I02k79j389P8J407J41j434m29J349P12j157r25R70J014p91j157O66J317m37
2568E58j437J07J431J64j366l56J306N21j248p47J124R98r20j122P03J169n29
2585C56j247L86J364j51j432j25J393L69j278n50J169P31j100r25R30J147o79
2602C58j249M24J254k17j274L2J318J77j307m87J233P19j040r06Q62J020o91j178
2620i52N11J292k42j316k3J259K41j201l96J167N77j116q02R81R77p57j110N70
2638c40J193l89j256K08J297L1j287k61J206M67j132n93J039P58r58r39P85J102
2656I31n75j195L35J241j28j233r8J244L10j188n56J075P22r20q61P76R83o03
2674B60j090L38J245j83j239m6J210K93j160m76J065O93r50q31P81R45o07j067
$$ y = [902, 623, -766, -688, 719, 860, -574, -1003, 346, 1058, -99, -1024, -54, 960, 169, -988, -322, 995, 558, -879, -772, 659, 823, -543, -899, 407, 928, -320, -1067, 57, 1055, 135, -987, -284, 885, 356, -891, -505, 859, 708, -724, -849, 544, 913, -365, -915, 254, 985, -115, -1040, -110, 1037, 358, -891, -467, 787, 570, -704, -672, 646, 823, -484, -971, 262, 981, -59, -965, -103, 917, 226, -952, -441, 851, 609, -707, -730, 529, 770, -431, -827, 340, 917, -199, -1001, -20, 957, 200, -910, -340, 853, 464, -792, -584, 713, 744, -543, -804, 402, 869, -263, -856, 183, 941, -17, -956, -171, 931, 356, -839, -504, 737, 609, -624, -722, 522, 832, -356, -912, 163, 885, -35, -896, -120, 863, 260, -830, -492, 753, 570, -669, -715, 495, 788, -372, -848, 217, 910, -40, -871, -90, 855, 248, -819]
2692h19M36J169k82j209R6J229J17j206l28J139N25j067o95R41Q53p82r65O13
2710b35J069m56j145K47J178m8j193j45J151L46j092n36J021P19q79q93P02J023
2728H34m93j104K94J140q9j162j14J146L26j075n29R73O86q40q36P33R78n78j096
2747h06L62J163j46j167n2J124K28j093l99J039N79r37p33P95Q48o75r36N48J056
2766G98m10j131J81J177N6j132k42J045L88r80n56R04P49p95q79O05R78m23j020
2785f87K59J085q9j132j42J123L95j006o03Q82O89p36q26O27R47m79j047K67J090
2804F17n4j064j03J060K32j048m46R96O50q57p93O71Q73n50r13M35J006k78j089
2823f55Q1J076J32j026k65R79L90r34n70Q69P71p23r05M99R75l43r73J98J028
$$ y = [-819, -383, 786, 504, -705, -609, 620, 737, -469, -797, 342, 867, -200, -895, 46, 899, 117, -848, -235, 834, 378, -767, -520, 658, 610, -583, -728, 423, 769, -323, -859, 162, 881, 2, -891, -189, 834, 341, -763, -469, 671, 582, -580, -694, 452, 778, -297, -826, 147, 833, -7, -843, -110, 868, 290, -806, -444, 719, 573, -594, -646, 478, 706, -387, -786, 253, 832, -105, -838, -43, 805, 130, -806, -258, 798, 388, -743, -562, 615, 671, -461, -703, 342, 730, -250, -806, 98, 847, 52, -827, -222, 756, 333, -687, -428, 657, 568, -564, -706, 417, 812, -194, -797, 85, 774, 38, -788, -161, 786, 307, -740, -473, 617, 563, -501, -604, 456, 688, -360, -806, 190, 840, -17, -810, -139, 734, 184, -729, -294, 712, 434, -655, -574, 502, 634, -392, -657, 322, 712, -222, -792, 77, 848, 125, -780, -281, 694, 351, -622, -424, 604]
2842F04k6j077j88J025M02r03n55P90O59p22p93O10R66m22j047J65J047jr97j51
2862f14J006L13r97m99R05O92p48p76N90Q18n01r07M03J020k07j089k3J048K13
2881F47r60l33R19M41q76o15P87P77n99q65M35Q67l19r25K03J020k6j060k25R91
2901B84M41q65n44P42O51o80q01N70R27l48r88J45R62J4r40j41R66L01r56n20
2921g80Q54P02o79p95N25Q46m11r26L08R71j12j008o7R44K12q95l22Q82M57q45
2941a39o22P18P78n55q48L85Q83k66r12J25R70M6r65k28Q98L71q07n08P47O24
2961F95o38p62M82Q93k92r34J07R38K1r05k16R34L44q25n38P29O71o34p36M84
2981a82Q12l76r30L12R54o4r50r5Q62K73q91l93Q39N12p32o30O57O72m55q07L36
$$ y = [604, 578, -499, -687, 338, 740, -163, -718, 72, 731, 9, -784, -174, 792, 370, -677, -512, 535, 534, -463, -614, 392, 705, -292, -791, 114, 806, 58, -718, -128, 690, 189, -718, -315, 705, 498, -591, -614, 434, 647, -313, -646, 273, 714, -162, -777, 10, 787, 188, -677, -242, 625, 306, -619, -416, 604, 578, -482, -707, 284, 725, -140, -684, 58, 709, 29, -772, -202, 725, 377, -611, -466, 496, 510, -430, -571, 395, 696, -260, -780, 74, 776, 97, -698, -173, 673, 262, -664, -356, 615, 503, -505, -572, 372, 584, -311, -633, 249, 706, -139, -761, -43, 735, 180, -668, -283, 600, 334, -578, -453, 517, 563, -402, -630, 268, 639, -168, -676, 71, 695, 57, -705, -223, 670, 378, -556, -449, 489, 510, -395, -611, 323, 667, -158, -696, 33, 704, 70, -666, -182, 630, 254, -676, -364, 590, 526, -424, -519, 343, 616, -275, -668, 171, 683, -49, -679, -22, 650, 195, -612, -276]
3002b76Q72k59q79R9R28N8q88k37Q38L82p80m96O68O65n86p20L82Q29k87q18J11
3023c94Q52j0p74k58Q75K89p28n57P59O03n57p72M59Q07l03q42J09R17l2q36j40
3044e33Q47K73q09l87P31N36o66o40N39P42m33p88K73Q47j32q58QQ33J33q10k51
3065e45P62L86p19n05O24O31n12p20L89P96k55q30P4Q52P2q18k24P62L50p19m71
3086f20O44N96n49o97M04P79k55q29J33Q39K4q48j86Q24L31p34m51O51N54n88
3106B2o05M66P19l82p95K62P90n4q06j8Q02J06q01k92P52M73o62n36M88O59m67
3127A21o65L56P81k76q01L2Q13Q7p62k39P55K78o08n24O90N69m80p12L20P53j92
3148B96p55Q1Q13K1q11j90P84L41o93m45O17N14n49o13M62P39l19q09J59P93k1
$$ y = [-276, 596, 337, -542, -443, 485, 543, -345, -582, 256, 638, -142, -638, 30, 695, 109, -611, -229, 600, 313, -505, -394, 458, 448, -326, -584, 291, 580, -148, -705, 54, 657, 100, -672, -213, 594, 291, -551, -442, 475, 443, -393, -533, 314, 587, -222, -609, 122, 658, -8, -648, -109, 633, 200, -588, -315, 532, 400, -458, -450, 383, 516, -294, -545, 217, 603, -116, -621, 3, 634, 122, -598, -209, 587, 332, -498, -424, 428, 500, -318, -542, 220, 570, -149, -620, 24, 620, 71, -626, -222, 557, 302, -527, -394, 445, 469, -379, -565, 259, 590, -144, -595, 56, 610, 22, -583, -117, 602, 220, -575, -313, 477, 423, -383, -401, 401, 507, -294, -586, 166, 639, -23, -559, -71, 588, 121, -544, -188, 593, 317, -484, -452, 361, 448, -314, -553, 202, 480, -128, -652, 38, 607, 127, -585, -265, 488, 296, -459, -378, 435, 456, -355, -545, 239, 580, -113, -558, 59, 573, 24, -589, -127, 612, 293, -516, -357, 436, 415]
3169D15p72p9P69J79p80l01P02M55o12n30N05N76m28o73L48P55j92q10K1P79J39
3190D66p23k33O79L40o61m62N87N91m65o58L25P08k08p69J25P97O2q02k47P37
3210A89L80o38m51N53N19m95o26M10P26k77p61J25P49qp58q4P66K06p40l90O65
3231F0M86n20n56M52N81l61o71K87P28j30p54k2P19J33o92k22O89L44o45n02N41
3252e5O02l84o24K62O82j98p13P0P87N6p41k57O72L83o12m26N48N11m91o43L11
3273b60P71j33p61jP19J8o77j46P44K10n87l90M63N79m92n32L75O02l15o60J70
3294c03P48m1p81l3O68J78o50k52O24L81n97m83M85N81l79n94K58O44j71o99L4
3315c82P41J24p06k74O13L77n53m41M87N39m22o23K79O97j69o96L7O95P1o97j81
$$ y = [415, -357, -436, 333, 512, -268, -569, 133, 588, -24, -554, -49, 527, 99, -574, -226, 529, 337, -473, -452, 327, 466, -257, -490, 189, 529, -132, -594, -7, 584, 119, -539, -214, 494, 286, -483, -358, 439, 501, -301, -548, 189, 569, -69, -520, 33, 552, 57, -569, -159, 567, 290, -471, -346, 403, 395, -363, -447, 319, 525, -215, -605, 60, 546, 26, -530, -78, 503, 142, -529, -242, 486, 356, -398, -420, 299, 432, -260, -482, 207, 551, -94, -596, -55, 547, 163, -461, -199, 483, 285, -428, -358, 429, 485, -256, -513, 159, 542, -70, -496, 52, 563, 72, -571, -260, 511, 378, -383, -384, 335, 353, -324, -470, 274, 484, -103, -493, -30, 549, 57, -475, -100, 502, 187, -473, -303, 445, 404, -377, -410, 258, 436, -214, -466, 158, 539, -58, -541, -56, 525, 146, -448, -190, 454, 283, -416, -382, 359, 483, -223, -497, 116, 493, -60, -501, -14, 525, 103, -520, -241, 456, 287, -409, -372, 323, 394, -303, -484]
3336d84O89L14o25m41N41N20m23n73L41O22k55o64J51O78k1o83q7O69J85o35k89
3357d70N92L92n13n02M26N60l31n83K08O36j17o62lO44J32o28k40N77L53n33m45
3378e07M58N32l45o15K45O42j16o64JO62J18o43k36O29L30n65m13M83N10m13n67
3399d74L14O19j97o58R1O61K1o59j20O28K37n95l38N30L94m31n07L73N56k75o14
3420d44J96O09n2o22n2N51J93o10k37N41L82m49m39L96M98l70n35K70N75j05o29
3441c33k0O14J47n96k36N66L47n18m52M35N35l27n77K15N74j04o00K6O16N1n98
3462b35j74N73K74n23l58M63M14l96n01L33N40k04n81J05N67J0n70q0N61J80n59
3483a61k74M96L82m22m47L29N03k47n52J54O15n4n84j04N65K05n27k51M80L32
$$ y = [-484, 205, 519, -106, -547, -6, 514, 91, -482, -141, 481, 226, -438, -287, 391, 370, -313, -400, 269, 454, -181, -470, 122, 514, 1, -501, -75, 485, 154, -429, -221, 415, 298, -364, -367, 277, 409, -219, -459, 118, 471, -62, -507, -49, 483, 138, -477, -232, 410, 294, -370, -369, 293, 411, -232, -468, 161, 491, -74, -487, -4, 506, 93, -474, -160, 459, 262, -396, -305, 356, 377, -282, -402, 226, 463, -132, -470, 60, 454, 23, -484, -111, 445, 170, -444, -248, 361, 309, -313, -365, 186, 379, -231, -468, 73, 455, 6, -433, -37, 461, 91, -444, -174, 401, 296, -333, -353, 261, 408, -188, -424, 142, 489, -29, -481, -46, 489, 162, -415, -200, 374, 270, -330, -304, 312, 363, -235, -409, 164, 438, -85, -443, 20, 434, 38, -463, -130, 410, 206, -375, -270, 297, 307, -263, -343, 218, 398, -161, -435, 61, 443, 21, -426, -97, 406, 159, -393, -239, 376, 322, -262, -366, 199, 404, -123, -374, 106, 438]
3503D38m51m48L90M99k54n56J39O67j07o24k0O03J05n76k36M84L87m66l71L89
3523hM10l35m97K68N57j52n70M3N53M9n51j10N37K26n20l36M32M25l40m57K73
3544a03M87k13n42J28N79Mn83j23N28K16m90k94M78L79m13m87L10N49k08n48R8
3565b48N52k2n65o6N89J68n51k84M56L43l64m16L51M84l06n38J91N62n1n89J0
3586b94N25O7n08j11N36J65m41l10L56M02l15m59K75M83j69n60R4N70M3n45j62
3607c58M87K28m57k90M16L95l67m75K58N40j66n44P5N69nn84j06N74K40n17l26
3628d13M42L70l61m32L29M82k45n67J60N73m0n44o4N37J34n43k11N11K99m29l92
3649d04L45M28k72m54K07N00j36n54M1N51Q7n25j66M87K33m45l30M17M09l26m80
$$ y = [438, -13, -461, -71, 428, 174, -382, -243, 424, 317, -307, -327, 276, 381, -195, -431, 53, 440, -26, -397, -8, 402, 67, -430, -162, 395, 243, -327, -284, 269, 318, -233, -343, 194, 420, -100, -436, -4, 421, 81, -376, -103, 384, 171, -371, -243, 336, 340, -243, -366, 162, 378, -112, -406, 72, 451, 38, -449, -139, 410, 202, -346, -248, 304, 282, -283, -349, 240, 408, -143, -427, 29, 372, 8, -408, -57, 427, 121, -417, -226, 336, 285, -304, -294, 231, 298, -210, -321, 215, 380, -61, -371, -15, 387, 72, -387, -112, 371, 202, -358, -264, 306, 349, -196, -358, 129, 357, -100, -390, 26, 421, 54, -421, -163, 377, 211, -333, -258, 311, 306, -278, -384, 190, 430, -87, -413, 29, 399, 38, -394, -65, 417, 172, -395, -235, 338, 298, -246, -310, 227, 361, -182, -393, 118, 417, -12, -404, -59, 369, 97, -357, -150, 350, 214, -340, -299, 252, 339, -186, -352, 135, 368, -77, -407, 10, 419, 93, -387]
3670c87K11N30j49n29O6N58J4n47j41N33K59m88l26M17L91l51m58L04N13k13n70
3691c63J01N69pn48q6N22J76n18k47M86L34m24l94L32M45k56m84J81N17q7n55
3712c06JN41R9n09j89M76K72m25l44L85M09l10m84K34N12j25n48L8N58N4n52j75
3734c88N37K64m72l51L96M31l43m81K67N25j89n45Q0N66K7n68j20N45K09n19k92
3755d21M57L68l87m32L10M90k35n08J58N15m7n38k2N33J12n30j99M85L22m50l63
3776c82L55M27l01m67K05N24j12n50J3N53P3n41j57M88K76m75l56M05M42l33m94
3797d07K46N17j44n59N5N87L8n71j53N45K52m95l16M43L83l93m46L09N13k12n33
3818c41J14N50l5n52n7N61J46n28k54M68L26m16l57L36M29k74m96J84N38j04n34
$$ y = [-387, -176, 354, 205, -324, -258, 300, 314, -233, -374, 159, 418, -70, -396, 21, 412, 61, -397, -93, 420, 207, -363, -262, 307, 300, -248, -334, 188, 364, -154, -401, 85, 419, -5, -399, -67, 378, 122, -362, -181, 336, 249, -306, -305, 236, 335, -174, -363, 113, 385, -40, -384, 1, 410, 100, -384, -150, 362, 237, -311, -273, 285, 339, -213, -388, 149, 413, -59, -410, -14, 417, 74, -407, -140, 385, 196, -349, -269, 297, 324, -244, -364, 181, 390, -129, -421, 36, 404, 17, -415, -105, 385, 150, -358, -200, 315, 268, -270, -292, 241, 353, -177, -376, 109, 431, -19, -382, -27, 400, 99, -368, -163, 361, 249, -301, -288, 265, 338, -203, -360, 128, 404, -71, -427, -22, 420, 87, -407, -161, 356, 212, -347, -292, 295, 333, -238, -391, 154, 406, -89, -405, 38, 421, 28, -418, -109, 404, 192, -341, -227, 323, 288, -264, -321, 240, 386, -142, -396, 72, 398, -18, -375, -39, 390, 116, -380, -196, 342, 238, -296]
3839b96k1N41J06n13j94N13K74m66l71L74M56l02m92K38N03j39n61N1N88O9n69
3860b11j70N20K57m78l25M38M09l73m84K67N39j63n51Q1N51k2n53o2N46J91n27
3881a20k88M58L41l95l88L44M36k55n11J56N51n4n42l5N08Q9m95j68M96K89m50
3902c3l92L70M47k77m68K13N02j25n63K5N72R9n34k05M94K73m60l39M20M24l57
3923H6m86K41N42j40n50O2N37J2n44j32N45K24m97l00M09L60l59m06L10M60k13
3944A61n28J17N25nn20m5M98J30n11k03M71L26m10l95L21M46k42m84J82N23j00
3965B57n44l6N64J35n14k27M71K78m37l58L87M53k95n24J91N32j00n47L3N47N3
3986C19n45j54N10K60m54l25L88L75l40m41K88M99k05n23R1N16K9n08p8M85J62
$$ y = [-296, -317, 224, 330, -183, -377, 136, 410, -56, -427, -53, 403, 101, -391, -153, 350, 211, -350, -299, 289, 358, -211, -381, 139, 396, -82, -407, 31, 440, 67, -417, -150, 389, 226, -325, -244, 307, 285, -268, -330, 216, 407, -120, -408, 50, 391, -4, -392, -48, 388, 133, -378, -222, 329, 275, -267, -302, 206, 295, -200, -368, 128, 417, -33, -425, -55, 392, 115, -353, -140, 362, 237, -326, -301, 271, 370, -164, -369, 125, 398, -62, -401, 19, 443, 86, -400, -159, 383, 243, -307, -245, 292, 304, -240, -372, 173, 397, -100, -400, 9, 369, 10, -396, -86, 374, 161, -367, -250, 275, 270, -250, -295, 203, 333, -178, -381, 90, 416, 6, -389, -68, 378, 136, -348, -166, 357, 257, -287, -323, 241, 376, -138, -365, 106, 384, -53, -411, -24, 429, 134, -390, -199, 333, 233, -314, -281, 266, 319, -226, -380, 130, 390, -64, -389, -1, 374, 34, -407, -119, 380, 175, -348, -257, 259, 288, -220, -298, 187, 349]
4007C49m72k38M31L36l74l91K79M44k31m67J41N15n3n45n0N24J64m83k41M46K97
4028C81m08l89L51M68k80n14J78N28p6n34j2N43J09n29k02M87K81m30l42L79L92
4049C81l09m55K47M91j39n19M6N16M0n09j11M91J89m57k65L94L44l23m03K58M43
4070C50j98m77J09N03k0n17o8M95J56m70k40M42L03l80l85L13M45k22m93J36N21
4091C03n4n17m2N15J40n09k07M57L02m17l64L59M20k74m61J87N09j15n18J5N31
4112B60N6n02j43M56K33m44k70L71L44l08m19K58M57j76m81P1M97mm87q4M69J85
4134C39m49k59L82L38l35l84K78M42k12m74J11N32k6n22p5N03J66m74k42M41L19
4155C99l96l86L28M16k18m73J41N09r1n05j8N25J02m88k00M49K63l98l16L33L78
$$ y = [349, -123, -361, 70, 406, 32, -359, -80, 364, 133, -334, -193, 322, 269, -276, -326, 198, 362, -121, -362, 84, 381, -27, -416, -65, 403, 123, -391, -213, 315, 239, -295, -307, 236, 345, -184, -386, 101, 382, -48, -390, -11, 381, 72, -383, -136, 355, 216, -303, -257, 259, 299, -210, -321, 170, 359, -98, -363, 31, 375, 52, -351, -93, 350, 152, -325, -216, 287, 267, -250, -318, 177, 333, -137, -377, 65, 368, -12, -397, -84, 361, 139, -354, -218, 303, 249, -268, -310, 205, 345, -164, -371, 86, 388, -29, -393, -34, 386, 112, -349, -162, 347, 232, -286, -271, 260, 316, -186, -329, 127, 360, -84, -354, 17, 361, 53, -366, -108, 349, 173, -308, -237, 260, 256, -231, -315, 154, 339, -110, -369, 13, 351, 16, -368, -90, 352, 140, -334, -223, 309, 283, -239, -314, 189, 355, -119, -361, 80, 399, 3, -383, -55, 361, 143, -330, -189, 320, 229, -276, -294, 231, 333, -155, -355, 94, 357, -41, -357, -24, 354]
4176C54k91m15J97M64j19m65L3M80K8m70j15M61K09m30k88L71L59l10l87K40M40
4197C46j79m72P4N05J5m82j07M70J76m51k54M15L37l52m26K81M52k03m67J32M89
4218B99o3n10m0M98J58m68k39M21K79l70l29L25M15k72m64J88M65q4m75L2M46
4239B12P4m76j36M48K36l94l16L41L52k78l91K27M31j46m86N6N00K9m79j02M34
4260A36J91m35k64L99L53l22m15K27M43j66m58R9M87k5n01o8M86J80m56k42M07
4281E6K93l56l61L23M19k38m62J37M66m6m65j2M64P8m64j61M18K73l80l07L04
4302b1L36k58l84K00M39j11m76K0M64O6m48j20M29J88m19k68L56L64k94l97K01
4323a33M33j43m47O3M96J8m87j12M53J95m29k35L72L07l46l69K73M39j93m49J00
$$ y = [354, 63, -352, -155, 309, 190, -275, -242, 238, 266, -204, -319, 142, 351, -79, -367, 4, 363, 53, -334, -94, 346, 167, -305, -231, 274, 289, -193, -300, 170, 346, -105, -359, 56, 393, 41, -385, -104, 348, 145, -322, -190, 299, 236, -274, -314, 184, 342, -126, -365, 56, 335, -35, -364, -39, 376, 104, -360, -172, 293, 209, -266, -234, 212, 286, -190, -326, 122, 358, -36, -352, -11, 341, 63, -328, -101, 330, 184, -302, -246, 254, 283, -196, -298, 136, 327, -108, -372, 27, 380, 58, -357, -130, 313, 147, -311, -212, 275, 250, -251, -319, 167, 347, -109, -351, 56, 349, -7, -368, -45, 374, 136, -326, -189, 277, 231, -234, -246, 218, 296, -168, -329, 89, 362, -18, -325, -21, 315, 57, -327, -127, 312, 201, -275, -255, 209, 275, -173, -293, 136, 324, -95, -363, -7, 357, 63, -334, -133, 300, 157, -290, -227, 269, 287, -200, -312, 141, 336, -93, -328, 44, 351, 5, -364, -91, 348, 155, -294, -194]
4344a94M58m3m49k2M46J06m35j98L92K66l27l15K70L60k35m05J74M42q3m42j0
4365b44M16Q3m09j32L98J97l65k89L20L47k36m02J88M21j16m43M3M69L7m66j18
4386c01M20K11l95k53L52L20l14l91K43M29j57m49P6M45Lm53o2M28J51m11k08
4407c16L62K73l20l13K52L84k19m04J29M33m9m35j8M03J00l97j52L86K23l38l01
4428c17K88L43k31l84J67M22r9m28MM52O4m25j56M09K07l70k71L11L50k73l86
4449c23K02M12j30m41N5M39L0m46p7M04J68l82k34L48K92l00l47K51L78j75l91
4470b67J01M25m9m20l6M10J33m07j76L51K39l15k91K77L44k18l84J38M14p3m10
4491b14nM12P9m10j57L83K35l56l09L08L45k46l79J91M00j01m53L0M59N0m32j24
$$ y = [-194, 264, 221, -228, -250, 196, 302, -133, -331, 61, 327, 0, -315, -45, 315, 80, -325, -151, 291, 208, -234, -244, 172, 255, -154, -286, 112, 309, -56, -345, -25, 322, 86, -316, -128, 293, 177, -266, -223, 246, 283, -183, -301, 119, 330, -65, -318, 34, 354, 40, -351, -108, 321, 164, -285, -209, 236, 239, -214, -276, 152, 303, -108, -316, 46, 319, -1, -314, -62, 322, 103, -301, -172, 261, 212, -223, -241, 162, 262, -135, -287, 99, 322, -16, -317, -29, 314, 83, -301, -134, 288, 189, -239, -235, 217, 281, -144, -300, 109, 316, -54, -325, -14, 336, 63, -323, -121, 291, 161, -280, -225, 214, 244, -202, -279, 125, 293, -89, -323, 25, 317, 17, -330, -79, 299, 124, -267, -166, 259, 210, -210, -246, 164, 297, -110, -286, 65, 304, -11, -302, -25, 319, 101, -283, -145, 269, 196, -214, -219, 193, 272, -138, -295, 88, 323, -33, -342, -34, 311, 65, -314, -123, 277, 176, -277, -247, 212, 262, -170, -294]
4513b94M10J72l64k49L48L13k75l70K14L90j48m06J05M00j5m32o3M10J41l75j93
4534b81L30K43k89k99K58L43j83m13J24L96l7m05k7M03Q8l99j54L77K41l37k85
4555c06K57L48k21l73J68M11j08m39K2M36P3m09j33L92J85l74k46L37L12k60l64
4576b92J91L79j24m09Q0M21j0m19q0M07J49l69k04L15K40k81k96K54L41j80l81
4597b68R3L95l5l79j8L84Q6l92j68L64K43l03k86K49L26k13l65J57M18q5m46J4
4619b29M14P6l94j39L85K09l78k60L09L50k69l68J75L91j24m03K2M69J5m39j09
4640b97M09J72l54k14L11K56k82l07K27L63j43l98Q0L91k9l77l2M03R9l90j82
4661b94L59K42l00k85K47L27k05l68J42M09p3m18nM13P3l98j42L88K02l59k69
$$ y = [-294, 116, 288, -76, -325, 23, 336, 61, -309, -95, 295, 147, -259, -154, 246, 231, -201, -264, 146, 287, -88, -281, 49, 292, 3, -296, -38, 305, 122, -291, -167, 229, 192, -213, -240, 163, 251, -148, -302, 75, 316, -21, -306, -49, 299, 78, -295, -127, 284, 176, -263, -241, 195, 268, -141, -274, 118, 303, -71, -317, 20, 332, 72, -292, -101, 278, 154, -255, -175, 246, 236, -183, -263, 144, 293, -76, -280, 35, 275, -6, -302, -48, 293, 113, -268, -175, 220, 185, -194, -212, 172, 258, -134, -302, 62, 305, 2, -284, -35, 291, 78, -287, -130, 288, 203, -243, -229, 185, 261, -133, -272, 113, 322, -56, -316, -7, 343, 74, -294, -119, 272, 148, -255, -233, 236, 251, -188, -297, 112, 284, -70, -284, 27, 283, 1, -306, -79, 284, 141, -257, -177, 214, 185, -192, -224, 179, 278, -112, -294, 65, 307, 7, -278, -31, 296, 91, -277, -135, 274, 201, -217, -222, 191, 264, -134, -276, 112, 314, -45, -314]
4682c14K97L45k37l81J69L90j25m14O4M29K8m38j03M03J72l59k24L27K64k81l16
4703c04K23L76j58l84R2L86k0l95m0M06R3l67j85L37K39k95k86K59L18k01l75
4724b81J41L96n6m04j1M03N9l87j29L81J95l47k67K89L07k20l56J71L93j19m18
4745b60M7M25L6m15j02L87J62l62k10L21K85k72l49K27L65j39l77Q1L78k9l88
4766a89m1L96R4l59j73L23K23k87k64K34L17j89l53J22L93q3l80QL70P4l79j44
4788b87L72K02l29k70K85L27k33l55J65L88j05l99K8M19M3m09j16L91J78l61k15
4809b81L09K90k72l22J94L61j32l84O8L92rl90n2L69J16l57j66L20K22k84k65
4830b73K14L10j69l40J25L54n1l65k7L91P3l54j51L35K08l19k47K56L17k03l52
$$ y = [-314, -17, 328, 91, -290, -121, 269, 144, -270, -206, 223, 251, -187, -290, 113, 285, -74, -298, 29, 293, 12, -304, -81, 295, 137, -247, -155, 231, 211, -184, -224, 182, 275, -92, -277, 60, 299, 4, -282, -23, 295, 94, -281, -140, 256, 200, -204, -215, 188, 247, -140, -269, 112, 307, -40, -307, -18, 289, 69, -287, -116, 277, 158, -260, -213, 212, 248, -167, -269, 118, 280, -82, -292, 29, 314, 42, -307, -80, 285, 146, -231, -150, 228, 199, -189, -230, 166, 260, -99, -272, 51, 274, -13, -277, -43, 274, 85, -268, -146, 247, 164, -216, -208, 162, 236, -143, -287, 85, 287, -42, -312, -27, 300, 67, -288, -123, 265, 160, -239, -211, 208, 251, -158, -274, 117, 295, -66, -281, 28, 318, 46, -276, -82, 279, 147, -237, -169, 223, 214, -176, -228, 141, 257, -100, -266, 54, 276, -8, -273, -59, 251, 82, -258, -133, 221, 170, -195, -222, 169, 242, -112, -263, 72, 280, -39, -286, -30, 287, 84, -268]
4851b68J36L77q2l79J9L93M3l95j04L77J80l35k49K87K94k40l36J96L64j38l74
4872b34N5L72J6l80p2L69J22l43j85L17K49k72k89K02L24j50l45J13L46k7l80
4893a92j8L54R5l34j54L10J97k87k40K37L22j92l50J23L55o5l45j1L78N0l59j42
4915b68L56J90l09k35K53K85k12l29J73L57r9l87L0L72L6l59q1L39J41l43j98
4936b88L08K56k33k85J72L06j28l25Q5L47j8l55o0L45J14l16j48K87J92k66k59
4957b69K32L06j57l45R1L43l5l50nL56P1l55j52L19K14k87k31K33K73k01l19J56
4979a12L47n6l76kL53N0l40r5L35J61l04k27K57K64j99k87J48L04j16l13O3L38
5001A93K2l40q8L17J21k88j59K59K09k42k62J89K99j22l13O3L14j2l34k6L46P8
$$ y = [-268, -132, 245, 163, -216, -197, 196, 239, -156, -260, 117, 297, -38, -287, 0, 294, 54, -282, -86, 278, 140, -234, -179, 193, 209, -171, -243, 126, 248, -95, -280, 37, 286, 14, -275, -73, 251, 101, -244, -131, 215, 188, -192, -210, 144, 239, -95, -249, 61, 258, -29, -269, -32, 290, 98, -252, -129, 226, 161, -184, -195, 183, 233, -126, -268, 88, 278, -31, -266, -13, 272, 60, -269, -96, 261, 162, -225, -195, 177, 213, -146, -227, 112, 253, -90, -288, 20, 276, 43, -242, -70, 236, 108, -217, -132, 215, 197, -158, -218, 127, 241, -75, -223, 64, 256, -10, -269, -37, 269, 112, -233, -142, 201, 166, -184, -189, 167, 238, -117, -269, 50, 264, -23, -254, -21, 252, 51, -268, -112, 235, 179, -197, -199, 154, 204, -136, -231, 104, 265, -39, -266, -9, 255, 56, -231, -83, 221, 105, -208, -145, 193, 215, -125, -213, 104, 225, -63, -222, 37, 246, 4, -258, -69, 230, 108, -205, -142, 172, 160, -174, -200, 146, 224]
5023B24l24j52K78K16k39k43K16K82j79l20J10L51m0l47l2L54M6l06j31L19J90
5044B73k92k33K31K65j76k86J36L01q6l36L7L35L4l18j08L02J36k63j82K48K32
5065B50k24k59J63K74r1l16N8L16rl18k7K98J16k99j72K80K12k32k71K65K40j26
5087A28l25O4L36k7l39p1L94K9l23r1K69J92k12k49K23K38j21l10K7L33n9k02
5109i6m2L18N9l35p8K43K08l86j61K61K40k09k62J72L30j29k98K3K69O7l50l1
5131a87K94R8k95q0J52K75k47k29J77K95j13k62K2K61n1k67%K60J83l36j54J83
5153b1L56k88k98J61L21j34k71J04K51n8k71MK88P5l83l5K45K41k71k90K35K86
5175B47j86l40K67J78n5l24N4K87K2k35j34L55J17l00j37K02K22k28k17J39K70
$$ y = [224, -100, -252, 26, 242, 3, -240, -24, 258, 79, -241, -131, 220, 180, -167, -199, 155, 201, -105, -236, 83, 273, -19, -252, -21, 244, 68, -218, -82, 219, 133, -203, -166, 169, 203, -115, -223, 79, 215, -48, -230, 18, 250, 26, -233, -70, 204, 113, -203, -145, 171, 162, -156, -183, 115, 231, -68, -240, 40, 252, 20, -251, 14, 254, 128, -197, -133, 203, 176, -163, -234, 160, 189, -134, -225, 44, 236, 24, -225, -2, 236, 115, -195, -168, 165, 106, -96, -138, 180, 239, -96, -174, 69, 277, -109, -270, -9, 231, 22, -240, -68, 262, 133, -165, -142, 127, 194, -156, -187, 107, 205, -90, -170, -18, 257, 10, -219, -42, 253, 140, -122, -100, 161, 110, -157, -157, 103, 286, -50, -204, -21, 335, 47, -251, -90, 231, 97, -174, -70, 181, 123, -148, -144, 144, 219, -164, -199, 46, 287, 16, -274, -39, 247, 61, -279, -12, 166, 111, -213, -159, 128, 150, -85, -219, 136, 253, -47, -184, 18, 240, 12, -205, -66, 204]
5196B04j20k81O1L04Ol18q1L29J02k74j80K69K22k43k60J96K92j39l19R1L22k9
5218A54l21k2L32P4l17j36K89J78k29k27K04K47j70k65J08L05o2l13J7K92M5k87
5240a04q0K74J40k73j85K23K45j93k70J24K97q7l12N6L00L7l52n9K37K01k75k24
5262b80L41J38k10k39J37L74q1l87P4L03j5k79o1L27P6l26j74L26J97k54k11K07
5284a7K34j47k84J04L23m9l18j7L00N5k86j01K71J46k49k14K16K59j69k59J12
5305i0K79p8l03K7L17L2l12r3K79J48k66j63K46K00j98k62J61L07j09l13N5L17
5327A81j5l22l6L18J19l11j71K49K24k26k36J82K77j54l05J00L25m2l21j9L03
5348A20N9k78j13K72J64k51k14K00K52j51k70J14K88o4l13J1L24M7k94r0K57J41
$$ y = [204, 84, -197, -136, 168, 174, -144, -225, 104, 206, -68, -248, 21, 243, 0, -260, -64, 228, 89, -230, -139, 183, 154, -167, -189, 143, 217, -100, -236, 53, 231, 2, -225, -21, 226, 56, -209, -101, 204, 142, -171, -154, 138, 183, -104, -184, 90, 230, -43, -228, -5, 240, 47, -223, -99, 198, 111, -201, -145, 155, 192, -160, -219, 18, 219, -56, -280, 61, 199, -11, -250, -113, 261, 180, -207, -133, 170, 155, -124, -185, 142, 218, -108, -282, 44, 241, -13, -224, -17, 217, 70, -214, -110, 213, 164, -154, -171, 129, 184, -102, -203, 68, 214, -35, -249, -33, 226, 57, -202, -90, 189, 111, -192, -165, 152, 184, -128, -221, 58, 206, -60, -223, 23, 223, 25, -237, -76, 231, 122, -191, -136, 181, 166, -156, -192, 126, 245, -66, -237, 12, 236, 10, -226, -44, 233, 79, -226, -126, 199, 157, -164, -183, 120, 179, -99, -212, 60, 224, -27, -241, -41, 211, 60, -210, -96, 192, 128, -185, -174, 150, 197, -97, -187, 70, 211]
5370B11k53j80K34K39k09k75J55K91q3l17M6L17kl27n7L18J44l11j85K51K30k28
5392Ik61K00K86j51l12P6L30rl22l2L04P6k93j28K78J91k48k27J92K55j44k73
5414b03J04K99n2l22kL19O1k87j17K68J53k56j88K25K48j86k94J34L08q6l20M6
5436a48L23J3l16r2L17J37k88j95K67K16k21k52J83K90j40l10O6L68m4l29n7L13
5458A01J22l16j42L25J62k06k89K16K46j53k59O7L58q7l25j2K75J15l04j03K60
5479E1J71k39j69K53J17j43k47Q4L28p9l51N7L00N1l21r4L18J48k80k01K55K34
5501B43k17k70J54L21r8l45N3L49J2l43p9L37J29l18j67K68K21k30k59J77L04
5522B42j37l18Q4L27k6l42j4L24P2k99j46K79J86k46k31K08K64j67k89J12L25
$$ y = [211, -42, -222, 12, 251, 42, -233, -78, 213, 130, -187, -141, 176, 174, -153, -210, 108, 252, -59, -244, 7, 237, 9, -252, -52, 234, 83, -229, -153, 177, 168, -154, -186, 118, 194, -99, -227, 51, 242, -6, -233, -41, 214, 70, -203, -99, 200, 148, -174, -176, 143, 204, -83, -200, 68, 221, -35, -223, 2, 250, 64, -230, -96, 212, 126, -194, -148, 175, 188, -128, -220, 97, 234, -54, -249, 18, 234, 13, -239, -56, 234, 94, -216, -150, 218, 174, -155, -212, 101, 223, -93, -235, 90, 252, 46, -243, -27, 219, 66, -193, -126, 232, 145, -180, -192, 83, 198, -106, -209, 51, 222, -17, -186, 67, 184, 41, -206, -122, 206, 127, -224, -167, 133, 184, -137, -231, 87, 235, -45, -246, 9, 243, 26, -244, -90, 231, 133, -212, -159, 190, 202, -141, -220, 117, 246, -72, -239, 29, 250, 20, -239, -62, 242, 105, -213, -129, 198, 172, -170, -184, 140, 212, -87, -233, 46, 232, -14, -245, -37, 227, 60, -229, -117, 208]
5543B08n9l29LL24N3l18j03L12J52k83k06K39K58j99k97J55L20j10l36P1L34J7
5565B06l54p9L33J41l13j77K81K19k41k76J93L04j18l45Q1L38k5l39m1L47Q8l30
5587a07j42K82K03k30k32K07K56j66l06J15L30m4l20k8L30N0l06j31L20J94l23
5608d8k18K47K75k13k60J15K87l5l90P0L62Ll72m8K95J54k87j71K26K47k43k42
5630b46J55L31j34l45J21L09j0l55l5L57J02l28j86L10K08k89k19K31K61j64l02
5651b28J83K24k2l32l3L41P1l16r2K76J71k75k16K44K46j58l50J57L30q1l36K9
5673a67L62J3l08j00L41Q3k83j85L40J86k46k97J62L40j40l16R9L33m0l47n0L69
5695A49O8k99j80L24J93k81k38K44K77k10l21J47K75J5l22qL13M1k96j32K95K02
$$ y = [208, 149, -180, -177, 147, 200, -118, -221, 91, 243, -40, -246, -7, 251, 52, -245, -90, 230, 120, -216, -145, 189, 206, -148, -227, 106, 247, -66, -243, 38, 257, 16, -260, -67, 237, 119, -226, -145, 193, 168, -171, -212, 135, 223, -107, -249, 33, 236, 6, -226, -19, 237, 71, -235, -120, 210, 166, -154, -182, 148, 198, -108, -239, 81, 275, -48, -266, -19, 256, 43, -217, -102, 185, 150, -240, -170, 192, 195, -177, -225, 70, 224, -63, -234, -8, 239, -4, -246, -91, 240, 106, -239, -118, 191, 181, -174, -209, 148, 250, -78, -264, 46, 254, -35, -254, -23, 238, 74, -228, -45, 179, 157, -175, -208, 133, 204, -112, -204, 72, 243, -32, -248, -4, 242, 84, -266, -109, 221, 140, -196, -167, 195, 208, -100, -200, 141, 224, -59, -244, 96, 282, 36, -261, -99, 241, 101, -215, -116, 217, 177, -170, -220, 149, 217, -82, -262, 62, 255, -26, -264, -20, 257, 47, -274, -127, 148, 163, -159, -167, 146, 187, -109, -241, 54, 256]
5717B56k62k47K38K40j48l17J82K99j29l34M6L40L3l28o4L00R5k54j94K76K41
5738B69k32k78J56L05j11l15Q3L14j9l35m1L35J18l18j53K64J94k38k40K04K79
5759B41j44l24R4L05k1l09k5L02P6l09j07K80J78k60k11J98K37j49k75J36K95
5780B08p7l13J9L04N8l08r1K94J39k83j87K58K18j97k78J56L08j04l19N7L29n
5802A86l26o7L18J18k99j59K45K09k24k37J79K67j20l02P3L09k8k98k4L10P1k90
5824h9j28K67J78k33k10K01K29j46k62J00K94n6l05NK99M7l02r8K83J39k55j91
5846b33K24K37j84k57J35K96j07k99L9L10J6l21p0L09J08k76j71K54K18k22k39
5867b33J72K76j23k94O6L11k9k98l6K94Q6k71j22K51J73k29k10J84K43j30k71
$$ y = [256, -6, -253, -15, 225, 77, -240, -58, 241, 112, -222, -176, 164, 197, -131, -195, 105, 200, -54, -248, 28, 269, 37, -241, -85, 220, 109, -206, -123, 191, 172, -163, -204, 131, 249, -69, -222, 42, 236, -2, -242, -38, 241, 97, -227, -133, 172, 151, -158, -183, 119, 195, -114, -221, 59, 237, -23, -234, -36, 201, 52, -223, -87, 208, 131, -182, -163, 141, 199, -109, -200, 94, 233, -50, -237, 21, 239, 42, -236, -80, 228, 124, -195, -138, 191, 186, -140, -207, 111, 229, -70, -229, 16, 225, 1, -236, -57, 210, 90, -212, -139, 170, 142, -156, -180, 130, 201, -89, -217, 50, 228, -5, -215, -14, 215, 69, -193, -93, 201, 145, -160, -155, 144, 191, -111, -209, 74, 213, -42, -233, -9, 228, 44, -213, -78, 218, 111, -188, -149, 161, 177, -144, -214, 95, 203, -73, -244, 10, 228, 6, -233, -61, 215, 92, -202, -136, 175, 146, -152, -188, 106, 192, -79, -201, 50, 223, -6, -216, -32, 211, 81, -190]
5888a90Q8K74m3k70k2K91N0k70j00K59J37k36j78J86K27j58k62J33K82q2k98L6
5910a46K72L6k94o1K80J04k38j86K34K26k12k22J41K63j00k76M1L12j2k90n2K86
5932A06J01k63j33K26K00k22k12J66K23j06k50O7K49m6k35m0K80P7k46j48K36
5953C0K12k62j60J61K06j44k56J04K88r2k86J8K79M9k46j14K72J38k52j59J44
5974g0L16k39j68J22K83j53k76J5K83P5k85n8K26J42k91j37K94R5j59k32J83K56
5996B22k28j37K8J76P9k90l2K07J89k35k44L10J56j56k17J31K80j81k64J53K30
6017A77r7j81k9K60L3k51j68L35K37l14j88J33K00j00k31J03L53j78k41oK93J5
6039A55l16o5L28Q1k54j57K55J58j50k45J45K66j23k41O4K49k6k72k5K61R3k39
$$ y = [-190, -102, 172, 129, -141, -163, 128, 178, -92, -192, 67, 204, -32, -210, -24, 203, 45, -217, -84, 198, 116, -182, -146, 126, 162, -132, -193, 87, 191, -47, -233, 1, 227, 15, -207, -66, 197, 97, -179, -138, 174, 162, -128, -180, 106, 207, -56, -189, 37, 237, 15, -197, -31, 192, 86, -164, -97, 152, 106, -129, -169, 111, 188, -58, -206, 30, 242, -20, -180, -19, 187, 43, -213, -109, 179, 87, -199, -181, 98, 147, -99, -213, 59, 197, -55, -214, -70, 246, 7, -161, -39, 244, 91, -185, -170, 113, 188, -97, -155, 71, 213, -78, -215, 79, 174, 15, -217, -34, 222, -6, -143, -115, 61, 140, -150, -182, 25, 214, -21, -265, 45, 201, 45, -172, -41, 239, 58, -206, -53, 177, 80, -101, -130, 130, 163, -88, -256, 79, 316, 2, -186, -53, 147, 47, -184, -81, 272, 94, -147, -153, 140, 155, -161, -226, 102, 183, -71, -228, 27, 185, 35, -210, -65, 201, 78, -163, -99, 150, 124, -148, -173, 88, 181, -58]
6061e8j20K03J58j91j78J64K23j29k42P0K66n4k55M2K34M1k97k5K41R0k50j47
6083b14K21J71j57k23J56K64j41j71o6K79L8l17k2K58J27k56j70J67K94k36k56
6104b54J73K17p0j74M6K16p8k50M3K57N1k03j75K55J14j67j49J11K04q4k66J21
6126f2K26m7k49J6K29M2k39r0K18J38j89j68J49K02j27k34J07K50n6k66jK77K3
6149A49k52p3K45J20k35j54K08J94j79k02J20K29q7k42M5K61ok56l8K50P7k27
6171e3j17J94J59j90j70J45K03j00k27O3K31k5k39j5K33P2k31j08K06J36j91j68
6193a92J62K03j39k05R2K26n1k44J6K61K6k57o6K36J12k26j52K04J82j60k08J23
6215e7K23p1k54M3K54pk50m3K53P9k30j18J89J53j51j86J25K02j04k09P1K32k6
$$ y = [-58, -178, 25, 183, -8, -186, -22, 201, 72, -170, -100, 166, 112, -143, -101, 133, 174, -123, -148, 93, 183, -67, -214, 7, 178, 21, -202, -46, 218, 77, -94, -160, 119, 157, -160, -182, 76, 203, -53, -223, -56, 238, 2, -254, -81, 136, 66, -108, -62, 154, 76, -174, -131, 126, 177, -26, -201, 54, 168, 1, -148, -37, 167, 83, -183, -62, 164, 117, -132, -116, 113, 155, -84, -174, 44, 182, -7, -175, -26, 176, 49, -185, -78, 172, 116, -150, -151, 126, 149, -103, -176, 69, 189, -46, -200, 8, 202, 23, -179, -59, 170, 83, -159, -114, 147, 141, -115, -153, 97, 174, -53, -170, 24, 183, -7, -177, -32, 171, 71, -156, -93, 138, 113, -126, -141, 92, 164, -67, -175, 31, 167, -24, -192, -30, 173, 34, -171, -79, 147, 96, -148, -132, 129, 155, -102, -168, 68, 180, -46, -198, 6, 188, 28, -180, -57, 166, 95, -159, -116, 138, 131, -119, -162, 91, 170, -60, -178, 11, 164, 13, -173, -48, 154, 50, -159, -88, 144, 118]
6238A18k39l3K51M5k27q7K13J22j81j66J52K34j35k11N9K37m6k19k4K78J0k45
6260i4n1J88J33k31j19J69J85j56j52O0K16l7k87K8L11n7k77RK54J01k18j35J66
6283FJ72j11k62J77J62r3k18P7K11K0k43l8K24N1k05r3K11J37j86j82J52K02j04
6306F7k13P1K32n4k33PK41L0k23p7K02J12j96j41J74J90j61k12J09K26o0k37K9
6329a17K47lk62l4K46R3k23j31J90J70j80j79J46K12j06k29O0K33nk27k4K13N2
6352A42k13j08K19J39j76j76J32K00j07j93P1K25m8k42NK31N3k32o4J95R2j84
6374c9j48J69J98j62j94Q9K40p0k23K7K45jk56l3K17J08k17j17J74J84j69k02
6396a80J38K20p4k57N1K46l1k29lK03O6j96j19K08J54j93j59J17J50p4j92Q5K20
$$ y = [118, -121, -154, 97, 142, -85, -172, 41, 163, -18, -184, -32, 202, 67, -144, -85, 152, 106, -113, -137, 141, 151, -94, -145, 43, 176, -55, -174, -5, 180, 24, -128, -68, 148, 111, -176, -148, 163, 106, -171, -162, 92, 193, -25, -160, 6, 178, 67, -195, -18, 144, 51, -167, -90, 121, 141, -102, -140, 84, 135, -70, -163, 48, 185, -1, -183, -31, 171, 67, -146, -75, 157, 103, -130, -123, 118, 148, -75, -152, 50, 162, -34, -175, -1, 189, 28, -184, -75, 151, 91, -146, -117, 130, 127, -135, -169, 77, 170, -53, -184, 6, 176, -4, -183, -37, 175, 69, -160, -100, 133, 128, -99, -123, 90, 142, -71, -179, 40, 179, 3, -173, -41, 159, 52, -141, -70, 155, 107, -135, -130, 101, 154, -78, -142, 53, 145, -39, -187, -18, 180, 18, -176, -87, 153, 83, -140, -113, 132, 131, -125, -158, 59, 167, -50, -167, 7, 191, 22, -180, -42, 178, 104, -153, -102, 144, 113, -116, -119, 84, 150, -46, -165, 43, 197, 4, -155, -38, 112, 38, -154, -69, 151]
6419A51o2k33j1K31M3k38k3K09P8k04q3J26K25j65k22R3K11m4k10K0K35L8k58
6442i3o2K47R7k05j71J87K48j88k49J34K51q1k68K9K66J0k92J1J61J26k13r5K23
6465G3J10j51k17J63J76j44k16J43J83k2k25k8K15J11k49o7K05J09j79j12Q2K05
6487A65r6k12O1K60q0k04L5K39qk44r3K81J42l46o1J22K86j52k56P3K06j03j52
6510a37m7L12k1k11p5J92J55k06j29J65K12j50k21J09K02j17j89O0K13J7k59j4
6532a39K48L3k23n9K05J19j84j65J29K15j12k26R8K15m9k30LK37L9k50o7K21J08
6555A66k00j44J67J93j62j99J11K30q1k48M9K34J9k57l6K22R9k14j28J94J66j79
6577Bj94J50K12j04k26O2K33j4k35k6K33P0k30j05K04J42j86j60J58J86j22k13
$$ y = [151, 89, -144, -155, 76, 119, -119, -142, 67, 145, -59, -142, -16, 209, 44, -178, -85, 126, 82, -128, -108, 127, 165, -93, -155, 92, 189, -16, -187, 0, 248, 60, -189, -55, 196, 115, -153, -124, 142, 152, -140, -129, 32, 158, -55, -150, 73, 183, 32, -185, -22, 154, 10, -206, -63, 120, 98, -127, -155, 60, 171, -78, -145, 60, 169, -10, -122, -40, 165, 69, -143, -82, 178, 98, -106, -71, 168, 160, -84, -177, 104, 246, -100, -161, -39, 247, 95, -161, -88, 118, 15, -137, -184, 128, 107, -104, -179, 13, 168, -38, -167, -2, 210, 60, -161, -52, 150, 33, -156, -96, 117, 134, -125, -139, 109, 142, -81, -140, 65, 184, 0, -165, -36, 179, 67, -159, -61, 154, 105, -125, -122, 115, 154, -96, -163, 58, 166, -34, -178, -11, 182, 20, -179, -68, 162, 81, -167, -118, 116, 135, -122, -158, 64, 163, -51, -179, 15, 181, 2, -192, -42, 170, 66, -160, -98, 135, 121, -114, -140, 93, 163, -67, -172, 32, 174, -12, -172, -14, 172, 50, -163]
6599a63P8K37l0k44kK37L3k37o4K14J14k03j57J77J75j40j93R9K29p7k44O4K84
6622A87r1k06m6K30Q3k11j29K07J55j71j90J37K07p6k33O2K25j0k52k2K36P9k28
6645e7r9J65J47j72j60J63J85j18k27Q5K22j1k47j6K32L0k14r2K38J22k11j70
6667b05J85J52r4k21J27J89l5k50O7K09M0k81n3K36J30j92k13K90J02j54j59P7
6689e3K20j47j33jK48J8k73j1K60K6j84j21J86J97k18j87J11K25q7k20K4K93n0
6712A23k74N6J43J04j49k16K59J19j45j72J39J90j30k00R5K04n7k35L3K32M3k80
6734a18l2K13J03k02j61K30J67j94j91J54K14j38j82O7J93k8k16k0K12J06k55
6755g8r5J74J48j57j60J14K22q9k05L9K07j4k09lJ97N6k12r8K06J18j54j57J37
$$ y = [-163, -85, 152, 122, -122, -124, 113, 146, -91, -155, 59, 173, -30, -187, -10, 165, 25, -168, -69, 160, 83, -161, -97, 187, 96, -110, -156, 74, 157, -54, -183, 24, 179, 8, -182, -45, 162, 86, -147, -85, 140, 130, -122, -144, 92, 171, -57, -156, 9, 156, -16, -176, -13, 172, 54, -173, -88, 134, 123, -124, -140, 92, 122, -92, -184, 54, 176, -35, -205, -20, 132, 38, -183, -56, 133, 98, -152, -85, 124, 164, -117, -170, 66, 196, 4, -209, 81, 183, 29, -130, -53, 167, 20, -113, -114, 134, 152, -121, -132, 128, 154, -30, -151, 35, 232, 14, -173, -62, 163, 76, -144, -120, 173, 123, -151, -95, 48, 152, 3, -213, 46, 165, 20, -152, -13, 177, 47, -153, -58, 146, 89, -146, -113, 119, 162, -118, -150, 63, 166, -36, -197, 33, 200, 6, -185, -31, 183, 45, -137, -70, 123, 95, -121, -141, 71, 177, -78, -173, 1, 149, -8, -168, -54, 168, 79, -126, -87, 120, 106, -103, -106, 91, 147, -65, -163, 43, 161, 7, -150, -13]
6778a3J68j21j73P3K20m1k43J8K17K5k03o4K13Q2j97j30J77J72j38k11J01K07
6800A39o9k17L5K41Ok45m1K25Q6k10j21J98J40j62j70J17J93p2k05L9K23k1k14
6823a05j8K20N0k09q0J78J24j54j62J27J86j09j90P7K10m4k06rK07M6k16o9J96
6846E0J13j85j50J58J62j16j97J06J97n8k24L5K22J4k13m7K13R7k19j18J73J58
6868A71j59j70J30J85r3j80M2J99k2j81m7K18N3k16r5J50J76j50j54J54J41j11
6890D1j82P6K12p9j70k2J86Q2k22r1J90J71k20j23J01J86j15j87J32J96o9j98
6912a05pK22m4j58o7K13J08j63k00K80J07j61j91J02K60n7k62PJ61Q7k13m7K28
6935A00O4k24r6K02P2j47j71J39K40j14k35N9K54k0k20p0K53O8k22r5J81J14j64
$$ y = [-13, 155, 34, -139, -66, 154, 113, -130, -112, 105, 130, -73, -137, 76, 158, -39, -169, 8, 180, 42, -169, -68, 139, 70, -147, -112, 129, 135, -110, -151, 74, 160, -50, -171, 27, 167, 5, -165, -48, 145, 73, -132, -93, 130, 109, -105, -123, 97, 147, -62, -142, 36, 160, 6, -156, -29, 157, 48, -142, -65, 145, 101, -105, -114, 93, 139, -77, -146, 50, 163, -22, -172, -14, 148, 32, -165, -59, 138, 80, -144, -109, 113, 127, -86, -133, 80, 177, -42, -160, 13, 171, 12, -158, -28, 157, 64, -116, -74, 125, 103, -78, -125, 93, 146, -70, -165, -15, 161, 11, -143, 11, 152, 41, -141, -65, 147, 68, -102, -124, 62, 144, -78, -169, 21, 192, -28, -151, -50, 136, 21, -166, -34, 162, 93, -105, -112, 110, 66, -92, -159, 54, 162, -1, -201, 79, 186, 25, -166, -64, 196, 139, -123, -116, 45, 132, -81, -128, 100, 164, -60, -156, 46, 118, -29, -200, -61, 179, 65, -170, -111, 143, 123, -97, -167, 86, 154, -68, -163, 18, 132, -32]
6958c2j28J62J59j16k04Q1K20m0k28J4K17L2k23n3K07R5j90j43J75J59j36k00
6980a72J15K08p7k16K6K34J7k40k4K04P1k06j20K16J29k00j34J04J92j03j91J09
7002e8J96k0k61k5K91J11k65j06K05R2j63j75J73J69j00k41J08K02l0k16LK21
7024A11L0k23p2K10J10j94j38J52J59j28j84J08K26q2k48M8K22Mk15l1K06Q4k09
7047e4j19J90J40j29k02J40J84p2k30O3K29k9k14l0K05O4j91p5J75Q8j06k08J37
7070d4K00j17k00N8J93%k38M9J79P2k07j57K67O4j48j31J27K29j61j87R4J58n
7093I5l14J19J62O1k62LJ99O0j97q7K16J54j64j72R1J76q8k03Q6J87L2k36n8K30
7117I0M7j78j22J94J14j64j44J33J71q9k30R4K20k6k11n3K22N9j94p0J64J24k37
$$ y = [-32, -160, 2, 161, 45, -159, -78, 142, 102, -126, -112, 105, 137, -86, -139, 68, 163, -27, -170, 5, 164, 28, -172, -57, 151, 74, -142, -116, 118, 135, -105, -129, 75, 146, -60, -180, 36, 165, -35, -169, -65, 127, 24, -167, -58, 138, 118, -143, -168, 123, 234, -31, -137, 68, 160, -3, -178, -5, 164, 64, -177, -69, 133, 103, -113, -110, 111, 141, -82, -154, 56, 166, -28, -166, -14, 145, 17, -167, -59, 167, 85, -163, -115, 107, 111, -104, -135, 71, 155, -54, -173, 17, 157, 28, -174, -34, 150, 78, -152, -89, 140, 111, -103, -133, 72, 136, -55, -130, 45, 133, 27, -181, -44, 156, 39, -161, -103, 90, 90, -148, -99, 80, 152, -55, -212, 55, 119, -29, -160, -33, 196, 35, -152, -58, 100, 95, -219, -100, 62, 123, -139, -136, 63, 123, -74, -161, 55, 209, 45, -127, -36, 140, 52, -151, -65, 122, 154, -82, -140, 90, 137, -41, -163, 31, 145, -19, -163, -30, 141, 52, -178, -84, 136, 110, -101, -154, 68, 127, -67, -137, 27, 151, -86]
7140h6r9J81Q6p5k16J60K02n5k32N7J98J3k25n5K20R3k26j33K19J48j39j97J07
7163e4K16m6l12P2K14L8k27p4K64M0k02q8J78J25j65j51J29J88q8k02N8K00l8
7186G5k02nK30L8k07q8J99J11j60j50J53J80j37j87Q3K23n6k33L1K17J3k20o4
7209a56K30Q8j99j27J70J62j54j82J25K06r4k22M6K19Kk32k6K08O9j86j16J89
7231B0J31j59j65J42J87j01j98N9K13k2k16k6K33L6j82j00J83J29j69j48J33J84
7253A64j17k00Q5K12m9k14JK30K4k22o6K12J02k00j40J75J58j38j93J16K17q0
7275G7k12L3K25jk32k8K06P7k07j02J74J43j49j68J36J77r0j98N4K08ok25j8K06
7299H0O1j96q6J82J29j78j61J40J79j03j89O8J98l7k19PK12L5k07p1K07J04j82
$$ y = [-86, -185, -4, 82, 7, -209, -49, 153, 98, -134, -77, 121, 134, -91, -146, 74, 167, -59, -192, 27, 175, 36, -161, -54, 162, 116, -196, -124, 90, 128, -99, -173, 91, 131, -71, -159, 19, 144, -21, -172, -43, 145, 57, -145, -87, 113, 75, -127, -132, 98, 136, -71, -159, 40, 151, -9, -159, -6, 174, 37, -150, -67, 156, 100, -133, -102, 115, 128, -92, -156, 74, 162, -37, -164, 6, 168, 14, -168, -43, 163, 69, -153, -107, 112, 114, -118, -144, 64, 133, -53, -169, 20, 151, -8, -173, -31, 156, 55, -143, -84, 129, 107, -109, -135, 98, 134, -48, -148, 35, 164, -5, -153, -20, 164, 47, -153, -68, 144, 95, -119, -118, 112, 136, -86, -152, 60, 162, -38, -178, -3, 155, 17, -176, -60, 157, 77, -135, -102, 123, 122, -110, -138, 68, 145, -62, -164, 10, 153, 4, -164, -28, 149, 59, -139, -85, 123, 117, -108, -126, 80, 141, -55, -141, 41, 170, -8, -169, -29, 150, 47, -142, -74, 124, 87, -132, -125, 87, 122, -85, -156, 51, 155, -27]
7322b7j39J70J50j37j78Q2K31p5k22M0K14Pk23m0K24Q7k08j13J83J32j46j67J31
7345b4J87q6k22L9K21lk13l1K07P3k16q9J81J35j54j72J28J74r8j94Q0J97l2k10
7369a22LK08N0k17p1J88J12j99j31J70J75j29j94R1K03o2k06K6K24J5k36l4K08
7392G2J03k07j17J55J50j50j69J19K07q5k18M2K19j1k20k0K09N7k05j03J96J26
7414A50j43j59J06J87r4j93O9K11k9k08k2K19L7k00q1J90J13j69j37J47J80j19
7436E5j92O8K09o6k03L1K12K0k25n4K06Q4j87j16J71J42j46j79J20K02p6k25M7
7459a02K07Jk14l0K08O3j89j02J70J46j57j76J47J77q8k19P7J98j4j97oK00N2
7482A52k27p7K03J14k07j32J56J95j73j16P2K03r0k01kK52j1j91o9K34L3j81j05
$$ y = [-27, -166, 4, 154, 17, -161, -79, 152, 77, -145, -105, 109, 116, -107, -147, 77, 164, -44, -157, 26, 158, 12, -155, -24, 163, 77, -145, -106, 115, 112, -101, -132, 75, 148, -68, -157, 24, 159, 5, -167, -39, 135, 37, -157, -77, 120, 88, -122, -119, 89, 139, -78, -149, 39, 151, -48, -179, -9, 166, 37, -157, -66, 137, 75, -131, -105, 119, 134, -102, -136, 72, 175, -32, -149, 6, 156, 6, -163, -44, 163, 78, -140, -98, 121, 110, -110, -130, 79, 136, -69, -172, 24, 150, 7, -152, -46, 141, 47, -146, -77, 134, 105, -103, -125, 94, 131, -69, -150, 40, 153, -16, -153, -6, 174, 55, -137, -69, 140, 74, -129, -98, 114, 134, -91, -145, 61, 145, -42, -158, 13, 155, 9, -170, -50, 152, 76, -149, -102, 105, 106, -108, -138, 70, 133, -56, -158, 12, 158, 1, -175, -28, 149, 61, -158, -81, 117, 103, -94, -100, 100, 152, -75, -152, 51, 165, -42, -174, -18, 177, 4, -112, -40, 163, 73, -128, -130, 122, 111, -80, -149, 85, 118, -63, -168]
7505a68P8K71j35k54J28K38q9j93mJ91K7j90r2K69O4j87j19J70J32j46j34J18
7527b5J78j01j82N0K06pk31j4K12O6k12q3J94J04j65j57J34J75r8j88P2K02n0
7550H0k15QK24L3k31n8K08Q6j82j12J60J52j37j71J08J93p8k04M1K06mk09k8K10
7574H0O9j92j11J79J33j59j53J28J86j04j90M4K09j6k13j4J93O0j84r8J80J29
7596A56j72j44J28J84j11j86O7K00m1k00JK08M0k09p1K03R6j80j24J67J47j37
7618B2j76J04J97o2k18L3K16Nk07n6K16P8k01j01J79J16j29j74J17J73p9j99N0
7641i6K13j7k12j4K08N3j90r7J79J18j63j47J35J74r8j80M7K11l3j98QJ95K0j84
7665f8o5J82J16j92j19J44J58j29j75J05J88o8k00K6K12lk05l4J88P3j90j01J72
$$ y = [-168, -90, 181, 46, -208, -80, 158, 69, -124, -128, 63, 90, -100, -192, 77, 141, -46, -165, 5, 137, -9, -143, -25, 153, 52, -130, -80, 126, 119, -112, -126, 86, 152, -60, -143, 51, 155, -10, -167, -33, 142, 44, -144, -72, 130, 80, -135, -127, 97, 130, -101, -159, 49, 135, -47, -159, 1, 153, 16, -155, -47, 146, 68, -136, -95, 111, 107, -102, -130, 80, 149, -43, -154, 25, 158, -1, -154, -26, 160, 56, -134, -90, 119, 103, -110, -124, 69, 129, -55, -153, 27, 156, -16, -160, -32, 152, 41, -145, -78, 122, 81, -119, -118, 90, 130, -79, -150, 53, 149, -31, -155, 12, 159, 22, -154, -50, 147, 85, -133, -100, 116, 121, -86, -142, 74, 152, -49, -150, 29, 145, 16, -158, -41, 132, 53, -146, -96, 117, 100, -112, -126, 82, 135, -55, -152, 27, 145, -18, -165, -30, 144, 46, -134, -87, 124, 91, -107, -99, 96, 116, -68, -133, 49, 165, -27, -146, -2, 156, 27, -148, -43, 145, 77, -123, -97, 115, 112, -93, -127, 61, 134, -56, -157, 15]
7688A5J42j56j63J21J85r3j79M7J86j1k04k2K05O1k01p5J68J21j57j39J30J84
7710A65j09j79O6J82k6k00%K05K5j94q0J85J16j61j28J30J60j34j52P6J99o7k15
7733a36L6K02Mk10m6J85R1j79q4J21J62j05k06J18J83j09j98Q2K14pk06qJ90M5
7757A39j68j40J78J48j36j55J37J52j13j74K5K26l7j88rK37J0k00p7J86J40j98
7779a7j19J13J92j67j44J04J84k6k41J3K10L0k28k2J72P4j64j32J45J81j36j63
7801a41R8K04j40j57Q6J71k4j89n9K28M7j85p2J56J19j28j89J35J60n2j78KJ88
7824H0pj67j4J81N1j75j09J97M4o2j40J34J43j43j75R3J88k7k37J1K18Rj61p8
7848a46K13P5j78r6J48J77j82j73J14J90m9j80K5J86k4j82l8J93R2k13p4J45J29
$$ y = [15, 157, 1, -162, -41, 144, 51, -128, -81, 105, 94, -110, -132, 73, 134, -67, -142, 26, 147, -10, -149, -19, 165, 56, -123, -57, 125, 99, -101, -101, 104, 129, -65, -145, 40, 156, -5, -133, -3, 157, 23, -129, -53, 146, 79, -136, -100, 102, 106, -104, -150, 35, 126, -53, -137, -16, 146, 41, -165, -47, 136, 27, -171, -89, 125, 118, -88, -96, 94, 139, -29, -169, 9, 157, 21, -134, 3, 155, 42, -132, -107, 119, 82, -106, -115, 122, 132, -68, -145, 41, 181, -17, -136, -23, 169, 2, -142, -38, 146, 120, -121, -108, 102, 132, -96, -118, 54, 128, -36, -168, -23, 158, 22, -141, -43, 161, 21, -136, -50, 121, 97, -92, -151, 77, 124, -61, -133, 23, 142, 14, -175, -40, 120, 68, -110, -108, 80, 73, -94, -108, 73, 124, -51, -160, 37, 81, 19, -121, 13, 156, 13, -162, -69, 119, 92, -145, -134, 84, 93, -68, -146, 67, 142, -36, -132, 16, 193, 11, -162, -48, 142, 93, -87, -62, 124, 100, -82, -120, 73, 165, -48, -122, 23, 152]
7871A52j59j64J15K07r5j82O0J63J4j89%J39N4j88m0J09J36j45j35J60J57j42
7893B7r8M4K06o2k97J38J25Q5k77kJ99N1j48j26J62J26j06k05J10J97p1k06L9
7916h9J99J3k30j6J90Q1j99j08J63J39j53j49J18J82q0j92N2K02k3j95k1J99M7
7939A30j70j10J87J08j42j58J31J64q5j99R1J89k6k06k8K40Pj65j07K02J11j89
7961b5j10J43J21p3k07J06J94q7j80K2K01Kj95n6K02Q2j75j15J63J39j43j60J12
7984c9J94r3j92M6K02j8j96k7K10M9j85q6J75J26j48j57J27J62r9j81O0K07k7
8007A10k06k0K05N9k02p5J72R9j51j50J49J66j19j87Q1J70n8j64QK18J7k10k3
8030a11J62P7j79j09J41J53j23j40Q3K10r2k21J10J40Qk30K2K14L9j98q6J28J64
$$ y = [152, -7, -171, -56, 151, 56, -126, -66, 97, 111, -78, -78, 61, 115, -73, -113, -4, 132, -13, -148, 12, 169, 27, -71, -27, 179, 117, -180, -42, 83, 168, -109, -111, 88, 139, -9, -135, 27, 153, 47, -158, -48, 149, 78, -128, -89, 110, 123, -107, -123, 67, 148, -51, -159, 4, 143, -10, -159, -41, 141, 61, -131, -79, 123, 100, -95, -116, 83, 130, -40, -150, 37, 145, 3, -155, -24, 140, 55, -144, -53, 136, 110, -96, -124, 116, 123, -42, -149, 53, 164, -25, -135, 8, 129, 56, -151, -45, 149, 62, -118, -96, 105, 107, -88, -144, 58, 140, -35, -150, 13, 152, 9, -151, -39, 155, 62, -130, -84, 118, 100, -96, -123, 87, 136, -49, -135, 40, 166, 18, -139, -12, 150, 51, -130, -70, 137, 110, -96, -116, 89, 148, -54, -129, 43, 142, -9, -159, -10, 156, 37, -150, -69, 101, 43, -121, -113, 105, 122, -88, -111, 51, 128, -51, -160, -19, 134, 11, -129, -46, 164, 72, -149, -39, 101, 109, -121, -99, 115, 154, -44, -130, -2, 162]
8053A62j17k13J29K00r3k06M0J96k5j72k4K21P1k12j04J85Q2j34j33J26J76j13
8075D2j74P5J78l9j89%K12Oj94n5J93R2j78j08J52J50j49j51R5J90p6j96L3J97
8099A06J6k09l0J91P2j99r2J71J22j29j67J09J64o9j94N9J83jk09k6J97O3j88
8122f0q0J72J12j58j38J37J65j06j80O5J89j7k03oK09L5k07o6J84R6j58j34J58
8145IJ44j22j66P1J97o4k02L6K01pj81m5J98O8j69j21J57J38j36j65J15J77q2
8168E1j94M8K04mj91l9J98O3j84q6J68J22j54j49J12J87r6j76M6K00l9j79j3
$$ y = [162, 45, -168, -39, 161, 68, -138, -98, 98, 73, -99, -123, 98, 169, -43, -147, 38, 120, -14, -147, -21, 155, 42, -132, -57, 121, 82, -107, -107, 105, 111, -83, -138, 55, 147, -31, -139, 13, 163, 14, -137, -42, 148, 72, -124, -91, 106, 122, -87, -117, 74, 146, -53, -145, 26, 148, 19, -148, -39, 125, 56, -138, -79, 104, 103, -106, -132, 65, 128, -60, -140, 32, 144, -14, -152, -15, 150, 44, -136, -71, 118, 101, -102, -108, 101, 136, -71, -137, 47, 143, -15, -149, 9, 153, 31, -135, -64, 133, 69, -133, -97, 104, 97, -84, -129, 69, 137, -32, -153, 4, 142, 6, -159, -44, 133, 51, -143, -95, 109, 105, -86, -125, 73, 136, -48, -134, 34, 156, 2, -147, -35, 152, 56, -120, -74, 126, 87, -92, -105]
8191a05
$$ Imaginary data points
##PAGE= N=2
##DATA TABLE= (X++(I..I)), XYDATA
0@%%%%%%%%%%%%%%%%Qj6J6j6J6j9K7l2L2m0M8n6O4p2Q3r2J05j20J36j53J72j93
38a02K16k41K70l00L30l65M05m48M93n44O00o60P27q01Q82r74J078j194J325j477
58g80J654j863K118k429K820l335M041n075O740r833J7455o9222r7824K03257
72D7724J02533j62248j37327J41625J47738j09812j66267Q7681J74699n5473j84989
83a14116K8226J85410K750j87860l1245J84344O7299j75647j02556J52016J33191
94A41812j21571j50572Q8251J59507o0088j63039L3725J66126p902j65581j8897
105i8229J61692M3816j55150o9429J46120R6309j30941j23476J06935J45068p5486
116D7229j56452M3123J58277j4423j54960j0028J49882L2890j42611n4374J33234
$$ y = [0, 0, 0, 0, 0, 0, 0, 0, 0, 0, 0, 0, 0, 0, 0, 0, 0, 8, -8, 8, -8, 8, -11, 16, -16, 16, -24, 24, -32, 32, -40, 43, -49, 56, -64, 72, -81, 91, -102, 114, -127, 143, -157, 173, -192, 213, -235, 258, -286, 314, -346, 381, -420, 462, -512, 566, -628, 697, -780, 874, -989, 1129, -1300, 1520, -1815, 2226, -2849, 3891, -5942, 11513, -57709, -155533, 47724, 150257, -11991, -149318, -7693, 140045, 30233, -136034, -48353, 126346, 70873, -114116, -85890, 99520, 102270, -85590, -116835, 67509, 134808, -40839, -143395, 8621, 141812, 20241, -130331, -42080, 117427, 57339, -105700, -71975, 94151, 86249, -79332, -98229, 63463, 107279, -47871, -117300, 28820, 125129, -5812, -129288, -22353, 122715, 47229, -109223, -66100, 92177, 77754, -77206, -87234, 62648, 95538, -47073, -101447, 31787]
127C1787P4743j21762r4569J07503J14313q8689j32571O3436J45338l3315j49019
138h2805L354J44613K2768j35323m4467J23621O2555j10799p8102R7061R1670
149I4146q2896j04573O7141J17133m8051j28235K3821J33776L356j31471k9272
160h5125J22515N1282j09327o8585R4568Q2091p9034r2621O3243J00701m7952
171C1756j07560L2350J14641j4099j19990q090J20542L2386j13748n5023J00816
182A3981P3021q4327q5648O7054R4277m9756r9827L2923J02528j7283j04236J937
194e5356J05311J4543j04865l3522J00518N3615r0152p1671P4428Q4703n6165
205B1387r2382L7754R5752k0530r5864M885R4010R287r1572k2539Q8436L6449
$$ y = [31787, 106530, -15232, -109801, -2298, 112015, 23326, -109245, -45809, 99529, 66214, -82805, -79451, 65162, 87930, -47393, -91860, 31761, 94316, -16483, -94585, 2476, 94146, 11250, -93323, -26182, 90951, 42900, -85335, -61514, 72262, 75618, -55853, -85125, 37390, 88672, -20655, -89240, 5328, 87419, 8385, -84236, -20993, 79708, 31756, -75804, -43454, 71187, 57088, -62902, -70992, 49550, 81936, -31812, -86835, 13981, 87002, 2675, -82973, -15919, 78358, 28602, -71225, -38302, 64226, 46943, -57293, -55356, 49955, 64498, -40367, -73889, 26629, 80244, -9908, -81579, -7151, 77552, 21387, -70995, -33241, 62511, 41981, -53883, -48998, 45012, 54299, -37273, -59812, 28624, 65073]
217F5073q4327n1501P7255O7277o5164q0788M8908Q9966l0393r3862J2043R3204
229D7691M383q9600j8513Q4588L0770p9038m2097P3119N3506o5960o5533N6063
241a0621P7010m2573q6069K5990R1117p819r1321r977Q6896K5309p9645l7792
253e9495P0920M7499o2177n5706N3688O3735m4327p1611L3032P8506j9296q3037
265d8269L583Q4090J3069q0744k8809P3415M1980o3340n1646N2382N8157m2146
277A1722o3092L2719O7899k2738p2263J1389P5566J617p6682j5890P4665L0460
289E5372o9136m4194N9733N5225m7706o2351L5151O5921k3871o7889J3715O9451
301C9421l514p0547p604P0302J9667o7855l1957O2894M4014n5060n5106M3774
$$ y = [65073, -19254, -70755, 6500, 73777, 8613, -72175, -23267, 66699, 36306, -57556, -45513, 47691, 52074, -37526, -56039, 28549, 59319, -19719, -61816, 11303, 64809, -1151, -66684, -10621, 66389, 23816, -62253, -36263, 54854, 47035, -44286, -54263, 32633, 57942, -21703, -59495, 11425, 58924, -3253, -58959, -5271, 58464, 14137, -57474, -24442, 54064, 34768, -48269, -44686, 39404, 52473, -28271, -57080, 16335, 58315, -5025, -56671, -4289, 53868, 11722, -51370, -18651, 49248, 26510, -45753, -34364, 41202, 42819, -33863, -49753, 24912, 55372, -13764, -57958, 1775, 57000, 9294, -53057, -17906, 48015, 24144, -43745, -30030, 39421, 35907, -34640, -42244, 28058, 47725, -20130, -52087, 10807, 54821, -239, -55345, -11571]
313a1571O3307l0124o7123J6578O7131m917o5318m561O3508J3623o1623k3280
325d4370N8479L3319n3298m2847M6358N1685l7428n9582K5816O4843j2252o6002
337c5279j122O3178J2011n8585k0102N4487K7402n0843l5372M6017M3545l9340
349E997n0923L0954N7053k1234o1884R741O4482L330o3346j6109N8227K6217n1202
362h697l3112M4696L8668l8833m4265L2427M9931k4550n4575J5283N7631n289
374B9315n9221n637N8741J7495n4891k8508M7635L6670l8837m1540L0723M4626
386C6571k3763m7556J6770N0456q806n2430J9N2899R016n2169j8646M9603K8703
399D0667m4117l7678L5830M3899k6359m6909J7704M8154j0279m9138K995M9766
$$ y = [-11571, 51736, 21612, -45511, -28933, 38198, 33281, -32037, -36598, 26910, 40533, -21090, -44370, 14109, 47428, -5870, -48717, -2359, 49326, 11898, -47684, -21868, 42975, 30723, -35279, -36401, 26777, 38788, -19797, -39899, 14588, 41990, -8853, -44225, 1792, 45337, 5997, -44926, -13972, 43081, 21847, -40037, -30296, 34186, 37516, -25830, -41939, 16288, 42505, -8697, -41809, 2887, 41555, 2722, -41543, -9116, 40815, 16265, -38310, -23027, 34604, 29315, -29906, -35543, 23198, 40693, -14198, -42706, 4929, 41599, 2762, -38778, -8055, 36571, 12808, -34748, -17978, 32478, 23672, -28758, -28739, 24160, 33176, -18993, -37639, 11964, 40667, -3450, -41128, -5298, 38601, 12242, -34667, -16963, 31191, 20912, -28226, -25231, 24535]
411B4535M837m9326j2796M7674K0696m5101k8928M0970L7414l4118m4682K4580
423a4245M8868j4153m9482N124M8354K220m7056r200M5413J6342m2708k3244L8793
436E026K9433l4322l5341K9078M1478k1728m6614J1888M8634j415m7037p257M3664
449A5487J3678m0397j9268L7357K5014l3514l0603K8473L5190k2991l9121J7278
461a3417M3160j0017m6462O72M7036R372m4106j7741L9067K3466l4115k7758K9770
474a073L2043k5039l6262J9231L9472j2840m1697O345M3439R72m4370r590M3099
487A3730J8706l8621k6202L1978L0805k5373l3470J9703L5640j4303l7717Q419
499a6705L9146k002l9567m462L9181J1167l7947j8436L5018K5740k9685l1548
$$ y = [24535, 29372, -19954, -32750, 14924, 35620, -9481, -38409, 2561, 39975, 5857, -38825, -14245, 34623, 20470, -29012, -23888, 24466, 26686, -20370, -29570, 15843, 32185, -10523, -33767, 5026, 34459, 137, -35204, -6126, 35352, 13624, -32990, -21102, 27532, 26117, -20920, -28177, 15487, 29165, -11232, -30500, 6857, 31871, -1643, -32246, -3773, 31417, 8426, -30695, -13417, 29743, 19726, -26736, -26064, 20972, 30344, -13762, -31503, 7564, 31030, -3085, -30843, -1073, 30970, 5931, -30331, -11100, 28372, 15532, -26165, -19820, 23619, 24591, -19779, -29369, 13730, 32436, -6185, -32387, -409, 30396, 5023, -28447, -8744, 26896, 12593, -25124, -16705, 22441, 20439, -19128, -23590, 15591, 26758, -11189, -29625, 5393, 31133, 1448, -30100]
511c0100K2641L4888j5585l6257R330L6742l778l6989j785L6884P487l5939j3341
524b5802L4409J9340l1955k5564K7802L1442k1750l5751J4388L7809o983l7904
536b0519L99L6920N327l5446j0605L3583J5674l1175k0530K8263K5448k4431l0261
549b7353J9217L4312j2564l6761N084L7050K111l5546q337L3013J3552k9952j7976
562b4150K6592K1730k3083k5130J9382K8433j5117l1664R820L4172l343l5203
574a7561l717L4172J0369l1555j5907K7960K0285k3903k3632J9833K6281j5761
586F864k8609J1670L0718p008l2643J636L3642M740l3240j1263L0982J7302k7235
599b444k2099K2463K5484j7357k7559J2426K8803p952k9499L513L0193J035l0467
$$ y = [-30100, -7459, 27429, 11844, -24413, -15083, 21659, 17881, -19108, -20893, 15991, 23478, -12461, -25802, 8607, 27947, -4008, -29572, -1770, 29672, 7922, -27829, -13441, 24368, 17385, -20519, -20120, 16800, 22127, -13319, -23924, 9659, 25333, -5842, -26372, 1891, 27339, 2908, -27353, -8136, 26176, 13612, -23149, -18065, 18985, 21096, -14450, -22787, 10226, 23778, -6174, -24150, 2442, 24172, 1089, -24041, -4659, 23774, 8657, -23007, -13187, 20985, 17642, -17561, -21278, 12894, 23263, -8292, -24199, 3761, 24046, 143, -23489, -3656, 22625, 6864, -21745, -10075, 20643, 13635, -19008, -17372, 16270, 21010, -12230, -23493, 7489, 24791, -2444, -24543, -2080, 23404, 6047, -21512, -9086, 19717, 11765, -17734, -14221, 15972, 17007, -13460]
612a3460o284K9850J1883k7952j7281K4460K2045k0006k5566J4679K7748r177
624A0939k8470M123K8178J95k7607m047K7167Q115k6440j2738K4854J7513k1987
637b05k1847J8077K5375j3308k7828P952K9064k363k8824k732K7483O894k5843
650h105j0386K4386J3955k2761j7966K0179K1929j6443k5190J1823K7363o734
662A2050k8568J323K8562M158k7164r092K4606J2835k1719j5656J9104J8246j6522
675B163k1089J3296K3742r143k5579M497K6468L56k6452n326K5433J0305k3076
688d405j4540J9689J7489j6126j9314J3103K1000j0276k2932O858K4634k610k5432
701a2862j949K5242O370k4352j0842K2653J5268j9685j9071J5536K1330j1277
$$ y = [-13460, -19744, 10106, 21989, -5963, -23244, 1216, 23261, 3255, -22311, -7632, 20116, 10939, -17531, -13408, 14770, 14965, -12642, -16689, 10478, 18593, -7847, -20585, 4269, 21782, -205, -22052, -3975, 21400, 8092, -19736, -11784, 17280, 14917, -13907, -16639, 10844, 17738, -8105, -18491, 5895, 19850, -2911, -20877, -698, 21231, 4788, -20402, -8579, 18784, 12050, -16518, -15195, 13367, 17525, -9639, -18731, 5875, 18710, -3009, -18665, 439, 18685, 2163, -18926, -5630, 18112, 8969, -16610, -12113, 14355, 14711, -11741, -17067, 8366, 18671, -4405, -18945, 744, 18233, 2107, -17207, -4104, 16896, 6620, -16312, -9454, 15180, 12570, -12862, -14811, 10431, 16801, -7551, -18393, 4260, 19528, -157, -19228, -3692, 17638, 6361]
713F361k2295P684K2899m565k3785R79K4448L295k4057p692K2631J1600k0640
726c137j5237J8090J8820j4443k1671R735K2971m977k2650J234K1960J687k1633
739i251m799K1389Q579k0190j2383J7925J5556j5175j8163J2201K0601q528k2552
752a4790L924K3070P62k2072m467K0497P063j9354r672J8389J2852j6725j6173
765a6696J3945J8750j0621k0578P167K2029l349k2966j165K2678N717k0842r276
778a5207J8410J1677j6216j3717J4370J6066j1966j8414Q725K0038n059k0784
790a2077J457K1085K303k0838o360J9530J0259j6976j3158J3910J4844j1212j6098
803a3331Q895J7498o311j8880L048J9547L96j9506l709J9018O990j8133j0487
$$ y = [6361, -15934, -8250, 14649, 10084, -13701, -12722, 11726, 15021, -9036, -16728, 5903, 17503, -3137, -18374, -284, 18536, 4093, -17578, -7843, 15128, 10151, -12499, -11265, 10695, 12382, -9251, -14050, 7339, 15918, -4272, -16655, 1270, 16826, 1651, -16512, -4311, 16290, 7762, -14790, -10866, 12204, 12966, -9106, -13573, 6924, 13987, -5367, -15039, 3350, 16202, -523, -16696, -2751, 15999, 5378, -15200, -8033, 13996, 10647, -12319, -13484, 9194, 14911, -5931, -15207, 3203, 14880, -1336, -15053, -683, 15383, 3417, -14997, -6272, 13766, 8707, -12077, -10620, 10465, 12768, -8070, -14430, 5100, 15359, -1617, -14775, -865, 13979, 2767, -13331, -4436, 13062, 6751, -12129, -9081, 10466, 10862, -8644, -12353, 6665, 13655, -4478, -14965]
816a4965J6303J3810j3398j6133J0025J7261p043j7879M467J8603j676j9143j558
829a1326J9029M882j8143p851J6915J0724j5348j3683J2982J6419r517j8032N694
842g255J8341k384j7982l06J7652K907j7316n826J6389Q731j4755j1185J2793
855a96J3248j0717j5318Q076J7099m669j7979R28J7601K310j6560m753J5473O884
869A1427j4540r204J3225J1581j1328j3539R137J5119o742j6475M037J7580p24
882I554j7889k849J7075O019j5454q348J3738J0187j2128j1965J0365J3740q176
895C869j5212N596J6210k819j6771j31J6882L256j6284o450J4772R122j2679j1073
909a1712J0356J2440q202j3482O070J4355l762j5047J267J5381J355j5280m034
$$ y = [-14965, 1338, 15148, 1750, -14383, -4358, 12903, 5860, -12019, -7552, 11051, 9375, -9768, -11326, 7703, 12585, -5558, -13409, 3506, 14230, -1118, -14801, -1819, 14600, 5083, -12949, -7255, 11086, 8702, -9280, -9586, 8066, 10973, -6343, -12169, 4220, 12951, -1804, -12989, -196, 13052, 2335, -12983, -4907, 12192, 7523, -10456, -9528, 8073, 10383, -6177, -10930, 4543, 11427, -3113, -12317, 908, 12489, 1161, -12378, -3241, 11878, 5136, -11339, -7302, 10278, 9554, -8335, -11184, 5891, 11910, -3544, -11892, 1846, 12033, -95, -12060, -1695, 12045, 3869, -11343, -5747, 10463, 7644, -9127, -9258, 7624, 10880, -5404, -11854, 2918, 12040, -639, -11712, -1356, 11084, 2882, -10600, -4530, 9825, 6063, -8984, -7717, 7664, 9019, -6261, -10295]
922a0295J4653O796j3423r361J1641J1422r411j2880O963J3856m602j4387K363
935f665J4715j06j4764k206J4651M609j4098p162J3089R566j1412j1714R209J3318
949A1030o728j4335M024J4789j446j4753r77J4354L176j3669n362J2898P467j1773
963a305r581J0111J1463p995j2935N540J3833k940j4155L19J4043K195j3318m474
977i199J2301O318j1079p959R958R556q596j1131O783J2543m547j3456K065J3838
991G395L80j3754k814J3242N214j2166p311J0661Q856r092j0069P611J1242o083
1005C312j2509M071J3486j586j3857r99J3527L362j2838n568J1829P721j0305
1018c54r517Q297J0734o224j1318M395J1793k737j2396P51J2794J701j2543m112
$$ y = [-10295, 4358, 11154, -2269, -11630, 11, 11433, 2022, -10858, -3895, 9961, 5359, -9028, -6665, 8050, 7944, -6820, -9026, 5625, 10234, -3864, -11026, 2063, 11629, 217, -11497, -2288, 11030, 4302, -10033, -6009, 8780, 7334, -7419, -8396, 5958, 9134, -4535, -9897, 3001, 10468, -1305, -10886, -775, 10688, 2693, -10242, -4702, 9131, 6191, -7964, -7645, 6398, 8593, -4725, -9199, 3102, 9420, -1659, -9618, 340, 9896, 1300, -9831, -3048, 9495, 4948, -8508, -6443, 7395, 7775, -5979, -8793, 4449, 9663, -2503, -9814, 847, 9703, 611, -9458, -1847, 9395, 3312, -9197, -5126, 8360, 6774, -7083, -8082, 5445, 8807, -4031, -9599, 2230, 9951, -354, -9871, -1574, 9160, 2936, -8382, -3987, 7806, 5069, -7327, -6576, 6218, 7919, -4624, -8736]
1032h736J1622O167j0342p869Q962R447p256j0750N123J1502k951j1595J123J1556
1046F003M05j1700k223J1711M375j1152o569R902Q353q320r696O732J0839m919
1060C741j1807K710J2193m62j1959j446J1473L054j1077m739J0565O676r507q550
1074i135P858R929n928j0782M073J1448k055j1827j99J1636K421j0863m185R786
1088B177N541q887o842P969Q341o582r688M734J0457k793j0811J006J1020Q59
1102F501j1018k957J0467M985r328o474P919P430o847q397N808R590m294j0599
1116g214K342J1048l41j0940j426J0735L127j0415n090R580P033q032q345O235
1130a703Q985m765r459L473J0150j887j0732j27J0718K208j0062l866R255N298
$$ y = [-8736, 2886, 9053, -1289, -9158, -196, 9251, 1995, -8755, -3632, 7870, 4919, -6676, -5553, 6003, 6408, -5292, -7515, 4196, 8571, -2581, -9150, 752, 9105, 785, -8911, -2179, 8660, 3741, -8066, -5356, 6837, 6375, -5584, -7030, 4443, 7497, -3580, -8319, 2246, 8922, -585, -9135, -1277, 8652, 2724, -8058, -3985, 7463, 5408, -6419, -6618, 5018, 7439, -3424, -7609, 2177, 7718, -1169, -8011, -42, 8299, 1717, -7971, -3237, 7220, 4427, -6384, -5378, 5642, 6501, -4517, -7474, 2993, 7978, -1350, -7824, 95, 7525, 678, -7719, -1911, 7679, 3385, -7214, -4872, 6176, 5835, -5105, -6531, 4204, 7331, -3084, -8174, 1406, 8439, 407, -7938, -1703, 7282, 2517, -6942, -3469, 6681, 4794, -5938, -6065, 4653, 6861, -3201, -7067, 2188, 7486]
1144G486q486o888P285Q364n473r311L482R508j833r410N58R556P97r744k605
1159f714R432M507q503n944P370P057o306q162N017R242l306r922J317R905M11
1174E401r507j686R277K993r082m580Q487O240p332p553N897Q460m482r202K989
1189c680R821j175j0073q34R663K547q869l816Q129M981p406o257O447P496n016
1204A958q433L386Q863j840r110L06R239J387q998l130Q265M590p244n643O230
1219a74O513n252p414M158Q252k692q786J125Q914L31q901j800Q732L348q238
1234a884m892P304O222o059p105M817P723l628q328K310Q821q04q945p90Q747
1249C509K279q343l669P734N032o858o356N627P359m091p879K619Q116j262q228
$$ y = [7486, -1000, -7888, -603, 7761, 2288, -7023, -3541, 5967, 4134, -5276, -4718, 4838, 5635, -4109, -6714, 2718, 7225, -1278, -7222, 148, 7205, 899, -7263, -2246, 6996, 3690, -6232, -4915, 4990, 5401, -4106, -5792, 3485, 6478, -2604, -7184, 1303, 7543, 211, -7342, -1445, 7015, 2533, -6669, -3680, 6141, 4966, -5107, -5941, 3722, 6269, -2600, -6416, 1713, 6694, -712, -6969, -522, 6974, 1958, -6475, -3089, 5774, 3934, -5176, -4870, 4369, 5756, -3242, -6372, 1893, 6483, -761, -6404, -174, 6339, 1087, -6327, -2169, 6083, 3391, -5395, -4270, 4644, 4975, -3926, -5726, 3006, 6354, -1884, -6776, 528, 6750, 691, -6414, -1597, 6126, 2498, -5830, -3520, 5301, 4497, -4448, -5238, 3509, 5788, -2555, -6224, 1510, 6542, -316, -6672, -1045, 6314, 2223, -5656, -3037, 5079, 3817, -4411]
1264d411p8Q198J447p963k870P441M151o681n298N793O336m712p222L371P849
1279E351j911q099M76Q070Q85p858k103P485L293p033m490O358N579n480o557
1294f034M419P430l134q006J693Q309k26q274j245P964K591p402l799O718M874
1309E878n897n798M918O618l823p356K489P862j023p950m54P772J835p355l087
1324e371O703M253n945n256M910O058l843o562K738P018j646p385L89P551J007
1339D619p404k307O909L534o296m530N590N475m666o320L437O952k294p227J243
1354c285P357l3p580j161P498K532p030l860O251M873n309n656M335O439l249
1369B122p152J895P410n29p325n88O992J720o873k735O409M038n575n206M591
$$ y = [-4411, -4489, 3709, 5156, -2807, -5677, 1764, 5915, -766, -6064, -271, 6065, 1353, -5869, -2498, 5351, 3440, -4659, -4183, 3887, 4772, -3086, -5189, 2296, 5589, -1444, -5934, 424, 6003, 523, -6034, -1615, 5815, 2681, -5325, -3632, 4677, 4451, -3823, -5068, 2896, 5487, -1915, -5714, 1004, 5878, -19, -5817, -899, 5719, 1896, -5460, -2971, 4891, 3868, -4082, -4536, 3236, 5071, -2284, -5371, 1332, 5585, -360, -5616, -706, 5352, 1509, -5053, -2315, 4703, 3057, -4328, -3939, 3612, 4619, -2785, -5092, 1817, 5351, -945, -5475, 115, 5590, 924, -5396, -1959, 4993, 2699, -4528, -3285, 4072, 4039, -3541, -4702, 2796, 5328, -1702, -5562, 689, 5562, 253, -5403, -1068, 5371, 2122, -5030, -3135, 4275, 3746, -3579, -4167, 2825, 4545, -2328, -5063, 1346, 5384, -191, -5397, -806]
1384h06N842l422o381K401O787j268p074j13P086J468o631k561O055L356n574
1399h35m202N111N243m266o157L105O651j867o854P81P004K53p128j550O926K918
1415E133o240l961N393M625m676n282L997O105l065o822J697P118k96o957q75
1430d106O688J874o451l049N964M242n027n111L908N609k922n883K104O288j119
1445C009o677k01O694J530o244k594N693L441n174m314M524N212l549n872K395
1460b127O143j358o221N17O392M38o542j670O314K873n731l851M987M575m290
1475D49n279L500O002k406o460J144O493ro350r30O231J921o006l043N456M105
1491D818m603m849L647N345k761n793J816O235n91o335o62O036J720n571k525
$$ y = [-806, 5036, 1614, -4767, -2366, 4421, 3153, -3921, -4034, 3052, 4520, -2111, -4672, 1383, 4739, -835, -5037, 74, 5317, 1051, -5106, -2001, 4650, 2783, -4071, -3290, 3714, 3967, -3161, -4711, 2215, 5133, -1107, -5068, 325, 4950, 274, -5008, -1011, 5094, 2029, -4793, -3096, 4022, 3726, -3231, -4106, 2582, 4456, -1995, -5044, 920, 5162, 135, -4976, -1068, 4541, 1619, -4264, -2160, 4128, 3009, -3668, -3869, 2825, 4355, -1889, -4483, 1210, 4651, -523, -4837, -313, 4899, 1350, -4522, -2127, 4016, 2658, -3563, -3046, 3346, 3784, -2758, -4428, 1886, 4759, -972, -4823, 164, 4739, 449, -4830, -1330, 4672, 2266, -4194, -3050, 3443, 3434, -2916, -3846, 2385, 4306, -1700, -4743, 713, 4818, 215, -4634, -987, 4358, 1597, -4196, -2380, 3855, 3264, -3071, -3733, 2303, 4023, -1548, -4073]
1506d073N139L312m739m208M019N043l015n525J980N728j129n927K40O128Q72
1521C845o070k084N598L071m931l718M327M306l811n051L030N718j954o034Q34
1536b924O048J26n973j020N942K076n650l248M974M177m011m688L154N047k442
1551A588n452J560N860m60n945p20N667J729n270k501M868L352m377m250L546
1566h05M905k500n235J521N341p53n473mN550J013n519k027N079K980m570l633
1582d130L993M295l335m937K483N462j546n624M50N677L62n528j205N397K189
1597D003n092l104M545L865l799m475L001M969k093n347J166N529j64n522q94
1612c412N323J696m913k446M411L322l947l934L112M535k386m862J441N120n13
$$ y = [-4073, 1066, 4378, -361, -4569, -550, 4493, 1478, -4047, -2067, 3661, 2532, -3395, -3155, 2973, 3845, -2225, -4309, 1289, 4360, -571, -4289, 38, 4344, 533, -4518, -1488, 4230, 2276, -3758, -2924, 3124, 3250, -2723, -3743, 2199, 4275, -1375, -4623, 351, 4528, 517, -4171, -1017, 4030, 1588, -3864, -2304, 3556, 3096, -2849, -3569, 2098, 3827, -1443, -3944, 924, 4276, -101, -4351, -805, 4100, 1600, -3635, -2114, 3227, 2474, -2999, -3003, 2547, 3560, -1959, -3986, 1093, 4073, -497, -4130, -137, 4158, 823, -4114, -1631, 3831, 2285, -3339, -2889, 2788, 3150, -2378, -3583, 1814, 4003, -1089, -4193, 352, 4217, 418, -4057, -1056, 3913, 1820, -3527, -2361, 3168, 3004, -2518, -3412, 1911, 3607, -1306, -3752, 659, 3981, 34, -3900, -788, 3747, 1361, -3501, -2060, 3060, 2547]
1627B547n268l94N291J222m984k097M527K973m110l565L432M204k773m636K025
1642a606M988j198n195L48N314N48n267j442N004K284m579l106M077L768l370
1657E68m352K609M746j761n015R04N140o2n142q29N002J726m673k583M118L307
1673C703l519l895K808M369j991m717J138M869k21m836n85M683J315m491k052
1688c422M190K850l709l530L046M050k335m384J605M678q54m858JM866Q74m641
1704a573j631M344K262m032k904L619L574l019m190K215M550j381m700N86M783
1719B503J79m782j056M585J920m140k627L592L159l061l632K487M109j732m509
1734c005Q49M589M8m429p88M280J461m074k187L704K941l105l492K423L775j806
$$ y = [2547, -2721, -3115, 2176, 3398, -1586, -3683, 844, 3817, -293, -3858, -426, 3778, 1005, -3631, -1606, 3382, 2184, -3011, -2663, 2651, 3199, -2068, -3510, 1494, 3778, -801, -3907, 170, 3938, 568, -3784, -1175, 3571, 1810, -3205, -2301, 2839, 2777, -2365, -3194, 1808, 3534, -1139, -3722, 396, 3703, 184, -3711, -903, 3466, 1475, -3242, -2104, 2765, 2544, -2292, -2877, 1806, 3121, -1370, -3422, 768, 3618, -91, -3621, -575, 3475, 1140, -3244, -1639, 3039, 2185, -2673, -2672, 2194, 3068, -1573, -3204, 1140, 3402, -630, -3534, 85, 3659, 640, -3550, -1335, 3215, 1834, -2866, -2280, 2503, 2682, -2100, -3156, 1429, 3349, -791, -3418, 174, 3333, 272, -3360, -873, 3236, 1504, -3005, -2156, 2433, 2481, -1948, -2736, 1544, 3005, -1069, -3256, 448, 3389, 284, -3208, -785, 2990, 1184]
1750A184m015J259M285n43m496l07M413J114m132j756L838K306l555k930L112
1765b23L584k452l997J631M158r74m237L91M363L15m425j179M188K000l692k559
1781c108L181K993k745l482K194M010j373m254M50M177L00l967q51L832J431l701
1797i13k176L331K887k693l286K031L497j510l759R60M067k00m162o84L924J344
1813B658l539j790L280K219l087k823K685L420k010l737J264L845p01l919J64
1828b071M046N56m044j388L703K089l192k486K747K824k370l278J884L723j129
1843A614l921L18L848L43l683q95L571J533l364k226K866K784k257l065J680L230
1859B376j200l473O79L691Nl693p51L493J323l221j771K962K271k658k796K148
$$ y = [1184, -2831, -1572, 2713, 2170, -2326, -2633, 1780, 2894, -1238, -2994, 844, 3150, -405, -3335, -223, 3361, 909, -3088, -1457, 2701, 1727, -2510, -2119, 2244, 2559, -1866, -3045, 1143, 3143, -549, -3108, 73, 3066, 321, -3161, -967, 3043, 1670, -2584, -2134, 2043, 2343, -1624, -2475, 1357, 2788, -913, -3089, 242, 3129, 436, -2850, -819, 2678, 1168, -2591, -1631, 2436, 2236, -1926, -2610, 1314, 2658, -881, -2671, 609, 2828, -259, -3082, -397, 3023, 1013, -2724, -1460, 2385, 1684, -2235, -2071, 1975, 2531, -1513, -2901, 802, 2891, -301, -2787, -40, 2784, 414, -2864, -980, 2743, 1614, -2307, -1989, 1859, 2202, -1481, -2376, 1195, 2728, -636, -2862, 4, 2788, 531, -2534, -854, 2376, 1176, -2297, -1618, 2073, 2078, -1615, -2366, 1127, 2450, -771, -2542, 420, 2691, 33, -2763, -615]
1875f15L198j536l389R50L475m62l566o8L644P47l542j412L221J934k854k314
1891b589K509K734k091l181J497L486p88l514J37L431L90l365r21L250J554k967
1907d28k134K488K527j983k787J518L044j051l312M27L414K85l274q98L019J320
1923B175k785j712K565K198k226k652J721K937j181l062P23L161k81l277k89L330
1939A345R16l095j510K768J896k418k223K121K573j732k927J218L136o30l181
1954a743P4L158M13l097r81K971J557k642k061K160K418j701k621J263K803q06
1970A165k968K82L029K95k946q40K772J301k530j743K264K131j873k478J418K703
1986A982r41k834M65K925m1k905m32K850R28k730j387K488J833k217k170J799
$$ y = [-615, 2583, 1047, -2342, -1392, 2083, 1621, -1945, -2013, 1631, 2378, -1164, -2576, 645, 2579, -275, -2589, -80, 2654, 563, -2618, -1121, 2365, 1577, -1937, -1800, 1631, 2021, -1344, -2265, 985, 2539, -428, -2562, -74, 2453, 470, -2317, -799, 2245, 1194, -2118, -1691, 1723, 2008, -1266, -2164, 855, 2175, -610, -2322, 243, 2441, 215, -2437, -716, 2221, 1040, -2022, -1299, 1862, 1581, -1696, -1985, 1345, 2261, -834, -2344, 424, 2320, -98, -2321, -200, 2373, 641, -2286, -1068, 2068, 1438, -1743, -1669, 1489, 1902, -1195, -2176, 795, 2352, -290, -2351, -191, 2227, 526, -2095, -832, 1971, 1165, -1803, -1521, 1508, 1803, -1143, -1983, 789, 2090, -440, -2183, 81, 2212, 339, -2139, -721, 1982, 1041, -1793, -1328, 1597, 1556, -1349, -1781, 1069, 1997, -733, -2120, 368, 2201, -16, -2186, -387]
2002c87K480j388k681R00K868m17k974k2K920N36k786r95K585J409k321j830K011
2019i2K204j620k491J127K701o30k770J27K768L38k670r25K517J384k193j692
2035a917J872K024j620k231J262K464q86k587K57K742K05k652o10K562R41k447
2051f21j378K263J837j873k174J412K320j105k417Q50K537l95k744p9K710N96
2067A739k515j068K381J381k132j788J836K140j390k370R08K435m82k465J41K505
2083A256K80k521q13K374J278k046j621J722J851j420k123J102K367o28k484J17
2099a309K413K92k300n71K235Q99k173j333J985J736j613j990J222K131r29k258
2115a563N95K463j79k518l19K388P11k195r64K042J268j937j634J596K068j227
$$ y = [-387, 2093, 705, -1976, -1076, 1792, 1375, -1599, -1621, 1299, 1835, -951, -1946, 639, 2048, -273, -2103, -92, 2112, 492, -1999, -872, 1829, 1199, -1571, -1444, 1324, 1662, -1008, -1933, 584, 1968, -225, -1917, -45, 1979, 359, -1872, -610, 1854, 968, -1619, -1362, 1380, 1585, -1067, -1677, 885, 1826, -621, -1999, 264, 2101, 228, -1946, -534, 1786, 681, -1736, -886, 1651, 1256, -1488, -1567, 1143, 1739, -776, -1844, 537, 1918, -214, -2002, -166, 1974, 584, -1786, -878, 1557, 1075, -1390, -1249, 1256, 1536, -985, -1798, 576, 1854, -192, -1813, -91, 1760, 340, -1783, -681, 1686, 1058, -1426, -1309, 1104, 1396, -904, -1475, 760, 1659, -514, -1847, 138, 1874, 261, -1729, -507, 1624, 695, -1563, -968, 1495, 1316, -1202, -1521, 867, 1578, -617, -1581, 461, 1729, -208, -1842, -246, 1822, 595]
2131E95k198P43K249m17k282Q3K381L92k387q68K117J253j727j524J451J726j266
2148C21j972R63K148m24k295L7K148M04k100p11K145R47j947j405J692J674j249
2165C76j898J000J946p67k112N29K218k5k263m24K136P48j994r93J890J317j740
2182e6j690J368J970r53k038N92K055l22k130RK211M36k132r01J882J224j602
2199g7j431J405J678j167j961P62K144k80k108j28J968M10j920o25J899J011j764
2216a84j391J459J628j102j817R11J874n96k061K20K120K20k042n93J859Q09j750
2233d36j015J636J394j501j701J265J765p77j927M68K002k06k104j53K084O89
2249A483j984j014J716J219j504j377J318J679j074j853O40K006k61j940j15J872
$$ y = [595, -1603, -860, 1389, 972, -1310, -1227, 1154, 1546, -841, -1709, 408, 1661, -66, -1590, -139, 1587, 321, -1651, -688, 1460, 1036, -1259, -1222, 926, 1330, -770, -1481, 664, 1611, -336, -1741, -49, 1625, 376, -1522, -522, 1424, 657, -1455, -926, 1292, 1267, -996, -1420, 716, 1464, -530, -1523, 367, 1684, -56, -1746, -378, 1592, 639, -1399, -807, 1248, 926, -1204, -1195, 1016, 1452, -680, -1581, 301, 1525, -77, -1508, -103, 1575, 408, -1553, -791, 1353, 1073, -1035, -1163, 805, 1215, -705, -1330, 569, 1580, -184, -1575, -116, 1512, 410, -1407, -496, 1378, 782, -1279, -1059, 1061, 1281, -761, -1354, 505, 1314, -436, -1451, 185, 1579, 78, -1623, -358, 1407, 630, -1297, -829, 1173, 967, -1137, -1290, 794, 1483, -501, -1515, 201, 1420, -84, -1461, -143, 1536, 462, -1391, -751, 1255, 994, -946, -1061, 811]
2265H11M58j898p65J749J131j550j383J249J519r15j663P09J818m42j937L6J983
2282I10K93j893o08J816Q37j657j125J467J445j284j643R49J785o55j838L87J928
2299A114r7j966k55J920O17j781r38J621J180j412j426J181J682q77j842N05J875
2316A101j43j862j51J823M71j757q00J626J089j411j334J139J519q94j682N99
2332f67J819k68j876p7J829M21j734p07J618R22j474j160J317J382j083j566Q24
2349d80J715n50j811K46J866O8j843l86J777O95j633r67J456J195j240j405J009
2366b88J552p53j700M83J797j41j836k35J787N54j638q36J444J107j263j326J024
2383b68J501p33j629M34J672j68j695j13J719M19j668p37J526J030j306j235J105
$$ y = [811, 1269, -629, -1394, 355, 1486, -64, -1447, -198, 1321, 406, -1257, -548, 1270, 828, -1109, -1073, 910, 1203, -690, -1298, 518, 1355, -302, -1427, 40, 1485, 201, -1442, -493, 1292, 637, -1201, -814, 1114, 1017, -949, -1204, 716, 1333, -448, -1386, 235, 1415, 3, -1423, -242, 1440, 563, -1279, -774, 1101, 958, -904, -1055, 768, 1239, -518, -1318, 308, 1397, -14, -1348, -209, 1310, 416, -1266, -667, 1152, 884, -992, -1069, 760, 1181, -553, -1260, 358, 1280, -194, -1354, -37, 1345, 262, -1304, -480, 1235, 685, -1126, -880, 986, 1054, -789, -1175, 602, 1297, -336, -1303, 153, 1348, 108, -1297, -288, 1264, 511, -1189, -706, 1091, 950, -886, -1121, 666, 1220, -418, -1254, 190, 1297, 34, -1292, -268, 1233, 500, -1129, -695, 977, 809, -886, -999, 720, 1139, -529, -1266, 260, 1290, -16, -1251, -146]
2400a46J368q92j519O63J666l74j721O2J705J92j657m17J607O76j543r68J368
2417G0J261j107j428Q52J521o27j617L47J712l6j722l14J619N92j480q05J345
2434A83J040j217j285R62J496o22j585L18J591n0j610k01J614M94j532q19J341
2451A18J056j113j174R52J303p83j482N46J640k30j657q6J593L06j518n20J488
2468D39P79j399j076J174J257r17j331P05J411n48j527L06J655M4j660l94J510
2485D28O29j363q01J253J037j101j292Q23J452m94j469K30J465n5j503j63J544
2502F20N30j465q52J220J062j001j157Q31J285o54j459L87J555n2j509j99J417
2519E59L42j375n31J375P89j275j067J022J248p71j306N66J375m10j483J69J522
$$ y = [-146, 1222, 330, -1189, -526, 1140, 766, -955, -893, 812, 1004, -653, -1070, 537, 1213, -330, -1298, 70, 1331, 224, -1204, -352, 1169, 542, -1075, -728, 984, 948, -774, -1088, 531, 1123, -357, -1162, 183, 1223, 6, -1279, -317, 1179, 557, -1028, -710, 881, 831, -779, -980, 634, 1128, -404, -1223, 118, 1174, 61, -1113, -161, 1142, 359, -1123, -577, 1063, 833, -824, -910, 683, 989, -529, -1049, 439, 1218, -181, -1257, -83, 1174, 257, -1074, -369, 1042, 494, -1033, -727, 928, 972, -688, -1082, 428, 1057, -306, -1107, 146, 1183, 82, -1210, -387, 1065, 571, -898, -668, 797, 742, -761, -924, 620, 1150, -315, -1167, 53, 1115, 114, -1043, -212, 1073, 419, -1040, -653, 902, 850, -659, -858, 559, 901, -474, -1005, 370, 1159, -116, -1183, -161, 1087, 316, -990, -424, 951, 541, -942, -773, 749]
2536G49J76j472m08J329N98j240p69J175J004j010j257P30J365m12j378J79J396
2553G55J0j414k84J398N99j259q43J065R74q71j090P42J233n54j400K60J450K8
2571G99j385k66J326M35j278o44J207Q82j035j089Q18J142n96j204M61J306k84
2588E95j404J4J417K51j326m63J214O38j130q29J040J046q14j201N41J257l16
2605E30j257J27J295O7j330l39J295O03j144q06R36R72p80j108O26J224l71j314
2623g74R4J311J32j237l22J172M70j137o82J049R03q78j066O82J159m77j223K95
2641e29J282q5j294j49J255L69j164n29J066O83j003q50Q82J015o82j149M68J219
2659H05k47j239L1J231K10j233m33J143O22r84q13Q57R31p19j033N05J178l14
$$ y = [749, 925, -547, -955, 374, 972, -268, -1037, 138, 1142, 132, -1125, -395, 970, 558, -820, -641, 755, 765, -649, -933, 465, 1064, -195, -1038, 27, 1001, 130, -960, -218, 1015, 461, -939, -679, 771, 799, -586, -852, 474, 909, -369, -1013, 194, 1076, 41, -1048, -230, 912, 316, -888, -427, 879, 595, -809, -795, 622, 873, -453, -916, 298, 936, -194, -1023, 17, 1063, 249, -952, -411, 846, 530, -727, -600, 695, 762, -568, -907, 388, 991, -153, -959, -23, 949, 169, -939, -313, 911, 540, -774, -680, 631, 763, -474, -796, 376, 846, -291, -973, 76, 979, 101, -965, -283, 876, 399, -824, -529, 753, 668, -626, -775, 480, 849, -315, -844, 222, 905, -98, -948, -66, 949, 267, -882, -414, 805, 558, -681, -650, 581, 791, -442, -875, 268, 890, -94, -907, -50, 881, 162, -871, -366, 812, 498]
2677D98j221M9J227K17j197m16J136N79r95q05Q81R23p07j034N25J128l63j173
2695g48J98J206K2j208k31J172M16j087o09R97P71q55r19P04J018n44j107L54
2713d50J161j56j176n0J170K57j121m36J045O22r46q17P86R86o11j072L87J136
2731G15j94j145k0J152K31j115m41J028O04r10p42P87R04o54j032M59J152k50
2749E29j181L9J140J50j115l11J086M85j000o70Q81P82p27q92O14R88m88j088
2767g78K94J181p1j168j67J094L21j015m66R63O42q65q08O92R46n10j003L46J039
2786F67j78j114l0J151K76j076n07R34O52p98p58O81Q96n59j012L79J087j66j070
2805e45k9J057J50j051l35J028N63r41p40P72Q41o05r00M95R63l66j057J81J088
$$ y = [498, -723, -674, 553, 770, -427, -843, 293, 872, -123, -928, -47, 876, 169, -865, -340, 788, 425, -748, -550, 656, 678, -530, -761, 411, 827, -260, -869, 128, 899, 44, -875, -171, 847, 303, -804, -450, 711, 555, -621, -671, 499, 756, -365, -801, 244, 866, -80, -897, -111, 875, 264, -808, -421, 715, 521, -624, -644, 508, 739, -376, -817, 211, 815, -95, -837, -50, 854, 200, -832, -373, 779, 529, -652, -613, 527, 677, -438, -749, 337, 822, -178, -848, 33, 815, 88, -804, -190, 798, 310, -778, -484, 697, 626, -542, -709, 385, 706, -309, -775, 188, 830, -35, -843, -151, 795, 285, -718, -372, 667, 489, -625, -655, 496, 772, -304, -811, 123, 775, -23, -781, -100, 796, 237, -775, -396, 691, 525, -545, -574, 483, 633, -418, -753, 275, 838, -103, -843, -71, 770, 165, -735, -240, 723, 357, -700, -519, 569]
2824E69M9j056k06R89L29r62m71R15O77q00q47O00R34m12r50K50J013j32j045
2843e56p5J051L10r75n01Q55O07p56p33O79Q95n29j017K87J068p8j014q9J000
2862D29K11r85m08R64N94q25p44O49Q08n42q48M46R69l15j060Q9J079J20j001
2881c70k65R40L74r01n23Q39P04p09q21N05Q77l72r02K76R59j15j062r3J035L53
2901G29r33m99P92N85p01p11O21Q59m45r66K34R80m7r62p1R62K09r82m01R15O33
2922H01p67p69O05Q05m68q69L70R34k04j008J7R91J58r42k59Q85L86q61n52P84
2942C7P17o41q27M81Q64l18r07K05R32n1r63j54R23L37q57m44P75N72o99p02N76
2963a44Q31l86r13K06R44k8r60j05R22K77q73m43P93N70o84o97N39Q31m55q80
$$ y = [569, 618, -438, -644, 345, 674, -288, -759, 156, 833, 33, -814, -214, 720, 308, -642, -392, 621, 489, -556, -631, 420, 730, -245, -746, 109, 716, -40, -773, -94, 801, 272, -745, -458, 610, 532, -482, -571, 429, 640, -345, -753, 211, 805, -20, -764, -115, 693, 151, -697, -251, 718, 403, -657, -568, 511, 631, -370, -635, 305, 679, -222, -745, 94, 798, 89, -732, -227, 650, 278, -624, -348, 611, 496, -566, -659, 376, 729, -204, -703, 89, 674, -27, -738, -117, 742, 297, -669, -435, 545, 498, -464, -535, 427, 636, -346, -747, 168, 801, 34, -735, -130, 675, 207, -662, -292, 642, 438, -570, -553, 438, 596, -346, -605, 280, 666, -195, -747, 37, 754, 113, -714, -233, 631, 313, -594, -389, 543, 492, -471, -625, 298, 635, -222, -666, 109, 681, -18, -720, -144, 687, 301, -612, -406, 538, 510, -450, -555, 367, 644, -229, -672, 121, 691, 7, -690, -151, 680, 225, -655]
2983f55K75R75j30r79m9R57J27q30k55P83M07p51n46O71P10o04p45M37P74k59
3003C13r21J68R45Kr08j85Q69L12q09m24P06N58o45o14M29Q32l34q67K00Q18m1
3024D04p90p6Q01K82r00l87Q23M59o34o05M75P53l51q56K46Q70m2r15o3Q51K17
3045E62q40l21P74M61p13n82O01O96m84p72L42Q39k18q39P1Q34Q0q34j92P97L22
3066E84p42m49O64N83n84o58M56P46l17q24J62Q48J7q48j61P96K80p36m05O70
3086H2N35n92o60M93P38l40p93J77Q42n4q53r9Q53K56p86m14P19M71o00n54N12
3107f7O73m52p67L38P89j42q28qQ82M7q09k08Q02M00p72m81N85N68m39o84M28
3128a45P32k72q43K00P84L2q04j47P54K40p50l87P37N28n84o66M12P11k68p63
$$ y = [-655, -380, 595, 465, -514, -563, 394, 521, -309, -564, 219, 626, -125, -671, 0, 710, 106, -639, -202, 572, 313, -608, -440, 505, 507, -401, -586, 283, 595, -214, -638, 68, 626, -19, -633, -204, 628, 294, -573, -373, 445, 404, -386, -462, 339, 621, -279, -666, 157, 616, -18, -623, -148, 605, 254, -602, -356, 514, 472, -443, -506, 345, 562, -278, -599, 175, 636, -77, -659, -58, 638, 154, -618, -276, 563, 345, -494, -423, 411, 491, -343, -535, 262, 584, -158, -607, 57, 640, 56, -602, -146, 600, 283, -541, -379, 469, 486, -362, -523, 273, 553, -183, -588, 82, 617, 25, -635, -142, 596, 256, -537, -360, 482, 428, -425, -524, 329, 585, -201, -615, 104, 575, -25, -579, -67, 606, 154, -613, -275, 514, 372, -456, -464, 418, 465, -344, -552, 250, 650, -122, -603, -18, 550, 111, -573, -145, 587, 315, -528, -328, 456, 488, -316, -463, 291, 531, -219, -606, 131, 659, 75, -591, -179, 532, 264, -499]
3148d99J62P80m6q05j03Q04K72p38l99O52M93n97n73N16O94m05p73K29P99o4p78
3169c79l3P63J26p64k53P48L92o72m93N45N76m78o36M14P06k66q15J07Q07O8p62
3190b99j79P08K53o63l94O37N27n27o40L87O94k68p16J59P87m1q19j45P84L20
3210E65o79m28O03M91n53n64M68O74l37p52J78P65n3p47n0P69J47p62k90O88M63
3231E96n98n26M77N74m14o38L34P08k07p54N5P43O7p05j74O93K65o64m23O00N66
3252E75m44o67L40O60k43o69J13P70qp56j77O87L20o35l60N84M48n06o42M63P20
3273E73k63p76J11P14K0o95r0P28J40o60l41O14M79n37m84L85O55m85o07L25O73
3294D79j41p55jO96J45o83j87O37L01o13m22N28N42m21n94L12O36k18o71J08P16
$$ y = [-499, -337, 443, 397, -408, -511, 293, 565, -173, -572, 80, 573, -24, -597, -81, 613, 208, -565, -336, 463, 399, -379, -412, 351, 477, -287, -540, 208, 600, -72, -565, -20, 556, 78, -558, -144, 562, 296, -519, -412, 395, 463, -299, -478, 230, 483, -180, -574, 63, 590, 63, -577, -190, 504, 236, -480, -321, 466, 425, -394, -539, 245, 565, -114, -542, 61, 552, -1, -565, -97, 577, 240, -512, -334, 431, 378, -369, -419, 350, 497, -265, -555, 133, 596, -2, -528, -51, 523, 109, -529, -195, 513, 306, -448, -393, 350, 417, -288, -462, 231, 496, -168, -591, 9, 575, 131, -536, -196, 464, 221, -448, -335, 435, 427, -329, -506, 181, 501, -134, -494, 90, 538, 32, -610, -147, 573, 310, -466, -355, 359, 379, -316, -406, 322, 462, -198, -539, 75, 554, 17, -467, -82, 573, 88, -519, -194, 479, 338, -417, -418, 278, 423, -260, -447, 190, 491, -122, -544, -16, 526, 105, -489, -177, 459, 241, -430, -322, 394]
3315C94M8p35j95O62L30n91l98N13M82m55n73L48O49k11o97R3O90J9o95j14O80
3336B44K62o63l94N92M90m83n56L88N91k94o36K02O69q3o99k1O72J31o45k36O13
3357A44L63n66m46M59N37l62n82K67O13j59o52N5O51O7o33j93O16L00n75l99M98
3378CM92m09n91L01O46j87o61P2O59N8o54j84O37K77n80l67N12M68m60n11L44
3399a35N86k42o48J44O59l0o48r2O56J74o17k72N58L73m99m42M24N52l42o08K49
3420b00N98r8o39L6N64J34o04j97N41L30n05m27M28M30k40o10K62N95j40o22M9
3441c15O14P5o02j93N75K97n42l90M78M75l79n50K73N77j43o08P1O12No13j20
3462d03O04K31n65l22N12L73m14m68L70N26k63n72J39N89m5n71l8N58J29n63k14
$$ y = [394, 442, -293, -488, 174, 504, -87, -485, 28, 510, 55, -518, -170, 479, 268, -429, -336, 354, 373, -322, -436, 244, 506, -157, -551, 41, 531, 48, -508, -120, 471, 177, -459, -257, 412, 329, -370, -391, 281, 412, -233, -469, 144, 507, -59, -505, -46, 491, 129, -453, -186, 427, 268, -384, -329, 322, 389, -244, -437, 179, 479, -96, -495, 3, 495, 86, -505, -204, 442, 255, -406, -334, 325, 383, -271, -455, 182, 459, -121, -488, 24, 492, 32, -479, -135, 451, 209, -439, -295, 364, 334, -314, -406, 250, 424, -193, -465, 93, 466, -33, -475, -51, 501, 159, -449, -200, 398, 300, -339, -303, 261, 395, -209, -406, 135, 465, -40, -467, -39, 391, 151, -459, -197, 398, 258, -364, -315, 299, 374, -228, -421, 154, 451, -91, -481, -3, 472, 93, -457, -184, 393, 250, -358, -287, 325, 330, -283, -403, 201, 432, -133, -455, 57, 430, 16, -452, -82, 444, 181, -391, -252, 337, 292, -279, -317, 241, 370, -193, -407]
3483d07N24L18m59m16L70M68k87n19K07N86j13o13j3N92J50n51k18M98L03m81
3503f1l86M21N05l11n83K07N51j63m86M9N60R2o47j46M79L17m50l51M00M15l78
3524C4m67L18N35k09n68P0N78On43p7N31J70n40k68M84L74l88m38L04M70k41n12
3546c77J75N57n3n85o8N53J73n14k36M63L44m57m28L74N19k64n48J41N61p2n58
3567c00k2N88J21n87k41N16L21m06l91L95M25l45n24K86N65j08o20J0N56P8n32
3588b15r8M77K95n85k92M15M76l93m74L14M50k09n56J74N39J4n70j20N17J99m81
3609a23k60M47L43m03m30L29M95k20n36J14N66n4n69n0N77J79n48k90M74L59l88
3630A2m21L57M55k94n08J90N71p8n69j4N41R0n45j55N16K67m75l76M04M23l05
$$ y = [-407, 117, 435, -24, -440, -70, 398, 111, -408, -201, 385, 272, -341, -354, 238, 388, -163, -381, 117, 420, -61, -447, -26, 479, 168, -415, -208, 343, 180, -306, -257, 303, 395, -252, -398, 81, 398, -52, -403, -3, 412, 34, -433, -115, 420, 211, -357, -287, 291, 297, -246, -323, 208, 378, -162, -430, 54, 428, 40, -398, -94, 376, 135, -377, -202, 355, 302, -283, -351, 202, 375, -139, -375, 88, 432, -25, -453, -79, 440, 176, -372, -231, 330, 258, -300, -322, 266, 387, -200, -441, 75, 396, -10, -401, -6, 419, 74, -450, -164, 401, 293, -327, -317, 239, 317, -215, -313, 164, 459, -126, -418, -3, 473, 80, -394, -80, 370, 161, -395, -221, 318, 332, -238, -358, 159, 358, -123, -383, 64, 407, 4, -426, -97, 398, 178, -358, -244, 322, 268, -301, -351, 226, 405, -143, -433, 41, 400, 12, -409, -52, 403, 109, -399, -209, 362, 284, -285, -299, 242, 332, -213, -368, 148, 415, -60, -436, -32, 391, 86]
3651H6m57K49M77j80n16P7N54K7n36j27N09J98m70k89M37L67l74m53K80N06j76
3672A89n30R6N39j0n58r4N62K04n01l12M47L79l87m17L15M89k54n41J48N66l5
3693B95n67n9N52J34n29k07M91L02m58l65L71M14k83m76K39N03j49n31L3N51N8
3714C19n19j58M91K44m59l13M11L87l41m56K61M96j77n19Q2N51J6n61j15N42K15
3735C97m96l09M34M00l74m58K92N01k04n40J22N78n9n74n6N54J66n24k62M73L41
3756D02m22m01L52M67k74n07J77N34r2n47K1N28P3n27j64N15K62m64l33L82M13
3777C95l21m59K47N06j58n41N9N54L8n44j35N22K17m97l09M49M04l71m72K87N12
3798C83j83n58Q8N92j4n76j12N58K10n16k84M60L49m18m11L45M93k69n24J65N52
$$ y = [86, -371, -122, 355, 175, -341, -264, 290, 317, -219, -346, 163, 361, -109, -398, 39, 406, 32, -421, -141, 365, 189, -341, -245, 294, 284, -274, -368, 194, 398, -103, -415, 32, 411, 24, -393, -78, 411, 157, -384, -236, 330, 295, -272, -331, 221, 355, -174, -381, 110, 412, -46, -411, -40, 374, 91, -385, -146, 357, 208, -323, -290, 261, 319, -200, -358, 133, 377, -82, -395, 16, 403, 62, -394, -133, 363, 186, -333, -251, 300, 316, -245, -360, 182, 397, -99, -408, 26, 426, 52, -406, -114, 387, 183, -357, -235, 343, 284, -290, -346, 208, 374, -150, -412, 61, 402, -20, -421, -69, 398, 124, -383, -206, 328, 236, -311, -290, 238, 311, -216, -380, 135, 397, -67, -400, -18, 395, 74, -385, -138, 368, 210, -331, -272, 282, 320, -224, -359, 163, 380, -117, -426, 23, 427, 56, -416, -129, 383, 200, -358, -270, 322, 308, -268, -380, 178, 388, -128, -412, 48, 397, -21, -432, -87, 406, 137, -387, -222, 330]
3819C30p6n50qN56R8n43j96N04K81m41l52L81M08l30m58K54N09j51n40M7N46M5
3841C14n23j37N08K33n00l33M27M17l20m92K55N04j69n30R0N64J9n94j24N56K28
3862C93n05l05M57L66l95m55L27N21k15n44J14N41l7n45j0N44J27n48k30M88L11
3883D00m16l70L57M19k97m86K19N27j06n37mN16P4n00j51N18K39m80l47M20M23
3904D18l25m75K28N10j66n52P1N72N8n71j52N10K54m68l03M30L82l78m79L06N24
3925C94j84n34Q5N35k0n51o7N62J73n11k79M65L22l90l75L34M26k70n01J79N35
3946C28o2n38k5N14Q3m92j67M88K61m36l74L61M25k62m59K07M84j31n35K6N75
3967B71P8n38j82M79K62m49l33M28M11l54m83K41N40j39n43N6N46J2n53r8N37
$$ y = [330, 254, -296, -304, 252, 350, -193, -389, 115, 396, -45, -397, -16, 392, 62, -396, -142, 367, 216, -324, -277, 269, 314, -209, -346, 162, 395, -105, -438, -11, 406, 86, -406, -151, 353, 184, -346, -256, 308, 327, -267, -391, 165, 393, -112, -417, 40, 406, 11, -444, -117, 404, 189, -355, -241, 300, 263, -282, -292, 252, 379, -169, -399, 89, 400, -16, -386, -29, 390, 93, -393, -174, 353, 247, -290, -294, 222, 296, -204, -355, 163, 402, -78, -425, -5, 418, 93, -382, -154, 356, 190, -362, -291, 281, 339, -232, -384, 126, 380, -88, -391, 39, 421, 43, -436, -130, 394, 210, -324, -239, 296, 276, -275, -342, 220, 393, -118, -397, 68, 390, 0, -375, -41, 385, 115, -386, -207, 328, 266, -272, -297, 217, 300, -192, -359, 129, 390, -46, -420, -59, 366, 104, -355, -148, 336, 205, -330, -304, 271, 349, -189, -371, 108, 370, -79, -412, 16, 427, 73, -410, -169, 371, 232, -311, -255, 291, 303, -250, -348, 189]
3988A89K08m93l03M13L55l67l90K99M73k31n20J37N19k1n12n9N08J07m78j96M60
4009I8K93m16l63L20M26k53m54J89N05j12n47J4N33J16n05j98M71K57m30l39L82
4030a3M20l11m78K18N24j42n25L4N42N4n47j52N32K32m50l35L97L77l41m33K86
4051a11M70j94n03Q5N25J2n18q1N06J45m75k30M24L31l71l87K93M36k32m58J47
4072a86M88o6n13k0N10J17m74k14M49K87m09l54L44M15k65m71J71N13j03n19P
4093b93N42Q1n22j78M88K53m39l37L91M00l14m58K31M98j52n08M6N30K3n01j06
4114c25M78K02m51k62L96L24l44l80K86M24k02m70J16M87k6m98m9M92J30m80k10
4135c62M22L07l71l63K91M38k44m67J69N00p6n06m3N00J29m96j95M51K94m19l65
$$ y = [189, 397, -96, -399, 14, 369, 2, -388, -89, 384, 153, -367, -230, 289, 268, -244, -303, 205, 312, -166, -362, 98, 391, -25, -388, -68, 358, 105, -349, -160, 345, 233, -314, -300, 233, 349, -156, -354, 117, 374, -56, -395, -13, 407, 96, -382, -164, 360, 218, -307, -273, 269, 323, -224, -376, 156, 388, -62, -397, 0, 377, 36, -397, -111, 359, 165, -338, -253, 272, 284, -234, -315, 191, 336, -139, -369, 55, 386, 15, -372, -79, 357, 125, -333, -186, 302, 236, -277, -297, 213, 330, -144, -358, 91, 378, -31, -385, -41, 374, 109, -362, -191, 322, 219, -300, -293, 249, 330, -192, -370, 118, 371, -68, -405, -14, 386, 72, -386, -155, 343, 191, -317, -271, 259, 282, -219, -325, 153, 355, -96, -358, 38, 362, 18, -362, -76, 348, 146, -324, -208, 279, 253, -245, -294, 198, 328, -152, -362, 60, 367, -4, -367, -76, 362, 118, -349, -180, 320, 244, -262, -305, 195, 324, -172, -367, 84, 378, -41, -406]
4156d06L62M16k78m39J77M85j32m93M3N29N1n08j58M74K47m31k99L82L38l15m20
4177c75K48M55j48m89R7M68j1m74p4M79J59m51k60M11L28l42l73K79M16k13m68
4198c38J38M96l2n03o1M95J26m58k29M47L14m07l79L13M46k42m70J69M82r4m97
4219b84mN21J11n05j91M41K69m07l01L62L58k95m50K26M63j16m79M0M71J5m69
4240b24p8M59J82m31k75L69L28k96l72K56M09j81m77J08M91Om91q5M57J58m53
4261a40k16M31L08l70l88K75M40j97m55J37M77p2n07k8N17J27m65k17M08K72l79
4282d2l16L24M06k78m46J77M72r1m60J2M62N1m65j36M53K19m06k69L20L39k85
4303D1l53K14M23j56m55N9M63K5m47q9M32J49m38k21M01L21l33l88K44M18j73
$$ y = [-406, -44, 372, 94, -345, -168, 317, 185, -308, -265, 264, 315, -193, -351, 123, 370, -61, -360, 22, 360, 45, -375, -127, 328, 180, -309, -212, 256, 245, -229, -303, 176, 335, -116, -376, 35, 363, 21, -352, -73, 343, 130, -338, -200, 296, 264, -239, -300, 195, 321, -137, -366, 81, 395, -12, -391, -78, 368, 126, -344, -175, 307, 213, -284, -288, 233, 344, -161, -352, 89, 358, -49, -350, 12, 370, 75, -375, -149, 314, 198, -281, -241, 230, 245, -224, -302, 157, 339, -92, -367, 2, 330, 34, -338, -82, 327, 146, -331, -223, 268, 274, -217, -302, 155, 313, -140, -356, 75, 383, 13, -375, -100, 340, 143, -312, -175, 302, 230, -277, -305, 212, 339, -126, -343, 65, 337, -42, -358, -34, 372, 94, -352, -175, 297, 206, -254, -242, 220, 271, -194, -330, 123, 342, -64, -333, -13, 326, 41, -312, -98, 325, 169, -286, -227, 236, 261, -186, -275, 157, 306, -132, -353, 48, 369, 36, -352, -108, 310, 137]
4324A37m44J25M70m4m87n4M72J51m35k23L96K71l59l34L09L94k15m49J41M44o1
4345B05m58J6M53O3m53j52M26K28l48k93K90L40k58l66K02M05j20m46M2M29M4
4366B49m15j03L92J67l81k51L72L09k95l69K06M11j37m34P0M66Om69r9M54J71
4387C20m14k29L72K87l37l43K61M24k15m29J08M50l3m49l3M58R7m21j97L92K61
4408C30l39l17K79L61k35l79J68M20j03m30J8M15P2m16j28L94J88l64k56L19L36
4429C33k64l85K02M03j25m34N9M31M5m56r9M13J88l82k59L57L14l02l60K37M00
4450C16j65m36R2M37j4m44p2M47J43m25j94L72K64l31l26K92L52j98l97J30M30
4471B73r3m09oM19P9m03j61L76K17l20k74K89L14k35l67J76M05r6m23K4M19N3
$$ y = [137, -307, -182, 288, 244, -243, -297, 175, 326, -109, -332, 64, 335, -24, -358, -49, 345, 130, -319, -178, 266, 205, -253, -237, 216, 279, -174, -326, 100, 328, -20, -313, -23, 317, 59, -307, -105, 300, 180, -266, -224, 205, 249, -166, -269, 123, 290, -91, -342, 30, 339, 44, -325, -119, 292, 155, -279, -209, 257, 263, -206, -305, 149, 320, -94, -323, 49, 336, -1, -344, -83, 341, 126, -303, -195, 255, 222, -227, -260, 198, 295, -126, -323, 69, 330, -9, -326, -47, 314, 79, -300, -132, 288, 185, -245, -227, 188, 260, -156, -284, 110, 298, -66, -322, -3, 333, 69, -316, -114, 289, 164, -270, -211, 220, 265, -191, -290, 123, 311, -71, -330, 27, 341, 39, -321, -84, 316, 151, -285, -193, 244, 230, -214, -286, 161, 304, -121, -315, 57, 321, -10, -336, -44, 308, 110, -287, -157, 273, 180, -229, -235, 184, 263, -140, -301, 75, 292, -28, -302, -13, 301, 66, -301, -125, 280, 184, -239, -215, 204, 257]
4493B57m29j04M13J75l72k73L31L12k44l81K19L96j55m22O1M66Km39r1M24J43
4514B89l92j96L63K62l31l15K38L81j73m13J21M21n9m19k7M25J00l98j67L54K23
4535B87l10k61K70L20k16l73J53M04r1m03OM15M7m09j25L96K00l57k68K99L22
4556C06k51l54J94L85j31m25N7M45L0m16j16L94J70l85k19L49K92k94l49K30L75
4577B87j54l91R8M02l7m15m6M14J40m04j85L48K28l01k70K69L19k09l74J36L96
4598B51o3l92LL86N5m00j23L87J98l36k72K83L10k33l46J95L88j26m34K8M45N1
4620B55m12j15L97J63l69k41L58L08k92l62J99L76j42l97R9M55p2m16n9M14J51
4641B98l80k06L46K33l07k90K60L51j93l93J24L93o1l75mL84P0l99j49L76K23
$$ y = [257, -172, -276, 137, 312, -60, -333, -2, 310, 66, -315, -96, 300, 145, -277, -216, 250, 252, -187, -278, 146, 289, -103, -299, 64, 326, -5, -320, -82, 299, 126, -287, -166, 255, 196, -223, -250, 175, 275, -123, -290, 64, 287, -23, -284, -14, 306, 90, -283, -130, 274, 183, -220, -214, 201, 248, -161, -286, 110, 310, -47, -315, -16, 306, 55, -299, -105, 280, 149, -276, -219, 226, 256, -160, -276, 118, 288, -97, -316, 33, 325, 31, -318, -88, 287, 133, -258, -160, 242, 205, -210, -256, 158, 298, -106, -291, 57, 285, -16, -286, -17, 302, 93, -281, -145, 251, 188, -204, -201, 185, 240, -160, -283, 104, 302, -34, -306, -23, 287, 54, -292, -97, 291, 165, -269, -241, 204, 255, -157, -272, 125, 288, -81, -322, 36, 344, 52, -310, -111, 265, 123, -274, -175, 280, 208, -208, -267, 147, 298, -82, -288, 58, 291, -16, -306, -46, 305, 112, -281, -157, 236, 175, -200, -204, 180, 250, -149, -298, 78, 301]
4662C01l18k78K61L12k26l44J75M04j22m22K8M20N4m06j02L96J70l75k54L37L07
4683C18k52l67K06L72j28m06Q4M18j5m34o4M14J45l78k10L50K47l07l12K64L57
4704C02j96l78J11L93p1l67qL96O2l86j46L60K12l12k67K68L07k28l47J75L98
4725B78j08m04K6L94M4l92j05L82J73l52k51L19L03k59l43K05L72j52m09R1M19
4746B31jm14q6M08J43l85j94L49K49l07l12K54L51j79l69J04L90n5l94LL81Q3
4768B50l80j50L49K13l07k62K67K93k15l40J66L57p4l87K0L82N8l92j08L77J77
4789B94l53k42L12K87k55l37K07L68j35m00O4M06Om09p6L97J51l77k01L27K59
4810B93k82l06K26L53j72l73J04L87m6l79k0L79Q0l64j47L48K01l13k51K52K96
$$ y = [301, -17, -295, -34, 278, 52, -292, -117, 287, 165, -257, -229, 191, 245, -161, -263, 133, 303, -72, -326, 11, 318, 66, -301, -95, 277, 149, -257, -173, 245, 230, -204, -268, 146, 291, -87, -297, 53, 300, -7, -319, -55, 302, 106, -272, -161, 232, 161, -206, -214, 182, 244, -142, -288, 72, 284, -28, -295, -27, 280, 52, -295, -120, 278, 170, -234, -208, 186, 230, -162, -267, 115, 288, -64, -315, 4, 307, 48, -295, -90, 282, 130, -279, -188, 231, 230, -184, -270, 138, 281, -104, -298, 51, 300, -7, -319, -65, 286, 107, -262, -158, 232, 177, -217, -214, 167, 250, -130, -280, 69, 282, -25, -287, -20, 273, 58, -282, -116, 241, 167, -220, -200, 182, 240, -152, -260, 117, 294, -59, -301, 11, 298, 43, -294, -87, 281, 146, -254, -190, 216, 222, -187, -263, 134, 285, -92, -293, 34, 293, 11, -295, -69, 284, 112, -261, -157, 230, 184, -195, -215, 164, 244, -120, -267, 81, 282, -31, -282, -30, 266]
4831B66j96l28J55L41p1l74K7L66M6l64j31L61J70l24k40K98K86k46l39J85L67
4852B55j20l78N3L82J8l80q6L84J49l56k20L19K66k66l05K20L54j78l67Q7L81
4873B12nl75o1L67R7l52j50L35K23k95k82K35L20j80l27J18L46n5l86J8L63P4
4895B40l67j18L14J88l04k27K68K85k23l28J45L56p7l69L6L68K2l72r2L71J63
4916B79l31k27K93K57k34l02J90L59j61l64O1L86Ol66n7L44R8l31j64L08K36k68
4938A2k76K17K99j60l10J04L38n6l60j5L54P2l11j33K98J60k75k27K41K93j86
$$ y = [266, 70, -258, -103, 238, 167, -207, -180, 186, 232, -132, -263, 98, 268, -56, -296, 2, 288, 42, -297, -112, 255, 135, -243, -190, 192, 210, -170, -256, 128, 277, -79, -299, 20, 286, 20, -285, -65, 289, 111, -256, -169, 212, 207, -168, -229, 138, 235, -117, -267, 68, 291, -4, -286, -51, 269, 89, -238, -120, 226, 171, -215, -197, 166, 240, -127, -245, 69, 257, -47, -274, -6, 279, 56, -272, -127, 229, 152, -217, -181, 187, 209, -163, -255, 116, 279, -52, -279, 14, 271, 37, -265, -75, 284, 123, -241, -180, 206, 212, -154, -211, 133, 231, -100, -264, 44, 280, 12, -264, -47, 252, 92, -218, -114, 224, 168, -192, -207, 147, 219, -92, -225, 73, 233, -42, -269, -28, 265, 79]
$$ [...]
8191I4
##END NTUPLES=NMR FID
##END=
