##TITLE=1H_LY-13Dix.4.B
 CD3CN, 8 sc, 
 4.06.2021
##JCAMPDX= 6.0         $$ Bruker NMR JCAMP-DX V2.0
##DATA TYPE= NMR FID
##DATA CLASS= NTUPLES
##ORIGIN= UXNMR, Bruker Analytische Messtechnik GmbH
##OWNER= root
$$ XWIN-NMR		Version 3.5
$$ Fri Jun  4 09:55:57 2021 Russian Standard Time (UT+4h)  she@DPX200
##.OBSERVE FREQUENCY= 200.131506
##.OBSERVE NUCLEUS= ^1H
##.DELAY= (6, 6)
##.ACQUISITION MODE= SIMULTANEOUS
##.ACQUISITION SCHEME= undefined
##.AVERAGES= 8
##.DIGITISER RES= 18
##SPECTROMETER/DATA SYSTEM= spect
##.PULSE SEQUENCE= zg30
##.SOLVENT NAME= CDCl3
##.SHIFT REFERENCE= (INTERNAL, CDCl3, 0, 15.7039)
##AUDIT TRAIL= $$ (NUMBER, WHEN, WHO, WHERE, WHAT)
$$ ##TITLE= Audit trail, XWIN-NMR		Version 3.5
$$ ##JCAMPDX= 5.01
$$ ##ORIGIN= Bruker BioSpin GmbH
$$ ##OWNER= she
$$ F:/spectra/data/she/nmr/H-F/1/audita.txt
$$ ##AUDIT TRAIL=  $$ (NUMBER, WHEN, WHO, WHERE, WHAT)
(   1,<2021-06-04 09:54:34.90 +0400>,<she>,<DPX200>,
      <created by zg, POWCHK disabled, PULCHK disabled
       configuration hash MD5:
       00 E9 B6 7A A2 85 ED C7 34 08 36 98 17 FE 4E 26
       data hash MD5: 16K
       82 FE E9 64 2F E8 C9 49 79 C0 88 0F 9D 86 8A 04>)
$$ ##END=
$$ 
$$ hash MD5
$$ 40 F8 F3 2B 99 3B F9 EA 38 8A 0E A0 A7 C1 B3 A8
##$RELAX= 
##$RELAX= 
##$RELAX= 
##$RELAX= 
##$RELAX= 
##$RELAX= 
$$ Bruker specific parameters
$$ --------------------------
##$DU= <F:/spectra>
##$EXPNO= 1
##$NAME= <H-F>
##$PROCNO= 1
##$TYPE= <nmr>
##$USER= <she>
##$AMP= (0..31)
100 100 100 100 100 100 100 100 100 100 100 100 100 100 100 100 100 100 
100 100 100 100 100 100 100 100 100 100 100 100 100 100 
##$AQSEQ= 0
##$AQ_mod= 1
##$AUNM= <au_zg>
##$AUTOPOS= <>
##$BF1= 200.13
##$BF2= 200.13
##$BF3= 200.13
##$BF4= 200.13
##$BF5= 200.13
##$BF6= 200.13
##$BF7= 200.13
##$BF8= 200.13
##$BYTORDA= 1
##$CFDGTYP= 0
##$CFRGTYP= 5
##$CHEMSTR= <none>
##$CNST= (0..31)
1 1 145 1 1 1 1 1 1 1 1 1 1 1 1 1 1 1 1 1 1 1 1 1 1 1 1 1 1 1 1 1 
##$CPDPRG= <>
##$CPDPRG1= <>
##$CPDPRG2= <>
##$CPDPRG3= <>
##$CPDPRG4= <mlev>
##$CPDPRG5= <mlev>
##$CPDPRG6= <mlev>
##$CPDPRG7= <mlev>
##$CPDPRG8= <mlev>
##$CPDPRGB= <>
##$CPDPRGT= <>
##$D= (0..31)
0 1.2 0 0 0 0 0 0 0 0.06 0 0.03 0 0 0 0 0.0002 0 0 0 0 0 0 0 0 0 0 0 0 
0 0 0 
##$DATE= 1622786074
##$DBL= (0..7)
120 120 120 120 120 120 120 120 
##$DBP= (0..7)
150 150 150 150 150 150 150 150 
##$DBP07= 0
##$DBPNAM0= <>
##$DBPNAM1= <>
##$DBPNAM2= <>
##$DBPNAM3= <>
##$DBPNAM4= <>
##$DBPNAM5= <>
##$DBPNAM6= <>
##$DBPNAM7= <>
##$DBPOAL= (0..7)
0.5 0.5 0.5 0.5 0.5 0.5 0.5 0.5 
##$DBPOFFS= (0..7)
0 0 0 0 0 0 0 0 
##$DE= 6
##$DECBNUC= <off>
##$DECIM= 32
##$DECNUC= <off>
##$DECSTAT= 4
##$DIGMOD= 1
##$DIGTYP= 9
##$DL= (0..7)
0 120 120 120 120 120 120 120 
##$DP= (0..7)
150 150 150 150 150 150 150 150 
##$DP07= 0
##$DPNAME0= <>
##$DPNAME1= <>
##$DPNAME2= <>
##$DPNAME3= <>
##$DPNAME4= <>
##$DPNAME5= <>
##$DPNAME6= <>
##$DPNAME7= <>
##$DPOAL= (0..7)
0.5 0.5 0.5 0.5 0.5 0.5 0.5 0.5 
##$DPOFFS= (0..7)
0 0 0 0 0 0 0 0 
##$DQDMODE= 0
##$DR= 18
##$DS= 0
##$DSLIST= <SSSSSSSSSSSSSSS>
$$ [...]
##$SUBNAM2= <"">
##$SUBNAM3= <"">
##$SUBNAM4= <"">
##$SUBNAM5= <"">
##$SUBNAM6= <"">
##$SUBNAM7= <"">
##$SUBNAM8= <"">
##$SUBNAM9= <"">
##$SW= 20.0188882624521
##$SWIBOX= (0..15)
0 0 2 0 0 0 0 0 0 0 0 0 0 0 0 0 
##$SW_h= 4006.41025641026
##$TD= 16384
##$TD0= 1
##$TE= 0
##$TE2= 300
##$TE3= 300
##$TEG= 300
##$TL= (0..7)
0 120 120 120 120 120 120 120 
##$TP= (0..7)
150 150 150 150 150 150 150 150 
##$TP07= 0
##$TPNAME0= <>
##$TPNAME1= <>
##$TPNAME2= <>
##$TPNAME3= <>
##$TPNAME4= <>
##$TPNAME5= <>
##$TPNAME6= <>
##$TPNAME7= <>
##$TPOAL= (0..7)
0.5 0.5 0.5 0.5 0.5 0.5 0.5 0.5 
##$TPOFFS= (0..7)
0 0 0 0 0 0 0 0 
##$TUNHIN= 0
##$TUNHOUT= 0
##$TUNXOUT= 0
##$USERA1= <user>
##$USERA2= <user>
##$USERA3= <user>
##$USERA4= <user>
##$USERA5= <user>
##$V9= 5
##$VALIST= <valist>
##$VCLIST= <CCCCCCCCCCCCCCC>
##$VD= 0
##$VDLIST= <DDDDDDDDDDDDDDD>
##$VPLIST= <PPPPPPPPPPPPPPP>
##$VTLIST= <TTTTTTTTTTTTTTT>
##$WBST= 1024
##$WBSW= 4
##$XGAIN= (0..3)
0 0 0 0 
##$XL= 0
##$YL= 0
##$YMAX_a= 135821
##$YMIN_a= -131679
##$ZGOPTNS= <>
##$ZL1= 120
##$ZL2= 120
##$ZL3= 120
##$ZL4= 120
##$ABSF1= 10
##$ABSF2= 0
##$ABSG= 5
##$ABSL= 3
##$ALPHA= 0
##$AQORDER= 0
##$ASSFAC= 0
##$ASSFACI= 0
##$ASSFACX= 0
##$ASSWID= 0
##$AUNMP= <proc_1d>
##$AZFE= 0.1
##$AZFW= 0.1
##$BCFW= 1
##$BC_mod= 2
##$BYTORDP= 1
##$COROFFS= 0
##$CY= 11.3945322036743
##$DATMOD= 1
##$DC= 2
##$DFILT= <>
##$DTYPP= 0
##$F1P= 15.9154993809931
##$F2P= -4.1035820241983
##$FCOR= 0.5
##$FTSIZE= 0
##$FT_mod= 4
##$GAMMA= 1
##$GB= 0.15
##$INTBC= 1
##$INTSCL= 1
##$ISEN= 128
##$LB= 0.24
##$LEV0= 0
##$LPBIN= 0
##$MAXI= 10000
##$MC2= 0
##$MEAN= 0
##$ME_mod= 0
##$MI= 1.114404
##$NCOEF= 0
##$NC_proc= 0
##$NLEV= 6
##$NOISF1= 3.799351
##$NOISF2= 2.8
##$NSP= 1
##$NTH_PI= 0
##$NZP= 0
##$OFFSET= 15.70392
##$PC= 1
##$PHC0= -11200.77
##$PHC1= 10.20099
##$PH_mod= 1
##$PKNL= yes
##$PPARMOD= 0
##$PSCAL= 0
##$PSIGN= 0
##$REVERSE= no
##$SF= 200.130013532006
##$SI= 16384
##$SIGF1= 3
##$SIGF2= 2
##$SINO= 400
##$SIOLD= 16384
##$SREGLST= <1H.CDCl3>
##$SSB= 0
##$STSI= 0
##$STSR= 0
##$SW_p= 3612.71676300578
##$SYMM= 0
##$S_DEV= 0
##$TDeff= 0
##$TDoff= 0
##$TI= <>
##$TILT= no
##$TM1= 0
##$TM2= 0
##$TOPLEV= 0
##$USERP1= <user>
##$USERP2= <user>
##$USERP3= <user>
##$USERP4= <user>
##$USERP5= <user>
##$WDW= 1
##$XDIM= 8192
##$YMAX_p= 0
##$YMIN_p= 0
$$ End of Bruker specific parameters
$$ ---------------------------------
##NTUPLES= NMR FID
##VAR_NAME=  TIME,          FID/REAL,        FID/IMAG
##SYMBOL=    X,             R,               I
##VAR_TYPE=  INDEPENDENT,   DEPENDENT,       DEPENDENT
##VAR_FORM=  AFFN,          ASDF,            ASDF
##VAR_DIM=   8192,          8192,            8192
##UNITS=     SECONDS,       ARBITRARY UNITS, ARBITRARY UNITS
##FACTOR=    0.0002496,     1,               1
##FIRST=     0,             0,               0
##LAST=      2.0444736,     0,               0
##MIN=       0,             -131679,         0
##MAX=       2.0444736,     135821,          0
$$ Real data points
##PAGE= N=1
##DATA TABLE= (X++(R..R)), XYDATA
$$ [...]
1979G44J114l192j14L217q72k911J764K315k489j454K960M70l161N89K983j542
1995D21k540K387J764k939q42L215j87l147J177K769k054k097K707J218l075k34
2011a457L129p68k843J672K310k456j505K929O39l145L21K997j202k612J981J918
2027A908k553j068K909J92k975P08K682j516k165K224J409k667n12K870l94k827
2043a775J262K451j984j789K485R60k823K0K827q92k613J700K050k307j277K719
2059A014K95k809O80K674j561k258K225J573k642o89K818k83k725J183K416j925
2075a4j871K414J123k648k25K632o79k441J515K040k142j473K522P15k629J13
2091a048K535r78k223J729J754k271j138K547L63k532M94K295j337j864K043J293
$$ y = [744, 1858, -1334, -1448, 1769, 897, -2014, -250, 2065, -424, -1878, 1082, 1552, -1609, -1020, 1963, 421, -2119, 268, 2032, -907, -1749, 1466, 1279, -1868, -691, 2078, 24, -2073, 634, 1852, -1223, -1457, 1672, 904, -1939, -267, 2043, -413, -1918, 1011, 1650, -1495, -1174, 1823, 621, -1991, -10, 1908, -645, -1713, 1196, 1388, -1587, -879, 1803, 287, -1878, 346, 1755, -912, -1424, 1446, 1052, -1775, -513, 1938, -46, -1835, 650, 1610, -1213, -1193, 1634, 742, -1871, -171, 1879, -428, -1705, 1014, 1309, -1500, -820, 1854, 293, -1965, 260, 1833, -809, -1498, 1320, 1037, -1688, -505, 1911, -14, -1885, 529, 1652, -996, -1221, 1411, 732, -1709, -194, 1846, -296, -1769, 753, 1468, -1161, -1048, 1487, 509, -1714, 15, 1769, -502, -1640, 907, 1270, -1262, -768, 1527, 190, -1674, 369, 1662]
2107A662k495o09K646j86k481R98K105j762j551K344Q85k629j54K594o46k240
2123a519J420J688k088j014K549K81k687M08K506j098k025J722J381k238o64K541
2139A163n5k549P13K252j321j706J850J010k262k42K459m48k402J064K032j595
2155c7j420K027O64k302J25K384q39k188J415J720j864j004K167J63k294O48K244
2172A609j363j902J868J308k182n17K310l45k259J149K009j753j544K124Q54k279
2188i13p0K248p44k050J458J686j975j153K245M76k283K84K135j031j861J651
2204A03J459k081q91K268K06k216N28J977j243j591J822J106k170m79K262k17
2220H43k139R65J789j620j309K103P40k333p5K273o43j937J332J432j908q35K252
$$ y = [1662, -833, -1442, 1204, 1018, -1463, -465, 1640, -122, -1673, 671, 1556, -1073, -1227, 1367, 721, -1519, -99, 1589, -499, -1513, 1036, 1317, -1370, -962, 1544, 446, -1579, 143, 1524, -714, -1378, 1163, 1108, -1441, -728, 1524, 203, -1503, 347, 1357, -905, -1147, 1312, 864, -1538, -474, 1558, -37, -1457, 570, 1234, -1068, -943, 1441, 602, -1586, -171, 1549, -315, -1319, 848, 1011, -1283, -635, 1609, 246, -1656, 212, 1520, -662, -1179, 1131, 786, -1473, -324, 1685, -68, -1612, 512, 1366, -913, -983, 1265, 521, -1529, -71, 1615, -360, -1513, 732, 1208, -1075, -791, 1344, 313, -1548, 103, 1562, -519, -1410, 858, 1064, -1152, -624, 1353, 110, -1481, 341, 1447, -723, -1202, 1060, 843, -1296, -331, 1458, -162, -1471, 632, 1372, -961, -1036, 1237, 594, -1343, -11, 1421, -487, -1322, 930]
2237I30J87k331M99K130j167j691J717J100k158m48K367k27k256Q39J921j409
2253Cj375J848P18k128n3K217n99k037J175J624j631j049J991L90k171K53K146
2270A322q57j868J375J372j736p37J980J9k050O60J927j244j559J692R92j988
2286g00k92K083m17j994J063J700j582j221J921N85k076J52K005q41j797J437
2302B6J357j839p88K066J16k060N48J886j168j566J667J089j969m96K061j27j989
2319a186P78J717j303j318J723P87j973j73J994m32j838J055J503j551j043J872
2335F12M85k031J80J957p92j682J326J224j724o69J947J0j947O27J737j215j355
2352a310J694Q14j966j99K019m64j869J059J530j523j035J842M28j956K05J861
$$ y = [930, 1117, -1214, -715, 1415, 248, -1443, 274, 1374, -784, -1232, 1135, 908, -1348, -509, 1412, 3, -1372, 476, 1194, -934, -987, 1230, 631, -1406, -231, 1393, -238, -1287, 704, 1094, -1077, -824, 1322, 465, -1403, -28, 1344, -392, -1129, 851, 870, -1180, -520, 1407, 163, -1396, 296, 1288, -700, -992, 1091, 674, -1320, -257, 1443, -139, -1360, 561, 1146, -930, -778, 1227, 386, -1411, 26, 1383, -456, -1244, 822, 938, -1122, -574, 1312, 144, -1422, 245, 1334, -635, -1131, 930, 803, -1186, -408, 1309, 6, -1312, 411, 1198, -775, -948, 1046, 614, -1224, -169, 1334, -217, -1260, 612, 1097, -934, -754, 1203, 411, -1271, 55, 1279, -445, -1114, 833, 843, -1104, -477, 1260, 45, -1310, 384, 1198, -768, -967, 1052, 588, -1281, -222, 1308, -215, -1250, 592, 1020, -936, -731, 1130]
2368A130q22j582J375J153j748o20J943L6j932N45J745j083j382J508R12j771
2384e93l82J887k10j761P74J472j298j038J668N32j860J6J867n97j646J101J249
2401A181j535p29J809J57j885M13J732r44j380J402Q44j716k51J858l53j781Q90
2418b88J509j312j052J621M60j775J23J785o63j593J120J232j442p22J626J53
2434G82j700M32J620r40j380J319R97j557m68J656j10j634O69J461j137j168J462
2451C04P33j610j78J594m24j457R42J195j362p96J600L09j657K51J526q16j271
2468a117J302R09j608m63J685l3j572N76J315j070r69J479N14j660n1J635l94
2485D78j439Q77J112j299p13J569K99j667J19J585n47j299R46R24j322m66J536
$$ y = [1130, 308, -1274, 101, 1254, -494, -1114, 829, 865, -1067, -522, 1223, 140, -1242, 266, 1178, -593, -975, 912, 702, -1059, -285, 1187, -111, -1149, 519, 1051, -809, -793, 1074, 477, -1169, -68, 1181, -354, -1083, 726, 883, -1002, -589, 1143, 199, -1181, 221, 1065, -651, -902, 956, 603, -1178, -288, 1221, -91, -1143, 478, 938, -837, -714, 1071, 408, -1185, -65, 1167, -275, -997, 629, 782, -918, -486, 1134, 194, -1186, 133, 1130, -427, -895, 761, 651, -983, -314, 1147, 10, -1158, 304, 1037, -573, -751, 843, 419, -1038, -96, 1099, -263, -1059, 541, 850, -807, -556, 970, 154, -1117, 185, 1094, -514, -977, 708, 675, -897, -321, 994, -76, -1045, 434, 948, -712, -763, 872, 478, -961, -84, 1028, -271, -984, 585, 884, -783, -664, 921, 374, -925, 21, 945, -377, -843, 693]
2502F93K5j598L90J446p93j117J159O83j433k22J580k44j555O47J313r66r03J258
2520C63L77j437J48J474o13j346R85J034j248n65J415L3j465M85J391r14j168
2537a051J191P88j333k83J395k60j331P47J167j114r08J338N04j390k9J356m74
2554C13j232Q94J033j210p36J370L30j386J24J289o05j093J015Q21j299m74J395
2571E49N1j349M29J171q58q94J206N51j406j66J416k48j258O85R68j055o03J305
2589D94K05j386J98J288n92j049R63O99j223k99J382r4j384M56J206p95r03J065
2607B31N23j230j30J305k68j227N91J026q97o96J115L30j280N9J320m24j211P48
2625a15R43r98n94J174J75j225K44J172n96j010R04O93j128k73J230j39j221N39
$$ y = [693, 718, -880, -490, 956, 163, -954, 205, 888, -545, -767, 813, 569, -986, -339, 974, 8, -895, 363, 740, -697, -549, 925, 312, -1034, -49, 985, -263, -828, 587, 620, -845, -360, 1031, 117, -1051, 140, 928, -405, -688, 707, 447, -884, -137, 1030, -84, -992, 346, 850, -540, -569, 787, 313, -919, -25, 1008, -202, -938, 432, 762, -624, -500, 789, 184, -909, 106, 927, -372, -846, 549, 600, -749, -320, 851, -7, -901, 305, 856, -550, -716, 700, 452, -806, -121, 847, -208, -811, 494, 699, -687, -489, 799, 207, -842, 121, 820, -403, -702, 680, 586, -798, -342, 864, 69, -834, 231, 754, -476, -606, 699, 431, -796, -205, 821, -76, -772, 343, 673, -607, -548, 772, 348, -863, -115, 828, -170, -764, 410, 585, -640, -396, 776, 180, -830, 74, 767, -361, -634, 596, 457, -764, -225]
2643b25J094q79q23J086M74j200n2J195l70j093P57Q70j010n53J155J67j195K36
2661c66J118o21r42R34O82j135l59J201oj176L85J030p19q01R80N12j136j61J166
2680E86k02j104N70R10q63o65J103L31j190L7J158m14j014P23P90r85m39J125
2698D57O8j135K92J046o50q31R31N19j096j58J149k20j074N62R17q63o51J040
2716C03L21j124K5J114l74r61O93P17r35m54J092J08j094K22J040n43q86Q31O36
2735G31j026l54J119L1j105L13R62o20p45R00M48j056j34J092j99j025N39Q27
2753F98q14n53J030K35j116O7J097l99r28O87O50q95l34J047l8j053L65R47o37
2772E6p43Q57M36r99j15J095k25j048M98Q72p12o13Q71L01r67M4R97l73r26O30
$$ y = [-225, 869, -10, -833, 253, 727, -473, -525, 670, 300, -793, -36, 834, -176, -729, 426, 593, -602, -366, 752, 131, -811, 123, 805, -330, -689, 512, 506, -670, -285, 745, 26, -775, 205, 717, -419, -580, 586, 384, -720, -150, 760, -103, -768, 335, 666, -524, -487, 671, 257, -757, -34, 756, -229, -668, 457, 525, -610, -318, 728, 78, -753, 178, 697, -399, -557, 592, 372, -702, -140, 777, -86, -737, 303, 624, -500, -475, 639, 265, -696, -3, 714, -221, -675, 417, 525, -569, -347, 693, 150, -736, 95, 731, -295, -649, 470, 501, -604, -291, 671, 51, -694, 206, 654, -402, -536, 556, 357, -668, -129, 698, -116, -669, 361, 596, -520, -453, 644, 245, -683, 4, 654, -241, -575, 472, 434, -619, -254, 693, 56, -687, 170, 606, -393, -508, 587, 362, -686, -188, 684, -28, -641, 230, 531, -436, -392, 605, 232, -694, -64]
2792f4P71q15n14R49J66j009J81R85m74q93P20O97q90l93R53L4r56L34Q82o24
2812D0p32Q42M71r52j43R62k07q96N50P56q03n77R67K87r74K4R16l72p77O63N83
2833F28q69l53R72Q4r44K14Q35n20o67P82M70r47k45J002j6r50K89Q16n85o10
2853f14Q09L92r58j31R79j44q73M21P03p09m66Q99K35j025M9R93l02q45N50N91
2873E54p75k92R06K3r39K55Q49n03o32P07L44q60m7R56k48r17M59P75o26n14P44
2894B19K13q46Q8Q84l77p87N61O30o98l76P90O3q50K43Q37m86p52O56N80p60l18
2915d86Q22%q33L06P80n60o43P24M25q02j30Q16j89p73M76O78p11m80Q16K62q49
2936c51L2P68l31o42N94M81p65k77Q37J6p75K36O76m96n21P14L13q25j03Q35j28
$$ y = [-64, 707, -108, -622, 327, 493, -516, -335, 650, 176, -717, 3, 700, -190, -583, 370, 404, -552, -218, 664, 40, -692, 150, 621, -331, -474, 488, 281, -615, -65, 691, -112, -689, 278, 565, -409, -385, 531, 159, -618, 45, 628, -241, -594, 378, 462, -482, -268, 567, 47, -620, 162, 632, -315, -560, 442, 426, -524, -235, 581, -4, -614, 195, 587, -371, -502, 477, 333, -540, -119, 584, -125, -591, 308, 543, -482, -433, 560, 258, -587, -37, 554, -221, -513, 393, 416, -523, -268, 581, 78, -554, 153, 497, -363, -410, 546, 298, -619, -160, 615, -11, -525, 219, 432, -414, -326, 558, 181, -606, -45, 585, -113, -489, 301, 364, -486, -243, 594, 108, -644, 12, 592, -168, -486, 336, 336, -497, -191, 589, 29, -614, 110, 535, -267, -397, 419, 230, -543, -67, 611, -100, -580, 236, 498, -351, -319, 449, 118, -524, 70, 551, -214, -491, 346, 362, -413, -177, 499, 3, -518, 196, 509, -316, -419, 416, 288]
2957B88p56L61O11n90m18P42K10q13LQ02k40o91M55N21o50l27Q02Q9q45J54P93
2978E01l66o49N62M52p16k23P95l0p82K65O87m87m90O55K47p48JP78k43p17M66
2999d2N54o15l39P21J03p67J46P17l69n94N28M12o46j84P03n9p06K76O57m96n05
3020e05O22L26p04j31P64j07p35L38O21n21m50O39K48p12lP33k52o68M73N25o21
3041a20l50P28J17p54J21P13l46n85N30L99o53j77P07n5o80K85N91m96m20O25
3061A80K27p09LP07k39o23M19N07n71l23O50J11o79J06O42l13n55M88M18o14k30
3082c98O79J9o90K10O36m03n29N62L60o47j72O94n4o67K90N72m84m25O18K39o73
3103b63j4O52k04n89M35M46o04k87O91R0o90J28N89k94n01M93L13o19j04O70j09
$$ y = [288, -468, -107, 504, -86, -504, 238, 448, -365, -362, 440, 200, -491, -36, 485, -165, -492, 310, 399, -446, -292, 501, 135, -514, 48, 500, -216, -439, 356, 326, -456, -191, 496, 9, -481, 174, 421, -327, -326, 452, 209, -508, -42, 512, -103, -442, 279, 382, -385, -239, 478, 109, -485, 43, 455, -191, -375, 328, 269, -437, -161, 496, 0, -505, 117, 443, -261, -392, 372, 265, -470, -132, 489, -32, -482, 157, 405, -307, -310, 423, 171, -497, -24, 501, -120, -470, 258, 375, -379, -258, 455, 109, -476, 54, 453, -200, -377, 330, 275, -405, -120, 471, -25, -445, 180, 407, -302, -299, 408, 169, -454, -35, 472, -99, -422, 228, 339, -340, -234, 408, 95, -460, 28, 446, -168, -398, 281, 300, -390, -180, 456, 53, -476, 86, 446, -201, -373, 321, 267, -400, -110, 462, -22, -447, 171, 410, -263, -277, 375, 171, -418, 17, 463, -141, -428, 263, 353, -337, -209, 380, 86, -415, 78, 391, -228, -332, 338, 229]
3124B29n78K56M52m14l28O53O5o44m2O65j14o62L79M53m55k76N52J23o16P3O13
3145C84k48n44L82M09n62j47O39j4o85J81O25l17m94M77L11n83r9O21r1n97L08
3166d4M48m06l28M78J77o22J05N73k88n24M30M07m99k45N34M4n35J58N23l62m28
3187d04M73K94n14j23N17p3n08K63M68m30l61N12K57n58o7N41j42m87L25M21m70
3208f6l15N52J75n66J4N10k12m31L92L32n26k08N77N8n66J13M91k94l69M43K35
3229C39n37r4N49o7m80K19L77l77k38N04Q4n46M4N20j69m31K93L10m27j43M91
3250B21K9n28J06M85k26l83L32K43m37p7N05n3n32J82M82k92l71L98K00m61n3
3271b30N08j02m94K23M12l12k88M00J12m69Q3M70k30m41L41L39m05j85M38J0m43
$$ y = [229, -349, -93, 359, -55, -383, 270, 335, -309, -351, 314, 200, -462, -83, 370, -85, -361, 191, 314, -302, -229, 384, 136, -408, -26, 383, -179, -326, 313, 299, -386, -205, 420, 103, -391, 86, 397, -186, -285, 336, 245, -352, -44, 404, -2, -330, 148, 325, -297, -192, 381, 93, -431, -1, 406, -93, -338, 196, 240, -295, -137, 386, 24, -404, 69, 363, -151, -274, 243, 170, -338, -75, 393, -37, -398, 114, 371, -187, -254, 287, 145, -342, -17, 404, -66, -381, 171, 346, -220, -206, 304, 92, -339, 53, 385, -141, -349, 228, 286, -280, -167, 324, 30, -339, 104, 339, -198, -292, 257, 190, -290, -71, 306, -71, -309, 195, 279, -267, -223, 297, 128, -303, -10, 300, -127, -270, 221, 250, -278, -172, 313, 87, -296, 36, 279, -158, -235, 270, 217, -315, -133, 349, 57, -314, 84, 284, -177, -230, 278, 176, -318, -95, 317, 5, -283, 117, 229, -240, -157, 313, 83, -358, -17, 322, -83, -268, 170, 180, -263]
3292b63J56M04k92l23L74K06l98o8M03r7l66K57L12l70k28M22J09m20J5L94j44
3313H3l53K75K98l83j87M11P8m03L5L86j82l22L13K34m08j44M66J8m47J12L84
3334B64k49k88L43J88m15p2M28n9l61J59L02k78k16L74P1m02L4M10j44l25K05
3355c1K26k67j56L46N7l85R3L59k05k60K52J87k91o5K76K0l94J70L04j89k61L40
3377A26J53m47k1L85l8m01K10K90l05j62K53J10k93n5L85r9l37K30K88l83r3M08
3399B04k2l46l3L66k02k37K88J68l37k8K60L9k87J46K22j90k35K98P8k71PK69
3421A57q1k83J98J76k15j40K69N7k70K1L00j21k51K02J57k22j43L21J9l28J03
3442g4K92j54k96K32K29k94j32L44j4l34J02L00j90j99K27J46k77n0L06o1l08
$$ y = [-263, -107, 297, 5, -318, 56, 262, -136, -204, 199, 102, -264, -7, 305, -65, -293, 129, 238, -182, -167, 227, 83, -270, 5, 303, -80, -267, 144, 222, -181, -146, 240, 58, -264, 49, 283, -125, -269, 197, 215, -232, -120, 264, 15, -273, 70, 258, -157, -229, 199, 140, -221, -62, 240, -38, -254, 120, 191, -211, -177, 233, 89, -236, -31, 195, -72, -228, 118, 175, -210, -117, 242, 37, -223, 29, 216, -75, -140, 136, 156, -238, -68, 236, 47, -214, 126, 279, -168, -189, 196, 158, -243, -33, 257, -48, -210, 43, 153, -140, -195, 190, 91, -246, -16, 272, -111, -204, 204, 182, -164, -197, 169, -33, -270, 18, 186, -151, -179, 81, 120, -167, -21, 201, 11, -224, 74, 152, -119, -112, 157, 76, -207, -9, 167, -48, -188, 81, 138, -132, -111, 189, 68, -183, 19, 176, -46, -189, 132, 151, -177, -74, 218, 64, -232, 0, 229, -65, -197, 147, 133, -201, -99, 201, 11, -188, 39, 185, -92, -142, 164, 103, -205]
3463b05J63K54k42j44K60Q0k87K8K58j15k33J83J68k06r9K09L1k31Q1K34j65j96
3485a74K39J03k08j45K83j9k39Q8K03r9k41K80R8l10k9L88q0k36R5J73j96j26
3507a52K52O7k83%K31j5k86K09J47k36j23K87P2l00K3K50j15j87K24R3k73l0K85
3530A40l2k62R4K14j54j47K17R1k76j4K72m7k42J07J77j62j19K36M7k89M5K63
3552A59q8k60J71J87k25p8K62Ok96O0K83j17k35J82J55k43n5K69l1k90J16K68
3574B00j72j99K02J16k51j1K62o4k50J28K20j82j62K10P0k22L9K23j11k31J82
3595cJ72k08j11K23L2k22O3K13j33k10J92J66k25r1K33kk17P8K30j69j86K28J39
3618A92k66o0K64m2k55J51K19k31j71K59J17k79k1K47o9k20J71J62k23j11K65
$$ y = [-205, -42, 212, -30, -174, 86, 166, -121, -93, 165, 50, -183, 0, 168, -38, -137, 72, 103, -128, -47, 187, 22, -174, 65, 168, -40, -185, 98, 79, -160, -72, 131, 32, -209, 71, 169, -141, -170, 218, 138, -98, -3, 170, -26, -152, 100, 167, -116, -116, 115, 100, -186, 23, 170, -66, -189, 98, 170, -130, -107, 143, 28, -159, 65, 158, -115, -145, 140, 108, -154, -60, 154, 0, -147, 70, 161, -115, -129, 143, 96, -146, -39, 138, -24, -143, 93, 140, -149, -104, 159, 71, -189, -18, 169, -56, -134, 128, 134, -162, -102, 181, 64, -171, 11, 166, -77, -132, 137, 106, -184, -68, 200, 28, -171, 31, 147, -104, -115, 147, 83, -167, -39, 181, -1, -163, 47, 117, -105, -66, 157, 46, -185, -3, 169, -39, -150, 73, 105, -117, -54, 159, 26, -184, 8, 174, -51, -142, 91, 89, -128, -50, 180, 11, -175, 53, 192, -74, -134, 130, 88, -167, -16, 203, -28, -199, 60, 177, -102, -123, 124, 55, -165, 6, 168, -55, -166, 99]
3639I9L8k64L7K30j08j98K29J12k26r3K25N0k52N8K15j59j29K04J00k83nK30o2
3662D8k00J58J45j65j29J99R4l18M7K34n7j59Q6J64k33oK04O3l11K5K15o6k39
3685b01K67N0j40j27L03p3k70J50K46k45k12L51P4k42q4L47j30l27K22K50j72
3706C7k13K80L0l01J45J02k4k39K14J38j43k06K91N7k93N9K43j23k85K34J46k40
3728i1l8K03M3k31K5K72j89j61K32R2k07j28L71r1k78J27K03k34j09L52J1k86
3750a12k5K89q0k77J88K09k56r7K79J7k89P2K57j21k35K03J40k38n6K49pk58R5
3773e3K17j66j57K06J07k61l2K88n8k62J37K24k09j52K44O6k70K7K55j14k08J79
3795HJ84k64j17L09J3k89N5K86j49k34K35J54k36j19L15m9k31J36J61j62j79K66
$$ y = [99, 137, -127, -90, 140, 32, -166, 63, 175, -51, -144, 81, 131, -121, -63, 152, -7, -136, 68, 168, -115, -120, 110, 48, -152, 6, 151, -14, -143, 56, 150, -168, -121, 113, 56, -103, -17, 147, -86, -92, 112, 175, -136, -111, 104, 38, -201, 66, 116, -24, -151, 152, 79, -191, -41, 205, -40, -252, 99, 173, -69, -153, 194, 64, -263, -41, 209, 37, -176, 104, 134, -167, -22, 80, 56, -183, 31, 169, 26, -180, 111, 168, -125, -66, 177, 54, -231, 3, 149, -91, -129, 74, 117, -114, -89, 183, -6, -167, 65, 157, -50, -178, 193, 102, -176, -49, 154, -80, -189, 163, 174, -112, -137, 152, 72, -205, -17, 192, -64, -161, 118, 135, -154, -82, 175, 54, -181, 22, 162, -76, -132, 117, 110, -148, -53, 164, -2, -159, 47, 154, -107, -139, 149, 91, -171, -34, 190, -19, -171, 73, 139, -131, -104, 151, 37, -171, 8, 192, -72, -189, 120, 133, -156, -101, 185, 36, -198, 37, 191, -45, -164, 151, 102, -129, 7, 168, 6, -173, 93]
3817I3O5k42m6L02p1k80J74J98k40j61K81O8k31j0K74j05k22J67J59k36r3K69
3839A13L6k75M5K47j36k08K11J41k66o1L00k9k81Q8K66j80j85K47R8l00j2L11
3861A70p5k80J63K09k14j38K75M8l09L5L06j25k58J94J91k39r9K70j0k82J02K63
3883A97j67j98K11J26k52k8K55n8k70J46K41j98k01K59P6k48jK82j13k61J96K00
3905A94k29j42K87K8k83P1K76j70k52K44J86k89r3K86Mk80J08K58k07j95K64J23
3927A89k96l8K97n6k65J54K29k50j67K79R7k81jK64r4k49K07J53k74o9K65O5l18
3950a59J13K12j23k16K04J90l34l3L03k4k73J07K65k34k18K77J66l10o2L52j16
3971H7k87J87K10k51j08K61N4l14M5L09j46k50K05J82k63p7L15l6k92J08K77k01
$$ y = [93, 158, -84, -130, 172, 101, -179, -5, 193, -47, -208, 73, 141, -90, -100, 174, 69, -153, 14, 173, -63, -156, 113, 149, -126, -81, 166, 30, -178, 33, 174, -92, -153, 147, 118, -163, -75, 191, 11, -174, 73, 171, -129, -141, 170, 95, -185, -22, 187, -27, -165, 110, 158, -151, -116, 190, 65, -193, 1, 192, -47, -146, 124, 114, -168, -66, 197, 30, -168, 43, 169, -83, -111, 144, 86, -184, -38, 203, 5, -196, 63, 139, -109, -110, 172, 59, -202, -6, 194, -35, -177, 110, 138, -145, -74, 202, 32, -220, 24, 210, -79, -172, 114, 118, -162, -54, 204, -3, -198, 66, 189, -107, -145, 152, 96, -169, -15, 214, -36, -203, 76, 173, -108, -109, 155, 61, -188, 19, 172, -102, -171, 94, 159, -159, -46, 166, 43, -173, 31, 221, -113, -146, 157, 133, -140, -33, 232, -2, -220, 57, 223, -87, -149, 203, 87, -200, -13, 197, -54, -162, 99, 153, -161, -116, 193, 47, -203, 2, 184, -79, -156, 159, 123, -169, -61, 216, 15]
3993A5k01K29J21k67k5K98q4k71J68K18k25j56K60P1k84L4K70j19k38J77J94k37
4015e2j14K79K3k86Q7K60j75k21K34J62k84p7L10m5k91J46K51k29j80K87R1l05
4037a29NK92q8k72J99J99k66j27L13L9l11L2K96j39k31K17J58k70p2K82Mk91Q8
4060g2K45j67j91K41J16k81k6K96n7k73J13K40k03j55K61O0k94K6K89j18k41J80
4082a1K10k79q8K90Ll01R4K75j66k33K41J41k84m8L10n4k82J45K41k24j65K73
4104H8Q1k94jK98j13k48J50K59k63j33K81L6l14P2L02j28l08K92J89l30n5K14
4126G5M9k83P5K37j57j66K47J01k97j7K87n7k81J63K10k16j44K78N2k86J8L05
4148A93j29k50J86J90k56r5K99nk92Q3K80j76k23K38J26k64n1K86n6k61J36K40
$$ y = [15, -186, 43, 164, -103, -128, 170, 86, -185, -17, 201, -24, -180, 80, 151, -133, -99, 171, 52, -186, -9, 185, -52, -166, 113, 136, -150, -63, 197, 22, -199, 35, 197, -87, -164, 146, 101, -190, -44, 207, -22, -202, 85, 176, -129, -124, 168, 80, -192, 7, 206, -60, -187, 126, 165, -146, -114, 182, 43, -188, 29, 187, -83, -155, 127, 131, -160, -72, 173, 6, -185, 56, 172, -109, -135, 161, 104, -169, -56, 184, -19, -174, 87, 147, -147, -121, 168, 50, -191, -11, 199, -80, -168, 122, 125, -176, -82, 193, 27, -206, 35, 176, -108, -156, 154, 100, -182, -37, 204, -20, -185, 88, 169, -125, -126, 172, 59, -189, -39, 220, -43, -176, 105, 141, -173, -101, 201, 73, -235, 57, 246, -84, -139, 75, 124, -159, -84, 153, -4, -170, 77, 178, -119, -136, 151, 94, -187, -24, 186, -30, -174, 104, 156, -130, -112, 193, 64, -186, 0, 190, -66, -161, 138, 133, -159, -76, 204, 28, -195, 43, 169, -95, -146, 140, 84, -177, -41, 199]
4170A99k12j72K45Q7k70LK78j05k28J56J95k18j12K38M6k58L3K52j16k20K00J59
4192A80k50q7K74Pk71P9K38j66j95K28J39k74m2K75m5k56J31K15k04j62K67P2
4214A53k74LK72q3k62J61K01k13j38K99J7k89N2K41p9k51K33J21k90JK66k7k32
4237a18P4K10j69j53K46J05k63r2L22n3k72R7J87j75p3K59Nk43KK40l1k91K05
4260A9J39k04j10K75Pk79P0K65j47k18K02J47k56m8K82m0k69J21K26j75j86K32
4282E3J01k64oK78q7k56J70K03k18j24K32N1k45L4K45j29k18J83J68k30q4K43
4304A00Lk55R2K28j68j85K25J30k60m5K60k6k63J39K08k21j39K58P5k69LK73j07
4327E6k36J91J77k43j24K88L3k79N6K49j46j87K02J42k63o5K91k6k71J10K12j80
$$ y = [199, -13, -185, 60, 147, -123, -120, 158, 53, -175, -19, 176, -42, -154, 84, 130, -128, -95, 157, 41, -179, 21, 180, -70, -157, 117, 124, -147, -68, 170, 4, -191, 37, 176, -98, -140, 135, 90, -166, -35, 180, -24, -186, 81, 153, -121, -118, 154, 71, -191, -30, 171, -42, -180, 119, 136, -153, -101, 140, 61, -190, 43, 164, -126, -125, 141, 114, -118, -44, 166, -3, -156, 90, 195, -68, -160, 162, 109, -163, -66, 121, -54, -127, 132, 137, -106, -104, 136, 105, -186, 19, 158, -46, -156, 119, 126, -153, -83, 182, 35, -183, 19, 166, -90, -138, 144, 104, -165, -44, 182, 7, -179, 53, 154, -110, -116, 162, 75, -181, -11, 192, -26, -150, 82, 133, -112, -78, 167, 38, -180, 3, 171, -59, -143, 100, 103, -152, -60, 168, 0, -185, 40, 170, -90, -135, 125, 99, -164, -25, 183, -38, -177, 81, 156, -113, -110, 163, 56, -180, 11, 188, -55, -179, 109, 142, -137, -81, 168, 22, -165, 37, 179, -84, -149, 142, 116, -155, -45, 167, -13]
4349a3j65K43Q4k70qK80q0k42J50J86k09j12K52L8k65L1K64j12k14J79J61k45
4371f7p0K88q2k49J38J84j47k36L02J24k88j4K73r6k48J69K27k26j51K59O0k87
4393a37L6K85j27k59K05J84k42j00K73%k78Q6K57j63k07K28J27k59m6K69k7k68
4415a63J22K24j94j64K59P2k78rK65l5k64J78J66k33j44K96M0l09M1L35k04k07
4437b06K38J78k78q2K93l1k73J22K38k14j78K52J27k72k7K82m2k86P8K46k25j35
4459a95L28J8k87L6K65q6k99K32J25j66j63L21K1l21J36J60j34j56K10J37k59
4480g7o3K62j2l11J56K28k03j59K56Q3k89K6K81j10k61J89K07k54j25K81M5k95
4502a45M2K84j42k34K27J58k74q4L08j7l05J11K62j85j91K38J27k92l9L14n9k84
$$ y = [-13, -178, 65, 149, -121, -129, 151, 71, -171, -21, 165, -44, -156, 96, 134, -131, -100, 164, 52, -162, 17, 178, -67, -137, 151, 69, -180, -42, 142, -5, -241, 61, 185, -103, -117, 156, 60, -188, -19, 208, -18, -169, 90, 150, -137, -101, 184, 57, -202, 3, 187, -55, -155, 118, 118, -160, -74, 183, 20, -187, 41, 168, -91, -137, 132, 105, -163, -41, 183, -11, -175, 84, 156, -122, -131, 134, 99, -165, 13, 179, -54, -198, 98, 138, -171, -130, 205, 1, -206, 32, 210, -68, -150, 143, 112, -161, -39, 199, -15, -193, 59, 186, -86, -113, 169, 127, -159, -81, 165, -60, -195, 133, 151, -136, -100, 165, 79, -220, 12, 137, -29, -192, 129, 150, -171, -35, 125, -9, -165, 45, 182, -77, -140, 122, 110, -201, -45, 183, -20, -179, 77, 160, -129, -103, 178, 68, -193, -4, 203, -51, -176, 105, 150, -145, -103, 181, 39, -195, 32, 190, -84, -168, 140, 123, -182, -71, 191, 6, -185, 53, 180, -112, -151, 163, 104, -180]
4524a80J49K30k28j55K75P0l05L7K82j12k54J90J58k27q8K88k4k74L3K81o9k55
4546a78J76J29k09j31L85o0k67J17K57k56j78K63J27k69k6L00j13k73J86K32k45
4567c3j56K82O4l11N0K89j53k39K28J87k73r7K94j2k87R2K60j83k05K60J31l02
4589a14m0K97o2k71J60K27k29j62K63J02l06J6K84r7k52J85J89k60j04K66L4k83
4611a57P8K68j58k31K41J61l13o0L05j6l01J42K29j87k01K68R0k98NL05j03k64
4633a97J74K30k50j26K76M2l04M2L00j27k24J92J36k54q6K81K9l10J31K04j29
4654C0k15K58J23k69m4K84r5k65J33L20k53k38L57R6l86R0K94k25j88K03K02k48
4676c6j30L70j22k59J17K71j57l25L07J18j82p4K33J5k95J20K24j89j54J61J67
$$ y = [-180, -31, 199, -29, -184, 91, 161, -144, -107, 175, 63, -191, -1, 157, -70, -158, 130, 106, -168, -135, 146, 77, -178, -2, 127, -82, -213, 172, 112, -155, -38, 219, -37, -215, 48, 175, -94, -120, 180, 67, -206, -20, 212, -33, -189, 93, 157, -154, -104, 185, 32, -207, 21, 208, -65, -162, 132, 120, -167, -75, 185, 2, -203, 57, 188, -114, -154, 143, 81, -190, -30, 197, -32, -194, 69, 171, -135, -119, 165, 68, -184, 1, 190, -70, -174, 92, 126, -157, -79, 189, 31, -200, 41, 202, -111, -171, 134, 118, -183, -41, 188, 1, -200, 68, 158, -140, -135, 170, 67, -197, -23, 207, -43, -169, 107, 149, -155, -113, 187, 60, -164, 28, 164, -90, -176, 105, 134, -176, -45, 159, 30, -185, 73, 196, -73, -117, 167, 72, -193, -60, 260, 7, -231, 126, 222, -164, -74, 220, -5, -193, 10, 212, -36, -166, 204, 82, -177, -60, 211, 54, -271, 36, 154, -28, -102, 131, 146, -149, -29, 195, 6, -148, 13, 180]
4697A80k35o9K66l1l40K34K26k15k63L54O0k98KL34j73j65J71K29l16r1L11j2
4719A59l41O4L40k33j61K42R0k75j1L03o3l34K13J96k65r0K98l1k78L4M09j83
4741H3k40J40K90l14j44K95N0l53P2L57k29j95K77J24l15r1L67l6l45J48K96l04
4763f7j42L43nk69L5L20j40k53J61K03k46j12K49P6l66J11L12k26j78K14J76l47
4785a51k8K82j2k89J31K53j62k22K81J13l46J3K93n9l08K08K38k84j43L74L7l80
4807a61J8L37j44k69K46K16l02j18L35o3k74J50K53k19k03K95M9k57qK92q2k94
4829b03K03K04k59j35K98L0k97J4M00j77k96K32J81k98j30L78K5l69J19K88j63
4850D5k81K91J41l13j1K87p5l11J93K60k30k22L34J00l73M9K65p3k58K73J80l55
$$ y = [180, -55, -124, 142, 111, -229, 5, 231, 16, -247, 107, 167, -131, -129, 205, 32, -133, 38, 267, -49, -140, 171, 159, -182, -118, 222, -11, -172, 70, 160, -115, -126, 177, 114, -220, -7, 189, -76, -166, 132, 101, -177, -143, 266, 83, -157, -17, 273, -41, -185, 110, 160, -193, -121, 236, 7, -188, 89, 213, -102, -193, 174, 138, -207, -59, 237, -67, -209, 134, 129, -140, -105, 215, 75, -178, -17, 186, -60, -172, 77, 153, -213, -102, 210, -16, -194, 20, 196, -151, -179, 103, 91, -198, -67, 186, 24, -198, 83, 196, -150, -137, 156, 97, -211, -3, 235, -49, -192, 182, 219, -161, -143, 194, 50, -219, 27, 243, -59, -177, 158, 95, -179, -29, 224, 5, -198, 97, 146, -111, -119, 173, 91, -203, 0, 204, -55, -190, 108, 138, -159, -145, 255, 78, -218, 14, 195, -103, -233, 145, 170, -199, -80, 208, 45, -236, 55, 196, -117, -128, 159, 84, -227, -34, 226, -4, -226, 108, 208, -165, -116, 149, 76, -182, 91, 271, -84]
4872h4j39L45Pl51J36K94j77j79J02K38k00j40K72j3l12J31K09j31k26K61J52
4893A95l47k2L74j44k84K34K57k77k26L31J26l20nL77j83l01J64K39k36j69L75
4914A58m0l06N7L62k32k09K41J41l07k2L30p1l53K51K42l01j32L13Q4l71N2L45
4936B32j53l09K29K25k96j16K97O4l40R5K92k00k13K61J66l50m0L30n7l20J55
4957d8K97k79j99L23J04l26LK86r4k81K37K00k78j45L26L5l35P5L18k01k42K73
4979D9J71l12o9L27k7l26J40K57k17j97K76J27l41qL24p2l00J84K21k57j42L10
5001A18N1l43N1L26j44k61K15J83k82q7L21pl35J19K85j89k29K62J28k99l9L31
5023A75p0l10J64K60k32j88K88R2l15J4L22j16k96K17K27k85j24L04K6l12P4L14
$$ y = [-84, -223, 122, 129, -222, -86, 208, 31, -148, -46, 192, -8, -148, 124, 111, -201, -70, 139, 8, -218, 43, 195, -152, -174, 200, 56, -228, 6, 263, -14, -240, 91, 217, -103, -108, 269, 86, -215, -51, 188, -48, -217, 158, 118, -188, -131, 231, -1, -210, 31, 172, -135, -157, 173, 102, -251, 0, 242, -59, -191, 122, 206, -165, -113, 232, 79, -230, -1, 224, -72, -188, 109, 173, -167, -72, 220, 20, -193, 68, 234, -116, -156, 174, 117, -203, -48, 249, -30, -229, 94, 198, -128, -125, 161, 67, -214, 23, 223, -55, -200, 126, 161, -174, -99, 219, 18, -224, 49, 220, -92, -161, 166, 139, -187, -47, 210, -7, -204, 72, 199, -142, -150, 174, 102, -198, -14, 207, -50, -192, 118, 169, -174, -123, 203, 59, -202, 13, 196, -86, -173, 148, 141, -194, -75, 210, 21, -208, 54, 182, -117, -156, 175, 105, -205, -41, 219, -13, -201, 87, 179, -136, -122, 200, 84, -212, 5, 232, -53, -177, 127, 153, -159, -85, 229]
5045B29j90k61K49J92l14o2L14m3l08J35K71k06k18K84J22l03l2L16j01k66J76
5066a6K24k49j61K97P9l11K8L01j30k58K09K03k97j08L37j2l15J09K77j91k22
5087b06K69J45l20m8L28n8k91J46K55k43j79L09O3l28K2L37j33k77K09K19k82
5108f3j26L14L6l27O4L04j62k23K25J53k85p9L21k8l04J25K58k03j91K55J09k73
5130a00k6L09r3k85J76K33k56j65L44J3k85K5L05j23k97K59J83l00j07L19ml11
5152a86J10K78k01k07K54J70k98p6L14l9k74J10K70k57j83L06Q3l14k7L29r0k80
5174b08K21J97k63j08K83J3k95Q0K46j17k54K41J60k64r4K80J7l09R9K60j74j91
5196a80K37J05l09RL27q0k73J11K75k82j31L00Q5l52P0L17k18j80K69J36k62j41
$$ y = [229, 39, -222, 27, 219, -95, -157, 157, 114, -194, -59, 212, 6, -212, 72, 194, -109, -141, 175, 74, -192, -16, 208, -41, -202, 95, 174, -137, -109, 192, 62, -196, 13, 216, -81, -189, 148, 136, -179, -70, 207, 16, -206, 63, 208, -112, -160, 168, 110, -181, -35, 220, -23, -202, 107, 170, -158, -136, 201, 68, -209, 0, 219, -63, -189, 125, 161, -166, -102, 202, 40, -183, 42, 195, -90, -169, 152, 124, -180, -55, 203, 0, -191, 64, 173, -100, -126, 183, 90, -195, -19, 214, -42, -207, 137, 150, -135, -110, 195, 72, -225, 34, 217, -83, -190, 129, 125, -186, -76, 202, 1, -206, 48, 218, -80, -156, 158, 119, -155, -45, 225, -32, -215, 91, 174, -140, -167, 162, 72, -208, 13, 210, -53, -161, 122, 135, -160, -80, 166, 49, -205, 36, 196, -68, -162, 118, 135, -174, -75, 185, 11, -180, 57, 162, -147, -138, 189, 109, -164, -53, 222, -60, -191, 109, 194, -158, -88, 229, 11, -169, 100, 236, -26, -167]
5218a67L41m6k92J78K24k12k20K57J50l40k6L95j65k66J37K52j64k53L25Q4k57
5239f5k8K72q0k62K30J67l02j62L83L1l48L8L26j87k27K43J89l13k3K62l8l15
5261b09J70K19j89j75K62J16l46J0L10o8k93J64K22k29j47K99L9l05M7K88j26
5282E9k57K12J68k50r2K97j0l08J07K75j80k12K19J50k78l7K90n9k81J44K42k08
5304ij65K52P4k89K9K89j21k57K01J90k46j08K79J0k83Q0K78j86k23K49J60k93
5326h9n2K86l5k83J30K48k32j78K85R2k85rK76r5k47J91J96k50j37L00L8k95N5
5349i0K60j50j96K13J53k70q2K81Mk79R9K22j63j82K47R7k73k0K78o5k58J47J99
5372A72k06j40K69N2k83K8K93j25k40K00J49k37q4K82Mk97R5K54j74k09K37J30
$$ y = [-167, 174, 128, -164, 14, 238, 26, -194, 63, 213, -127, -153, 242, 77, -189, -52, 200, 36, -217, 108, 192, -65, -93, 179, 99, -163, 67, 234, -68, -230, 153, 184, -164, -126, 200, 13, -214, 29, 218, -95, -118, 144, 106, -209, -39, 180, -9, -184, 78, 194, -152, -142, 168, 100, -193, -29, 193, -36, -183, 116, 155, -150, -103, 185, 59, -198, 14, 182, -68, -160, 137, 127, -181, -74, 201, 21, -191, 28, 178, -100, -137, 153, 94, -187, -43, 199, -9, -174, 78, 152, -137, -108, 181, 60, -197, 4, 194, -52, -160, 119, 129, -154, -74, 204, 18, -205, 44, 204, -89, -141, 145, 110, -173, -43, 205, -27, -205, 80, 172, -113, -122, 154, 59, -188, 3, 199, -51, -188, 112, 150, -145, -90, 170, 20, -176, 37, 190, -80, -162, 119, 123, -156, -57, 165, 2, -180, 67, 164, -109, -129, 149, 84, -174, -27, 172, -34, -174, 95, 147, -136, -108, 185, 60, -180, 20, 169, -68, -152, 130, 134, -163, -68, 186, 12, -197, 40, 170]
5394A70k68l7K85o6k62J29K29j83j66K50P4k81K6K64r9k39J54J97k10j22K50L8
5416A33k70O1K48j36k18K10J38k25q2K60j6k56J03K30j70j85K27J08k47l0K52
5437A35o1k43J57K01k21j32K55O5k84M3K44j08k34K04J51k26j05K69J2k66Q1K41
5459A78j59j93K17J32k56n7K80m5k58J28K10j93j44K29P1k45NK38p9k21J58J72
5481A68k20j09K54L2k59M8K52j24j96J82J46k35p9K73k7k53Q9K29j71j79K33J10
5503A64k60j6K64p2k45J53J91j95j43K54N5k77L9K55j12k19J73J62k24r3K45K1
5525A20k64P4K23j38j76J98J19k46l8K47m0k33J29J90j64j56K33O9k47OK55r2
5547F9k19J54J52k03j01K65Kk56O5K43j42j95J99J31k49m5K62l5k58J08K29j85
$$ y = [170, -98, -135, 150, 84, -178, -49, 180, -3, -169, 81, 155, -126, -100, 164, 65, -174, -20, 177, -33, -155, 95, 133, -137, -76, 172, 36, -182, 28, 166, -59, -141, 119, 103, -153, -50, 180, 10, -175, 52, 160, -87, -117, 135, 74, -169, -12, 189, -32, -164, 91, 156, -128, -85, 159, 51, -183, 21, 172, -54, -159, 110, 122, -144, -63, 178, 19, -174, 43, 175, -81, -138, 142, 97, -161, -33, 177, -16, -160, 69, 140, -105, -100, 138, 59, -162, -4, 168, -52, -161, 93, 125, -134, -86, 166, 42, -154, 28, 174, -61, -140, 133, 106, -147, -58, 171, 0, -179, 54, 164, -96, -112, 152, 80, -165, -12, 179, -16, -159, 95, 150, -127, -88, 167, 55, -164, 9, 171, -53, -146, 99, 120, -144, -70, 153, 15, -161, 37, 156, -90, -128, 119, 79, -154, -25, 165, 1, -155, 78, 147, -100, -94, 161, 69, -150, 4, 156, -47, -148, 117, 119, -137, -72, 171, 29, -166, 33, 164, -85, -130, 132, 97, -161, -53, 176, -9]
5569ij65K24Q6k50JK60q2k55J67J95k12j12K31N7k73O9K30j20k21J97J44k16q9
5592a43K57j8k42J01K15j70j68K21J10k48l0K48m8k29J31J96k07j43K56N7k60
5613a14jK58j19j79J76J71k45j28K97k0k56Q5K28j55j66K14J00k62k3K78k7k65
5635a53J16K02j83j14K15Q9k91K1K62r9k39J62J42j80r6K63Ok70N2K43q6k50K42
5658E4Q2j81p6K23O1k78R7J54j70j29J93J10k73L7K45n8k69J29K06j66j54K13
5680E0O2j98j8K17o0k42J95J73k31r9K68pk43P9K40j76j75K09J21k38m4K50n2
5703H1k22J22J96j95j43K35P0k48MK36q5k05J62J47k01j00K40J4k37N5K38j40
5725B4j79K02J08k37m4K56l1k38R4J98j67j37K28P7k68J0K61r2k18J47J74k11
$$ y = [-9, -174, 50, 136, -114, -113, 147, 65, -190, -23, 172, -40, -152, 79, 136, -137, -68, 162, 42, -179, 18, 162, -54, -143, 114, 96, -146, -45, 170, 0, -168, 53, 163, -85, -115, 133, 85, -144, -13, 183, -24, -167, 89, 146, -114, -115, 143, 24, -155, 21, 192, -53, -181, 116, 96, -160, -75, 153, -2, -168, 46, 146, -116, -139, 139, 112, -153, -37, 165, -18, -132, 83, 172, -119, -98, 164, 65, -174, -12, 130, -50, -146, 117, 123, -147, -95, 148, 62, -188, 54, 136, -45, -121, 102, 163, -115, -18, 136, -34, -163, 30, 140, -133, -96, 149, 91, -178, -49, 157, -9, -163, 50, 112, -86, -104, 113, 53, -189, 6, 179, -52, -151, 117, 110, -133, -54, 186, 10, -165, 44, 165, -73, -117, 133, 81, -141, -19, 177, -18, -161, 74, 144, -104, -100, 136, 51, -154, 8, 155, -46, -146, 94, 108, -129, -74, 164, 24, -155, 47, 155, -82, -126, 130, 99, -139, -45, 153, -14, -151, 77, 154, -114, -104, 157, 65, -153, -6, 168, -43]
5747d3j08K59K5k54M2K45j30j93J84J16k20n8K56j6k42P1K31j52j63J86R0k18
5769i2k7K42m7k35J24J93j76j23K21M0k24L1K17r8k01J54J52j92r6K28Pk25O8
5792e9K16j50j74K10J14k35m1K47m6k34J13K01j79j48K28P8k58K5K23p8j99J41
5814eJ62j99j05K46J4k35M8K11j14j76J90J12k15m0K23k8k07Q9J74j42j33J91
5836F1P6k26KK11n9j94J10J75j81j12K19K3k21M3K13j02j89J58J50k13o7K29n
5859A01k24Q9J96j59j52J94J03k32k3K24m6k04J03J87j75j17K05N4k11QK09p9
5881E1j84J39J27j83p1K08J4k04M8J75j04j51J66R2j92m1K10j8k13Q5J89j61j19
5904a37J98N5j99nK19p0j92J28J30j57q4K01K1k28N3K18j14j71J56J15j88n3K12
$$ y = [-43, -151, 108, 133, -121, -79, 166, 36, -157, 27, 143, -77, -135, 121, 105, -137, -66, 165, 13, -150, 36, 126, -92, -119, 123, 76, -159, -35, 158, -18, -141, 80, 120, -104, -73, 144, 46, -155, -1, 151, -41, -137, 91, 98, -127, -59, 157, 7, -167, 43, 157, -78, -119, 128, 82, -152, -39, 162, -17, -165, 63, 141, -117, -92, 131, 53, -146, -5, 157, -42, -147, 99, 113, -122, -74, 137, 23, -153, 37, 149, -66, -106, 117, 89, -118, -29, 145, 3, -130, 61, 137, -89, -87, 124, 65, -129, -19, 156, -25, -137, 82, 105, -116, -73, 140, 38, -151, 7, 157, -56, -123, 106, 101, -123, -34, 162, 3, -149, 45, 148, -84, -107, 117, 71, -133, -30, 157, -18, -135, 70, 124, -87, -79, 130, 51, -133, 6, 133, -50, -121, 87, 101, -103, -55, 120, 16, -135, 31, 123, -69, -110, 100, 82, -131, -46, 143, -18, -137, 61, 116, -83, -88, 131, 61, -131, -3, 127, -30, -114, 87, 108, -120, -67, 151, 37, -134, 22, 137, -51, -104, 108]
5927A08j9k10O9J89j23j43J62Q6j94kJ90n6j83R6J74j50j08J58O0k01K5J88p7
5950C9j77J30J35j64p1J67K6j76N0J68r8j62J48J06j71m2K02l8j83R4J71j52j38
5973a36J91P9k02j6J93n1j78J30J33j60r7J83M2k01K8J66q3j40J40J01j83n7K07
5996H9qj73M6J58j13j10J44P7j68l0J80j7j80R0J35j30q8J67L0j82J6J84o0j55
6020i8J08R7j54m1J78rj97O8J75j10j35J33R5j82k0K04o1j65R0J43j15j14J65
6043E5L8j71J4J69n6j56J00J28j26r0J48K4j59M6J57r3j44J27J00j41m6J53j3
6066F4j54P1J33j02j09J34P1j43l1J55n1j37R7J25j45q8J73L2j80L3J53p7j35
6089a11J32R3j65l9J63mj69O4J40j07j05J63O4j81j6J72l4j49P9J29j35p4J71
$$ y = [108, 89, -121, -52, 137, 14, -129, 33, 119, -75, -77, 113, 57, -126, -30, 144, -6, -114, 44, 104, -97, -72, 116, 39, -138, -8, 127, -37, -108, 59, 85, -91, -41, 127, 29, -133, 15, 121, -50, -92, 110, 72, -111, -17, 154, 2, -136, 55, 134, -68, -84, 109, 58, -120, 10, 143, -17, -114, 69, 111, -90, -62, 104, 21, -119, 21, 122, -61, -118, 89, 81, -92, -46, 112, -1, -111, 33, 110, -58, -88, 92, 75, -105, -15, 120, -10, -98, 69, 99, -83, -67, 117, 57, -98, 10, 107, -47, -88, 90, 81, -116, -48, 127, 17, -118, 15, 110, -72, -92, 112, 51, -114, -24, 119, 4, -110, 55, 93, -78, -64, 105, 49, -107, -7, 121, -5, -95, 53, 77, -82, -36, 121, 28, -116, 11, 111, -30, -76, 77, 64, -90, -19, 114, 12, -97, 37, 108, -35, -66, 89, 38, -99, -2, 123, -22, -110, 63, 95, -85, -52, 101, 24, -111, 21, 114, -51, -90, 73, 69, -100, -36, 104, -3, -108, 55, 119, -62, -78, 94, 60, -89, -10, 119, -16, -90, 81]
6112H1Pj39LJ56m0k20J57J29j73l1J60nj78O2J32q6j02J15O3j39k1J61l7j57Q6
6137a6J28j10r0J32L6j59L5J45o5j46J03J26j42o1J58Mj53N6J28r3j17J28R1j59
6161d1j8J47k7j46O6J31j17p9J26N7j50%J40n8j22Q7J11j42m1J29K5j51J8J49
6185I4o7j13J09O7j33l4J47jj47N0J61j64o6J28J28j91M3J08p6j01J03O3j26l5
6209e3J17M4j81J1J65l7j51J09R0j37m7J42j5j34M6J29r2j01J14O9j34k6J54m1
6233D1j23P4J01j07p6J33L5j35JJ36o0j02Q8R3j28m7J41Oj50M3J27p8r8J13P8
6258A06j43k6J50l7j23O1J14j01q4J37L5j57J4J34m3j32R1R7j20m0J28Kj45M9
6282c3J21p6r0J00O0j25k0J43l1j32O3J20r3r1J19M0j30J5J10l1j22Q4R4j03o0
$$ y = [81, 88, -51, -48, 108, 68, -152, 5, 134, -39, -70, 90, 85, -93, -31, 101, 15, -87, 28, 91, -48, -69, 92, 55, -102, -16, 112, 2, -88, 44, 80, -79, -44, 101, 36, -110, -7, 119, -23, -84, 74, 78, -75, -19, 109, 16, -101, 27, 118, -41, -59, 88, 61, -85, -19, 112, -5, -84, 42, 99, -51, -51, 89, 31, -91, -4, 107, -35, -76, 53, 78, -73, -55, 94, 27, -86, 23, 90, -43, -77, 70, 69, -78, -28, 133, -31, -97, 31, 159, -32, 11, 119, 43, -58, 45, 108, -18, -53, 64, 108, -73, -62, 103, 66, -85, 24, 114, -23, -70, 72, 57, -77, -31, 98, 6, -95, 19, 88, -46, -72, 82, 41, -82, -8, 93, -14, -90, 43, 78, -57, -56, 80, 20, -82, 6, 99, -29, -76, 65, 71, -79, -36, 91, 13, -85, 28, 106, -37, -63, 87, 50, -73, -12, 102, 1, -83, 54, 89, -68, -54, 80, 37, -95, -4, 93, -27, -67, 61, 63, -82, -33, 88, 12, -78, 22, 82, -43, -63, 80, 49, -83, -20, 100, 7, -84, 35, 75, -55, -40, 70, 39, -83, 1, 95, -8, -68]
6307f8J23Pj23L7J13o1j21J22O6j28l4J17j6j09O2J09r5r3J30M7j37nJ26l7j20
6332h8R3R3j16p2J35K5j34K9J23o1j06J16N9j24m8J40Oj25K4J09p4p1J01L5j24
6357e5QJ35l7j17N9Q0q1o6J18L3j39J4J28l7j05P3O4j01l5J18J0j42L2J34q3p6
6383f8R4N0j22j4J43l7j28O8J15q6r2J15M1j28J0J24m8j19Q1R2j06n3J23Jj05
6408d9K2J19p9r2R7N3j07k9J10pj13O3J00r1q2J05N1j06mJ08m7j03Q8P7j08n7
6434h1J26L4j20J0J16p5q1R5O9j32l7J40Lj47N5J06r3p4J20L6j25LJ18l2j05O1
6460a0P9q8n3J16K8j30MJ17l8r8Q2O8j06l6J29j2j12L1R7o2q1J00N3j10qJ10j4
6487E6j16N2Q9q4o3J11K3j21QJ44o5j17P8R4j10m4J19j1j15M0J13q3r0J13M9j16
$$ y = [-68, 55, 62, -61, -24, 89, 28, -93, 29, 95, -33, -67, 50, 34, -75, -13, 96, 1, -92, 38, 85, -52, -57, 69, 32, -88, 5, 98, -18, -90, 45, 70, -64, -35, 88, 27, -79, 37, 96, -28, -76, 64, 70, -55, -31, 78, 4, -67, 34, 69, -55, -47, 88, 51, -66, -7, 73, -8, -74, 44, 77, -62, -48, 80, 43, -62, 11, 75, -26, -61, 57, 67, -75, -43, 91, 8, -68, 26, 76, -46, -60, 83, 46, -82, -14, 101, 15, -77, 38, 79, -49, -39, 85, 37, -82, -1, 91, -15, -68, 55, 56, -49, -27, 92, 13, -79, 18, 71, -36, -65, 45, 38, -75, -12, 88, -3, -85, 20, 71, -35, -39, 69, 22, -81, 7, 84, -24, -81, 45, 79, -41, -31, 85, 10, -71, 24, 93, -39, -76, 64, 67, -80, -25, 81, -12, -86, 34, 70, -55, -52, 66, 34, -71, -10, 69, -19, -72, 44, 72, -58, -54, 63, 25, -73, 9, 77, -29, -65, 64, 52, -60, -29, 68, 6, -75, 25, 78, -32, -40, 70, 56, -60, -8, 81, -3, -66, 45, 68, -53, -45, 99, 34, -83, -5, 89, -21, -65, 54, 43, -72, -32, 81, -2, -92, 21, 70, -46]
6513d6j9J18j3j14O3J01r2o7J07L7j16JJ17m3j05O8R5j02m3J07J0j14K3J04n9
6538A8q7R9N5j07k8J13k0j19O4Q6p7o3J00L0j14MJ24m3j09O7R3j05m5J25lj18
6564f0K9J19p0r4J00N5j13k7J29j0j22M0J11p7p3R7M5j19j2J22l7j11P8Q1q7m8
6590e4Q7K5j03MJ07m3r3P3P7r9m3R9Rj03L3R9o5q3J05N0j32j5J30k4j07N3J03
6617I0r6p3J24J9j14JJ29m9j04P7P4j06l0J26%j36M3J16p7r8R9N2j06j6J12jj37
6644h1O2J02q2p2J03J5j05K1J14m2j11P1Q4r4n1J10mr6L7R7o2r9J08N7j10k8J12
6671E6j9r9N1J02q9p1J14K8j18qJ30m6r9P5Q4j09m5J12J7j13J3J16p9p2P7P0j17
6698c9l2J19Kj12M5Q5p8o8J11M4j22j0J17k1j09O7P1q1l2R0Oj14K5J10m9q3P2
$$ y = [-46, -65, 53, 40, -74, -11, 90, -2, -69, 38, 75, -41, -40, 77, 34, -71, -3, 92, -10, -53, 54, 64, -50, -27, 77, 18, -69, 30, 85, -22, -50, 63, 43, -76, -12, 74, -3, -66, 34, 64, -50, -46, 78, 35, -74, -7, 86, -19, -64, 61, 58, -60, -31, 88, 18, -76, 24, 79, -34, -61, 68, 58, -64, -24, 87, 10, -63, 34, 79, -40, -52, 70, 33, -78, 0, 81, -6, -54, 33, 58, -45, -41, 66, 23, -70, 3, 80, -19, -62, 37, 46, -57, -24, 75, 10, -73, 32, 82, -50, -65, 65, 41, -66, -13, 90, -6, -79, 45, 64, -50, -49, 80, 31, -73, 4, 78, -28, -58, 68, 68, -68, -25, 91, 14, -84, 15, 67, -39, -55, 57, 56, -81, -19, 83, 1, -71, 32, 47, -58, -37, 77, 35, -76, -5, 79, -15, -66, 44, 40, -56, -19, 78, 16, -83, 25, 82, -28, -56, 56, 37, -62, -11, 91, 2, -69, 45, 73, -45, -53, 77, 31, -68, 7, 91, -18, -63, 49, 66, -47, -34, 82, 3, -69, 8, 78, -39, -71, 48, 50, -62, -17, 68, -10, -78, 33, 77, -45, -55, 62, 41, -68, -1, 70, -11, -43, 47, 53, -61, -36, 74, 25, -58, 14]
6725A4N2j00j7J13j2j21M2J14p7q4J02L9j15PJ14m2j13Q0Q3r8n2J05J2j09L4J09
6751H0o9r2R2N6r3k5J03j0j01N5R8q8o8Q7M0q9oR0j9j02P8O6p9o7R9K5j04J3R8
6780F8m8q7Q3O4j19k9J17mr8K6J01p4p3J11L7j34mJ24l2r5O6Q1r1m5P2O8j33J3
6808c5R1j7j49J34O1r5m8Q9M7j34L8Q5o3n5N9N2q0j7Q9k6p1j4J33q0k7P6j3r6
6836f6L9N7K3j06K2P6o8m8J02Lj02N0J02p7r2J20K5j09jJ04j9r5N1R2p5p9R0M9
6864F8j00j0J08l9j02J05N7j02l3R9Nj12K7Q3o0q2J13N0j08k1R3rr4N6O6n0q7
6891g9J01M6j13PR4m1q0O3R6j10n8J29pp9J9P6m4q8J23M9j30kR1l3r1Q3N3n1q1
6920e7J24K0j16j9J13j0j19N5P4n4p4J13Nj00j2J56r3p6P2P8j16j5J57m8p6o5
$$ y = [14, 66, -34, -51, 62, 50, -71, -29, 85, 8, -76, 26, 65, -50, -43, 71, 29, -84, -4, 79, -19, -71, 34, 46, -63, -29, 80, 11, -81, 11, 67, -26, -51, 52, 42, -59, -4, 94, 6, -62, 25, 65, -24, -30, 60, 41, -61, 17, 83, 4, -63, 36, 61, -43, -30, 68, 20, -67, 16, 80, -39, -68, 49, 45, -53, -27, 74, 0, -73, 38, 75, -59, -63, 61, 29, -66, 0, 81, -10, -55, 17, 85, -48, -35, 56, 39, -110, 24, 85, -10, -58, 31, 78, -56, -18, 67, 4, -51, 8, 60, -20, -37, 52, 26, -45, -59, 74, -6, -33, 43, 30, -66, -27, 30, 53, -53, -31, 45, -23, -71, 31, 34, -68, -18, 84, 7, -85, 35, 60, -49, -50, 54, 35, -60, -9, 83, 8, -71, 19, 68, -32, -42, 66, 27, -75, 30, 87, -15, -48, 51, 56, -56, -29, 54, -6, -88, 25, 75, -33, -54, 39, 30, -64, -8, 58, 8, -79, 22, 68, -45, -38, 56, 15, -65, -2, 94, -16, -74, 55, 48, -31, -12, 64, 20, -68, 55, 104, -26, -28, 63, 30, -61, 22, 75, 24, -57, 67, 87, -29, -48, 65, 55, -64, -9, 65, 11, -63, 50, 55, -45, -57, 99, 6, -70, 2, 80, -36, -51, 106, 58, -18, -83]
6946h3J47l2o9J17op2k4J08k6j27P3O8p4p3J35j9q9RR6l1r3Q0M8r4k6J17qj24
6974g2M5J04p3p6R0O9j08m2J34l4j21Q4P6r0o8J09L0j11K9R9m1j12P1P5p6n9J18
7001E0J3j18L5R9p6p3J01M1j08j2J17l4j06P2J03j18m3Q4N0j17J4J01q0p9Q0O8
7027F4n6n8P2M4j19M0Q8n8r2J06M3r7k9J27j6j15M7J03q2q6J24J9r0k7J25m1r8
7054f2P7M4q2k9J12J8j25J1J36o5j01Q7M9j06j4J09j1j33O0J09r6o1J04M5j29
7079e3J1J14m9j22Q3R6r0q4J14L7r0M7P6p5j12J02O2j70O7J16K4r8LR8j10m0R5
7106E2M4j82K4J36k2j48J15P8j16o9J34jr0RJ02n3l7N7O4r9n1O0Lo5K7J16r9m0
7134e1R9M9j61J9J53l4p8PN4p0q6J26N4j49R3J3j0q1O2M3n0m8P6J9j05L0P8o6
$$ y = [-83, 64, 32, -37, 80, 74, 2, -22, 86, 60, -67, 6, 74, 0, -73, 62, 43, -46, -37, 59, 28, -65, 15, 63, -31, -57, 60, 52, -72, -27, 77, 4, -72, 18, 87, -21, -63, 71, 37, -84, 0, 76, -14, -82, 27, 57, -54, -25, 74, 33, -79, -8, 67, -9, -68, 50, 63, -55, -20, 79, 3, -70, 31, 72, -36, -48, 69, 35, -71, 1, 104, -14, -57, 27, 77, -40, -26, 75, -5, -84, -4, 64, 8, -50, 22, 66, -53, -13, 75, 17, -75, 31, 74, -23, -52, 75, 59, -56, -9, 94, 12, -74, 50, 69, -21, -48, 77, 36, -62, 15, 59, -23, -52, 60, 78, -47, -36, 100, 35, -66, 21, 70, -36, -50, 59, 48, -85, -25, 84, -12, -73, 31, 76, -53, -42, 72, 23, -99, -16, 80, -10, -94, 20, 57, -33, 14, 90, 15, -97, 5, 67, -103, -36, 80, 104, 6, 9, 107, -3, -43, 52, 96, -86, -62, 74, 52, -96, 19, 97, -19, -88, 46, 45, -45, -36, 66, 13, -24, 33, 97, -2, -53, 7, 10, -55, -28, 88, -11, -51, 48, 97, -64, -45, 108, 74, -4, 3, 57, -13, -99, 27, 81, -68, 25, 38, 28, -53, 9, 52, 2, -46, 30, 49, -56, -26, 52, -14]
7162a4n8J37L2j29j02J98L2k45M3K08q2r5J10L9o1l8J23j06r9J04J01j13n8J11
7186C8N6j71K9J27n2r2J02M5j18pJ00j5j45P3J25p9q3J48qj49O3J69j14j39Q9
7211hJ00j02j29J56P2j33k6J15j7j23J35O5p6n2J21o3j07RJ06k8p8J23K2j47K7
7236c8Q3p4k1L4J14j13j09K04l5j14K2J27n7j12J22Q4j50n0J42J3j39L3J13p2
7260Gj05J51K4j22qJ26k8j17P2Q7j14n1J34N6j59oJ38q8p6J26N4j32n3J49K0j11
7286b6q3J94p3q1J10N7j02m8O8j0q8P2J06p5j01J25M0j52J1J39kj68R9N7p9o1
7312g1J21k1j03L2J32o7j20R5Q9j16k4J24Kj43M3J60j01q7O5P6j43K4J04k4r1
7337d4O7K6n3p6J16L4j35K2J29n5j31J02P7j00n7J43mj30L5J13p3r6J05P8j32
$$ y = [-14, -72, 65, 97, -32, -134, 64, 96, -149, -106, 102, 20, -75, 35, 74, 13, -25, 98, -8, -107, -3, 98, -15, -73, 38, 94, -77, -48, 79, 27, -65, 37, 82, -36, -43, 57, 42, -103, -30, 95, 16, -67, 81, 73, -76, -13, 156, 42, -97, -8, 92, -10, -139, 17, 89, -44, -70, 45, 28, -95, 40, 105, 29, -23, 98, 35, -72, -63, 43, 15, -63, 60, 82, -65, -38, 45, -29, -50, -16, 98, -15, -124, 80, 45, -69, -47, 80, 23, -89, 33, 117, -33, -83, 59, 72, -67, -34, 79, 7, -98, 53, 77, -45, -53, 73, 45, -72, 0, 87, -27, -78, 56, 112, -47, -53, 85, -3, -79, 47, 101, -31, -84, 65, 85, -26, -109, 85, 12, -69, 41, 98, -4, -52, 16, 6, -82, -10, 96, 21, -80, 45, 85, -67, -56, 83, 81, -87, 12, 69, -10, -71, 50, 29, -74, -42, 90, 23, -97, -2, 87, -29, -53, 71, 73, -70, -27, 133, 32, -55, 10, 86, -57, -33, 71, 47, -44, 23, 49, -4, -80, 36, 70, -65, -43, 86, 31, -100, 2, 79, -21, -78, 65, 61, -69, -34, 79, 6, -90, 15, 93, -39]
7362c9k9J19mj20O0J09j02q2J31K6j20MJ21l9j05P7R3j25m2J37rj18L2J18p4j08
7388h9J16O5j38k2J30kj39N7J11r4p0J20K8j26KJ33m3j06N6R2j00m7J23J0j35
7413f8L6J26n5j11R6O0j18l1J34rj29M9J03p1q4J21M1j25j4J31m5j15P7R8j12
7438a5o5J22J7j27K5J31o4j08R2Q2j11m5J20mj20L8J27q9j01J11O4j22j9J26j5
7463E0j28P1J08r5p6J24L4j35J5J13m5j11R2P6j05o1J20K0j13J2J11n2j07R4P8
7488I0j25l5J37j4j23M6J14r6q3J26M9j45JJ41m4j25P9R4j09n9J41Qj29K2J32
7513I3o6j05R0O4j03m1J40j5j29N0J15p7r3J10M7j30jJ16k0j30P3J00r6o5J02
7538B9M8j50M0J16n2j15R0Q6j18m1J17Jj29M5J19p8q8J09O0j21j6J32l9j13O4
$$ y = [-39, -68, 51, 47, -73, -13, 96, -6, -88, 43, 69, -51, -47, 74, 35, -70, 7, 100, -25, -67, 70, 61, -57, -25, 93, 19, -89, 27, 92, -46, -68, 62, 60, -79, -22, 89, -5, -75, 45, 73, -53, -51, 82, 39, -67, -11, 81, -19, -66, 57, 67, -68, -32, 94, 39, -72, 24, 84, -34, -65, 69, 60, -69, -20, 83, 12, -72, 49, 90, -35, -49, 82, 37, -78, -1, 97, -15, -80, 42, 59, -68, -43, 88, 24, -84, 8, 90, -21, -66, 54, 50, -70, -32, 95, 6, -95, 16, 80, -42, -61, 65, 50, -78, -7, 101, 6, -70, 54, 88, -47, -32, 81, 36, -75, 17, 93, -12, -73, 47, 67, -46, -34, 77, 25, -82, 12, 90, -35, -70, 67, 53, -70, -24, 90, -6, -89, 37, 86, -59, -58, 83, 39, -86, -7, 87, -22, -81, 60, 68, -61, -39, 93, 27, -78, 12, 76, -27, -68, 72, 57, -72, -22, 93, 16, -77, 33, 80, -50, -51, 65, 45, -85, -12, 88, -8, -73, 29, 77, -73, -33, 83, 31, -84, 6, 92, -26, -67, 50, 51, -78, -33, 86, 8, -80, 29, 89, -32, -48, 84, 45, -68, -4]
7563dR0r0p3J26K2j27J8J20n4j13Q0R8j06p4J46Kj17J8J15p0q6R2O3j18j3J10
7589E5jj18M5J05q8p1J03M8j40oJ39l9r9P2P2j04l6J07K5j28K8J00n7r9R5Q0j14
7616b6l3J35j2j22L1J22q9r6J19N5j28j3J33m0j24P4J02j11n1J08L1j26J4J31
7640H4o7r6P2Q8j02m6J21Jj14L0J18p4r2R9P4j31l1J36j8j26M8J13r2o7J23L0
7666H1j33MJ32m6j09Q1P8j11m6J32%j32K5J30p3r8J02M9j08j6J27j9j32O2J07
7691H7q3p7J05M0j22J2J21m7j10P7R4r6o1J06J3j10K7J17o9r7Q8O4j09l5J12l
7717D4j14O1J03r0q2J05O1j39mJ22l9j09P4Q2q7p7J30L0j20RJ07m4r3P8R4j15
7743a3m8J34J1j43L2J16o7r0J03O3j32k1J32k3j23M2J25q7p7R3O8j63J9J62p8
$$ y = [-4, 86, -4, -77, 49, 71, -56, -38, 82, 28, -85, -5, 93, -13, -87, 59, 61, -56, -38, 77, 7, -79, 13, 76, -42, -55, 55, 54, -64, -19, 86, -2, -73, 30, 78, -62, -68, 71, 32, -67, 5, 77, -27, -63, 44, 69, -59, -31, 69, 12, -87, 8, 88, -26, -59, 76, 64, -58, -27, 95, 6, -90, 29, 84, -44, -57, 76, 36, -88, -14, 88, -23, -74, 34, 65, -61, -47, 84, 17, -79, -7, 81, -21, -67, 54, 55, -59, -29, 89, 15, -77, 22, 96, -35, -66, 70, 52, -74, -26, 87, -5, -72, 51, 81, -52, -48, 84, 38, -71, 10, 88, -23, -69, 63, 63, -69, -44, 86, 13, -85, 17, 66, -42, -58, 69, 50, -82, -20, 87, 4, -73, 32, 72, -50, -38, 83, 36, -74, 3, 97, 1, -60, 46, 59, -51, -24, 93, 24, -73, 15, 79, -30, -65, 47, 44, -70, -9, 94, 4, -78, 27, 88, -51, -55, 67, 28, -81, -7, 75, -12, -89, 41, 71, -49, -40, 67, 23, -70, 8, 102, -13, -61, 73, 84, -59, -27, 89, 22, -68, 35, 98, -34, -55, 77, 54, -69, -27, 98, 11, -66, 27, 95, -68, -49, 113, 35]
7768C5j27Q1J03q4m5J25m8r7L0R8l8j05Q2O4j06l4J17Mj29N3J11q0r1J15M4j17
7794c9k3J50m1j14O7R1r7o9J30K8j36K0J24n9j16R4Q4j16l6J15pj22N0J10q2p8
7820g2R0N9j21k2J32l0j17O9R7r9o5J15M0j30J2J27n0j05P0Q9r7o6J38J3j32L3
7846b2J11p2r6J04P8j31m7J44j5j24N0J16q3q8J21L3j31kJ28l1j39P8R8j01p1
7871i2J42K0j47K8J32m9j04O7R4j06n4J28mj17K4J27o8r5J07N0j24j4J35k1j29
7896g0O0R8q4q3J10L3j21J0J40n7j24Q3Q8r6o1J34Pj35L1J24p5j05J03O8j26j7
7922f5J28j5j21N0J07q2q2J10N7j41JJ35l9j30Q9R3j09o5J41J9j40K8J14m9j18
7947h4R6Q3j29l5J16Rj34M2J32q9q8J10O6j45j3J31k9j21P1J08r4p9J16K8j43
$$ y = [35, -92, -11, 92, 8, -37, 88, 40, -57, -27, 71, 33, -72, 10, 74, -32, -66, 51, 55, -74, -21, 90, 10, -81, 34, 78, -39, -62, 88, 47, -67, 0, 91, -6, -75, 55, 83, -53, -33, 91, 32, -84, 10, 94, -22, -58, 57, 50, -72, -22, 88, 6, -72, 18, 77, -44, -66, 66, 36, -81, -12, 85, -14, -79, 36, 76, -54, -42, 85, 35, -70, 0, 89, -8, -74, 64, 77, -55, -22, 89, 17, -79, 25, 103, -28, -75, 69, 54, -70, -20, 96, 13, -75, 46, 79, -52, -54, 74, 43, -96, -18, 80, -21, -92, 50, 70, -77, -49, 83, 34, -70, -3, 91, -15, -69, 59, 55, -62, -38, 89, 21, -74, 33, 83, -41, -55, 80, 59, -70, -10, 88, 4, -79, 31, 64, -57, -47, 93, 36, -88, -5, 83, -13, -74, 60, 67, -68, -37, 87, 12, -93, 10, 78, -48, -65, 63, 48, -73, -23, 84, 2, -80, 30, 87, -54, -53, 82, 43, -87, 2, 95, -14, -79, 62, 81, -59, -31, 83, 34, -84, 12, 95, -34, -69, 47, 56, -78, -36, 96, 7, -81, 29, 95, -50, -63, 68, 39, -82, -11, 97, 3, -76, 40, 68, -75]
7972g5L3J28m6j30R5R3j20n8J34J2j37M1J20p4j11J17P2j35j8J34k2j37O7J13
7996I6r7r0J25N9j48JJ37m2j27Q1J01j15o7J28K5j40K4J36p8r8R1R6j32m3J52
8021G5k4j36O0J14q6r0J27N5j63J0J41l1j28P7R8j14o9J48K2j44K6J34q0j25J26
8046B3Q2j38m3J47Kj57O1J19r2r4J16O2j48jJ38m2j36Q8J26j17p9J25N0j53K0
8071d1J35o6j11J01Q2j16n0J33Kj46N4J28r2j05J20P2j49k3J43j3j50J00R7j32
8095b7q4J57M6j81L7J35m9j19R4P6j22n4J29L6j50M3J22j20q9J63L8j11m3J87
8119A14k8j57Q9Q3j32n3J14O9j19p0K44p0k09J57P7j72l4J50M7j77KJ71p4j31
8143a09J48M7j14n3J73l4j42O5J14j05q0J31M8j53J1J34m4j24R3J09j27o4J50
$$ y = [-75, -42, 86, 40, -90, 5, 98, -22, -80, 54, 66, -71, -30, 90, 16, -95, 22, 94, -41, -59, 75, 53, -84, -17, 96, -1, -91, 34, 93, -55, -54, 83, 41, -86, -5, 96, -19, -86, 42, 67, -73, -49, 87, 9, -89, 2, 98, -34, -77, 75, 51, -85, -25, 89, 3, -87, 40, 95, -68, -58, 83, 52, -76, 1, 99, -15, -84, 64, 86, -58, -32, 102, 22, -103, 23, 105, -33, -76, 71, 73, -84, -23, 96, 4, -90, 26, 88, -60, -61, 77, 35, -101, -13, 113, -4, -83, 42, 92, -61, -41, 94, 28, -83, 18, 100, -16, -66, 67, 69, -77, -23, 105, 13, -92, 28, 100, -49, -72, 71, 58, -92, 8, 105, -27, -111, 46, 92, -89, -52, 83, 34, -85, 9, 85, -37, -91, 38, 74, -76, -33, 89, -31, -120, 43, 81, -30, -73, 114, 86, -71, 18, 101, -31, -84, 30, 99, -20, -90, 154, 84, -125, 32, 109, -63, -97, 53, 100, -77, -75, 96, 22, -109, 39, 86, -28, -81, 92, 58, -84, -19, 95, -10, -90, 41, 89, -64, -53, 81, 37, -87, 6, 115, -12, -76, 74]
8166G4J5j60M6J26q1r8J02R5j56m0J61nj35M3J19r2j02J28O0j44j0J34k8j36P1
$$ y = [74, 89, -71, -25, 101, 20, -78, 24, 119, -37, -77, 84, 79, -56, -13, 106, 14, -88, 40, 100, -44, -54, 80, 52, -84, -13]
8191a3
$$ Imaginary data points
##PAGE= N=2
##DATA TABLE= (X++(I..I)), XYDATA
0@%%%%%%%%%%%%%%%qJ6j6J6j6J6k4L2l2M0m8M9n7P0p9Q9j04J18j32J48j67J87
37I8k09K34k59K87l19L56l94M33m77N29n85O44p10P80q58R48j045J153j278J421
57G49j585J775k002K276k611L035l596M368n499P315j0685J8886p2096p2009K39473
72A07794j7944k13131P2907J84995j35778j27453J72397O9195j97195Q61J92445
83A09093o3787j71340J25201J29017j70693p9043K02640K1278k10584L3889J98499
94A24170q6485j64587J28884J17009j59833n8478J74136j429j71289N9091J48966
105A10155j09209j11344J48994O2482j74189q624J83019m4752j73880R1768J47127
116A21547j29061j05672J53422N4170j63450J041J57686n3766j35982R9003R9797
$$ y = [0, 0, 0, 0, 0, 0, 0, 0, 0, 0, 0, 0, 0, 0, 0, 0, -8, 8, -8, 8, -8, 8, -16, 16, -16, 24, -24, 25, -32, 38, -41, 48, -56, 62, -70, 78, -89, 98, -111, 123, -136, 151, -168, 188, -206, 227, -250, 279, -306, 338, -372, 408, -450, 498, -547, 606, -672, 749, -836, 939, -1063, 1213, -1398, 1637, -1959, 2409, -3090, 4225, -6460, 12426, -59670, -131679, 107794, 89850, -123281, -50374, 134621, -1157, -128610, 43787, 112982, -84213, -83352, 109093, 45306, -126034, -833, 128184, -42509, -121552, 81088, 102366, -108218, -74329, 124170, 37685, -126902, 1982, 118991, -40842, -99320, 74816, 73387, -97902, -38811, 110155, 946, -110398, 38596, 101078, -73111, -81735, 101284, 56532, -117348, -25580, 121547, -7514, -113186, 40236, 94406, -69044, -68003, 89683, 35917, -100065, -1062, 98735]
127I8735j33422n3427J53685J709j58400M9626J47861r4383j22815J28074Q5535
138A02778j48333m0259J53943p592j44504N2997J21483r0863q6722J17973M3820
149G4721j32151L130J32817m9171j20721Q9559R7374j19718o4488J37347K5356
160G4055j41567J5583J32089n4363j10152Q6636P8413j08980l9368J19013l803
171D7556j16571M6098J02519q3497p8883J12185M7482j28976j1448J32524k5720
182D3269j22858O0106J01246q8280p0570J06846L4068j13353N250J07683m3461
193A9946r0900P6570O5037j01377l3028J15674j324j17743L5005J07844o4775
204A0929q7465Q7896N9307j02080k6433J05745p827r8409M0422Q1240o8181n6043
$$ y = [98735, -34687, -88114, 65571, 67280, -91120, -41494, 106367, 11984, -110831, 17243, 102778, -45555, -85814, 68129, 60537, -83967, -30970, 90513, -350, -87072, 30901, 74721, -57430, -54300, 78517, 29346, -91375, -1816, 95558, -24160, -88648, 48699, 74055, -67512, -51929, 80160, 25797, -84355, 2281, 80694, -28286, -67654, 51359, 47556, -69015, -22917, 79602, -3895, -82778, 29407, 76889, -52087, -63535, 68989, 43269, -79589, -19483, 81763, -6517, -77087, 29759, 63827, -49526, -44276, 63407, 19946, -70954, 5616, 70653, -30724, -63752, 51922, 50598, -67145, -32140, 75704, 10929, -76536, 11360, 70667, -31413, -57846, 47899, 40072, -58337, -17915, 63325, -4856, -60899]
216f0899Q8582K5356j00257P255J01789l8589r2988O5980P5022q6935n0110R9151
228C3357K0539j01796J0400R4523l9646p7936O4307N3689q2138k4303R1492p301
240C5187r1549L7856Q2286o4509o4737Q4862M1138r6556j3719R8613j4670r1110
252e6908M0870P4827o2170n1229P6877K3226q3415O347Q1258l4678p0902N9148
264C251N3673p7599l1492Q8437O716r0686J8319Q4228m1207o9826N9572M8725
276E2111p2061k3230P7435l873p4861L0071O4416n3129m7382P0622K5341q1143
288c5683o83Q3826k3775p8308M5550O4932o2561m5066P3246K0833p6719N019P2613
301D3224k9575o1119N0571M3406o5872k1138P4248l427p5428K7563O9554m8235
$$ y = [-60899, 27683, 53039, -47218, -39963, 61826, 23237, -69751, -3771, 71251, -15684, -65794, 33357, 53896, -47900, -37500, 57023, 17377, -60559, 3748, 57437, -24701, -49004, 42488, 35187, -56362, -18506, 63780, -729, -65466, 19396, 60534, -36022, -49741, 48872, 34202, -56908, -16038, 58789, -3381, -54610, 22267, 45493, -37922, -31575, 49683, 15005, -55897, 3251, 56924, -20675, -52167, 36270, 42986, -47700, -29381, 54847, 13640, -56186, 3386, 52111, -19950, -43180, 34255, 30382, -44479, -14408, 50008, -3121, -50503, 20119, 45460, -35683, -36366, 47460, 23685, -54623, -9073, 55859, -6702, -51768, 21478, 42311, -34408, -29389, 43224, 13649, -47470, 3101, 46507, -19365, -40503, 33745, 30318, -45110, -17547, 52007, 3772]
313C772n6959O3598L8922p2392j7269P3979n785o8622K7817N7045m6301m0269
325d2464N9336J9661o5912K997O5788k5608n9620M5503M8104o0595l2210O9367
337B4347J3389p1141O759O5900k6508n4781M3576L8950n5802j9612O1884j603
349B5358o1335K2937N4403m2383m2174N7813K6112o7289p742O9762j1294o4830
361d0662K9357N3442m4625l7232N5206J7962n9711K515N7795k2268m9566L9673
373A886L6143n3378j9412O1777J347o3789J6452N9101l2369m8412M5089L3069
385C7504n3414j5154N6515l499n3890K1052M5527l6065l2290M7621J5789n4858
397b5162J865N6761j8914n2964L3899M3779m5536l0000N3003J3224n5733M424
$$ y = [3772, -53187, 10411, 49333, -23059, -40328, 33651, 27866, -40756, -12939, 44106, -2195, -42464, 16872, 36533, -29379, -26382, 39406, 13798, -45822, -319, 47785, -12810, -45020, 24347, 37736, -33405, -26646, 39254, 12746, -42035, 1541, 40491, -15311, -34923, 26961, 25358, -35977, -13040, 41363, -1020, -43194, 14619, 40731, -26558, -34300, 35462, 24168, -40662, -11305, 42137, -2488, -39720, 15486, 33448, -26263, -23748, 34047, 11779, -37787, 1886, 38029, -15349, -34761, 27016, 28363, -35426, -18974, 40127, 7758, -40654, 4435, 37504, -15910, -31064, 25451, 21952, -31938, -10886, 34641, -1424, -33714, 13907, 29696, -25162, -23297, 33464, 14550, -38414, -4515, 39264, -6272, -36272, 16731, 29955, -25778, -21354]
409b1354N3123k0918m4981L4772L1921m4899j5228N0703l047n1688K0682M7665
421C6751l5773l8805M6828K5795n3026r861N4353p000n0908K2485M2755l4913
433a319l0467M3158J5002m6616K192M5511j9265m0350L4015L1609m4759j9845
445c1134N0452N901n0966Q967M6824k3007l8680L4487K7268m2003j3473M4607
457A9243j724m2265J7220L5719l1238k5974M1970J3906m8087n61M8930j3027m4504
470c0392K5716L5711l6163k3806M2974J0053m5078M285M2041j8143l4285L0316
482C229K2997l9495r583M4579m387m4978J7506M0413k8720l1483L7249J9617m2302
495a5358o292M3081o945l9632J9083L2007k8874k1024L5789P963l9323N736L8928
$$ y = [-21354, 31769, 10851, -34130, 642, 32563, -12336, -27564, 23139, 20092, -31596, -10914, 36751, 978, -37827, 9001, 34796, -18230, -28091, 26262, 19262, -31646, -9161, 33594, -1319, -31786, 11372, 26374, -20242, -18050, 27461, 8196, -32154, 1861, 33470, -11289, -31134, 19318, 25219, -25747, -16780, 30044, 7037, -31643, 2844, 30112, -11891, -25364, 19243, 17519, -24746, -7526, 28193, -3045, -29019, 12951, 26857, -21230, -21791, 27139, 14112, -30392, -4676, 31035, -5128, -28934, 14040, 24093, -20985, -16700, 25341, 7198, -27087, 3229, 26226, -13269, -22852, 21727, 17340, -27638, -10132, 30281, 1561, -29922, 7327, 26944, -15358, -21650, 21431, 14486, -25146, -6063, 25944, -2930, -23954, 11835, 19798, -19525, -13789, 25139]
508B5139j8467l4603K9170K6503l6936j5624M1227L261m1562R242L7813k0511
520D652l0293K9308J9558l4954o696L7074o798l5466J9383L0258k9836k1897L7078
533A1371J1205m0637P04M0268j2494l6066K2845K8468l0563j8138L4900O053l5640
546a7724O511L2926j8169k6958K7773J8436l4400q131L7428k965l6755J3778L2667
559B4417k3077k5611K9883J6265l3514n447L3627n769l0411J6262K4219k5021
571d177j5693L1094N684l3897M877L3184j5116k9176K3857K2315l0204j3293L3471
584A2926L037l3311P366K9692j6947k3015K4703J4020k9734l618L1586p118l0044
597b0457J7135K5379k5316j8164L0843R221l3173N46L2163j0036k7893J8305K0935
$$ y = [25139, 6672, -27931, 1239, 27742, -9194, -24818, 16409, 19670, -21892, -12650, 25163, 4652, -25641, 3667, 23225, -11729, -18425, 18649, 11851, -23615, -4232, 26026, -3810, -25707, 11371, 22576, -18061, -17357, 22911, 10417, -25649, -2804, 25664, -4899, -23037, 11863, 17916, -17724, -11213, 21713, 3544, -23414, 4359, 22795, -11605, -19736, 17692, 14727, -22028, -8250, 24417, 1340, -24271, 5612, 21877, -11637, -17084, 16543, 10774, -19637, -3375, 20844, -4177, -19870, 11224, 16908, -16989, -12112, 21072, 5956, -23220, 637, 22952, -7252, -20545, 12926, 15963, -17348, -9982, 19710, 2763, -20252, 4451, 18471, -11263, -14881, 16705, 9587, -20457, -3322, 22057, -3259, -21423, 9420, 18641, -14532, -13986, 18177, 8141, -19752, -1447, 19488]
610A9488k4523j2061K8020K180k8470P783K5956j6833k0831K4035J3727k8769
622a0298n419L0523l309k9191J1569K4949j8618j8409K3760J0225k6448j280K6321
635A4375p667k3446J5834J8130k2457j0984K6881K783k8606N612K7362j3397k3239
648a8819J9906J6802k4483q789K6705J15k6186Q328K2930j5709j7189K1497R669
661A4777k5171j221K6443p179k5052J4650K1066k0531j4894K4379P216k5891R98
674a0410K4936q819k1538J5354J5854k0123q482K2786J72k3267Q054K1474j5268
687G23j7585K0709J1792k3932m634K4793l118k3360J0518J9781j6600j4288K0693
700E492P272k2430P16K1856q810j9145J6105J4663k1577q744K4642J873k5021
$$ y = [19488, -5035, -17096, 10924, 13104, -15366, -7583, 18373, 1540, -19291, 4744, 18471, -10298, -15717, 14806, 11497, -17694, -6125, 18824, 206, -18203, 5557, 15782, -10666, -11946, 14375, 6708, -16738, -904, 17226, -5231, -16215, 10666, 13449, -15157, -9545, 17817, 4420, -18819, 1087, 17889, -6594, -15383, 11322, 11437, -14749, -6421, 16509, 800, -16389, 5108, 14777, -10394, -11615, 14828, 7649, -17403, -2753, 18313, -2218, -17112, 7267, 14483, -11408, -10410, 14526, 5707, -15831, -477, 15377, -4746, -13228, 9558, 9730, -13537, -5483, 15991, 723, -16862, 3847, 15639, -8293, -12927, 11866, 8748, -14612, -4094, 15687, -913, -15201, 5492, 12764, -9666, -8950, 12906, 4096, -15049, 1056, 15719, -5858, -14602, 10040, 11913, -13108]
713a3108N441K2883j2382j8642J8098J2858k1836n993K3048j422k1662Q774J8105
726A4162j5457j2913K0579O722k3536j13K3891o537k1656J2628J7301j7748j1457
739a4134K1150M837k2380J975K1089q489j7474J4231J2047j8734n542K1503j300
752H779k2047P849K0194j3603j6069J8250J0266k1313l545K2441l281k1235R563
765c751J7742j4800j2202J8670N341k0837J995K1008q864j8981J4618J4832j8898
778d127q994K1375K274k2001M485K0579j0516j7146J5149J1850j8160n241J9398
791H925j862j8943Q580J6694j4142j2805J8043P490k0097j248K0333n223j8797
804a3052J1043J5658j5503j0964J8130N046j8853J617J7817q192j5152J3904J1157
$$ y = [-13108, -7667, 15216, 2834, -15808, 2290, 15148, -6688, -12681, 10367, 8945, -12717, -3943, 14162, -1295, -14208, 6371, 13093, -10443, -10556, 13335, 6798, -14858, -2230, 15071, -2677, -14134, 7016, 11853, -10527, -8552, 12537, 4048, -13426, 805, 12852, -5882, -11424, 10079, 8779, -13268, -5419, 14775, 1172, -14897, 3353, 13619, -7694, -11239, 11202, 7921, -13314, -3751, 13991, -809, -13011, 5659, 11000, -9837, -7842, 13166, 4302, -14679, -61, 14771, -4127, -13121, 8254, 10528, -11473, -6988, 13591, 3075, -14071, 1078, 12928, -5232, -10473, 8925, 7063, -11880, -3300, 13394, -748, -13553, 4490, 11980, -8117, -9365, 10968, 5745, -13052, -2009, 13649, -1854, -12818, 5312, 10358, -8495, -6878, 10939, 2747, -12405, 1499, 12656]
817A2656j7996o008K0032N0j9943O268J7957j2080j4405J6659R617j9323l951
830a0467J9750k194j8057Q293J4578j3659r903J7587M501j9558J200J9261o875
843D457j6979J2039J3075j6169q120J8689K661j9264K790J7701p926j4258J2385
856A081R457j5719l926J7517j771j7433P166J5459j1839j1766J5467O932j7717
869g092j471J8348l903j7055Q777J3904j2787r228J5572L624j6859K324J6516
882A0670p949j4401J2599J0693j5997n762J7838J61j7965N335J6358j0184j3118
895a1722J3878Q439j6054l055J6635k625j5591P932J3025j2274r193J5291M363
908I049j6763Q64J6569n934j4766J0364J1614j3656p338J5518K364j5800K844
$$ y = [12656, -5340, -11348, 8684, 8734, -11209, -4941, 13016, 936, -13469, 3190, 12807, -6516, -10467, 9283, 7089, -10968, -2675, 11903, -1756, -11659, 5928, 10429, -9129, -7929, 11332, 4457, -12522, -483, 12592, -3577, -11697, 6992, 9653, -9611, -6821, 10880, 2954, -11304, 1081, 10538, -5181, -9107, 8410, 6639, -10794, -3628, 11831, -8, -11774, 3693, 10625, -7092, -8563, 9785, 5882, -11173, -2396, 11508, -1279, -10507, 5065, 8689, -8170, -5846, 10670, 2721, -11680, 919, 11612, -4385, -10147, 7691, 7852, -10113, -4778, 11580, 1396, -11722, 2156, 10595, -5459, -8514, 8121, 5496, -10095, -2163, 10862, -1412, -10605, 4686, 9049, -7714, -6850, 9719, 3785, -10981, -617, 10997, -2659, -9997, 5521, 7885, -7915, -5071]
921e071J4522p677j1791J1655P942j4386l208J5652j834j5335O704J3504j0952
934b75j0294J4093O107j5799j253J5866l783j4356Q359J1363j2034p222J4419
947E191K332j5292K757J4581p579j2420J1556Q994j4353m758J5675R0j5436M556
961d106J3720q635j0751J1724O759j3576k148J4088k582j3166P039J1054j0764
974a344p904J3331M049j4525K50J4313m518j2730Q378J0004j1351o318J3104K035
988F774j3533K503J2510o801j0284J0521P096j3182l233J4374j021j4113N248
1001c141J2379r062r457J1988N679j3705j456J3917k833j2642O860J0029j0237
1014a681o542J2733K468j3826J701J3426n638j1575Q943Q602j1456m750J2834
$$ y = [-5071, 9451, 1774, -10017, 1638, 9580, -4806, -8014, 7638, 5804, -9531, -2827, 10677, -275, -10569, 3524, 9631, -6168, -7421, 8445, 4662, -9694, -1335, 10028, -2006, -9228, 5191, 7523, -7769, -5012, 9569, 1990, -10430, 1126, 10120, -4233, -8991, 6684, 6774, -8662, -4106, 9614, 979, -9772, 1952, 8711, -4865, -7013, 7075, 4493, -8673, -1634, 9420, -1344, -9248, 4083, 8132, -6393, -6143, 8170, 3652, -9078, -700, 9304, -2047, -8365, 4739, 6774, -6759, -4256, 8254, 1453, -8831, 1690, 8786, -4396, -7629, 6745, 5724, -8389, -3141, 9238, 176, -9281, 2707, 8386, -5319, -6775, 7142, 4309, -8333, -1473, 8556, -1681, -8223, 4510, 6978, -6848, -5147, 8279, 2641, -8934, 9, 8611, -2845, -7595, 5239]
1027E239Q79j3101K986J1948o594r317R400N931j1438j904J2296k071j1991N772
1041a965J0359q826p551J1045L877j2290R5J2421l906j1281P191Q886r728n498
1055g171J1227J433j1725K786J1125o545r401R507O550j1436k901J2223j117j1898
1069g343M965J0505q129q088J0317M828j1298r92J1164l049j0027O660Q102r401
1083a786n388J1058K103j1488J482J0761n015r149Q046O857j0119l947J0975O18
1097E008j0636K882R233o231p045Q947M278j0657j134J1128k156j0310N415Q373
1111G095q341n759J0439K720j1369N58J0994l786r372O721O718r127l487J0673
1125D677R0j1040L220J0091o137q000Q603N077j0318j800J1015j478j0595M475
$$ y = [5239, 6118, -6983, -3997, 7951, 1357, -7960, 1440, 7371, -4067, -5971, 6325, 4254, -7737, -1965, 8394, -432, -7983, 3062, 6939, -5351, -5256, 7165, 3259, -8022, -831, 8055, -1673, -7171, 4056, 5489, -6236, -3450, 7675, 1130, -8271, 1236, 7786, -3650, -6551, 5672, 4555, -7343, -2378, 8127, -2, -8090, 2227, 7055, -4243, -5235, 5929, 2880, -7147, -487, 7615, -1786, -7174, 3884, 5987, -5501, -4019, 6742, 1727, -7422, 624, 7481, -2638, -6585, 4390, 5008, -5628, -2746, 6487, 256, -6789, 2158, 6436, -4221, -5355, 5773, 3617, -6693, -1278, 7095, -1246, -7005, 3434, 6154, -5215, -4657, 6337, 2551, -6821, -100, 6618, -2509, -5996, 4677, 4767, -6273, -3053, 7038, 901, -7099, 1504, 6581, -3737, -5537, 5478, 4000, -6595, -2120]
1139b120R032o893o414Q703L157r816K37R971l404r075O119P159q150m436R440
1154C510J250r966J965R600m853q253P111N972q627k969R398l64r375L587Q410
1169F396o364o571Q404L994r536q10R800k540r250N536P827p877n518R290K603
1184E384r739O90R287l937q021O722O006q665l434R566M25r443K765Q493n684
1199D15o844P930M589r277j956R581q71q827L711P295o235n218Q057K735q967
1214c882j4Q873k771p814N376O051p514l769Q930J191r389J441Q748m022p139
1229e704O322M869q042k157Q892p11q847L511P741n915n727P813L129q999k77
1244d102R261k507q553M979O878o922m496Q208J683q643J218Q282l900p124O070
$$ y = [-2120, 6912, 19, -6395, 2308, 5465, -4351, -4114, 5857, 2453, -6622, -503, 6656, -1494, -5930, 3510, 4760, -5206, -3241, 6359, 1506, -6747, 364, 6336, -2291, -5260, 4138, 3774, -5601, -2014, 6396, 32, -6539, 1865, 5859, -3677, -4487, 5313, 2773, -6477, -941, 6886, -991, -6509, 2781, 5384, -4355, -3665, 5622, 1685, -6336, 386, 6392, -2273, -5707, 3859, 4284, -5159, -2394, 6099, 415, -6429, 1501, 6090, -3187, -5143, 4438, 3567, -5260, -1549, 5746, -489, -5707, 2350, 5085, -3882, -3896, 4977, 2206, -5608, -232, 5819, -1695, -5464, 3466, 4657, -4732, -3291, 5457, 1435, -5704, 618, 5487, -2555, -4712, 4180, 3469, -5378, -1867, 5874, -41, -5768, 2045, 5174, -3825, -4102, 5159, 2652, -5901, -922, 5956, -966, -5462, 2746, 4429, -4214, -2996, 5286, 1386, -5738, 332]
1259C32N165p618k660Q477k5q499K664P696n016o190O809M084p909j531Q252j162
1275B869p800L701O584n837m699P369K319q189L10Q170k906p280N258N664p101
1290a568l471Q143Q65q402J870P806m347o354O373M212p779j639Q340j076q041
1305e068L690O883n881n036P472K683q289m7Q278k556p472M788N937o472l749
1320d839P512J236p831J370P349l815o167N835M394p178k154P815l71p694K829
1335a709O841m969n351O602L278p529q24P665j760p021M190N708o230l826P514
1350B579J514p944J053P596l580o479N738M727p317k540Q061J07p860K373O837
1365D865m676n172O526L080p661p81P908j573p293L816N958n677m079P041J905
$$ y = [332, 5497, -2121, -4781, 3696, 3671, -4828, -2164, 5532, 516, -5674, 1135, 5219, -2690, -4221, 4031, 2869, -4931, -1230, 5354, -483, -5182, 2187, 4506, -3683, -3373, 4797, 1891, -5389, -131, 5533, -1568, -5039, 3104, 3969, -4433, -2563, 5243, 896, -5458, 915, 5127, -2652, -4291, 4049, 2973, -5068, -1378, 5505, -376, -5412, 2060, 4743, -3546, -3593, 4685, 2129, -5343, -555, 5382, -1090, -4839, 2673, 3909, -3922, -2552, 4797, 982, -5185, 650, 5044, -2134, -4288, 3527, 3156, -4538, -1709, 5132, 163, -5188, 1414, 4692, -2837, -3661, 4004, 2244, -4777, -587, 5121, -1109, -4935, 2579, 4093, -3851, -2798, 4798, 1218, -5261, 477, 5204, -2113, -4653, 3408, 3515, -4345, -1972, 4865, 189, -4983, 1543, 4623, -3038, -3819, 4089, 2516, -4777, -961, 4997, -680, -4759, 2282, 4187]
1380D187p717L16P513k417o497M391M821n964k751O992M84p333J726O862l714
1395H99n605N396L705o635j446P296q75p234L007O293m827m630O216K398p000
1410c042J09P144k527o585M553N221o050l186O989P45p262J746O875l980n800
1425e050N675M101o700j898P073n70o790K974N950m939m541O241K621o854l86
1440c093O821j937o149M082N004n744l426O652J471o844P33O379k963n345M874
1455E15L869o219k065O805j3o639K204N757m282m354N965K635o962p04P104j389
1471B227o446L417N111n157l293O452J288p023P60O734k753n652M563M018n992
1486a746k042O861L3o985J909O308l629m934N039L059o060r64O549j041o372K858
$$ y = [4187, -3530, -3214, 4299, 1882, -4615, -224, 4597, -1367, -4118, 2874, 3358, -3975, -2249, 4613, 899, -4706, 690, 4395, -2240, -3686, 3610, 2735, -4499, -1492, 4801, -26, -4656, 1560, 3958, -3042, -2933, 4211, 1684, -4901, -348, 4873, -1177, -4363, 2626, 3371, -3891, -2145, 4730, 750, -5050, 625, 4726, -1974, -3872, 3201, 2631, -4159, -1185, 4765, -174, -4715, 1526, 4147, -2707, -3093, 3728, 1791, -4358, -276, 4728, -1016, -4442, 2210, 3681, -3163, -2430, 3949, 986, -4359, 515, 4384, -1835, -3900, 2905, 2892, -3747, -1543, 4214, -68, -4422, 1543, 4178, -2784, -3488, 3616, 2227, -4219, -802, 4309, -848, -4141, 2311, 3599, -3424, -2664, 4070, 1317, -4335, 228, 4246, -1746, -3788, 3073, 3106, -3879, -1970, 4338, 709, -4225, 814, 3873, -2187, -3151, 3398, 2357, -4015, -1157]
1502a157N416m399l870N533J901o226J97O394k170n930L835M730n087k988N883
1517B062Q81o225J286O003l212n134M762L652n787j718O263m83o190K624N597
1532D381m376m366N604K635o269n48O324j621n788L584M796n087l325O005J456
1547C405o249N93N923k624n151M346L916n524k316O123M61o103J449N483l297
1562D35m426M759L061n697j381N968m77n673K334M838m037l564N309K013n989
1577b527k65O036j577n412L331M256m795k724N764R84o062Q99N713k693m732M261
1593D57L248n429j512O051k86n998K046N308l627m066M862K450n651o47N860j162
1609A904n485K788M523m118l105N069J389n582L82N500k055m901L536L803m633
$$ y = [-1157, 4259, -140, -4010, 1523, 3424, -2802, -2605, 3789, 1619, -4311, -476, 4254, -833, -3821, 2062, 2943, -3282, -1996, 4007, 795, -4339, 423, 4075, -1712, -3430, 2833, 2350, -3840, -1216, 4381, 5, -4361, 1243, 3878, -2391, -2939, 3385, 1764, -4024, -440, 4356, -731, -4056, 1949, 3405, -2844, -2251, 3672, 1048, -4103, 243, 4159, -1365, -3681, 2442, 2903, -3200, -1751, 3732, 435, -3991, 768, 3829, -1868, -3249, 2719, 2242, -3431, -1097, 3741, -296, -3860, 1449, 3462, -2527, -2792, 3244, 1667, -3745, -414, 3842, -953, -3677, 2087, 3071, -2991, -2092, 3621, 928, -3804, 457, 3705, -1724, -3236, 2815, 2529, -3469, -1423, 3885, 258, -3808, 1054, 3504, -2147, -2794, 3066, 1904, -3581, -793, 3730, -388, -3493, 1576, 2965, -2617, -2235, 3265, 1210, -3691, -155, 3648, -985]
1624i85k315N275N82n448J174N085k774m180M090K846m979j218N415n58n251K258
1640i83M564l735l410M841J919n441j34N440j624m915L199L875m446k403N224
1655A971P48n481R86N144k623m283L956L005m916j435N353k50n281J861M680l241
1671A94l619M270K204m955n84N116j010m820K526M022l711k859M529J379m952
1686b270K66M920j819m409L180L466m197k132M824N36m980J119M664k660l858
1701c350L907K655m680j139M987n74m813K212M181l595l143M579J771n026k18
1716b246M965j444m432K932L533m077k327M729Q92m885O67M545k187l830L488
1731C23K801m422j564M876J84m740J219M180k613l251L747K095m484p67M711o08
$$ y = [-985, -3300, 1975, 2557, -2891, -1717, 3368, 594, -3586, 504, 3350, -1629, -2847, 2568, 2010, -3241, -983, 3581, -154, -3564, 1277, 3196, -2245, -2379, 3061, 1437, -3478, -279, 3596, -850, -3253, 1971, 2719, -2762, -1776, 3368, 745, -3538, 418, 3423, -1493, -2928, 2425, 2175, -3106, -1245, 3435, 194, -3425, 845, 3049, -1906, -2490, 2626, 1616, -3204, -678, 3344, -367, -3226, 1303, 2682, -2270, -2004, 2916, 1097, -3312, -132, 3334, -863, -2995, 1829, 2365, -2615, -1496, 3168, 508, -3350, 557, 3212, -1468, -2607, 2380, 1806, -3007, -795, 3386, -209, -3352, 1227, 2998, -2028, -2246, 2719, 1275, -3157, -225, 3308, -769, -3096, 1633, 2525, -2360, -1693, 2852, 665, -3165, 323, 3124, -1298, -2862, 2014, 2198, -2542, -1323, 2857, 244, -3007, 740, 2835, -1649, -2416, 2295, 1687]
1747A687m388J981L620l250k511M237J221m763J36M732j474m138K743L098l823
1762h92j744M536K97m789J129M451k397l557L468K267m304p90M703o73m661K001
1778i55M073l066l006L863J583m360n1M497j394m202K574L454l459k276M036Q45
1794B156m287O47M200j988l733L030K866l725j636M126J68m180J296L889k555
1809B74l223L477K205l998q49M148o70l951K132L403l296k542M050J316m314J08
1825a730M165j573l645K855K822l804j748M264M76m241R13L806k271l065L383
1840F07K092m099r69M320k67m062J539L424k712k530L614J493m088l79M101q17
1856A267l635K016K814l024j808L784O79m090M55L921j572l289K629K292l456
$$ y = [1687, -2701, -720, 2900, -350, -2861, 1376, 2597, -2166, -2030, 2702, 1228, -2910, -167, 2931, -892, -2636, 1900, 2197, -2592, -1463, 2988, 591, -2966, 502, 2769, -1535, -2325, 2378, 1705, -2956, -955, 3118, 52, -2954, 909, 2492, -1868, -1919, 2578, 1184, -3018, -444, 3010, -449, -2725, 1311, 2156, -2131, -1484, 2716, 728, -3005, 25, 2891, -834, -2470, 1656, 1824, -2356, -1060, 2829, 274, -2949, 528, 2733, -1265, -2114, 2034, 1364, -2587, -455, 2948, -348, -2890, 1160, 2476, -1838, -1730, 2435, 862, -2783, 72, 2894, -910, -2658, 1606, 2082, -2159, -1246, 2560, 289, -2776, 607, 2699, -1400, -2369, 1951, 1684, -2378, -839, 2585, -127, -2657, 957, 2450, -1638, -2017, 2084, 1267, -2368, -352, 2462, -562, -2370, 1414, 2093, -1997, -1542, 2379, 807, -2482, 147, 2439, -1017]
1871a017j129L950q4l993J226L540k265k666L142J483l753j81L986j067l768K125
1887d71L088k985k015L554P51l837N41L763j696l302K620K445l267j298L608K9
1903A528l646J202L371k220k761K967J835l400o85L539n17l400J659K969k570
1918a29k234L164J242l429q9L392j114l043K182K434k982j572L426N06l513O45
1934a114L255j776k700K715J903l351q92L560k07l415J331K934k351k177L097
1949H12J234l485j86L516r13l156J930K510k758j666L308O95l493L33L310j312
1965F79k800K186K035k859j099L234Q9l262Q90K973j792k377K542J551l033o26
1981a669L240l89l103J328K649k155j901K776R63l103N3L141j087k792J965K166
$$ y = [-1017, -2146, 1804, 1720, -2273, -1047, 2493, 228, -2438, 704, 2187, -1566, -1747, 2239, 1172, -2596, -471, 2617, -368, -2383, 1171, 1922, -1915, -1374, 2389, 693, -2609, 11, 2456, -811, -2109, 1499, 1528, -2118, -916, 2455, 235, -2526, 441, 2276, -1124, -1809, 1730, 1213, -2187, -528, 2441, -129, -2363, 801, 2043, -1386, -1475, 1917, 803, -2240, -58, 2376, -606, -2178, 1248, 1754, -1759, -1114, 2141, 365, -2335, 380, 2283, -1068, -1960, 1600, 1393, -2022, -691, 2243, -108, -2285, 812, 2046, -1439, -1625, 1891, 978, -2178, -248, 2262, -496, -2162, 1146, 1841, -1652, -1319, 1991, 679, -2121, 65, 2100, -759, -1858, 1376, 1465, -1797, -907, 2066, 274, -2103, 439, 1990, -1043, -1669, 1571, 1182, -1921, -593, 2056, -99, -2000, 776, 1739, -1364, -1311, 1830, 743, -2049, -84, 2082]
1997B082k687j313L127L23l222O85L003j645k442K393J682k931p26L144k80l034
2013a841J255K612k099j923K732J084l089j51L117p71k846J613K257k292j474
2028a816K740O29k940K68K834j118k431J851J827k454r81K772J18k875P42K665
2044A831j543k105K145J392k667m87K910m90k771J360K371k075j671K539P95k808
2060a274J79K789j123k501J924J939k465j135K748K09k810P35K609j575k157K166
2076B58J536k576o80K674k38k555J120K265j875j770K376J096k606k97K607n59
2092G76k403J369K015k035j460K444P65k562P0K438r21k110J726J573k298r50
2108a563K602K22k597N92K323j401j832K084J213k536n20K657k54k441J036J979
$$ y = [2082, -605, -1918, 1209, 1532, -1690, -1005, 1998, 353, -2089, 304, 1986, -945, -1671, 1473, 1193, -1841, -586, 2026, -73, -1996, 736, 1820, -1269, -1420, 1697, 926, -1920, -307, 1950, -342, -1816, 924, 1553, -1387, -1119, 1715, 597, -1834, 17, 1844, -610, -1591, 1181, 1299, -1576, -834, 1831, 288, -1817, 328, 1720, -947, -1434, 1476, 986, -1785, -425, 1946, -129, -1800, 739, 1534, -1274, -1095, 1694, 571, -1930, -6, 1933, -532, -1667, 1081, 1290, -1520, -785, 1824, 249, -1908, 258, 1794, -782, -1462, 1212, 974, -1581, -461, 1804, -71, -1841, 535, 1631, -975, -1272, 1335, 776, -1627, -258, 1757, -278, -1738, 706, 1471, -1091, -1021, 1417, 496, -1614, 112, 1685, -613, -1563, 1039, 1261, -1336, -744, 1579, 178, -1654, 430, 1643, -893, -1413, 1244, 990, -1451, -415, 1564]
2124A564j771j355K341O36k648P8K617p67k285J434J709k007j014K411K91k572
2140a338M02K433j027j998J592J358k066o09K383j03k480P83K251j345j754J838
2156C20J047k192k56K371m92k323J135J991j651j390K030N97k260K49K296j014
2172D58k108J634J617k049r37K285P9k303P65K154j477j801J964J214k213m85
2188a203K291l52k147J117J866j733j431K127Q43k290r5K220o51k019J370J668
2204A581j891j187K191N58k252J48K121r00j772J550J357k034q06K243J30k218
2220a181N93J985j316j565J893J036k252m19K334k96k124R91J706j642j146K124
2236G21N06k331J71K252q45j935J466J417j974p70K303J03k343N42K115j133j665
$$ y = [1564, -207, -1562, 779, 1415, -1233, -1155, 1462, 695, -1590, -156, 1553, -454, -1468, 943, 1234, -1338, -936, 1497, 470, -1528, 64, 1422, -644, -1253, 1130, 1027, -1453, -670, 1581, 236, -1518, 320, 1367, -825, -1081, 1290, 798, -1525, -390, 1601, -50, -1440, 590, 1187, -1073, -824, 1472, 458, -1650, -16, 1601, -448, -1385, 900, 979, -1324, -559, 1595, 118, -1683, 281, 1495, -718, -1203, 1088, 736, -1411, -294, 1572, -161, -1592, 535, 1378, -912, -1007, 1213, 562, -1457, -87, 1581, -310, -1497, 694, 1252, -1000, -852, 1269, 369, -1403, 147, 1504, -530, -1336, 907, 1037, -1181, -588, 1397, 81, -1484, 409, 1445, -807, -1226, 1108, 812, -1312, -321, 1385, -257, -1403, 721, 1227, -1104, -933, 1319, 474, -1461, 5, 1422, -552, -1322, 981, 1084, -1259, -717, 1398, 265, -1400]
2253a400J662J028k014l73K211l02k135Q92J863j420j348J805P30k101n3K175
2269A220n60k021J118J629j560j075J877L91k047L29K006r59j765J479J282j851
2285e07o49K055o5k065P51J886j358j471J776R17k017k26K056n09j909J156J587
2302A408j658j097J982M69k086K15J993q76j728J447J328j834p95K029J91k038
2318a050M52J862j057j535J552J051j854m95K004j31j942P65J683j326j292J738
2334D25P61j961j60K002m81j841J075J463j551r39J854L44j981L20J859r32j570
2351a313J482J094j845n23K017j33j965P77J720j309j302J717P24j919j15J938
2367A045n32j714J095J382j567q95J870L15j952K59J868q43j570J322J155j661
$$ y = [-1400, 262, 1290, -724, -1097, 1114, 812, -1323, -431, 1432, 12, -1336, 469, 1199, -902, -955, 1220, 660, -1361, -243, 1386, -174, -1249, 628, 1019, -1028, -699, 1307, 348, -1417, 62, 1344, -507, -1156, 899, 834, -1231, -480, 1406, 48, -1423, 353, 1270, -747, -973, 1083, 574, -1335, -179, 1408, -250, -1347, 635, 1104, -982, -767, 1226, 350, -1378, 69, 1397, -437, -1232, 797, 988, -1050, -598, 1264, 207, -1328, 224, 1275, -579, -1074, 930, 799, -1143, -378, 1305, -21, -1313, 425, 1186, -775, -935, 1067, 586, -1255, -180, 1283, -268, -1207, 647, 991, -990, -670, 1189, 257, -1313, 169, 1263, -582, -1105, 912, 779, -1186, -409, 1311, 2, -1300, 417, 1141, -778, -893, 1045, 513, -1201, -106, 1276, -291, -1186, 684, 999, -953, -694, 1174, 331, -1239, 83, 1238, -423]
2383d23o50J846Q6j852N07J616j044j260J500P95j797k43J873l12j787Q58J466
2400A179j338r91J693M47j873J33J833p10j555J177J127j564n62J803n5j817O33
2417d40J652j113j284J471P69j731j60J830m17j714R19J426j303r95J566M32j679
2434g71J54J672o97j526J154J190j455p22J610J63j667M13J554r14j341J325R56
2451A098j543m68J613j24j550P08J336j170j018J507N68j654k4J604n43j410J087
2468A7J101j488o81J680K27j662L09J469q51j138J280P51j584k84J678j66j572
2485i14O37J294j113r03J447N04j656p4J649l56j453P57J113j149o77J443K45
2502G94j611J92J547o00j299R66R16j296m53J525j7j585M40J470q23j113J128
$$ y = [-423, -1073, 773, 859, -993, -486, 1130, 86, -1174, 326, 1121, -676, -919, 954, 642, -1145, -287, 1179, -159, -1150, 543, 990, -883, -750, 1083, 373, -1182, -5, 1122, -442, -1004, 799, 744, -1073, -440, 1212, 99, -1185, 286, 1055, -676, -836, 994, 577, -1137, -218, 1208, -95, -1090, 476, 908, -771, -617, 1055, 358, -1168, -14, 1176, -279, -1001, 609, 772, -895, -482, 1072, 158, -1183, 142, 1098, -445, -913, 700, 576, -974, -266, 1070, -100, -1118, 389, 957, -697, -721, 883, 340, -1070, 17, 1118, -370, -1051, 629, 856, -806, -497, 972, 121, -1017, 263, 1014, -570, -854, 824, 658, -914, -277, 1017, -96, -999, 448, 952, -704, -778, 871, 515, -938, -181, 932, -217, -894, 549, 794, -817, -625, 922, 322, -977, -11, 905, -391, -844, 681, 664, -921, -481, 989, 166, -947, 181]
2519A81O37j354j15J475l89j428Q23J197j125p94J337K95j457K53J438p37j297
2536a060J083J002j290n35J366%j376N14J270r52j062J252P26j385k86J401k28
2553D40j305O82J154j084q95J320N44j393j14J353l62j202Q13R75j172o57J359
2570D56K80j384J86J279o54j059J064P29j324l57J443n3j347M67J123q77p95J192
2588C69M12j371oJ356m05j188P89Q84j102m96J309Q1j389K82J303o24j059R29
2606G4P17j165l12J265o7j265M31J137p48q84J029N24j220j20J304k57j267N89
2624b35J091q70p74J083M05j218K2J234m34j122P63Q73j026m95J186O9j236L48
2642c36J165p17r65R88O57j172k58J212j67j149N82R65q94p12J096L59j195N4
$$ y = [181, 818, -536, -651, 824, 435, -993, -170, 1027, -98, -892, 445, 740, -717, -464, 974, 237, -1060, 23, 1025, -265, -800, 566, 566, -810, -296, 974, 22, -1040, 212, 938, -447, -733, 668, 440, -865, -183, 971, -113, -1008, 312, 856, -537, -651, 702, 340, -862, -49, 926, -246, -903, 456, 736, -648, -462, 817, 163, -896, 168, 897, -427, -784, 659, 606, -741, -274, 849, -28, -823, 369, 781, -590, -596, 760, 355, -833, -44, 840, -262, -758, 551, 632, -757, -475, 828, 204, -855, 74, 791, -374, -686, 579, 512, -753, -322, 815, 67, -817, 212, 736, -484, -604, 700, 443, -824, -235, 856, -14, -788, 295, 700, -518, -496, 738, 304, -818, -55, 818, -208, -703, 483, 552, -684, -336, 829, 112, -853, 135, 792, -380, -638, 574, 407, -742, -160, 805, -89, -801, 295, 654, -541, -487]
2660d87J178m48j029P88Q14j047n29J191J70j211K11J113n60r27Q69O64j074l40
2678f54J164j7j150L85J032p36p95J000M86j146j57J192k18j114N74R18q65o18
2696g19J074K53j160J23J111m95r38Q02O79j023l40J131j7j144M08J022p36q00
2714g69R75M76j089j34J127k22j041N61Q30q20o01J030K81j100M4J098m01r65
2732g20P01P57r44m95J087J83j122J61J035m69q57P65N92r81l00J096m4j068L72
2751b51R44o89o91R24L93j084p6J126k25j036N53P85p93m84R81J39j070K06J009
2770F61n00q59P57N79r25k62J062q2j077L67R63o09p67Q18M63r41j16R91k12r76
2790f65M95Q65p29o42Q89L38r86J1J014l27r55O03Q12q27n53R45J96r42J64R10
$$ y = [-487, 691, 243, -786, 2, 816, -231, -760, 431, 601, -610, -399, 714, 154, -773, 96, 760, -314, -654, 510, 493, -657, -272, 760, 24, -771, 229, 715, -431, -588, 604, 386, -728, -154, 764, -101, -719, 355, 608, -552, -429, 682, 187, -751, 51, 730, -293, -633, 498, 481, -663, -255, 767, 31, -769, 206, 682, -407, -541, 586, 364, -677, -116, 714, -106, -707, 323, 604, -496, -452, 646, 245, -720, -19, 738, -206, -701, 386, 569, -553, -392, 643, 174, -683, 82, 674, -307, -607, 489, 445, -623, -251, 693, 4, -687, 237, 630, -454, -530, 596, 371, -665, -112, 673, -120, -604, 377, 516, -554, -348, 661, 161, -698, 59, 638, -287, -549, 513, 431, -646, -279, 684, 75, -692, 126, 589, -352, -468, 523, 311, -665, -170, 695, -34, -676, 213, 551, -435, -424, 590, 263, -692, -89, 723, -104, -657, 288, 484, -458, -294, 616]
2810F16m99q06P48O08r12l17R88l7r34L85Q31o94o71Q89M39r82j27R42j93q52
2830e78N30O82p87m84R43K29r73M6R20l78p61O67N70q67l78R92J19r83J50Q97
2850E56m44p14P14M96r03k48R76mr33K65Q00n64n88Q26L27r74q0J029j82r33M22
2871a56P24o56m54Q73J33r32J20R07l84p41N97M92p90j78R08j11r31L57Q51n65
2891F4o41O94L68q12m8Q72k47q32M74P24o42n14P53K11q19R1Q60l67q32N79O83
2912F19p15m46P98J57q29J49Q12m48p03O51N35p72k84Q26m4q04L54P26o06n78
2932f02P69L88q44j11Q05j84p17M70N73o88l79Q06J43q09J13P36l85n86O05M22
2952E25p82k09Q44j0q14K42O91m80n19O74L07p79r8Q24j29p55L40O22n58m16P25
$$ y = [616, 117, -689, 59, 667, -245, -562, 426, 389, -545, -160, 671, -23, -694, 195, 634, -348, -475, 467, 274, -578, -48, 634, -153, -637, 306, 535, -438, -392, 528, 150, -611, 56, 626, -241, -619, 373, 492, -491, -341, 556, 112, -602, 112, 608, -295, -543, 433, 429, -504, -239, 561, -3, -591, 235, 562, -412, -492, 537, 355, -578, -156, 568, -88, -542, 331, 464, -468, -348, 559, 175, -566, 31, 523, -267, -445, 463, 352, -579, -222, 629, 64, -577, 117, 485, -327, -375, 497, 250, -582, -108, 616, -26, -540, 213, 424, -395, -304, 556, 189, -643, -64, 619, -96, -542, 256, 413, -416, -267, 545, 97, -606, 45, 580, -192, -476, 350, 306, -498, -144, 582, -24, -602, 167, 555, -289, -400, 405, 221, -496, -26, 547, -141, -520, 286, 429, -380, -267, 469, 84, -502, 103, 525, -257, -466, 378, 368, -446, -204, 487, 7, -512, 162, 469, -310, -408, 416, 287, -468, -128, 494, -64, -480, 245]
2973B45J98q20L0Q17k56p20M75N60o60l21P48R2p98J56P41l78n95N78L76p12j32
2994c76P74j33p45L64O33n36m58O81K14p48K6P47k71o56M48N08n91l12O97N9p27
3015d02J88O86l97n87N65M32o90k26P62j9p43K34O80m42n32N88L42o76j18P28
3035C73j23o98L50O19n59m46O91K33p53PP40k49o53M44M92n84l09O98O3p11J80
3056a95O42m04n16N62L38o73j22P19j26o69L29N77n09m11O12K20o77%O80k24n94
3077d41M04M85n59l15O53J18o97J13O68l15n80M92M53o22k62O86M2o76J74O25
3097D46l86n15N59L35o62j32O85j05o30L27N22n23l61O47J78p07K8O39k34n19
3117d08L92M24n74k33O81ko48K02N38l23m60N91J72n83o2O69j43o45L45M64l69
$$ y = [245, 443, -377, -347, 470, 214, -506, -31, 529, -131, -452, 296, 388, -410, -254, 487, 109, -486, 92, 468, -244, -376, 398, 265, -480, -116, 517, -19, -477, 204, 418, -330, -304, 443, 172, -484, -36, 472, -119, -431, 266, 325, -402, -214, 472, 75, -512, 53, 485, -205, -431, 331, 312, -431, -197, 483, 41, -491, 97, 439, -237, -355, 373, 250, -448, -98, 521, -38, -484, 207, 440, -313, -306, 434, 185, -468, -24, 468, -116, -425, 273, 336, -375, -195, 447, 43, -473, 89, 427, -246, -368, 351, 225, -444, -115, 462, -47, -458, 154, 374, -303, -303, 377, 153, -441, -37, 448, -111, -426, 227, 345, -352, -239, 429, 114, -466, 26, 479, -143, -405, 281, 323, -353, -179, 446, 60, -455, 104, 439, -223, -355, 330, 225, -405, -78, 444, -79, -440, 207, 385, -322, -294, 345, 111, -408, -16, 408, -166, -399, 282, 280, -368, -166, 372, 49, -411, 180, 352, -231, -293, 376, 233, -412, -67, 397, 28]
3138B8l72N46J00n74m9O81j54n90L32M39m72k33N39Q9o19P4O14k52n29L51M03
3159C52n02j98N98K0o62K68N19l29m69M59K20n04l1N94j85n71L63M77m69l26N17
3180A41J46n46P8N22k57m68M04L75m93k22N38K3n23J75M85l55m19M80L05n38j51
3201c00N43l2n23K43M52m12l68N16K49n69o8N22j10m82L14L79m67k69N70J28n76
3222b60M1N25k24m30L89K94n01j58N52K0n22J46M25l09k85M28J55n23rN37j14
3243A77m83K50L57l61k29M75P3n19N1N06j62m29K78K92l75j53M58Nn17J31N06
3264C31k40m24L42K92m30j39M86j7n03J57M68k85l46L71J86m34j9M81j63m39K79
3285d6L86l77k54M23Q6m36R2M10k34l74L36K72l81j25L91j4l88J83L38l09k88
$$ y = [28, -344, 202, 302, -272, -321, 360, 206, -384, -52, 387, -85, -318, 221, 310, -309, -235, 379, 127, -402, -51, 352, -150, -348, 250, 270, -392, -124, 395, 66, -403, 56, 276, -228, -259, 335, 150, -421, -58, 419, -50, -376, 141, 287, -259, -181, 341, 84, -384, 20, 395, -98, -320, 218, 241, -282, -107, 378, 23, -396, 84, 389, -149, -300, 243, 211, -312, -69, 383, -29, -397, 119, 368, -201, -269, 253, 143, -339, -25, 354, -113, -382, 188, 316, -260, -219, 306, 82, -348, 41, 335, -166, -324, 228, 248, -274, -128, 297, -12, -297, 131, 286, -237, -246, 291, 177, -306, -56, 301, -60, -289, 186, 259, -260, -209, 297, 135, -294, -16, 276, -99, -252, 206, 211, -306, -175, 331, 91, -333, 9, 301, -129, -268, 218, 201, -302, -145, 323, 38, -308, 63, 249, -185, -204, 277, 114, -325, -46, 340, -37, -291, 132, 218, -218, -126, 284, 50, -324, 12, 284, -97, -222, 169, 155, -233, -50, 288, -21, -309]
3306c09M01J79m33m9M07p4l76K10L32l32k52M03J52m14k7L95j16l48K57K77l76
3327i3j70M24P9m43L6M12j81l24K81K49l99j18M14Qm12J37L41k40k52L37J29l47
3349a32qL37r8l32K15K52k78j87L38J31m01K4L53j28l18K35K24l28j06L47j9l59
3371b38J62L27k44k66L06J30k05j80M04j7l98J48K66j38k51L11K3l04j2L72j27
3392F9l11K20J98j13k43L14N9l23lM15j88l13K26J95k80j83L45N9l47J45K30j19
3414E2k21K31J24k89o3L32m4l17J59K58k58j60K62J28l19j8L09p4k78J67K20k77
3436g6j35K97O1l14L4K98j03k84J94K53k55j56L01L6l18N5L06j61k70K37J89k64
3458g5p4L27o0k85J08K80j92k26K73Q5k63j7K75q1k00J30J57j94j34K47M5k41
$$ y = [-309, 92, 271, -162, -211, 196, 122, -254, -44, 288, -44, -296, 107, 259, -155, -182, 213, 97, -251, 6, 283, -93, -263, 161, 240, -203, -167, 245, 64, -260, 21, 270, -129, -247, 167, 175, -237, -100, 241, 1, -251, 86, 215, -132, -140, 197, 99, -233, -18, 234, -44, -231, 107, 238, -163, -139, 214, 86, -232, 3, 227, -101, -207, 140, 121, -238, -76, 251, 7, -259, 47, 177, -28, -208, 196, 179, -219, -71, 195, 57, -194, 117, 140, -164, -176, 196, 69, -242, -22, 176, 63, -180, 134, 193, -130, -133, 282, 94, -219, 7, 202, -78, -261, 84, 143, -204, -59, 171, 52, -169, 62, 186, -103, -166, 166, 122, -195, -36, 222, -36, -196, 66, 194, -125, -143, 166, 92, -186, -19, 201, -76, -211, 86, 147, -167, -133, 165, 62, -222, -28, 225, -30, -186, 115, 151, -167, -112, 194, 33, -237, 0, 189, -75, -149, 178, 118, -167, -59, 221, 29, -197, 76, 161, -102, -119, 156, 75, -125, 5, 162, -32, -166, 81, 126, -115]
3480a15J9K63p9k80K07K03k79j08K93J0k53R0J64j50j80K13J86k65j25K95qk08
3502a07O0J62p7k54K80J58l43m4L20o5k41J35K14k36k17L74M9k83j3K81p6k05
3524a28J59J32k53o0K80J4k77M7K43j32j86J80J22k42n6K73ok58P3K20j45j38
3546a38K06P4k64KK74o3k62J22K25j85j24K24N9k95K6L07r2k70J39K01j93j12
3568a39K57J4k88O9K79j37k45J94J55k20o5K47l7k53J06K47j67j95J93J15k13
3589h3oK18p3k25J43K02j90j50K12P2k11J9K19j06k11J62J95k03j42K34N0k35
3611a09O1K13j45j93J94J67k40j10K64Rk43Q8K29k03j96K58J41k81o0K65k0k50
3633a61J27J92j94j51K65Q5k78mK49p7k08J73J37j91j36L00Nk37J4K11m4k12J58
$$ y = [-115, -96, 167, 88, -192, 15, 218, -61, -169, 124, 134, -119, -29, 135, -15, -195, 18, 204, -61, -186, 109, 101, -107, -47, 115, 38, -216, 64, 222, -121, -165, 155, 90, -151, -16, 198, -38, -255, 119, 168, -115, -128, 153, 77, -128, 31, 163, -90, -150, 130, 144, -133, -86, 157, 25, -161, 19, 141, -101, -157, 116, 110, -148, -75, 145, 0, -138, 68, 142, -122, -120, 154, 91, -171, -49, 176, -9, -133, 91, 150, -145, -119, 188, 96, -174, -35, 166, -27, -139, 118, 132, -156, -87, 192, 55, -190, 4, 159, -61, -126, 121, 84, -169, -63, 184, 17, -178, 15, 130, -83, -89, 129, 56, -169, -26, 176, -14, -164, 48, 120, -91, -72, 147, 41, -170, -8, 187, -16, -158, 76, 126, -109, -48, 165, 20, -173, 21, 188, -52, -162, 102, 111, -132, -44, 185, -18, -214, 44, 185, -96, -156, 109, 89, -161, -34, 158, -36, -187, 78, 163, -115, -119, 130, 53, -155, 18, 155, -36, -172, 128, 133, -104, -90, 121, 77, -135, 23]
3656B3J43k35p5K56Nk58R2J80j06j90K24P7k31k2K61n2k18N8K84k02j63K14P7
3679A42k85pL05p6k86K10K43l60m8L41n0l84J81K94j98k18K43J49k66p1K16J0
3701H5k27M4K75j65j31J38J24k78N9K03Ok32J00J54j57j96K70J07k41k4K78j25
3723F7k49J60J51j63j36L32m3k81P4K26j47j92K75O8k32m7K60j9k48J03K67k08
3745A8j84K53J46l94P7K11k3k55J45J93k36j34K69P2k84K5K68j15k29J66J73k03
3767d1r9K25K6k46M8K39j36j82J78J52k55m0K82m7k56R4K40j72j92K23J14k53
3789i8l9K71o3k29J52K06k19j54K82M8k77K2K73q2k77K07K03k94r7K57J2k45J6
3812a25K55q2k35K08R9j99j10K70ql15J84J81j74r6K18P4k62mK37j3k43J14J91
$$ y = [23, 166, -69, -144, 112, 117, -141, -49, 131, 25, -165, 59, 136, -95, -117, 144, 92, -126, -68, 216, 14, -149, 65, 142, -143, -150, 155, 79, -207, 3, 246, -114, -162, 179, 129, -255, -74, 220, 22, -196, 47, 196, -70, -141, 75, 85, -142, -98, 177, 12, -119, 19, 143, -135, -76, 127, 133, -99, 1, 155, -2, -198, 72, 179, -62, -86, 192, 67, -182, -22, 129, -34, -170, 162, 119, -162, -88, 138, -9, -201, 74, 142, -90, -137, 123, 104, -144, -41, 226, 18, -166, 87, 233, -161, -84, 127, 104, -151, -6, 187, -49, -183, 86, 158, -126, -101, 167, 52, -177, -11, 162, -41, -140, 85, 111, -135, -87, 152, 16, -166, 12, 164, -91, -131, 151, 104, -152, -58, 182, 10, -182, 41, 155, -98, -137, 134, 71, -158, -6, 200, -19, -173, 109, 157, -120, -98, 175, 93, -184, 23, 226, -68, -165, 92, 104, -141, -125, 130, 48, -187, 21, 120, -79, -189, 81, 73, -242, -58, 123, -51, -147, 71, 145, -117, -121, 116, 103, -140, -26, 165]
3835A65k12j23K62N5k72J2K71j05k24J81J73k52q9K88J6l00N8K79j54k07K22J31
3857A75k84n0L15m4k99J25K55j93j78K46R4k99nL17q5k86J54K29k14j30K41M5
3879A29k82O2K73j32k39J97J78k45q2K58kk81J08K56j62k39K29J40k48n1K72o1
3901G8k71J49K49k24j78K67R1k92K2K69j12k57K10K13k78j36K99N5l00N7K74j68
3923A7k23K41J77k88r3L00j3k87J31K32j89j98K63J31l06l3K88m9k72J64K09k56
3945e4j14K73N7l22M6K75j01k51J69J63k21j45L86o2k53M3L16j46k92K06J86l19
3967a60j0L17m4k74R8K10j58j51L07L8l32L3L34j11k91J87K33k84j13K96J3k90
3989a52N2L03j45k59K19J71k58r4L03k9k98J07K81j90k10K30J32k71k3K79o5k73
$$ y = [165, -47, -170, 92, 147, -125, -113, 158, 53, -171, 10, 183, -69, -158, 130, 146, -154, -96, 183, 29, -178, 44, 175, -109, -159, 156, 112, -187, -62, 193, 0, -178, 68, 162, -137, -142, 175, 90, -196, -42, 187, -27, -157, 84, 129, -153, -91, 182, 50, -189, 8, 186, -59, -141, 117, 115, -166, -58, 198, 36, -203, 26, 166, -82, -133, 139, 78, -193, -44, 205, -19, -197, 70, 161, -131, -109, 160, 48, -209, 1, 214, -64, -200, 99, 154, -146, -89, 185, 17, -206, 35, 212, -76, -169, 131, 118, -169, -38, 194, 5, -193, 70, 201, -105, -138, 150, 101, -171, -7, 202, -54, -168, 105, 162, -160, -114, 161, 60, -191, -22, 141, -80, -225, 161, 99, -154, -111, 205, 59, -233, -27, 159, -160, -170, 147, 103, -171, -73, 137, -21, -172, 135, 173, -159, -126, 208, 97, -194, -7, 226, -58, -171, 125, 138, -152, -100, 203, 58, -201, 18, 189, -69, -163, 140, 111, -187, -80, 201, 11, -199, 31, 163, -108, -131, 148, 83, -190]
4011a90J46K30k17j59K60O9k73L3K79j35k44K17J87k64j22L11jk73Q5K66j78k33
4033b06K64J32k86n6L06m5k86J53K32k40j73K97R1l22PK95r5k70J84K08k43j20
4055a73K79L6k97N1K70j37k31K28J60k78o7K95j5k88J06K42j76j89K50J12l01
4076a23qK98o4k81J49K37k24j66K84N7l00L7L06j59k39K12J83k70r9L03j0l00
4098a77J04K59j80k06K50J34k92m5L02n3k82J36K51k05j59K42O1k79MK71m3k72
4120a79K02J58k61p3K74J8l17Q3K32j20k01K17J49k02j08K68l3k81J01K60j99
4141a2j78K57R8k90j0K94q1k84J73K23k29j36K64M9k96M9K94j39k46K15J71k53
4163f7r8K88lk81R2K59j65k10K20J40k59n3K74m1k71J37K30j91j89K91O3k78l
$$ y = [-190, -44, 186, -31, -190, 70, 139, -134, -101, 178, 43, -201, 16, 203, -61, -183, 128, 127, -146, -61, 205, 27, -206, 58, 190, -96, -152, 154, 109, -177, -24, 208, -32, -205, 92, 183, -139, -132, 163, 68, -202, -18, 190, -53, -173, 106, 142, -155, -104, 166, 29, -202, 26, 186, -92, -159, 136, 121, -167, -61, 181, 5, -184, 66, 178, -123, -131, 167, 103, -178, -29, 208, -16, -182, 102, 159, -141, -104, 202, 43, -196, 16, 199, -71, -170, 133, 123, -177, -73, 186, 6, -200, 50, 184, -108, -153, 149, 96, -186, -50, 201, -4, -163, 79, 140, -139, -135, 136, 93, -179, 23, 181, -80, -153, 121, 139, -178, -95, 137, 17, -184, 33, 182, -20, -128, 140, 107, -174, -73, 187, -12, -190, 67, 165, -125, -135, 159, 78, -206, -33, 190, -39, -175, 89, 138, -158, -109, 185, 46, -200, 15, 186, -67, -165, 123, 120, -161, -69, 190, 25, -185, 35, 175, -84, -137, 137, 96, -175, -38, 192, 1, -188, 103, 166, -112, -115]
4186a15K59q2k49J65J95k21j36K77L6k71M6K58j30k26K09J66k53j02K86J2k78
4207a54R1K39j79j98K62J18k77m4K98m8k70J18K16k02j74L12R4l11n6L24j07k06
4229a54J36J91k08j25K40N7l17O8L12j46k47K04J94l27oK84n8k17J12K21k29k14
4251b29K91P9k14p1K79l6k60J28K07j89j46K38O6k72K9K86j20k57J90J80k18j11
4273a50K55J3k87Q3K75j56k19K07J36k51m9K58l6k58J22K28j84j70K24J05k58
4294a12KK52q4k42J65K09k16j35K46L4k42M4K38j20k19K06J65k53q2K65Nk67Q5
4317e6K23j69j72K25J21k60n2K74n2k44J27K17k25j45K64O8k74NK67q9k34J76
4339eJ69k34j04K74K6k71M8K60j24k28K25J25k50o9K98l6k60R2K42j73j60K19
$$ y = [-115, 144, 62, -187, -22, 173, -48, -184, 93, 129, -142, -96, 162, 32, -194, 15, 181, -72, -174, 112, 124, -154, -63, 176, -3, -201, 61, 179, -98, -142, 156, 108, -162, -44, 172, -30, -204, 108, 202, -109, -165, 159, 52, -154, -18, 173, -35, -160, 80, 137, -180, -112, 200, 54, -193, 11, 205, -122, -128, 156, 98, -119, -7, 214, -15, -229, 62, 141, -73, -144, 135, 99, -161, -33, 174, -15, -161, 77, 143, -129, -100, 186, 66, -191, -1, 179, -39, -150, 105, 118, -169, -86, 189, 33, -186, 21, 157, -94, -143, 115, 79, -179, -57, 171, -13, -183, 41, 146, -112, -110, 142, 58, -184, -19, 190, -26, -161, 85, 119, -123, -79, 159, 39, -180, 26, 191, -62, -144, 121, 126, -141, -56, 167, -2, -174, 51, 172, -88, -140, 134, 82, -162, -35, 182, -43, -188, 76, 144, -130, -125, 142, 53, -181, -5, 164, -70, -174, 100, 126, -145, -97, 163, 39, -189, 36, 161, -89, -158, 140, 104, -156, -64, 178, 5, -155, 64]
4361F4R0k67nK67p5k39J45J97j95j45K64K1k69N8K27r5j94J63J48k65m8K88j0
4384A25k93Q6K89k09j96K58J03k81qK85o9k80J68K12k24j55K76N9k65L0K65j19
4406E7k36J91J77k39j07K70Mk68O6K66j69k02K14J69k85m2K61l5k82J49K36k26
4428c1j59K56R4k74MK42q2k68J67K34k66q6K59M4k63Q5K11j56j64J77J41k82n5
4451a72L14nk89R7L04j81k48K14J57k70j20L40r3k24J60K03k07j86K85R3l36P8
4473h6K57j43k14K01J80k53j51L06N9k97R0K36k01j76K45J11k67n0K88l2k92J53
4495c6K31k18j65K79Q9l06jL07r2k81J83K14k61j23L01K7l11O3K85j40k53K43
4517C5J44k76p2L08j3l05J13K56j90j99K54J11k85k0L02o6k80J43K31j97j34K50
$$ y = [64, 154, -113, -118, 149, 74, -165, -20, 177, -18, -163, 101, 122, -147, -89, 138, 43, -151, 12, 160, -105, -153, 135, 125, -168, -82, 207, -2, -198, 60, 163, -118, -126, 159, 90, -190, -22, 190, -34, -189, 87, 146, -119, -89, 176, 57, -179, 12, 189, -50, -157, 113, 117, -151, -85, 181, 12, -190, 24, 193, -92, -134, 127, 92, -190, -41, 195, -31, -190, 66, 160, -114, -110, 132, 50, -218, -51, 183, -83, -169, 90, 134, -129, -44, 167, 11, -153, 24, 165, -117, -172, 142, 137, -152, -55, 249, 68, -180, 34, 191, -79, -199, 141, 48, -176, -16, 187, -20, -206, 79, 172, -164, -86, 171, 28, -186, 15, 195, -58, -209, 97, 156, -141, -51, 185, -16, -192, 53, 164, -103, -153, 135, 103, -189, -36, 195, -23, -188, 91, 180, -126, -127, 180, 88, -193, -10, 204, -57, -180, 121, 148, -163, -100, 185, 45, -208, 35, 179, -97, -169, 139, 126, -179, -66, 190, 0, -199, 55, 166, -119, -139, 163, 97, -183, -40, 191, -6, -140, 110]
4539A10O6k99nL05j04k17J70K25k84q2K32K6k95P6K46j37k55K35J97k88j06L44
4561A60n6l07J50K63k22k00K70J08k97oL12j19k71K01K07k45j44K88N6k98O5K77
4583A92j54k36K28J66k64j05K98J1k78Q4K45j79j94K49J34k93l8K83o4k65J43
4604c7K31k36j70K99O8l06L1K87r9k67J99J98k44j38L02K2l28P7L02j62k19K17
4626B7J58k90m8L05m4k95J19K66k04j89K86R1l32J2L21o9l29K08K10k59j25K80
4648I9M4k75M2K87j29k46J91J46k65l7K59J2l08R9L34j89k53K33J56l55j8K86
4670A13m9l04J60L05k89r6J87J25l12M4L53j81k71K43J86k84q6K93P6l61J17J56
4692A25o5k55K63J38k49r1K81p0k66J08L47k47l14L61Q1k60NK85p8k78J90K56
$$ y = [110, 176, -123, -128, 177, 73, -144, 26, 251, -33, -115, 117, 143, -152, -76, 170, 33, -222, 13, 210, -78, -184, 160, 104, -203, -53, 210, -12, -212, 58, 166, -131, -137, 175, 56, -215, -14, 193, -52, -196, 92, 148, -150, -85, 192, 38, -198, 30, 196, -68, -173, 125, 136, -142, -58, 187, 8, -186, 63, 197, -96, -134, 149, 85, -180, -37, 194, -42, -212, 87, 155, -151, -120, 167, 68, -199, 0, 198, -46, -184, 118, 140, -188, -111, 191, 29, -190, 27, 185, -105, -153, 152, 108, -187, -68, 198, -6, -195, 91, 182, -150, -138, 183, 114, -215, -7, 203, -56, -181, 99, 143, -132, -90, 197, 68, -178, 13, 159, -106, -143, 116, 128, -180, -81, 253, 64, -189, 44, 200, -155, -173, 113, 64, -240, -80, 225, -64, -160, 27, 152, -160, -116, 237, 56, -215, 28, 214, -70, -156, 137, 213, -148, -31, 125, 60, -195, 68, 206, -43, -134, 147, 77, -189, -81, 266, 19, -295, 66, 147, -113, -108, 177, 99, -179, 11, 267]
4714B67l08j84L17L4k87J27K03j26l24K82K25l75j53M61Rl39J81K33k72j98L56
4735A29O3l19p7L27q3k68J68K75k27j54K81J7k47j7L10j02l64L35P5k09j17L02
4757I8O5l17Q1K78k01j97J57J92k65k6K80p5k55J57K53k17k30L22J14l55M2L30
4779B31j42l00K53J57k85j36L91j8k91N6K83j72j98K42J07l60LL41l4l18R0K88
4801A88k17j97L53M2k30o0L01j31k20J34L38k99j83L10L0l65J40K50j52k30K78
4822H0J27k89n5K55J0l29J76K45j99j41K31N9k66kK60o0k91K02K55l13j48K92
4844I9N3k96K7L27j75k64K38K08l73q6M19n3l18R0L41k22k11L27M1k73o2L45n3
4867A29k97K14N5r9k59L96O0l36J1L53j57l09L40O9k91j66L97P3l62J46K05j80
$$ y = [267, -41, -225, 92, 126, -161, -34, 169, 43, -281, 1, 226, -149, -302, 159, 168, -171, 10, 243, -29, -227, 129, 192, -127, -204, 123, 40, -228, -60, 215, -12, -166, 115, 132, -115, -132, 178, 76, -288, 47, 122, -87, -204, 98, 163, -154, -73, 205, 4, -193, -36, 156, -109, -135, 145, 70, -185, -28, 225, 8, -222, 100, 214, -141, -99, 231, 89, -211, 42, 199, -86, -222, 169, 151, -140, -84, 199, 27, -171, 71, 178, -182, -179, 162, 128, -190, -100, 188, -29, -226, 127, 169, -61, -121, 180, 49, -171, -37, 301, 2, -181, 129, 159, -206, -66, 184, 32, -198, 80, 207, -82, -137, 118, 128, -201, -25, 220, 21, -120, 111, 170, -96, -98, 162, 102, -189, 13, 268, -45, -193, 99, 152, -144, -117, 210, 35, -229, 9, 217, -156, -242, 177, 124, -194, -104, 237, 15, -196, 131, 172, -101, -163, 182, 129, -168, 46, 101, 2, -257, 139, 199, -137, -126, 227, 70, -239, 101, 170, -121, -287, 110, 183, -179, -33, 172, -8]
4889hj63K17J64k96p9L24r8k56J26L04k85j28J92K46m43M2K80ll33K29J88k95
4911g5q3K55Q9l64O9L61k12l20L34J55k93j24L88l0l44J21L15k98j52K53J88l53
4933a20l2L35p5l70K29K63k89j73L25O2k89PL25j67k77K46J85k78j00L27J5l31
4955a82R7K92j90k33K69J66l11q8L41l6k92J39K72k58k12L38R6l48JL30j51k58
4977b18K42J99l07j13L62%l54N3L58k00k26K55J52l30n5L41m8l07J17K80k13j91
4999b03K81R0l13%L23r1k85J71K29k51j42L13K9l22O5L06j30k70K17J77k70q1
5021a57L09k2l18J13L02k04k34K66J37l11m1L34p6l15J74K64k50j85L00Q5l26
5042a55J6L24j27k90K32K27k78j41L17K1l07Q0K86j83k33K53J62k88o9L18l1l10
$$ y = [-8, -171, 46, 210, -86, -165, 159, 61, -195, -69, 235, -50, -178, 14, 260, -183, -141, 139, 136, -197, 32, 220, -75, -158, 97, 186, -178, -109, 252, 40, -280, 54, 209, -84, -208, 180, 150, -194, -73, 242, -56, -208, 45, 233, -120, -152, 183, 108, -262, -33, 230, -59, -232, 93, 155, -134, -127, 198, 31, -246, 0, 185, -93, -193, 134, 149, -182, -85, 207, 17, -216, 53, 219, -92, -180, 161, 125, -167, -28, 244, -14, -226, 112, 208, -140, -139, 191, 40, -218, 24, 223, -84, -197, 165, 165, -189, -136, 222, 22, -204, 51, 203, -127, -182, 159, 111, -196, -79, 201, -12, -203, 78, 168, -145, -145, 178, 87, -198, -27, 202, -49, -191, 122, 151, -171, -106, 200, 70, -200, 17, 194, -76, -157, 152, 130, -188, -75, 227, 23, -211, 55, 192, -119, -160, 174, 98, -217, -43, 221, -29, -214, 86, 171, -155, -139, 185, 58, -232, 0, 227, -51, -192, 125, 146, -161, -81, 205, 22, -211, 42, 204, -84, -153, 165, 134, -176]
$$ [...]
8191I7
##END NTUPLES=NMR FID
##END=
