##TITLE=1H_LY-13Dix.3.B
 CD3CN, 8 sc, 
 3.06.2021
##JCAMPDX= 6.0         $$ Bruker NMR JCAMP-DX V2.0
##DATA TYPE= NMR FID
##DATA CLASS= NTUPLES
##ORIGIN= UXNMR, Bruker Analytische Messtechnik GmbH
##OWNER= root
$$ XWIN-NMR		Version 3.5
$$ Thu Jun  3 10:43:00 2021 Russian Standard Time (UT+4h)  she@DPX200
##.OBSERVE FREQUENCY= 200.131506
##.OBSERVE NUCLEUS= ^1H
##.DELAY= (6, 6)
##.ACQUISITION MODE= SIMULTANEOUS
##.ACQUISITION SCHEME= undefined
##.AVERAGES= 8
##.DIGITISER RES= 18
##SPECTROMETER/DATA SYSTEM= spect
##.PULSE SEQUENCE= zg30
##.SOLVENT NAME= CD3CN
##.SHIFT REFERENCE= (INTERNAL, CD3CN, 0, 15.7039)
##AUDIT TRAIL= $$ (NUMBER, WHEN, WHO, WHERE, WHAT)
$$ ##TITLE= Audit trail, XWIN-NMR		Version 3.5
$$ ##JCAMPDX= 5.01
$$ ##ORIGIN= Bruker BioSpin GmbH
$$ ##OWNER= she
$$ F:/spectra/data/she/nmr/H-F/1/audita.txt
$$ ##AUDIT TRAIL=  $$ (NUMBER, WHEN, WHO, WHERE, WHAT)
(   1,<2021-06-03 10:41:53.51 +0400>,<she>,<DPX200>,
      <created by zg, POWCHK disabled, PULCHK disabled
       configuration hash MD5:
       00 E9 B6 7A A2 85 ED C7 34 08 36 98 17 FE 4E 26
       data hash MD5: 16K
       FF C3 E0 E0 C1 5B 0E 9D F3 ED 2C 66 18 83 FD E5>)
$$ ##END=
$$ 
$$ hash MD5
$$ 42 84 A6 14 EF 97 09 1F A2 58 10 EF D1 FD 8F 79
##$RELAX= 
##$RELAX= 
##$RELAX= 
##$RELAX= 
##$RELAX= 
##$RELAX= 
$$ Bruker specific parameters
$$ --------------------------
##$DU= <F:/spectra>
##$EXPNO= 1
##$NAME= <H-F>
##$PROCNO= 1
##$TYPE= <nmr>
##$USER= <she>
##$AMP= (0..31)
100 100 100 100 100 100 100 100 100 100 100 100 100 100 100 100 100 100 
100 100 100 100 100 100 100 100 100 100 100 100 100 100 
##$AQSEQ= 0
##$AQ_mod= 1
##$AUNM= <au_zg>
##$AUTOPOS= <>
##$BF1= 200.13
##$BF2= 200.13
##$BF3= 200.13
##$BF4= 200.13
##$BF5= 200.13
##$BF6= 200.13
##$BF7= 200.13
##$BF8= 200.13
##$BYTORDA= 1
##$CFDGTYP= 0
##$CFRGTYP= 5
##$CHEMSTR= <none>
##$CNST= (0..31)
1 1 145 1 1 1 1 1 1 1 1 1 1 1 1 1 1 1 1 1 1 1 1 1 1 1 1 1 1 1 1 1 
##$CPDPRG= <>
##$CPDPRG1= <>
##$CPDPRG2= <>
##$CPDPRG3= <>
##$CPDPRG4= <mlev>
##$CPDPRG5= <mlev>
##$CPDPRG6= <mlev>
##$CPDPRG7= <mlev>
##$CPDPRG8= <mlev>
##$CPDPRGB= <>
##$CPDPRGT= <>
##$D= (0..31)
0 1.2 0 0 0 0 0 0 0 0.06 0 0.03 0 0 0 0 0.0002 0 0 0 0 0 0 0 0 0 0 0 0 
0 0 0 
##$DATE= 1622702512
##$DBL= (0..7)
120 120 120 120 120 120 120 120 
##$DBP= (0..7)
150 150 150 150 150 150 150 150 
##$DBP07= 0
##$DBPNAM0= <>
##$DBPNAM1= <>
##$DBPNAM2= <>
##$DBPNAM3= <>
##$DBPNAM4= <>
##$DBPNAM5= <>
##$DBPNAM6= <>
##$DBPNAM7= <>
##$DBPOAL= (0..7)
0.5 0.5 0.5 0.5 0.5 0.5 0.5 0.5 
##$DBPOFFS= (0..7)
0 0 0 0 0 0 0 0 
##$DE= 6
##$DECBNUC= <off>
##$DECIM= 32
##$DECNUC= <off>
##$DECSTAT= 4
##$DIGMOD= 1
##$DIGTYP= 9
##$DL= (0..7)
0 120 120 120 120 120 120 120 
##$DP= (0..7)
150 150 150 150 150 150 150 150 
##$DP07= 0
##$DPNAME0= <>
##$DPNAME1= <>
##$DPNAME2= <>
##$DPNAME3= <>
##$DPNAME4= <>
##$DPNAME5= <>
##$DPNAME6= <>
##$DPNAME7= <>
##$DPOAL= (0..7)
0.5 0.5 0.5 0.5 0.5 0.5 0.5 0.5 
##$DPOFFS= (0..7)
0 0 0 0 0 0 0 0 
##$DQDMODE= 0
##$DR= 18
##$DS= 0
##$DSLIST= <SSSSSSSSSSSSSSS>
$$ [...]
##$SUBNAM2= <"">
##$SUBNAM3= <"">
##$SUBNAM4= <"">
##$SUBNAM5= <"">
##$SUBNAM6= <"">
##$SUBNAM7= <"">
##$SUBNAM8= <"">
##$SUBNAM9= <"">
##$SW= 20.0188882624521
##$SWIBOX= (0..15)
0 0 2 0 0 0 0 0 0 0 0 0 0 0 0 0 
##$SW_h= 4006.41025641026
##$TD= 16384
##$TD0= 1
##$TE= 0
##$TE2= 300
##$TE3= 300
##$TEG= 300
##$TL= (0..7)
0 120 120 120 120 120 120 120 
##$TP= (0..7)
150 150 150 150 150 150 150 150 
##$TP07= 0
##$TPNAME0= <>
##$TPNAME1= <>
##$TPNAME2= <>
##$TPNAME3= <>
##$TPNAME4= <>
##$TPNAME5= <>
##$TPNAME6= <>
##$TPNAME7= <>
##$TPOAL= (0..7)
0.5 0.5 0.5 0.5 0.5 0.5 0.5 0.5 
##$TPOFFS= (0..7)
0 0 0 0 0 0 0 0 
##$TUNHIN= 0
##$TUNHOUT= 0
##$TUNXOUT= 0
##$USERA1= <user>
##$USERA2= <user>
##$USERA3= <user>
##$USERA4= <user>
##$USERA5= <user>
##$V9= 5
##$VALIST= <valist>
##$VCLIST= <CCCCCCCCCCCCCCC>
##$VD= 0
##$VDLIST= <DDDDDDDDDDDDDDD>
##$VPLIST= <PPPPPPPPPPPPPPP>
##$VTLIST= <TTTTTTTTTTTTTTT>
##$WBST= 1024
##$WBSW= 4
##$XGAIN= (0..3)
0 0 0 0 
##$XL= 0
##$YL= 0
##$YMAX_a= 152253
##$YMIN_a= -151004
##$ZGOPTNS= <>
##$ZL1= 120
##$ZL2= 120
##$ZL3= 120
##$ZL4= 120
##$ABSF1= 10
##$ABSF2= 0
##$ABSG= 5
##$ABSL= 3
##$ALPHA= 0
##$AQORDER= 0
##$ASSFAC= 0
##$ASSFACI= 0
##$ASSFACX= 0
##$ASSWID= 0
##$AUNMP= <proc_1d>
##$AZFE= 0.1
##$AZFW= 0.1
##$BCFW= 1
##$BC_mod= 2
##$BYTORDP= 1
##$COROFFS= 0
##$CY= 11.3945322036743
##$DATMOD= 1
##$DC= 2
##$DFILT= <>
##$DTYPP= 0
##$F1P= 15.9154993809931
##$F2P= -4.1035820241983
##$FCOR= 0.5
##$FTSIZE= 0
##$FT_mod= 4
##$GAMMA= 1
##$GB= 0.15
##$INTBC= 1
##$INTSCL= 1
##$ISEN= 128
##$LB= 0.24
##$LEV0= 0
##$LPBIN= 0
##$MAXI= 10000
##$MC2= 0
##$MEAN= 0
##$ME_mod= 0
##$MI= 1.114404
##$NCOEF= 0
##$NC_proc= 0
##$NLEV= 6
##$NOISF1= 3.799351
##$NOISF2= 2.8
##$NSP= 1
##$NTH_PI= 0
##$NZP= 0
##$OFFSET= 15.70392
##$PC= 1
##$PHC0= -11562.24
##$PHC1= 13.60099
##$PH_mod= 1
##$PKNL= yes
##$PPARMOD= 0
##$PSCAL= 0
##$PSIGN= 0
##$REVERSE= no
##$SF= 200.130013532006
##$SI= 16384
##$SIGF1= 3
##$SIGF2= 2
##$SINO= 400
##$SIOLD= 16384
##$SREGLST= <1H.CDCl3>
##$SSB= 0
##$STSI= 0
##$STSR= 0
##$SW_p= 3612.71676300578
##$SYMM= 0
##$S_DEV= 0
##$TDeff= 0
##$TDoff= 0
##$TI= <>
##$TILT= no
##$TM1= 0
##$TM2= 0
##$TOPLEV= 0
##$USERP1= <user>
##$USERP2= <user>
##$USERP3= <user>
##$USERP4= <user>
##$USERP5= <user>
##$WDW= 1
##$XDIM= 8192
##$YMAX_p= 0
##$YMIN_p= 0
$$ End of Bruker specific parameters
$$ ---------------------------------
##NTUPLES= NMR FID
##VAR_NAME=  TIME,          FID/REAL,        FID/IMAG
##SYMBOL=    X,             R,               I
##VAR_TYPE=  INDEPENDENT,   DEPENDENT,       DEPENDENT
##VAR_FORM=  AFFN,          ASDF,            ASDF
##VAR_DIM=   8192,          8192,            8192
##UNITS=     SECONDS,       ARBITRARY UNITS, ARBITRARY UNITS
##FACTOR=    0.0002496,     1,               1
##FIRST=     0,             0,               0
##LAST=      2.0444736,     0,               0
##MIN=       0,             -151004,         0
##MAX=       2.0444736,     152253,          0
$$ Real data points
##PAGE= N=1
##DATA TABLE= (X++(R..R)), XYDATA
$$ plain form
0 0 0 0 0 0 0 0 0 0 0 0 0 0 0 8 -8 8 -8 16 -16 16 -24 25 -32 40 -47 54 -62 72 -81 96 -109 124 -141 160 -180
35 -180 204 -230 258 -290 322 -360 399 -443 493 -545 602 -666 735 -809 891 -982 1079 -1190
53 -1190 1312 -1449 1600 -1771 1966 -2194 2456 -2768 3140 -3602 4182 -4943 5986 -7516 9979
68 9979 -14806 42655 -120338 21368 99466 -151004 102018 3182 -97344 125062 -67650
79 -67650 -35878 119292 -123093 43497 61533 -125666 105033 -10629 -95816 141948 -84186
90 -84186 -38336 130762 -123497 24893 82532 -124429 82843 8408 -87516 111012 -63482
101 -63482 -29731 104004 -108824 38356 59665 -116687 95557 -5495 -92036 125067 -68032
112 -68032 -41710 118092 -104658 18681 74186 -108376 71200 6953 -79629 101088 -57510
$$ packed form
0@%%%%%%%%%%%%%Qj6J6j6K4l2L2m0M9n7P2q7J01j16J34j53J77k05K33k65L01l40
35a80L84m34M88n48O12o82P59q42R36j038J147j268J401j544J700j873K061k269
53a190K502k761L049l371L737m160M650n224N908o742P784r125J0929j3502J7495
68I979k4785N7461j62993J41706P8098k50470K53022r8836j00526K22406j92712
79f7650L1772J55170k42385J66590J8036j87199K30699j15662q5187K37764k26134
90h4186M5850J69098k54259J48390N7639k06961K07272p4435r5924J98528j74494
101f3482L3751J33735k12828J47180K1309j76352K12244j01052q6541K17103j93099
112f8032K6322J59802k22750J23339N5505j82562J79576o4247q6582J80717j58598
$$ plain form
123 -57510 -27200 96966 -99645 33640 58216 -111113 84951 1104 -88949 112859 -53347
134 -53347 -43273 105533 -88113 12065 64385 -94404 62319 6497 -70696 91432 -50148
145 -50148 -26788 88197 -89311 25672 56254 -99927 72435 8183 -82280 97167 -40117
156 -40117 -43584 90355 -72846 7777 56757 -81153 55123 6289 -64777 83013 -44816
167 -44816 -28519 83140 -79953 19356 56832 -91930 61944 13177 -78612 85193 -31463
178 -31463 -42250 81728 -63243 6157 51893 -74688 50740 5755 -62605 78662 -39621
189 -39621 -29586 80267 -72848 13161 56380 -85105 51591 17004 -72124 74178 -23780
200 -23780 -38726 71492 -55170 4868 45635 -67768 46263 6769 -58131 72055 -33684
$$ packed form
123e7510L0310J24166j96611J33285K4576j69329J96064q3847r0053K01808j66206
134e3347J0074J48806j93646J00178N2320j58789J56723n5822p7193J62128j41580
145e0148K3360J14985j77508J14983L0582j56181J72362o4252r0463J79447j37284
156d0117l467J33939j63201Q0623M8980j37910J36276m8834p1066J47790j27829
167d4816J6297J11659j63093R9309L7476j48762J53874m8767r1789J63805j16656
178c1463j0787J23978j44971O9400M5736j26581J25428m4985o8360J41267j18283
189c9621J0035J09853j53115Q6009M3219j41485J36696l4587q9128J46302r7958
200b3780j4946J10218j26662O0038M0767j13403J14031l9494o4900J30186j05739
$$ plain form
211 -33684 -30413 74052 -64466 6833 54225 -75275 42465 19637 -64661 63300 -18923
222 -18923 -35283 62765 -49816 5026 42756 -63291 43354 8278 -57104 67457 -29366
233 -29366 -32525 71187 -57972 2690 53978 -69485 35836 20986 -60415 56287 -16473
244 -16473 -32123 58724 -46992 5334 41348 -61899 40572 10254 -56975 63423 -23654
255 -23654 -33760 67360 -50826 -2017 51239 -62051 28729 20984 -53424 49419 -14048
266 -14048 -28521 53249 -43726 4319 39479 -58503 36236 13334 -54392 57265 -18020 -34514
278 -34514 61658 -43776 -5631 48085 -54688 24113 20429 -48247 44735 -13676 -26701 50980
290 50980 -42579 3402 40736 -57162 32919 16344 -54322 53035 -13906 -35630 58374 -38598
$$ packed form
211c3684L271J04465j38518P1299M7392j29500J17740k2828q4298J27961q2223
222a8923j6360R8048j12581N4842L7730j06047J06645l5076o5382J24561r6823
233b9366l159J03712j29159O0662N1288j23463J05321j4850q1401J16702p2760
244a6473j5650R0847j05716N2326L6014j03247J02471l0318o7229J20398q7077
255b3654j0106J01120j18186M8809N3256j13290R0780p745p4408J02843o3467
266a4048j4473Q1770r6975M8045L5160r7982R4739k2902o7726J11657p5285j6494
278c4514R6172j05434L8145N3716j02773P8801l684o8676R2982n8411j3025P7681
290E0980r3559M5981L7334r7898R0081j6575p0666J07357o6941k1724R4004r6972
$$ plain form
302 -38598 -7410 46005 -50188 21117 19076 -45065 42285 -13653 -25544 50400 -40872 1328
314 1328 41466 -54934 27868 19054 -51941 46980 -8870 -34410 52568 -32645 -8949 41620
326 41620 -44301 17855 17451 -40616 39196 -12347 -24835 48017 -37770 -1791 41323 -50835
338 -50835 22524 21422 -48377 41107 -5333 -33282 47538 -28587 -9436 38721 -40805 16947
350 16947 16628 -39440 38294 -11609 -26155 48028 -35594 -4689 42440 -47988 18632 22798 -46424
363 -46424 37129 -3062 -32243 44129 -25528 -9217 36290 -38231 15986 15652 -38272 36969
375 36969 -9877 -27090 46632 -31311 -8036 41099 -42798 13697 22804 -41823 31841 -875
387 -875 -29608 39419 -22104 -9317 33102 -34757 14402 15152 -36591 34905 -7352 -28147 44353
$$ packed form
302c8598L1188N3415r6193P1305k041o4141Q7350n5938j1891P5944r1272M2200
314A328M0138r6400Q2802q814p0995R8921n5850k5540Q6978q5213K3696N0569
326D1620q5921O2156m04n8067P9812n1543j2488P2852q5787L5979M3114r2158
338e0835P3359j102o9799Q9484m6440k7949Q0820p6125J9151M8157p9526N7752
350A6947l19n6068P7734m9903j4546P4183q3622L0905M7129r0428O6620M166o9222
363d6424Q3553m0191k9181P6372o9657J6311M5507p4521N4217l34n3924P5241
375C6969m6846j7213P3722p7943K3275M9135q3897N6495R107o4627P3664l2716
387h75k8733O9027o1523J2787M2419o7859M9159P50n1743P1496m2257k0795P2500
$$ plain form
400 44353 -27033 -11073 39654 -38119 10167 22597 -38482 28793 -82 -28424 37240 -20669
412 -20669 -9380 32163 -33750 14005 15715 -37074 34067 -5361 -29851 43478 -23728 -13518
424 -13518 38669 -34339 7555 21796 -35583 26201 190 -26651 35043 -19378 -9168 30948
436 30948 -32080 12450 16147 -35842 31294 -2660 -29839 40035 -19197 -14964 35447 -29493
448 -29493 5032 20180 -31588 23149 311 -24445 32583 -18121 -9102 29901 -30659 11008
460 11008 17132 -35201 28730 -44 -29913 37242 -16182 -15504 33395 -27018 4263 19131 -30060
473 -30060 22466 46 -23854 32242 -18026 -9210 30333 -30800 9831 18767 -35202 26407
485 26407 2392 -29683 34311 -13399 -15390 30619 -24467 3880 17684 -28120 21169 224
$$ packed form
400D4353p1386J5960N0727p7773M8286J2430o1079O7275k8875k8342O5664n7909
412b0669J1289M1543o5913M7755J710n2789P1141l9428k4490P3329o7206J0210
424a3518N2187p3008M1894J4241n7379O1784k6011k6841O1694n4421J0210M0116
436C0948o3028M4530L697n1989O7136l3954k7179O9874n9232M233N0411o4940
448b9493L4525J5148n1768N4737k2838k4756N7028n0704R019L9003o0560M1667
460A1008O124n2333O3931k8774k9869O7155n3424O78M8899o0413L1281J4868m9191
473c0060N2526k2420k3900N6096n0268Q816L9543o1133M0631Q936n3969O1609
485B6407k4015l2075O3994m7710j991M6009n5086K8347J3804m5804M9289k0945
$$ plain form
497 224 -22812 30556 -16703 -9647 29504 -28764 7534 19622 -33032 22474 4734 -27980 29746
510 29746 -10432 -14256 27236 -22023 3908 16351 -26736 20209 517 -22612 29620 -15379
522 -15379 -10403 29330 -27434 5826 20377 -31983 20072 6008 -26775 27539 -9435 -13121
534 -13121 25710 -21775 4533 15701 -26958 20506 1013 -23096 29467 -14289 -11447 29123
546 29123 -25942 3827 20654 -29798 17417 6816 -24660 24562 -8362 -11910 23424 -20494
558 -20494 4517 15204 -25766 19065 2140 -22804 27312 -11973 -12471 27593 -22613 1621
570 1621 20076 -26624 14452 6942 -22471 22020 -7761 -10853 22491 -19778 4178 15451 -25584
583 -25584 17893 3135 -23161 26461 -10325 -13278 27201 -21002 163 19731 -25153 13043
$$ packed form
497B24k3036N3368m7259P056L9151n8268L6298J2088n2654N5506j7740l2714N7726
510B9746m0178l824M1492m9259K5931J2443m3087M6945j9692k3129N2232m4999
522a5379M976L9733n6764L3260J4551n2360N2055j4064l2783N4314l6974l686
534a3121L8831m7485K6308J1168m2659M7464j9493k4109N2563m3756K842M0570
546B9123n5065K9769J6827n0452M7215j0601l1476M9222l2924l548L5334m3918
558b0494K5011J0687m0970M4831j6925k4944N0116l9285m98M0064n0206K4234
570A621J8455m6700M1076p510k9413M4491k9781l092L3344m2269K3956J1273m1035
583b5584M3477j4758k6296M9622l6786k953M0479m8203K1165J9568m4884L8196
$$ plain form
595 13043 6695 -21027 21457 -8008 -10291 22453 -20046 3582 15968 -25444 16765 4538
607 4538 -22879 24909 -8475 -13896 25509 -18548 -1295 18648 -22202 11278 6350 -18972 19580
620 19580 -7680 -9952 21367 -18702 2496 16290 -23706 14488 5688 -21994 22295 -6526
632 -6526 -14025 23616 -15932 -2014 17467 -20161 10151 5568 -18041 19088 -7719 -9912 21853
645 21853 -18268 1576 16901 -23529 13149 6474 -21856 21357 -5276 -13995 22746 -14800
657 -14800 -2461 16372 -19226 9942 5032 -17329 19277 -7510 -10340 21768 -17554 74
669 74 17076 -22064 11287 7506 -20508 19065 -3710 -13752 20266 -12658 -2790 14848 -16994
682 -16994 9343 4625 -16490 18214 -6864 -11023 21093 -15653 -1341 17122 -20023 9308
$$ packed form
595A3043o348k7722M2484k9465k283L2744m2499K3628J2386m1412M2209j2227
607D538k7417M7788l3384n421L9405m4057J7253J9943m0850L3480m928k5322L8552
620A9580k7260k272L1319m0069K1198J3794l9996L8194q800k7682M4289k8821
632f526p499L7641l9548J3918J9481l7628L0312m583k3609L7129k6807k193L1765
645B1853m0121J9844J5325m0430L6678o675k8330M3213k6633q719L6741l7546
657a4800J2339J8833l5598K9168m910k2361L6606k6787k830L2108l9322J7628
669G4J7002l9140L3351l781k8014L9573k2775j0042L4018l2924R868J7638l1842
682a6994K6337m718k1115L4704k5078m159L2116l6746J4312J8463l7145K9331
$$ plain form
694 9308 7784 -19423 17056 -2923 -13115 19053 -11563 -2388 14074 -16678 9387 4172 -16947
707 -16947 18600 -6370 -11676 21606 -14777 -2417 17130 -19362 8101 7907 -18530 16184 -2374
720 -2374 -12321 18029 -11218 -2184 13128 -16505 9456 4513 -16847 18166 -5009 -12406 20383
733 20383 -12924 -3784 16229 -16979 6585 7969 -16584 14153 -1861 -11490 16091 -10319 -1892
746 -1892 12599 -15597 8997 5081 -16890 16811 -3730 -12985 19148 -10982 -4203 15528 -15562
759 -15562 5867 7445 -16010 13432 -1954 -10878 16018 -10287 -1427 12728 -16285 8856 5611
772 5611 -17692 16466 -2370 -13237 18438 -9745 -4513 14463 -14787 5447 7019 -15122 13055
785 13055 -1592 -10387 15235 -9936 -1793 12356 -15759 7939 6622 -16991 14750 -678 -13167
$$ packed form
694I308j524k7207L6479j9979j0192L2168l0616R175J6462l0752K6065n215k1119
707a6947L5547k4970n306L3282l6383J2360J9547l6492K7463j94k6437L4714j8558
720b374r947L0350k9247R034J5312k9633K5961m943k1360L5013k3175p397L2789
733B0383l3307R140K0013l3208K3564J384k4553L0737j6014r629K7581k6410Q427
746a892J4491k8196K4594l916k1971L3701k0541r255L2133l0130O779J9731l1090
759a5562K1429J578k3455K9442j5386q924K6896k6305Q860J4155k9013K5141l245
772E611k3303L4158j8836j0867L1675k8183N232J8976k9250K0234J572k2141K8177
785A3055j4647q795K5622k5171Q143J4149k8115K3698j317k3613L1741j5428j2489
$$ plain form
798 -13167 16179 -7896 -4889 12992 -12824 4941 6702 -14023 11999 -1363 -10354 14402 -9224
811 -9224 -2151 12613 -14902 6991 7292 -16787 13290 159 -13058 15147 -6893 -4507 12484
824 12484 -12456 4939 6243 -14203 12039 -1433 -10362 14913 -9030 -2537 12993 -14944 5965
837 5965 7749 -16422 12268 1044 -12324 14120 -6214 -4481 11493 -11804 4479 6048 -13281
850 -13281 11492 -920 -10108 14104 -8319 -3433 12677 -13558 4475 8313 -14744 10344 1648
863 1648 -11421 12322 -5558 -4209 10765 -10883 4344 6115 -12819 10780 -810 -10235 13779
876 13779 -7839 -3811 13046 -12829 3621 8456 -14234 9326 1544 -10744 11988 -5636 -3584
889 -3584 10833 -11208 4287 6064 -13100 10635 -525 -10265 13918 -7218 -4366 12888 -12107
$$ packed form
798a3167K9346k4075L007J7881k5816J7765J761k0725K6022j3362q991K4756k3626
811i224P073J4764k7515K1893L01k4079L0077j3131j3217K8205k2040K386J6991
824A2484k4940J7395J304k0446K6242j3472q929K5275k3943O493J5530k7937K0909
837E965J784k4171K8690j1224j3368K6444k0334J733J5974k3297J6283J569j9329
850a3281K4773j2412r188K4212k2423M886J6110k6235J8033L838k3057K5088q696
863A648j3069K3743j7880J349J4974k1648J5227J771j8934K3599j1590r425K4014
876A3779k1618M028J6857k5875J6450M835k2690K3560p782j2288K2732j7624K052
889c584J4417k2041J5495J777j9164K3735j1160r740K4183k1136K852J7254k4995
$$ plain form
902 -12107 2410 8403 -12960 8151 1844 -9509 10972 -5373 -3472 10094 -10721 3707 6305
915 6305 -12303 9744 408 -10134 12664 -6063 -5083 12057 -10433 1485 8171 -11379 7108
928 7108 1571 -8861 10199 -5424 -3249 10121 -10458 3625 6645 -12355 9235 590 -10422
941 -10422 12375 -5464 -5187 11883 -9740 1335 7525 -10987 7026 933 -8424 10542 -5620
954 -5620 -3059 10385 -10573 3132 6716 -12219 8656 1178 -10133 11667 -4407 -5363 10760
967 10760 -8609 741 6725 -9699 6589 837 -7770 10031 -5279 -3517 9933 -9724 2242
980 2242 6916 -11177 7596 1831 -9713 10342 -3650 -5366 9811 -7603 836 6189 -9103
993 -9103 6679 420 -7971 10101 -5269 -3767 10291 -9374 1979 7073 -11031 7152 1781
$$ packed form
902a2107J4517N993k1363K1111o307j1353K0481j6345J901J3566k0815J4428K598
915F305j8608K2047r336j0542K2798j8727R80J7140k2490J1918O686j9550J8487
928G108n537j0432J9060j5623K175J3370k0579J4083L020j9000K1590q645j1012
941a0422K2797j7839K77J7070k1623J1075O190j8512J8013o093r357J8966j6162
954e620K561J3444k0958J3705L584j8935K0875p478j1311K1800j6074r56J6123
967A0760j9369R350N984j6424J6288n752q607J7801j5310J762J3450j9657J1966
980B242M674j8093J8773n765j1544K0055j3992j716J5177j7414Q439N353j5292
993i103J5782o259q391J8072j5370J502J4058j9665J1353N094j8104J8183n371
$$ plain form
1006 1781 -9594 10038 -3382 -4989 9462 -7359 1111 5582 -9181 6838 285 -7979 10252
1019 10252 -4805 -4043 10107 -8711 1183 6809 -10244 6279 2193 -8841 8948 -2631 -4737
1032 -4737 8300 -6631 968 5111 -8539 6549 664 -7892 9620 -4045 -4591 9448 -7687
1045 -7687 674 6655 -9376 5690 2301 -8411 8253 -2568 -4475 7945 -6475 1392 5024
1058 5024 -8748 6794 692 -8369 9631 -3767 -4739 9452 -7328 612 6497 -9207 5428
1071 5428 2118 -8158 8025 -2417 -4102 7640 -6386 1489 4835 -8819 6473 1117 -8302
1084 -8302 9130 -2853 -4993 8729 -6318 -29 6023 -8230 4666 2288 -7381 7157 -2042
1097 -2042 -3881 6969 -6059 1291 4883 -8484 6004 1641 -8221 8455 -2215 -5107 8134
$$ packed form
1006A781j1375J9632j3420j607J4451j6821Q470M471j4763J6019o553q264J8231
1019A0252j5057P62J4150j8818R894N626j7053J6523m086j1034J7789j1579k106
1032d737J3037j4931P599M143j3650J5088n885q556J7512j3665n46J4039j7135
1045g687Q361N981j6031J5066l389j0712J6664j0821j907J2420j4420P867L632
1058E024j3772J5542o102r061J8000j3398r72J4191j6780P940N885j5704J4635
1071E428l310j0276J6183j0442j685J1742j4026P875L346j3654J5292n356r419
1084h302J7432j1983k140J3722j5047O289O052j4253J2896k378r669J4538r199
1097b042j839J0850j3028P350L592j3367J4488m363r862J6676j0670k892J3241
$$ plain form
1110 8134 -5766 -38 5825 -7776 4479 2053 -7104 7041 -2395 -3642 7156 -6406 1495
1123 1495 5224 -8814 5910 1935 -8432 8078 -1954 -4948 7841 -5492 -31 5577 -7480
1136 -7480 4258 1908 -6770 6779 -2248 -3414 6985 -6236 1139 5452 -8539 4919 2595
1149 2595 -7924 7000 -1088 -4728 6874 -4736 -211 5105 -6862 3880 1988 -6347 6332
1162 6332 -2112 -3376 6866 -6097 727 5748 -8224 4376 2931 -7656 6390 -954 -4367
1175 -4367 6494 -4836 178 5002 -7011 4133 1802 -6484 6557 -2302 -3476 7138 -6118
1188 -6118 577 5938 -8112 3983 3083 -7306 5841 -813 -3967 6075 -4616 215 4678 -6715
1202 -6715 3936 1848 -6345 6197 -1816 -3626 6804 -5374 -101 5805 -7196 3061 3143 -6521
$$ packed form
1110H134j3900N728N863j3601J2255k426r157J4145r436j247J0798j3562P901
1123A495L729j4038J4724l975j0367J6510j0032k994J2789j3333N461N608j3057
1136g480J1738k350q678J3549r027j166J0399j3221P375M313j3991J3458k324
1149B595j0519J4924q088l640J1602j1610M525N316j1967J0742j892q335J2679
1162F332q444j264J0242j2963O824N021j3972J2600j445j0587J4046p344l413
1175d367J0861j1330N014M824j2013J1144k331q286J3041q859j174J0614j3256
1188f118O695N361j4050J2095r00j0389J3147o654l154J0042j0691M831M463j1393
1202f715J0651k088q193J2542q013j810J0430j2178N273N906j3001J0257Q2r664
$$ plain form
1216 -6521 5079 -612 -3671 5594 -4305 183 4541 -6500 3739 1987 -6288 6041 -1665 -3871
1230 -3871 6836 -5072 -435 5705 -6824 2930 2911 -6256 5126 -929 -3464 5787 -4612 257
1244 257 4689 -6628 3786 1977 -6361 6146 -1551 -4083 6784 -4653 -750 5535 -6247 2515
1258 2515 2750 -5680 4758 -970 -3329 5588 -4257 -52 4600 -6140 3262 2187 -6086 5537
1272 5537 -1033 -4177 6322 -3912 -1167 5210 -5493 2074 2495 -5282 4575 -1031 -3306 5611
1286 5611 -4185 -158 4741 -6149 3073 2307 -6104 5520 -939 -4272 6326 -3759 -1173 5025
1300 5025 -5424 2239 2258 -5229 4846 -1210 -3327 5802 -4284 -341 4826 -6052 2882 2456 -6048
1315 -6048 5246 -544 -4374 5824 -3216 -1346 4666 -4837 1978 2142 -4880 4555 -1023 -3473 5533
$$ packed form
1216f521J1600n691l059R265r899M488M358j1041J0239j752q275J2329p706k206
1230c871J0707j1908M637O140j2529R754j9r167J1382o055k535R251j0399M869
1244B57M432j1317J0414j809q338J2507p697k532J0867j1437L903O285j1782Q762
1258B515K35q430J0438n728k359Q917r845M205M652j0740R402j075q273J1623
1272E537o570l144J0499j0234K745O377j0703P567M21p777R857n606k275Q917
1286E611r796M027M899j0890R222p66q411J1624o459l333J0598j0085K586O198
1300E025j0449P663J9p487J0075o056k117R129j0086L943N167j0878Q934m26q504
1315f048J1294n790l830J0198r040J870O012r503O815J64p022R435n578k450R006
$$ plain form
1330 5533 -3778 -698 4800 -5570 2367 2696 -5824 4615 -112 -4297 5343 -2750 -1290 4353 -4603
1345 -4603 2089 1925 -5050 4761 -967 -3652 5746 -3718 -811 4935 -5642 2286 2699 -5863 4662
1360 4662 -61 -4218 5274 -2761 -1117 4104 -4753 2354 1859 -5161 4915 -822 -3828 5682 -3476
1375 -3476 -1161 4824 -5208 1925 2843 -5486 4098 285 -4014 4596 -2429 -1059 3843 -4417 2228
1390 2228 1983 -5136 4568 -432 -4077 5332 -2888 -1381 4695 -4745 1635 2829 -5296 3743 265
1405 265 -3788 4522 -2491 -817 3854 -4706 2401 2052 -5517 4666 -239 -4149 5387 -2829 -1369
1420 -1369 4594 -4816 1621 2704 -5186 3797 241 -3580 4463 -2606 -720 3807 -4856 2302 2362
1435 2362 -5453 4323 187 -4142 4876 -2375 -1561 4234 -4274 1385 2758 -4772 3345 366 -3449
$$ packed form
1330E533r311L080N498j0370P937L29q520J0439m727m185R640q093J460N643q956
1345d603O692j64o975R811n728k685R398r464K907N746j0577P928M13q562J0525
1360D662m723m157R492q035J644N221q857P107m95p020J0076n737l006R510r158
1375c476K315N985j0032P133R18q329R584l813m299Q610p025J370M902q260O645
1390B228k45p119R704n000l645R409q220J507O076r440O380J194q125R039l478
1405B65m053Q310p013J674M671q560P107l49p569J0183m905l910R536q216J460
1420a369N963r410O437J083p890Q983l556l821Q043p069J886M527q663P158O0
1435B362p815R776m136m329R018p251Q14N795q508N659J373p530Q117k979l815
$$ plain form
1450 -3449 4071 -2440 -791 3845 -4614 2053 2628 -5379 3857 454 -4166 4530 -2075 -1429 4137
1465 4137 -4183 1420 2609 -4818 3358 144 -3402 4345 -2593 -720 4057 -4881 1939 2740 -5484
1480 -5484 3785 550 -3979 4529 -2088 -1376 4008 -4208 1302 2551 -4627 3328 251 -3271 4229
1495 4229 -2522 -940 4046 -4645 1500 3007 -5038 3239 844 -3833 3969 -1790 -1497 3772 -3770
1510 -3770 1127 2605 -4322 3032 247 -3289 4086 -2438 -1098 4231 -4401 1241 3080 -4896 2935
1525 2935 747 -3685 3932 -1878 -1246 3920 -3924 1162 2502 -4444 3150 94 -3272 4398 -2506
1540 -2506 -1140 4394 -4469 960 3101 -4749 2757 850 -3411 3815 -1841 -1282 3734 -3829 956
1555 956 2516 -4213 2972 362 -3273 4113 -2208 -1523 4252 -3956 492 3220 -4193 2304 952
$$ packed form
1450c449P520o511J649M636q459O667N75q007R236l403m620Q696o605O46N566
1465D137q320N603J189p427Q176l214l546P747o938J873M777q938O820Q01q224
1480e484R269l235m529Q508o617P12N384q216N510J249p178P955l077l522P500
1495D229o751J582M986q691O145J507q045Q277k395m677P802n759K93N269p542
1510c770M897J478o927P354k785l536P375o524J340N329q632N642J839p976P831
1525B935k188m432P617n810O32N166p844N086J340o946P594l056l366P670o904
1540b506J366N534q863N429K141p850P506j907m261P226n656N59N016p563M785
1555I56J560o729P185k610l635P386o321O85N775q208M448K728p413O497j352
$$ plain form
1570 952 -3247 3396 -1728 -1320 3641 -3593 951 2626 -4180 2847 399 -3440 4087 -2069 -1631 4348
1586 4348 -3698 455 3049 -4165 2305 699 -3158 3583 -1865 -1151 3798 -3758 978 2549 -4363
1601 -4363 2894 458 -3495 4155 -1779 -1767 4109 -3468 248 2843 -3864 2199 753 -2948 3478
1616 3478 -1696 -1347 3579 -3489 715 2607 -4073 2638 814 -3503 3703 -1377 -2012 3759 -2932
1631 -2932 120 2683 -3490 2152 625 -3005 3411 -1683 -1444 3655 -3337 699 2693 -4079 2525
1646 2525 757 -3582 3675 -1285 -1893 3699 -2859 325 2439 -3639 2302 458 -3065 3608 -1599
1661 -1599 -1470 3701 -3274 502 2603 -4011 2350 934 -3440 3459 -931 -1918 3341 -2615 136
1676 136 2293 -3353 2151 663 -2995 3374 -1265 -1734 3434 -2909 227 2673 -3640 2047 1161 -3321
$$ packed form
1570I52m199O643n124M08M961p234M544J675o806P027k448l839P527o156M38N979
1586D348q046M153K594p214O470j606l857O741n448P14M949p556M736J571o912
1601d363P257k436l953P650n934J2N876p577L716K595o707O063j446l701O426
1616C478n174L49M926p068M204J892o680O711j824m317P206n080o35N771o691
1631b932L052K563o173N642j527l630O416n094K39N099o992M036J994o772O604
1646B525j768m339P257m960o08N592o558L184K114o078N941j844l523O673n207
1661a599J29N171o975L776K101o614O361j416m374O899m390r87N259n956K751
1676A36K157n646N504j488l658O369m639m69N168o343L136K446o313N687q86m482
$$ plain form
1692 -3321 3045 -782 -1901 3098 -2435 279 2287 -3330 2213 661 -3169 3293 -1220 -1724 3484
1707 3484 -2854 302 2660 -3708 2002 1047 -3336 3003 -758 -1693 3072 -2479 405 2213 -3497
1722 -3497 2165 743 -3180 3242 -959 -1754 3331 -2637 44 2581 -3491 1699 1301 -3081 2655
1737 2655 -448 -1672 2737 -2302 200 2204 -3282 1948 1041 -3129 2910 -686 -1903 3075 -2368
1752 -2368 -78 2623 -3251 1536 1344 -2994 2433 -573 -1589 2728 -2367 362 2304 -3421 1975
1767 1975 1060 -3238 2868 -685 -1822 3136 -2330 -13 2579 -3250 1460 1239 -2904 2417 -554
1782 -554 -1425 2746 -2367 268 2335 -3407 1680 1269 -3120 2604 -339 -1862 2884 -2038 -321 2471
1798 2471 -2926 1119 1387 -2604 2133 -433 -1441 2613 -2279 42 2493 -3239 1403 1516 -3013
$$ packed form
1692c321O366l827j119M999n533K714K008n617N543j552l830O462m513n04N208
1707C484o338L156K358o368N710r55m383O339l761r35M765n551K884J808n710
1722c497N662j422l923O422m201p95N085n968K681K537o072N190l98m382N736
1737B655l103j224M409n039K502K004n486N230r07m170O039l596j217M978n443
1752b368K290K701n874M787j92m338N427l006j016M317n095K729J942n725N396
1767A975r15m298O106l553j137M958n466K317K592n829M710k21m143N321k971
1782e54q71M171n113K635K067n742N087m11m389N724k943j523M746m922J717K792
1798B471n397M045K68l991M737k566j008M054m892K321K451n732M642J13m529
$$ plain form
1813 -3013 2296 -237 -1847 2698 -1966 -254 2473 -2838 1188 1263 -2611 2192 -634 -1432 2787 -2367
1829 -2367 92 2619 -3253 1316 1478 -2956 2221 -257 -1704 2683 -1912 -212 2374 -2784 1074
1844 1074 1183 -2521 2139 -521 -1446 2768 -2162 -230 2608 -2975 912 1600 -2663 1894 -33 -1664
1860 -1664 2411 -1683 -382 2267 -2542 927 1261 -2395 2048 -420 -1583 2694 -1979 -413 2609
1875 2609 -2742 812 1558 -2519 1840 -180 -1603 2446 -1752 -278 2278 -2561 1034 1148 -2466
1890 -2466 2129 -474 -1665 2766 -1890 -488 2567 -2582 687 1408 -2397 1765 -182 -1554 2409
1905 2409 -1605 -416 2189 -2380 795 1188 -2342 1951 -249 -1707 2602 -1532 -769 2406 -2211
1920 -2211 419 1413 -2136 1583 -64 -1536 2259 -1452 -520 2142 -2225 749 1212 -2295 1913 -203
$$ packed form
1813c013N309k533j610M545m664J712K727n311M026P5l874M803k826p98M219n154
1829b367K459K527n872M569J62m434N177k478j447M387m595J700K586n158L858
1844A074J09l704M660k660r25M214m930J932K838n583L887O88m263M557j927j631
1860a664M075m094J301K649m809L469L34l656M443k468j163M277m673J566L022
1875B609n351L554P46m077M359k020j423M049m198J474K556m839L595J14l614
1890b466M595k603j191M431m656J402L055n149L269P21l805M162j947j372L963
1905B409m014J189K605m569L175L93l530M293k200j458M309m134P63L175m617
1920b211K630R94l549L719j647j472L795l711R32K662m367K974M63l507M208k116
$$ plain form
1936 -203 -1761 2526 -1467 -742 2325 -2116 531 1265 -2123 1683 -227 -1522 2317 -1530 -453 2137
1952 2137 -2243 781 1178 -2328 1867 -153 -1763 2431 -1307 -773 2194 -1946 422 1224 -2010 1515
1968 1515 -75 -1506 2157 -1273 -565 2052 -2048 577 1293 -2219 1612 160 -1801 2152 -964
1983 -964 -864 1999 -1753 361 1197 -1939 1474 -20 -1526 2100 -1238 -583 2028 -2075 591 1311
1999 1311 -2271 1585 159 -1773 2049 -997 -712 1892 -1802 538 1101 -2019 1564 -47 -1523
2014 -1523 2092 -1203 -560 1989 -2008 552 1346 -2193 1414 326 -1696 1831 -772 -700 1726 -1639
2030 -1639 439 1111 -1934 1380 141 -1574 1902 -948 -693 1921 -1789 330 1401 -2063 1167
2045 1167 451 -1606 1634 -715 -606 1636 -1655 495 1115 -1991 1394 155 -1577 1903 -953 -650
$$ packed form
1936b03j558M287l993P25L067m441K647P34l388L806j910j295L839l847J077K590
1952B137m380L024L97l506M195k020j610M194l738N34K967m140K368Q02l234L525
1968A515j590j431L663l430P08K617m100K625P16l512L831j452j961L953l116
1983i64J00K863l752K114Q36l136L413j494j506L626l338O55K611m103K666P20
1999A311l582L856j426j932L822l046K85K604l694K340N63l120L583j611j476
2014a523L615l295O43K549l997K560P94l539L607j088k022L527k603P2K426l365
2030a639K078O72l045L314j239j715L476k850K55K614l710K119J071l464L230
2045A167p16k057L240k349J09K242l291K150O20l106L385j239j732L480k856L03
$$ plain form
2061 -650 1903 -1807 363 1347 -2018 1175 358 -1468 1625 -823 -509 1642 -1733 535 1163 -1999
2077 -1999 1320 276 -1548 1757 -831 -718 1802 -1645 191 1387 -1828 922 461 -1373 1417
2092 1417 -690 -552 1574 -1609 357 1288 -1897 1056 421 -1516 1557 -657 -739 1740 -1497 119
2108 119 1358 -1731 844 410 -1277 1422 -776 -467 1646 -1684 343 1296 -1900 1040 401 -1416
2124 -1416 1570 -710 -632 1701 -1554 150 1288 -1681 852 361 -1217 1427 -780 -518 1621 -1614
2140 -1614 201 1349 -1763 867 510 -1381 1363 -551 -746 1587 -1317 -36 1309 -1474 660
2155 660 423 -1184 1278 -659 -603 1633 -1427 61 1398 -1636 687 502 -1333 1308 -533 -702
2171 -702 1599 -1267 -12 1223 -1461 723 303 -1152 1401 -738 -579 1690 -1461 11 1309 -1605
$$ packed form
2061f50K553l710K170R84l365L193q17j826L093k448L14K151l375K268O28l162
2077a999L319j044j824L305k588J13K520l447J836J196l215K750m61j834K790
2092A417k107J38K126l183J966R31l185K953o35j937L073k214q2K479l237J616
2108A19J239l089K575m34j687K699k198L09K113l330K027R53l196K940o39j817
2124a416K986k280P8K333l255J704J138k969K533m91j578K644k207K62K139l235
2140a614J815J148l112K630l57j891K744j914j95K333k904J281J345k783K134
2155F60k37j607K462j937N6K236l060J488J337l034K323j85j835K641j841j69
2171g02K301k866J255J235k684K184m20j455K553k139J59K269l151J472J298k914
$$ plain form
2187 -1605 702 474 -1257 1332 -544 -706 1536 -1246 -70 1181 -1368 695 346 -1129 1345 -645
2203 -645 -733 1623 -1278 -171 1357 -1403 532 570 -1210 1141 -395 -794 1450 -1036 -152 1176 -1260
2220 -1260 608 362 -1181 1306 -546 -805 1654 -1138 -219 1323 -1339 496 461 -1157 1191 -441
2236 -441 -697 1468 -1088 -63 1075 -1373 709 312 -1220 1396 -519 -804 1619 -1094 -234 1218
2252 1218 -1284 517 478 -1119 1161 -377 -741 1374 -1004 -143 1090 -1267 656 457 -1229 1260
2268 1260 -317 -964 1451 -871 -336 1181 -1119 434 496 -1102 1065 -331 -792 1341 -908 -127
2284 -127 1101 -1267 618 437 -1304 1202 -275 -913 1407 -817 -233 1057 -1162 520 350 -1130
2300 -1130 1166 -352 -743 1370 -953 -101 1048 -1319 613 471 -1267 1201 -185 -889 1304 -770
$$ packed form
2187a605K307k28j731K589j876j62K242k782J176J251k549K063l49j475K474j990
2203f45q8K356k901J107J528k760J935L8j780K351j536l99K244k486Q84J328k436
2220a260J868k46j543K487j852k59K459k792R19J542k662J835l5j618K348j632
2236d41k56K165k556J025J138k448K082l97j532K616j915k85K423k713Q60J452
2252A218k502J801l9j597K280j538l64K115k378Q61J233k357J923j99j686K489
2268A260j577o47K415k322N35J517k300J553O2j598K167j396m61K133k249P81
2284a27J228k368J885j81j741K506j477o38K320k224N84J290k219J682j70j480
2300a130K296j518l91K113k323Q52J149k367J932j42j738K468j386p04K193k074
$$ plain form
2316 -770 -264 984 -1103 499 457 -1110 1075 -229 -825 1241 -838 -246 1073 -1165 485 593 -1215
2333 -1215 996 -58 -928 1139 -678 -268 1000 -1037 464 455 -1130 1010 -228 -808 1251 -805
2349 -805 -174 1080 -1197 469 539 -1217 970 -129 -778 1167 -734 -147 953 -1125 512 421 -1120
2366 -1120 1032 -189 -732 1218 -825 -194 1040 -1179 381 593 -1104 872 -25 -767 1042 -689
2382 -689 -237 934 -1051 381 561 -1040 864 -86 -777 1102 -725 -280 1072 -1041 305 666 -1051
2399 -1051 718 -19 -721 980 -672 -166 982 -1029 421 533 -1080 850 -134 -722 1138 -730
2415 -730 -187 1054 -1067 293 591 -1015 719 -93 -603 1039 -714 -131 931 -1081 351 537 -1036
2432 -1036 802 -73 -685 1081 -672 -307 1027 -987 158 652 -878 631 2 -605 945 -657
$$ packed form
2316g70N06J248k087J602m2j567K185j304n96K066k079N92J319k238J650J08j808
2333a215K211j054q70K067j817M10J268k037J501rj585K140j238n80K059k056
2349h05O31J254k277J666P0j756K187j099o49J945j901N87J100k078J637r1j541
2366a120K152j221n43J950k043O31J234k219J560K12j697J976q97p42J809j731
2382f89M52J171j985J432J80j601J904r50o91J879j827M45J352k113J346L61j717
2399a051J769p37p02J701j652N06J148k011J450J12j613J930r84n88J860j868
2415g30N43J241k121J360K98j606J734q12n10J642j753N83J062k012J432J86j573
2432a036J838q75o12J766j753L65J334k014J145M94j530J509o29o07J550j602
$$ plain form
2448 -657 -233 979 -972 256 647 -943 699 -11 -732 1029 -590 -342 1019 -857 159 592 -836
2465 -836 614 -129 -594 1001 -710 -185 1022 -981 260 575 -949 693 -98 -671 1030 -615 -274
2482 -274 973 -888 129 491 -809 658 -142 -553 1034 -663 -260 1002 -933 125 604 -852
2498 -852 618 23 -647 957 -519 -380 930 -746 57 540 -709 613 -64 -613 950 -603 -353
2515 -353 994 -814 67 619 -784 561 -20 -656 890 -510 -328 884 -738 133 444 -759 637
2532 637 -172 -637 1000 -591 -318 974 -772 90 497 -776 582 -56 -610 917 -478 -309 858
2549 858 -697 93 431 -711 621 -50 -637 953 -441 -425 875 -666 -21 520 -695 495 54
2566 54 -626 832 -373 -408 796 -601 42 467 -707 570 5 -694 876 -405 -438 844 -597 17
$$ packed form
2448f57M24J212j951J228L91j590J642p10p21J761j619K48J361j876J016M33j428
2465h36J450p43m65J595j711N25J207k003J241L15j524J642p91n73J701j645L41
2482b74J247j861J017L62j300J467q00m11J587j697M03J262j935J058M79j456
2498h52J470n95o70J604j476J39J310j676Q03M83j249J322o77n49J563j553K50
2515c53J347j808Q81N52j403J345n81o36J546j400J82J212j622Q71L11j203J396
2532F37q09m65J637j591K73J292j746Q62M07j273J358o38n54J527j395J69J167
2549H58j555P90L38j142J332o71n87J590j394J6J300j541O45N41j215J190m41
2566E4o80J458j205l5J204j397O43M25j174J277n65o99J570j281l3J282j441O14
$$ plain form
2584 17 482 -685 522 -23 -635 818 -400 -332 770 -628 138 407 -729 591 -30 -652 883 -364
2602 -364 -388 814 -559 39 443 -692 482 44 -612 768 -295 -372 714 -556 30 435 -705 491
2620 491 109 -691 767 -238 -471 728 -492 -61 483 -617 399 120 -608 694 -265 -386 689
2637 689 -540 50 483 -712 479 128 -692 706 -239 -416 700 -489 36 448 -641 447 74
2654 74 -585 696 -281 -309 694 -578 85 487 -722 440 157 -661 658 -176 -389 624 -476 -13
2672 -13 450 -638 355 143 -605 626 -194 -381 656 -527 -29 537 -680 330 271 -653 565 -97
2690 -97 -404 599 -446 -19 470 -611 372 168 -597 614 -205 -354 673 -520 15 527 -662 325
2708 325 208 -590 554 -173 -308 609 -489 40 457 -646 374 145 -594 601 -222 -364 675 -510
$$ packed form
2584A7M65j167J207n45o12J453j218O8J102j398P66K69j136J320o21o22J535j247
2602c64k4J202j373N98M04j135J174m38o56J380j063p7J086j270N86M05j140J196
2620D91l82q00J458j005k33J199j220M31N44j100J016k79p28J302r59j21J075
2637F89j229N90M33j195J191l51q20J398r45j77J116j189N25M12j089J088l73
2654G4o59J281r77k8J003j272O63M02j209J162k83q18J319q34k13J013j100M63
2672a3M63j088R93k12p48J231q20j87J037j183M98N66j217J010n9r24J218o62
2690i7l07J003j045M27M89j081R83k04p65J211q19j49J027j193N35N12j189R87
2708C25j17p98J144p27j35R17j098N29M17j103J020k29p39J195q23j42J039j185
$$ plain form
2726 -510 -57 526 -621 257 224 -547 506 -117 -337 616 -438 -63 514 -597 274 236 -566 550 -130
2745 -130 -393 675 -415 -134 552 -556 200 250 -520 491 -166 -318 619 -458 -61 513 -586 289
2763 289 196 -550 555 -187 -360 650 -457 -98 505 -552 236 171 -485 513 -220 -321 642 -461 -69
2782 -69 508 -556 237 213 -515 519 -146 -385 657 -387 -158 531 -478 159 213 -482 465 -125 -367
2801 -367 622 -397 -160 530 -511 158 231 -519 489 -107 -433 627 -351 -187 499 -478 162 173 -474
2820 -474 491 -168 -368 631 -407 -127 488 -507 206 173 -497 513 -143 -405 614 -346 -161 468 -428
2839 -428 182 157 -458 513 -154 -394 627 -342 -181 491 -458 147 224 -502 471 -67 -452 586 -258 -241
2859 -241 468 -374 133 195 -480 473 -95 -454 609 -291 -229 507 -430 116 219 -494 467 -46 -445 569
$$ packed form
2726e10M53N83j147Q78l3p71J053o23k20R53j054L75N77j111Q71l8q02J116o80
2745a30k63J068j090K81O86j108P56N0p70J011o57j52R37j077L97N74j099Q75
2763B89r3p46J105p42j73J010j107L59O03j057P88o5o56R98p33j01R63j103L92
2782f9N77j064P93k4p28J034o65k39J042j044K29O89j009O37N4o95R47n90k42
2801c67R89j019K37O90j041O69P3p50J008n96l26J060r78J64O86r77O40J1o47
2820d74R65o59k00R99j038K80O15r95P13l3o70J010o56k62J019r60J85O29q96
2839d28O10k5o15R71o67k40J021r69J61O72r49O05P7p26R73n38l85J038q44J7
2859b41P09q42N07O2o75R53n68l59J063r00O2P36r37N46J03p13R61n13l99J014
$$ plain form
2879 569 -261 -198 424 -408 180 140 -484 529 -114 -423 624 -301 -194 462 -419 165 208 -488 483 -53
2899 -53 -425 537 -267 -180 426 -393 174 174 -505 483 -46 -485 568 -227 -252 465 -378 96 245 -511 401
2920 401 0 -449 513 -205 -182 433 -394 168 217 -542 453 -15 -468 560 -206 -200 437 -379 142 207 -488
2941 -488 432 -19 -401 532 -241 -139 410 -440 198 215 -527 470 0 -439 521 -214 -188 406 -409 148 234
2962 234 -480 401 3 -425 480 -230 -192 425 -407 136 286 -512 377 75 -465 462 -164 -217 429 -364 121
2983 121 275 -481 363 31 -423 476 -199 -170 445 -418 134 263 -516 353 41 -400 471 -184 -147 407 -406
3004 -406 126 225 -484 382 2 -372 473 -246 -152 421 -444 112 259 -486 341 44 -383 445 -191 -181 407
3025 407 -396 94 296 -450 322 65 -382 450 -187 -205 457 -384 69 350 -461 281 90 -408 417 -168
$$ packed form
2879E69q30O3O22q32N88m0o24J013o43l09J047r25J07O56q81N84M3o96R71n36
2899e3l72R62q04Q7O06q19N67%o79R88n29m39J053p95k5P17q43M74J49p56R12
2920D01m01m49R62p18K3O15q27N62M9p59R95m68m53J028p66OO37q16N21O5o95
2941d88R20m51l82R33p73J02N49q50O38J7p42R97m70m39R60p35K6N94q15N57Q6
2962B34p14Q81l98m28R05p10L8O17q32N43J50p98Q89l02n40R27o26n3O46p93M85
2983A21J54p56Q44l32m54Q99o75K9O15q63N52J29p79Q69l12m41Q71o55L7N54q13
3004d06N32R9p09Q66l80l74Q45p19R4N73q65N56J47p45Q27k97m27Q28o36J0N88
3025D07q03M90K02p46P72k57m47Q32o37j8O62q41M53K81q11P42j91m98Q25n85
$$ plain form
3045 -168 -201 439 -367 70 299 -445 289 38 -388 449 -208 -181 454 -395 61 302 -458 275 46 -359 423
3066 423 -201 -155 422 -401 64 252 -443 306 44 -358 452 -203 -198 456 -372 13 306 -407 270 111 -361
3087 -361 410 -161 -216 426 -340 28 316 -403 272 87 -414 434 -164 -277 461 -316 -25 320 -393 230
3107 230 55 -381 400 -187 -211 442 -335 26 288 -418 271 36 -379 447 -168 -232 447 -318 -8 255 -390
3128 -390 256 38 -333 442 -174 -207 441 -333 11 275 -399 267 78 -377 437 -120 -294 416 -272 -50
3148 -50 285 -351 235 59 -390 401 -155 -307 419 -287 -44 303 -385 228 91 -426 400 -110 -292 420
3168 420 -248 -29 247 -354 249 23 -391 426 -127 -239 439 -276 -2 263 -384 247 65 -386 421 -104
3188 -104 -244 393 -251 -4 230 -374 262 56 -388 427 -92 -290 399 -270 -58 262 -376 217 116 -409
$$ packed form
3045a68l3O40q06M37K29p44P34k51m26Q37o57K7O35q49M56K41p60P33k29m05P82
3066D23o24M6N77q23M65J88o95P49k62m02Q10o55NO54q28L85K93p13O77j59m72
3087c61P71n71n5O42p66L68K88p19O75j85n01Q48n98j13P38p77K91L45p13O23
3107B30j75m36P81n87k4O53p77L61K62p06O89k35m15Q26o15o4O79p65L10K63o45
3128c90O46k18l71P75o16l3O48p74L44K64o74O66j89m55Q14n57j74P10o88K22
3148e0L35o36N86j76m49P91n56j52P26p06K43L47o88O13j37n17Q26n10j82P12
3168D20o68K19K76o01O03k26m14Q17n53j12O78p15K74K65o47O31j82m51Q07n25
3188a04j40O37o44K47K34o04O36k06m44Q15n19j98O89o69K12L20o38N93j01n25
$$ plain form
3208 -409 374 -56 -309 363 -226 -35 272 -348 251 107 -425 376 -63 -300 380 -209 -34 286 -354 227
3228 227 111 -406 366 -48 -264 365 -222 11 235 -380 250 84 -409 392 -60 -264 365 -217 -4 224
3248 224 -374 225 91 -390 356 -44 -271 326 -223 -29 227 -375 211 122 -406 361 -9 -293 339 -188
3268 -188 -62 272 -350 190 182 -385 327 6 -274 321 -186 -29 270 -346 208 156 -416 314 -15 -287 327
3289 327 -174 -20 267 -338 186 131 -370 300 -25 -231 314 -223 -16 242 -379 182 119 -395 309 -12 -254
3310 -254 316 -195 -51 252 -340 147 155 -361 278 6 -249 318 -197 -61 288 -336 144 207 -363 261 41
3331 41 -277 307 -175 -78 272 -310 119 176 -340 252 -3 -251 297 -205 -70 287 -341 120 171 -342 234
3352 234 -12 -239 287 -184 -46 258 -302 130 129 -325 248 -28 -225 304 -193 -62 282 -294 101 167 -304
$$ packed form
3208d09P83m30k53O72n89J91L07o20N99j44n32Q01m39k37O80n89J75L20o40N81
3228B27j16n17P72m14k16O29n87K33K24o15O30j66m93Q01m52k04O29n82K13K28
3248B24n98N99j34m81P46m00k27N97n49J94K56o02N86q9n28P67l70k84O32n27
3268a88J26L34o22N40qn67P12l21k80N95n07J57K99o16N54n2n72P30l29k72O14
3289C27n01J54K87o05N24n5n01O70l25k06N45n37K07K58o21N61o3n14P04l21k42
3310b54N70n11J44L03n92M87Qn16O39k72k55N67n15J36L49o24M80O3n70O24k20
3331D1l18N84m82R7L50n82M29N7n16N92k55k48N48n02J35L57o28M61N1n13N76
3352B34k46k27N26m71J38L04n60M32jm54N73k76j97N29m97J31L44n76L95O6m71
$$ plain form
3373 -304 230 18 -211 290 -153 -91 266 -284 90 165 -307 232 14 -253 295 -149 -125 281 -271 56 191
3394 191 -300 199 25 -241 276 -151 -105 256 -254 76 168 -292 213 3 -238 281 -138 -95 254 -226 75
3415 75 140 -264 200 -12 -198 278 -132 -73 248 -231 76 140 -269 210 14 -228 281 -115 -118 244 -212 46
3437 46 162 -249 193 28 -228 268 -99 -136 241 -209 21 153 -273 171 38 -234 255 -96 -139 236 -178
3458 -178 20 142 -230 169 28 -221 241 -79 -104 223 -175 47 137 -240 192 19 -221 236 -68 -105 210
3479 210 -165 38 110 -225 167 23 -207 220 -66 -124 197 -163 16 115 -244 149 54 -239 197 -35 -150
3500 -150 178 -142 -1 135 -228 137 82 -238 197 -28 -140 193 -141 14 160 -227 135 100 -236 187 5
3521 5 -142 170 -112 17 132 -220 134 65 -212 173 -20 -116 180 -134 25 133 -207 107 78 -226 151 -4
$$ packed form
3373c04N34k12k29N01m43O2L57n50L74P5m72N39k18k67N48m44K4M06n52L27J35
3394A91m91M99j74k66N17m27M6L61n10L30R2m60N05k10k41N19m19M3L49m80L01
3415G5O5m04M64k12j86M76m10N9L21m79L07O4m09M79j96k42N09l96lL62m56K58
3437D6J16m11M42j65k56M96l67l7L77m50K30J32m26M44j33k72M89l51m3L75m14
3458a78J98J22l72L99j41k49M62l20k5L27l98K22R0l77M32j73k40M57l04l7L15
3479B10l75K03P2l35L92j44k30M27k86n8L21l60J79R9l59L93r5k93M36k32j15
3500a50L28l20J41J36l63L65n5l20M35k25j12L33l34J55J46l87L62l5l36M23j82
3521Ej47L12k82J29J15l52L54o9k77L85j93r6K96l14J59J08l40L14k9l04L77j55
$$ plain form
3543 -4 -108 138 -118 20 113 -205 95 92 -208 137 -18 -134 189 -113 23 152 -243 108 140 -219 162 46
3565 46 -141 158 -112 -5 180 -210 105 102 -279 158 4 -123 217 -124 -18 168 -198 91 194 -172 96
3586 96 -5 -170 113 -90 -35 118 -199 48 121 -213 121 13 -130 132 -92 -33 146 -198 47 116 -194 97
3608 97 28 -114 144 -110 -22 197 -183 45 152 -205 89 68 -141 148 -108 -11 175 -150 -9 160 -161 65
3630 65 60 -104 145 -96 -62 174 -186 1 153 -198 64 36 -132 115 -86 -50 168 -161 12 129 -171 76
3652 76 32 -112 126 -91 -36 166 -162 15 137 -157 73 52 -113 129 -51 -56 163 -138 4 148 -148 76
3674 76 61 -123 141 -60 -78 185 -146 -25 159 -178 46 52 -156 126 -56 -88 167 -134 -26 139 -155 52
3696 52 61 -129 138 -43 -81 171 -126 -21 139 -146 55 61 -116 129 -35 -75 161 -102 -8 111 -135 67 65
$$ packed form
3543dj04K46k56J38R3l18L00ll00L45j55j16L23l02J36J29l95L51L2l59L81j16
3565D6j87K99k70J07J85l90L15ll81M37j54j27L40l41J06J86l66K89J03l66K68
3586I6j01j65K83k03N5J53l17K47P3l34L34j08j43K62k24N9J79l44K45O9l10K91
3608I7o9j42K58k54Q8K19l80K28J07l57K94k1k09K89k56R7J86l25J41J69l21K26
3630F5nj64K49k41L4K36l60J87J52l51K62k8j68K47k01L6K18l29J73J17l00K47
3652G6m4j44K38k17N5K02l28J77J22k94K30k1j65K42j80nK19l01J42J44k96K24
3674G6j5j84K64k01j8K63l31J21J84l37K24Ok08K82j82l2K55l01J08J65k94K07
3696E2Rj90K67j81l8K52k97J05J60k85K01Oj77K45j64m0K36k63R4J19k46K02k
$$ plain form
3719 65 -121 138 -33 -81 159 -100 -22 137 -135 55 64 -150 121 -29 -108 148 -103 -42 132 -163 44 62 -166
3742 -166 132 -20 -117 161 -95 -41 141 -149 47 79 -146 114 -8 -102 146 -85 -27 129 -140 67 83 -136
3764 -136 130 -2 -99 131 -80 -30 125 -122 67 80 -122 116 -2 -103 115 -89 -34 120 -149 52 78 -153
3786 -153 94 5 -113 129 -86 -29 133 -149 55 84 -157 95 12 -113 145 -72 -27 158 -151 44 111 -156
3808 -156 93 35 -110 128 -74 -28 130 -142 41 87 -141 94 21 -84 126 -75 -30 121 -146 32 90 -139
3830 -139 74 15 -85 106 -82 -33 116 -133 40 79 -144 78 3 -97 126 -76 -40 128 -135 21 110 -139
3852 -139 78 36 -105 127 -59 -32 149 -140 29 119 -138 59 21 -107 131 -66 -42 136 -129 3 100 -138
3874 -138 59 24 -88 88 -83 -42 126 -140 1 103 -121 56 34 -82 98 -80 -35 119 -113 0 107
$$ packed form
3719F5j86K59j71m8K40k59P8J59k72J90Rk14K71j50p9K56k51O1J74k95K07J8k28
3742a66K98j52r7K78k56N4J82k90J96L2k25K60j22r4K48k31N8J56k69K07J6k19
3764a36K66j32r7K30k11N0J55k47J89J3k02K38j18j01K18k04N5J54k69K01K6k31
3786a53K47q9j18K42k15N7J62k82K04K9k41K52q3j25K58k17M5J85l09J95O7k67
3808a56K49n8j45K38k02M6J58k72J83M6k28K35p3j05K10k01M5J51k67J78N8k29
3830a39K13n9j00J91j88M9J49k49J73L9k23K22p5j00K23k02L6J68k63J56Q9k49
3852a39K17m2j41K32j86K7J81k89J69R0k57J97l8j28K38j97K4J78k65J32R7k38
3874a38J97l5j12J76j71M1J68k66J41J02k24J77k2j16J80j78M5J54k32J13J07
$$ plain form
3895 107 -113 52 14 -82 105 -63 -33 148 -117 23 119 -120 53 45 -95 125 -43 -46 157 -114 5 121 -117
3918 -117 47 40 -94 116 -48 -67 136 -115 -27 108 -122 44 30 -95 115 -56 -63 141 -107 -18 104 -107 44
3941 44 23 -83 105 -60 -51 140 -96 -21 115 -100 55 36 -83 115 -47 -65 137 -92 -23 112 -92 47 29
3964 29 -76 118 -46 -70 154 -98 -30 117 -131 32 23 -119 107 -46 -95 144 -99 -34 109 -117 34 34 -108
3987 -108 115 -36 -90 159 -87 -36 113 -99 51 41 -91 131 -29 -81 139 -67 -33 100 -92 44 42 -89
4009 -89 121 -27 -83 139 -77 -32 117 -99 37 41 -115 95 -30 -98 122 -81 -41 104 -114 45 42 -133 118
4032 118 -19 -110 134 -75 -36 115 -110 38 51 -119 106 -15 -96 138 -64 -29 126 -114 54 59 -117 112
4054 112 6 -84 128 -67 -41 107 -101 32 48 -114 100 -19 -91 115 -77 -29 93 -110 40 47 -111 89
$$ packed form
3895A07k20J65l8r6J87j68L0J81k65J40R6k39J73qj40K20j68lK03k71J19J16k38
3918a17J64pj34K10j64j9K03k51Q8J35k30J66j4j25K10j71pK04k48Q9J22k11J51
3941D4k1j06J88j65RJ91k36P5J36k15J55j9j19J98j62j8K02k29O9J35k04J39j8
3964B9j05J94j64k4K24k52O8J47k48J63rj42K26j53m9K39k43O5J43k26J51%j42
3987a08K23j51n4K49k46N1J49k12J50j0j32K22j60n2K20k06L4J33j92J36kj31
4009h9K10j48n6K22k16M5J49k16J36Mj56K10j25o8K20k03M0J45k18J59lj75K51
4032A18j37r1K44k09L9J51k25J48J3j70K25j21q1K34k02L5J55k40J68Nj76K29
4054A12j06r0K12j95K6J48k08J33J6j62K14j19p2K06j92M8J22k03J50Pj58K00
$$ plain form
4076 89 -10 -102 114 -84 -42 100 -121 34 53 -121 92 -24 -87 123 -61 -38 121 -113 39 68 -112 93 -1
4099 -1 -92 127 -69 -33 127 -107 41 62 -122 91 0 -83 123 -61 -42 90 -124 23 56 -114 85 -1 -85 110
4123 110 -71 -47 94 -104 19 55 -113 71 -18 -91 102 -78 -32 107 -107 35 68 -115 89 8 -89 121 -60
4146 -60 -37 136 -104 32 81 -121 83 9 -84 109 -71 -13 137 -75 15 105 -122 72 15 -103 117 -85 -75
4169 -75 153 -108 28 83 -102 49 -12 -70 127 -69 -46 99 -106 13 78 -95 65 11 -74 118 -58 -25 114
4192 114 -99 30 75 -97 85 1 -77 113 -50 -43 137 -117 41 56 -111 35 -13 -94 130 -65 -60 126 -104
4215 -104 -1 57 -111 67 -7 -108 126 -66 -60 125 -106 -3 66 -91 51 -5 -75 116 -73 -41 109 -80 19
4238 19 73 -82 77 2 -76 111 -68 -53 106 -76 2 57 -83 76 6 -70 116 -55 -49 115 -85 -5 66 -104
$$ packed form
4076H9r9r2K16j98M2J42k21J55J9j74K13j16o3K10j84K3J59k34J52K9j80K05r4
4099ar1K19j96L6J60k34J48K1j84K13r1q3K06j84J9J32k14J47L3j70J99q6q4J95
4123A10j81K4J41j98J23L6j68J84q9p3J93j80M6J39k14J42L3j83K04q1r7K10j81
4146f0K3J73k40J36M9k02K04p4r3J93j80N8J50k12R0R0k27J94n7j18K20k02J0
4169g5K28k61J36N5j85J51o1n8J97j96K3J45k05J19O5j73J60n4q5J92j76L3J39
4192A14k13J29M5j72J82q4p8J90j63PJ80k54J58J5j67J46m8q1K24j95NJ86k30
4215a04J03N8j68J78p4j01K34j92OJ85k31J03O9j57J42n6p0J91j89L2J50j89R9
4238A9N4j55J59p5p8J87j79J5J59j82P8N5j40J59p0p6J86j71OJ64k00Q0P1j70
$$ plain form
4262 -104 71 -9 -97 115 -67 -71 110 -85 -9 53 -104 70 -18 -102 110 -51 -70 109 -86 1 72 -91 69 -3
4286 -3 -85 121 -34 -52 104 -61 4 61 -83 72 1 -87 98 -44 -49 100 -63 13 60 -84 56 1 -88 101 -35
4311 -35 -69 99 -67 -6 54 -99 64 3 -98 100 -35 -75 101 -75 1 64 -84 54 16 -107 111 -30 -68
4334 -68 105 -55 -1 65 -75 64 33 -92 102 -18 -64 89 -58 0 68 -81 58 15 -97 90 -27 -54 87
4357 87 -62 -5 49 -92 32 9 -102 85 -22 -69 79 -63 -19 60 -98 41 10 -110 84 -16 -76 92 -57
4380 -57 -8 69 -89 64 31 -98 90 3 -76 100 -58 -8 73 -95 42 36 -91 92 -18 -59 88 -53 0 64
4404 64 -107 42 22 -105 69 -13 -72 67 -64 -26 57 -93 41 24 -83 78 -18 -58 81 -61 -19 69 -88 43
4428 43 38 -96 78 -9 -53 87 -33 -18 78 -74 36 47 -93 84 -4 -62 104 -63 -22 95 -89 33 47 -112
$$ packed form
4262a04J75q0q8K12j82mJ81j95P6O2j57J74q8q4K12j61j9J79j95Q7P1j63J60p2
4286cq2K06j55j8J56j65O5N7j44J55p1q8J85j42nJ49j63P6M7j44J40n5q9J89j36
4311c5l4J68j66O1O0j53J63o1j01J98j35m0J76j76P6O3j48J38l8j23K18j41l8
4334f8J73j60N4O6j40J39l1j25J94j20m6J53j47N8O8j49J39m3j12J87j17k7J41
4357H7j49N7N4j41J24k3j11J87j07m7J48j42M4P9j58J39l1j20J94j00o0J68j49
4380e7M9P7j58J53l3j29J88q7p9J76j58N0Q1j68J37oj27J83j10m1J47j41N3O4
4404F4j71J49k0j27J74q2n9J39j31L8Q3j50J34j7j07J61r6m0J39j42M2Q8j57J31
4428D3nj34J74q7m4J40j20J5R6j52J10J1j40J77q8n8J66j67M1J17j84J22J4j59
$$ plain form
4452 -112 88 -10 -86 92 -75 -30 73 -101 18 38 -108 70 -22 -77 89 -63 -40 78 -95 15 47 -98 77
4475 77 -9 -67 91 -49 -13 84 -74 41 38 -79 82 -5 -65 108 -51 -24 90 -84 27 49 -78 89 -9 -68
4499 -68 107 -56 -34 85 -104 19 37 -93 79 -16 -81 110 -69 -45 86 -93 17 29 -99 83 -18 -71 99
4522 99 -67 -39 97 -69 24 55 -76 63 5 -62 82 -50 -21 107 -63 34 17 -98 77 22 -100 76 -55
4545 -55 1 57 -77 -20 18 -82 51 -20 -135 129 -35 -8 89 -119 8 48 -101 73 -7 -97 108 -62 -47 62
4569 62 -91 2 31 -83 91 4 -69 125 -35 -26 95 -74 30 38 -82 91 8 -74 108 -36 -32 76 -70 33
4593 33 34 -89 86 -3 -92 98 -48 -36 74 -76 35 31 -101 82 -16 -83 97 -54 -41 85 -88 35 43 -111
4617 -111 91 -9 -95 97 -26 -30 92 -74 42 56 -101 104 16 -80 116 -30 -44 86 -69 33 43 -93 99
$$ packed form
4452a12K00r8p6J78j67M5J03j74J19K0j46J78r2n5J66j52K3J18j73J10L2j45J75
4475G7q6n8J58j40L6R7j58J15lj17J61q7o0J73j59K7J14j74J11K2j27J67r8n9
4499f8J75j63K2J19j89J23J8j30J72r5o5J91j79K4J31j79J10J2j28J82j01n3J70
4522I9j66K8J36j66R3L1j31J39n8o7J44j32K9J28j70R7j7j15J75n5j22J76j31
4545e5N6N6j34N7L8j00J33p1j15K64j64K7R7k08J27M0j49J74q0r0K05j70J5J09
4569F2j53R3K9j14J74q7p3J94j60RJ21j69J04Qj20J73q3q2J82j44MJ08j46J03
4593C3Jj23J75q9q9J90j46J2J10j50J11mj32J83r8o7J80j51J3J26j73J23Qj54
4617a11K02j00q6J92j23mJ22j66J16J4j57K05q8r6J96j46j4J30j55J02J0j36J92
$$ plain form
4640 99 12 -81 104 -42 -39 70 -79 20 30 -109 85 0 -86 108 -50 -32 62 -78 35 52 -99 82 9 -87 84
4665 84 -47 -33 80 -85 36 48 -100 88 7 -83 105 -37 -26 88 -91 40 53 -110 89 12 -85 107 -39
4688 -39 -24 84 -101 36 47 -117 76 6 -91 90 -52 -29 82 -87 19 43 -114 67 -4 -82 86 -63 -31
4711 -31 62 -98 31 37 -98 84 12 -74 88 -41 -19 92 -76 37 54 -100 83 7 -96 86 -39 -17 97
4734 97 -84 45 66 -103 69 4 -85 92 -41 -26 84 -95 23 56 -120 73 1 -84 87 -53 -35 69 -109
4757 -109 23 39 -115 73 6 -83 94 -48 -30 85 -83 26 58 -87 73 4 -68 99 -40 -26 82 -76 30
4780 30 61 -97 75 4 -71 88 -51 -35 85 -92 8 63 -99 48 3 -90 86 -58 -41 87 -104 2 50
4803 50 -106 62 -5 -92 86 -49 -42 90 -90 22 51 -93 66 12 -82 90 -22 -33 94 -78 19 65 -89 64
$$ packed form
4640I9q7r3J85j46LJ09j49R9J0j39J94q5q6J94j58J8R4j40J13J7j51J81p3r6J71
4665H4j31J4J13j65J21J2j48J88q1r0J88j42J1J14j79J31J3j63J99p7r7J92j46
4688c9J5J08j85J37J1j64J93p0r7J81j42K3J11j69J06K4j57J81p1p8J68j49L2
4711c1R3j60J29Oj35J82p2q6J62j29K2J11j68J13J7j54J83p6j03J82j25K2J14
4734I7j81J29K1j69J72o5q9J77j33J5J10j79J18L3j76J93p2q5J71j40J8J04j78
4757a09J32J6j54J88o7q9J77j42J8J15j68J09L2j45J60o9p2J67j39J4J08j58J06
4780C0L1j58J72p1p5J59j39J6J20j77J00N5j62J47m5r3J76j44J7J28j91J06M8
4803E0j56J68o7q7J78j35PJ32j80J12K9j44J59n4r4J72j12j1J27j72R7M6j54J53
$$ plain form
4827 64 13 -75 94 -36 -34 88 -77 11 49 -93 52 -5 -85 78 -45 -60 75 -95 1 64 -108 53 -8 -109
4851 -109 80 -57 -65 78 -89 5 54 -105 63 4 -96 102 -44 -50 92 -79 1 56 -95 68 6 -88 98 -23
4875 -23 -39 91 -67 8 58 -105 62 16 -87 78 -50 -65 85 -87 -4 40 -93 56 -5 -82 78 -32 -47 83
4899 83 -78 6 43 -93 56 7 -108 92 -37 -48 81 -66 12 59 -94 76 16 -105 95 -41 -51 92 -55
4922 -55 23 62 -92 65 16 -95 98 -40 -45 92 -77 -2 49 -105 50 -1 -105 71 -46 -71 67 -85 0 43
4946 43 -111 56 -4 -106 73 -35 -57 76 -77 -3 49 -107 69 24 -86 98 -31 -56 92 -76 18 68 -101
4969 -101 78 32 -86 92 -11 -41 93 -65 18 58 -107 57 23 -102 75 -17 -53 67 -87 11 53 -113 40
4992 40 11 -105 73 -37 -61 60 -82 9 47 -101 53 13 -96 85 -22 -50 74 -78 21 53 -103 60 27
$$ packed form
4827F4n1q8J69j30KJ22j65Q8L8j42J45n7q0J63j23j5J35j70R6O3j72J61o1j01
4851a09J89j37qJ43j67R4M9j59J68n9j00J98j46oJ42j71Q0N5j51J63o2r4J86j21
4875b3j6J30j58P5N0j63J67m6j03J65j28j5J50j72Q3M4j33J49o1p7J60j10j5J30
4899H3j61Q4L7j36J49m9j15K00j29j1J29j47P8M7j53J70o0j21K00j36j0J43j47
4922e5P8L9j54J57m9j11J93j38nJ37j69P5N1j54J55n1j04J76j17k5J38j52Q5M3
4946D3j54J67o0j02J79j08k2J33j53P4N2j56J76m5j10J84j29k5J48j68R4N0j69
4969a01J79m6j18J78j03l0J34j58Q3M0j65J64l4j25J77r2l6J20j54R8M2j66J53
4992D0k9j16J78j10k4J21j42R1L8j48J54m0j09J81j07k8J24j52R9L2j56J63l3
$$ plain form
5015 27 -93 90 -9 -55 70 -73 8 68 -102 61 33 -90 87 -24 -54 82 -87 6 66 -104 53 30 -105
5038 -105 73 -23 -55 66 -94 3 57 -121 46 12 -101 76 -26 -49 87 -73 15 73 -93 50 36 -89 86
5061 86 -20 -38 87 -62 20 62 -87 60 35 -87 86 -15 -47 81 -79 1 62 -104 47 19 -90 78 -35
5084 -35 -49 76 -83 5 63 -114 31 14 -115 68 -41 -63 85 -80 0 57 -103 48 30 -89 73 -27 -49
5107 -49 96 -76 2 70 -95 58 48 -83 73 -18 -39 90 -69 8 80 -99 38 16 -71 67 -40 -60 85 -75
5131 -75 -6 60 -102 31 23 -81 67 -36 -58 81 -87 -4 63 -107 32 25 -86 71 -31 -55 94 -75 -4 76
5155 76 -95 40 25 -89 90 -31 -47 97 -70 -2 76 -101 62 25 -81 95 -22 -48 80 -70 -1 55 -87
5178 -87 42 5 -90 75 -35 -56 64 -83 -17 52 -99 46 8 -93 71 -19 -52 78 -63 5 73 -91 49 28
$$ packed form
5015B7j20J83r9m6J25j43Q1O0j70J63k8j23J77j11l0J36j69R3O0j70J57k3j35
5038a05J78r6l2J21j60R7N4j78J67l4j13J77j02k3J36j60Q8N8j66J43j4j25J75
5061H6j06j8J25j49Q2M2j49J47k5j22J73j01l2J28j60Q0O1j66J51k8j09J68j13
5084c5j4J25j59Q8N8j77J45j7j29J83j09k2J48j65Q0N7j60J51j8j19J62j00k2
5107d9J45j72P8O8j65J53j0j31J56r1k1J29j59P7P2j79J37k2q7J38j07k0J45j60
5131g5O9O6j62J33qj04J48j03k2J39j68Q3O7j70J39pj11J57j02k4J49j69P1Q0
5155G6j71J35j5j14J79j21j6J44j67O8P8j77J63l7j06J76j17k6J28j50O9N6j42
5178h7J29l7r5J65j10k1J20j47O6O9j51J45l8j01J64r0l3J30j41O8O8j64J40k1
$$ plain form
5202 28 -82 92 -23 -61 90 -70 6 73 -89 62 33 -87 96 -24 -57 93 -52 -8 77 -80 56 36 -90
5225 -90 72 -28 -62 74 -69 -17 56 -98 34 10 -98 58 -34 -84 71 -77 -8 51 -92 37 8 -84 80 -21
5249 -21 -52 76 -55 0 60 -83 55 29 -92 86 -12 -49 95 -48 -14 70 -89 51 31 -105 81 -22 -68 83
5273 83 -77 -8 64 -97 35 20 -102 72 -21 -76 63 -77 -22 44 -103 36 12 -115 64 -12 -66 73 -71 -13
5297 -13 70 -84 59 37 -86 82 -5 -53 83 -53 -5 64 -88 45 28 -98 66 -10 -71 63 -68 -8 57 -91
5321 -91 32 38 -106 66 -7 -62 81 -68 -23 65 -112 35 36 -123 57 -17 -76 74 -69 -17 56 -101 36 36 -96
5346 -96 66 -1 -60 89 -51 -8 85 -96 46 47 -90 85 7 -58 88 -58 -6 73 -100 29 44 -109 61 -16
5370 -16 -73 80 -67 -18 66 -102 27 39 -111 64 -21 -85 77 -73 -23 71 -118 29 51 -105 74 -9 -67 82
$$ packed form
5202B8j10J74j15l8J51j60P6O7j62J51k9j20J83j20l3J50j45M4Q5j57J36k0j26
5225i0J62j00l4J36j43N2P3j54J32k4j08J56r2n0J55j48O9N9j43J29k9r2J64j01
5249b1l1J28j31N5O0j43J38k6j21J78r8l7J44j43L4Q4j59J40k0j36J86j03m6J51
5273H3j60O9P2j61J32j5j22J74r3n5J39j40N5O6j47J39k4j27J79p6n4J39j44N8
5297a3Q3j54J43k2j23J68q7m8J36j36M8O9j52J33j7j26J64p6o1J34j31O0O5j48
5321i1J23Oj44J72p3n5J43j49M5Q8j77J47Jj59J80p4n9J50j43N2P3j57J37%j32
5346i6J62o7n9J49j40M3R3j81J42Jj37J75p8o5J46j46N2P9j73J29J5j53J70p7
5370a6n7J53j47M9Q4j68J29J2j50J75q5o4J62j50N0R4j89J47K2j56J79q3n8J49
$$ plain form
5394 82 -61 -13 93 -102 34 57 -107 66 -2 -60 100 -60 -9 85 -88 49 48 -94 77 -12 -73 75 -72 -34
5418 -34 67 -111 16 33 -100 63 -14 -84 82 -81 -36 69 -118 24 42 -120 70 -9 -78 92 -53 -30 88
5441 88 -102 30 57 -121 73 -6 -82 98 -58 -35 99 -95 36 66 -103 81 4 -69 97 -63 -28 96 -98
5464 -98 18 49 -110 63 -11 -88 91 -63 -42 89 -106 4 34 -115 65 -8 -90 97 -63 -41 95 -102 31
5487 31 59 -102 74 9 -66 111 -56 -40 102 -96 26 66 -93 91 2 -84 120 -53 -30 107 -96 31 67
5510 67 -114 83 -8 -87 108 -71 -53 104 -110 5 47 -135 70 -7 -106 105 -67 -56 81 -117 19 49 -120
5533 -120 73 11 -96 108 -58 -35 104 -101 27 84 -107 90 10 -91 114 -44 -48 107 -106 35 82 -121
5555 -121 69 10 -111 115 -56 -43 112 -109 26 67 -147 83 5 -116 107 -60 -55 98 -121 20 64 -141
$$ packed form
5394H2j43M8J06j95J36K3j64J73o8n8J60j60N1R4j73J37jj42J71q9o1J48j47L8
5418c4J01j78J27J7j33J63p7p0J66j63M5J05j87J42J8j62J90p9o9J70j45K3J18
5441H8j90J32K7j78J94p9p6J80j56K3J34j94J31L0j69J84p7p3J66j60L5J24j94
5464i8J16L1j59J73p4p7J79j54K1J31j95J10L0j49J80p3q2J87j60K2J36j97J33
5487C1K8j61J76o5p5J77j67J6J42j98J22M0j59J84q9q6K04j73K3J37k03J27L6
5510F7j81J97r1p9J95j79J8J57k14J15M2j82K05p7r9K11j72J1J37j98J36L0j69
5533a20J93o2j07K04j66K3J39k05J28N7j91J97q0j01K05j58mJ55k13J41M7k03
5555a21J90n9j21K26j71J3J55k21J35M1k14K30p8j21K23j67NJ53k19J41M4k05
$$ plain form
5577 -141 80 -10 -119 114 -59 -40 111 -123 28 67 -131 91 17 -100 126 -45 -33 111 -99 37 77 -112
5599 -112 96 26 -106 116 -53 -42 116 -120 31 74 -146 87 17 -125 94 -67 -51 107 -132 26 67 -152
5621 -152 73 16 -127 110 -64 -57 104 -124 16 70 -147 83 10 -121 105 -60 -45 117 -108 18 84 -142
5643 -142 85 31 -93 115 -45 -35 106 -113 42 81 -141 75 19 -108 107 -61 -51 101 -124 13 67 -140
5665 -140 76 3 -125 104 -61 -45 113 -127 19 94 -154 72 19 -118 107 -56 -53 121 -119 16 99 -148
5687 -148 83 30 -113 123 -52 -57 124 -125 28 104 -130 78 24 -119 110 -49 -35 116 -128 10 84 -137
5709 -137 60 21 -127 105 -74 -61 111 -131 3 73 -159 74 22 -116 115 -58 -68 127 -126 9 102 -142
5731 -142 81 37 -125 117 -54 -61 141 -121 18 104 -143 80 47 -102 130 -44 -58 131 -124 6 117 -140
$$ packed form
5577a41K21r0j09K33j73J9J51k34J51L9j98K22p4j17K26j71J2J44k10J36M0j89
5599a12K08p0j32K22j69J1J58k36J51M3k20K33p0j42K19j61J6J58k39J58M1k19
5621a52K25n7j43K37j74PJ61k28J40N4k17K30p3j31K26j65J5J62k25J26O6k26
5643a42K27n4j24K08j60J0J41k19J55L9k22K16n6j27K15j68J0J52k25J37N4k07
5665a40K16p3j28K29j65J6J58k40J46P5k48K26n3j37K25j63LJ74k40J35Q3k47
5687a48K31n3j43K36j75nJ81k49J53P6k34K08n4j43K29j59J4J51k44J38P4k21
5709a37J97l9j48K32j79J3J72k42J34P0k32K33n2j38K31j73j0J95k53J35R3k44
5731a42K23m4j62K42j71pK02k62J39Q6k47K23l3j49K32j74j4J89k55J30J11k57
$$ plain form
5753 -140 76 37 -121 118 -55 -69 136 -121 0 95 -142 67 15 -130 111 -63 -81 126 -130 -10 92 -144
5775 -144 73 42 -114 118 -45 -58 135 -110 11 109 -132 76 38 -120 124 -45 -70 149 -115 -4 115 -146
5797 -146 72 40 -132 122 -56 -84 140 -122 -4 100 -164 62 32 -145 123 -61 -97 124 -131 -11 103
5818 103 -159 53 28 -145 127 -44 -76 145 -124 0 111 -136 70 41 -124 133 -34 -76 152 -98 9
5839 9 119 -130 91 57 -121 145 -42 -84 146 -108 -9 108 -149 72 40 -147 129 -35 -97 132 -115 -17 94
5862 94 -163 69 39 -145 123 -48 -100 143 -114 -4 114 -154 75 40 -152 137 -29 -93 150 -104 -5 113
5884 113 -140 74 64 -130 126 -18 -82 157 -105 -6 115 -153 81 46 -144 125 -39 -105 130 -124 -15 102
5906 102 -180 64 54 -166 129 -43 -109 140 -121 -22 118 -163 75 55 -162 142 -23 -101 140 -109 -21 129
$$ packed form
5753a40K16l9j58K39j73j4K05k57J21R5k37K09n2j45K41j74j8K07k56J20J02k36
5775a44K17l1j56K32j63j3J93k45J21R8k41K08l8j58K44j69k5K19k64J11J19k61
5797a46K18l2j72K54j78k8K24k62J18J04k64K26l0j77K68j84l6K21k55J20J14
5818A03k62K12k5j73K72j71l2K21k69J24J11k47K06k9j65K57j67m2K28k50J07
5839IJ10k49K21l4j78K66j87m2K30k54R9J17k57K21l2j87K76j64o2K29k47R8J11
5862I4k57K32l0j84K68j71n2K43k57J10J18k68K29l5j92K89j66o4K43k54R9J18
5884A13k53K14j0j94K56j44o4K39k62R9J21k68K34l5j90K69j64o6K35k54J09J17
5906A02k82K44j0k20K95j72o6K49k61R9J40k81K38k0k17L04j65p8K41k49Q8J50
$$ plain form
5928 129 -169 81 69 -150 130 -7 -96 158 -104 -21 142 -166 74 67 -155 119 -22 -94 147 -120 -12 137
5950 137 -168 55 60 -168 118 -35 -116 144 -131 -39 117 -179 65 60 -179 124 -21 -111 159 -110 -29 133 -172
5973 -172 78 82 -177 127 -13 -102 167 -120 -18 157 -168 66 78 -154 137 -1 -108 164 -119 -30 130 -179
5995 -179 60 81 -156 126 -32 -116 142 -127 -36 121 -181 55 76 -182 108 -29 -120 146 -119 -25 141 -177
6017 -177 59 89 -164 128 -19 -105 170 -107 -25 153 -177 63 97 -163 139 -10 -111 170 -107 -19 150 -179
6039 -179 57 88 -169 125 -15 -126 172 -122 -38 150 -169 51 80 -171 106 -26 -119 150 -133 -44 139 -177
6061 -177 41 81 -164 114 -16 -114 157 -117 -25 150 -152 60 88 -153 130 -3 -102 182 -110 -28 160 -157
6083 -157 59 83 -152 125 -13 -115 170 -110 -45 154 -175 46 76 -165 131 -25 -124 161 -115 -49 146 -185
$$ packed form
5928A29k98K50j2k19K80j37q9K54k62Q3J63l08K40pk22K74j41p2K41k67J08J49
5950A37l05K23Nk28K86j53q1K60k75R2J56k96K44nk39L03j45r0K70k69Q1J62l05
5973a72K50Mk59L04j40q9K69k87J02J75l25K34J2k32K91j38j07K72k83Q9J60l09
5995a79K39K1k37K82j58q4K58k69R1J57l02K36K1k58K90j37r1K66k65R4J66l18
6017a77K36L0k53K92j47q6K75k77Q2J78l30K40L4k60L02j49j01K81k77Q8J69l29
6039a79K36L1k57K94j40j11K98k94Q4J88l19K20K9k51K77j32r3K69k83Q9J83l16
6061a77K18M0k45K78j30r8K71k74R2J75l02K12K8k41K83j33r9K84k92Q2J88l17
6083a57K16K4k35K77j38j02K85k80O5J99l29K21L0k41K96j56r9K85k76O6J95l31
$$ plain form
6105 -185 24 80 -179 104 -23 -131 160 -114 -48 154 -172 50 87 -165 116 -9 -117 175 -101 -36 159
6126 159 -143 56 97 -151 130 -2 -120 173 -98 -52 158 -155 45 72 -166 111 -25 -133 151 -116 -52
6147 -52 163 -177 39 86 -179 117 -11 -134 173 -105 -53 167 -160 32 99 -171 134 -11 -131 174 -88
6168 -88 -46 151 -154 47 96 -153 131 8 -126 180 -80 -47 159 -135 53 99 -165 117 10 -127 165 -99
6190 -99 -57 166 -157 39 93 -185 113 -9 -146 156 -104 -82 135 -171 26 95 -180 122 9 -145 171 -85
6212 -85 -61 170 -160 43 102 -183 124 11 -140 177 -74 -52 162 -159 48 115 -176 124 17 -130 161 -80
6234 -80 -53 156 -148 28 97 -171 117 13 -146 168 -82 -68 146 -165 40 97 -199 98 16 -142 155 -71
6256 -71 -55 162 -161 40 115 -178 122 38 -143 173 -76 -54 167 -150 49 131 -176 111 26 -143 181 -79
$$ packed form
6105a85K09N6k59K83j27j08K91k74O6K02l26K22L7k52K81j25j08K92k76O5J95
6126A59l02J99M1k48K81j32j18K93k71M6K10l13K00K7k38K77j36j08K84k67O4
6147e2K15l40K16M7k65K96j28j23L07k78N2K20l27J92O7k70L05j45j20L05k62
6168h8M2J97l05K01M9k49K84j23j34L06k60L3K06k94J88M6k64K82j07j37K92k64
6190i9M2K23l23J96N4k78K98j22j37L02k60K2K17l06J97O9k75L02j13j54L16k56
6212h5K4K31l30K03N9k85L07j13j51L17k51K2K14l21K07O7k91L00j07j47K91k41
6234h0K7K09l04J76O9k68K88j04j59L14k50J4K14l11K05N7k96K97q2j58K97k26
6256g1J6K17l23K01P5k93L00q4j81L16k49K2K21l17J99Q2l07K87q5j69L24k60
$$ plain form
6278 -79 -62 173 -157 25 116 -192 108 20 -150 155 -82 -60 155 -157 20 109 -199 90 22 -149 132 -80
6300 -80 -78 148 -155 -1 120 -178 107 28 -141 161 -72 -62 170 -146 26 128 -162 116 44 -132 166 -64
6322 -64 -60 182 -150 19 139 -187 105 26 -151 159 -81 -86 175 -162 21 122 -196 92 19 -157 149 -81
6344 -81 -92 164 -169 -8 120 -185 82 38 -150 160 -70 -85 172 -153 6 132 -178 90 42 -138 168 -60
6366 -60 -77 184 -146 26 136 -170 106 54 -143 159 -73 -95 187 -151 -2 148 -184 89 38 -162 155 -79
6388 -79 -100 170 -159 -10 117 -196 79 39 -160 151 -75 -96 182 -149 -6 140 -179 86 42 -156 163 -67
6410 -67 -96 187 -133 8 147 -165 88 71 -131 173 -37 -86 208 -145 -9 157 -168 86 63 -161 157 -62
6432 -62 -110 187 -159 -24 152 -174 61 48 -184 158 -100 -115 181 -133 -49 163 -189 78 47 -202 186 -58
$$ packed form
6278g9J7K35l30J82R1l08L00q8j70L05k37K2K15l12J77Q9l08K89o8j71K81k12
6300h0KK26l03J54J21k98K85p9j69L02k33J0K32l16J72J02k90K78p2j76K98k30
6322f4MK42l32J69J20l26K92p9j77L10k40nK61l37J83J01l18K88p3j76L06k30
6344h1j1K56l33J61J28l05K67m4j88L10k30j5K57l25J59J26l10K68m8j80L06k28
6366f0j7K61l30J72J10l06K76n2j97L02k32k2K82l38J49J50l32K73n1k00L17k34
6388g9k1K70l29J49J27l13K75m0j99L11k26k1K78l31J43J46l19K65m4j98L19k30
6410f7k9K83l20J41J39l12K53j7k02L04k10m9K94l53J36J66l25K54k3k24L18k19
6432f2m8K97l46J35J76l26K35j3k32L42k58j5K96l14Q4K12l52K67l1k49L88k44
$$ plain form
6454 -58 -133 197 -195 -15 125 -188 58 55 -180 158 -31 -102 199 -126 -12 144 -169 86 59 -167 167 -48
6476 -48 -106 187 -143 -21 142 -175 64 44 -173 147 -54 -123 171 -152 -50 136 -194 61 52 -176 168 -48
6498 -48 -125 188 -133 -27 155 -174 95 68 -177 171 -34 -110 203 -120 -10 167 -162 92 59 -170 165 -25
6520 -25 -117 192 -120 -26 151 -173 69 60 -166 143 -42 -128 176 -129 -48 141 -185 52 49 -188 132 -46 -134
6543 -134 168 -133 -31 135 -176 67 70 -197 153 -29 -130 173 -109 1 132 -167 79 64 -168 154 -43
6564 -43 -102 218 -112 -45 109 -182 122 48 -216 131 27 -191 147 -144 -2 163 -156 78 92 -190 104 -31
6586 -31 -134 147 -126 -45 147 -188 46 85 -184 139 -13 -120 171 -120 -41 141 -182 61 95 -175 142 -4
6608 -4 -130 187 -99 -26 172 -166 55 88 -176 141 -7 -135 183 -121 -57 167 -188 53 86 -189 126 -20
$$ packed form
6454e8p5L30l92J80J40l13K46lk35L38j89p1L01l25J14J56l13K55k7k26L34k15
6476d8n8K93l30J22J63l17K39k0k17L20k01o9K94l23J02J86l30K55rk28L44k16
6498d8p7L13l21J06J82l29K69k7k45L48k05p6L13l23J10J77l29K54l3k29L35j90
6520b5r2L09l12R4J77l24K42rk26L09j85q6L04l05Q1J89l26K37lk37L20j78q8
6543a34L02l01J02J66l11K43Lk67L50j82j01L03k82J10J31k99K46j5k32L22j97
6564d3n9L20l30O7J54k91L04p4k64L47j04k18L38k91J42J65l19K34J4k82K94j35
6586c1j03K81k73Q1J92l35K34L9k69L23j52j07K91k91P9J82l23K43L4k70L17j46
6608dj26L17k86P3J98l38K21L3k64L17j48j28L18l04O4K24l55K41L3k75L15j46
$$ plain form
6630 -20 -136 170 -119 -50 155 -183 29 89 -191 127 -12 -130 159 -109 -45 162 -173 30 107 -178 121 -7
6652 -7 -130 173 -100 -53 169 -162 39 117 -169 133 10 -125 174 -95 -59 173 -177 38 97 -179 106 -11
6674 -11 -147 165 -113 -74 171 -176 10 90 -190 105 -17 -154 172 -119 -72 167 -167 27 116 -179 125 -2
6696 -2 -129 178 -103 -61 176 -152 25 114 -164 127 12 -136 181 -87 -63 181 -144 25 130 -167 106 11
6718 11 -138 180 -79 -78 168 -160 6 101 -182 91 4 -162 163 -98 -82 167 -169 13 103 -178 112 9
6740 9 -151 182 -83 -93 184 -148 6 128 -154 109 14 -140 187 -78 -91 175 -131 51 135 -172 83 45
6762 45 -162 180 -32 -55 210 -168 70 76 -179 92 0 -158 97 -85 -52 160 -198 1 93 -240 112 39 -151
6785 -151 211 -90 -55 106 -155 9 124 -188 42 85 -183 220 -68 -34 201 -163 71 179 -207 104 64
$$ packed form
6630b0j16L06k89O9K05l38K12O0k80L18j39j18K89k68O4K07l35K03P7k85K99j28
6652gj23L03k73M7K22l31K01P8k86L02j23j35K99k69L6K32l50K15N9k76K85j17
6674a1j36L12k78L9K45l47J86Q0k80K95j22j37L26k91M7K39l34J94Q9k95L04j27
6696bj27L07k81M2K37l28J77Q9k78K91j15j48L17k68K4K44l25J69J05k97K73r5
6718A1j49L18k59JK46l28J66R5k83K73q7j66L25k61J6K49l36J82R0k81K90j03
6740Ij60L33k65j0K77l32J54J22k82K63r5j54L27k65j3K66l06J82Q4l07K55l8
6762D5k07L42k12k3K65l78K38Ok55K71r2j58K55j82L3K12l58J99R2l33L52p3j90
6785a51L62l01L5J61k61J64J15l12K30M3k68M03k88L4K35l64K34J08l86L11m0
$$ plain form
6806 64 -160 155 -15 -85 160 -148 43 81 -172 75 -35 -182 165 -23 -72 173 -141 -8 123 -181 125
6827 125 38 -167 147 -19 -145 174 -136 -35 114 -153 92 30 -128 131 -44 -130 136 -153 -13 181 -144
6848 -144 114 51 -178 181 -62 -94 211 -114 43 180 -197 102 58 -206 179 -61 -93 181 -136 -4 85 -209
6870 -209 71 49 -193 157 -37 -131 174 -158 -36 121 -173 102 44 -170 176 -33 -105 174 -108 -3 133
6891 133 -169 96 66 -159 165 -36 -85 197 -116 1 156 -152 91 71 -176 168 -41 -111 189 -126 -26
6912 -26 136 -165 87 58 -182 146 -52 -128 175 -146 -24 126 -204 81 57 -183 158 -24 -106 190 -138 -22
6934 -22 152 -176 90 60 -163 161 -33 -108 191 -126 -28 174 -166 82 108 -162 166 -36 -101 193 -130 -7
6956 -7 173 -165 88 72 -188 151 -28 -127 182 -141 -25 142 -160 62 55 -187 141 -46 -160 167 -137 -42
$$ packed form
6806F4k24L15j70p0K45l08J91L8k53K47j10j47L47j88m9K45l14J33J31l04L06
6827A25q7k05L14j66j26L19l10J01J49k67K45o2j58K59j75q6K66k89J40J94l25
6848a44K58o3k29L59k43l2L05l25J57J37l77K99m4k64L85k40l2K74l17J32Q9k94
6870b09K80k2k42L50j94r4L05l32J22J57k94K75n8k14L46k09p2K79k82J05J36
6891A33l02K65l0k25L24k01m9K82l13J17J55l08K43k0k47L44k09p0L00l15J00
6912b6J62l01K52k9k40L28j98p6L03l21J22J50l30K85k4k40L41j82q2K96l28J16
6934b2J74l28K66l0k23L24j94p5K99l17R8K02l40K48K6k70L28k02o5K94l23J23
6956gJ80l38K53j6k60L39j79r9L09l23J16J67l02K22pk42L28j87j14L27l04R5
$$ plain form
6978 -42 150 -198 68 81 -168 168 -35 -110 188 -147 -45 129 -180 76 88 -156 152 -25 -104 220 -147 -56
7000 -56 185 -159 41 78 -191 167 -29 -120 162 -111 -30 191 -165 13 75 -192 145 -42 -136 209 -127 -23
7022 -23 173 -160 97 78 -144 144 -69 -108 187 -112 -42 163 -168 36 82 -190 141 -66 -120 222 -75 -57
7044 -57 189 -127 110 77 -204 179 18 -130 217 -102 -65 230 -119 49 39 -168 104 32 -170 105 -66 -53
7066 -53 157 -155 45 92 -117 112 -4 -182 165 -125 -71 164 -207 -10 -2 -203 125 13 -132 204 -66 -71
7088 -71 153 -123 113 49 -178 107 -20 -107 201 -130 -75 207 -141 22 101 -229 137 31 -114 199 -64 -85
7110 -85 166 -152 71 40 -219 152 27 -146 208 -121 -143 119 -136 114 105 -129 127 -20 -152 149 -138 -79
7132 -79 143 -90 76 63 -211 172 -58 -130 184 -85 -11 135 -124 -1 63 -161 190 27 -152 146 -88 -83
$$ packed form
6978d2J92l48K66J3k49L36k03p5K98l35J02J74l09K56J2k44L08j77p9L24l67R1
7000e6K41l44K00L7k69L58j96r1K82k73Q1K21l56J78O2k67L37j87r4L45l36J04
7022b3J96l33K57j9k22K88k13l9K95k99P0K05l31K04M6k72L31k07n4L42k97J8
7044e7K46l16K37l3k81L83j61j48L47l19L7K95l49J68j0k07K72p2k02K75j71J3
7066e3K10l12K00M7k09K29j16j78L47k90N4K35l71J97Qk01L28j12j45L36k70n
7088g1K24k76K36o4k27K85j27q7L08l31N5K82l48J63P9l30L66j06j45L13k63k1
7110h5K51l18K23l1k59L71j25j73L54l29k2K62k55K50rk34K56j47j32L01k87N9
7132g9K22k33J66j3k74L83k30p2L14k69P4J46k59J23O4k24L51j63j79K98k34N
$$ plain form
7154 -83 113 -156 46 103 -214 153 -5 -145 158 -50 -65 195 -183 1 97 -158 100 20 -175 179 -38 -40
7176 -40 160 -160 37 98 -199 141 30 -175 172 -68 -68 168 -136 59 128 -188 136 23 -154 191 -77 -78
7198 -78 181 -148 56 101 -190 149 18 -147 168 -88 -91 144 -186 25 104 -204 111 36 -155 160 -48 -48 159
7221 159 -139 45 112 -202 123 19 -130 218 -76 -73 194 -145 13 120 -175 122 45 -163 216 -56 -63 186
7243 186 -103 29 108 -148 125 69 -120 201 -43 -82 106 -164 6 78 -177 64 53 -201 207 -59 -101 155
7265 155 -144 5 128 -226 19 21 -116 108 -42 -75 155 -156 -8 136 -251 159 10 -153 229 -63 -49
7286 -49 206 -129 -24 138 -156 111 48 -119 176 -144 -121 173 -189 -31 229 -148 82 32 -129 172 -17
7307 -17 -87 162 -165 -22 43 -221 75 41 -154 275 -111 -132 261 -173 -2 206 -161 155 29 -157 157 -47
$$ packed form
7154h3J96k69K02N7l17L67j58j40L03k08j5K60l78J84R6k55K58q0j95L54k17k
7176d0K00l20J97O1k97L40j11k05L47k40%K36l04J95O9l16L24j13j77L45k68j
7198g8K59l29K04M5k91L39j31j65L15k56lK35l30K11P9l08L15p5j91L15k08%K07
7221A59k98J84O7l14L25j04j49L48k94LK67l39J58J07k95K97p7k08L79k72pK49
7243A86k89J32P9k56K73n6j89L21k44l9J88k70J70P2k55K41j1k54M08k66m2K56
7265A55k99J49J23l54K45Kj37K24j50l3K30l11J48J44l87M10j49j63L82k92J4
7286d9K55l35J05J62k94K67o3j67K95l20K3K94l62J58K60l77K30n0j61L01j89
7307a7p0K49l27J43O5k64K96l4j95M29l86k1L93m34J71K08l67L16j26j86L14k04
$$ plain form
7329 -47 -62 201 -27 5 166 -186 82 55 -192 260 -26 -59 166 -202 21 127 -143 110 -24 -158 161 -85
7351 -85 -114 236 -158 -10 115 -185 81 14 -77 184 -37 -114 211 -125 61 111 -173 117 56 -183 180 -46
7373 -46 -197 241 -93 40 111 -202 142 30 -150 194 -69 -45 184 -123 40 147 -162 118 23 -186 171
7394 171 -63 -89 135 -75 4 120 -149 54 41 -161 197 -78 -141 158 -147 -3 83 -214 102 57 -144 144
7416 144 -30 -135 224 -92 -21 174 -195 117 -33 -149 186 19 -105 165 -76 -13 152 -179 108 58 -139
7437 -139 162 -7 -119 146 -38 -33 138 -197 115 28 -180 162 -41 -132 161 -138 -28 123 -175 88 49 -191
7459 -191 158 -32 -124 164 -107 -24 128 -158 99 59 -172 155 -15 -104 178 -98 -7 134 -148 93 75 -174
7481 -174 160 -9 -113 178 -104 -11 139 -150 95 77 -173 157 -22 -119 167 -120 -35 130 -170 75 54 -193
$$ packed form
7329d7j5K63k28L2J61l52K68k7k47M52k86l3K25l68K23J06k70K53j34j34L19k46
7351h5k9L50l94J48J25l00K66o7r1K61k21p7L25l36J86N0k84K90o1k39L63k26
7373d6j51M38l34J33P1l13L44j12j80L44k63K4K29l07J63J07l09K80r5k09L57
7394A71k34k6K24k10P9J16k69K03j3k02L58k75o3K99l05J44Q6k97L16m5k01K88
7416A44j74j05L59l16P1J95l69L12j50j16L35j67j24K70k41O3J65l31K87n0j97
7437a39L01j69j12K65j84NJ71l35L12q7k08L42k03r1K93k99J10J51k98K63l9k40
7459a91L49j90r2K88k71Q3J52k86K57m0k31L27j70q9K82k76R1J41k82K41j8k49
7481a74L34j69j04K91k82R3J50k89K45j8k50L30j79r7K86k87Q5J65l00K45k1k47
$$ plain form
7503 -193 135 -36 -131 155 -133 -34 139 -171 76 63 -173 146 -22 -127 171 -99 -10 154 -164 80 87 -159
7525 -159 149 -1 -102 176 -82 -22 158 -157 80 96 -168 138 0 -107 174 -98 -24 144 -167 69 77 -182
7547 -182 140 -11 -129 151 -110 -37 142 -171 63 76 -178 125 -23 -119 157 -109 -25 142 -158 76 89 -156
7569 -156 140 -3 -100 181 -87 -13 160 -156 74 86 -162 150 5 -119 159 -89 -23 146 -160 61 101 -161
7591 -161 125 -11 -134 155 -98 -53 147 -153 44 84 -168 119 -15 -140 152 -109 -46 137 -170 54 75
7612 75 -167 130 12 -120 172 -81 -25 152 -134 61 97 -145 142 12 -115 179 -82 -34 161 -151 53
7633 53 95 -170 129 -5 -118 159 -81 -58 143 -147 42 81 -173 114 -7 -139 153 -95 -62 147 -148 29
7655 29 85 -157 112 -1 -135 162 -71 -57 152 -135 52 98 -141 135 20 -119 182 -72 -52 162 -132 61
$$ packed form
7503a93L28j71r5K86k88R9J73l10K47j3k36L19j68j05K98k70Q9J64l18K44Pk46
7525a59L08j50j01K78k58O0J80l15K37J6k64L06j38j07K81k72P4J68l11K36Qk59
7547a82L22j51j18K80k61P3J79l13K34J3k54L03j48r6K76k66Q4J67l00K34J3k45
7569a56K96j43r7K81k68P4J73l16K30J2k48L12j45j24K78k48O6J69l06K21M0k62
7591a61K86j36j23K89k53M5K00l00J97M0k52K87j34j25K92k61O3J83l07K24K1
7612G5k42K97j18j32K92k53N6J77k86J95L6k42K87j30j27K94k61M8J95l12K04
7633E3M2k65K99j34j13K77k40K3K01k90J89L9k54K87j21j32K92k48L3K09k95J77
7655B9N6k42K69j13j34K97k33J4K09k87J87M6k39K76j15j39L01k54K0K14k94J93
$$ plain form
7677 61 100 -155 133 7 -123 170 -82 -59 147 -142 35 89 -167 109 9 -141 157 -77 -71 145 -149 28
7699 28 91 -159 118 16 -136 166 -69 -65 160 -134 30 85 -157 133 22 -129 166 -66 -62 153 -128 41
7721 41 108 -168 126 18 -144 157 -58 -61 152 -121 44 98 -168 124 7 -154 145 -81 -68 136 -145 22
7743 22 89 -184 101 4 -166 155 -62 -80 134 -141 21 97 -177 100 29 -135 160 -48 -58 161 -111 35
7765 35 114 -153 126 49 -141 159 -48 -79 145 -119 36 117 -164 107 35 -147 166 -55 -75 137 -135 18
7787 18 91 -187 99 17 -162 142 -57 -80 145 -145 18 93 -189 99 24 -147 146 -59 -66 156 -132 25 110
7810 110 -165 105 45 -128 159 -39 -64 154 -121 23 126 -152 106 61 -140 150 -31 -69 159 -121 25
7831 25 123 -176 104 40 -157 142 -55 -85 139 -132 13 105 -178 97 44 -153 138 -56 -83 150 -123 16
$$ packed form
7677F1L9k55K88j26j30K93k52K3K06k89J77N4k56K76j00j50K98k34OK16k94J77
7699B8O3k50K77j02j52L02k35MK25k94J64N5k42K90j11j51K95k32MK15k81J69
7721D1O7k76K94j08j62L01k15lK13k73J65N4k66K92j17j61K99k26J3K04k81J67
7743B2O7k73K85r7j70L21k17j8K14k75J62P6k74K77p1j64K95k08j0K19k72J46
7765C5P9k67K79p7j90L00k07l1K24k64J55Q1k81K71p2j82L13k21k0K12k72J53
7787A8P3k78K86q2j79L04j99k3K25k90J63P5k82K88p5j71K93k05pK22k88J57Q5
7810A10k75K70o0j73K87j98k5K18k75J44J03k78K58m5k01K90j81l8K28k80J46
7831B5R8k99K80o4j97K99j97l0K24k71J45R2k83K75n3j97K91j94k7K33k73J39
$$ plain form
7853 16 110 -175 102 49 -138 158 -35 -65 168 -122 42 136 -160 113 52 -129 151 -31 -72 158 -115 14
7875 14 118 -174 98 41 -143 139 -54 -91 137 -132 -11 112 -176 81 39 -143 138 -46 -91 151 -135 3
7897 3 120 -169 91 43 -147 144 -41 -75 153 -124 22 127 -152 106 57 -137 165 -37 -65 167 -115 19
7919 19 135 -148 93 62 -141 150 -45 -87 153 -129 -2 107 -169 75 33 -153 134 -41 -90 157 -128 -23
7941 -23 110 -159 76 46 -148 141 -32 -102 165 -107 -10 128 -141 84 69 -138 152 -26 -76 169 -101 18
7963 18 126 -141 100 51 -142 153 -33 -74 158 -110 2 125 -155 79 40 -147 131 -50 -87 138 -131 -12
7985 -12 107 -168 74 48 -146 136 -32 -97 152 -113 -14 121 -154 76 52 -139 136 -14 -94 164 -103 -15
8007 -15 129 -139 88 55 -146 151 -17 -97 161 -96 -2 119 -126 80 54 -147 138 -32 -97 147 -112 -18
$$ packed form
7853A6R4k85K77n3j87K96j93l0K33k90J64R4k96K73o1j81K80j82m1K30k73J29
7875A4J04k92K72n7j84K82j93l7K28k69J21J23k88K57m2j82K81j84m5K42k86J38
7897CJ17k89K60m8j90K91j85l4K28k77J46J05k79K58m9j94L02k02k8K32k82J34
7919A9J16k83K41l1k03K91j95m2K40k82J27J09k76K44m2j86K87j75m9K47k85J05
7941b3J33k69K35l0j94K89j73p0K67k72R7J38k69K25j5k07K90j78n0K45k70J19
7963A8J08k67K41m9j93K95j86m1K32k68J12J23k80K34l9j87K78j81l7K25k69J19
7985a2J19k75K42k6j94K82j68o5K49k65R9J35k75K30k4j91K75j50q0K58k67Q8
8007a5J44k68K27l3k01K97j68q0K58k57R4J21k45K06k6k01K85j70o5K44k59R4
$$ plain form
8029 -18 110 -162 72 45 -160 131 -42 -107 150 -109 -21 119 -157 82 51 -162 132 -17 -103 160 -87 7
8051 7 130 -142 85 81 -142 145 4 -80 167 -90 -10 125 -148 83 78 -148 134 -14 -108 144 -99 -19 128
8074 128 -152 70 51 -163 117 -35 -119 134 -99 -24 106 -162 64 56 -153 119 -30 -99 138 -109 -15 123
8096 123 -145 70 68 -152 138 -5 -99 158 -80 -9 138 -139 81 76 -140 119 6 -91 148 -77 -20 118 -157
8119 -157 63 62 -167 102 -13 -119 130 -106 -32 120 -149 49 75 -162 112 -12 -116 126 -93 -24 124 -162
8141 -162 61 70 -160 118 2 -99 147 -87 -7 135 -143 67 80 -142 122 -2 -105 154 -86 -17 135 -133
8163 -133 55 91 -143 114 -3 -113 126 -92 -35 132 -166 42 74 -177 93 -4 -113 135 -98 -37 133 -156
8185 -156 33 85 -157 104 -3 -110
$$ packed form
8029a8J28k72K34k7k05K91j73o5K57k59Q8J40k76K39l1k13K94j49q6K63k47R4
8051GJ23k72K27mk23K87j41q4K47k57Q0J35k73K31nk26K82j48r4K52k43Q0J47
8074A28k80K22j9k14K80j52q4K53k33P5J30k68K26qk09K72j49o9K37k47R4J38
8096A23k68K15kk20K90j43r4K57k38P1J47k77K20nk16K59j13r7K39k25N7J38k75
8119a57K20jk29K69j15j06K49k36P4J52k69J98K6k37K74j24j04K42k19O9J48k86
8141a62K23Rk30K78j16j01K46k34Q0J42k78K10J3k22K64j24j03K59k40O9J52k68
8163a33J88L6k34K57j17j10K39k18N7J67k98K08L2k51K70r7j09K48k33O1J70k89
8185a56J89N2k42K61j07j07
8191a10
$$ Imaginary data points
##PAGE= N=2
##DATA TABLE= (X++(I..I)), XYDATA
$$ plain form
0 0 0 0 0 0 0 0 0 0 0 0 0 0 0 -8 8 -8 8 -8 8 -16 16 -18 24 -25 32 -35 40 -48 56 -64 72 -81 91 -104 115 -131
36 -131 147 -164 183 -202 224 -249 275 -305 335 -372 408 -449 495 -545 599 -661 729 -805 890
55 890 -989 1101 -1234 1387 -1572 1799 -2080 2444 -2933 3618 -4648 6341 -9555 17568 -71676
70 -71676 -70538 152253 -121233 9936 96950 -131106 81230 21075 -109416 126251 -59531
81 -59531 -49318 122051 -111840 27546 78487 -133609 99389 8616 -116898 138267 -55941
92 -55941 -66579 133899 -100706 4434 86430 -114877 70046 16201 -94980 111748 -52057
103 -52057 -43907 111882 -102220 22672 74221 -123430 84584 16140 -108119 120856 -42326
114 -42326 -62500 116652 -86190 927 76108 -102272 63883 15499 -86391 102655 -47089
$$ packed form
0@%%%%%%%%%%%%%qJ6j6J6j6J6k4L2l4M2m9N7o7P5q8J04j20J36j53J72j95K19k46
36a31K78l11L47l85M26m73N24n80O40p07P80q57R44j040J144j260J390j534J695
55H90j879K090k335K621k959L371l879M524n377O551q266J0989j5896K7123q9244
70g1676J138K22791k73486J31169Q7014k28056K12336o0155j30491K35667j85782
81e9531J0213J71369k33891J39386N0941k12096K32998r0773j25514K55165j94208
92e5941j0638K00478k34605J05140Q1996k01307J84923n3845j11181K06728j63805
103e2057Q150J55789k14102J24892N1549j97651K08014o8444j24259K28975j63182
114d2326k0174J79152k02842Q7117P5181j78380J66155m8384j01890J89046j49744
$$ plain form
125 -47089 -42767 104316 -94964 16832 73976 -113554 72796 22857 -100780 103854 -31573
136 -31573 -59022 100437 -72881 799 67359 -89968 57100 14601 -79377 91302 -40462
147 -40462 -41857 95701 -81985 10348 70749 -100741 58177 26380 -90981 85983 -21526
158 -21526 -52634 86327 -60968 17 59067 -80996 50575 14549 -74481 83905 -32875
169 -32875 -42339 89670 -72535 3174 68397 -91664 47515 29623 -82692 75362 -15849
180 -15849 -48778 77271 -55445 -529 54694 -76105 47594 16547 -71709 78312 -27722
191 -27722 -44095 84201 -64284 -2635 66154 -80914 38550 30306 -73742 63998 -12766
202 -12766 -43637 68001 -49459 163 50695 -69557 42263 17173 -67564 69953 -21881
$$ packed form
125d7089M322J47083j99280J11796N7144j87530J86350m9939j23637K04634j35427
136c1573k7449J59459j73318P3680O6560j57327J47068m2499r3978J70679j31764
147d0462j395J37558j77686R2333O0401j71490J58918l1797j17361J76964j07509
158b1526l1108J38961j47295O0985N9050j40063J31571l6026q9030J58386j16780
169c2875r464J32009j62205P5709O5223j60061J39179j7892j12315J58054r1211
180a5849l2929J26049j32716N4916N5223j30799J23699l1047q8256J50021j06034
191b7722j6373J28296j48485O1649O8789j47068J19464q244j04048J37740p6764
202a2766l0871J11638j17460M9622N0532j20252J11820k5090q4737J37517r1834
$$ plain form
213 -21881 -43730 77167 -53848 -6811 61497 -70463 29868 28823 -65090 55248 -10738
224 -10738 -38477 62560 -45795 -381 48501 -66508 37921 19151 -65554 65239 -16329
235 -16329 -44298 72793 -47594 -10836 58609 -63869 24669 28106 -58959 51066 -10354
246 -10354 -36061 59428 -44579 -1491 48380 -64037 34144 22307 -63348 59146 -11357
257 -11357 -44663 66328 -40150 -13397 54019 -55019 20286 25585 -52476 45556 -10046 -33339
269 -33339 55587 -41037 -2986 47686 -59130 28283 23948 -59768 51818 -6458 -43239 59995
281 59995 -33109 -14474 49338 -48912 17216 23054 -48507 43349 -9761 -32452 55140 -39150
293 -39150 -5843 48291 -56869 23739 26294 -57708 47310 -2561 -42335 55580 -29291 -15253
$$ packed form
213b1881k1849J20897j31015M7037O8308j31960J00331j045r3913J20338o5986
224a0738k7739J01037j08355M5414M8882j15009J04429j8770q4705J30793q1568
235a6329k7969J17091j20387L6758O9445j22478Q8538L437q7065J10025o1420
246a0354k5707R5489j04007M3088M9871j12417R8181j1837q5655J22494p0503
257a1357l3306J10991j06478K6753O7416j09038P5305N299p8061R8032n5602k3293
269c3339Q8926r6624L8051N0672j06816Q7413m335q3716J11586n8276l6781J03234
281E9995r3104J8635O3812r8250O6128N838p1561R1856n3110k2691Q7592r4290
293c9150L3307N4134j05160Q0608K555q4002J05018m9871l9774R7915q4871J4038
$$ plain form
305 -15253 45809 -45104 16226 21437 -46043 42452 -9144 -33116 53897 -36322 -9140 48139
317 48139 -52026 18564 27760 -53063 40579 358 -39729 49064 -24474 -14746 41245 -39940
329 -39940 14820 19705 -43313 39493 -7410 -33243 51371 -31536 -12156 46851 -46392 13377
341 13377 27775 -48827 35106 2410 -37128 44782 -21670 -13926 38689 -38345 14221 19532
353 19532 -43270 38631 -5141 -34741 50473 -28038 -15131 45835 -42906 10074 28004 -45724
365 -45724 31642 3780 -34966 41359 -20026 -13249 36427 -36649 13692 19821 -42446 36358
377 36358 -2083 -35502 46732 -22886 -17140 42595 -36922 6757 26617 -40723 27116 4463
389 4463 -32155 37033 -17462 -12510 33880 -34116 12273 20232 -41404 33022 1132 -35755 43106
$$ packed form
305a5253O1062r0913O1330N211o7480Q8495n1596k3972Q7013r0219K7182N7279
317D8139j00165P0590R196q0823R3642m0221m0087Q8793p3538R728N5991q1185
329c9940N4760M885o3018Q2806m6903k5833Q4614q2907J9380N9007r3243N9769
341A3377J4398p6602Q3933l2696l9538Q1910o6452P744N2615p7034N2566N311
353A9532o2802Q1901m3772k9600Q5214p8511J2907O0966q8741N2980J7930p3728
365d5724P7366k7862l8746P6325o1385O777M9676p3076N0341O129o2267P8804
377C6358l8441l3419Q2234o9618N746N9735p9517M3679J9860o7340O7839k2653
389D463l6618O9188n4495M952M6390o7996M6389P959o1636P4426l1890l6887P8861
$$ plain form
402 43106 -18111 -18497 39727 -32660 4682 25285 -38109 24994 4884 -30921 35464 -16517
414 -16517 -12404 33531 -33851 11213 21648 -41613 31154 4061 -36476 40526 -14467 -19469
426 -19469 37035 -29324 3468 23786 -35336 23309 4733 -29344 33647 -15406 -12592 32474
438 32474 -31810 9158 22280 -39554 27265 6642 -35092 35688 -10603 -19128 33059 -25166
450 -25166 2337 21530 -31965 21359 4415 -27750 31886 -14223 -12905 31941 -30201 6913
462 6913 23318 -37888 23966 8538 -33766 32672 -8631 -18521 31017 -23617 2346 20578
474 20578 -31084 21125 4249 -27597 31917 -14042 -13816 32771 -29310 4648 24541 -36264
486 -36264 20852 9944 -31976 29337 -7090 -17186 28521 -21976 2267 19371 -29443 19749
$$ packed form
402D3106o1217l86N8224p2387L7342K0603o3394O3103k0110l5805O6385n1981
414a6517M113M5935o7382M5064J0435o3261P2767k7093m0537P7002n4993n002
426a9469N6504o6359L2792K0318n9122N8645j8576l4077O2991m9053K814M5066
438C2474o4284M0968J3122o1834O6819k0623m1734P0780m6291q525N2187n8225
450b5166K7503J9193n3495N3324j6944l2165N9636m6109J318M4846o2142L7114
462F913J6405o1206O1854j5428m2304O6438m1303r890M9538n4634K5963J8232
474B0578n1662N2209j6876l1846N9514m5959K26M6587o2081L3958J9893o0805
486c6264N7116j0908m1920O1313l6427j0096M5707n0497K4243J7104m8814M9192
$$ plain form
498 19749 4439 -26642 30268 -12347 -14578 31693 -26380 1799 24426 -32751 16676 10781
510 10781 -28618 25448 -5957 -15369 26109 -20775 2227 18695 -28460 18791 5247 -26397
522 -26397 29198 -10923 -15511 31202 -24618 -73 24539 -30609 14635 10767 -26771 23894
534 23894 -6329 -14256 25500 -21091 2694 19034 -28751 18318 6079 -26845 28254 -9443
546 -9443 -16434 30301 -22076 -1720 23605 -27749 12297 10147 -24242 21701 -6020 -12878 24181
559 24181 -19985 2044 18744 -27406 16154 7250 -25897 25742 -6691 -16708 27841 -18741
571 -18741 -3238 21812 -24577 10516 9466 -22073 20549 -5913 -12618 23679 -19477 1066
583 1066 19190 -26771 14950 8507 -25830 24427 -5253 -17418 26631 -17027 -3901 20903
$$ packed form
498A9749j5310l1081N6910m2615k231M6271n8073K8179K2627n7177M9427n895
510A0781l9399N4066l1405r412M1478m6884K3002J6468m7155M7251j3544l1644
522b6397N5595m0121m588M6713n5820K4545K4612n5148M5244l868l7538N0665
534B3894l0223p927L9756m6591K3785J6340m7785M7069j2239l2924N5099l7697
546i443o991M6735n2377K0356K5325n1354M0046k150l4389M5943k7721o858L7059
559B4181m4166K2029J6700m6150M3560q904l3147N1639l2433j0017M4549m6582
571a8741J5503K5050m6389L5093j050l1539M2622k6462o705L6297m3156K0543
583A066J8124m5961M1721o443l4337N0257k9680j2165M4049m3658J3126K4804
$$ plain form
595 20903 -22908 10225 8602 -21435 20445 -6319 -12901 23955 -18913 186 19807 -25788
607 -25788 13164 9323 -25168 22198 -3411 -17111 24469 -14266 -4316 18914 -20500 9052
619 9052 7655 -19947 19308 -5478 -12740 23091 -17004 -1408 19298 -23790 10737 10018 -23548
632 -23548 19791 -1631 -16461 22114 -12555 -4533 17286 -19193 9001 7266 -19517 19423
644 19423 -5125 -13584 23029 -16335 -2595 19641 -22849 9751 10712 -22964 18492 -1024 -16255
657 -16255 20804 -11695 -4019 16517 -18494 9336 6989 -19740 19015 -4465 -14255 22559 -14451
670 -14451 -3676 19307 -20804 7694 10747 -21360 15938 193 -14907 18554 -9949 -3623
682 -3623 14838 -17424 8600 6844 -19305 17983 -2809 -14549 21338 -12323 -4981 18187 -18952
$$ packed form
595B0903m3811L3133j623l0037M1880k6764o582L6856m2868J9099J9621m5595
607b5788L8952l841l4491M7366k5609j3700M1580l8735R950K3230l9414K9552
619I052j397k7602L9255k4786p262L5831m0095J5596K0706m3088L4527p19l3566
632b3548M3339k1422j4830L8575l4669Q022K1819l6479K8194j735k6783L8940
644A9423k4548q459L6613l9364J3740K2236m2490L2600R61l3676M1456j9516j5231
657a6255L7059l2499P676K0536l5011K7830k347k6729L8755k3480r790L6814l7010
670a4451J0775K2983m0111K8498L053l2107L7298j5745j5100L3461k8503O326
682c623J8461l2262K6024j756k6149L7288k0792j1740L5887l3661P342K3168l7139
$$ plain form
695 -18952 6188 10674 -19747 14721 605 -14048 17391 -9934 -3331 14409 -17586 9018
707 9018 7495 -19751 17968 -1949 -15462 20778 -11364 -5669 17925 -17657 5661 10503 -18741
720 -18741 13725 298 -13355 16567 -9806 -2731 14434 -17312 8483 8047 -19778 16257 -523
733 -523 -15435 19057 -9032 -6021 16476 -15497 4236 9613 -16980 12085 538 -12010 15585
746 15585 -9170 -2807 14070 -16901 7147 8783 -19171 14757 1078 -14932 17511 -7865
758 -7865 -6157 15310 -14687 4042 9330 -16133 12107 301 -11740 15560 -9796 -3040 14699
771 14699 -17175 6720 9999 -19040 13609 1841 -14768 16114 -7237 -5814 14593 -13771
783 -13771 4054 8977 -15568 11258 192 -11488 14960 -9082 -3314 14846 -15976 5065
$$ packed form
695a8952K5140M486l0421L4468j4116j4653L1439k7325O603J7740l1995K6604
707I018j523k7246L7719j9917j3513L6240l2142N695K3594l5582K3318M842k9244
720a8741L2466j3427j3653K9922k6373P075J7165l1746K5795m36k7825L6035j6780
733e23j4912L4492k8089L011K2497l1973J9733N377k6593K9065j1547j2548K7595
746A5585k4755O363J6877l0971K4048J636k7954L3928j3679j6010L2443k5376
758g865J708K1467k9997J8729N288k5463K8240j1806j2041K7300k5356O756J7739
771A4699l1874K3895L279k9039L2649j1768j6609L0882k3351J423K0407k8364
783a3771J7825M923k4545K6826j1066j1680K6448k4042N768J8160l0822K1041
$$ plain form
795 5065 10417 -17924 11134 2915 -13613 14115 -5638 -5316 13212 -12639 3396 8419 -14796
808 -14796 10494 774 -11113 14616 -8183 -4065 14630 -15256 3733 10792 -16951 10081 3559
821 3559 -12834 13224 -5599 -5180 12677 -12713 3624 8550 -14758 10802 916 -11651 14590
834 14590 -8042 -4880 14830 -14405 2949 11091 -15883 8927 3495 -12257 12127 -5158 -4810
847 -4810 12136 -11717 3412 8285 -14185 9825 1174 -11593 13814 -6538 -5440 14267 -12417
860 -12417 1447 10432 -14222 7364 3498 -10987 11240 -4554 -4496 11550 -11302 2804 8036
873 8036 -13818 9490 1669 -11573 13701 -5830 -6179 13840 -11702 722 10127 -13249 7250
886 7250 3152 -10456 11227 -5126 -4627 11611 -11402 2796 8403 -13636 9395 2029 -11919
$$ packed form
795E065N352k8341K9058q219j6528K7728j9753L22J8528k5851J6035N023k3215
808a4796K5290r720j1887K5729k2799M118J8695k9886J8989P059k7743K7032o522
821C559j6393K6058j8823M19J7857k5390J6337M926k3308K5560r886j2567K6241
834A4590k2632L162J9710k9235J7354Q142k6974K4810n432j5752K4384j7285L48
847d810J6946k3853J5129M873k2470K4010q651j2767K5407k0352J098J9707k6684
860a2417J3864Q985k4654K1586l866j4485K2227j5794N8J6046k2852J4106N232
873H036k1854K3308p821j3242K5274j9531l49K0019k5542J2424R405k3376K0499
886G250m098j3608K1683j6353M99J6238k3013J4198N607k2039K3031p366j3948
$$ plain form
899 -11919 13104 -5125 -6717 13335 -10175 156 9583 -11793 6361 2615 -9775 10463 -4734
912 -4734 -4439 11387 -10391 2094 8400 -12950 7931 2610 -11527 11825 -3620 -6744 12198
925 12198 -8652 -464 8499 -10812 5906 2332 -9155 10426 -4595 -4552 11345 -10391 1509
938 1509 8506 -12802 7663 3187 -11359 11420 -3183 -6768 11407 -8378 -143 7966 -10437
951 -10437 6490 2007 -9172 10612 -4808 -4932 11354 -9969 1215 8756 -12157 6889 3567
964 3567 -11002 10049 -2424 -6424 10235 -7168 24 7147 -9675 6037 1798 -9071 9960
977 9960 -3958 -5132 10906 -8722 399 8454 -11277 5601 3788 -10210 9010 -1740 -5846
990 -5846 9348 -6809 249 6557 -9800 6247 1985 -9177 10179 -3576 -5472 10801 -8514
$$ packed form
899a1919K5023j8229j592K0052k3510J0331R427k1376J8154l746j2390K0238j5197
912d734K95J5826k1778J2485O306k1350K0881n321j4137K3352j5445l124J8942
925A2198k0850Q188Q963j9311J6718l574j1487J9581j5021M3J5897k1736J1900
938A509O997k1308K0465m476j4546K2779j4603l585J8175j9785Q235Q109j8403
951a0437J6927m483j1179J9784j5420j24J6286k1323J1184P541k0913J9046l322
964C567j4569K1051j2473m000J6659j7403P192P123j6822J5712m239j0869J9031
977I960j3918j174J6038j9628R121Q055j9731J6878j813j3998J9220j0750m106
990e846J5194j6157P058O308j6357J6047m262j1162J9356j3755j896J6273j9315
$$ plain form
1003 -8514 31 8348 -10919 5492 3883 -9763 8684 -1851 -5496 8815 -7004 686 6507
1016 6507 -9781 6399 2209 -9333 9704 -3109 -5805 10161 -7529 -315 8080 -9863 4554
1029 4554 3827 -8979 7427 -1525 -4912 8060 -6352 726 6296 -9440 5672 2558 -9216
1042 -9216 8787 -2104 -5677 9486 -6629 -610 7639 -9257 4019 3665 -8390 7199 -1485
1055 -1485 -4479 7931 -6711 865 6411 -9842 5671 2999 -9275 8685 -1829 -5740 9136
1068 9136 -6550 -699 7397 -8926 4021 3592 -8021 6890 -1669 -4280 7652 -6760 786
1081 786 6624 -9494 5122 3430 -9072 7644 -1115 -5692 8217 -5462 -867 6919 -7948
1094 -7948 3320 3395 -7354 6171 -1481 -3984 7481 -6268 449 6689 -9096 4330 3735 -8728
$$ packed form
1003h514Q545Q317j9267J6411j609j3646J8447j0535l645J4311j5819P690N821
1016F507j6288J6180m190j1542J9037j2813k696J5966j7690P214Q395j7943J4417
1029D554p27j2806J6406q952l387J2972j4412P078N570j5736J5112l114j1774
1042i216J8003j0891l573J5163j6115O019Q249j6896J3276l54j2055J5589q684
1055a485k994J2410j4642P576N546j6253J5513k672j2274J7960j0514l911J4876
1068I136j5686N851Q096j6323J2947m29j1613J4911q559k611J1932j4412P546
1081G86N838j6118J4616j692j2502J6716q759m577J3909j3679M595P786j4867
1094g948J1268P5j0749J3525p652k503J1465j3749O717O240j5785J3426n95j2463
$$ plain form
1108 -8728 6948 -632 -5374 7812 -5182 -926 6522 -7759 3359 3049 -7139 6501 -1820
1121 -1820 -3981 7808 -6538 224 6975 -9159 4026 3994 -8438 6581 -585 -5211 7454 -5036
1135 -5036 -878 6227 -7303 3300 2954 -6820 6235 -1801 -4056 7720 -6133 -461 7156 -8210
1149 -8210 2990 4224 -7624 5467 -206 -4736 6677 -4428 -864 5902 -6769 2910 2805 -6545
1163 -6545 5983 -1646 -4232 7762 -5673 -953 7134 -7767 2408 4159 -7125 5173 -443
1176 -443 -4342 6674 -4713 -679 5837 -7017 3141 2790 -6708 6257 -1611 -4437 7856 -5534
1190 -5534 -1252 7131 -7328 2059 4029 -6541 4837 -508 -4030 6297 -4516 -613 5668 -6704
1204 -6704 2883 2968 -6510 5723 -1064 -4601 7250 -4569 -1728 6605 -6308 1501 3736 -5904
$$ packed form
1108h728J5676p580m742J3186j2994M256P448j4281J1118l10j0188J3640q321
1121a820k161J1789j4346O762O751j6134J3185l2j2432J5019p166m626J2665j2490
1135e036M158P105j3530J0603l46r774J3055q036k255J1776j3853N672P617j5366
1149h210J1200J234j1848J3091n673m530J1413j1105L564O766j2671R679j05r350
1163f545J2528p629k586J1994j3435M720Q087j4901J0175J751j1284J2298n616
1176d43l899J1016j1387M034O516j2854J0158l51r498J2965p868k826J2293j3390
1190e534M282Q383j4459R387J970j0570J1378n345l522J0327j0813L903O281j2372
1204f704R587Q5r478J2233o787l537J1851j1819K841Q333j2913P809K235r640
$$ plain form
1218 -5904 4335 -445 -3796 5970 -4310 -690 5611 -6538 2635 3034 -6557 5585 -757 -4810
1232 -4810 7037 -4150 -1754 6299 -6094 1654 3440 -5816 4629 -716 -3825 6213 -4439
1245 -4439 -703 5666 -6608 2710 3158 -6672 5478 -404 -4890 6657 -3655 -1871 5847 -5503
1259 -5503 1488 3076 -5489 4433 -579 -3856 5876 -3937 -989 5458 -6077 2157 3271 -6344 4815
1274 4815 109 -4863 6006 -2944 -1985 5278 -4968 1442 2848 -5326 4434 -502 -3920 5913 -3848
1289 -3848 -1171 5552 -5971 2084 3373 -6377 4783 247 -4868 5838 -2924 -1779 5140 -5030
1303 -5030 1738 2730 -5488 4624 -563 -4104 5996 -3712 -1329 5548 -5801 1812 3511 -6246
1317 -6246 4208 597 -4652 5268 -2444 -1748 4687 -4640 1551 2630 -5339 4269 -141 -4129 5635
$$ packed form
1218e904J0239m780l351R766j0280L620O301j2149R173L99r591J2142o342m053
1232d810J1847j1187K396Q053j2393P748J786r256J0445n345l109J0038j0652
1245d439L736O369j2274R318M48r830J2150n882m486J1547j0312J784P718j1350
1259e503O991J588q565R922n012l277R732r813K948O447j1535Q234J114r615J1159
1274D815m706m972J0869q950R59P263j0246O410J406q174R760m936l418R833r761
1289c848K677O723j1523Q055J289r750J1160m536n115J0706q762J145O919j0170
1303e030O768R92q218J0112n187l541J0100r708K383O877j1349P613J699r757
1317f246J0454l611n249R920p712O96O435r327O191J079p969R608m410l988R764
$$ plain form
1332 5635 -3134 -1647 5408 -5319 1278 3675 -5791 3698 894 -4372 4849 -2282 -1567 4464 -4730
1347 -4730 1777 2790 -5521 4388 -9 -4334 5684 -3155 -1775 5449 -5307 1312 3715 -5799
1361 -5799 3607 783 -4238 4693 -2501 -1292 4499 -4928 1898 2889 -5713 4231 191 -4479 5466
1376 5466 -2672 -1895 5272 -4828 863 3671 -5319 2990 905 -3808 4338 -2229 -1206 4349 -4767
1391 -4767 1564 3100 -5581 3772 729 -4377 5046 -2240 -2036 4987 -4538 633 3570 -5001 2953
1406 2953 796 -3667 4352 -2556 -1171 4532 -5086 1581 3414 -5692 3716 760 -4450 4927 -2320
1421 -2320 -1990 4944 -4469 775 3480 -4889 2946 563 -3575 4365 -2649 -1158 4772 -4931 1223
1436 1223 3587 -5461 3152 1043 -4235 4453 -1794 -1896 4636 -4025 441 3317 -4526 2576 649
$$ packed form
1332E635q769J487P055j0727O597K397r466R489k804n266R221p131P15O031r194
1347d730O507J013q311R909m397m325J0018q839J380P224j0756O619K403r514
1361e799R406k824n021Q931p194J209N791r427O826R91q602R944m040m670R945
1376E466q138P77P167j0100N691K808q990Q309k085m713Q146o567J023N555r116
1391d767O331J536q681R353l043n106R423p286K04P023r525N171K937q571P954
1406B953k157m463Q019o908J385N703r618O667J833r106R408k956n210R377p247
1421b320L30O934r413N244K705q369P835k383m138P940p014J491N930r703O154
1436A223K364r048Q613k109n278Q688o247j02O532q661M466K876p843P102j927
$$ plain form
1451 649 -3366 4245 -2400 -1360 4730 -4731 752 3681 -5206 2797 1256 -3978 4204 -1841 -1889 4481
1467 4481 -4104 514 3226 -4504 2872 563 -3482 4475 -2617 -1526 4945 -4736 720 3833 -5037
1482 -5037 2755 1130 -3938 4129 -1883 -1835 4461 -3868 562 3179 -4399 2713 523 -3535 4347
1497 4347 -2313 -1732 4931 -4173 231 3700 -4668 2190 1240 -3677 3768 -1500 -1810 4220 -3575 281
1513 281 2980 -4248 2563 619 -3516 4382 -2056 -2019 4819 -3965 -22 3604 -4404 2260 1168 -3515
1529 -3515 3910 -1728 -1860 4247 -3699 440 3016 -4279 2877 591 -3703 4499 -2094 -2252 4859
1544 4859 -3726 -83 3591 -4126 2102 996 -3488 3702 -1653 -1882 4158 -3389 331 3000 -4160
1559 -4160 2461 741 -3754 4175 -1532 -2419 4607 -3108 -482 3321 -3782 1737 1031 -3244 3610
$$ packed form
1451F49m015P611o645J040O090r461N483K929q887Q003j541n234Q182o045m8O370
1467D481q585M618K712p730P376k309m045P957p092J091O471r681N456L113q870
1482e037P792j625n068Q067o012M8O296q329M430K617p578P112k190m058P882
1497D347o660N81O663r104M404L469q368O858r50m917P445n268l10O030p795L856
1513B81K699p228O811j944m135P898o438L7O838q784L943L626q008O664j092m683
1529c515P425n638j32O107p946M139K576p295P156k286m294Q202o593j58P111
1544D859q585L643L674p717O228j106m484P190n355k29O040p547L720K669p160
1559d160O621j720m495P929n707q87P026p715K626L803p103N519p06m275O854
$$ plain form
1574 3610 -1419 -1855 4087 -3354 140 3014 -4165 2445 986 -3759 4177 -1328 -2501 4380 -3094
1589 -3094 -384 3191 -3720 2020 913 -3241 3767 -1668 -1922 4118 -3492 220 3161 -4204 2425
1604 2425 1111 -3883 3826 -1155 -2497 4104 -2777 -318 3045 -3497 1856 866 -3279 3463 -1352
1619 -1352 -1924 4000 -3080 13 3192 -4000 1912 1374 -3731 3400 -634 -2341 3755 -2440 -321
1634 -321 2770 -3482 1834 950 -3254 3514 -1179 -1982 3952 -3114 -126 3132 -4004 1926 1459 -3654
1650 -3654 3323 -706 -2240 3546 -2687 -102 2735 -3580 2074 991 -3387 3482 -1175 -2137 3838
1665 3838 -2942 -159 3213 -3762 1713 1579 -3515 2879 -529 -2127 3310 -2321 -104 2714 -3384
1680 -3384 1768 1160 -3368 3096 -744 -2114 3680 -2499 -398 3123 -3524 1281 1585 -3277 2655
$$ packed form
1574C610n029m36N942p441L494K874p179O610j459m745P936n505j173O881p474
1589c094K710L575o911N740j107m154P008n435k54O040p610L712K941p365O629
1604B425j314m994P709m981j342O601o881K459L363o542N353r90m145O742m815
1619a352n72N924p080L093L179p192N912n38n105P131m034j707O096o195K119
1634c21L091o252N316q84m204O768m693q03N934p066K988L258p136N930m67n113
1650c654O977m029j534N786o233K585K837o315N654j083m378O869m657r62N975
1665C838o780K783L372o975N475j34n094O394l408j598N437n631K217K818o098
1680c384N152o08m528O464l840j370N794o179K101L521o647M805L04m862N932
$$ plain form
1695 2655 -404 -1912 3199 -2393 -124 2659 -3545 1713 1273 -3324 3114 -736 -2139 3602 -2623
1710 -2623 -434 3067 -3499 1370 1633 -3129 2647 -556 -1851 3156 -2529 -89 2784 -3446 1668
1725 1668 1427 -3265 2847 -575 -2178 3412 -2285 -541 3101 -3129 985 1659 -2922 2195 -421
1740 -421 -1776 3006 -2221 -235 2818 -3279 1212 1550 -3193 2503 -317 -2126 3292 -2044 -713
1755 -713 2965 -3003 798 1539 -2761 2276 -475 -1672 3117 -2403 -288 2898 -3364 1223 1647 -3092
1771 -3092 2574 -332 -2115 3237 -2101 -707 2902 -2881 887 1526 -2616 2273 -560 -1741 3084
1786 3084 -2324 -457 3007 -3096 939 1747 -2953 2167 -139 -2137 2941 -1721 -863 2790 -2504
1801 -2504 577 1416 -2488 2052 -467 -1806 3084 -2046 -723 3029 -2868 582 1754 -2802 2005
$$ packed form
1695B655l059j508N111n592K269K783o204N258m40m597O438l850j403N741o225
1710b623K189L501o566M869K63m762N776l203j295N007n685K440K873o230N114
1725A668k41m692O112l422j603N590n697J744L642o230M114O74m581N117k616
1740d21j355M782n227J986L053o097M491L38m743N696k820j809N418n336J331
1755g13L678n968L801P41m300N037k751j197M789n520K115L186o262M587M24m739
1771c092N666k906j783N352n338J394L609n783L768O39m142M889k833j181M825
1786C084n408J867L464o103M035Q08m700N120k306j998N078m662Q58L653n294
1801b504L081Q39l904M540k519j339M890n130J323L752n897L450J172m556M807
$$ plain form
1816 2005 -49 -1996 2937 -1661 -822 2673 -2547 694 1330 -2495 2300 -492 -1844 3228 -2103
1831 -2103 -832 3011 -2809 574 1715 -2638 2030 -115 -1965 2793 -1683 -824 2582 -2406 680
1846 680 1346 -2457 2154 -380 -2022 3038 -1744 -1059 2907 -2373 296 1700 -2434 1663 9 -1909
1862 -1909 2595 -1377 -855 2493 -2216 563 1346 -2461 2035 -181 -2062 2952 -1467 -1094 2776 -2247
1878 -2247 284 1556 -2349 1772 -36 -1842 2650 -1474 -811 2431 -2350 656 1334 -2538 2109
1893 2109 -110 -2131 2844 -1385 -1157 2566 -2108 304 1470 -2255 1720 5 -1891 2469 -1272
1908 -1272 -907 2335 -2096 506 1427 -2415 1839 153 -2180 2546 -971 -1218 2390 -1747 191 1426
1924 1426 -2124 1547 110 -1855 2363 -1098 -919 2284 -2017 446 1406 -2440 1751 213 -2130
$$ packed form
1816B005k054j947M933m598Q39L495n220L241O36l825M795k792j352N072n331
1831b103J271L843n820L383J141m353M668k145j850M758m476Q59L406m988L086
1846F80O66l803M611k534j642N060m782O85L966n280K669J404m134M097j654j918
1862a909M504l972N22L348m709K779P83l807M496k216j881N014m419L73L870n023
1878b247K531J272l905M121j808j806M492m124O63L242m781L006O78l872M647
1893B109k219k021M975m229K28L723m674K412J166l725L975j715j896M360l741
1908a272L65L242m431K602R21l842M254j686k333M726l517k47L608m137J938J235
1924A426l550L671j437j965M218l461J79L203m301K463R60l846M191j538k343
$$ plain form
1939 -2130 2466 -957 -1135 2234 -1828 307 1281 -2182 1656 32 -1852 2390 -1189 -882 2240 -2061
1955 -2061 466 1436 -2376 1684 311 -2068 2277 -824 -1117 2121 -1659 220 1323 -2027 1472
1970 1472 197 -1795 2185 -941 -970 2198 -1825 230 1579 -2226 1321 526 -1971 1980 -612 -1078
1986 -1078 1977 -1569 183 1315 -2004 1382 216 -1788 2131 -969 -953 2195 -1880 190 1574
2001 1574 -2215 1275 476 -1840 1938 -754 -890 1940 -1680 312 1310 -2049 1408 240 -1745 2098
2017 2098 -929 -947 2196 -1778 98 1625 -2041 1051 583 -1683 1691 -625 -866 1830 -1563 169
$$ packed form
1939b130M596l423j78L369m062K135R74l463L838j624j884M242l579L07L122m301
1955b061K527R70l812M060j373k379M345l101k93L238l780J879J103l350L499
1970A472j275j992L980l126k9L168m023K055J349l805L547p95k497L951k592m66
1986a078L055l546J752J132l319L386j166k004L919l100J6L148m075K070J384
2001A574l789L490p99k316L778k692j36K830l620J992R98l359L457j168j985L843
2017B098l027j8L143l974J876J527l666L092m68k266L374k316k41K696l393J732
$$ [...]
8191A13
##END NTUPLES=NMR FID
##END=
