##TITLE=1H_LY-13Dix.2.B
 CD3CN, 8 sc, 
 2.06.2021
##JCAMPDX= 6.0         $$ Bruker NMR JCAMP-DX V2.0
##DATA TYPE= NMR FID
##DATA CLASS= NTUPLES
##ORIGIN= UXNMR, Bruker Analytische Messtechnik GmbH
##OWNER= root
$$ XWIN-NMR		Version 3.5
$$ Wed Jun  2 10:07:08 2021 Russian Standard Time (UT+4h)  she@DPX200
##.OBSERVE FREQUENCY= 200.131506
##.OBSERVE NUCLEUS= ^1H
##.DELAY= (6, 6)
##.ACQUISITION MODE= SIMULTANEOUS
##.ACQUISITION SCHEME= undefined
##.AVERAGES= 8
##.DIGITISER RES= 18
##SPECTROMETER/DATA SYSTEM= spect
##.PULSE SEQUENCE= zg30
##.SOLVENT NAME= CDCl3
##.SHIFT REFERENCE= (INTERNAL, CDCl3, 0, 15.7039)
##AUDIT TRAIL= $$ (NUMBER, WHEN, WHO, WHERE, WHAT)
$$ ##TITLE= Audit trail, XWIN-NMR		Version 3.5
$$ ##JCAMPDX= 5.01
$$ ##ORIGIN= Bruker BioSpin GmbH
$$ ##OWNER= she
$$ F:/spectra/data/she/nmr/H-F/1/audita.txt
$$ ##AUDIT TRAIL=  $$ (NUMBER, WHEN, WHO, WHERE, WHAT)
(   1,<2021-06-02 10:05:45.04 +0400>,<she>,<DPX200>,
      <created by zg, POWCHK disabled, PULCHK disabled
       configuration hash MD5:
       00 E9 B6 7A A2 85 ED C7 34 08 36 98 17 FE 4E 26
       data hash MD5: 16K
       6D 29 47 22 FA AB 91 75 AF DE 84 80 B9 9A FF C5>)
$$ ##END=
$$ 
$$ hash MD5
$$ E4 73 46 41 71 25 80 26 D8 7F D4 23 47 CB 0E 8C
##$RELAX= 
##$RELAX= 
##$RELAX= 
##$RELAX= 
##$RELAX= 
##$RELAX= 
$$ Bruker specific parameters
$$ --------------------------
##$DU= <F:/spectra>
##$EXPNO= 1
##$NAME= <H-F>
##$PROCNO= 1
##$TYPE= <nmr>
##$USER= <she>
##$AMP= (0..31)
100 100 100 100 100 100 100 100 100 100 100 100 100 100 100 100 100 100 
100 100 100 100 100 100 100 100 100 100 100 100 100 100 
##$AQSEQ= 0
##$AQ_mod= 1
##$AUNM= <au_zg>
##$AUTOPOS= <>
##$BF1= 200.13
##$BF2= 200.13
##$BF3= 200.13
##$BF4= 200.13
##$BF5= 200.13
##$BF6= 200.13
##$BF7= 200.13
##$BF8= 200.13
##$BYTORDA= 1
##$CFDGTYP= 0
##$CFRGTYP= 5
##$CHEMSTR= <none>
##$CNST= (0..31)
1 1 145 1 1 1 1 1 1 1 1 1 1 1 1 1 1 1 1 1 1 1 1 1 1 1 1 1 1 1 1 1 
##$CPDPRG= <>
##$CPDPRG1= <>
##$CPDPRG2= <>
##$CPDPRG3= <>
##$CPDPRG4= <mlev>
##$CPDPRG5= <mlev>
##$CPDPRG6= <mlev>
##$CPDPRG7= <mlev>
##$CPDPRG8= <mlev>
##$CPDPRGB= <>
##$CPDPRGT= <>
##$D= (0..31)
0 1.2 0 0 0 0 0 0 0 0.06 0 0.03 0 0 0 0 0.0002 0 0 0 0 0 0 0 0 0 0 0 0 
0 0 0 
##$DATE= 1622613944
##$DBL= (0..7)
120 120 120 120 120 120 120 120 
##$DBP= (0..7)
150 150 150 150 150 150 150 150 
##$DBP07= 0
##$DBPNAM0= <>
##$DBPNAM1= <>
##$DBPNAM2= <>
##$DBPNAM3= <>
##$DBPNAM4= <>
##$DBPNAM5= <>
##$DBPNAM6= <>
##$DBPNAM7= <>
##$DBPOAL= (0..7)
0.5 0.5 0.5 0.5 0.5 0.5 0.5 0.5 
##$DBPOFFS= (0..7)
0 0 0 0 0 0 0 0 
##$DE= 6
##$DECBNUC= <off>
##$DECIM= 32
##$DECNUC= <off>
##$DECSTAT= 4
##$DIGMOD= 1
##$DIGTYP= 9
##$DL= (0..7)
0 120 120 120 120 120 120 120 
##$DP= (0..7)
150 150 150 150 150 150 150 150 
##$DP07= 0
##$DPNAME0= <>
##$DPNAME1= <>
##$DPNAME2= <>
##$DPNAME3= <>
##$DPNAME4= <>
##$DPNAME5= <>
##$DPNAME6= <>
##$DPNAME7= <>
##$DPOAL= (0..7)
0.5 0.5 0.5 0.5 0.5 0.5 0.5 0.5 
##$DPOFFS= (0..7)
0 0 0 0 0 0 0 0 
##$DQDMODE= 0
##$DR= 18
##$DS= 0
##$DSLIST= <SSSSSSSSSSSSSSS>
$$ [...]
##$SUBNAM2= <"">
##$SUBNAM3= <"">
##$SUBNAM4= <"">
##$SUBNAM5= <"">
##$SUBNAM6= <"">
##$SUBNAM7= <"">
##$SUBNAM8= <"">
##$SUBNAM9= <"">
##$SW= 16.9725357007746
##$SWIBOX= (0..15)
0 0 2 0 0 0 0 0 0 0 0 0 0 0 0 0 
##$SW_h= 3396.73913043478
##$TD= 16384
##$TD0= 1
##$TE= 0
##$TE2= 300
##$TE3= 300
##$TEG= 300
##$TL= (0..7)
0 120 120 120 120 120 120 120 
##$TP= (0..7)
150 150 150 150 150 150 150 150 
##$TP07= 0
##$TPNAME0= <>
##$TPNAME1= <>
##$TPNAME2= <>
##$TPNAME3= <>
##$TPNAME4= <>
##$TPNAME5= <>
##$TPNAME6= <>
##$TPNAME7= <>
##$TPOAL= (0..7)
0.5 0.5 0.5 0.5 0.5 0.5 0.5 0.5 
##$TPOFFS= (0..7)
0 0 0 0 0 0 0 0 
##$TUNHIN= 0
##$TUNHOUT= 0
##$TUNXOUT= 0
##$USERA1= <user>
##$USERA2= <user>
##$USERA3= <user>
##$USERA4= <user>
##$USERA5= <user>
##$V9= 5
##$VALIST= <valist>
##$VCLIST= <CCCCCCCCCCCCCCC>
##$VD= 0
##$VDLIST= <DDDDDDDDDDDDDDD>
##$VPLIST= <PPPPPPPPPPPPPPP>
##$VTLIST= <TTTTTTTTTTTTTTT>
##$WBST= 1024
##$WBSW= 4
##$XGAIN= (0..3)
0 0 0 0 
##$XL= 0
##$YL= 0
##$YMAX_a= 143840
##$YMIN_a= -128961
##$ZGOPTNS= <>
##$ZL1= 120
##$ZL2= 120
##$ZL3= 120
##$ZL4= 120
##$ABSF1= 10
##$ABSF2= 0
##$ABSG= 5
##$ABSL= 3
##$ALPHA= 0
##$AQORDER= 0
##$ASSFAC= 0
##$ASSFACI= 0
##$ASSFACX= 0
##$ASSWID= 0
##$AUNMP= <proc_1d>
##$AZFE= 0.1
##$AZFW= 0.1
##$BCFW= 1
##$BC_mod= 2
##$BYTORDP= 1
##$COROFFS= 0
##$CY= 11.3945322036743
##$DATMOD= 1
##$DC= 2
##$DFILT= <>
##$DTYPP= 0
##$F1P= 15.9154993809931
##$F2P= -4.1035820241983
##$FCOR= 0.5
##$FTSIZE= 0
##$FT_mod= 4
##$GAMMA= 1
##$GB= 0.15
##$INTBC= 1
##$INTSCL= 1
##$ISEN= 128
##$LB= 0.24
##$LEV0= 0
##$LPBIN= 0
##$MAXI= 10000
##$MC2= 0
##$MEAN= 0
##$ME_mod= 0
##$MI= 1.114404
##$NCOEF= 0
##$NC_proc= 0
##$NLEV= 6
##$NOISF1= 3.799351
##$NOISF2= 2.8
##$NSP= 1
##$NTH_PI= 0
##$NZP= 0
##$OFFSET= 15.70392
##$PC= 1
##$PHC0= -11561.14
##$PHC1= 10.40099
##$PH_mod= 1
##$PKNL= yes
##$PPARMOD= 0
##$PSCAL= 0
##$PSIGN= 0
##$REVERSE= no
##$SF= 200.130013532006
##$SI= 16384
##$SIGF1= 3
##$SIGF2= 2
##$SINO= 400
##$SIOLD= 16384
##$SREGLST= <1H.CDCl3>
##$SSB= 0
##$STSI= 0
##$STSR= 0
##$SW_p= 3612.71676300578
##$SYMM= 0
##$S_DEV= 0
##$TDeff= 0
##$TDoff= 0
##$TI= <>
##$TILT= no
##$TM1= 0
##$TM2= 0
##$TOPLEV= 0
##$USERP1= <user>
##$USERP2= <user>
##$USERP3= <user>
##$USERP4= <user>
##$USERP5= <user>
##$WDW= 1
##$XDIM= 8192
##$YMAX_p= 0
##$YMIN_p= 0
$$ End of Bruker specific parameters
$$ ---------------------------------
##NTUPLES= NMR FID
##VAR_NAME=  TIME,          FID/REAL,        FID/IMAG
##SYMBOL=    X,             R,               I
##VAR_TYPE=  INDEPENDENT,   DEPENDENT,       DEPENDENT
##VAR_FORM=  AFFN,          ASDF,            ASDF
##VAR_DIM=   8192,          8192,            8192
##UNITS=     SECONDS,       ARBITRARY UNITS, ARBITRARY UNITS
##FACTOR=    0.0002944,     1,               1
##FIRST=     0,             0,               0
##LAST=      2.4114304,     0,               0
##MIN=       0,             -128961,         0
##MAX=       2.4114304,     143840,          0
$$ Real data points
##PAGE= N=1
##DATA TABLE= (X++(R..R)), XYDATA
$$ plain form
0 0 0 0 0 0 0 0 0 0 0 0 0 0 0 8 -8 8 -8 8 -10 16 -16 24 -24 32 -33 40 -48 56 -64 73 -82 97 -107 121 -137
35 -137 155 -177 197 -220 248 -275 305 -340 377 -417 459 -507 560 -617 680 -749 824 -909 1003
54 1003 -1107 1223 -1355 1507 -1680 1887 -2130 2423 -2787 3252 -3870 4729 -6022 8186 -12685
69 -12685 40835 -99381 -37589 142553 -98585 -38783 128683 -76749 -64173 137353 -59149
80 -59149 -78846 121504 -34992 -86557 118113 -27446 -98499 115014 -1482 -114828 100093
91 100093 19240 -115359 86036 36594 -123811 71820 61470 -121621 44120 75830 -109039
102 -109039 28409 81481 -103890 13189 93896 -94200 -6258 96573 -81428 -16585 100462
113 100462 -76816 -33010 109854 -61195 -54228 107086 -42008 -65828 102240 -27064 -79317
$$ packed form
0@%%%%%%%%%%%%%Qj6J6j6J6j8K6l2M0m8N6o5P3q8J04j20J37j55J79k04K28k58
35a37K92l32L74m17M68n23N80o45P17p94Q76r66J067j177J297j429J573j733J912
54A003k110K330k578K862l187L567m017M553n210O039p122Q599j0751J4208k0871
69a2685N3520j40216O1792J80142k41138N9802J67466k05432J2576K01526j96502
80e9149j9697K00350j56496n1565K04670j45559p1053K13513j16496j13346K14921
91A00093q0853j34599K01395m9442j60405J95631j0350j83091J65741L1710j84869
102a09039J37448N3072j85371J17079Q0707j88096Q7942J02831j78001O4843J17047
113A00462j77278M3806J42864j71049O967J61314j49094k3820J68068j29304n2253
$$ plain form
124 -79317 96271 -5454 -87930 80341 10372 -86745 69660 19832 -90155 60626 34387
135 34387 -90958 46548 44538 -87985 37207 54402 -89424 23905 69062 -83719 5422
146 5422 76301 -73085 -8114 80719 -64151 -22930 84252 -49880 -35762 80144 -37805
157 -37805 -41781 78237 -30102 -51161 77782 -17833 -60425 72496 -6168 -66702 68080
168 68080 5872 -75141 59853 22066 -78154 46085 33955 -75832 34253 42985 -73431
179 -73431 21815 51385 -67179 9793 54950 -60826 1806 58946 -56834 -7897 64252
190 64252 -49978 -18771 66948 -41761 -28791 68913 -32203 -39998 67900 -19375 -48466
201 -48466 62398 -7769 -53005 56299 1670 -56374 50019 10354 -58391 43732 17783
$$ packed form
124g9317J75588j01725q2476J68271o9969r7117J56405m9828j09987J50781k6239
135C4387j25345J37506k010j32523J25192J7195j43826J13329M5157j52781Q9141
146E422P0879j49386O4971Q8833j44870M1221J07182j34132J4118J15906j17949
157c7805l976J20018j08339k1059J28943r5615m2592J32921p8664o0534J34782
168F8080o2208q1013J34994l7787j00220J24239j2130j09787J10085Q732j16416
179g3431R5246K9570j18564P6972M5157j15776O2632N7140j15780M8937P2149
190F4252j14230L1207Q5719j08709J2970R7704j01116p795J07898q7275k9091
201d8466J10864p0167m5236J09304n4629n8044J06393l9665o8745J02123k5949
$$ plain form
212 17783 -60259 37833 25851 -62231 30333 34740 -62527 20894 43383 -60295 9779 50494
224 50494 -54892 -1659 54551 -47442 -11651 56278 -39081 -20204 55644 -30661 -26274 54139
236 54139 -24030 -31845 53869 -16756 -38730 52150 -7793 -44462 48744 998 -49853 44216
248 44216 11720 -53764 35681 21533 -53015 26956 27615 -51796 19796 33903 -49975 11212
260 11212 38351 -45946 4754 41110 -44119 -1590 46525 -40633 -11250 49661 -33546 -18960
272 -18960 50365 -27427 -26801 51394 -18093 -35030 47150 -7726 -37664 41730 -1716 -40041
284 -40041 38663 5689 -42976 32609 12429 -42500 28157 16677 -44869 24334 25120 -46294
296 -46294 15268 31863 -42665 7919 35332 -40748 798 40852 -36041 -8964 41694 -28476
$$ packed form
212A7783p8042R8092j1982q8082R2564M407r7267Q3421K2489j03678P0074M0715
224E0494j05386N3233N6210j01993L5791O7929r5359J8877P5848q6305M387Q0413
236E4139p8169p815Q5714p0625k1974R0880n9943l6669R3206m7746n0851R4069
248D4216l2496o5484Q9445j4148p4548P9971O59p9411P1592J4107q3878O1187
260A1212K7139q4297N0700L6356q5229M2529M8115q7158K9383O0911q3207J4586
272a8960O9325p7792O26P8195o9487j6937Q2180n4876k9938P9394m3446l8325
284d0041P8704l2974m8665P5585k0180n4929P0657j1480o1546O9203P86p1414
296d6294O1562J6595p4528N0584K7413p6080M1546M0054p6893K7077N0658p0170
$$ plain form
308 -28476 -13686 40584 -25145 -18479 42664 -19439 -25471 40867 -12521 -28387 39453 -8541
320 -8541 -33845 39404 269 -39574 33197 8916 -39439 27537 13753 -40716 22670 21238
332 21238 -39985 14032 24955 -35407 9802 26127 -35298 5863 31565 -33265 -2006 33638
344 33638 -28413 -6189 35039 -26775 -12526 38954 -20512 -20814 36976 -12873 -23541 34747
356 34747 -9035 -27802 34008 -1687 -31485 28539 3631 -30589 26170 5946 -33709 24652
368 24652 13098 -35861 18111 18161 -34022 14131 21652 -35033 8695 28244 -32051 -38 29568
381 29568 -26182 -3608 29505 -24422 -8136 32181 -19464 -14054 30324 -14495 -15433 29999 -12975
394 -12975 -20026 31687 -6801 -25359 28225 -985 -26417 26208 2682 -30088 23834 10068
$$ packed form
308b8476J4790N4270o5729O666O1143o2103o032O6338n3388j5866O7840m7994
320h541k5304P3249l9135l9843P2771k4281m8355O6976j3784n4469O3386j432
332B1238o1223N4017J0923o0362M5209J6325o1425M1161K5702o4830L1259L5644
344C3638o2051K2224M1228o1814J4249N1480n9466l02N7790m9849j0668N8288
356C4747m3782j8767O1810l5695k9798O0024k4908l4220N6759k0224l9655N8361
368B4652j1554m8959N3972N0n2183M8153P521n6685M3728J9549o0295L2013K9606
381B9568n5750K2574L3113n3927J6286M0317n1645N410M4378m4819r38M5432m2974
394a2975p051N1713l8488j8558N3584k9210k5432N2625k3526l2770N3922j3766
$$ plain form
406 10068 -31493 17100 14210 -28961 13810 16030 -29738 10629 20917 -28621 4833 22799
418 22799 -25921 2123 24802 -25914 -2726 29149 -22100 -9575 29057 -16865 -12697 28718
430 28718 -13798 -17133 28868 -7785 -20930 25257 -3074 -21168 23270 -775 -23498 22159
442 22159 4082 -25279 18545 7607 -25353 16563 10849 -27340 13334 16319 -27107 7645
454 7645 19477 -24677 3614 21564 -23353 -847 24002 -20133 -5318 23928 -16959 -7648
466 -7648 24371 -15273 -11285 25566 -11539 -15118 24706 -7775 -17686 24045 -4065 -21030 22440
479 22440 1226 -22913 18793 5295 -23036 15828 8499 -23346 12538 11808 -22522 9080 13727
492 13727 -21617 6766 15915 -21534 3641 18751 -20349 -208 20746 -18488 -3970 22378
$$ packed form
406A0068m1561M8593k890m3171M2771K220m5768M0367J0288m9538L3454J7966
418B2799m8720K8044K2679n0716K3188L1875n1249J2525L8632m5922M168M1415
430B8718m2516l335M6001l6653j3145M6187k8331j8094M4438k4045k2723M5657
442B2159j8077k9361M3824j0938l2960M1916n714l8189M0674K985m3426L4752
454G645J1832m4154K8291J7950m4917K2506K4849m4135J4815K9246m0887R311
466g648L2019l9644L988L6851l7105l579L9824l2481r911M1731k8110j6965M3470
479B2440k1214k4139M1706j3498k8331L8864p329l1845L5884p30l4330L1602M647
492A3727l5344K8383R149l7449K5175J5110l9100K0141K0954l9234J4518K6348
$$ plain form
504 22378 -16004 -8085 23031 -12492 -11471 22422 -9138 -13913 21523 -6015 -15992 20328 -3025
517 -3025 -17672 19056 -56 -19333 17517 3224 -20679 15412 6613 -21614 12801 10262 -21864
530 -21864 9126 13484 -20638 5382 15441 -19034 2215 17085 -17217 -1099 17938 -14868
542 -14868 -3485 18270 -13509 -5823 19556 -11609 -9303 19952 -8536 -11964 19461 -5963 -14534
555 -14534 19171 -2365 -17261 17002 1483 -17855 14594 3692 -18509 13058 6705 -19276
567 -19276 10080 9345 -18290 7831 10710 -18475 6074 13772 -18287 2169 16021 -15972 -838
580 -838 16798 -14549 -3655 18481 -11952 -7541 17979 -8289 -9008 16747 -6814 -10578 17127
593 17127 -4314 -13209 15701 -1340 -13843 14528 23 -15690 14297 3545 -17771 11307
$$ packed form
504B2378l8382P919L1116l5523J021L3893l1560m775L5436k7538r977L6320k3353
517c025j4647L6728j9112j9277L6850j4293k3903L6091q799k8227L4415k539l2126
530b1864L0990M358l4122K6020J0059l4475K1249J4870l4302J6118J9037l2806
542a4868J1383K1755l1779P686K5379l1165K306K9255k8488l428L1425k5424q571
555a4534L3705k1536j4896L4263j5519j9338L2449j0902k2201L1567o353k5981
567a9276K9356p35k7635K6121K879k9185K4549P698l2059K0456J3852l1993J5134
580h38J7636l1347J0894K2136l0433M411K5520k6268p19K5755k3561l764K7705
593A7127k1441q895K8910j7041j2503K8371j4505j5713K9987j0752k1316K9078
$$ plain form
605 11307 6859 -17137 8958 8357 -17630 7128 11641 -17275 3107 13201 -14756 1208 13339
618 13339 -14414 -434 15612 -13056 -4017 15983 -10308 -5467 16010 -9487 -7966 17484 -6323
631 -6323 -11532 15784 -2608 -11981 14144 -1257 -13456 13712 2046 -14995 10636 4471 -13949
644 -13949 9149 5013 -15112 8431 8222 -15779 4996 10097 -14241 3448 10967 -14800 1424
657 1424 14131 -13471 -2788 14573 -10349 -4128 14232 -9653 -6036 15630 -7038 -8921 14260
670 14260 -4273 -9019 13645 -3760 -10929 14319 -548 -13292 11880 2293 -12934 10438 3476
683 3476 -14278 9254 6876 -14661 5536 8511 -12771 3973 8791 -13117 2479 11201 -12228
696 -12228 -739 11568 -10220 -1603 11826 -10415 -3489 14006 -8496 -6799 13595 -5759 -7715
$$ packed form
605A1307m448k3996K6095o01k5987K4758M513k8916K0382J0094k7957J5964J2131
618A3339k7753J3980J6046k8668R039K0000k6291M841K1477k5497J521K5450k3807
631f323n209K7316j8392r373K6125j5401j2199K7168j1666j7041K5631o165j8420
644a3949K3098m136k0125K3543k09k4001K0775N101k4338J7689P519k5767J6224
657A424J2707k7602J0683J7361k4922O221J8360k3885L617K1666k2668j883K3181
670A4260j8533m746K2664j7405p169K5248j4867j2744K5172r587j5227K3372o962
683C476j7754K3532k378k1537K0197K975k1282J6744M818k1908J5596Q722k3429
696a2228J1489J2307k1788Q617J3429k2241O926J7495k2502J697K0394j9354j956
$$ plain form
709 -7715 13251 -4635 -9731 13578 -1496 -11593 11342 905 -11101 10295 1698 -12273 9763
722 9763 4411 -13021 7219 6065 -12247 6000 7072 -13004 4338 9706 -12425 1080 10567
735 10567 -10597 -513 10931 -10082 -2534 12187 -8169 -5037 11598 -6094 -5664 11353 -5425
748 -5425 -7187 11971 -3387 -8980 11115 -1447 -9626 10736 -24 -11192 10158 2779 -12069
761 -12069 7986 4700 -11629 6562 5909 -11872 5041 7720 -11406 2857 8539 -10461 1550
774 1550 9259 -10211 -219 10498 -9107 -2400 10852 -7684 -3940 11162 -6430 -5886 11321
787 11321 -4357 -7521 10491 -2405 -8281 9745 -909 -9105 8989 776 -9644 8000 2161
800 2161 -9993 7270 3618 -10596 6164 5357 -10793 4648 6912 -10613 2943 8253 -10049
$$ packed form
709g715K0966j7886n096K3309j5074j0097K2935j0437j2006K1396q597j3971K2036
722I763n352j7432K0240j154j8312J8247J072k0076J7342N368k2131J3505R487
735A0567k1164J0084J1444k1013P548J4721k0356L132J6635j7692M30J7017j6778
748e425j762J9158j5358n593K0095j2562q179K0362j0760j1168K1350p379j4848
761a2069K0055l286j6329J8191o53j7781J6913K679j9126J4263N682j9000J2011
774A550P709j9470R992J0717j9605O707J3252j8536L744J5102j7592N44J7207
787A1321j5678l164J8012j2896n876J8026j0654q196J8094q213j0420J7644n839
800B161j2154J7263l652j4214J6760q07j6150J5441K264j7525J3556N310j8302
$$ plain form
813 -10049 1052 9202 -9083 -708 9779 -7979 -2373 10059 -6700 -3803 9993 -5516 -5017
826 -5017 10013 -4248 -6452 9785 -2624 -7548 9181 -1119 -8572 8631 785 -9480 7245
839 7245 2689 -9437 5796 3836 -9340 4812 5157 -9325 3290 6282 -8686 2112 6888
852 6888 -8559 1161 8133 -8288 -759 8973 -7026 -2173 9126 -6325 -3451 9802 -5073
865 -5073 -5401 9417 -3098 -6056 8527 -2225 -6829 8426 -721 -8031 7410 940 -7969 6370
879 6370 1592 -8461 6065 3404 -9210 4265 5145 -8388 2772 5591 -8210 1888 6968
892 6968 -7832 -231 7609 -6194 -1139 7329 -5977 -1911 8365 -5211 -3818 8310 -3604
905 -3604 -4400 7901 -3190 -5409 8556 -1712 -7164 7572 258 -7248 6559 858 -7824 6189
$$ packed form
813a0049J1101Q150j8285Q375J0487j7758N606J2432j6759K897J3796j5509M99
826e017J5030j4261k204J6237j2409m924J6729j0300p453J7203p846j0265J6725
839G245m556j2126J5233j960j3176J4152L45j4482J2615K992j4968J0798M776
852F888j5447R720O972j6421P529R732j5999M853J1299j5451K874J3253j4875
865e073l28J4818j2515k958J4583j0752m604J5255r147p310J5441o470q909J4339
879F370m778j0053J4526k661j2614J3475Q80j3533J1160K819j3801J0098N080
892F968j4800P601P840j3803N055Q468j3306M066J0276j3576J393J2128j1914
905c604p96J2301j1091k219J3965j0268n452J4736p314p506J3807n701q682J4013
$$ plain form
919 6189 2595 -8464 4336 3906 -7506 3371 3994 -7738 2923 5580 -7772 906 6380 -6442
933 -6442 52 6465 -6434 -950 7746 -5422 -3072 7566 -3618 -3487 7070 -3275 -4367 7609
947 7609 -1886 -5798 6600 -427 -5579 6058 -225 -6455 6348 1368 -7429 4885 2601 -6943
961 -6943 4180 3053 -7665 3626 4950 -7632 1422 5584 -6280 732 5514 -6343 -97 6783
975 6783 -5523 -1957 6559 -4101 -2206 6433 -4102 -3272 7324 -2626 -4906 6398 -1089 -4831
989 -4831 5954 -784 -5792 6071 1023 -6605 4452 2096 -5912 3910 2213 -6497 3647 3729 -6677
1004 -6677 2042 4277 -5877 1701 4506 -6433 925 6036 -5920 -957 6181 -4642 -1445 6120
1018 6120 -4491 -2446 6853 -3237 -3841 6125 -1946 -3848 5770 -1686 -4663 6000 -273 -5572
$$ packed form
919F189l594j1059J2800m30j1412J0877O23j1732J0661K657j3352Q678N474j2822
933f442O494O413j2899N484Q696j3168K350J0638j1184J31J0557j0345j092J1976
947G609r495l912J2398p027n152J1637o283o230J2803m980q797J2314k284r544
961f943J1123j127j0718J1291J324j2582R054M162j1864P012M782j1857O246O880
975F783j2306L566Q516j0660J895Q639j0535Q30J0596r950k280J1304p487l742
989d831J0785o738n008J1863n048p628J1057k356q008R822j697q710J0144Q2j0406
1004f677Q719K235j0154P578K805j0939P358N111j1956M963P138j0823L197P565
1018F120j0611K045R299j0090o04R966q071j902R618p456k977J0663o273n299
$$ plain form
1032 -5572 4891 827 -5363 4424 1285 -6037 4028 2819 -6288 2565 3598 -5641 1871 3970
1046 3970 -5781 1111 4989 -5274 -207 5086 -4501 -598 5252 -4496 -1388 6014 -3776 -2561 5946
1061 5946 -2840 -3143 5952 -2317 -4058 5943 -1119 -4858 5245 -23 -5015 4725 605 -5434 4230
1076 4230 1743 -5604 3259 2397 -5400 2653 2929 -5552 1935 3868 -5334 934 4463 -4894 143
1091 143 4898 -4520 -887 5350 -3783 -1818 5334 -3017 -2409 5306 -2462 -3054 5307 -1762 -3649 5140
1107 5140 -1093 -4238 4990 -291 -4781 4597 599 -5179 4099 1496 -5453 3374 2373 -5448 2515
1122 2515 3012 -5282 1758 3655 -5071 855 4133 -4562 86 4336 -4194 -543 4784 -3809 -1455
1137 -1455 5088 -3007 -2199 5020 -2416 -2824 5135 -1662 -3663 4846 -641 -3954 4333 -167 -4240
$$ packed form
1032e572J0463m064o190R787l139p322J0065j209r107Q853J033r239P512K099
1046C970r751O892L878j0263N067N293r587L903N850r748L108P402r790J215Q507
1061E946q786l03R095q269j741J0001p062l739J0103n268m992R740m120o039R664
1076D230k487p347Q863q62p797Q053K76q481P487J933r202O268L529r357N037
1091A43M755r418L633O237r133J965P152q351O08P715p768n92Q361p069j887Q789
1107E140o233l145R228n281m490R378l998n778R278k603o949Q827j001p821P963
1122B515M97q294P040J897q726N926L278q695M648M250q530L651N327q593K354
1137a455O543q095Q08P219p436m08P959o797k001Q509n487l313Q287m500m073
$$ plain form
1152 -4240 4251 577 -4822 3645 1471 -4778 3048 1819 -4987 2786 2711 -5297 1765 3524 -4809
1167 -4809 967 3734 -4693 397 4528 -4355 -888 4777 -3288 -1461 4467 -2964 -1863 4901 -2338
1182 -2338 -2900 4705 -1266 -3131 4295 -987 -3600 4532 -43 -4491 3775 1109 -4290 3092 1294
1197 1294 -4515 3010 2242 -4941 1914 2990 -4305 1332 2914 -4448 1138 3811 -4501 -87 4207
1212 4207 -3664 -556 4085 -3681 -1045 4903 -3138 -2418 4771 -1866 -2659 4284 -1649 -3070 4602
1227 4602 -720 -3951 3879 360 -3690 3352 394 -4015 3490 1420 -4612 2437 2295 -4068 1886
1242 1886 2327 -4330 1673 3315 -4412 375 3739 -3548 -61 3572 -3652 -440 4340 -3266 -1654
1257 -1654 4240 -2315 -1783 4012 -2401 -2288 4629 -1592 -3395 4136 -520 -3359 3763 -301 -3865
$$ packed form
1152d240Q491l674n399Q467k174o249P826j229o806P773p5q008P062J759q333
1167d809N776K767q427N090M131q883L467N665q065J827N928p431J101O764p239
1182b338n62P605n971j865P426n282k613Q132m575m448Q266k666n399P382j798
1197A294n809P525p68p183O855J076p295N637J582p362N586K673q312M414M294
1212D207p871L108M641p766K636N948q041P20P189o637p93O943n933j421P672
1227D602n322l231P830l519m050P042k958m409P505k070o032P049j42o363N954
1242A886M41o657O003J642p727M787L364p287L487L633p224L212M780p606J612
1257a654N894o555N32N795o413J13O917o221j803P531m656k839P122m064l564
$$ plain form
1272 -3865 3815 849 -4385 2757 1675 -3844 2299 1731 -4141 2079 2754 -4175 883 3144 -3459
1287 -3459 527 3126 -3662 67 4005 -3272 -1177 3965 -2407 -1392 3851 -2423 -2017 4342 -1612
1302 -1612 -2995 3787 -746 -2879 3540 -726 -3391 3745 226 -3991 2973 950 -3722 2728 1168
1317 1168 -4169 2504 2285 -4260 1349 2778 -3614 968 2893 -3710 464 3677 -3304 -653 3679
1332 3679 -2520 -912 3594 -2488 -1460 4007 -1846 -2331 3693 -1126 -2482 3545 -952 -3049 3644
1347 3644 -62 -3658 2958 651 -3545 2618 926 -3821 2391 1710 -3939 1645 2165 -3644 1329
1362 1329 2460 -3751 886 3167 -3530 52 3436 -3014 -422 3592 -2756 -1039 3907 -2155 -1798
1377 -1798 3760 -1511 -2158 3602 -1059 -2629 3463 -411 -3030 3061 138 -3204 2767 562 -3493
$$ packed form
1272c865P680k966n234P142j082n519O143n68n872O220O75o929N058K261o603
1287c459L986K599o788L729L938p277K095N142o372J015N243o274M06O359n954
1302a612j383O782m533k133O419m266k665P136l519m217O964k023m672O450j560
1317A168n337O673k19o545N609J429o392M582J925o603M174L213o981K651M332
1332C679o199J608M506o082J028N467n853m85O024m819j356O027m497k097O693
1347C644l706l596O616k307m196O163j692m747O212o81n649N584N20n809M973
1362A329J131o211M637K281o697L582L384o450K592M014o348J717M946o062L57
1377a798N558n271o47N760m661j570O092l874k619O091k923l342N971k205m055
$$ plain form
1392 -3493 2463 1192 -3677 1950 1732 -3678 1463 2217 -3612 930 2646 -3398 400 2961 -3169
1407 -3169 -90 3267 -2843 -593 3459 -2478 -1080 3650 -2062 -1630 3696 -1522 -2127 3572 -1005
1422 -1005 -2528 3473 -427 -3009 3119 283 -3222 2624 761 -3325 2253 1263 -3493 1696 1815
1437 1815 -3342 1169 2056 -3313 842 2549 -3284 161 2969 -2839 -390 3057 -2593 -731 3396
1452 3396 -2259 -1433 3479 -1583 -1764 3285 -1310 -2049 3442 -813 -2664 3185 -72 -2767 2801 129
1468 129 -3022 2740 804 -3431 2134 1585 -3245 1508 1685 -3209 1244 2284 -3374 324 2678 -2685
1484 -2685 -140 2651 -2562 -395 3028 -2352 -1210 3216 -1639 -1480 2979 -1478 -1746 3325 -1055
1499 -1055 -2539 3083 -168 -2494 2672 -61 -2736 2807 580 -3243 2162 1246 -2939 1736 1241
$$ packed form
1392c493N956j271m869N627k18n410N141P54n829M542J716o044L798K561o130
1407c169L079L357o110K250M052n937J398M730n712M32N326n218o05N699m577
1422a005j523O001l900k582O128k836l505N846j863m086N578r90m756N189J19
1437A815n157M511Q87n369M155J707n833L445K808n808K449L447n650J862M127
1452C396n655Q26M912n062j81N049m595p39N491m255j851N849l257k695N568k672
1468A29l151N762j936m235N565n49m830M753J77m894M453J040n658L698K354n363
1484b685K545K791n213K167L423n380J142M426m855J59M459m457k68N071m380
1499a055j484N622l251k326N166k733k675N543k227l823N405r16m185M675m95
$$ plain form
1514 1241 -3065 1692 1894 -3318 829 2384 -2799 362 2323 -2879 104 2979 -2631 -914 3041
1529 3041 -1796 -1178 2737 -1704 -1448 3153 -1194 -2229 2863 -393 -2163 2495 -355 -2432 2753
1544 2753 322 -2992 2115 981 -2673 1792 1001 -2925 1780 1752 -3168 908 2187 -2617 585 2056
1560 2056 -2739 401 2688 -2610 -486 2760 -1965 -648 2607 -2045 -1000 3129 -1559 -1865 2838
1575 2838 -774 -1862 2548 -713 -2218 2752 3 -2737 2115 645 -2443 1811 667 -2695 1793
1590 1793 1397 -2876 1021 1754 -2435 799 1730 -2653 616 2411 -2558 -213 2521 -1976 -409 2460
1606 2460 -2056 -760 2903 -1615 -1470 2657 -1030 -1457 2525 -1028 -1836 2766 -399 -2374 2281 164
1622 164 -2248 2043 310 -2568 1973 1015 -2760 1252 1428 -2422 977 1521 -2557 691 2109 -2399
$$ packed form
1514A241m306M757K02n212M147J555n183L161J961n202K983K875n610J717L955
1529C041m837O18L915m441K56M601m347j035N092l256j770M658k850k077N185
1544B753k431l314N107j134l654M465p91l926M705k8m920M076J279m804L202J471
1560B056m795L140K287n298K124L246m725J317L255m652J045M129m688l06M703
1575B838l612j088M410l261j505M970k749k740M852j470l088M254j144l362M488
1590A793l96m273L897P33m189L234R31m383L269J795m969K345K734m497J567K869
1606B460m516J296L663m518J45M127l687m27L982l553q08M602l165j975M655k117
1622A64k412M291j733k878M541r58l775M012J76l850L399N44m078L248J418m508
$$ plain form
1638 -2399 -35 2215 -1928 -210 2204 -1962 -533 2607 -1650 -1133 2515 -1164 -1273 2464 -1064
1653 -1064 -1649 2619 -522 -2094 2267 -50 -2064 2095 103 -2306 2009 621 -2519 1543 998
1668 998 -2391 1280 1213 -2501 991 1686 -2433 448 1919 -2153 121 2069 -2053 -279 2339 -1740
1684 -1740 -779 2357 -1345 -1049 2312 -1082 -1331 2328 -742 -1643 2218 -382 -1830 2110 -79 -2070
1700 -2070 1989 296 -2196 1776 647 -2339 1513 949 -2316 1145 1272 -2339 852 1615 -2271 443
1716 443 1826 -2084 81 1948 -1906 -223 2186 -1674 -634 2334 -1359 -1053 2212 -1036 -1279 2282
1732 2282 -705 -1720 2098 -159 -1836 1851 45 -1908 1714 392 -2180 1479 827 -2131 1143
1747 1143 999 -2116 1034 1351 -2236 585 1677 -1995 236 1716 -1914 83 2010 -1848 -457
$$ packed form
1638b399K364K250m143J718K414m166J429L140m257N17L648l679j09L737l528
1653a064n85M268l141j572M361k317k014M159j992k409M315j388l140M062n45
1668I98l389L671o7l714L492O95m119K881J471m072K274J948m122J774K618m079
1684a740R61L136l702K96L361l394k49L659l070r01L861k600j448L940k189j991
1700b070M059j693k492L972j129k986L852n64l265L461J27l611L191P63l886K714
1716D43J383l910K165J867l854J683K409l860J040K968l693L06L265l248k43L561
1732B282k987j015L818k257j677L687j806j953L622j322k572L659o52k958L274
1747A143j44l115L150L17l587K821J092l672K231J480l630J997J927l858J391
$$ plain form
1762 -457 2168 -1395 -747 2016 -1256 -906 2216 -1017 -1417 2129 -471 -1529 1888 -341 -1689 1969
1778 1969 80 -2106 1606 658 -2000 1216 733 -2026 1173 1158 -2204 638 1534 -1862 331 1460
1794 1460 -1861 277 1866 -1876 -332 2037 -1388 -529 1871 -1389 -635 2216 -1200 -1255 2152 -625
1810 -625 -1325 1881 -587 -1468 2089 -199 -1966 1733 351 -1810 1411 326 -1932 1511 812 -2250
1826 -2250 944 1280 -1908 609 1229 -1946 534 1701 -1978 -124 1899 -1468 -342 1735 -1455
1841 -1455 -437 2111 -1284 -1066 2051 -716 -1115 1821 -746 -1258 2107 -423 -1769 1825 92 -1673
1857 -1673 1571 103 -1860 1668 598 -2182 1136 998 -1868 871 939 -1984 818 1445 -2058 196
1873 196 1650 -1621 -6 1591 -1672 -218 2016 -1447 -847 1966 -900 -925 1808 -898 -1152 2074
$$ packed form
1762d57K625l563O48K763l272L50L122l233m00L546k600j058L417k229j348L658
1778A969j889k186L712r48k658L216m83k759L199j5l362K842Q96l396K193J129
1794A460l321K138J589l742J544K369l425Q59K400l260P54K851l416n5L407k777
1810f25p00L206k468q81L557k288j767L699j382k161L221j085k258L443o99l062
1826b250L194L36l188K517O20l175K480J167l679J854K023l367J126K077l190
1841a455J018K548l395K18L117k767l99K936k567n12L365k530j346L594j733j765
1857a673L244j468j963L528j070k780L318j38k866K739O8k923K802O27l503K254
1873A96J454l271J615J597l263J454K234l463O00K813k866k5K733k706k54L226
$$ plain form
1889 2074 -487 -1616 1785 4 -1505 1591 -11 -1696 1682 426 -1981 1245 745 -1767 1104
1904 1104 751 -1979 1036 1249 -2057 457 1442 -1710 277 1422 -1800 70 1813 -1626 -504 1818
1920 1818 -1199 -594 1769 -1183 -874 2020 -775 -1354 1799 -357 -1327 1711 -220 -1597 1748 257
1936 257 -1835 1371 602 -1727 1186 705 -1851 1062 1064 -1919 594 1297 -1702 460 1265 -1765 254
1953 254 1618 -1657 -179 1742 -1431 -337 1751 -1330 -646 1905 -1068 -1012 1818 -771 -1127 1785
1969 1785 -586 -1367 1791 -203 -1613 1577 147 -1633 1421 369 -1767 1292 743 -1838 971
1984 971 1018 -1784 717 1212 -1772 436 1446 -1681 96 1581 -1510 -162 1658 -1395 -412 1754
2000 1754 -1238 -693 1802 -1032 -959 1802 -780 -1183 1764 -520 -1388 1696 -231 -1579 1591 116
$$ packed form
1889B074k561j129L401j781j509L096j602j685L378j256k407L226n00k512K871
1904A104l53k730L015K13l306K514R85l152J987J145l222J870J743l439J122K322
1920A818l017O05K363k952L09K894k795n79L153k156r70L038j931j377L345j491
1936B57k092L206p69k329K913m81k556K913Kk983K513P03k999K162Q05l030K019
1953B54J364l275J478J921l173J094K088l081O84K551k973N6K830k589l56K912
1969A785k371p81L158j994j410L190j430j780L054j052k136L059n49k581K809
1984I71M7k802K501M95k984K208J010l127J777J485l091J348J820l053R83K166
2000A754k992N45K495k834P3K761k582m03K947k284q68L084j927j348L170j475
$$ plain form
2016 116 -1676 1405 392 -1732 1245 695 -1815 982 1017 -1749 688 1173 -1692 492 1419 -1677
2032 -1677 102 1632 -1444 -231 1643 -1302 -448 1793 -1145 -826 1805 -803 -1029 1667 -670 -1158
2048 -1158 1735 -458 -1489 1634 -64 -1540 1407 63 -1607 1428 355 -1835 1178 762 -1714
2063 -1714 910 861 -1717 830 1186 -1785 398 1470 -1500 107 1424 -1430 -18 1690 -1364 -500
2079 -500 1776 -969 -739 1626 -881 -886 1807 -649 -1342 1660 -187 -1380 1397 -122 -1470 1496
2095 1496 178 -1787 1194 602 -1640 928 606 -1689 974 962 -1841 547 1260 -1535 321 1221
2111 1221 -1552 265 1584 -1538 -271 1716 -1093 -464 1545 -1076 -569 1817 -881 -1092 1706 -393
2127 -393 -1153 1469 -378 -1269 1641 -50 -1689 1323 416 -1552 1027 383 -1635 1107 755 -1856
$$ packed form
2016A16j792L081j013k124K977n50k510K797L5k766K437M85k865K184R27l096
2032a677J779J530l076J213J874k945Q54K241k938L19K631k608k26K696k337m88
2048a158K893k193j031L123j698j476K947j344j670L035j073k190L013m16k476
2063a714K624m9k578K547L56k971K183J072k970J607J317k854J412J708l054Q64
2079e00K276k745K30K365k507nK693k456o93L002j847j193K777j519j348K966
2095A496j318j965K981n92k242K568l22k295K663j2k803K388P13k795J856R00
2111A221k773J817J319l122J267J987k809O29K009k621N07K386k698k11K798k099
2127c93p60K622j847q91K910j691j639L012r07j968K579o44k018K742l52k611
$$ plain form
2143 -1856 665 1100 -1549 453 1032 -1593 440 1389 -1623 -38 1557 -1219 -169 1413 -1261 -237
2159 -237 1752 -1153 -765 1739 -690 -871 1547 -667 -1008 1745 -370 -1437 1480 96 -1363 1244
2175 1244 96 -1513 1306 502 -1783 888 849 -1548 648 834 -1626 596 1227 -1669 133 1399
2191 1399 -1326 -37 1353 -1355 -173 1649 -1209 -615 1648 -812 -677 1526 -833 -840 1726 -551
2207 -551 -1219 1553 -203 -1214 1419 -151 -1397 1463 239 -1631 1106 550 -1494 922 610 -1623
2223 -1623 829 995 -1679 374 1194 -1395 199 1220 -1438 2 1525 -1285 -415 1532 -964 -539
2239 -539 1502 -931 -745 1686 -643 -1091 1517 -306 -1109 1415 -245 -1269 1452 75 -1480 1192
2255 1192 333 -1429 1056 447 -1542 967 769 -1608 617 967 -1458 425 1059 -1480 230 1308
$$ packed form
2143a856K521M35k649K002N79k625K033R49l012J585J595k776J050J582k674J024
2159b37J989k905L88K504k429j81K418k214l41K753k115j067K917j384j459K607
2175A244j148j609K819q04k285K671l9k397K196J86k460K222O31k896J802J266
2191A399k725J289J390k708J182J822k858N94K263k460J35K203k359pK566k277
2207e51o68K772j756j011K633j570j246K860j224j870K737n56k044K416l12k233
2223a623K452J66k674K053Q20k589J594J021k658J440J523k810Q70J947k496M25
2239e39K041k433J86K431k329m48K608j823q03K524j660j024K721j377j555K672
2255A192q59j762K485o09j989K509j98k377K225L50k425J883O34k539J710J078
$$ plain form
2271 1308 -1375 -129 1396 -1143 -331 1440 -1023 -564 1537 -805 -846 1487 -533 -981 1433 -355
2287 -355 -1151 1407 -107 -1319 1269 154 -1394 1111 377 -1442 965 577 -1480 774 762 -1474
2303 -1474 590 940 -1419 377 1091 -1362 168 1235 -1271 -83 1351 -1102 -306 1369 -973 -504
2319 -504 1452 -790 -785 1462 -506 -953 1359 -317 -1069 1332 -107 -1286 1179 201 -1322 986 346
2336 346 -1359 919 572 -1487 689 856 -1370 438 909 -1318 347 1092 -1336 59 1259 -1116
2352 -1116 -157 1225 -1030 -234 1369 -974 -570 1422 -648 -716 1302 -555 -789 1399 -392 -1118 1308
2369 1308 -22 -1183 1079 86 -1222 1082 348 -1425 813 664 -1308 552 698 -1293 529 942
2385 942 -1395 173 1183 -1125 -50 1105 -1081 -87 1311 -1048 -460 1379 -705 -578 1224 -676
$$ packed form
2271A308k683J246J525k539Q12J771k463M59K101k342m1K333k020m48K414j788
2287c55p96K558j514j212K588j115j548K505p34j819K407l88k057K254j2k236
2303a474K064L50k359J796P14k453J530J067k506J188J434k453P96J675k342M69
2319e04J956k242NK247j968m47K312j676p52K401j439j179K465r78j523K308o40
2336C46j705K278l47k059K176J67k226J808M71k227J665P45k428J395J200k375
2352a116R59J382k255P96J603k343M04J992k070o8K018j857k34K188j791p26K426
2369A308j330j161K262r93j308K304p34j773K238j49j972J860J46j991J822M13
2385I42k337J568J010k308J075J155k186R94J398k359N88J839k084J27J802j900
$$ plain form
2401 -676 -609 1402 -538 -978 1304 -175 -978 1105 -162 -1032 1220 55 -1327 985 421 -1219 744
2418 744 418 -1261 772 712 -1417 392 977 -1148 161 904 -1147 132 1186 -1146 -291 1298 -778
2435 -778 -436 1146 -759 -503 1358 -631 -880 1279 -243 -868 1085 -262 -935 1242 -46 -1238
2451 -1238 1030 308 -1118 804 254 -1159 893 527 -1351 552 767 -1127 386 705 -1193 363
2467 363 994 -1220 -54 1142 -908 -199 1036 -910 -249 1283 -801 -669 1270 -457 -731 1108
2483 1108 -453 -766 1236 -214 -1061 993 132 -1003 952 91 -1087 961 370 -1322 703 618 -1106
2500 -1106 533 604 -1195 462 853 -1211 166 978 -950 36 938 -1009 -64 1169 -905 -417 1171
2517 1171 -629 -497 1094 -599 -641 1215 -387 -918 1080 -97 -928 964 -26 -1057 968 254 -1205
$$ packed form
2401f76O7K011j940m40K282j479q03K083j267q70K252j165j382K312n64j640J963
2418G44l26j679K033o0k129J809N85k125J309P43k051J279J054k332Q55J589k076
2435g78L42J582j905K56J861j989k49K159j522o25J953j347o73K177j288j192
2451a238K268p22j426J922n50j413K052l66j878J903K15j894J513L19j898J556
2467C63O31k214J166J196k050P09J235j946O61J532k084J32J939j727k74J839
2483A108j561l13K002j450q47K054q61j135J955q61j178K048n91j692K025q5j724
2500a106J639P1j799J657L91k064J377Q12j928R86R02j947R45J233k074M88J588
2517A171j800J32J591j693m2J856j602n31J998j177q31J892r90j031K025p14j459
$$ plain form
2534 -1205 711 474 -1084 598 532 -1169 526 774 -1167 248 912 -1004 133 942 -1016 -7
2550 -7 1121 -902 -272 1111 -720 -346 1094 -683 -507 1191 -500 -723 1113 -302 -808 1052 -198
2567 -198 -944 1034 30 -1079 853 230 -1089 750 364 -1158 626 609 -1175 411 759 -1080 257
2584 257 858 -1044 104 1011 -949 -93 1081 -825 -244 1124 -724 -410 1161 -586 -570 1119 -404
2601 -404 -692 1094 -308 -827 1089 -171 -930 948 18 -1012 857 187 -1082 766 321 -1111 605
2618 605 563 -1117 369 708 -1080 235 800 -1020 117 973 -957 -126 1082 -740 -313 1059 -636
2635 -636 -402 1130 -532 -626 1139 -287 -735 1020 -203 -804 1025 -64 -1000 908 180 -1011 722
2652 722 242 -1023 718 382 -1167 526 627 -1052 316 638 -1018 284 798 -1064 23 971 -838
$$ packed form
2534a205J916k37j558J682o6j701J695K48j941J415O64j916J137Q09j958J009
2550gJ128k023O30J383j831L74J440j777J76J698j691k23J836j415n06J860j250
2567a98p46J978j004j109J932o23j319J839l86j522J784j7j784J586L48j839J337
2584B57O01j902J148R07j960Q56J174j906N81J368j848L14J571j747J6J689j523
2601d04k88J786j402n19J916j260p59J878r30j030J869o70j269J848m45j432J716
2618F05m2j680J486L39j788J315N65j820J137Q56j930Q31J208j822M27J372j695
2635f36K34J532j662r4J765j426m48J755j223o01J829j089r36J908p28j191J733
2652G22m80j265J741l36j549J693J01j679J368L22j656J302N14j862J087R48j809
$$ plain form
2669 -838 -148 931 -768 -198 1093 -694 -508 1146 -373 -612 1003 -312 -660 1090 -172 -929 978
2686 978 131 -930 771 154 -951 800 328 -1144 588 582 -1029 375 530 -1022 396 717 -1125
2703 -1125 106 897 -893 -53 812 -861 -66 1001 -834 -376 1065 -509 -467 935 -504 -496 1115
2720 1115 -353 -824 1022 -4 -830 835 22 -865 908 221 -1098 670 506 -975 461 469 -993
2737 -993 489 687 -1123 159 859 -874 7 761 -889 -2 941 -892 -321 1027 -606 -387 888
2754 888 -601 -416 1067 -468 -720 1003 -152 -688 842 -158 -752 970 40 -977 776 333 -896
2771 -896 599 331 -943 612 559 -1070 297 749 -880 149 695 -907 99 914 -903 -237 970
2788 970 -648 -320 877 -627 -368 1021 -532 -624 971 -267 -636 868 -257 -704 961 -76 -895
$$ packed form
2669h38O90J079j699N70J291j787J86J654j519k39J615j315l48J750j262p57J907
2686I78q47j061J701o17j105J751m72j472J732oj611J404J55j552J418L21j842
2703a125J231P91j790Q40Q65j673P95J067j835M58J441j574M2J402j439QJ611
2720A115j468m71J846j026q26J665q13q87J773o87j319J768j64j481J436Qj462
2737i93J482J98j810J282P00j733Q81P54j650Q87R43j833N71J348j633K19J275
2754H88j489J85J483j535k52J723j155n36J530j000n94J722r30j017J753m43j229
2771h96J495k68j274J555n3j629J367M52j629J029N46j602J006Q15j817O66J207
2788I70j618L28J197j504K59J389j553r2J595j238l69J504j125m47J665j037q19
$$ plain form
2805 -895 794 163 -818 678 180 -872 694 389 -986 469 555 -865 320 562 -901 252 770
2822 770 -895 -34 840 -709 -154 816 -687 -260 946 -577 -518 921 -353 -579 856 -305 -668
2839 -668 920 -109 -814 766 70 -798 697 126 -863 671 320 -924 494 452 -847 396 493 -870
2857 -870 305 658 -849 111 722 -735 9 760 -712 -140 858 -605 -333 871 -453 -429 847 -375
2875 -375 -555 866 -208 -689 801 -43 -750 731 82 -830 645 227 -860 526 361 -857 433
2892 433 449 -868 320 563 -834 199 662 -794 58 720 -707 -59 770 -618 -184 810 -548 -317
2910 -317 826 -427 -419 800 -308 -525 805 -187 -654 749 -15 -718 647 102 -755 607 241 -838
2928 -838 481 405 -815 325 470 -792 259 588 -806 90 708 -693 -54 683 -641 -98 781 -612
$$ packed form
2805h95J689o31r81J496m98j052J566l05j375J455Q6j420J185K42j463J153N18
2822G70j665Q61Q74j549N55R70j503M27J206j523N9J439j274k26J435j161l63
2839f68J588j029p05J580o96q68J495n71r89J534l51j244J418m2j299J243R7j363
2857h70J175L53j507R60O11j457P44P51j472N72R98j463K72J204j324K4J276j222
2875c75j80J421j074m81J490q44p07J481o49r12J475m18j087J386j65j218J290
2892D33J6j317J188K43j397J033M63j456Q52O62j427O48Q29j388M34R94j358K31
2910c17J143j253QJ219j108k17J330r92m67J403p64p03J365n45q57J362l66j079
2928h38J319p6j220J140J45j262J051L29j394Q96O18j401O39P37j324N43Q79j393
$$ plain form
2946 -612 -285 817 -423 -386 737 -367 -409 791 -294 -585 766 -78 -623 647 -33 -631 672 99
2964 99 -782 546 304 -727 382 330 -718 382 472 -799 188 645 -667 16 614 -637 -19 743
2982 743 -634 -248 797 -418 -353 695 -388 -350 784 -330 -584 766 -77 -586 606 -77 -584 690
3000 690 35 -743 557 244 -668 411 217 -681 466 366 -791 256 546 -640 106 484 -641 126
3018 126 632 -676 -116 722 -471 -224 634 -463 -244 763 -408 -493 740 -141 -502 605 -153 -519
3036 -519 710 -42 -719 599 192 -652 444 156 -646 512 305 -772 317 460 -614 199 385 -635
3054 -635 233 541 -695 8 652 -495 -83 545 -514 -92 693 -476 -338 693 -264 -383 589 -272
3072 -272 -406 703 -156 -625 604 68 -587 472 73 -615 548 212 -744 370 386 -633 254 348 -650
$$ packed form
2946f12L27J102j240L7J123j104m2J200j085k91J351q44n45J270o80n98J303n73
2964I9q81J328k42j031J109n2j048J100R0j271R87M57j312O83N98j251O18P62
2982G43j377L86J045j215O5J048j083L8J134j114k54J350q43n09J192o83n07J274
3000F90o55p78J300l13r12J079j94q98J147j00j157J047K90j186P46L78j125P67
3018A26N06j308N60Q38j193K47Q58j097K19J007j171q5J233q81l61J107p58l66
3036e19J229p52o77J318m07q44J096k88q02J158k07j077J089J43j074Q13J86j020
3054f35Q68L08j236P03O44j147M12O28j059M22P85j169J38J031r57j19R72q61
3072b72j34J109q59m69J229n36o55J059l99o88J163l36r56J114J6j019Q87R4r98
$$ plain form
3091 -650 276 502 -693 63 600 -526 -10 525 -525 -21 652 -511 -225 666 -334 -273 590 -343 -316
3110 -316 680 -240 -494 614 -54 -481 529 -44 -531 566 91 -670 430 255 -607 337 272 -637 318
3129 318 419 -673 141 509 -569 58 509 -578 -5 625 -527 -183 635 -384 -226 607 -371 -297 654
3148 654 -274 -403 606 -150 -431 574 -108 -504 564 30 -568 481 128 -552 423 174 -606 374 306
3167 306 -622 245 400 -583 159 453 -583 68 543 -530 -82 589 -457 -137 604 -415 -265 645 -319
3186 -319 -361 617 -219 -422 608 -146 -482 554 -26 -524 511 56 -542 460 125 -577 417 223 -565
3205 -565 313 328 -563 227 393 -511 145 425 -568 150 458 -562 -75 533 -409 -197 567 -366 -251 585
3225 585 -326 -333 592 -196 -372 600 -88 -464 566 -18 -567 525 133 -568 400 187 -559 396 261 -617
$$ packed form
3091f50R26K26j195P56N37j126N16N35j050N04O73j163K86Q91j000O1Q63r33K7
3110c16R96r20k54J108o68m27J010n73m87J097m75p61J100j75q62R44o5r09R55
3129C18J01j092Q14L68j078O27M51j087N73O30j152L44Q18j019J58Q33r78P4R51
3148F54r28j29J009p56k81J005o82l96J068n34n98J049l53o80R75k49p80R80o8
3167C06r28Q67J55r83P42K94j036O51M75j073M48O71j046L20P41j019J50R10r64
3186c19m2R78q36k03J030p54l36J036n80m98J035m55n98J002l35p02R94j94p88
3205e65Q78J5q91P90J66r04O56K80r93P18L08j020M87O08r42K12P64r33J15Q36
3225E85r11pR25p88j76R72o88l76J030n84n49J092l92p01R68k13p46R55j35q78
$$ plain form
3245 -617 296 391 -552 187 382 -527 155 461 -557 22 541 -437 -87 491 -412 -102 566 -407 -267 595
3265 595 -254 -352 512 -210 -362 563 -145 -533 528 45 -536 421 74 -515 455 174 -644 345 352 -574 216
3286 216 341 -543 237 433 -592 85 546 -456 -28 477 -443 -26 562 -448 -202 603 -295 -268 498
3305 498 -290 -253 572 -263 -437 547 -68 -445 416 -63 -453 501 39 -605 398 230 -531 278 222 -538
3325 -538 319 347 -630 157 485 -490 37 447 -473 49 571 -485 -141 610 -309 -216 522 -323 -227 622 -273
3346 -273 -414 578 -100 -419 457 -126 -416 532 -41 -561 439 129 -514 324 106 -522 379 248 -613 217
3366 217 393 -488 128 354 -508 133 494 -525 -53 573 -361 -121 509 -361 -150 620 -314 -337 600 -146
3386 -146 -362 504 -154 -391 571 -72 -544 474 88 -493 373 62 -508 410 178 -590 277 300 -511 199
$$ packed form
3245f17R13R5r43P39J95r09O82L06j018N79N19r78L50N78r03L10O68r73J40Q62
3265E95q49r8Q64p22j52R25p08l88J061m83n81R57l47n89R70k81q18R89Pr26P90
3286B16J25q84P80J96j025O77M61j002M28N05r20M17N88j010K46Q05q98K7P66
3305D98p88L7Q25q35j74R84o15l77Q61m79l90R54m62o44J003j68p61Q09n6p60
3325e38Q57K8r77P87L28r75N27M10r20N22N22j056L44P51r19R3P38q45R6Q49q95
3346b73j41R92o78l19Q76n83k90R48n73n20J000l10o43Q38k18o28R01j31q61Q30
3366B17J76q81O16K26q62O41L61j019M72O26r34K40O30q70K11P70r34k3R37p46
3386a46k16Q66o58k37R62o43m72J018l86n81Q66l11n70R18k32p68Q67K3q11P10
$$ plain form
3406 199 270 -515 200 402 -537 38 485 -413 -30 447 -417 -47 544 -374 -205 562 -240 -265 521 -222 -325
3427 -325 566 -130 -452 507 4 -468 444 27 -506 425 132 -568 326 240 -537 247 265 -545 208 352 -543
3448 -543 98 398 -464 44 429 -449 -11 493 -405 -130 515 -306 -178 513 -272 -246 537 -184 -353 514
3468 514 -101 -390 489 -32 -467 444 78 -511 380 167 -523 308 237 -549 249 314 -538 150 370 -510 82
3489 82 432 -487 2 465 -419 -82 478 -368 -151 504 -307 -229 512 -234 -282 502 -170 -343 488 -68 -393
3510 -393 442 -7 -417 407 61 -474 364 162 -494 276 227 -482 233 289 -506 145 392 -461 41 403 -441
3531 -441 9 457 -430 -100 509 -322 -186 484 -274 -211 502 -229 -318 502 -101 -360 424 -68 -356 441 -18
3552 -18 -442 389 112 -449 301 134 -428 295 200 -492 212 313 -428 115 311 -418 98 397 -452 -37 472
$$ packed form
3406A99P1p85P15K02r39N75M47q98L83M77q64L70N91r18J69P67q02k5P86p43j03
3427c25Q91o96l22R59n03m72R12m17n33R31k93p00Q94q6p77P84J8q10P53J44q95
3448e43O41L00q62N08L85q78M38N04q98K75O45q21J28O91p85K6P83p21j69Q67
3468E14o15k89Q79n21m35R11l66n89Q91k13o90Q31p1p86P98O5q52O88K20q80N92
3489H2L50r19M89M63q84L37N60q46K17O55q11P8P41p46m8P84o72j73Q31n56l25
3510c93Q35m49m10Q24l46n35Q38k02o56P70m9p09P15N6p95O51K47q53N02L62q44
3531d41M50M48q87L30O09q31J36O70p58O3P13p31q9Q20o03k59P84m92k88P97m59
3552a8m24Q31k77n61P50j67n62P23r5o92P04J01p41N43J96p29N16K99q49M15N09
$$ plain form
3573 472 -320 -118 411 -286 -127 490 -277 -278 511 -126 -312 421 -111 -325 467 -60 -446 399 90 -429 289
3594 289 82 -408 330 150 -498 231 276 -415 127 236 -398 156 327 -447 30 408 -323 -61 352 -312
3614 -312 -42 433 -323 -206 466 -169 -257 379 -154 -249 463 -105 -398 417 49 -390 314 47 -387 351 117
3635 117 -504 246 260 -416 151 210 -408 180 306 -462 42 368 -343 -19 325 -335 10 415 -338 -145 434
3656 434 -187 -168 350 -194 -161 439 -172 -304 408 -14 -309 332 -24 -313 375 49 -445 294 172 -395 196
3677 196 145 -404 226 245 -455 101 330 -370 28 306 -376 24 380 -370 -95 407 -244 -132 365 -241 -142
3698 -142 433 -203 -255 401 -80 -258 332 -89 -272 378 -31 -360 326 91 -342 250 78 -370 265 165
3718 165 -421 154 250 -368 92 240 -376 86 331 -386 -28 377 -294 -89 357 -279 -115 406 -241 -211 411
$$ packed form
3573D72p92K02N29o97J59O17p67jP89o37j86P33n32k14P92n27l86Q45l09n19P18
3594B89k07m90P38j80o48P29M5o91N42J09o34N54J71p74M77L78p31K62M13o64
3614c12K70M75p56J17O72o35q8O36n33r5P12n68k93Q15l68m39P04k67m34P38k34
3635A17o21P50J4o76N67N9o18N88J26p68N04L26p11L24L44o60L45M05p53J93N79
3656D34o21J9N18n44L3O00o11j32P12m22k95O41l56k89O88l26m94P39j22n67N91
3677A96n1n49O30J9p00N56K29p00L98K78o82M00L56p50K75N02o51J12M97o06R9
3698a42N75o36n2O56m81j78N90m21j83O50m09l29O86k35m33N92j72m48O35j00
3718A65n86N75R6o18M60J48o16M62K45p17L58M05o71K05M46o36J64N21o47L0O22
$$ plain form
3739 411 -143 -228 376 -111 -258 381 -53 -321 339 33 -326 291 61 -336 273 110 -377 201 167 -354 156
3760 156 205 -355 118 261 -351 39 308 -310 -12 329 -295 -61 360 -251 -136 380 -195 -189 384 -138 -242
3781 -242 384 -83 -292 355 -28 -316 336 28 -353 295 82 -363 251 127 -371 198 180 -368 129 213 -341
3802 -341 90 243 -339 44 299 -308 -17 309 -275 -52 335 -250 -117 358 -191 -176 347 -141 -206 351 -97
3823 -97 -273 354 -22 -314 303 30 -328 287 77 -372 246 152 -372 167 175 -350 162 214 -386 74 290 -328
3845 -328 10 288 -287 2 318 -286 -75 364 -200 -133 315 -172 -140 352 -161 -223 367 -56 -262 296 -32
3866 -32 -254 314 -6 -348 286 124 -342 198 124 -331 208 178 -396 115 254 -340 30 246 -316 48 295
3887 295 -346 -48 364 -235 -108 308 -202 -87 344 -196 -189 374 -91 -213 291 -77 -193 337 -42 -296 307
$$ packed form
3739D11n54q5O04m87j47O39m34k68O60l06l59O17k30l97O09j63m87N78l4n21N10
3760A56M9n60M73J43o12L90K69o18K98L41o24K34M21o11J15N16n75ON73n22j04
3781b42O26m67k09O47l83k88O52l08l81O48k13m45O14j24m98N69j8n48M97Q4n54
3802c41M31J53n82L83K55o07K91L26n84K23L87n85J33M75n49J5N23m88o5N57m48
3823i7j76O27l76k92O17k73l58O15k10m49O18r4n24N39Qn25N12N2o00M60K16o18
3845c28L38K78n75K89L16o04K11M39n64O7M48m87L2M92n13o2N90m23k06N58l28
3866c2k22N68l20l42O34j62m66N40p4m55N39l0n74N11J39n94L70K16n62L64K47
3887B95o41K98M12n99J27M16n10J15M31n40PN63m65j22N04l68j16N30l79k54O03
$$ plain form
3908 307 72 -293 204 51 -277 236 103 -373 166 198 -326 81 192 -316 96 258 -358 -10 327 -260
3928 -260 -70 270 -245 -59 347 -258 -166 389 -121 -201 300 -104 -180 363 -73 -290 326 28 -268 243 34
3949 34 -262 291 65 -337 212 158 -302 116 135 -295 148 188 -362 39 268 -284 -22 226 -276 -9 307
3970 307 -294 -122 343 -177 -161 293 -164 -156 351 -127 -255 354 -13 -256 287 -3 -263 324 55 -343 262
3991 262 141 -303 180 134 -288 201 185 -354 108 252 -295 29 206 -289 40 277 -289 -64 296 -225 -100
4012 -100 275 -206 -116 336 -182 -214 330 -85 -229 298 -61 -248 322 -7 -318 294 93 -310 232 107 -314
4033 -314 228 175 -356 155 234 -317 79 232 -300 65 271 -309 -22 297 -264 -66 282 -244 -98 316 -195
4054 -195 -160 304 -129 -187 298 -101 -221 313 -53 -261 289 24 -292 262 80 -298 241 128 -314 192 185
$$ packed form
3908C07k35l65M97j53l28N13j33m76N39L2n24M07J11n08M12J62o16L48L37n87
3928b60J90L40n15J86M06o05R2N55n10q0N01m04p6N43m36k17O16k98k96N11k09
3949C4k96N53k26m02N49n4m60M18J9m30M43M0n50M01K29n52K62K48n02K67L16
3970C07o01J72M65n20J6M54m57QN07m78j28O09l67k43N43k90k60N87k69l98O05
3991B62j21m44M83m6m22M89j6n39M62J44n47L24J77m95L29K37n66K25L60n21J25
4012a00L75m81R0M52n18l2N44m15j44N27l59j87N70l29l11O12k01m03N42j25m21
4033c14N42n3n31N11P9n51L96J53n32L65K06n80K87L19n61J98L48n26J46M14n11
4054a95L5M64m33n8M85l99j20N34l66k08N50k65l16N54j82l78N39j13m42N06p
$$ plain form
4075 185 -326 144 219 -322 99 273 -308 32 288 -284 -19 313 -264 -85 319 -225 -125 324 -191 -174 327
4096 327 -136 -223 304 -72 -237 292 -33 -275 271 21 -293 242 62 -298 222 114 -331 172 185 -325 117
4117 117 216 -301 85 244 -321 28 293 -272 -49 298 -251 -85 327 -236 -143 352 -158 -208 314 -122 -210
4138 -210 319 -95 -272 315 0 -297 261 31 -284 256 73 -327 216 155 -299 140 161 -283 134 214 -323
4159 -323 55 271 -266 -7 255 -250 -17 295 -250 -106 339 -174 -153 302 -151 -169 337 -133 -250 334 -22
4180 -22 -270 265 -3 -265 281 39 -345 233 143 -316 158 138 -301 158 188 -345 89 271 -272 11 231
4201 231 -256 32 276 -277 -66 314 -181 -125 263 -178 -105 313 -154 -210 316 -52 -230 258 -43 -219 300
4222 300 -10 -315 264 109 -301 186 97 -293 203 152 -357 126 241 -277 53 220 -282 67 276 -309 -30
$$ packed form
4075A85n11M70P5n41M21J74n81L40K56n72K65L32n77J79M04n44J00M49n15J7N01
4096C27m63q7N27l76j65N29l25k42N46k50l14N35j80l60N20j08m45N03J3n10M42
4117A17R9n17L86J59n65L49K65n65K23L47n49J66M12n63R3M95n10n0N22m36q8
4138b10N29m14j77N87l15k97N58k30l15N40j83m00N43o1m54M39K1m44M17Q0n37
4159c23L78K16n37K59K62n05K33L12n45J44M45n13K1M55m53j8N06m70j17N84l56
4180b2k48N35k68k62N46k42l84N78r0m59M74k0m39M59L0n33M34J82n43K83K20
4201B31m87K88K44n53K11L80m95N6L88m41P3M18m67n6N26l68j78M88l01j76N19
4222C00l10l05N79j55m10M87q9l90M96n1n09M83J15n18L30J67n02L49K09n85K79
$$ plain form
4243 -30 317 -211 -86 255 -189 -81 304 -183 -183 319 -85 -190 242 -87 -192 284 -52 -272 247 65 -251
4264 -251 191 58 -254 218 117 -324 144 198 -268 90 183 -276 90 244 -299 -10 296 -215 -52 255 -224
4285 -224 -60 310 -214 -166 309 -107 -177 260 -109 -174 292 -60 -246 249 14 -239 195 21 -237 220 77
4306 77 -282 163 146 -248 121 133 -247 111 195 -265 49 233 -230 -16 229 -220 -22 280 -218 -101 282
4327 282 -150 -139 256 -143 -151 283 -91 -228 269 -13 -234 222 -1 -234 237 44 -267 192 98 -253 148
4348 148 118 -239 138 163 -250 82 190 -228 33 200 -218 14 232 -203 -38 243 -163 -92 257 -156 -125
4369 -125 272 -115 -164 266 -77 -208 245 -30 -229 234 18 -255 210 51 -259 191 107 -263 156 142 -265
4390 -265 105 171 -247 82 198 -236 25 218 -203 2 226 -199 -36 256 -148 -100 247 -119 -115 244 -109
$$ packed form
4243c0L47n28J25L41m44J08L85m87%N02m04j05M32l29j05M76l36k20N19j82l16
4264b51M42j33l12M72j01m41M68N4m66L58R3m59L66J54n43K89L06n11J63L07m79
4285b24J64L70n24M8M75m16p0M37l69o5M66l52j86M95k35k53M34j74k58M57j43
4306G7l59M45j7l94L69J2l80L58Q4m60L14J84m63K14K45m49J98L02m98J17L83
4327B82m32J1L95l99qM34l74j37M97k82k21M56k23k33M71j93l11M59r4l51M01
4348A48l0l57L77K5m13L32J08m18K61J67m18K32K18m35J65K81m06P1L49m13L1
4369a25L97l87m9M30l43j31M53k75j99M63k16k73M65j59l10M50q4l70M19j4m07
4390b65L70O6m18L29J16m34K61J93m21K05K24m25J63K92m04M8L47l66ML59l53
$$ plain form
4411 -109 -154 246 -56 -203 217 -18 -207 218 12 -235 210 78 -241 145 107 -239 158 137 -262 103 199
4432 199 -235 40 202 -215 32 226 -220 -23 257 -170 -71 235 -141 -65 239 -140 -139 253 -68 -170 205
4453 205 -49 -160 216 -38 -212 207 43 -228 162 57 -212 179 79 -255 151 161 -229 79 159 -217 77
4474 77 186 -250 34 242 -200 -34 221 -178 -27 237 -186 -102 265 -106 -139 206 -105 -149 258 -82 -205
4495 -205 242 11 -208 176 22 -171 181 37 -220 170 93 -215 94 89 -216 115 157 -197 54 199 -185
4516 -185 5 188 -186 0 230 -189 -90 239 -144 -109 211 -133 -107 236 -134 -191 239 -28 -189 184 -36
4537 -36 -197 219 0 -258 170 84 -234 125 82 -215 135 122 -247 79 187 -192 36 156 -184 42 203
4558 203 -202 -29 242 -140 -63 203 -142 -60 235 -137 -154 233 -60 -161 184 -75 -178 219 -35 -237 192
$$ packed form
4411a09m5M00l02j47M20k35j89M25k06k47M45j32l19L86l8l46L97k1l99L65R6
4432A99m34K75J62m17K47J94m46J97K80m27R9L06l76P6L04l79JL92l21j02L75
4453B05k54j11L76k54j74M19j64k71L90j05k69L91j00l34M06J0l90L08Q0l76K94
4474G7J09m36K84K08m42J66K55l99J51K64m23Q4L67l71l3L45l11m4M07l40j23
4495b05M47k31k19L84j54j93L52j44k57L90p7l08L09nl05L31M2l54K51J45l84
4516a85J90J83l74J86K30m19R9L29l83L5L20l44K6L43l70n7M30k67j61L73k20
4537c6j61M16k19k58M28q6l18L59m3k97L50j3l69L26J08l79K28J20l40K26J61
4558B03m05J73K71l82P7K66l45Q2K95l72j7L87k93j01L45k59j03L97k54k02M29
$$ plain form
4579 192 47 -225 154 35 -229 165 82 -264 112 141 -227 74 127 -208 87 175 -221 15 208 -160 -7
4600 -7 188 -152 -18 220 -144 -89 232 -94 -111 200 -99 -125 217 -75 -187 186 -19 -192 162 4 -203 182
4622 182 30 -249 137 101 -229 100 106 -223 110 156 -222 61 185 -195 20 195 -177 9 222 -176 -48
4643 -48 225 -123 -74 219 -108 -91 224 -86 -127 207 -44 -157 185 -25 -174 174 0 -198 150 41 -207
4664 -207 130 68 -212 114 109 -235 88 136 -212 49 168 -190 24 200 -183 -9 219 -153 -47 236 -128
4685 -128 -82 233 -111 -102 212 -81 -139 211 -46 -158 189 -25 -165 168 9 -193 146 53 -210 122 67 -207
4707 -207 101 93 -212 81 155 -195 38 158 -184 23 182 -185 -5 223 -136 -58 216 -117 -71 227 -104 -111
4729 -111 236 -55 -157 205 -38 -156 206 -22 -204 188 40 -208 137 61 -185 143 64 -224 109 132 -201
$$ packed form
4579A92j45k72L79j19k64L94q3l46L76K9l68L01N3l35K95Q8l96K36J93l68J53
4600gJ95l40J34K38l64N5L21l26j7L11k99k6L42k92j12L73k05j73L54j58k07L85
4622A82j52k79L86l6l30L29Ol29L33M6l78K83J24l80K15J75l72J86K13l98J28
4643d8K73l48M9K93l27J7L15l10m1L34k51j13L42k10j49L48j74j98L48j09k48
4664b07L37o2k80L26nl44L23M8l48K61J19l58K14J76l83J74K28l72J06K83l64
4685a28M6L15l44RL14k93n8L50k57j12L47k14j40L33j59k02L39r3k63L32n5k74
4707b07L08ql05K93P4l50K33J20l42K07J59l67J80K28l59P8K74l33M6K98l31p
4729a11L47k91j02L62k43j18L62k28j82L92j48k48L45p6k46L28p9k88L33K3l33
$$ plain form
4750 -201 50 120 -184 52 145 -195 3 195 -136 -30 188 -132 -24 200 -125 -87 233 -77 -115 197 -54
4771 -54 -129 210 -45 -182 201 18 -194 153 37 -187 172 60 -233 118 121 -208 65 123 -189 82 149 -214
4793 -214 26 190 -166 -7 168 -146 7 186 -152 -63 224 -74 -80 184 -78 -89 212 -74 -145 210 0 -166
4815 -166 157 -3 -155 168 26 -210 139 92 -190 104 87 -186 108 131 -222 56 183 -168 3 159 -159
4836 -159 5 196 -158 -43 221 -92 -66 194 -91 -69 212 -80 -134 202 -14 -138 156 -21 -127 168 6
4857 6 -189 147 70 -171 95 52 -176 115 89 -213 71 150 -171 30 144 -163 38 176 -175 -21 211 -118
4879 -118 -52 186 -115 -49 211 -103 -112 204 -50 -128 180 -50 -124 190 -15 -170 151 57 -164 120 39 -166 135
4902 135 72 -190 89 110 -167 58 113 -157 62 145 -179 5 168 -135 -12 157 -125 -30 186 -118 -68 197
$$ packed form
4750b01K51P0l04K36R3l40J98J92l31J06K18l20J08K24l25L8L20l10l8L12k51
4771e4p5L39k55j37L83j83k12L47j16k24L59j12k93L51Ll29K73N8l12K71O7l63
4793b14K40J64l56J59J75l14J53J79l38Q9K87k98oK64k62j1L01k86p1L55k10j66
4815a66L23j60j52L23j42k36L49m7k82K94j7k73K94K3l53K78J27l51J71J56l18
4836a59J64J91l54J15K64l13K6K60k85K2K81k92n4L36k16j24K94j77j06K95j62
4857Fj95L36p7k41K66m3k28K91k6l02K84P9l21K01J14l07K01J38l51J54K32l29
4879a18O6K38l01O6K60l14rL16k54p8L08k30p4L14k05j55L21r4k21K84q1k05L01
4902A35o3k62K79K1k77K25N5k70K19Q3l24J84J63l03J23J69k82R5K16l04N0K65
$$ plain form
4924 197 -70 -90 179 -54 -102 198 -54 -148 183 -3 -155 155 14 -159 151 38 -190 111 71 -179 74
4945 74 70 -170 77 117 -186 40 139 -144 16 143 -136 -1 160 -142 -59 157 -84 -79 180 -78 -84 181 -55
4968 -55 -103 192 -42 -150 171 -6 -148 151 18 -141 149 31 -184 123 65 -199 82 84 -169 63 117 -161
4990 -161 38 122 -163 -7 143 -131 -5 149 -118 -41 166 -89 -67 163 -76 -77 164 -52 -102 165 -11 -121
5012 -121 144 4 -122 147 20 -148 116 61 -170 81 74 -159 76 88 -170 59 124 -162 17 135 -140 18
5034 18 131 -142 -27 167 -109 -52 157 -75 -49 159 -72 -88 161 -25 -115 126 -14 -98 139 3 -132 133
5056 133 49 -136 86 57 -127 84 70 -140 69 108 -141 24 107 -124 38 120 -142 -6 162 -114 -45 149
5078 149 -79 -28 159 -100 -74 135 -49 -95 125 -53 -90 129 -32 -156 134 41 -147 105 13 -131 93 9
$$ packed form
4924A97k67k0K69k33m8L00k52r4L31j86j52L10j41j73L10j13k28L01m0k50K53
4945G4mk40K47M0l03K26R9k83J60J27k79J35J61l02Q3K16k41NK59k58oK65k36
4968e5m8K95k34j08L21j77j42K99j33j59K90j18k15L07n8k64K81Kk53K32N4k78
4990a61J99Q4k85J56J50k74J26J54k67P7K07k55K2K30k39jK41k16n0K67j76j10
5012a21K65j40j26K69j27j68K64n5k31K51pk33K35J2k58K29O5k86J79J18k75J58
5034A8J13k73J15J94k76N7K09k32K6K08k31j6K49j86r0K41j40q4K37j36j35K65
5056A33q4j85K22k9j84K11j4k10K09L9k49J65Q3k31J62Q2k62J36J68k76O9J94
5078A49k28N1J87k59K6K09j84m6K20j78l7K19j61j24K90r3j88K52r2j44K24q4
$$ plain form
5100 9 -106 118 86 -137 17 9 -114 59 84 -171 -16 160 -89 16 109 -87 -11 131 -101 -57 154 -60 -85
5123 -85 129 -39 -68 147 -29 -114 143 25 -111 105 3 -109 122 34 -157 95 79 -123 42 68 -110 54
5145 54 70 -140 26 122 -101 -9 90 -93 -5 116 -94 -38 146 -59 -48 93 -62 -46 138 -46 -88 138 6
5168 6 -88 110 9 -100 123 11 -131 99 54 -114 67 41 -122 75 64 -146 30 96 -118 20 75 -113 -6
5191 -6 105 -114 -20 123 -79 -42 104 -66 -40 126 -55 -76 137 -12 -70 108 -10 -76 119 18 -100 99 42
5214 42 -104 77 44 -103 84 66 -125 50 96 -120 23 84 -128 10 105 -127 -11 116 -93 -34 115 -81
5236 -81 -42 122 -75 -60 131 -32 -70 119 -27 -76 124 -7 -85 104 25 -93 98 42 -103 91 45 -118 64
5259 64 79 -110 42 72 -114 23 88 -118 5 96 -107 -24 100 -87 -32 127 -89 -47 120 -67 -74 126 -43
$$ packed form
5100Ij15K24l2k23J54qj23J73K5k55J55J76k49J05R3j96P6J42k32M4K11k14k5
5123h5K14j68k9K15j76q5K57j18j36K16j02j12K31q8j91K52j6k02J65K6j78J64
5145E4J6k10J66R6k23R2R9j83Q8J21k10N6J84k05J1J41j55J6J84j84m2K26j32
5168Fr4J98j01j09K23j12j42K30m5j68J81k6j63J97j1k10J76O6k14J38N5j88J07
5191fJ11k19R4J43k02L7J46j70K6J66j81k1K13j49n8J78j18o6J95j01j18J99n7
5214D2j46J81l3j47J87j8j91J75M6k16J43O1k12J38R5k32J16J27k09N9J49j96
5236h1L9J64j97J5J91j63l8J89j46m9K00j31p8J89p9j18J91n6j45J94m6j63J82
5259F4J5j89J52L0j86J37O5k06J23R1k03Q3J24j87N5J59k16M2J67j87pK00j69
$$ plain form
5282 -43 -85 128 -26 -94 117 -3 -99 107 22 -102 100 38 -106 86 56 -108 73 70 -102 53 77 -106 34
5305 34 80 -117 4 108 -106 -14 101 -91 -27 103 -85 -53 116 -62 -70 106 -40 -57 124 -29 -85 139 -1
5328 -1 -100 115 16 -98 102 34 -113 101 62 -113 57 71 -100 69 76 -126 29 99 -91 2 90 -86 -6 99
5352 99 -88 -30 129 -72 -59 91 -53 -51 113 -46 -79 128 -10 -85 97 8 -81 116 9 -101 113 48 -105
5375 -105 76 57 -97 76 59 -121 51 103 -102 17 88 -97 18 97 -92 -14 117 -76 -37 96 -67 -38 109
5398 109 -66 -66 121 -30 -77 93 -21 -71 111 -10 -103 104 39 -100 77 39 -88 80 50 -115 75 95 -108
5421 -108 36 78 -100 43 97 -105 7 125 -83 -25 101 -66 -11 109 -79 -49 130 -34 -60 102 -35 -65
5443 -65 114 -28 -92 102 11 -87 77 22 -77 86 36 -110 70 76 -94 52 67 -104 61 72 -110 26 96 -90
$$ packed form
5282d3m2K13j54o8K11j20r6K06q5j24K02o2j44J92l0j64J81lj72J55K4j83J40
5305C4M6j97J21J04k14R2J15j92O4J30j88L2J69j78qJ76j46j7J81j53n6K24j40
5328ar9K15r9j14K00o8j47K14l9j75J70J4j71J69Pk02J55P0j90R3Q8j76Q0J05
5352I9j87N8J59k01J3J50j44KJ64j59l3K07j38p5J82q9q9J97j07j10K14o5j53
5375a05J81j9j54J73j7j80J72N2k05J19P1j85J15P9j89P8J31j93L9J33j63K9J47
5398A09j75%J87j51m7J70j14n0J82j21r3K07o5j39J77l8j27J68l0j65J90K0k03
5421a08J44M2j78J43N4k02J12J18k08N8J26j67N5J20j88L0J79j64k6J62j37l0
5443f5J79j42o4J94r1r8J64n5r9J63n0j46J80Oj70J46J5j71J65J1j82J36P0j86
$$ plain form
5467 -90 -6 91 -92 10 105 -102 -42 121 -61 -60 102 -44 -51 120 -53 -86 117 -14 -83 102 -7 -82 105 21
5491 21 -107 80 54 -90 76 44 -91 63 63 -107 33 94 -84 14 86 -76 12 94 -87 -21 109 -60 -38 96
5515 96 -61 -36 106 -56 -78 116 -28 -72 112 -26 -81 130 9 -100 102 34 -99 84 46 -105 77 56 -108
5538 -108 43 82 -103 32 76 -97 27 95 -91 -6 91 -84 -25 97 -72 -32 122 -59 -45 103 -45 -65 110
5561 110 -29 -64 109 -11 -89 102 11 -81 95 35 -96 87 55 -105 77 67 -108 52 80 -97 40 98 -86
5584 -86 27 102 -78 -1 104 -72 -29 104 -65 -39 104 -49 -54 100 -35 -80 102 -14 -68 82 1 -89 97 18
5608 18 -91 69 28 -86 84 51 -101 66 71 -89 48 83 -90 49 102 -88 23 103 -80 -1 107 -62 -22
5631 -22 101 -69 -46 119 -44 -71 95 -37 -65 104 -29 -77 107 7 -89 79 18 -76 86 25 -97 77 58
$$ packed form
5467i0Q4R7j83J02R5k07O0J63j82JJ62j46pJ71j73l3K03j31o9J85j09p5J87q4
5491B1j28J87k6j44J66l2j35J54%j70J40O1j78R8P2j62Q8Q2j81O6J30j69K2J34
5515I6j57K5J42j62k2J94j44m4J84j38n5K11j21j09K02o8j33J83l8j51J82k1j64
5538a08J51L9j85J35M4j73J24O8j86Q5R7j75N9J22j69M0J54j81J4J48j48k0J75
5561A10j39l5J73j20p8J91r1r2J76o0j31J83l2j60J82j0j75J60K8j77J37N8j84
5584h6J13P5j80P7J05j76M3J33j69K6J43j53nJ54j35m5J82j16n4J50q1r0J86p9
5608A8j09J60m1j14J70l3j52J67Nj60J37L5j73J39N3j90J11Q0j83P9J08j69M0
5631b2J23j70K3J65j63k7J66j32k8J69j33m8J84j00r6J68o1r4J62o1j22J74j9
$$ plain form
5654 58 -86 40 70 -69 54 67 -105 37 105 -78 -6 93 -75 10 99 -65 -38 106 -58 -57 94 -60 -49 102
5678 102 -55 -77 111 -5 -91 88 -1 -78 97 17 -96 83 53 -98 55 48 -62 58 59 -90 42 87 -76 11
5702 11 79 -64 18 101 -71 -6 108 -52 -24 94 -47 -30 93 -51 -56 106 -28 -71 80 -19 -68 95 -11 -88
5726 -88 90 16 -101 53 32 -74 68 48 -88 58 81 -87 31 71 -71 36 90 -81 13 101 -54 -14 83 -54
5750 -54 -8 97 -53 -41 97 -33 -55 76 -16 -60 89 -12 -86 82 13 -67 67 16 -54 74 26 -86 59 69
5774 69 -83 36 64 -75 48 77 -75 11 91 -65 0 75 -59 -2 81 -54 -24 90 -27 -35 68 -33 -38 81 -22
5799 -22 -61 79 4 -71 61 9 -75 68 24 -80 58 51 -70 39 49 -71 44 67 -77 29 82 -73 15 70 -69
5824 -69 6 93 -51 -13 105 -36 -27 78 -39 -34 89 -39 -56 76 -22 -70 63 -8 -63 70 8 -75 55 26 -67 43
$$ packed form
5654E8j44J26L0j39J23J3j72J42O8j83P2R9j68Q5Q9j64K7J44j64JJ51j54J1J51
5678A02j57k2J88j16q6J79q9p7J75q0j13J79l0j51J53pj10J20Jj49J32M5j63Q7
5702A1O8j43Q2Q3j72O5J14j60K8J18j41J7J23j44nJ62j34m3J51r9m9J63j06p7
5726h8J78p4j17J54k1j06J42k0j36J46K3j68J18M0j42J07N4j71R4Q8j55M0R7j37
5750e4M6J05j50J2J38j30k2J31r2m4J49j01p4J68o9q0J34n1p0J28m8j12J45J0
5774F9j52J19K8j39J23K9j52Q6Q0j56O5P5j34N7Q3j35L0J14j17qJ03j01nJ19j03
5799b2l9J40p5p5J32n2q4J43m4j04J38pj21J09J0j20J15K3j44J06N3j55Q8N5j39
5824f9P5Q7j44L8J18j41RJ05j17NJ23j28j7J32r8m8J33p1n5J33o2q3J30k9r3J10
$$ plain form
5850 43 34 -75 35 48 -69 27 57 -72 13 74 -60 12 78 -59 -3 95 -46 -13 84 -37 -28 88 -17 -43 83 -22
5876 -22 -55 78 -17 -74 66 0 -66 64 7 -77 46 25 -81 34 38 -75 26 52 -58 27 67 -59 14 76 -49
5901 -49 4 68 -44 -9 87 -35 -29 85 -22 -20 80 -22 -52 88 -14 -50 75 1 -56 73 0 -76 70 11 -72 46
5927 46 30 -72 50 42 -82 26 52 -62 21 53 -65 25 76 -62 5 83 -39 -14 83 -23 -8 86 -33 -43 89
5952 89 -3 -50 61 1 -44 68 -17 -70 67 19 -77 42 22 -75 44 28 -99 41 50 -77 14 43 -63 30 61 -79
5978 -79 11 87 -53 -5 69 -44 0 77 -44 -25 93 -20 -38 78 -11 -36 77 -22 -66 73 3 -68 40 9 -64 56
6004 56 22 -74 47 43 -80 28 37 -66 24 46 -79 11 64 -73 1 64 -46 10 82 -53 -12 94 -28 -25 88 -29
6030 -29 -28 93 -18 -51 86 11 -58 64 4 -49 80 9 -66 65 42 -75 37 39 -59 49 46 -79 24 65 -60 19
$$ packed form
5850D3rj09J10J3j17R6L0j29Q5O1j34P2O6j37N6R8j41L3R7j21RJ16j05k6J26j05
5876b2l3J33r5n7J40o6o6J30n7q4J23k1j06J15Mj13J01K6j10Q5M0j26P3O2j25
5901d9N3O4j12L5R6j22OJ14j07KJ00j02l0J40j02l6J25p4n7J29p3p6J46n9q3J18
5927D6j6j02J22qj24J08K6j14Q3L2j18R0N1j38O7P8j22K5R7j06J5R4j19j0J32
5952H9r2m7J11o0m5J12q5n3J37m8r6J19k0r7J19j6j27J40Rj27R1K9j06R3L1j40
5978g9R0P6j40M8P4j13M4P7j21J9J18j13j8J16q9k5J13r9m4J39p0p1J08l1p3J20
6004E6l4r6J21mj23J08Rj03R0K2j25R0N3j37P4O3j10N6P2j35M1J06j22LJ13j17
6030b9JJ21j11l3J37p5o9J22o0n3J29p1p5J31k3j17J12Kr8J08lj25J03M1j25P9
$$ plain form
6056 19 50 -61 25 78 -57 -7 97 -37 -15 79 -39 -16 82 -37 -34 98 -7 -48 83 -18 -50 74 -6 -63 77
6081 77 25 -77 59 34 -70 60 29 -82 42 53 -63 18 50 -62 42 64 -61 3 69 -56 -2 66 -45 -10
6105 -10 86 -35 -19 84 -14 -44 80 -14 -29 94 -7 -52 80 12 -59 73 6 -54 63 28 -80 54 33 -77 43
6130 43 41 -76 25 52 -81 8 70 -59 14 72 -51 10 84 -49 -26 86 -24 -19 53 -19 -28 67 -7 -34 72 -5 -66
6157 -66 71 19 -53 64 12 -88 87 33 -47 30 41 -72 41 53 -77 27 66 -78 14 68 -65 4 87 -57 3
6182 3 81 -52 -11 87 -33 -22 85 -21 -40 85 -12 -52 77 0 -68 68 6 -63 52 22 -83 51 19 -74 19 24
6208 24 -68 22 43 -79 25 60 -81 9 63 -54 7 70 -62 -20 93 -37 -27 79 -23 -25 87 -25 -41 90 0
6233 0 -53 77 6 -44 73 14 -71 74 37 -66 48 31 -56 33 36 -84 31 63 -72 11 56 -67 10 61 -58 -10
$$ packed form
6056A9L1j11Q6N3j35N0J04j34K2R4j18K3R8j19LJ32j05m1J31j01l2J24q0n7J40
6081G7n2j02J36k5j04J30l1j11J24J1j16Q1L2j12J04K2j25O4O6j25N4O8j11L5
6105a0R6j21J6J03r8l0J24r4j5J23j01m5J32o8p1J32o7o0J17l5j08J34k1j10J20
6130D3kj17J01K7j33Q9O2j29P3N8j23O1P4j33K3J12j10NP2p2rR5p4k7J06p7o1
6157f6J37n2p2J17n2j00J75n4q0P7J1j13J13J2j30J04L9j44R2N4j33O9Q3j44O0
6182CP8j33M1R8j20J1J07j06j9J25r7m0J29p7o8J36o2o9J15l0j05J34l2r3R3N
6208B4r2R0K1j22J04L5j41R0N4j17O1O3j32M2J13j30J0J06j02kJ12j12j6J31r0
6233@n3J30p1n0J17n9q5J45l7j03J14j7q7Q9Lj20J15L2j35Q3M5j23P7N1j19M8
$$ plain form
6259 -10 83 -51 -24 63 -42 -15 87 -42 -37 105 -15 -39 69 -5 -44 88 -11 -55 88 15 -68 57 25 -56 62
6284 62 45 -72 44 51 -72 15 56 -65 26 55 -68 11 73 -61 -13 74 -37 1 70 -41 -32 91 -15 -46 70 -17
6310 -17 -33 88 -11 -61 91 13 -58 65 19 -63 75 23 -69 55 45 -71 26 45 -69 34 53 -84 15 66 -63
6335 -63 -6 63 -65 -5 76 -49 -33 89 -30 -40 83 -26 -25 92 -25 -49 89 9 -55 63 25 -62 61 15 -68
6360 -68 53 43 -65 44 35 -72 38 50 -84 25 64 -73 12 58 -72 1 66 -73 -10 71 -40 -25 82 -37
6384 -37 -30 91 -37 -46 86 -1 -49 81 -1 -62 80 10 -70 71 35 -70 46 19 -57 37 38 -72 19 52 -73 14 51
6411 51 -63 13 62 -79 0 70 -64 -20 73 -56 -16 76 -47 -31 82 -30 -43 74 -16 -51 73 -2 -57 79 22
6436 22 -64 59 23 -59 52 36 -69 41 42 -64 25 56 -79 5 55 -73 0 62 -58 -9 62 -56 -15 68 -41 -24
$$ packed form
6259a0R3j34K7Q7j05K7J02j29NJ42j20k4J08p4l9J32r9m4J43p3q3J25l2q1J18
6284F2j7j17J16Pj23Q7M1j21R1K9j23P9O2j34M8Q7j11L8O9j11RJ23j06l1J16q7
6310a7j6J21r9n0J52p8p1J23m6q2J38n2r2J24j0j16R7J9j14J03J9j37R9N1j29
6335f3N7O9j28O0Q1j25J6J22j19j0J23j09JJ17j17k4J38q0o4J18l8q7J23m6q3
6360f8J21j0j08J09rj07J10J2j34J09L9j37Q5M6j30P3O5j39O3Q1j11J5J07j19
6384c7PJ21j28rJ32q7m8J30q2o1J42p0q0J41l6j05J16k7p6R4Jj10R1L3j25Q7L7
6411E1j14P6M9j41P9P0j34M4R3j29M0R2j23J6J13j12j3J17r0l5J24p5n5J36n7
6436B2q6J23l6q2J11j6j05J10Jj06Q9L1j35Q4N0j28P3O2j20M9P1j18M1Q3j09J7
$$ plain form
6462 -24 72 -42 -28 76 -18 -36 90 -5 -34 79 0 -51 83 11 -56 70 22 -56 50 36 -72 43 38 -74 31
6487 31 52 -62 12 51 -62 5 69 -64 -12 66 -49 -16 73 -47 -18 71 -32 -37 80 -10 -34 73 -1 -48 72 7
6513 7 -54 55 27 -48 54 13 -61 63 45 -70 34 43 -55 25 39 -70 10 55 -75 -7 44 -50 1 65 -62 -17 70
6540 70 -48 -49 73 -24 -25 68 -24 -28 70 13 -47 62 20 -45 71 18 -67 59 42 -55 38 35 -47 50 42 -62 26 63 -59
6569 -59 4 59 -47 16 64 -71 -12 71 -43 -11 66 -35 -19 75 -36 -42 91 -12 -45 66 1 -39 61 0 -56 70
6595 70 28 -62 47 28 -53 55 34 -59 35 57 -67 12 52 -49 13 52 -73 1 76 -42 -6 61 -43 -9 71 -37
6621 -37 -34 78 -29 -49 68 -12 -38 54 -11 -55 70 13 -62 60 23 -52 62 28 -57 48 55 -64 18 42 -43 24 51
6648 51 -59 7 67 -55 -11 62 -37 -9 68 -54 -28 75 -29 -34 66 -28 -44 69 -20 -51 81 9 -55 69 19 -52
$$ packed form
6462b4R6j14J4J04r4j8J26r5k9J13p9n1J34p2o7J26m8p8J06j4j08J15nj12J05
6487C1K1j14P4L9j13O7O4j33N2P8j15L3Q9j20K9Q9j03nJ17r0k4J07p4m7J20o5
6513Go1J09k8p5J02m1p4J24j8j15J04Rr8Q0J4j09Q0M5j30O8N1r4N1O4j27M5Q7
6540G0j18jJ22r7jR3r2mR8n7o0J09m2o5J16n3q5J26j7r7R3lq2R7qj04Q8L7j22
6569e9O3N5j06O3M8j35N9Q3j14L2P7j01J6R4j11oJ33j03l3J11o5m0J00o1n6J26
6595G0m2r0J09j9q1J08k1r3R4K2j24P9M0j01O2L9j25P4P5j18L6O7j04L4Q0j08
6621c7LJ12j07k0J17q0k6R2o5m4J25n7p5J22l7p5J14l4q5J05Pj19Q2K4q5O7K7
6648E1j10O6O0j22M4P3r9K8P7j22K6J03j04nJ00r4j6J13q9l1J32p2o4J24n0p1
$$ plain form
6674 -52 65 24 -55 68 33 -64 39 44 -53 39 55 -65 28 66 -57 7 58 -53 6 57 -49 -13 66 -37 -37 81 -37
6701 -37 -27 72 -31 -29 78 0 -35 78 9 -46 62 13 -51 45 60 -44 53 8 -71 65 70 -101 42 57 -49 37 72
6728 72 -41 42 82 -23 17 96 -54 -58 96 -42 -3 58 -45 -65 85 27 -33 82 -3 -65 62 15 -72 70 22 -44
6754 -44 56 28 -50 56 31 -55 45 40 -59 39 51 -67 34 59 -57 11 68 -55 2 65 -56 -22 66 -43 -28 70
6780 70 -40 -38 59 -30 -40 64 -12 -43 74 -7 -55 66 24 -49 61 24 -60 61 38 -62 51 47 -52 41 54 -62 11
6807 11 59 -59 15 60 -59 -3 63 -60 -15 69 -55 -24 71 -32 -26 70 -28 -38 71 -19 -40 76 6 -58 72 7 -46
6834 -46 74 15 -55 59 33 -70 46 56 -49 48 57 -61 25 71 -44 9 69 -49 -3 70 -54 -1 64 -35 -36 65
6860 65 -20 -15 59 -33 -37 81 -5 -50 66 11 -46 68 7 -49 62 29 -51 52 37 -34 53 46 -53 41 65 -53 20 53 -50
$$ packed form
6674e2J17m1p9J23l5r7J03Nr7R2J6j20R3L8j23O4N1j11N9N1j06L6P9j03%J18j18
6701c7J0R9j03KJ07p8l5J13o9n5J08m9o4R6J5j04R7m5p9J36Nj71J43J5j06Q6L5
6728G2j13Q3M0j05M0P9j50mJ54j38L9O1j03k0J50n8o0J15q5o2J27m7q7J42m8o6
6754d4J00k8p8J06k5q6J00nr9R8J2j18J01K5j16O8N7j23N7O3j21L4Q8j09J5R8
6780G0j10KR7q9j0J04p6l1J17q1m8J21m2p3J10l7q4J21k3j00J13mr9R3J3j16P3
6807A1M8j18P4M5j19N6O6j23M5Q4j24L1R5j03OR6r8j0J09r0k1J16p0o4J30o5n3
6834d6J20n9p0J14k6j03J16J0j05R7Rj18Q6M6j15N3O0j18M6P3j24N3O5r9jJ01
6860F5q5NP4r2mJ18q6m5J16n5n7J14o1n6J11l3q0J03j5p1Q7pr9R4K4j18P3L3j03
$$ plain form
6889 -50 8 61 -56 1 74 -44 -22 66 -24 -30 73 -31 -35 70 -17 -49 63 -11 -49 66 -5 -55 61 14 -66 50 24
6916 24 -50 53 34 -64 45 53 -53 21 53 -60 15 50 -61 6 71 -38 -13 60 -44 -13 63 -38 -29 71 -14 -38 58
6943 58 -16 -41 56 -9 -47 62 6 -44 47 19 -43 52 23 -59 49 52 -53 27 39 -47 34 49 -56 19 66 -33 5 60 -41
6972 -41 6 71 -48 -22 68 -24 -27 54 -23 -24 69 -10 -39 68 9 -52 48 -2 -45 55 12 -53 45 36 -46 37 45 -45 39 47 -49
7003 -49 30 66 -39 9 65 -27 12 68 -33 -14 67 -39 -28 62 -41 -33 59 -15 -34 69 -13 -42 59 -2 -46 55 11
7030 11 -64 49 31 -47 58 28 -59 38 48 -49 34 53 -45 8 56 -46 16 67 -35 7 61 -33 -20 69 -33 -19 73 -19
7058 -19 -27 63 -16 -34 51 -11 -48 58 3 -55 44 3 -61 41 22 -55 37 35 -46 40 46 -52 28 54 -51 28 60 -43 14 62
7088 62 -36 3 61 -35 -5 66 -23 -31 67 -23 -31 68 -13 -46 54 -8 -45 48 7 -55 52 7 -65 46 17 -47 38 26 -55 40
$$ packed form
6889e0N8N3j17N7P3j18K2Q8r0oJ03j04mJ05q7l2J12p4l8J15p1n0J16m7q0J16k6
6916B4p4J03j9r8J09Qj06P4L2j13P5L5j11O7O5j09K5P3j04L1P6j01RJ00q5k4R6
6943E8p4k5R7o5l8J09n6n0R1k8o2R5k9q2J08Lj05Q0J2q6Q1J5j05P5M7r9L8N5j01
6972d1M7O5j19K6R0r2lQ1p7jR3p9k9J07n9o1J00n0m3J00m3o5R8rq2Q3Qr0Q4Qr6
7003d9P9L6j05M8N6r2L9N6j01J9Q1j06J1R0j03QR2p4j9J03q2k9J01o1m4J01m4
7030A1p5J13j8p8J05l0q7R7J0r7Q3J9r8N3M8j02O2N1j02M2N4r4J3Q9j02J4R2r2
7058a9qR0p9j8Q5o2l7J06n5n8R9m1o4J02j9p7R2kq1Q6Or8Q0K6j05P9L2j03N7M8
7088F2r8L9N8r6L0P1q9qR8r0qR9q1l3J00o2l7R3m1o2J07m5p2J11k9o4Q5j2q1R5
$$ plain form
7118 40 50 -51 26 56 -39 20 55 -39 16 69 -43 2 64 -31 -6 67 -33 -20 65 -21 -20 58 -11 -32 56 -9 -50 69 10
7147 10 -61 42 16 -53 38 21 -53 46 33 -50 24 41 -45 29 52 -40 18 69 -35 21 58 -31 3 59 -35 -9 69 -20 -16 55
7177 55 -17 -23 62 -14 -29 64 0 -36 39 4 -47 51 4 -49 49 34 -53 29 33 -40 36 41 -48 22 57 -30 21 57 -24 21 61 -29
7209 -29 6 73 -27 -9 58 -11 -13 72 -25 -31 70 -10 -33 61 7 -35 52 2 -45 54 11 -50 35 15 -44 32 25 -50 23 47 -41
7240 -41 23 53 -31 23 61 -33 7 70 -27 -7 66 -14 -8 65 -18 -1 67 -5 -29 55 -1 -29 54 -4 -43 48 8 -44 35 11 -45
7271 -45 40 15 -45 40 32 -45 25 37 -41 25 42 -37 15 58 -33 17 51 -23 13 59 -18 -3 79 -7 -12 63 -9 -11 66 -5 -24 59
7303 59 13 -39 39 3 -39 49 19 -49 38 22 -40 31 20 -39 40 32 -36 33 50 -45 19 55 -21 18 61 -25 15 66 -16 0 61
7334 61 -11 6 75 -7 -14 61 -2 -30 56 5 -26 47 11 -40 37 15 -34 35 27 -45 36 35 -47 24 44 -34 14 41 -35 11 56 -26
$$ packed form
7118D0J0j01P7L0r5N9L5r4N5N3j12M5O2r5K5P3j00J3Q5q6JP8o9k1Q8o5m1J19n9
7147A0p1J03k6o9R1j7p4R9j3q3P4J7q6P4K3r2N8N1j04N6L7q9L4N6r4K6P8q9MP1
7177E5p2oQ5p6j5R3o4l6P5l5n1R8m7n3R8j5q7Q2Mp3P6Nq9P0L5q7N1L6q1M5M0r0
7209b9L5O7j00J8O7o9kQ5r7oJ01q0k3R4n4m2Q7n0m7R9m3o1Q5k0n9P6pp5P3K4q8
7240d1O4L0q4N4L8r4M0O3r7K0P3q0OP3q3J7O8p2k4Q4n6k8Q3n8l9R1m0n2P9k4n6
7271d5Q5k5o0Q5qp7P0J2p8O6J7p9N2M3r1N0L4p4L6M6p7J5Q2q6nP5p2kP7p1j9Q3
7303E9m6n2P8l6m2Q8l0o8Q7j6o2P1j1n9P9qo8O9J7r5O4L6p6L9M3q6M0N1q2J6O1
7334F1p2J7O9q2pP5o3k8Q6n1l1P3l6n1P7k2m9O9qp2Q1jq2P1K0p8M8K7p6M6M5q2
$$ plain form
7366 -26 19 57 -11 9 57 -17 -9 56 -15 -6 58 -4 -22 56 1 -21 54 9 -29 48 9 -30 38 19 -48 33 29 -35 30 32 -34 31
7398 31 44 -33 22 44 -28 8 51 -22 1 56 -23 5 59 -19 -7 57 -6 -5 64 -2 -14 51 10 -24 54 14 -34 47 21 -36 41
7429 41 25 -38 34 18 -42 26 39 -33 18 53 -27 16 47 -37 11 50 -28 -6 52 -12 5 64 -25 -6 63 0 -13 55 1 -20
7459 -20 61 -2 -29 62 22 -32 45 21 -35 36 17 -45 45 36 -49 22 38 -31 27 44 -33 19 60 -28 -7 62 -18 5 60 -20 0
7490 0 69 -13 -15 61 7 -9 66 2 -15 68 3 -28 52 11 -25 51 2 -49 41 24 -42 20 26 -39 36 20 -48 27 49 -39 11 46
7522 46 -23 19 50 -36 5 67 -27 0 60 -11 -4 62 -4 -17 64 9 -20 66 3 -21 49 18 -37 56 28 -44 39 15 -34 32 8
7553 8 -55 16 37 -45 20 42 -31 27 40 -41 5 58 -24 6 49 -20 3 59 -18 -6 60 -9 -8 57 -1 -19 59 0 -27 47 9
7584 9 -30 42 12 -30 45 20 -34 42 36 -37 24 37 -33 19 36 -39 21 43 -28 11 47 -28 -11 58 -24 3 55 -12 -3 62 -2 -11
$$ packed form
7366b6M5L8o8K0M8p4QO5p1RO4o2j8P8n5k2P5m5l8P7l9l9O8j9o7Q1mo4O5Ko6O5
7398C1J3p7N5K2p2L6M3p3K3N5p9K8N4p8J2O4o3JO9o6j2O5m1l4P8m0m8Q1k6n7P7
7429D1j6o3P2j6o0O8J3p2N1L5q0M3L1q4M8L9p8K2N8o4J7N9q9J9O9o3j3O8n4k1
7459b0Q1o3k7R1m0n4P7k4n6P1j9o2R0rq5P1J6o9N8J7p7N2M1q8K1O9q0K3N5q0K0
7490@O9q2kP6n4j6P5o4j7Q3o5l1Q0m1l6P6m9n1R0j7o6O2Oo5P5j6o8P5K2q8N0L5
7522D6o9M2L1q6M1O2r4K7O0p1PO6o6j3Q1n5k9Q6o3k4P0l1n5R3k8p2Q3k4m9O6k4
7553Ho3P1K1q2O5K2p3N8J3q1M6N3q2L0M3o9K3N6p7J2O6o9JO5n8j8P8n9k7P4l8
7584Il9P2l0m2P5k5n4P6op3O1J3p0N2J7p5O0K2p1L9L6p5J7O9q2K7N2o7RO5o4r
$$ plain form
7616 -11 67 6 -19 59 6 -19 57 14 -32 47 16 -50 40 21 -32 31 18 -36 18 37 -35 17 41 -28 8 43 -31 13 58 -24
7646 -24 0 64 -15 -7 66 -9 -6 59 2 -5 58 9 -20 58 11 -18 54 27 -17 51 20 -29 41 18 -34 35 28 -42 23 30 -34 19 41
7679 41 -25 4 49 -25 3 47 -26 3 51 -12 -13 60 -5 -6 57 -1 -4 57 3 -18 53 12 -9 51 15 -22 48 21 -30 35 30 -31
7711 -31 24 27 -40 16 33 -38 14 30 -31 18 31 -44 -3 42 -19 -6 39 -16 -5 52 -7 -12 65 3 -9 54 19 -11 57 9 -24
7742 -24 53 18 -32 45 24 -31 41 33 -26 27 30 -32 26 25 -25 17 32 -30 23 52 -26 10 54 -30 3 53 -19 -1 62 7 -14 57
7774 57 3 -6 48 6 -7 59 19 -28 42 33 -14 47 29 -26 35 36 -31 17 33 -21 34 37 -32 11 42 -36 7 42 -21 4 44 -23
7806 -23 -16 59 -18 -6 57 -1 3 55 5 -17 48 17 -13 51 23 -15 50 20 -12 53 31 -21 31 37 -25 17 28 -31 19 53 -25 14
7838 14 39 -23 4 49 -34 -9 44 -12 -26 47 -11 -12 52 -17 -20 54 6 -18 45 13 -19 52 13 -17 48 34 -24 44 33 -19 38
$$ packed form
7616a1P8o1k5P8n3k5P6m3m6P9l1o6R0j9n3O3j3n4N4J9p2N2K4o9L6L5p4M4M5q2
7646b4K4O4p9QP3p5LO5n7pO3m9k9P8m7k9P2k7m4O8l1m9P0k3n2O9pp0O5Po4N3K2
7679D1o6K9M5p4K8M4p3K9M8o3jP3o5jO3n8lO1n4k1P1m1k1O0l6l7P0k7n1O5no1
7711c1N5Lo7N6J7p1N2J6o1M9J3p5M1M5o1J3M5n5J1N7n9nP7o2j2O3l5l0O8m8l3
7742b4P7l5n0P7k1n5P2qn9N3Lo2N8jn0M2J5o2N3K9p8L6M4q4L3N0p2J8O3n5k1P1
7774E7n4rN4m2j3O6m0m7P0rm7O1j8n5O1Jo7M8J6n4N5Lo9M3L1p8M3L5o3K5M0o7
7806b3PP5p7J2O3n8MN2n0k2O5l1l0O4k8l8O5l0l2O5k2n2N2Oo2M2J1n9N0L4p8L9
7838A4K5o2K7M5q3K5N3n6j4P3n8jO4o9lP4m8k4O3l2l2P1l9l0O5j4n8O8j1n2N7
$$ plain form
7869 38 30 -35 32 42 -32 5 28 -11 11 44 -33 5 52 -13 -18 45 -15 -4 44 -9 -22 46 3 -4 50 11 -13 54 12 -21 39 18
7901 18 -23 43 30 -28 43 23 -29 40 41 -24 20 42 -19 26 42 -19 16 45 -22 4 50 -21 5 49 -22 -13 51 -12 -9 53 2 -15
7933 -15 61 5 -14 58 21 -25 52 21 -20 50 28 -26 35 27 -22 27 42 -22 23 46 -25 2 46 -27 10 45 -15 -5 39 -23 -5
7964 -5 51 -18 -9 53 -8 -13 50 0 -18 42 5 -26 58 16 -24 44 31 -25 46 32 -12 40 38 -29 27 43 -25 28 38 -26 15 39
7996 39 -25 10 55 -21 -3 49 -21 -3 51 -11 -6 44 -9 -3 41 -1 -22 54 7 -22 39 16 -24 46 22 -25 45 27 -35 30 32 -27
8028 -27 33 43 -24 17 44 -25 11 46 -25 -3 41 -14 4 47 -19 -15 45 -10 -16 46 -8 -6 56 8 -27 39 6 -20 53 22 -24 48
8060 48 30 -31 42 37 -19 32 32 -21 35 49 -30 14 47 -31 20 41 -20 8 56 -26 8 52 -16 -4 48 -15 -13 55 -4 -18 55 7
8092 7 -16 57 6 -23 48 21 -27 41 31 -20 37 32 -34 34 43 -22 30 42 -28 17 38 -24 15 53 -21 -2 42 -27 -13 47 -24 -17
$$ packed form
7869C8qo5O7J0p4L7K3l9K2L3p7L8M7o5nO3o0J1M8n3j3O8m3pN4l9k4O7m2l3O0k1
7901A8m1O6j3n8P1k0n2O9Jo5M4K2o1M5J6o1L5K9o7K6M6p1K6M4p1RO4o3LO2n1j7
7933a5P6n6j9P2l7m6P7l1m1P0k2n4O1qm9M9J5o4M5K3p1K7M4p3L7L5o0J0M4o2J8
7964eN6o9RO2o1nO3n0j8O0l7l1Q4m2m0O8j3n6P1j4m4N2ko7N6J6o8N3J0o4M1K4
7996C9o4L5M5p6J8N2p0J8N4o2NN0n3OM4m2k1P6m7k9O1k3m0P0k4m7P0j8o2O5Kn9
8028b7O0J0o7M1K7o9L6L5p1K2M4n5J8M3o6MO0n5oO2n4KO2m8l5O6l3k6P3l1m6P2
8060D8j8o1P3nn6N1%n3N6J4p9M4L3p8N1K1o1K8M8q2L4M4o8J2N2o3KO8n9j4P3m8
8092Gk3P3n1k9P1k7m8O8j0n1N7no6O8Ro5N2J2p0M5K1o2L9L8p4J9M4o9J4O0p1P
$$ plain form
8124 -17 50 -8 -14 51 -5 -27 46 -1 -20 50 12 -18 48 23 -26 44 29 -36 41 38 -30 27 44 -19 24 46 -19 8 48 -16 -8 47
8156 47 -13 -5 40 -16 -6 50 -13 -23 50 -12 -7 43 -6 -24 34 -7 -28 35 10 -28 50 27 -24 43 26 -30 35 34 -24 35 28 -28
8188 -28 32 50 -24
$$ packed form
8124a7O7n8oO5n6k2P3m7j9P0l8l0O6k5m9P0j5o5P7lo8N7J7o3M3K2o5K7M0o4QN5
8156D7o0QM5n6J0N6o3j0P3o2NN0m9j8N8m1k1O3k5l8P8k3n1O7j7n6O5jn8N9pn6
8188b8O0J8p4
8191b4
$$ Imaginary data points
##PAGE= N=2
##DATA TABLE= (X++(I..I)), XYDATA
$$ plain form
0 0 0 0 0 0 0 0 0 0 0 0 0 0 0 0 1 -8 8 -8 8 -8 15 -16 16 -24 24 -27 32 -38 42 -49 56 -64 72 -81 90 -103 114
37 114 -127 143 -159 176 -196 217 -241 265 -292 323 -356 390 -429 475 -523 575 -636 704 -781
56 -781 869 -971 1092 -1236 1414 -1631 1914 -2293 2825 -3623 4956 -7523 14153 -62849 -91481
71 -91481 143840 -40776 -98048 124733 -20129 -110392 121279 271 -120118 100577 24314
82 24314 -118324 87056 32433 -121380 79040 54814 -128961 57647 74479 -120326 37667
93 37667 85694 -117286 20432 103352 -107559 -8555 110681 -86214 -25309 107337 -74179
104 -74179 -37831 111336 -60429 -55528 107418 -42596 -63674 102488 -33751 -75218 104185
115 104185 -15932 -91878 93912 6041 -97064 80625 21028 -101857 68872 40366 -103288
$$ packed form
0@%%%%%%%%%%%%%%JrJ6j6J6j6K3l1L2m0M8n1N9p0Q0r1J05j20J36j53J71j93K17
37A14k41K70l02L35l72M13m58N06n57O15o79P46q19R04r98J098j211J340j485
56g81J650j840K063k328K650l045L545m207N118o448Q579j2479K1676p7002k8632
71i1481K35321j84616n7272K22781j44862r0263K31671j21008j20389K20695p6263
82B4314j42638K05380n4623j53813K00420k4226j83775J86608J6832j94805J57993
93C7667M8027k02980J37718Q2920k10911R9004J19236j96895O0905J32646j81516
104g4179L6348J49167j71765M901J62946j50014k1078J66162j36239m1467J79403
115A04185j20117p5946J85790q7871j03105J77689n9597j22885J70729k8506j43654
$$ plain form
126 -103288 48477 54129 -94299 33778 59541 -90080 23122 69763 -85159 7330 76197
137 76197 -75567 -3812 80317 -70592 -16830 88943 -59831 -34943 89800 -43948 -46687
148 -46687 86453 -31381 -57546 83312 -15437 -66837 73309 -1662 -68578 65425 6396
159 6396 -72964 60401 18479 -77809 50487 30161 -78428 41287 40445 -80380 29919
170 29919 53916 -77361 13607 62267 -68575 480 66300 -60589 -11452 69852 -50169
181 -50169 -22804 68757 -39866 -29553 67640 -32808 -37336 68219 -23366 -46297 65814
192 65814 -12661 -53428 62144 -1748 -60717 56127 11412 -64927 46017 22474 -64747
203 -64747 36137 30360 -63486 27247 37205 -61245 18709 42654 -58774 11054 48253 -56413
$$ packed form
126a03288J51765N652j48428J28077K5763j49621J13202M6641j54922R2489O8867
137G6197j51764P1755Q4129j50909N3762J05773j48774K4888J24743j33748k739
148d6687J33140j17834k6165J40858r8749n1400J40146p4971o6916J34003n9029
159F396p9360J33365m1922r6288J28296k0326j08589J19715q42j20825J10299
170B9919K3997j31277R0968M8660j30842O9055O5820j26889M9137Q1304j20021
181e0169K7365R1561j08623J0313R7193j00448m528J05555r1585k2931J12111
192F5814p8475m0767J15572o3892n8969J16844m4715p6339J10944k3543q7221
203f4747J00884n777r3846R0733R958r8450P9954K3945j01428O9828L7199j04666
$$ plain form
215 -56413 2233 54265 -52166 -7904 59189 -45527 -18734 61895 -36318 -28924 61296 -25801
227 -25801 -36698 58302 -15562 -42495 53478 -6037 -45724 48014 1288 -48154 43948 8636
239 8636 -51833 38742 17467 -54068 31684 25521 -55167 24116 34340 -54770 13470 41866
251 41866 -49847 3156 44993 -44422 -4385 47917 -39402 -12718 49492 -32404 -18940 48950
263 48950 -27544 -24186 50813 -21827 -32411 50540 -12532 -38396 47068 -4696 -43079 44147
275 44147 4837 -48028 36764 15045 -47347 28161 20085 -45843 22900 25655 -45731 15363
287 15363 31079 -42266 8946 33388 -40983 4114 39197 -39457 -5523 43594 -32570 -13396
299 -13396 43609 -27366 -19411 45509 -20764 -27745 43480 -11310 -31040 38905 -6561 -33275
$$ packed form
215e6413N8646N2032j06431M4262O7093j04716K6793Q0629r8213P394R0220q7097
227b5801j0897R5000p3864k6933R5973n9515l9687R3738m6726m9442R2102l5312
239H636o0469R0575k1275p1535Q5752o163q0688P9283J0224q9110O8240K8396
251D1866r1713N3003M1837q9415M0037N2302q7319K6684O2210q1896J3464O7890
263D8950p6494L358P4999p2640j0584Q2951o3072k5864Q5464n1764l8383Q7226
275D4147l9310n2865Q4792k1719o2392P5508q076o5928O8743K755p1386O1094
287A5363J5716p3345N1212K4442p4371M5097L5083p8654L3934M9117p6164J9174
299a3396N7005p0975P955O4920o6273o981P1225n4790j9730O9945m5466k6714
$$ plain form
311 -33275 38032 -563 -38185 33892 7200 -38926 29252 11321 -41090 26742 19172 -43974
323 -43974 18577 26997 -40644 10684 29803 -38207 5139 34595 -35100 -3685 36350 -28022
335 -28022 -8307 34719 -25409 -11463 37493 -21921 -18748 37480 -14936 -22389 35617 -11447
347 -11447 -26743 36605 -4474 -33282 32157 4215 -33904 26806 8090 -35097 24100 14515
359 14515 -36657 17162 19583 -33389 12791 20706 -33654 10373 26288 -33813 2901 30243
371 30243 -29269 -2197 31297 -27457 -7261 35287 -22802 -15546 34469 -14931 -18454 31384
383 31384 -11748 -21090 31723 -6454 -25791 28035 -436 -25774 25115 1511 -28145 24897
395 24897 7457 -31852 19634 13574 -30663 15254 16379 -31483 11753 22374 -30897 4126
$$ packed form
311c3275P1307l8595l7622P2077k6692m6126O8178j7931n2411O7832p570o3146
323d3974O2551Q420o7641N1328J9119o8010M3346K9456o9695L1415M0035o4372
335b8022J9715M3026o0128J3946M8956n9414L173N6228n2416p453N8006m7064
347a1447j5296O3348m1079k8808O5439k7942l8119O0710j8716m3187N9197r585
359A4515n1172N3819K421n2972M6180P915n4360M4027J5915o0101L6714K7342
371C0243n9512K7072L3494n8754K0196M2548n8089P256N0015m9400l523M9838
383C1384m3132r342N2813l8177j9337N3826k8471k5338N0889k3604k9656N3042
395B4897j7440l9309N1486o060m4237M5917J125m7862M3236J0621n3271L5023
$$ plain form
407 4126 25482 -26011 -98 25346 -24507 -3076 28408 -22041 -8949 28880 -17391 -11675
419 -11675 28556 -15618 -15511 30723 -10812 -21550 28653 -4233 -23355 25621 -631 -25627
431 -25627 23883 5115 -27773 18694 9844 -26090 14970 11501 -26279 12893 15502 -26528 8186
444 8186 18481 -24699 4973 20441 -24551 1325 24418 -22566 -4847 25965 -18185 -8815
456 -8815 25886 -15193 -12498 26499 -10935 -16383 24716 -6639 -17785 23264 -4237 -20060 22913
469 22913 -168 -22807 20340 4092 -23772 17850 7683 -25172 14861 12410 -25288 9989
481 9989 15756 -23416 6080 17683 -21951 2398 19732 -19699 -1383 20429 -17292 -3913
493 -3913 21152 -15866 -6951 22591 -13437 -10687 23001 -10267 -13919 22826 -6786 -17094 21809
$$ packed form
407D126K1356n1493K5913K5444m9853K1431L1484n0449J3092L7829m6271N716
419a1675M0231m4174J07M6234m1535j0738N0203l2886j9122M8976k6252k4996
431b5627M9510j8768l2888M6467q850l5934M1060l469l7780L9172K609m2030L4714
444H186J0295m3180K9672J5468m4992K5876K3093m6984J7719L0812m4150R370
456h815L4701m1079K695L8997l7434n448M1099l1355j1146M1049k7501j5823M2973
469B2913k3081k2639M3147j6248k7864M1622j0167l2855M0033k451l7698L5277
481I989N767l9172K9496J1603l9634K4349J7334l9431J8316K1812l7721J3379
493c913K5065l7018Q915K9542l6028K750L3688l3268l652L6745k9612j0308L8903
$$ plain form
506 21809 -2583 -19365 19556 1175 -20443 17213 4336 -21119 14826 7238 -21385 12430
518 12430 9922 -21550 9895 12713 -21400 6891 15380 -20668 3536 17900 -19318 -496 19822
531 19822 -16625 -4359 20279 -13701 -7279 20287 -10946 -10112 19766 -7842 -12050 18637 -5671
544 -5671 -13636 18491 -3257 -16268 17591 365 -17980 15609 3323 -19132 13969 6743 -20415
557 -20415 10832 10378 -19596 7425 12073 -18610 5300 14173 -18109 1993 16092 -15927 -721
570 -721 16430 -14690 -2573 18181 -13502 -6379 19265 -10116 -9321 18438 -7622 -11389 18481
583 18481 -4664 -14465 16769 -583 -15145 14113 1141 -15450 13366 3437 -17096 11159
595 11159 6529 -16730 8834 7780 -17056 7814 10734 -17950 4298 13709 -15984 1208 14327
$$ packed form
506B1809k4392j6782L8921j8381k1618L7656j2877k5455L5945p588k8623L3815
518A2430k508l1472L1445K818l4113K8291Q489l6048K4204J4364l7218J8822K0318
531A9822l6447J2266K4638l3980O422K7566l1233Q34K9878k7608m208L0687k4308
544e671p965L2127k1748j3011L3859j7226j8345L3589j2286k2455L3101p226k7158
557b0415L1247m54k9974K7021M648l0683K3910Q873l2282K0102J4099l2019J5206
570g21J7151l1120J2117K0754l1683P123K5644k9381P95K7759k6060l767K9870
583A8481k3145r801L1234j7352j4562K9258j2972j6591K8816r929k0533K8255
595A1159m630k3259K5564j054k4836K4870K920k8684K2248R411k9693J7192J3119
$$ plain form
608 14327 -14899 -692 16400 -13612 -4616 17140 -10047 -6575 15967 -8688 -7672 16968 -6957
621 -6957 -10864 16388 -3521 -11968 14875 -2159 -13420 15052 927 -16140 12368 4829 -15598
634 -15598 9422 5918 -15584 8275 8548 -16147 4803 10737 -14000 2604 10641 -13716 1755
647 1755 13025 -13553 -1826 14465 -10843 -3749 14219 -10142 -5389 16200 -8216 -9310 15766
660 15766 -4243 -10361 13964 -2986 -11295 14249 -480 -13603 12099 2592 -13071 10195 3064
673 3064 -13810 10067 5811 -15419 6963 8600 -14006 4547 9143 -13932 3102 11679 -13435
686 -13435 -749 12807 -10473 -2567 12074 -9682 -3638 13562 -8284 -6664 13347 -5388 -7407
699 -7407 12485 -4827 -8618 13689 -2665 -11507 12454 634 -11851 10803 1872 -12762 10263
$$ packed form
608A4327k9226J4207J7092l0012Q996K1756k7187L472K2542k4655J016K4640k3925
621f957l907K7252j9909q447K6843j7034j1261K8472j4125j7067K8508p539k0427
634a5598K5020l504k1502K3859K73k4695K0950N934k4737J6604Q037k4357J5471
647A755J1270k6578J1727J6291k5308P094J7968k4361M753K1589k4416j094K5076
660A5766k0009o118K4325j6950q309K5544j4729j3123K5702r507j5663K3266p131
673C064j6874K3877m256k1230K2382J637k2606J8553M596k3075J7034Q577k5114
686a3435J2686J3556k3280P906J4641k1756O044J7200k1846J620K0011j8735k019
699g407J9892j7312l791K2307j6354q842K3961j1820j2485K2654q931j4634K3025
$$ plain form
712 10263 4673 -13952 7332 6988 -12615 5369 7239 -12697 4476 9327 -12783 1572 10614
725 10614 -11043 -113 10788 -10723 -1670 12573 -9461 -4868 12752 -6695 -6258 12043 -5420
738 -5420 -7589 12418 -3212 -9586 11121 -668 -9672 9891 213 -10382 9812 2237 -11654
751 -11654 8233 4333 -11553 6917 5522 -12203 5741 7889 -12350 3009 9408 -11004 1115
764 1115 9846 -10373 -496 10937 -9288 -2748 11114 -7610 -4004 11015 -6702 -5418 11512
777 11512 -5074 -7292 11099 -3063 -8360 10495 -1443 -9564 9921 810 -10510 8350 2838
790 2838 -10483 6908 4178 -10521 5642 5624 -10387 4157 6729 -10041 2935 7754 -9946
803 -9946 1456 9023 -9450 -383 9950 -8536 -2229 10558 -7317 -4052 10720 -5777 -5597
$$ packed form
712A0263n590j8625K1284l44j9603J7984J870j9936J7173M851k2110J4355R042
725A0614k1657J0930J0901k1511R053J4243k2034M593J7620j9447M37J8301j7463
738e420k169K0007j5630o374K0707j1789r004J9563r678j0595K0194p575j3891
751a1654J9887l900j5886J8470j395j7725J7944K148k0239J5359O399k0412J2119
764A115Q731k0219R877J1433k0225O540J3862j8724L606J5019j7717J284J6930
777A1512j6586k218J8391j4162n297J8855j1938q121J9485r111j1320J8860n512
790B838j3321J7391k730j4699J6163j8j6011J4544K572j6770J2976M819j7700
803i946J1402P567j8473R067J0333j8486O307J2787j7875L265J4772j6497J80
$$ plain form
816 -5597 10521 -4181 -6869 10062 -2536 -7819 9320 -1044 -8519 8683 390 -9286 7847
829 7847 2106 -9747 6614 3614 -9911 5456 5287 -10078 3698 6831 -9297 1862 7531
842 7531 -8437 605 8187 -7909 -949 8837 -6714 -2321 8831 -5982 -3221 9413 -5269
855 -5269 -5039 9675 -3544 -6232 9003 -2369 -7072 8944 -959 -8516 8061 1175 -8761 6551
869 6551 2114 -8698 5942 3370 -9194 4552 4973 -8625 3082 5362 -8303 2563 6618
882 6618 -8538 532 8047 -7008 -1210 7888 -6127 -2050 8579 -5352 -3967 8687 -3366
895 -3366 -4863 7674 -2711 -5195 8032 -1860 -6773 7543 61 -7194 6447 673 -7526 6505
909 6505 2096 -8807 5138 4069 -8349 3540 4502 -8077 2975 5809 -8210 1016 6881 -6710
$$ packed form
816e597J6118j4702k688J6931j2598n283J7139j0364p475J7202q293r676J7133
829G847n741j1853J6361l000j3525J5367j69j5365J3776L133j6128J1159N669
842G531j5968R042P582j6096O960R786j5551M393J1152j4813K761J2634j4682
855e269K30J4714j3219k688J5235j1372m703J6016r903p557J6577o886r936J5312
869F551m437j0812J4640k572j2564J3746M21j3598J1707K280j3665J0866M055
882F618j5156R070P515j5055N798R098j4015M077J0629j3931J385J2654j2053
895c366j497J2537j0385k484J3227r892m913J4316p482p255J3641n774q199J4031
909F505m409j0903J3945j069j2418J1889R62j2579J1052K834j4019R226N865j3591
$$ plain form
923 -6710 -237 6489 -6237 -614 7484 -5937 -2533 7935 -4182 -3490 7287 -3567 -4134 7970
937 7970 -2438 -5967 7286 -329 -6170 6047 144 -6423 6092 1408 -7502 4765 2986 -6882
951 -6882 3686 3028 -7067 3648 4418 -7683 1960 5595 -6703 903 5612 -6673 262 7040
965 7040 -6308 -1914 7378 -4364 -2683 6653 -3976 -3175 7346 -3038 -4829 6802 -1237 -4898
979 -4898 5964 -1018 -5432 6370 390 -6764 5077 2089 -6289 3984 2296 -6591 3791 3797 -7062
994 -7062 1948 4834 -5866 1040 4593 -5869 742 5718 -5781 -941 6143 -4510 -1468 5878
1008 5878 -4542 -2051 6951 -3811 -3881 6771 -2118 -4280 6067 -1703 -4805 6345 -449 -5949
1022 -5949 5284 1014 -5597 4390 1240 -5855 4284 2449 -6428 2915 3563 -5751 2051 3755 -5854
$$ packed form
923f710O473O726j2726N623Q098j3421L404J0468j2117O92J0777j0854n67J2104
937G970j0408l529J3253p615n841J2217n903o567J2515m684q910J2267j779r868
951f882J0568o58j0095J0715P70j2101R643L635j2298P606M709j2285O935O778
965G040j3348M394R292j1742J681R336j0629Q01J0521j0384j791J1631q039l661
979d898J0862o982m414J1802n980p154J1841k988q378J0273j688q887J0382Oj0859
994g062R010K886j0700O906L553j0462O611M976j1499M840P084j0653L042P346
1008E878j0420K491R002j0762p0J0652q889k162J0347p770l102J1150o794n500
1022e949J1233m270o611R987l150p095J0139j835q877R343O48r314P802J704r609
$$ plain form
1037 -5854 1509 4943 -5744 -115 5505 -4631 -958 5399 -4295 -1619 6009 -3552 -2875 5818 -2449
1052 -2449 -3210 5507 -2183 -3771 5888 -1345 -4826 5444 -169 -5107 4937 468 -5638 4623
1066 4623 1667 -6058 3608 2673 -5757 2738 3169 -5707 1999 4010 -5540 914 4485 -4884 153
1081 153 4737 -4572 -584 5254 -4047 -1655 5462 -3217 -2420 5463 -2609 -3220 5516 -1600 -3974 5149
1097 5149 -690 -4365 4707 10 -4712 4387 733 -5043 3889 1449 -5296 3403 2182 -5553 2720
1112 2720 3032 -5496 1925 3713 -5374 1075 4351 -4965 98 4747 -4402 -688 5011 -3843 -1545
1127 -1545 5158 -3038 -2235 5017 -2391 -2697 5049 -1816 -3493 4997 -870 -4062 4519 -96 -4374
1142 -4374 4251 653 -4925 3634 1684 -4950 2799 2139 -4845 2465 2702 -5110 1711 3506 -4763
$$ packed form
1037e854P363L434j0687N629N620j0136L673O357r694K676P628r561O77Q693q267
1052b449p61Q717p690j588R659p233l481J0270n613m938J0044m469o106J0261
1066D623k956p725R666r35q430Q495M31q876P706K011r550O454L571r369N037
1081A53M584r309L988N838r301K392P117q679P97P883q072o11Q736p116k374R123
1097E149n839l675R072m697m722R099l654n776Q932k440o745Q699j221p735Q273
1112B720L12q528P421J788r087O449L276r316N063M649r149L714N699q854K298
1127a545O703q196Q03P252p408l06P746o865j677Q490n867l192Q581m615m278
1142d374Q625l598n578Q559j950o634P749o60o984P310K37p812O821J795q269
$$ plain form
1157 -4763 882 3712 -4540 504 4318 -4528 -539 4928 -3706 -1438 4802 -3170 -1881 5162 -2625
1172 -2625 -2980 5108 -1366 -3462 4395 -827 -3547 4433 -226 -4331 3973 915 -4364 3169 1252
1187 1252 -4407 3093 2032 -5011 2145 3121 -4535 1123 3131 -4308 928 3778 -4453 -189 4399
1202 4399 -3560 -945 4058 -3279 -1070 4614 -3166 -2194 4863 -2042 -2683 4378 -1745 -2895 4806
1217 4806 -1141 -4056 4432 280 -4131 3497 596 -4103 3514 1352 -4730 2637 2426 -4224 1739
1232 1739 2349 -4136 1719 3070 -4506 590 3853 -3679 -224 3590 -3509 -413 4247 -3423 -1659
1247 -1659 4514 -2271 -2171 3997 -2047 -2311 4448 -1588 -3369 4192 -424 -3394 3582 -320 -3561
1262 -3561 3917 418 -4466 3238 1611 -4176 2461 1759 -4247 2327 2660 -4531 1132 3390 -3692
$$ packed form
1157d763N645K830q252N044L814q846L989N467q634K268O240p972J289P043p787
1172b625l55Q088o474k096P857n222k720P980m659m105Q304l058n279P533j917
1187A252n659P500j061p043P156R76p656N658K008p439N236K850q231M264M588
1202D399p959K615N003p337K209N684p780R72P057o905o41P061o123j150P701
1217D806n947k915Q488m152m411P628k901m699P617k162o082P367k11o650N963
1232A739O10o485N855J351p576N096L263p532L455L814p099L096M660p670J764
1247a659O173o785J00O168o044k64O759o036j781P561m616k970O976l902l241
1262c561P478l499m884P704j627n787O637p02o006O574L33p191N663K258p082
$$ plain form
1277 -3692 417 3186 -3586 199 3858 -3477 -1030 4077 -2470 -1483 3696 -2378 -1772 4232 -1905
1292 -1905 -2919 4003 -767 -3048 3493 -599 -3333 3738 203 -4095 3021 1225 -3771 2442 1243
1307 1243 -3896 2505 2064 -4286 1577 2787 -3740 1041 2815 -3815 775 3650 -3729 -455 3959
1322 3959 -2770 -962 3697 -2609 -1366 4128 -2101 -2401 3892 -1099 -2597 3427 -908 -2869 3594
1337 3594 -255 -3588 3061 613 -3518 2592 851 -3741 2515 1655 -4083 1683 2400 -3657 1121
1352 1121 2530 -3610 822 3115 -3507 11 3470 -2952 -427 3487 -2795 -858 3927 -2424 -1686
1367 -1686 3927 -1705 -2141 3733 -1291 -2591 3733 -639 -3187 3298 112 -3346 2839 567 -3535
1382 -3535 2484 1190 -3676 1924 1734 -3564 1460 2094 -3541 1042 2619 -3445 428 3038 -3155
$$ packed form
1277c692M109K769o772L785L659p335K447N107o547R87N179o074O06O004o137
1292a905j014O922m770k281O541m092k734P071l535m298P116j796m996O213j199
1307A243n139O401m41o350N863J210o527M781J774o630M590K875p379L274M414
1322C959o729J808M659o306J243N494o229l00O293m991j498O024m335j961O463
1337C594l849l333O649k448m131O110j741m592O256q60n738N766P17o057M778
1352A121J409o140M432K293o622L518L459o422K525L914o282J937M785o351P38
1367a686N613n632m36N874n024j300O324m372k548O485l186l458O185k272m102
1382c535O019j294m866N600j90n298N024O34n635M583J577o064L873K610o193
$$ plain form
1397 -3155 -137 3328 -2827 -684 3558 -2396 -1220 3631 -1957 -1668 3663 -1509 -2124 3588 -1016
1412 -1016 -2524 3453 -533 -2936 3247 65 -3254 2862 621 -3439 2464 1134 -3649 1944 1796
1427 1796 -3571 1277 2182 -3377 808 2538 -3238 218 2941 -2855 -354 3034 -2514 -683 3298
1442 3298 -2280 -1316 3523 -1656 -1851 3353 -1192 -2103 3397 -815 -2666 3250 -59 -2898 2799 297
1458 297 -2974 2718 723 -3395 2276 1419 -3368 1672 1647 -3259 1466 2082 -3486 751 2682 -3061
1474 -3061 20 2758 -2731 -297 3091 -2568 -1033 3313 -1756 -1574 3039 -1347 -1660 3192 -1148
1489 -1148 -2379 3131 -213 -2612 2605 32 -2611 2751 473 -3228 2289 1320 -3087 1649 1382
1504 1382 -3050 1612 1864 -3359 886 2519 -2891 262 2353 -2742 198 2765 -2843 -653 3136
$$ packed form
1397c155L018L465o155K143M242n954J176M851n588K89N331n172o15N712m604
1412a016j508N977l986k403O183l182l319O116k241m060N903j330m783N593j48
1427A796n367M848R05n559M185J730n776L456K723n796K501L388n548J831L981
1442C298n578R64M839n179j95N204m545r11N500m212j851N916l309k839N697k502
1458B97l271N692j995m118N671q57m787N040k5m906M725O16n568M237J931n743
1474c061L081K738n489K434L388n659J535M346n069J82M613m386l13M852m340
1489a148j231N510l344k399N217k573k643N362k278l701N517r69m407M736k67
1504A382m432M662K52n223M245J633n410L153K091n095K940K567n608K190L789
$$ plain form
1519 3136 -2068 -1164 2859 -1809 -1297 3229 -1541 -2153 3177 -523 -2359 2568 -306 -2350 2717 155
1535 155 -2972 2276 1019 -2798 1667 1057 -2763 1727 1548 -3172 1039 2223 -2705 475 2097 -2664
1551 -2664 428 2618 -2773 -463 2970 -2024 -891 2633 -1886 -968 3021 -1693 -1786 2991 -865 -1937
1567 -1937 2571 -784 -2053 2857 -311 -2769 2462 584 -2640 1890 657 -2670 1927 1250 -3043
1582 -3043 1208 1883 -2561 675 1769 -2523 622 2307 -2589 -181 2611 -1951 -530 2366 -1938
1597 -1938 -649 2829 -1762 -1460 2836 -1023 -1648 2501 -929 -1829 2756 -484 -2439 2393 213 -2339
1613 -2339 2000 241 -2459 2094 796 -2862 1512 1410 -2552 1062 1447 -2582 926 2005 -2628
1628 -2628 151 2323 -2071 -231 2220 -1987 -477 2615 -1710 -1178 2572 -1077 -1350 2328 -972
$$ packed form
1519C136n204R04M023m668N12M526m770o12N330l700j836M927k874k044N067k562
1535A55l127N248j257l817M465o10l820M490j79m720M211J184m928L180J622m761
1551b664L092K190n391K310L433m994J133L524m519R18L989m714r3M777l856j072
1567a937M508l355j269M910l168k458N231j878l224M530j233l327M597o77m293
1582c043M251O75m444L236J094m292L145J685m896K408K792m562J421K896m304
1597a938J289L478m591L02M296l859o25M149l430r00M585l240j955M832k180k552
1613b339M339j759k700M553j298l658M374j02l962L614L85m029L508J079m633
1628b628K779K172m394J840K451m207J510L092m325N32L750l649k73L678l300
$$ plain form
1643 -972 -1545 2560 -600 -2087 2325 -21 -2131 2038 130 -2331 2037 621 -2637 1575 1108 -2450
1659 -2450 1201 1225 -2481 1073 1656 -2533 515 1959 -2219 173 2026 -2122 -144 2334 -1915 -676
1675 -676 2434 -1476 -1008 2374 -1209 -1306 2453 -812 -1729 2291 -308 -1903 2054 -23 -2047 1886
1691 1886 332 -2206 1671 677 -2248 1396 978 -2352 1178 1300 -2364 813 1629 -2255 486 1865
1707 1865 -2125 109 2056 -1937 -228 2160 -1771 -601 2299 -1505 -984 2283 -1133 -1199 2234 -860
1723 -860 -1558 2241 -378 -1814 1992 -89 -1994 1891 359 -2179 1551 831 -2225 1111 1099 -2124
1739 -2124 914 1310 -2193 569 1709 -1999 162 1751 -1861 -19 1969 -1833 -430 2210 -1449
1754 -1449 -832 2090 -1207 -943 2203 -1072 -1389 2240 -546 -1636 1925 -300 -1662 1939 -58 -2029
$$ packed form
1643i72n73M105l160j487M412k346k110M169j908k461M368j416l258M212m67l558
1659b450L651K4l706L554N83m189L048J444m178K392J853m148J978K478m249J239
1675f76L110l910M68L382l583r7L759l265r17M020k599j595L957k077k024L933
1691A886j554k538L877r94k925L644m18l330L530J22l664L177Q16l884K741J379
1707A865l990K234J947l993J709K388l931J170K900l804N21L267l416o6L433l094
1723h60o98L799k619j436L806k081j905L885j532k538L730p20l056L336j2l223
1739b124L038L96l503K762J140l708K161J589l612J842J988l802J403K640l659
1754a449O17K922l297K64L146l275l17L629k786j090L561k225j362L601j997j971
$$ plain form
1770 -2029 1759 513 -2041 1334 678 -2008 1272 995 -2259 857 1542 -2009 329 1551 -1818 229
1786 229 1792 -1870 -287 2092 -1400 -660 1872 -1244 -683 2092 -1202 -1216 2181 -616 -1450 1839
1802 1839 -476 -1425 2007 -308 -1949 1861 327 -1957 1407 413 -1913 1480 710 -2251 1079 1280
1818 1280 -1993 615 1201 -1886 644 1547 -2075 76 1961 -1607 -370 1781 -1432 -404 2044
1833 2044 -1380 -1003 2170 -757 -1249 1815 -623 -1225 1998 -440 -1765 1874 183 -1778 1445 215
1849 215 -1739 1579 480 -2166 1256 1030 -1981 821 990 -1952 857 1362 -2155 312 1751 -1712
1865 -1712 -62 1587 -1616 -87 1911 -1606 -683 2068 -1034 -931 1822 -917 -1023 2063 -664 -1569
1881 -1569 1919 -32 -1610 1545 43 -1651 1647 385 -2043 1286 904 -1847 913 861 -1861 932
$$ packed form
1770b029L788j246k554L375o56k686L280k77l254L116O85l551K338J222l369K047
1786B29J563l662J583K379l492P40K532l116N61K775l294j4L397k797q34L289
1802A839k315r49L432k315j641L810j534k284L364r94k326L393p70k961L330K01
1818A280l273K608N86l087K530R03l622K151J885l568J237K151l213J028K448
1833B044l424L77L173k927m92L064k438o02L223k438j325L639j691j961L223j230
1849B15j954L318j099k646L422k26l011K802J69k942K809N05l517K467J439l463
1865a712J650J649l203J529J998l517R23K751l102J03K753k739j06L086k727r05
1881a569L488j951j578L155j502j694L298j262k428L329l82k751K760n2k722K793
$$ plain form
1897 932 1189 -2054 446 1502 -1729 184 1413 -1761 118 1798 -1726 -451 1941 -1248 -664 1759
1913 1759 -1174 -771 2030 -940 -1278 1925 -393 -1333 1669 -296 -1468 1793 79 -1863 1469 574
1929 574 -1742 1149 639 -1820 1102 1037 -1969 655 1381 -1746 326 1360 -1714 142 1670 -1661
1945 -1661 -320 1763 -1317 -476 1675 -1239 -634 1890 -1142 -1032 1854 -736 -1174 1807 -508 -1348
1961 -1348 1828 -234 -1634 1653 157 -1638 1453 325 -1744 1350 681 -1880 1031 1004 -1771 740
1977 740 1147 -1774 531 1404 -1743 141 1595 -1545 -177 1666 -1411 -459 1779 -1217 -785 1801
1993 1801 -949 -1009 1753 -725 -1205 1745 -468 -1392 1690 -191 -1557 1587 106 -1688 1428 391
2009 391 -1765 1261 664 -1811 1037 974 -1810 747 1180 -1737 516 1380 -1694 175 1600 -1505
$$ packed form
1897I32K57l243K500J056l231J913J229l174J879J680l524J275K392l189N84K423
1913A759k933M03K801k970l38L203k318r40L002j965j172L261j714j942L332q95
1929E74k316K891n10k459K922o5l006K624P26l127K072J034l074J856J528l331
1945a661J341K083l080Q41K151k914O05K524l032J10K886k590m38K981k315q40
1961a348L176k062j400L287j496j795L091j128k069L094o69k561K911k7k775K511
1977G40M07k921K305Q73l147J884J454l140J368J843l077R52K238k996M32K586
1993A801k750o0K762k478m80K950k213r24L082j881j366L144j481j794L116j037
2009C91k156L026n97k475K848o3k784K557M33k917K253Q64l074J869J425l105
$$ plain form
2025 -1505 -169 1641 -1323 -389 1734 -1212 -754 1844 -893 -1070 1709 -638 -1218 1689 -419 -1494
2041 -1494 1619 -15 -1608 1383 193 -1602 1341 404 -1806 1177 795 -1775 863 929 -1685 780
2057 780 1128 -1795 476 1459 -1608 113 1463 -1451 4 1647 -1445 -415 1826 -1071 -749 1650
2073 1650 -866 -827 1733 -766 -1244 1727 -297 -1424 1437 -108 -1447 1466 108 -1781 1267 612
2089 612 -1722 889 701 -1627 902 940 -1806 583 1352 -1580 218 1299 -1451 221 1514 -1538
2105 -1538 -212 1756 -1157 -507 1575 -1029 -528 1786 -989 -1026 1824 -458 -1198 1476 -350 -1206
2121 -1206 1605 -175 -1633 1424 353 -1618 1037 405 -1575 1102 682 -1864 754 1154 -1616 355
2137 355 1093 -1501 402 1348 -1642 -36 1659 -1240 -337 1475 -1135 -307 1708 -1131 -774 1805
$$ packed form
2025a505J336J810k964R34K123k946M58K598k737j77K779k347n80K907k108j075
2041a494L113j634j593K991j190j795K943r37k210K983l82k570K638O6k614K465
2057G80L48k923K271R83l067J721J350k914J455J643l092J030K241k897L22K399
2073A650k516L9K560k499m78K971k024j127K861j545j339K913j358j889L048o55
2089F12k334K611j88k328K529L8k746K389P69k932J798J081k750J672J293l052
2105a538J326J968k913O50K082k604N01K314k775l7K850k282p40K674j826q56
2121a206K811j780j458L057j071j971K655o32j980K677m20k546K618M00k770J971
2137C55P38k594J903R46k990J606J695k899R03J812k610Q28K015k839L57K579
$$ plain form
2153 1805 -668 -951 1515 -598 -937 1704 -495 -1402 1621 33 -1455 1249 93 -1452 1332 352
2169 352 -1775 1019 827 -1616 642 813 -1572 652 1120 -1714 209 1469 -1367 -98 1349 -1269
2185 -1269 -131 1607 -1242 -604 1730 -803 -795 1531 -718 -848 1693 -564 -1269 1614 -106 -1295
2201 -1295 1331 -77 -1328 1434 158 -1646 1189 558 -1570 899 594 -1586 869 896 -1755 474
2217 474 1214 -1474 210 1172 -1434 101 1453 -1388 -341 1598 -1006 -548 1487 -904 -678 1655
2233 1655 -706 -1067 1585 -300 -1161 1392 -213 -1258 1461 68 -1542 1229 430 -1485 987 500
2249 500 -1510 936 757 -1637 643 1017 -1476 412 1060 -1470 274 1298 -1441 -79 1439 -1187
2265 -1187 -304 1413 -1081 -475 1566 -897 -800 1561 -576 -967 1458 -389 -1118 1434 -138 -1327
$$ packed form
2153A805k473k83K466k113l39K641k199r07L023j588j488K704j156j545K784r80
2169C52k127K794j92k443K258J71k385K224M68k834J923J260k836J269J447k618
2185a269J138J738k849O38K334k533QK326k249j30K541k257p05K883j720j189
2201a295K626j408j251K762j276j804K835o31k128K469l05k180K455K7k651K229
2217D74P40k688J684R62k606J535J352k841J047J939k604M58K035k391K26K333
2233A655k361l61K652j885q61K553j605j045K719j393j610K771p99j915K472m87
2249E00k010K446j79k394K280L74k493J888O48k530J744J024k739J362J518k626
2265a187Q83J717k494O06K041k463R7K361k137l91K425j847p29K552j572j189
$$ plain form
2281 -1327 1285 171 -1377 1106 354 -1451 993 600 -1523 771 833 -1493 544 988 -1434 340
2297 340 1143 -1362 131 1266 -1257 -100 1353 -1137 -320 1405 -987 -515 1461 -818 -735 1472
2313 1472 -574 -935 1396 -369 -1060 1354 -181 -1254 1271 145 -1341 1044 352 -1371 907 540
2329 540 -1455 726 825 -1408 447 939 -1329 313 1090 -1346 64 1308 -1151 -227 1292 -978
2345 -978 -319 1354 -934 -584 1446 -672 -792 1327 -502 -825 1358 -404 -1088 1338 -63 -1210
2361 -1210 1100 81 -1193 1092 232 -1408 947 617 -1387 610 714 -1287 546 867 -1404 258
$$ packed form
2281a327K612j114j548K483p52j805K444l93k123K294O2k326K037M44k422J774
2297C40Q03k505J493J135k523J157J453k490Q17J725k392M72J976k279Q3K207
2313A472k046l61K331j765o91K414j535j073K525j126j486K385o92j723K278l67
2329E40j995K181R9k233J855M92k268J642P77k436J410J244k459R24J519k270
2345i78O59J673k288L50K030k118j20K119j829l23K183j762o84K426j401j147
2361a210K310j019j274K285q60j640K355l30k004J997J04k001J833L21k271J662
$$ [...]
8191a0
##END NTUPLES=NMR FID
##END=
