##TITLE=1H_LY-12.Dix.1B
 CD3CN, 8 sc, 
 1.06.2021
##JCAMPDX= 6.0         $$ Bruker NMR JCAMP-DX V2.0
##DATA TYPE= NMR FID
##DATA CLASS= NTUPLES
##ORIGIN= UXNMR, Bruker Analytische Messtechnik GmbH
##OWNER= root
$$ XWIN-NMR		Version 3.5
$$ Tue Jun  1 10:23:23 2021 Russian Standard Time (UT+4h)  she@DPX200
##.OBSERVE FREQUENCY= 200.131506
##.OBSERVE NUCLEUS= ^1H
##.DELAY= (6, 6)
##.ACQUISITION MODE= SIMULTANEOUS
##.ACQUISITION SCHEME= undefined
##.AVERAGES= 8
##.DIGITISER RES= 18
##SPECTROMETER/DATA SYSTEM= spect
##.PULSE SEQUENCE= zg30
##.SOLVENT NAME= CDCl3
##.SHIFT REFERENCE= (INTERNAL, CDCl3, 0, 15.7039)
##AUDIT TRAIL= $$ (NUMBER, WHEN, WHO, WHERE, WHAT)
$$ ##TITLE= Audit trail, XWIN-NMR		Version 3.5
$$ ##JCAMPDX= 5.01
$$ ##ORIGIN= Bruker BioSpin GmbH
$$ ##OWNER= she
$$ F:/spectra/data/she/nmr/H-F/1/audita.txt
$$ ##AUDIT TRAIL=  $$ (NUMBER, WHEN, WHO, WHERE, WHAT)
(   1,<2021-06-01 10:21:50.15 +0400>,<she>,<DPX200>,
      <created by zg, POWCHK disabled, PULCHK disabled
       configuration hash MD5:
       00 E9 B6 7A A2 85 ED C7 34 08 36 98 17 FE 4E 26
       data hash MD5: 16K
       D3 EC F3 C0 88 31 4B 85 35 26 B6 9F 80 9A 3A 1A>)
$$ ##END=
$$ 
$$ hash MD5
$$ BB 61 A1 AB C0 A7 DC 28 73 61 24 0E D7 48 CF 28
##$RELAX= 
##$RELAX= 
##$RELAX= 
##$RELAX= 
##$RELAX= 
##$RELAX= 
$$ Bruker specific parameters
$$ --------------------------
##$DU= <F:/spectra>
##$EXPNO= 1
##$NAME= <H-F>
##$PROCNO= 1
##$TYPE= <nmr>
##$USER= <she>
##$AMP= (0..31)
100 100 100 100 100 100 100 100 100 100 100 100 100 100 100 100 100 100 
100 100 100 100 100 100 100 100 100 100 100 100 100 100 
##$AQSEQ= 0
##$AQ_mod= 1
##$AUNM= <au_zg>
##$AUTOPOS= <>
##$BF1= 200.13
##$BF2= 200.13
##$BF3= 200.13
##$BF4= 200.13
##$BF5= 200.13
##$BF6= 200.13
##$BF7= 200.13
##$BF8= 200.13
##$BYTORDA= 1
##$CFDGTYP= 0
##$CFRGTYP= 5
##$CHEMSTR= <none>
##$CNST= (0..31)
1 1 145 1 1 1 1 1 1 1 1 1 1 1 1 1 1 1 1 1 1 1 1 1 1 1 1 1 1 1 1 1 
##$CPDPRG= <>
##$CPDPRG1= <>
##$CPDPRG2= <>
##$CPDPRG3= <>
##$CPDPRG4= <mlev>
##$CPDPRG5= <mlev>
##$CPDPRG6= <mlev>
##$CPDPRG7= <mlev>
##$CPDPRG8= <mlev>
##$CPDPRGB= <>
##$CPDPRGT= <>
##$D= (0..31)
0 1.2 0 0 0 0 0 0 0 0.06 0 0.03 0 0 0 0 0.0002 0 0 0 0 0 0 0 0 0 0 0 0 
0 0 0 
##$DATE= 1622528509
##$DBL= (0..7)
120 120 120 120 120 120 120 120 
##$DBP= (0..7)
150 150 150 150 150 150 150 150 
##$DBP07= 0
##$DBPNAM0= <>
##$DBPNAM1= <>
##$DBPNAM2= <>
##$DBPNAM3= <>
##$DBPNAM4= <>
##$DBPNAM5= <>
##$DBPNAM6= <>
##$DBPNAM7= <>
##$DBPOAL= (0..7)
0.5 0.5 0.5 0.5 0.5 0.5 0.5 0.5 
##$DBPOFFS= (0..7)
0 0 0 0 0 0 0 0 
##$DE= 6
##$DECBNUC= <off>
##$DECIM= 32
##$DECNUC= <off>
##$DECSTAT= 4
##$DIGMOD= 1
##$DIGTYP= 9
##$DL= (0..7)
0 120 120 120 120 120 120 120 
##$DP= (0..7)
150 150 150 150 150 150 150 150 
##$DP07= 0
##$DPNAME0= <>
##$DPNAME1= <>
##$DPNAME2= <>
##$DPNAME3= <>
##$DPNAME4= <>
##$DPNAME5= <>
##$DPNAME6= <>
##$DPNAME7= <>
##$DPOAL= (0..7)
0.5 0.5 0.5 0.5 0.5 0.5 0.5 0.5 
##$DPOFFS= (0..7)
0 0 0 0 0 0 0 0 
##$DQDMODE= 0
##$DR= 18
##$DS= 0
##$DSLIST= <SSSSSSSSSSSSSSS>
$$ [...]
##$SUBNAM2= <"">
##$SUBNAM3= <"">
##$SUBNAM4= <"">
##$SUBNAM5= <"">
##$SUBNAM6= <"">
##$SUBNAM7= <"">
##$SUBNAM8= <"">
##$SUBNAM9= <"">
##$SW= 16.9725357007746
##$SWIBOX= (0..15)
0 0 2 0 0 0 0 0 0 0 0 0 0 0 0 0 
##$SW_h= 3396.73913043478
##$TD= 16384
##$TD0= 1
##$TE= 0
##$TE2= 300
##$TE3= 300
##$TEG= 300
##$TL= (0..7)
0 120 120 120 120 120 120 120 
##$TP= (0..7)
150 150 150 150 150 150 150 150 
##$TP07= 0
##$TPNAME0= <>
##$TPNAME1= <>
##$TPNAME2= <>
##$TPNAME3= <>
##$TPNAME4= <>
##$TPNAME5= <>
##$TPNAME6= <>
##$TPNAME7= <>
##$TPOAL= (0..7)
0.5 0.5 0.5 0.5 0.5 0.5 0.5 0.5 
##$TPOFFS= (0..7)
0 0 0 0 0 0 0 0 
##$TUNHIN= 0
##$TUNHOUT= 0
##$TUNXOUT= 0
##$USERA1= <user>
##$USERA2= <user>
##$USERA3= <user>
##$USERA4= <user>
##$USERA5= <user>
##$V9= 5
##$VALIST= <valist>
##$VCLIST= <CCCCCCCCCCCCCCC>
##$VD= 0
##$VDLIST= <DDDDDDDDDDDDDDD>
##$VPLIST= <PPPPPPPPPPPPPPP>
##$VTLIST= <TTTTTTTTTTTTTTT>
##$WBST= 1024
##$WBSW= 4
##$XGAIN= (0..3)
0 0 0 0 
##$XL= 0
##$YL= 0
##$YMAX_a= 133374
##$YMIN_a= -114807
##$ZGOPTNS= <>
##$ZL1= 120
##$ZL2= 120
##$ZL3= 120
##$ZL4= 120
##$ABSF1= 10
##$ABSF2= 0
##$ABSG= 5
##$ABSL= 3
##$ALPHA= 0
##$AQORDER= 0
##$ASSFAC= 0
##$ASSFACI= 0
##$ASSFACX= 0
##$ASSWID= 0
##$AUNMP= <proc_1d>
##$AZFE= 0.1
##$AZFW= 0.1
##$BCFW= 1
##$BC_mod= 2
##$BYTORDP= 1
##$COROFFS= 0
##$CY= 11.3945322036743
##$DATMOD= 1
##$DC= 2
##$DFILT= <>
##$DTYPP= 0
##$F1P= 15.9154993809931
##$F2P= -4.1035820241983
##$FCOR= 0.5
##$FTSIZE= 0
##$FT_mod= 4
##$GAMMA= 1
##$GB= 0.15
##$INTBC= 1
##$INTSCL= 1
##$ISEN= 128
##$LB= 0.24
##$LEV0= 0
##$LPBIN= 0
##$MAXI= 10000
##$MC2= 0
##$MEAN= 0
##$ME_mod= 0
##$MI= 1.114404
##$NCOEF= 0
##$NC_proc= 0
##$NLEV= 6
##$NOISF1= 3.799351
##$NOISF2= 2.8
##$NSP= 1
##$NTH_PI= 0
##$NZP= 0
##$OFFSET= 15.70392
##$PC= 1
##$PHC0= -11208.96
##$PHC1= 21.40099
##$PH_mod= 1
##$PKNL= yes
##$PPARMOD= 0
##$PSCAL= 0
##$PSIGN= 0
##$REVERSE= no
##$SF= 200.130013532006
##$SI= 16384
##$SIGF1= 3
##$SIGF2= 2
##$SINO= 400
##$SIOLD= 16384
##$SREGLST= <1H.CDCl3>
##$SSB= 0
##$STSI= 0
##$STSR= 0
##$SW_p= 3612.71676300578
##$SYMM= 0
##$S_DEV= 0
##$TDeff= 0
##$TDoff= 0
##$TI= <>
##$TILT= no
##$TM1= 0
##$TM2= 0
##$TOPLEV= 0
##$USERP1= <user>
##$USERP2= <user>
##$USERP3= <user>
##$USERP4= <user>
##$USERP5= <user>
##$WDW= 1
##$XDIM= 8192
##$YMAX_p= 0
##$YMIN_p= 0
$$ End of Bruker specific parameters
$$ ---------------------------------
##NTUPLES= NMR FID
##VAR_NAME=  TIME,          FID/REAL,        FID/IMAG
##SYMBOL=    X,             R,               I
##VAR_TYPE=  INDEPENDENT,   DEPENDENT,       DEPENDENT
##VAR_FORM=  AFFN,          ASDF,            ASDF
##VAR_DIM=   8192,          8192,            8192
##UNITS=     SECONDS,       ARBITRARY UNITS, ARBITRARY UNITS
##FACTOR=    0.0002944,     1,               1
##FIRST=     0,             0,               0
##LAST=      2.4114304,     0,               0
##MIN=       0,             -114807,         0
##MAX=       2.4114304,     133374,          0
$$ Real data points
##PAGE= N=1
##DATA TABLE= (X++(R..R)), XYDATA
$$ [...]
2070H58j77j978J848J76j965J743M17k263J507J006k260R60J233k106Q15J444
2086A258k246M43J901j996q8J893j712j87K031j743o09K310j316j042K109j019
2102a3j060K184r57j491K262l90j767J876j24j714J897L8k113J738O83k170J206
2119H5Q68j998J128J079k254P72J627k037K08J612j755J17J828j854l64K162j373
2136a49q39J947j076q71K067j033j334K194m77j603J811k30j549J858r7j951J761
2153D29M74j995J287O25j875J279Q12k148R73J345k003M88J359j801M13J567j900
2170f71n3J926j500m95J792j267n74J957j193j072K069o27j376J762l89j387J826
2187G28k02j782J699L45j838J278M97j765J278P15k018R72J171j860N57J187j727
$$ plain form
2070 858 681 -1297 551 727 -1238 505 922 -1341 166 1172 -1088 -128 1105 -1001 -186 1258
2086 1258 -988 -545 1356 -640 -728 1165 -547 -734 1297 -446 -1055 1255 -61 -1103 1006 -13
2102 -13 -1073 1111 154 -1337 925 535 -1232 644 520 -1194 703 741 -1372 366 1049 -1121 85
2119 85 953 -1045 83 1162 -1092 -320 1307 -730 -522 1090 -665 -548 1280 -574 -938 1224 -149
2136 -149 -988 959 -117 -988 1079 46 -1288 906 429 -1174 637 407 -1142 716 619 -1332 429
2153 429 903 -1092 195 820 -1055 224 1036 -1112 -139 1206 -797 -309 1050 -751 -338 1229 -671
2170 -671 -724 1202 -298 -793 999 -268 -842 1115 -78 -1150 919 292 -1084 678 289 -1098 728
2187 728 526 -1256 443 788 -1050 228 725 -1040 238 953 -1065 -93 1078 -782 -225 962 -765
2204g65N17J408j849J15J706j523k35J620j364l28J802j286p94J903p99j076J716
2221G68o23j150J789l94j559J672J28j644J336L01j643J271O03j885R62J039j759
2238g88O11J103j667N08J272j701J46J576j467j60J520j302l07J657j182o69J770
2255I20q95q74J649p09j019J708m74j334J604q7j444J353J21j497J303L65j650
2272i60J067P26j662P65R22j603N53J153j626K51J406j466k2J456j315k82J587
2289I50j146n63J660r45p94J628o76r92J587m76j137J505k25j313J443l7j456
2306i87J309K77j466J094M85j592R52O78j544O98R35j523M84J058j510K96J289
2323I33j350j29J412j136l51J495j055n62J567p90q55J505n15r87J453l67j180
$$ plain form
2204 -765 -248 1160 -689 -574 1132 -391 -626 994 -370 -698 1104 -182 -976 927 128 -948 768
2221 768 145 -1005 784 390 -1169 503 631 -1013 323 624 -1019 252 855 -1030 -68 971 -788
2238 -788 -177 926 -741 -233 1039 -662 -516 1060 -407 -567 953 -349 -656 1001 -181 -850 920
2255 920 25 -849 800 91 -928 780 306 -1028 576 489 -955 398 519 -978 325 690 -960
2272 -960 107 833 -829 -64 858 -745 -192 961 -665 -414 992 -474 -496 960 -355 -637 950
2289 950 -196 -759 901 -44 -838 790 114 -878 709 233 -904 601 376 -937 506 469 -987
2306 -987 322 599 -867 227 712 -880 72 750 -794 -96 839 -684 -200 858 -652 -356 933
2323 933 -417 -546 866 -270 -621 874 -181 -743 824 34 -821 684 169 -818 635 268 -912
2340i12J439m1j380J231J88j349J106L10j463J014O10j507P00P85j407O01Q71
2357G96j477M14J148j373O3J211j158o8J300j199k79J464r26o31J401o85p02J406
2375G05n56r97J465k36j225J206M2j164J087J97j432J106N26j485P67O36j316
2392f74O96P30j454M53J062j339J55J069j147J18J131j142k25J430j021m59J318
2409G01q10m78J260p40p06J389l44j023J145j37r87J167q4j323J228M01j396Q10
2427G3N00j288Q16O03j497O52R46j361K47R97j158J92J075j254q2J389j031l90
2445e71J238q10l77J269q67o10J414n47q60J203l17q68J249l17j070J248M8j236
2463g81J086J25j119R37K93j309P94O72j263M25P19j134M12Q76j273J38J231j118
$$ plain form
2340 -912 527 486 -894 337 525 -824 282 592 -871 143 753 -754 -54 731 -676 -75 796
2357 796 -681 -267 881 -492 -429 782 -376 -444 856 -343 -622 842 -84 -715 686 1 -701 705
2375 705 149 -848 617 381 -844 362 404 -760 327 524 -908 198 724 -761 6 642 -674
2392 -674 22 752 -702 -249 813 -526 -371 698 -449 -331 800 -342 -567 863 -158 -617 701
2409 701 -109 -587 673 -67 -773 616 272 -751 394 257 -730 437 353 -970 258 659 -737 73
2427 73 573 -715 101 704 -793 -141 805 -556 -309 688 -470 -278 797 -457 -539 850 -181 -571
2445 -571 667 -143 -520 749 -118 -728 686 139 -721 482 165 -703 546 229 -841 407 455 -781
2463 -781 305 430 -689 248 541 -768 26 698 -565 -140 579 -555 -143 733 -540 -402 829 -289
2481b89k31J171r27k36J320r94n19J448n81p54J161m58p15J184l80j027J247O
2499D26j139J023P5j046R60J92j240Q23N46j209N65O12j152N36P27j265K99J002
2517G35j113K8R81r39o3J119r99l21J250p24n50J157n68o18J228m70q87J214j42
2536C18r96J003kj008J013J40j201R03L99j194O90M84j151O22O27j236M38Q24
2554F73j117K03Q84j060J24R83j029j12J109q56k97J082p18m33J181o20o41J172
2572E28l66q29J153k52r25J074n1j072J049K13j120P53M03j174O53N60j157M84
2590g6P37j150L15Q48j099J65R25j014j4J023r14j85J080p89l56J092o56m80J089
2609E41n25o29J099l45p79J034j60q73R68j1r74Q98J97j058P26L89j067O09N23
$$ plain form
2481 -289 -520 651 -276 -512 808 -186 -705 743 162 -592 569 111 -604 580 200 -827 420 426
2499 426 -713 310 385 -661 299 491 -749 74 620 -589 -24 588 -564 -28 699 -566 -267 735
2517 735 -378 -350 631 -308 -371 748 -251 -572 678 -46 -596 561 -7 -625 603 133 -754 460 318
2536 318 -678 325 323 -685 328 468 -733 170 569 -625 65 549 -602 20 647 -589 -151 673
2554 673 -444 -241 643 -417 -293 690 -339 -451 658 -198 -495 587 -131 -564 617 -3 -644 528
2572 528 162 -667 486 234 -691 383 332 -740 309 522 -598 155 558 -616 37 597 -560 -76
2590 -76 661 -489 -174 674 -425 -260 665 -349 -363 660 -254 -439 641 -148 -504 588 -68 -548 541
2609 541 16 -613 486 141 -638 396 236 -637 331 320 -654 244 441 -617 109 498 -569 40 563
2628E63j108M61P40j104K28Q43r79R9R09r58p1J053q57k94J057o73m00J061o08
2647c8n50J120m17p33J016k36p41R54j62q62R58N9r89P85K26r33O76L29j046O10
2667B6N40j049L51O75r45K62P43j003J03R64q99j80R86p01k71R79o85m44J119
2686E71m92o60J000k88o76R74k56q29R99J5r65P79J71q87P35K06j010O83M73j054
2706e11M38N40q93L62N98j000K50Q49r29l6Q55p36q4Q83p94k61J071n82n37R62
2726D45l85n50R68l63p42J035r3r11Q34O1q44P91J36j026P58M10j057M83N22r37
2746d65M48N30r88L01P59r48R5P84p92O0P64q31j20J011o73l81R01m87l87R13
2766D94m66n88R98k14p75Q55p2p49Q26Or27P95K76r95N66M11r25N03M85j016L76
$$ plain form
2628 563 -545 -84 656 -448 -220 623 -356 -257 652 -306 -377 676 -181 -475 582 -91 -491 570 -38
2647 -38 -588 532 115 -618 398 162 -579 375 213 -649 309 368 -621 164 390 -543 133 462 -584 26
2667 26 566 -483 -132 543 -402 -140 603 -400 -297 667 -232 -412 574 -127 -398 581 -104 -548 571
2686 571 79 -581 419 131 -545 429 173 -656 343 358 -607 172 343 -544 191 397 -613 70 543 -511
2706 -511 -73 467 -426 -64 534 -466 -216 633 -296 -332 523 -213 -297 586 -208 -469 602 20 -517 445
2726 445 60 -490 478 115 -627 408 315 -596 238 299 -545 246 382 -644 114 524 -533 -50 472 -465
2746 -465 -17 513 -475 -174 585 -363 -268 516 -276 -216 548 -283 -403 608 -65 -446 455 -32 -419 494
2766 494 28 -560 438 224 -551 304 232 -517 309 315 -612 183 459 -536 30 441 -484 19 504 -512 -136
2787a36P22r61J30P59q40P7Q01q54q3R49o90k98Q98n58l31R18n21n09R61k85o66
2808e17Q52j66o66Q34j01q11Q09J47q82O18K55q50N73L73r74M50N84r09K14O60
2828D93q36J43P48q55m0R05p29k30Q82n98l17R34n41m83R64l58n98Q73k16o51
2848e10Q62j25p89Q15P2q29O65J76q12N97K90q89M76M77q70L18N48q33K28O50
2868E17q42O4P92p40j20Q21o40k39Q75n64l86R00m00n50Q97k79o33Q73j48p56
2888e58Q20K7q19P19J52q48O25K78q73N22L96q83L98N24q63K51O11q02J41O77
2908D95p64QP62o82j43Q00n83k72Q26m94l88Q45l53n42Q33k15o26P94r9p26P63
2929B39O5q16O43K32q27N45L16q71M71M87q80K88N86p99J82O23p89Q1P41p26j10
$$ plain form
2787 -136 586 -375 -245 514 -326 -249 552 -302 -385 564 -126 -424 474 -84 -415 503 -18 -527 434 149 -517
2808 -517 335 169 -497 337 236 -575 234 381 -501 117 372 -478 95 468 -506 -56 528 -381 -167 493
2828 493 -343 -200 548 -307 -347 558 -171 -401 481 -117 -434 500 -41 -524 440 82 -516 357 141 -510
2848 -510 352 227 -562 253 325 -504 161 337 -475 122 412 -477 -1 476 -394 -76 472 -361 -133 517
2868 517 -325 -261 531 -209 -329 492 -148 -387 488 -76 -462 438 38 -512 385 106 -527 346 198 -558
2888 -558 262 289 -530 189 341 -507 118 396 -477 45 441 -442 -44 480 -383 -132 479 -323 -182 495
2908 495 -269 -261 501 -181 -324 476 -107 -379 447 -47 -435 410 57 -485 348 133 -493 301 202 -524 239
2929 239 304 -512 131 363 -464 81 397 -474 -3 484 -396 -108 478 -321 -139 484 -305 -224 517 -209 -319
2950c19P80n90j96P72n45k93Q25m11m70P94k61n08P64k21o19P78j5p55O43J38
2970B91p35N74K05q09N22L92q46L21N25p84K50N62q22J56P15p47o8P54o03j44
2990b91P67o13k54Q61m60m47P97k96m61P58k67n95Q09p2p11O62N2o54O07R2p61
3011d77N96K95q10L35M42p46L30M34p47K20O36p46j4O77o07n5P02o23k16Q97n54
3032c1m06Q34l78m30Q29l72n60Q70j69o74O95L4o69O31M7p61O56K41q24M48L55
3053C66p74M55L55q29L44N46p67Q6N84o09M7O56o88q5Q12n60l02P84m29l35P48
3074D05m14m51Q40k06o68P01o2o08P34l7p82P77J31q33N29K93p33M15L65q27L95
3095c6N06q03J66N93o97J30O31p44RP48o36j87P46n27j98P52n18l61Q46l35n03
$$ plain form
2950 -319 461 -129 -325 447 -98 -391 434 23 -447 347 86 -422 342 121 -498 280 265 -490 153 291
2970 291 -444 130 335 -474 48 440 -406 -85 440 -344 -94 468 -354 -198 517 -230 -298 456 -147 -291
2990 -291 476 -137 -391 470 10 -437 360 64 -397 361 94 -501 308 236 -475 187 239 -415 192 284 -477
3011 -477 119 414 -396 -61 381 -365 -35 399 -348 -128 508 -238 -252 425 -182 -237 465 -158 -374 523 -31
3032 -31 -437 397 19 -411 418 46 -514 356 187 -487 208 242 -427 204 251 -510 146 387 -437 11 366
3053 366 -408 47 402 -427 -83 463 -304 -218 366 -243 -196 460 -228 -313 499 -61 -363 421 -8 -343 405
3074 405 -9 -460 380 174 -494 207 145 -463 271 234 -548 229 360 -473 56 349 -384 31 396 -431 -36
3095 -36 470 -333 -167 426 -271 -141 490 -254 -245 503 -133 -320 426 -101 -299 453 -65 -426 420 85 -418
3116d18P31k14n35P55j33o76P22M2p39O25J32p22N27K76q30M83M15q23L03N35
3136D56q16K53N96p98R3O99p05o3P17n85j04P33n56k70P86m58l69P38k70n10P71
3157C38k45n58P16m1o66O94Lo37N75J53q12N70K76q27M68L41p42L45N02p91J56
3178a82O41p28L0P16o94n6P79o62j69P92n22l27Q17m33m19Q13l28n22Q01k02n92
3199d47P20p2o57O78L9p11O07J59p58N42K71p83M20L93p66L07M94p77K14N94p38
3220b71N5O71o74m2P31o27j78Q01n36l26Q06l93m27P99l31n27Q18j82o43P38l8
3241B24o86O79M4p44O44J96p95M97L15p64M04L79p78L24N30p75J42O01o85N7O28
3262D37o76l8P49n94k33P67m56l17P61m17m16Q17k71n78P50j17o07P05m8p07O98
$$ plain form
3116 -418 313 99 -436 319 186 -490 232 274 -465 160 292 -430 97 373 -457 26 441 -382 -79 456
3136 456 -360 -107 489 -309 -216 483 -222 -285 432 -153 -257 476 -80 -350 436 -22 -391 347 77 -433 338
3157 338 93 -465 251 210 -456 238 241 -396 179 332 -480 90 366 -461 7 348 -394 -49 453 -338 -182
3178 -182 459 -269 -239 477 -217 -273 506 -156 -325 467 -55 -382 435 2 -417 396 68 -454 347 145 -447
3199 -447 273 201 -456 222 261 -450 157 316 -442 100 371 -412 8 401 -365 -58 436 -341 -127 467 -271
3220 -271 -216 455 -219 -261 470 -157 -335 466 -70 -396 410 17 -410 389 58 -469 349 167 -476 262 224
3241 224 -462 217 261 -483 161 357 -438 59 374 -390 14 393 -385 -61 469 -306 -164 437 -248 -191 437
3262 437 -239 -277 472 -122 -355 412 -44 -361 400 -17 -433 384 113 -465 285 168 -439 266 218 -489 209
3283B09J21p96N61K62p63M82L11q25M16M84q02K17N64p18J38N95p39N6P19o56
3303a64j46P21n11k05P33n14l15Q01l49m90P46k15m95P03j59o22P31K3p28N91
3323A36J62p14N46K15p97M98L96q19K96N11p48K42N37p90J33P12p18q4P33n89
3343a42j34P39n75k63Q21m37m28P61k95m37P34k48n86P87p7o80O33O1o52N89J11
3364B82p53N60L01p90L82M01p45L27M78q04K21O40p48K8O72o44l9P10o33j90Q32
3385D88n19l69P91l85l94P86l30n47Q18j69o42P04k3o54O60L2p39O22K14p75M66
3406C5L18p51M11L85p98L06N50p51J24O02o91O1O70o82q9P76n77k50P85m80l16
3427c62Q01m20m66Q29k59n76P53j36o27P32l7p28O80J38p87N61K37p74M89L42
$$ plain form
3283 209 330 -466 95 357 -406 76 387 -438 -22 462 -340 -123 441 -277 -139 456 -283 -227 492 -164
3303 -164 -310 411 -100 -305 428 -86 -401 400 51 -439 307 92 -403 300 141 -481 250 273 -455 136
3323 136 298 -416 130 345 -452 46 442 -377 -81 430 -318 -76 461 -329 -196 516 -202 -286 447 -142
3343 -142 -276 463 -112 -375 446 9 -419 342 47 -390 344 96 -490 297 220 -460 173 234 -418 171 282
3364 282 -471 89 390 -400 -18 383 -362 -35 443 -361 -140 500 -248 -220 452 -192 -231 479 -154 -344 488
3385 488 -31 -400 391 6 -388 398 68 -479 339 170 -472 232 209 -445 215 247 -492 130 344 -431 35
3406 35 353 -398 13 398 -400 -94 456 -295 -171 431 -260 -199 471 -211 -300 476 -101 -351 434 -46 -362
3427 -362 439 19 -447 382 123 -453 300 164 -463 269 232 -496 184 322 -465 96 333 -441 48 390
3447C90q21L77M73p73K35N48p36J36O27p12J6O98o28j33P34n40k21P55m52l68
3467c95P88l34m72P66k35n64P61j20o70P19K0p29O31J51p79N60K73q12M55L93
3487D07p98L23N13q01K09O04p47P8O69o81l4P06o03j59P54n03k91P58m21l73P64
3508C74l05m87P36j77n70P00p5o53O67O5p32N94J82p58N11K89p83M13M47q15K83
3529i4N30p52J69O00p28M3P25o99j01P42n58j98P56n13l20Q19l92m46P55k57m99
3550d18P38j89n79P32m9o82O17J11o87N44J76p54N01L33p82L54M26p30K62M98
3570D22p50J63O42p26lO93o17q3P07n93k19Q22m87l88P94l38m38P65k73n56P84
3591C21j18o73O84K5o65N99R0p21N72K60p95M29L57p15L38M19p72K64N72p36P5
$$ plain form
3447 390 -431 -54 419 -354 -119 429 -307 -171 456 -256 -240 458 -170 -303 431 -109 -330 425 -27 -395
3467 -395 393 59 -413 353 118 -446 315 195 -475 244 264 -465 166 317 -462 98 371 -441 14 407
3487 407 -391 -68 445 -356 -147 457 -290 -212 457 -224 -258 448 -155 -314 440 -63 -354 404 -17 -390 374
3508 374 69 -418 318 141 -429 271 196 -457 210 275 -457 137 319 -439 72 361 -422 -9 438 -377 -94
3529 -94 436 -316 -147 453 -275 -232 493 -206 -307 435 -123 -321 435 -78 -398 421 29 -417 338 81 -418
3550 -418 320 131 -448 284 235 -447 170 281 -406 138 314 -440 61 394 -388 -34 392 -338 -76 422
3570 422 -328 -165 477 -249 -252 441 -176 -259 448 -145 -364 458 -29 -417 377 39 -399 366 93 -463 321
3591 321 203 -470 214 239 -426 173 263 -458 114 374 -421 8 365 -350 -12 407 -365 -101 471 -265 -190
3612a90N99o15JO41o25j17P65n27l02P49m10l31P47l50m73P79j84o15P03n5n99
3633d09O48J1p32O48J99q04M87K91p26M27L73q06K86N63p71J58N69o44N0O21o73
3654b34n3P49n40k41P13m32k56P02m34l97P78k67n08O86j19n69O98r6o45O54Q6
3675B75p13N08K15o90M90K94p87M09M58q15K28N27p13K02N34o64OO66o13j10O90
3696C97m84j81O81m72l55P97l24n03P60k35m68O74j40n92O76K1o63N78R7o73N14
3717A05K31p85M75L61p85L16M95p25J93N69p55J00O40o76k4P06o18j29P40n45
3737a11k54P98m54l72P60l24m59P68k33n66P33r9o17O43K6o66N90J33p27N21K62
3758C52p46M13L53p37L38M30p39K19N63p10P9O18o65j0O83o05j41P37n11k75P63
$$ plain form
3612 -190 409 -206 -205 436 -189 -306 459 -68 -370 379 -31 -362 385 35 -438 341 157 -458 245 190 -409
3633 -409 239 250 -482 166 365 -439 48 339 -387 40 413 -393 -107 456 -315 -157 412 -232 -182 439 -234
3654 -234 -287 462 -78 -319 394 -38 -294 408 -26 -423 355 88 -420 266 147 -422 276 180 -465 189 275
3675 275 -438 70 285 -405 85 379 -408 1 459 -356 -128 399 -314 -112 422 -242 -236 430 -183 -293 397
3696 397 -87 -268 413 -59 -414 383 59 -444 316 81 -387 287 147 -445 231 252 -411 167 264 -409 105
3717 105 336 -449 26 387 -398 -82 413 -312 -119 450 -305 -205 435 -241 -265 441 -177 -306 434 -111
3737 -111 -365 433 -21 -393 367 43 -416 352 119 -447 286 187 -430 213 239 -427 163 296 -431 90 352
3758 352 -394 19 372 -365 -27 403 -336 -117 446 -264 -185 433 -232 -242 441 -164 -305 432 -79 -354 409
3779D09m19l77P63l30m84P62k03n80P37r1o55O87L6o92N86J48p34N07K68p49M25
3800A4L72p48L02M72p40K10N48p00Q6O12o40l7O65n56j60P23n00k75P42l94l76
3821c80P38l05m80P53j77n98O96l4o58O52N1p17N91J96p56M85L08p58L89L96p65
3842c73L06N04p46J49N86o67N5O18o50m5P08n64j90P01m47k67P05l90l79P62k87
3863H9n19P10j33n49O59p0o38O54Q9p27N39K15p21M67K87p62L89M50p75K21N39
3884D14p07J63N77p24O5O82o37j15O92n28j69P03m95k79P66l64m45P21k26m66
3904c72O80j76n65O90k3o61N77J11o52N23J77p32M80L29p63L18M39p09K47M83
3924D01p33J66O30o89k6O75n93r3O94n66k14P92m59l73P41l15m15P40k92n08P51
$$ plain form
3779 409 -10 -387 376 46 -438 324 121 -459 278 187 -468 219 255 -437 149 297 -437 70 338 -411 14
3800 14 386 -362 -60 412 -328 -118 430 -270 -184 428 -212 -249 416 -140 -300 423 -77 -352 390 -4 -380
3821 -380 358 53 -427 326 149 -449 247 213 -445 207 258 -459 132 328 -428 57 365 -393 -4 392 -373
3842 -373 -67 437 -309 -160 426 -241 -186 432 -218 -263 445 -119 -309 392 -55 -322 383 -7 -386 376 89
3863 89 -430 280 147 -402 257 187 -451 203 292 -435 104 319 -402 65 352 -410 -21 429 -346 -125 414
3884 414 -293 -130 447 -277 -212 470 -167 -282 410 -118 -287 416 -79 -358 408 44 -401 320 94 -372
3904 -372 308 132 -433 257 234 -427 150 261 -391 132 309 -423 57 386 -377 -59 380 -329 -82 401
3924 401 -332 -166 464 -225 -251 424 -169 -262 432 -134 -348 444 -15 -388 353 38 -377 363 71 -437 314
3945C14j12o25O42lo03N85N8o94N44K43p37L99L25o78L30L93p32K50N40p02P0
3966a93N96o27K3O19o00j25P47n16k81P29m04l19P36l62m45P80k11n74O95r5n88
3987d15O65k1o82O27J56p32M81K56p08M19L28p57L25M78p22J70N19o45R5N70o43
4008b36j6O81n60j80O87m69k42P22m19l53P44k87m84P07j75n35O96r0o35O59N6
4029B71o99N56J75o98M96K62p66M03L99p40K71M71p00J73N58o99O4O38o24p2O53
4050C92n19j68O95m75k78P27l62m00P07k50m63O88j77n42O62k2o24N82P6o58N38
4071A29J86p24M63L00p34L72M03p37K70M99p38J57N85o89N7O36o14q3O91n47j91
4092c09P23m70k96P26l69l94P18k53m78O83j52n39O51n6n96N98O5o62N31J69o89
$$ plain form
3945 314 202 -423 219 216 -387 198 256 -438 106 349 -388 11 336 -342 -12 381 -351 -101 439 -263 -193
3966 -193 403 -224 -201 418 -182 -307 440 -76 -357 372 -32 -351 385 23 -422 358 147 -427 268 173 -415
3987 -415 250 229 -453 174 330 -402 79 335 -373 46 374 -383 -58 420 -302 -132 387 -258 -163 407 -236
4008 -236 -252 429 -131 -311 376 -93 -335 387 -32 -385 359 72 -412 295 120 -415 281 191 -444 215 271
4029 271 -428 128 303 -395 101 363 -403 0 399 -341 -70 401 -299 -126 432 -267 -203 435 -189 -261 392
4050 392 -127 -295 400 -75 -353 374 12 -388 319 69 -394 294 117 -425 237 215 -409 173 249 -409 129
4071 129 315 -409 54 354 -380 -8 395 -342 -72 427 -311 -154 431 -258 -201 435 -179 -262 429 -118 -309
4092 -309 414 -56 -352 374 5 -389 329 76 -402 281 129 -410 241 185 -411 187 252 -410 121 290 -399
4113c99M63K92p26L58L96p17K71M72p04J61N75o83K6O35n96q2O90n71j73P29m67
4134e0l16P29l44l96P11k66m85P21j49n83O52k0o11N90O9o75N37K07p08M22K98
4155C33o64L31L58o89K66M71o80J10N48n85K1N91n92p2O82n19k35P00m02l04O97
4176C66l68m00P43k21n57O98j02n54O27l2o42O20J13p02M87K21o58M13K83p11
4196c76L59M18p14J94M92o20J15N10o15J5O50n74j36O52m50j87O38m23l14P32
4216C66l13m43O73j78m73O41j33n67O55J7o52N31J41o47M84K20p27M32L68p31
4236c36K80M27o50K06M69o72J08O03o14p2O19m92j16O30n06j99O98l79l47O43
4256C00k45l78O22k12m76O46p1n78N65N2n82N20R0o48M76K57o91L46L45o52K90
$$ plain form
4113 -399 64 356 -370 -12 384 -333 -62 410 -294 -133 442 -241 -215 420 -176 -258 432 -139 -312 417 -50
4134 -50 -366 363 19 -377 334 68 -417 304 155 -428 224 204 -407 183 252 -423 114 321 -387 35 333
4155 333 -331 0 358 -331 -65 406 -274 -164 384 -201 -180 411 -181 -253 429 -90 -325 375 -27 -331 366
4176 366 -2 -402 341 120 -437 261 159 -395 232 200 -442 178 291 -411 76 297 -361 52 335 -376
4196 -376 -17 401 -313 -119 373 -247 -132 378 -237 -222 428 -146 -282 370 -80 -267 371 -52 -366 366
4216 366 53 -390 283 105 -368 273 140 -427 228 245 -407 124 265 -382 102 322 -405 27 395 -336
4236 -336 -56 371 -279 -73 396 -276 -168 435 -179 -251 368 -124 -240 390 -116 -315 383 4 -343 300
4256 300 55 -323 299 87 -389 257 186 -392 173 225 -357 163 253 -395 81 338 -353 -7 338 -314 -24
4277b4L98o94K08N41o60N2N56n60l2O15n63j33P00m65k66O62l40l18O53k87m23
4298c80O66j54n11N94o0n19N63J4n99N13J65o51M09K52o22L40L16o58K70M38o41
4319b55J26M96n90N6N61n75n9O35m96j89O42m07k60O60l54l61O92k34m71O35j25
4340A27n08N98l1n74N34R9n96M48J81o12L90K59o40L05L67o18J90M33o00J27M89
4361C68n69K3N43n15p7N90m58j74O29m00k78O47l00l73O35j94m77O41j05n38N88
4382B06mn85N34J04o10M36K13o31L65K91o27K75L90o40J88M57n83P6N10n49j0
4403a94N60m83j36O02m12k16N97l37k99O19k55l92O17j64m57N73p1n30N76K9n95
4424c68M88J36o03M26K20o44L74L13o52K54M16o17J56M72o08Q1N38n49n8N75m55
$$ plain form
4277 -24 374 -320 -112 429 -231 -179 377 -183 -215 400 -163 -296 404 -61 -327 335 -5 -323 330 43 -380
4298 -380 286 132 -379 215 155 -364 199 213 -386 127 292 -359 50 302 -320 20 336 -322 -52 386 -255
4319 -255 -129 367 -223 -167 394 -181 -240 395 -101 -290 352 -55 -315 345 -9 -370 322 88 -383 252 127
4340 127 -381 217 186 -388 146 245 -351 97 278 -334 56 315 -325 -20 347 -271 -81 352 -248 -121 368
4361 368 -201 -178 365 -150 -227 363 -95 -269 360 -40 -318 329 29 -344 291 97 -380 261 156 -382 206
4382 206 202 -383 151 255 -355 81 294 -337 28 319 -308 -33 357 -283 -95 362 -221 -145 365 -184 -194
4403 -194 366 -117 -253 349 -63 -279 318 -19 -318 301 46 -346 271 107 -350 223 152 -378 198 227 -368
4424 -368 120 256 -347 79 299 -345 29 342 -310 -56 360 -257 -101 371 -237 -156 382 -167 -225 350 -105
4445a05j37N87m36k18O43l25l47O08k08l74N62j67m26N96m8n52M87P7n41M71J15
4466B62o33M48K35o31L03L34n92K31L63n94J45N15n99L6N63n19q9N75n10j34O89
4487C98m37l05O64l15k88N52k25m03O43j79m90O11n7m72M43J15o24N37J51o15
4507b96L33K64n64L23J71n38K45M11n23QN66n72N8M47m89p0O20m91j76O17m38
4528i4j80O01l80l16O70j92m67N46o6m00N54r0n83N39R2n71M10J56n56L28L40
4549C41o66K62M63o39J02M94o13K02M66o06M9N32m86j62N70l87j58N57l99k15
4569b93N97k63l56N63j97l66N47j24m67N62j1n72M83J24n57M20J79o31M13K84
4589C35o19K49L53n65K12L91o13J35N01n43j7N25m77p8N51m35j77O07l40k93N78
$$ plain form
4445 -105 -242 345 -91 -309 334 9 -338 270 62 -312 250 83 -343 253 205 -347 140 217 -324 147 262
4466 262 -371 77 312 -319 -16 318 -274 -43 320 -274 -129 386 -213 -177 386 -133 -222 353 -157 -291 398
4487 398 -39 -344 320 5 -283 269 44 -359 284 105 -385 226 169 -303 140 255 -369 168 319 -296
4507 -296 37 301 -263 60 231 -307 -62 349 -174 -166 400 -172 -114 333 -156 -226 394 -97 -273 344 -94
4528 -94 -274 327 -53 -369 301 109 -358 188 122 -278 276 186 -397 142 234 -337 73 229 -327 1 341
4549 341 -325 -63 400 -239 -137 357 -256 -54 412 -194 -145 387 -99 -261 309 -78 -236 321 -78 -293
4569 -293 304 41 -315 248 51 -315 232 108 -359 203 192 -380 103 227 -330 90 269 -362 51 335
4589 335 -284 -35 318 -247 -35 356 -257 -122 379 -164 -181 344 -133 -211 340 -95 -272 335 -5 -298 280
4610B80k58l22N69j97m23N87q5n04N12J6n22M92P6n90M54K00o15L46K82n98K88
4631a2L45o12J98M48n90Q6M99n40QN29n01q7N79m16j97N83l37k70N87k75l50N85
4653B60j61m41N49p8m69N20Pn50M79J19n73M12J81n78L39K81n99K60L71n96J83
4674h4M38n88R6N06n41qN48n01j05N88m20k02O02l44k91O11k71l51N75j51m40
4695c33N45o7m86N09J1n38M85J19n74M12J73n70L13K82n55K40L57n67J26M69n60
4716b09P1N08n60l2O11m97j24O49m81k26N70l14k73O00k31m09N93j49m22N24m1
4737A58n17N56J0n77M89J38n74L85K10n82L14L12o02K16L84n50J34M27n55Q4N09
4758C69n28o5N42m17j24N46m00j93O07l26l17N81k10l81N74j75m37N85o1n36N07
$$ plain form
4610 280 22 -300 269 72 -351 236 151 -353 159 175 -347 145 221 -369 85 285 -330 16 298 -300 -12
4631 -12 333 -279 -81 367 -223 -137 362 -178 -170 359 -142 -229 350 -66 -263 320 -17 -287 300 25 -325 260
4653 260 99 -342 207 129 -340 180 187 -363 116 235 -338 74 255 -323 16 297 -302 -42 329 -267 -84
4674 -84 354 -234 -138 368 -173 -181 367 -134 -239 349 -71 -273 329 -15 -306 305 34 -317 258 107 -333
4695 -333 212 145 -341 168 179 -359 126 245 -329 83 256 -314 -1 281 -274 -34 323 -244 -118 351 -209
4716 -209 -138 370 -190 -222 389 -108 -232 417 -64 -290 280 -34 -307 293 62 -347 246 97 -325 199 158
4737 158 -359 197 207 -370 119 257 -317 68 278 -304 10 322 -280 -64 320 -230 -96 331 -224 -140 369
4758 369 -159 -224 318 -99 -223 323 -77 -270 337 11 -306 275 65 -316 258 83 -354 231 170 -366 141
4779A41O6n32M59R9n79M22K37o38L08L33n74K21L49n61J46M74n60J0N11m65m6
4800a79N08m53j16N82l77k60N66k56k86N38k43l54N90j23m80N06J1m94M81K4n36
4821c51M71J49n98L57K63n69L01K77n94K53M09n98R3M72n14N5M72n20k3N54m36
4842g7j80N63l40k12N54l23k97O05k10m22N45r4m15N00n7m85M99P1n55M13J59
4863B42n26L58K00n79L16L35o08J97L90n43J42M19n53N2N31m99r4N54m13j36N45
4884C30l95k20O05k90l36N62j90l65N46j44m44N42k0n08M56O1m96M12J28n58L73
4905D9K55n71K37L22n26K05L46n50J29M55n21J5M84m56m5N07m25j49N77l60k57
4926b79N66k70l05N53k08l82N64j13m64N11k4m76M70N3n36M20J51n35L30K43n41
$$ plain form
4779 141 207 -325 134 233 -346 76 313 -325 -17 316 -258 -37 312 -249 -103 371 -189 -179 332 -133 -179
4800 -179 329 -124 -240 342 -35 -295 271 15 -271 267 24 -330 260 137 -343 163 174 -320 161 185 -351
4821 -351 120 269 -329 28 291 -278 23 300 -294 -41 368 -230 -137 335 -179 -124 348 -172 -195 359 -77
4842 -77 -257 306 -34 -246 308 -15 -312 293 83 -339 206 112 -303 197 140 -345 154 225 -330 83 242
4863 242 -284 74 274 -305 11 346 -262 -65 325 -218 -76 343 -210 -158 373 -126 -220 334 -79 -215 330
4884 330 -65 -285 320 30 -306 256 66 -299 247 103 -341 201 181 -327 129 190 -306 106 234 -324 49
4905 49 304 -267 -30 292 -234 -29 317 -233 -104 351 -170 -155 329 -127 -172 335 -90 -239 338 -22 -279
4926 -279 287 17 -288 265 57 -325 239 126 -338 173 149 -327 143 196 -340 80 231 -304 26 269 -272
4947b72K66K97n39J91L73n23R2M24m77J5M66m51n8N16l94j55N26l24k39N38k60
4968A2l10N49j87l75N25j02m19M99k9m79M52P0n24M13J46n43L41K29n44K62K99
4989B85n24J80L67n04Q5M28m75RM54m23p3M94l72j59N06k92k33N04k36k88M96
5010B29j64l70M91n9m24M47Lm66M43P0n11L67J79n13L03K24n12K36L24n33J52
5031h4L89m98Q2M23m73J2M68m27j02N08l49j61M88k88k49N20k21l20M89j22l52
5052b67M42n4m25M55K3m75L83J14m67L23J73n09L02K56n23J98L33m81J27L66m87
5073a93O9M47m67l7M76l81j11M86l58j71N35k98k80N10j82l11M84j53l68M98m8
5094A47m53M12O0m26L63Q7m84L54J98n18K40K69m67J87K94m87J49L85m62JM39
$$ plain form
4947 -272 -6 291 -248 -57 316 -207 -115 309 -168 -153 313 -138 -196 320 -74 -229 297 -27 -266 272 12
4968 12 -298 251 64 -311 214 112 -307 192 163 -316 136 206 -318 95 241 -302 39 268 -276 -14 285
4989 285 -239 -59 308 -196 -111 317 -158 -149 305 -118 -191 303 -69 -228 278 -14 -247 257 21 -267 229
5010 229 65 -305 186 127 -297 150 153 -313 130 200 -311 56 235 -278 25 249 -263 -27 297 -236 -84
5031 -84 305 -193 -111 312 -161 -149 319 -108 -210 298 -51 -212 276 -12 -261 259 38 -282 207 85 -267
5052 -267 175 121 -304 151 174 -301 82 196 -271 52 225 -284 18 274 -249 -51 282 -199 -72 294 -193
5073 -193 -124 323 -144 -181 295 -86 -197 289 -69 -240 295 -3 -283 227 45 -266 218 65 -303 195 147
5094 147 -306 106 166 -260 103 190 -294 60 258 -260 -20 249 -218 -31 263 -224 -75 310 -152 -151 288
5115B88m02l3M39m14q7N25l53k15N15k61k40M81k17l17N21j34l94M67l9m18M24
5136A36J3m58M11J24n15L07K07m67K62K20m89K10L30m85R1L82m29L9L79m12k2
5157a66M68l70j44M72k90j77M66k89k34N20j87l64M79q0l80M54o3m17M53M1m87
5178b95L65J30m65L28J55n02K91K70n14J80L31m66J22L51m61N1M37m18o7M40l33
5199g0j10M56l23j74M93k42k80M60j54k98M42j18l66M63m8m20L97O0m31L67Q4
5220A88m66L26J93m98K44K64m74J83L01m77J27L91m56K3M12l98m3M41l74j04M75
5241B78l05k05M79k34k46M60j80l03M56r6l75M22k4l94L93M8m33L34J31m62K91
5262C5J93m76K34K51m58J74L11m51J00L66m44L8M12m08m4M52l72j11M65l01j91
$$ plain form
5115 288 -114 -147 292 -122 -209 316 -37 -252 263 2 -238 243 26 -291 230 96 -298 169 130 -288 136
5136 136 149 -309 102 226 -289 18 225 -242 20 240 -249 -39 291 -194 -103 279 -150 -111 268 -144 -166
5157 -166 302 -68 -212 260 -30 -207 259 -30 -264 256 69 -295 184 104 -276 178 115 -302 151 192 -295
5178 -295 70 200 -265 63 218 -284 7 277 -237 -57 274 -192 -70 281 -180 -129 308 -110 -177 263 -70
5199 -70 -180 276 -47 -221 272 30 -250 210 56 -242 200 82 -284 179 131 -289 108 168 -263 104 188
5220 188 -278 48 241 -257 -13 251 -223 -40 261 -216 -89 302 -154 -131 281 -117 -160 281 -93 -197 278
5241 278 -27 -232 247 13 -233 227 47 -256 200 104 -271 151 127 -267 126 174 -259 75 206 -256 35
5262 35 228 -248 -14 237 -221 -47 264 -187 -87 279 -165 -127 285 -123 -167 285 -87 -198 267 -34 -225
5283b25M67k32k55M62j65l04M45r9l65M31k0m10L90M5m34L44J35m55K72J99m42
5304b16K17K37m50J51L28m51Q8L68m10RL93l78m8M34l50j26M64k77k00M54k30
5325Gk52M65j71l15M54r0l59M12l3l90L89O6m45L34J44m50K72J73m36K20K53m54
5347b06J39L21m12P6L34m00L4L87l63q5M25l00j34M18k79j67M50k12k84M62j44
5368F0l02M19r7l48M28j6m16L69P7m10L10J12m50L26J74m58J92K74m16J28K91
5389B47m35J04L67m23pL99l29p5L94l06j22M44k61k30M27j60k50M11j64k83M32
5410A80p7l65L75K2l71L29M1m00L43J40m68K48K27m23J95K36m42J53L37m46M8
5431a18L77l75J0L65l61o3M48l22j70M38k34j86M06j96k49M45j36l41L98m2l21
$$ plain form
5283 -225 242 10 -245 217 52 -252 193 94 -271 160 140 -270 120 165 -269 75 210 -245 27 226 -216
5304 -216 1 238 -212 -61 267 -184 -96 272 -138 -129 264 -114 -162 272 -78 -204 260 -17 -217 237 7
5325 7 -245 220 49 -266 188 98 -261 151 118 -272 117 183 -262 72 216 -234 38 211 -225 -5 248 -206
5347 -206 -67 254 -158 -82 252 -148 -114 273 -90 -175 250 -50 -184 234 -45 -212 238 26 -258 204 60
5368 60 -242 177 80 -268 160 144 -272 97 174 -236 74 186 -264 62 236 -222 -30 244 -172 -44 247
5389 247 -188 -84 283 -140 -147 252 -77 -152 242 -64 -186 258 -3 -233 194 34 -216 195 31 -252 180
5410 180 103 -262 113 135 -236 93 134 -266 77 217 -251 -3 224 -199 -4 232 -210 -57 280 -166 -118
5431 -118 259 -116 -106 259 -102 -165 283 -39 -209 229 -5 -191 215 19 -230 215 79 -262 136 94 -227
5452b27L51ql87L84P4m55L10J61m13K37J90m65K05L25m58Q2L44l82N1L76m47K
5474a50M29l75j06M42l04j06M06k67j89M70k21k87M35j06l15M21q7l50M00Rm03
5495b54L24R1l86K73J42m36K44K32m47J73K67l86J00L17m14K2M06l81j4L68l39
5516i8n5M02l05j44M43k31k34M38j79k66M25j35l09M17o5l68L72K5l73L28O6m01
5538b47K89J57m34K26K21m12J76K52m12J21L09l95M3L42l46k3L72l25p6M05k81
5559c8j55M09k22k02M05j61k63M02j09l12M07o7l43L76Ml85L44P7m12L06J26m24
5581b37K50J89m22J99K32m00J32L01m02N4L46l57rL59l20o4L87k85j38M03k16
5602Bj91L80j67k41L92j13k99L75l6l38L47%l56L37O9m10L13J16l92K21J74l83
$$ plain form
5452 -227 124 116 -271 113 187 -268 42 203 -210 27 217 -248 -43 282 -176 -94 250 -132 -81 295 -152 -150
5474 -150 279 -96 -202 240 -64 -170 236 -31 -220 250 29 -258 177 71 -244 177 90 -260 140 149 -254
5495 -254 70 161 -225 48 190 -246 -2 230 -217 -44 223 -163 -63 254 -160 -138 268 -113 -127 241 -98
5516 -98 -153 249 -56 -200 243 12 -222 216 37 -229 196 61 -248 169 104 -264 108 133 -240 88 154 -247
5538 -247 42 199 -235 -9 212 -200 -24 228 -184 -63 246 -149 -106 236 -110 -133 239 -86 -162 243 -38
5559 -38 -193 216 -6 -208 197 36 -227 175 66 -246 161 94 -249 127 131 -254 90 167 -245 61 187 -237
5581 -237 13 202 -220 -21 211 -189 -57 244 -158 -104 242 -115 -124 235 -85 -149 238 -47 -185 218 2
5602 2 -189 191 24 -217 175 62 -237 138 102 -236 111 111 -245 92 161 -249 64 180 -212 9 183 -200
5624b00J86K46m42J38L16l83N5L07l58K1L40l36n2L65k43j38L89k21j79L99j88
5645B2k45L92r7k80L54n8l18L56J6l77L08R6l75K51J25l67K07K02m08J51K68l80
5667a57R9K80l77P1L23l59k3L72l03p4L73k86j07L94k24k12L89j37k36L51j04
5688E3k84L86m5l45L22M4l44K86O2l59K76J32l90J80K29l64J37K09l59J19K91
5709B36l62QL31l03j9L23l00n6L77k67j58L84j80j83L51j61k31L93j12l04L61
5730A28k4l13L09J6l37L05Q4l92K29J80l66J79J74l68J71K50l79N3L05l13J2L01
5752B04l11j2L52k86j17L53j99j41L47k00j91M04j56k52L01m3k40L26o4k97L27
5773A05L6l62K85Q7l42K35J11l62K02K11l92J39K41l41Q5K71l48M4L15l02o8L46
$$ plain form
5624 -200 -14 232 -210 -72 244 -139 -84 223 -135 -114 226 -110 -162 203 -40 -178 211 -10 -189 210 22
5645 22 -223 169 72 -208 146 88 -230 126 142 -235 73 169 -206 45 170 -197 10 212 -196 -45 223 -157
5667 -157 -58 222 -155 -84 239 -120 -143 229 -74 -148 225 -61 -168 226 2 -210 179 42 -194 157 53
5688 53 -231 155 110 -235 87 131 -213 73 135 -224 52 184 -206 -26 203 -161 -24 185 -174 -55 236
5709 236 -126 -118 213 -90 -109 214 -86 -142 235 -32 -190 194 14 -169 182 21 -210 183 71 -233 128
5730 128 104 -209 100 116 -221 84 168 -224 5 185 -181 -2 172 -196 -25 225 -154 -101 204 -109 -97 204
5752 204 -107 -119 233 -53 -170 183 -16 -157 190 -10 -201 203 47 -205 96 53 -187 139 75 -222 105
5773 105 141 -221 64 151 -191 44 155 -207 -5 206 -186 -47 194 -147 -62 209 -139 -95 220 -82 -150 196
5795A96k38j02L24k11j34L61j81k05L34j06k19L27q5k75L50k2l34K90O2l25K49
5816E6P7l43K48J37l66J76K03l60J44K19l49R9K65l30K0L13l01k7L22k72p5L43
5838A99k28j51L58j68j84L41j34k29L37p2k75L12Pl12K96L0l33K59J03l54K25
5859B7J47l63J88J77l47J34K37l49Q1K70l33K9K98k89l0L26k65r2L52k36j50L70
5881A82j76j90L47j38k18L37q0k69L15ll08K84L5l11K52R4l35K01J58l44J56J86
5903A75l28J21K32l33N9K78l06J1K84k77l1L31k71r5L42k12j38L39j83j74L52
5924A76j46k32L41n7k77L06k3k85L01K1l40K74R1l27J99J28l20J66J94l46J22
5945c4K28l08M4K61k95J9K89k81n7L29k29j11L26k06j25L24j54k10L35j05k20
$$ plain form
5795 196 -42 -144 180 -31 -165 196 15 -190 144 38 -181 146 61 -214 136 114 -220 70 132 -193 56
5816 56 133 -210 38 175 -191 -15 188 -172 -28 191 -158 -59 206 -124 -104 209 -92 -119 203 -69 -144 199
5838 199 -29 -180 178 10 -174 167 33 -196 141 69 -206 106 113 -199 97 127 -206 53 156 -198 27
5859 27 174 -189 -1 176 -171 -37 200 -149 -68 202 -131 -102 196 -93 -123 203 -62 -154 198 -38 -188 182
5881 182 6 -184 163 25 -193 144 64 -205 110 107 -201 83 118 -193 59 153 -182 19 177 -167 -11 175
5903 175 -153 -32 200 -133 -74 204 -102 -91 193 -84 -115 216 -55 -150 192 -20 -158 181 -2 -176 176
5924 176 30 -202 139 82 -195 111 88 -197 104 125 -215 59 150 -177 22 150 -170 -4 190 -156 -34
5945 -34 194 -114 -70 191 -104 -85 204 -77 -134 195 -34 -145 181 -25 -150 174 20 -190 145 40 -180
5966a80L04o6k45L09l2l12L04L7l03K36P5l24K43J17l43J64K00l29J13K03l18
5987a47R8K51l19J0L02k64l6K88k44o7L16k03j57L34j41j74L02j18k08L18o9k78
6009b06K96J0k85K59K1l03K76P6l43K13J44l12J45J75l31J39K23l39P0K66k92
6030i8K2K69k82j1K97k47j04L27j79j29K90j52j70L34j26k23K96l5k40K61k2k67
6052a89K80K8l12K22J08l07J86J23l13J69J84l35J05K25k91O1K32k97L8K83k85
6073h5m5L20k39p5K91k05j15L32j68j88L18r4j96K77o6k40K94j8k93K53O4k87
6095a65K12P6l05K15J35l31J41J85k90Q1K06k99Q0K43k78kK65k32n2K95k32q2
6117a34L11j88j41L05j37j77L11j10k19L11n8k56K78Lk68K43M0k89K21Q3k97J72
$$ plain form
5966 -180 124 58 -187 122 90 -222 82 119 -184 52 127 -197 46 163 -180 -16 184 -145 -32 171 -147
5987 -147 -49 202 -117 -107 195 -69 -105 183 -61 -128 188 -15 -172 162 21 -153 149 31 -177 141 72 -206
6009 -206 90 100 -185 74 95 -208 68 144 -199 14 158 -154 -9 166 -165 -26 197 -142 -72 194 -98
6030 -98 -76 193 -89 -100 197 -50 -154 173 -6 -135 155 3 -167 167 41 -182 114 79 -161 100 78 -189
6052 -189 91 119 -193 29 137 -170 16 139 -174 -5 179 -156 -51 174 -117 -56 176 -121 -83 200 -85
6073 -85 -130 190 -49 -124 167 -38 -153 179 11 -177 141 47 -149 128 62 -178 116 98 -195 58 122 -165
6095 -165 47 123 -182 33 168 -163 -22 163 -127 -46 160 -139 -59 184 -94 -96 169 -63 -115 180 -52 -134
6117 -134 177 -11 -152 153 16 -161 150 40 -179 132 74 -182 96 99 -169 74 114 -175 46 129 -168 4
6139DJ61l14J36J78l12J05K17k87L5K47k61mK68k38n4K96k12r6K86j63j38K99
6161A53j46j60K94j03k11K79m2k34K79j2k67K37N4l04K21J05l03J78J45l21J45
6182a3J74k98R2K16k87L4K58k64j1K70k35m6K85k02j17L06j62j48K87j20j84K96
6204A31p8k30K83k8k35K52qk52K30N8k91J98J13l03J62J30k74J37J79l21J05K21
6226A79k86L8K27k58J8K60k46n3K86k00r5K79j64j21K84j37j76K90o9k06K56m2
6248F4k25K52Kk70K39N1k65J83Q7k73J75J21l00J25J82k69Q2J88k65N5K36k81
6270a06kK75k28m0K60k08o8K85j92j26K86j05j74K65q3k00K73n1k39K47J7k41
6292a55K04N0k51K01Q1k75J36J52k72J06J62k66R2K02k77K2K49k28k0K41k38k3
$$ plain form
6139 4 165 -149 -13 165 -147 -42 175 -112 -77 170 -91 -95 173 -65 -119 177 -35 -131 155 -8 -146 153
6161 153 7 -153 141 38 -173 106 64 -170 109 97 -170 67 121 -183 38 143 -160 18 163 -158 -13
6182 -13 161 -137 -45 171 -116 -82 176 -88 -99 171 -64 -110 175 -27 -144 162 0 -148 139 19 -165 131
6204 131 53 -177 106 78 -157 95 87 -165 65 123 -168 30 143 -160 2 132 -142 -5 174 -147 -42 179
6226 179 -107 -69 158 -100 -82 178 -68 -121 165 -35 -130 149 -15 -136 148 11 -165 125 56 -150 106 64
6248 64 -161 91 93 -177 62 113 -152 31 118 -155 20 141 -159 -34 148 -121 -39 149 -116 -61 175 -106
6270 -106 -108 167 -61 -101 159 -49 -117 168 -24 -150 136 31 -143 122 39 -161 112 61 -178 69 86 -155
6292 -155 49 99 -152 49 130 -145 -9 143 -129 -23 139 -127 -35 167 -110 -88 161 -67 -87 154 -84 -107
6314a07K66k06q5K74j55j13K67j33j54K80r3k09K67k6k23K41j0k45K36L3k68J96
6336C3R0k46J32J12k68J45J58k94Q5K05k41J8K16k29OK54k33o5K65j72q3K44j47
6359a5j11K69j25j67K62o9j84K50o6j93K36lk37K12M4k48J86M9k38J75J05k71
6381a39J30J55k56P9J69k43N8K11k47LK29j96m0K25j81p4K75j59j30K54r1j60
6403a28K37p8j63K40n0k02K15Ok14J97L9k30J64Q8k58J49J20k55J10J39k36P1
6425c9J93k44L4K04k14pK18k07k7K45j91p6K48j32j31K48j07j45K52p8j90K34
6447H8k4k01K11J6k22J78O3k49J59J02k52J26J34k45R9J52k39O4J86k38L4K04
6469A46k17pK20j90l7K25j65p3K35j40j13K40j05j55K41n7j81K22k2k04K07Rk08
$$ plain form
6314 -107 159 -47 -132 142 -13 -126 141 8 -146 134 41 -168 99 73 -150 91 81 -164 72 105 -163 33
6336 33 123 -123 9 121 -147 -2 156 -138 -53 152 -89 -71 145 -84 -78 176 -57 -122 143 -29 -112 132 -15
6359 -15 -126 143 18 -149 113 44 -140 110 44 -149 87 84 -153 59 103 -145 41 90 -148 27 132 -139
6381 -139 -9 146 -110 -31 138 -105 -47 164 -83 -80 149 -47 -87 138 -43 -117 158 -1 -131 123 32 -128
6403 -128 109 31 -132 108 58 -144 71 77 -137 60 99 -131 33 121 -137 12 132 -123 -13 126 -110 -39
6425 -39 154 -90 -56 148 -66 -73 145 -62 -89 156 -35 -111 137 5 -126 122 15 -130 122 44 -146 88
6447 88 64 -137 74 90 -132 46 109 -140 19 121 -131 -5 129 -116 -17 135 -104 -40 146 -92 -58 146
6469 146 -71 -78 142 -48 -85 140 -25 -98 137 -3 -116 124 19 -136 105 48 -133 89 67 -137 70 79 -129
6492a29J85M3k26J40J03k35J21J20k38R0J54k30N2J95k17OK06j99j8K23j82n7
6514i3K28j49r0K19j15j05K23j02j45K33n6j79K08k2j90K15Kk19J83N9k30J51
6536B6P9k20J37R9k31Q4J56k11L2J73k04L0J97k05k6K27j74n8K13j34r5K44j39
6559@j34K52q2j47K12o0j54K07l5j91J95J8k14J77M3k16J65Q0k44J31J26k21Q1
6582a1J32k14P3J58k22K5J91j80k7K04j75k9K07j49q9K36j15j18K03q3j32K28
6604A13o8j72K06kj92J83Pj94J80L3k15J43R0k16J24R4k17J09J22k39P3J71k08
6627g5L2J66j86J1J90j87m6K14j40p8K09j11r7K20j05j45K34m8j73K03m0j63J90
6650G5lj92J62M8j93J36O3k12J42Q4k24R8J37k17O9J51k04K9J79j88j2K01j57
$$ plain form
6492 -129 56 99 -127 13 116 -119 2 122 -116 -26 128 -102 -50 145 -72 -66 140 -59 -77 146 -36 -93
6514 -93 135 -14 -104 115 0 -105 118 16 -129 104 48 -131 77 55 -135 80 82 -137 46 105 -125 26
6536 26 105 -115 22 121 -110 -26 130 -81 -49 124 -80 -50 147 -58 -84 143 -31 -89 124 -10 -105 139 0
6559 0 -134 118 36 -111 101 41 -113 94 59 -132 63 81 -133 44 87 -129 36 116 -128 3 129 -92 -11
6582 -11 121 -93 -20 138 -84 -59 132 -48 -75 129 -46 -75 132 -17 -106 130 15 -103 100 17 -115 113
6604 113 45 -127 79 77 -115 68 75 -119 61 94 -121 22 112 -104 20 114 -103 6 128 -111 -38 133 -75
6627 -75 -43 123 -63 -52 138 -49 -95 119 -21 -99 110 -1 -98 122 17 -128 106 58 -115 88 48 -115 75
6650 75 72 -120 42 90 -103 33 96 -116 26 110 -114 -16 121 -96 -27 124 -80 -51 128 -60 -72 129 -28
6673b8l7J80j47m7K08j30j01K03p6j26J94n7j37J92l4j84J93Rj76J47M4k11J55
6696C4P3k13J13J00k10R0J22k02O1J45j98J7J78j58j7J73j67k4K02j47o8J94r3
6719Er8K07j08j10K03o1j51J93k5j55J67Kj80J71M0k15J42P0j97J19Q2k04R2J28
6743A17j94M4J41j74J8J61j69jJ77j56m9J98j29o4J93j03j07K00r5j14J89n1j35
6766a03J78k1j65J79oj66J54L2j89J32O1j90J10R8k00R5J12j82M2J42j79K5J61
6789A20j68k1J83j50m3J99j41o2J85j00j01J95q8j10J86m4j45J80k1j57J69J0
6811G6j81J49M3j84J23O1j79J08R2j96Q3J17j85M3J40j74K5J44j56j3J76j37m6
6834g1J74j21n2J79j03j15J95n7j43J91m1j39J71rj72J69J7j63J23M3j61J20O5
$$ plain form
6673 -28 -65 115 -32 -79 129 -1 -102 101 25 -101 93 36 -101 91 57 -127 66 75 -101 46 90 -121 34
6696 34 107 -106 7 107 -103 -13 109 -93 -32 113 -85 -68 110 -48 -65 108 -59 -83 119 -28 -96 98 5
6719 5 -93 114 6 -104 99 38 -113 80 55 -100 67 69 -111 60 100 -115 27 97 -100 19 101 -103 -11 117
6743 117 -77 -33 108 -66 -48 113 -56 -57 120 -36 -85 113 -16 -80 113 10 -97 103 8 -106 83 32 -103
6766 -103 75 54 -111 68 62 -104 50 82 -107 25 86 -104 6 104 -96 -1 111 -71 -29 113 -66 -41 120
6789 120 -48 -69 114 -36 -79 120 -21 -83 102 2 -99 96 8 -102 84 40 -105 75 54 -103 66 76
6811 76 -105 44 87 -97 26 87 -92 16 108 -88 -5 112 -73 -30 110 -64 -39 105 -51 -64 112 -25 -71
6834 -71 103 -18 -70 109 6 -109 86 29 -114 77 36 -103 68 59 -113 56 73 -90 33 76 -85 35 100
6857A00j97R7J09j94O5J30j77M8J23j72J6J66j48k9J71j41k1J65j17p9J97r7j07
6880i2J75o1j06J70m7j43J80j0j53J36K2j64J45L7j76J07R6j93P3J08j80Q3J06
6903A13j82M0J45j65mJ57j44rJ63j49m3J86j10p6J76r3q8J86p9j30J81k4j36J42
6927E7rj43J62Qj77J34N8j80J03O8j62R2Q7j82O5J15j52K1J40j53RJ54j60k3J77
6952A09j24n8J70j00p3J78j01j05J88n3j26J72l4j30J73l3j40J64j6j30J00N0
6974H1j61J08N0j63R1R3j70P0J04j70L8J28j53J4J47j57l0J74j31p8K07j14o7
6997h9J77p4j33K09m0j40J78m0j53J70nj41J41mj52J41K9j52Q1R2j58N4J44j92
7021e7N1J05j22m4J74j45j3J61j20p5K22j74k9J36k9j11J58n5j51J88n9o4J29
$$ plain form
6857 100 -97 0 109 -85 -20 110 -67 -19 104 -68 -52 114 -34 -63 108 -33 -54 111 -6 -85 112 15 -92
6880 -92 83 22 -84 86 39 -104 76 66 -87 49 71 -93 52 89 -87 20 116 -77 -4 104 -76 7 113
6903 113 -69 -29 116 -49 -53 104 -40 -49 114 -35 -78 108 -2 -78 98 5 -83 103 24 -106 75 51 -85 57
6927 57 48 -95 67 75 -102 32 90 -90 13 81 -81 11 98 -84 -19 96 -56 -35 105 -48 -39 115 -45 -68 109
6952 109 -15 -73 97 -3 -76 102 1 -104 84 31 -95 77 43 -87 86 53 -87 77 61 -69 31 81
6974 81 -80 28 78 -85 6 99 -71 -1 103 -67 -29 99 -54 -40 107 -50 -80 94 -37 -115 92 -22 -89
6997 -89 88 14 -119 90 50 -90 88 48 -105 65 60 -81 60 56 -96 45 74 -78 3 95 -63 -9 135 -57
7021 -57 -6 99 -23 -67 107 -38 -51 110 -10 -85 137 -37 -66 70 41 -70 88 33 -118 70 11 -53 76
7044G6J1j76J65m5j36J77Pk21J57O1j62N9J24j92J12Q0j64Q1J10j48j3J32j56
7067f1oJ62q6p1J55r6m4J86j30p1J65o8j45K00o8j05J49k7r0J28p6j14J22O1j33
7092f3P9L6j38J05M6j05RQ4j33L8J27j22K9J20j45k2J61j53J1J40j06p5J20n5
7116a2p1J77p0j18J50Kj20J19jj48J45lj25J14N1j67J24lj32J22M4j47O1J09j44
7141d3J7J12j36K9J36j76k6J99j33n8J71r0p1J42l4j33J94r3r5J78n3r5R6K3j33
7166g2J19rj42J33K4j42J29L8j41Q2M9j23M9J04j99P1J04j38k2J69j47K6J33j00
7190ek9J46j00p9J68n5j70J87k4j08J62n0r6J36j5j25O5O5j37Q3M7j39P1Q6j46
7215f2O6O8j44R8N1j38L6J19j21j8J48j24k9J48j07o0J63q3q1J55n9r3J34m3j17
$$ plain form
7044 76 87 -89 76 31 -105 72 79 -142 15 76 -86 -27 97 -95 17 97 -67 14 124 -24 -37 95 -61
7067 -61 -67 95 9 -62 93 -3 -47 139 9 -62 103 35 -110 90 22 -83 66 39 -51 77 1 -113 9 70 -63
7092 -63 16 52 -86 19 65 -40 -31 53 -80 -42 85 -37 -8 112 -33 -55 106 -47 -36 104 -2 -77 43 -12
7116 -12 -83 94 24 -94 56 58 -62 57 56 -92 53 50 -75 39 90 -77 47 44 -88 34 78 -69 -8 101 -43
7141 -43 -26 86 -50 -21 115 -61 -87 112 -21 -79 92 2 -69 73 39 -94 100 7 -88 90 37 -58 38 61 -72
7166 -72 47 38 -104 29 53 -89 40 78 -63 19 68 -55 -6 98 -101 -30 74 -64 -86 83 -64 -38 95 -5
7190 -5 -34 112 12 -67 101 46 -124 63 39 -69 93 43 -53 83 68 -57 8 73 -64 19 66 -73 -2 84 -62
7215 -62 4 72 -72 26 77 -61 -25 94 -27 -45 103 -21 -50 98 -9 -69 94 11 -70 85 26 -67 67 24 -93
7240i3J64j2j35J26Mj40J26K3j54J09O7j56P1Q6j53P4Q0j50L3J23j35QJ18j19
7264c5NJ17j14m3J56r6n0J38q1o4J43o6r6J55l5j11J27rj16J37j0j25J11K5j36
7289g3Q8N5j37P8P9j60O8R5j52M1J08j44L3J18j40LJ20r9m0J42q8n2J43q6o9J54
7315H5o1j04J36l7r8J37j7j30J45qj33J30K5j50J02M6j44Q8P2j48O1Q4j40N6R1
7340H8j21kJ19j19j1J51j26l8J41r8n7J62q0q6J56o2r2J34k5j11J34k6j10J30
7364E1Oj41J20K0j26J00M1j42P2P2j34O8O7j30M1J07j40J5J15j17mJ22j14j9J32
7389H2r6n4J47q2o0J35o2q5J36l4r9J26j2j28J32j1j06J04L0j21Q4M4j32N8Q8
7414H4j38O5P0j48L5J10j02rR4q9J2J07j33m6J72q3m4J23o6o5J22p3p6J42m2r2
$$ plain form
7240 -93 71 59 -76 50 54 -86 40 63 -91 18 85 -71 0 86 -67 7 87 -63 -30 93 -42 -34 84 -35
7264 -35 -30 87 -27 -70 86 -10 -60 78 -3 -67 76 10 -86 69 34 -77 50 41 -75 62 52 -73 38 63 -73
7289 -73 15 70 -67 11 90 -70 -2 93 -59 -18 90 -54 -21 97 -43 -40 80 -19 -59 83 -5 -57 86 0 -69 85
7315 85 24 -80 56 19 -79 58 41 -89 56 48 -85 45 70 -80 22 68 -76 12 84 -64 -3 81 -59 -3 88
7340 88 -33 -35 84 -35 -46 105 -21 -59 82 -16 -73 89 9 -77 79 17 -75 59 34 -77 57 31 -79 51
7364 51 57 -84 36 56 -70 30 71 -71 1 73 -61 7 74 -56 -15 92 -48 -33 82 -35 -39 83 -31 -50 82
7389 82 -14 -68 79 -3 -63 72 10 -75 61 27 -72 54 42 -86 46 35 -71 33 63 -58 26 70 -62 -4 84
7414 84 -54 11 81 -67 -32 78 -24 -33 61 -28 -16 91 -42 -88 84 1 -43 80 14 -51 71 -2 -78 64 22 -70
7440g0J08lr8J03Qj30J13L8j43J03M4j33Q0N1j31N3R0j26K3Q6r9J7R5j20J3J07
7466G9j01l3J22q0l6J19p1n9J30n4q3J23k7q5J09k1j07J20Oj24R9L1j17R3L6j37
7492f8Q0N8j21L8Q6j16L2J04j28J0J19j13k5J21j01pJ08r9l2J25o3p2J24m6o8
7517e4J13m2r0J27j4j10R9J5j08R2L0j29R2O4j37M9P2j08K8Q7j16J3J14j19QR6
7543G2j34P4J40j90l9J31o0m7J18n7o6J26n3p6J24l6q7J01Kj10J02J2j07Q9L1
7568F0j09O7L9j13P2N0j10M3P2j13J8R1r3J5Q6q8j6J05q6k7J04p4m3J21p2p1J38
7595F6m2q4J15k6r6J12j9q6R9Rj13R5K4j08P7L6j11N3O3j11M3P5j02K7O8j04J2
7622b8J01r8j0J07q4k2J03p2m7J11n0o0J06l2p6J07l1q7J04kr7Q8J0r9P6L4j05
$$ plain form
7440 -70 38 35 -63 40 48 -82 31 69 -74 29 73 -60 20 71 -60 -7 83 -43 -20 66 -33 -16 79 -41 -28 79
7466 79 -22 -55 67 -13 -49 70 -1 -60 70 16 -67 56 29 -56 53 32 -75 45 51 -73 26 57 -60 33 69 -68
7492 -68 12 70 -51 -13 73 -43 -11 93 -35 -25 94 -19 -44 77 -24 -31 77 -22 -54 71 8 -64 60 14 -54
7517 -54 59 17 -73 54 40 -70 29 44 -64 28 58 -71 21 85 -52 -3 69 -39 -11 76 -40 -27 87 -32 -24 72
7543 72 -62 12 152 -38 -77 54 -6 -53 65 8 -58 68 15 -61 63 27 -60 41 43 -67 35 47 -60 29 60
7568 60 -49 18 57 -56 16 66 -44 -1 71 -42 -24 67 -26 -11 75 -13 -29 76 -10 -37 67 -7 -50 71 -1 -72 66
7595 66 24 -60 55 29 -67 45 26 -60 39 48 -65 30 54 -54 23 59 -52 1 64 -47 -4 71 -31 -4 64 -40 -28
7622 -28 73 -25 -35 72 -12 -34 69 -3 -50 61 11 -49 57 25 -51 56 25 -62 42 40 -57 31 41 -58 18 52 -53
7649e3O0N9j19N2P0j22M8P3j12K4R1j07J1R3q5k3J05p6l1J01o4m0J02n1o6J11
7675E1l8p5J08k9q3J05kr8Q7K6j12P7L3j05P0M2j02O1N3j10M3O8j02J7P5q7jR7
7703F9q6j3R8p9k7J02o0n3J08n2o0J11l6o8R4j7j05J14oq7Q6Pr7P7L5j13O0N7
7731E9j02N1M8r0L4P6j02PQ3q7PQ9r4j4Q8o0l6J01n3m9R6n5m8R7k3p2Q3np2Q5
7761D2j0q6Q4K4j00O1L7r4O1L5q9M5N6j06L2P0q2J3O7p6pQ7p7k2R9n8m2R8o9l5
7791d2R7m7o4J00l0o4R8k5p8Q3J2q5N8L6q9O7K2r0N7M4r8K9O3q7K4N6q0K0P5q3
7821b1LP1o5j9Q5o7j8R1m5n5Q4k7n7R0l2o6Q6mq2P4J6q0O1J0p3N0N3j08M5M8p8
7852c0L5N6j00L3O9q8LQ9p8j0P6o9k1R7o4l2P5l3n5R0l2n7Q9k3p2P3Np7P6Lp4
$$ plain form
7649 -53 7 66 -53 -1 69 -53 -5 68 -44 -20 71 -36 -25 68 -17 -40 65 -11 -42 59 -5 -45 57 6 -60 51
7675 51 13 -62 46 17 -66 39 37 -61 26 52 -60 17 50 -55 15 57 -45 16 69 -41 2 70 -32 -15 60 -27 -28 69
7703 69 -17 -30 68 -11 -38 64 4 -49 59 7 -53 58 22 -46 48 31 -74 40 34 -53 33 40 -57 20 55 -58 2 59
7731 59 -43 8 56 -34 0 76 -26 -19 64 -23 -16 73 -21 -35 53 -7 -43 58 5 -44 52 -3 -51 46 23 -49 34 29 -43 42
7761 42 32 -54 30 54 -46 15 52 -42 19 54 -35 10 66 -40 -8 62 -20 -7 60 -16 -23 64 -13 -35 64 6 -36 62 -7 -42
7791 -42 55 8 -56 44 14 -50 48 23 -55 28 40 -45 13 49 -40 27 49 -41 16 60 -38 -9 54 -33 -9 47 -33 -13 62 -21
7821 -21 -18 53 -12 -31 54 -13 -31 60 15 -40 44 17 -40 50 18 -48 38 34 -48 26 42 -38 23 33 -40 10 63 -45 0 48 -30
7852 -30 5 61 -39 -6 63 -25 -22 67 -11 -21 55 -14 -35 62 -2 -34 41 8 -47 43 11 -46 43 20 -52 21 26 -51 25 28 -46
7883d6N4L3q2M3M8p9J6O5r2L5N8q0QP2o8lO7n3k0P9o5l1Q6l2m3P9m0n1Q0k1n9
7914d2P9qo7O8Jo6N1K8q9N4L5p6M3L4p8K7O1q0J2P0p4MO5o6j1Q0o5l7R7n2k7P6
7946D7l5m9P9m1l8P3j0o8Q1j1o9O6Op7O5K8q8N5L3q3M5M7q6K2N5n9NO0p3RP4p3
7978a0j0P4o0j4P0m8m1P9l1n2R1k3p1R0k2p0Q2j0o8O9J2r4O9K6p1L8M8r4M1M3
8008D3q2K8N1n6J0N4p0OO9o5j9Q7n6k8P2m5k6Q0l8o4Q5j8o0P2jo5O4Kq1P6Oo9
8040c8N0L4q6N4L5q5L7N0p7K0O0q7K3P1p5nP1n8k0P8n1k0R6o7m0P5j7o0P7l1n0
8071c6P0mo6N9J0o5N3J3p2N3K2p0L4M2o4K6M3q0L5N2p6nQ2o1JO3o5j1P7o4k1P0
8103D5l6l6P4l3n2P4po4O8%o0N3Ro6N7Rn6L3L2o2K9L5o5K0M1o1J4O3o8jN2n4L
$$ plain form
7883 -46 8 41 -41 2 50 -29 -13 52 -40 -5 53 -27 -19 53 -15 -18 49 -4 -24 55 -10 -41 45 13 -30 49 9 -42 38 17 -42
7914 -42 37 29 -38 30 31 -35 16 44 -45 9 44 -32 11 45 -33 -6 55 -25 -13 57 -17 -13 52 -14 -25 55 -10 -47 50 -2 -29 47
7946 47 12 -37 42 1 -37 36 26 -42 39 28 -41 25 31 -46 19 47 -41 14 47 -36 9 56 -30 -8 47 -12 -7 53 -20 -11 63 -10
7978 -10 -20 54 -6 -20 50 2 -39 40 9 -43 48 25 -46 44 22 -48 34 24 -44 25 37 -57 12 38 -33 5 53 -41 0 43
8008 43 -39 -11 40 -16 -6 48 -22 -16 53 -12 -31 56 0 -28 44 -1 -27 53 15 -49 36 18 -42 30 29 -36 28 30 -51 25 31 -38
8040 -38 12 46 -40 14 49 -36 1 51 -26 -6 54 -33 -10 61 -14 -19 52 -6 -26 52 1 -19 77 10 -30 45 28 -32 45 14 -36
8071 -36 34 30 -36 23 33 -32 21 34 -38 15 37 -33 1 43 -21 5 48 -32 3 55 -21 -26 56 -5 -4 59 -6 -17 60 -4 -25 45
8103 45 9 -27 47 14 -38 36 29 -35 33 33 -27 26 35 -31 26 35 -21 12 44 -18 11 46 -19 1 42 -19 -5 58 -10 -11 41 -13 -10
8136a0O9p4rP4l9l7P1l8m2P9k8n8Q0k2n3O2mn0O7po9M4K9o3L7K7o2L4L2p2K4N3
8168D5o3J2N5o9J4N3o1j2O4l8k4O4l7k2N7k2m6P2l0l8O2j6m9
$$ plain form
8136 -10 59 -15 -24 50 11 -26 45 7 -35 44 16 -42 38 16 -37 25 21 -29 38 31 -38 6 35 -28 9 36 -26 8 40 -32 -8 45
8168 45 -18 -6 49 -20 -6 47 -14 -26 38 0 -24 40 3 -19 38 16 -30 42 12 -26 36 20 -29
8191b9
$$ Imaginary data points
##PAGE= N=2
##DATA TABLE= (X++(I..I)), XYDATA
0@%%%%%%%%%%%%%%%nJ3j6J6j6J6k4L2l2M0m8N6o4P2q5R4j05J20j36J53j74J97
37A04k19K44k72L02l37L73m11M54n01N53o11O74p40Q13q96R88j093J208j337J488
57G84j662J864k103K392k750L205l805M634n848P791j1359J9796p0571k8730K19664
72A33302j70265n5850K10589j35000q8430K19127j10554j17726K08172o6822j39085
83a12542J90605m3472j46519J80278j5975j66865J64233J5431j70978J41495L6567
94G2258j77102J30010O2129j88717J03911R4868j85269P4918J13742j80574N0550
105b9276J38908j75055J3969J59213j51902j9192J63862j31251m2984J71110j09681
116a2279p3069J69683p8612r1600J58071n6751j03536J52793l5192j20526J41248
$$ plain form
0 0 0 0 0 0 0 0 0 0 0 0 0 0 0 0 0 -5 8 -8 8 -8 8 -16 16 -16 24 -24 32 -32 40 -45 49 -56 64 -72 81 -93 104
37 104 -115 129 -143 159 -178 195 -216 238 -263 290 -321 353 -387 426 -470 518 -575 633 -704 784
57 784 -878 986 -1117 1275 -1475 1730 -2075 2559 -3289 4502 -6857 12939 -57632 -86362 133302
72 133302 -36963 -92813 117776 -17224 -105654 113473 2919 -114807 93365 26543 -112542
83 -112542 78063 34591 -111928 68350 52375 -114490 49743 65174 -105804 35691 72258
94 72258 -104844 25166 87295 -101422 2489 97357 -87912 -12994 100748 -79826 -29276
105 -29276 109632 -65423 -51454 107759 -44143 -63335 100527 -30724 -73708 97402 -12279
116 -12279 -85348 84335 5723 -85877 72194 15443 -88093 64700 29508 -91018 50230
127E0230q857j27855J26130Q518j34721J17078L0400j45431R8928N5473j45963
138g6070P7795P3199j45502N9215R4582j43383L1571J12730j29716N827J21405
149H1653j16051j5898J30471r9941m0903J32601p7516n8312J27889o0491p1566
160f8064J26092m2697q6759J19358k2612r5831J10229p185j04415J03816J1360
171D3292j14463R1164L1528j18381P6381M8498j21032O0943O7514j20695L9511
182a5740Q3811j12641J8472R4173j02938j124J03035q9974k1384J06386p3764
193a1688l7186J05347n9441n0074J04320m4730o2532J00361k9713p1918R5312
204C8058j6255q0721R0469j530q9617Q3025J4439r6493P3195L0650j01465O0625
$$ plain form
127 50230 41373 -86482 39648 48166 -86555 30523 60923 -84508 14420 69893 -76070
138 -76070 1725 74924 -70578 -11363 83219 -60164 -28593 84137 -45579 -39752 81653
149 81653 -34398 -50296 80175 -19766 -60669 71932 -5584 -63896 63993 3502 -68064
160 -68064 58028 15331 -71428 47930 25318 -70513 39716 32531 -71884 31932 43292
171 43292 -71171 19993 51521 -66860 9521 58019 -63013 -2070 65444 -55251 -15740
182 -15740 68071 -44570 -26098 68075 -34863 -35987 67048 -22926 -44310 62076 -11688
193 -11688 -48874 56473 -2968 -53042 51278 6548 -55984 44377 14664 -57254 38058
204 38058 21803 -58918 31551 30021 -59596 23429 37868 -58625 14570 45220 -56245 4380
216D380M7325j02955M5101O2382j00497K7737P4898r4080R853Q3824q4156o970
228c3158Q8962p2662k2359R1092n9426l5520Q9722m6591m5502Q7598l4971n5194
240d8009Q4833k2258o3748P9876j0177p0430P5460J955p8525O8888J6968q3960
252d9127N8468L0517q6280M8082M3768q8186L4349N7762q4703J8194O6524p7786
264b8418M785P3442p0898r857P8649n9510k3347P8303m8684l2029P8235l9595
276A076m2479P7447k7100n1226P2564j6607n6792O9912o727o5329O5282P213p0547
289d3313N6044J8313p2954M8879K9928p6894L7606M3496p4535K3498N1024o9786
301b8694J3326N8607o6455l8O5636n7111j2564O6150m8763k0184O8275m2107l1123
$$ plain form
216 4380 51705 -51250 -6149 56233 -44264 -16527 58371 -35709 -25856 57968 -26188 -33158
228 -33158 55804 -16858 -39217 51875 -7551 -43071 46651 60 -45442 42156 7185 -48009
240 -48009 36824 14566 -49182 30694 20517 -49913 25547 27502 -51023 17865 34833 -49127
252 -49127 9341 39858 -46422 1660 45428 -42758 -8409 49353 -35350 -17156 49368 -28418
264 -28418 -23633 49809 -21089 -30946 47703 -11807 -35154 43149 -5535 -37564 40671 1076
276 1076 -41403 36044 8944 -42282 30282 13675 -43117 26795 20068 -45261 20021 27234 -43313
289 -43313 12731 31044 -41910 6969 36897 -39997 -2391 41105 -33430 -9932 41092 -28694
301 -28694 -15368 43239 -23216 -23254 42382 -14729 -27293 38857 -9906 -30090 38185 -3922 -35045
314c5045O9491l0808l9505O5761k2628m4791O5582j4392n4266O2510j231n9613
326c8935N4780Q051o2665N0152J8845o8099M0212L2274o6540K7738L9074o3509
338b8622J9475M7061o1860O659N4659n3334m777N5051m6695j1230N8332m1758
350g039k1901O0414l1491k9607N7443k5181l4437N8969j8370m4348N7259o329
362A5382m9657N1252J227n3351M8891J0976o0187M0985K3863n9894L0301L0341
374C0129n8419K3488L8595n8171J1634M6499n0764R47M7289m5193m936N0946m1110
387i066j5035N3197l1728k2051N0478k6125k6299N2144k0679l5057N1272j0509
399A0542l9923M6756m385m3802M5891L765n0690M0237J5075n2006L2046K1376
$$ plain form
314 -35045 34446 3638 -35867 29894 7266 -37525 28057 13665 -40601 21909 20678 -38935
326 -38935 15845 23896 -38769 11383 30228 -37871 2341 34615 -31925 -4187 34887 -28622
338 -28622 -9147 37914 -23946 -17287 37372 -15962 -20739 34312 -12383 -23613 34719 -7039
350 -7039 -28940 31474 -17 -29624 27819 2638 -31799 27170 8800 -35548 21711 15382
362 15382 -34275 16977 18204 -35147 13744 24720 -35467 5518 29381 -30513 -212 30129
374 30129 -28290 -4802 33793 -24378 -12744 33755 -17009 -16062 31227 -13966 -18902 32044 -9066
387 -9066 -24101 29096 -2632 -24683 25795 -330 -26629 25515 4836 -30221 21051 10542
399 10542 -29381 17375 12990 -30812 15079 18844 -31846 8391 23466 -28540 3506 24882
411B4882n2132K6690K9398n3482J7058L7312m8715P917L9784m4876J932M3976
423B9744m1547p378M6870l3979j4132M5709k9091j8727M7496k4142k6538M7215
435B1500j5699l1597M4258r856l5755M3377k538m1869L9097O820m4013L3078J3195
448A9998m5564K8407K0855m7200K0510K8114m4632J2923L1857m2363P024L6488
460B6417l9875q27L9679l4657o980M0482l0875j2083M2654k6508j8968M3146k0091
473A514k4075M2023j4772k8873M1482q088l4414L8451k28l7532L4065O429l9971
486b3989K9540J3766m1519K2904K0306m0385J6429K4825l8881J0530K9263l6724
498a3935L953L2480l3280j694L4500l0075o954L6575k6383j2552L7777k1978j7729
$$ plain form
411 24882 -27250 -560 28838 -24644 -7586 29726 -18989 -11072 28712 -16164 -14232 29744
423 29744 -11803 -19181 27689 -6290 -20422 25287 -3804 -22531 24965 823 -25715 21500
435 21500 5801 -25796 18462 8606 -27149 16228 13690 -28179 10918 17738 -26275 6803 19998
448 19998 -25566 2841 23696 -23504 -2994 25120 -19512 -6589 25268 -17095 -10071 26417
460 26417 -13458 -14285 25394 -9263 -16243 24239 -6636 -18719 23935 -2573 -21541 21605 1514
473 1514 -22561 19462 4690 -24183 17299 9211 -25203 13248 13020 -24512 9553 15982 -23989
486 -23989 5551 19317 -22202 702 21008 -19377 -2948 21877 -17004 -6474 22789 -13935
498 -13935 -9982 22498 -10782 -12476 22024 -8051 -15005 21570 -4813 -17365 20412 -1566 -19295
511a9295L8371j7269k2890L8291j1670k7830L6914n496l1962L4294J066l5006
523b2482L0316P517l6670K5576J3324l7322K0079J8943l6503J4071K2934l4429
535a4646Q641K6189l2385L180K9186k9291k336L0708k5914o620L2273k3106j1710
548a5831L3854j8669j6758L3626j4172k0695L3700r755k5644L2755l384k9208
560b0181K9389K114l1103K6650P234l3622K2611J3533l3778J6739J7428l2250
572a5236J2722K0751l1929P659K4873k9167J885K6255k6123j616K8075k4353o747
585a2951L0360k0032j1709K9806j6118j4786L0452j2838j9902L0480o769k3718
597a7725K7602k157k5415K6127K112k8836K3225Q418k9613J8165J1891k8918J5503
$$ plain form
511 -19295 19076 1807 -21083 17208 5538 -22292 14622 9126 -22836 11458 12524 -22482
523 -22482 7834 15351 -21319 4257 17581 -19741 338 19281 -17222 -3151 19783 -14646
535 -14646 -6005 20184 -12201 -9021 20165 -9126 -11462 19246 -6668 -13288 18985 -4121 -15831
548 -15831 18023 -646 -17404 16222 2050 -18645 15055 5300 -20344 12411 9027 -20181
560 -20181 9208 11322 -19781 6869 14103 -19519 3092 16625 -17153 -414 17014 -15236
572 -15236 -2514 18237 -13692 -6033 18840 -10327 -8442 17813 -8310 -9926 18149 -6204 -12951
585 -12951 17409 -2623 -14332 15474 -644 -15430 15022 2184 -17718 12762 5993 -17725
597 -17725 9877 7720 -17695 8432 10544 -18292 4933 13351 -16262 1903 13794 -15124 379
610C79J5326l0033J1133K0049k8132N858K1520k6008L189K3946k5466j796K6947
623A6912k1636o718K6779j8590r461K8266j6108j4902K8906j0213j8723K6314
635A0826o211k0484K5711k333k4440K3347L943k5509J8842P042k5284J7012J0478
648A2940k7077J3121J5251k5520Q402J6532k4231O650J9321k4763K022K2862k1654
661f144k470K2996j9595m698K5304j8201j0221K6832j3073j4019K5049r756j6206
674a4202K5504o367k0678K3842k00k2248J9856K819k2426J8448O293k4528J4745
687H58J1194k3395J0315J2582k2368Q781J5426k3211M626J8864k0555M22J9259
700A2798j8954j515K1774j8235o398K3767j4306j0139K3002j1654j2380K3884
$$ plain form
610 379 15705 -14328 -3195 16854 -11278 -5420 16100 -9908 -6719 17227 -8239 -10035 16912
623 16912 -4724 -11442 15337 -3253 -12714 15552 -556 -15458 13448 3235 -15488 10826
635 10826 4615 -15869 9842 7509 -16931 6416 10359 -15150 3692 10734 -14550 2462 12940
648 12940 -14137 -1016 14235 -11285 -2883 13649 -10582 -3932 15389 -9374 -7352 15510 -6144
661 -6144 -8614 14382 -5213 -9911 15393 -2808 -13029 13803 730 -13289 11760 2004 -14202
674 -14202 11302 4935 -15743 8099 7899 -14349 5507 8326 -14100 4348 10641 -13887 858
687 858 12052 -11343 -1028 11554 -10814 -2033 13393 -9818 -5192 13672 -6883 -6461 12798
700 12798 -6156 -7671 14103 -4132 -10530 13237 -1069 -11208 11794 140 -12240 11644
712A1644q796j6877K3204l502j8932K0248m96j9914J9284K846k2221J6239P590
725A0317k1967J2389R617k1434J0547J2334k1967O824J5574k0037L086J6546j8697
738f868Q72J8698j7855l196K0539j4746o667K0427j2399r137K1362j0004j2833
751a1807K1151n855j5249J9580l146j6797J8778Q1j9105J6668L953j9610J3965
764B607O256j9869J2150R051k0523R186J1949j9626O150J3651j8877L688J5793
777A1586j7922J31J7602j5784k938J8282j3711n913J9231j1316r127J9297q048
790A370j1683J8475n257j3610J7592k132j5520J5989R00j6576J4251L439j7390
803a0152J2447O050j8010J0347Q383j8028Q089J0712j7955N622J2851j7396K949
$$ plain form
712 11644 2848 -14029 9175 5673 -13259 6989 6493 -13421 5863 8709 -13512 2727 10317
725 10317 -11650 739 10356 -11078 -531 11803 -10164 -3340 12234 -7803 -4717 11829 -6868
738 -6868 -5996 12702 -5153 -8349 12190 -2556 -9223 11204 -1195 -10332 11030 1026 -11807
751 -11807 9344 3489 -11760 7820 4674 -12123 6655 6736 -12369 4299 8252 -11358 2607
764 2607 8863 -11006 1144 10195 -10328 -1142 10807 -8819 -2669 10982 -7895 -4207 11586
777 11586 -6336 -6205 11397 -4387 -7325 10957 -2754 -8667 10564 -752 -9879 9418 1370
790 1370 -10313 8162 2905 -10705 6887 4755 -10765 5224 6124 -10452 3799 7238 -10152
803 -10152 2295 8345 -9665 682 9065 -8963 -874 9838 -8117 -2495 10356 -7040 -4091
816d091J4676j6332O9J6302j4743k956J7349j2718n741J7840j0361q462J7853
829H685p467j0854J7004m664j2446J5994k078j4133J4723R09j5178J2703L269
842F467j5454J1091N373j6236R293P900j6274O851R727j5815M991J1501j5862
855f447K563J3704j4692m37J4744j3174k457J5694j1935n371J6803r338q135J6212
869G734o862r588J5890m878j1791J5296j618j3267J3256O44j3523J2162K523j4812
883h834J0540N583j5013P898P229j4480O499Q791j4925M258J1293j3921J263J2232
897H413j2611l32J3411j2153l108J5014r830n883J4541p830o991J4755o570r403
911h577J4790l436j1156J3192j514j1607J2775J38j3441J1659L242j3807R112
$$ plain form
816 -4091 10585 -5747 -5678 10624 -4119 -7075 10274 -2444 -8185 9655 -706 -9168 8685
829 8685 1218 -9636 7368 2704 -9742 6252 4174 -9959 4764 5673 -9505 3198 6467
842 6467 -8987 2104 7477 -8759 534 8434 -7840 -989 8738 -7077 -2086 9415 -6447
855 -6447 -3884 9820 -4872 -5309 9435 -3739 -6196 9498 -2437 -7808 8995 -343 -8478 7734
869 7734 872 -8716 7174 2296 -9495 5801 4183 -9084 4172 4816 -8707 3455 5978 -8834
883 -8834 1706 7289 -7724 174 7403 -7077 -578 8213 -6712 -2454 8839 -5082 -3819 8413
897 8413 -4198 -4530 8881 -3272 -6380 8634 -1196 -7079 7462 -368 -7359 7396 826 -8577
911 -8577 6213 2777 -8379 4813 3299 -8308 4467 4605 -8836 2823 6065 -7742 1370
924A370M752j3545Q284O422j4559O116R232j3617L181R953j2500J861J1364j2364
938d050q95J3124j0191l556J2684q528m575J3269p506p132J3632m623q868J2284
952E069l113r262J2261j698j1455J1646J236j1989R663K407j2117R417M089j3611
966g457P553O891j2927M886P743j2353M003R365j2762J491J1362j0834j132J0975
980F804r336k291J2141q614n063J2730n731o790J1386m378p236J1586l016r521
994g329J1134k12j0227R409R30j0447R281K532j2136P868N196j1888N785N978
1008E874j1747N172P694j2385K819R787j0970M40J0052j0026o33J1189r495l182
1022e411J2057p186n011J1227n685n893J1564m481p958J1199j879q860R755n85
$$ plain form
924 1370 6122 -7423 861 7283 -7276 -1160 8072 -5545 -2364 7589 -4911 -3050 8314 -4050
938 -4050 -4945 8179 -2012 -5568 7116 -1412 -5987 7282 -224 -7356 6276 1653 -7215 5069
952 5069 1956 -7306 4955 3257 -8198 3448 4684 -7305 2358 4765 -7352 2065 6154 -7457
966 -7457 96 6987 -5940 -1054 6689 -5664 -1661 7704 -5058 -3567 7795 -3039 -4171 6804
980 6804 -2532 -4823 7318 -1296 -6359 6371 640 -6150 5236 858 -6378 5208 2192 -7329
994 -7329 3805 3593 -6634 2775 3705 -6742 2539 5071 -7065 803 5999 -5889 -104 5874
1008 5874 -5873 -701 6993 -5392 -2573 7214 -3756 -3316 6736 -3290 -3923 7266 -2229 -5411
1022 -5411 6646 -540 -5551 5676 -9 -5902 5662 1181 -6777 4422 2543 -6317 3438 2853
1036B853r269R471R29j0648Q338L253j0817O628M356j0851N829N976j1462L996
1050a418P836j0701K065Q512j0106Q54R731r725j272J0729q175l032J0713o998
1064i87m252J1120n781o088J1082l834p262J0349k456q129J0033q06r431R104
1078B662J219r939P823K633j0270O755M317j0672N154N954j0338L461P093r945
1092d093J929Q297r396J25R184q382j479R674p401k927J0112o279m401J0227m961
1107B29n665J0182l644o923R964k145p981R395o15q869Q695J038r623P640K675
1122D353r977O386M204j0213M942N806j0009L167O955r326J614P847q775kQ777
1137E749p725j774R090o516k966R273n546m413R578m118n773R160k767o500Q947
$$ plain form
1036 2853 -6416 3055 3984 -6664 1674 4927 -5890 738 5094 -5757 72 6048 -5414 -1418
1050 -1418 6418 -4283 -2218 6294 -3812 -2958 6773 -2952 -4224 6505 -1670 -4702 6011 -987
1064 -987 -5239 5881 100 -5988 5094 1260 -6002 4347 1891 -6238 3795 2989 -6442 2662
1078 2662 3881 -6058 1765 4398 -5872 883 5200 -5472 -318 5636 -4702 -1241 5852 -4093
1092 -4093 -2164 6133 -3263 -3138 6046 -2336 -3815 5859 -1542 -4469 5643 -636 -5037 5190 229
1107 229 -5436 4746 1102 -5821 4143 1998 -5983 3412 2797 -6072 2623 3661 -5962 1678 4353
1122 4353 -5624 762 4966 -5247 -305 5501 -4508 -1341 5614 -3712 -2098 5749 -3026 -3028 5749
1137 5749 -1976 -3750 5340 -1176 -4142 5131 -415 -4828 4750 632 -5141 4019 1252 -5248 3699
1152C699j729p692Q713J5q650P655J436q869O959K617r629N958M499r758M216
1167e60N581r232L131O523r288J617P952q320m09Q201p095j390Q556o533k973
1182d239R227m960m570Q653l578n114Q574k781o514Q595q64p572P415M04p645
1197d969P013J311q722O358L381r065M679M326q612L977N232r120K637O960q418
1212c032P31P190p480Q1P764p389j563Q909n964l241Q387m663l746Q512m128n292
1228d924Q770k182o471P621r12o593P401j5p895O765K133q197N099K982p900M661
1244C43L967q638L418N717q067J648O010p381J134O791p556m11P989o302j999
1259c337P677n386k452Q172n059m121Q657l226n322P723k196n635P827j312p111
$$ plain form
1152 3699 1970 -5722 2991 3006 -5644 2011 3447 -5422 1537 4154 -5475 483 4982 -4776 -560
1167 -560 5021 -4211 -1080 5443 -3845 -2228 5724 -2596 -3005 5196 -1899 -3289 5267 -1266 -4239
1182 -4239 4988 28 -4542 4111 533 -4581 3993 1212 -5302 3293 2429 -5143 2272 2676 -4969
1197 -4969 2044 3355 -5367 991 4372 -4693 -14 4312 -4300 -323 4909 -4211 -1574 5386 -3032
1212 -3032 -2301 4889 -2591 -2510 5254 -2135 -3698 5211 -753 -3994 4393 -270 -4016 4496 368 -4924
1228 -4924 3846 1664 -4807 2814 1902 -4691 2710 2695 -5200 1565 3698 -4499 600 3582 -4318 343
1244 343 4310 -4328 -910 4807 -3260 -1612 4398 -2983 -1849 4942 -2614 -3025 4964 -1338 -3337
1259 -3337 4340 -1046 -3498 4674 -385 -4506 4151 925 -4397 3326 1130 -4505 3322 2010 -5101
1274e101P347P99p546N837J680p406N461K747q285M212M626p783K413N003p182
1289c178J918N834p406L52P056o230j144O815n460j569P440n259l174Q007l637
1304C65m338P343k824m675P627k110o167P424k33o783O272O26o900O044J681p881
1320d529N011L464p640L443M035p244K830M942p449J368O159o509j17O222n774
1335a788p79O771n392k250P318m049l374O893l215l888P104k479n170P024r62
1350A764n883O223n1o180N973R04p005N270K337p136M166L105p079L478M069p250
1366c295K298N122o730J051N574o219J53O164n743j182O689m734k276O700l905
1381c33l128O794k959m216O685j757m979O231p54n513N819K63o118N271J381o408
$$ plain form
1274 -5101 2246 3045 -4501 1336 3016 -4390 1071 3818 -4467 -255 4371 -3412 -999 4004 -3178
1289 -3178 -1260 4574 -2832 -2480 4576 -1654 -2798 4017 -1443 -3012 4428 -831 -4005 4002 365
1304 365 -3973 3370 546 -4129 3498 1388 -4779 2645 2412 -4371 1901 2527 -4373 1671 3352 -4529
1320 -4529 482 3946 -3694 -251 3784 -3460 -630 4312 -3137 -1769 4390 -2119 -2236 3986 -1788
1335 -1788 -2567 4204 -1188 -3438 3880 -169 -3543 3350 135 -3753 3351 872 -4298 2726 1764
1350 1764 -4119 2104 2053 -4127 1846 2750 -4255 1015 3352 -3784 382 3487 -3592 -114 3955 -3295
1366 -3295 -997 4125 -2605 -1554 4020 -2199 -2046 4118 -1625 -2807 3882 -852 -3128 3572 -333
1381 -333 -3461 3333 374 -3842 2843 1086 -3893 2338 1584 -3929 1890 2153 -3965 1306 2687 -3721
1397c721M471K330o635L712L237o644K823M064o529J970M726o262R23N428n827
1412a934j17N879n237j130O324m642k102O439l774l008O534l004l814O405j822
1427I97m768O032p52n237N485K42n777M970J423o114M016K353o052L299L038o129
1443b974K478M010n966J361M612n599P26M944n354j77N625m867j231N776m099
1458g35j883N999l758k803O268k653l795N882j668m233N721j118m936N494K41
1473B023n534M523J212n433L949J863n863L279L110n789J994L642n232J453M038
1488C235n349N87M991m757p01N044l981j097N229l887k044N819k906l083N386
1503B486k063l289N371j726m188N469m37m878M569L72m767M323Q38n430L888K187
$$ plain form
1397 -3721 750 3080 -3555 157 3394 -3250 -427 3637 -2892 -922 3804 -2458 -1535 3893 -1934
1412 -1934 -2051 3828 -1409 -2539 3785 -857 -2959 3480 -294 -3302 3232 228 -3586 2819 997
1427 997 -3771 2261 1509 -3728 1757 1999 -3778 1192 2615 -3499 517 2870 -3182 117 3155 -2974
1443 -2974 -496 3514 -2452 -1091 3521 -2078 -1352 3592 -1762 -1939 3686 -1181 -2412 3364 -735
1458 -735 -2618 3381 -377 -3180 3088 435 -3360 2522 854 -3379 2342 1224 -3712 1782 2023
1473 2023 -3511 1012 2224 -3209 740 2603 -3260 19 3129 -2660 -666 2976 -2256 -803 3235
1488 3235 -2114 -1527 3464 -1293 -1994 3050 -931 -2028 3201 -686 -2730 3089 183 -2900 2486
1503 2486 423 -2866 2505 779 -3409 2060 1623 -3255 1314 1686 -3081 1242 2080 -3350 538 2725
1519B725n526K660K696n055K254L164n383J409M281m839P2M356m097k80M609m080
1535a034j274N289l096k364M876k299k546M942k008l525N106p80m136M271j17
1550A305m070M205K73m834L904J540m974K855J961m674K659K432n160J962L520
1565B904m766Q18L630m250N40M060m371m72M793l440j519M464k765j736M683k516
1581E7k770M861j263l439M121o38l433M106k17m251L810J017m379K836J404m167
1597b345K736J851m683K118K876m400J157K993m053R72L456m275Q7M203l559q19
1613a685M015l062j058M340k897k044M625j824k738M067j219k857M089p47l652
1628b647L837L74l874L005Q55l802K823J376m231K207K329m044J343K542l758
$$ plain form
1519 2725 -2801 -141 2555 -2500 -246 2918 -2465 -1056 3225 -1614 -1542 2814 -1283 -1563 3046 -1034
1535 -1034 -2308 2981 -115 -2479 2397 98 -2448 2494 486 -3039 2067 1287 -2849 1422 1305
1550 1305 -2765 1440 1713 -3121 783 2323 -2651 204 2165 -2509 150 2582 -2578 -616 2904
1565 2904 -1862 -1044 2586 -1664 -1124 2936 -1435 -1907 2886 -554 -2073 2391 -374 -2110 2573 57
1581 57 -2713 2148 885 -2554 1567 929 -2504 1602 1385 -2866 944 1961 -2418 418 1822 -2345
1597 -2345 391 2242 -2441 -323 2553 -1847 -690 2303 -1750 -778 2678 -1597 -1510 2693 -866 -1685
1613 -1685 2330 -732 -1790 2550 -347 -2391 2234 410 -2328 1739 520 -2337 1752 1005 -2647
1628 -2647 1190 1564 -2310 695 1550 -2252 571 1947 -2284 -77 2252 -1792 -449 2093 -1665
1643a665J067K975l902L43L607l394m30L592l000p34L880k844j494M172k126k110
1659b063L914j620k376L947j195k992L821l56l353L321K07l505L067P81l836K576
1675C38J532l819J907J983l715J447K453l697Q01K965l381J01L223l053m43L488
1691B130k709j057L664k241j595L677j769k071L675j267k534L552p04k899L363
1706A215j67l198L076L89l415K738Q93l587K357J473l676J828J983l572J293K361
1722A991l485P70K849l260L4L127k834m75L270k527j040L513k025j698L457j437
1738B30k040L318j038k464L305m22k899K944J37k974K686M70l258K488J120l440
1754a837J906J563l271J590J812l421J252K431l332M94K695k921J37K858k873
$$ plain form
1643 -1665 -598 2377 -1525 -1182 2425 -969 -1399 2193 -807 -1541 2339 -505 -1999 2173 47 -2063
1659 -2063 1851 231 -2145 1802 607 -2385 1436 1080 -2273 1048 1255 -2250 817 1598 -2238 338
1675 338 1870 -1949 -42 1941 -1774 -327 2126 -1571 -770 2195 -1186 -1085 2138 -915 -1358 2130
1691 2130 -579 -1636 2028 -213 -1808 1869 100 -1971 1704 437 -2097 1455 751 -2148 1215
1706 1215 1048 -2150 926 1315 -2100 638 1531 -2056 301 1774 -1902 -74 1909 -1663 -370 1991
1722 1991 -1494 -724 2125 -1135 -1101 2026 -808 -1283 1987 -540 -1580 1933 -92 -1790 1667 230
1738 230 -1810 1508 470 -1994 1311 889 -2010 934 1071 -1903 783 1253 -2005 483 1603 -1837
1754 -1837 69 1632 -1639 -49 1763 -1658 -406 2025 -1307 -813 1882 -1039 -902 1956 -917
1769i17l85L304k412j143L230j817j379L190j606j931L373q76k512K916k59k500
1785a724K719l6k900K635P21l158J969J166k936J745J333l221J482K085l188O98
1801f10K279k784N40K381k945J11K993k592o62K934k087p88K969k075j322L327
1817A669j411j968K930q45j958K833o89k477K900J38k849K215O21k644K027Q17
1833A309l032J798J606l016R91J836k648Q40J998k895M18K650k562l49K586k100
1849e70m32K670k180r34L084j603j562K788j165j537K816j088k089K931l31k455
1865a657K386O5k347K335K67k812K126J087k880J412J355k626J251J600k891Q06
1881e23K264k582N9K261k193q1K441k267o30K848j698j234K588j292j264K672
$$ plain form
1769 -917 -1302 2002 -410 -1553 1677 -140 -1519 1671 65 -1866 1507 631 -1881 1035 776 -1724
1785 -1724 995 959 -1941 694 1415 -1743 226 1392 -1544 201 1534 -1687 -205 1880 -1308 -610
1801 -610 1669 -1115 -575 1806 -1139 -1028 1965 -627 -1289 1645 -442 -1230 1739 -336 -1658 1669
1817 1669 258 -1710 1220 375 -1583 1250 561 -1916 984 1122 -1727 488 1109 -1535 492 1309
1833 1309 -1723 75 1681 -1335 -344 1492 -1156 -316 1682 -1213 -795 1855 -707 -1056 1530 -570
1849 -570 -1002 1668 -512 -1446 1638 35 -1527 1261 96 -1441 1375 287 -1802 1129 798 -1657
1865 -1657 729 794 -1553 782 1049 -1763 363 1450 -1430 -18 1337 -1289 -38 1562 -1329 -523
1881 -523 1741 -841 -782 1479 -714 -795 1646 -621 -1251 1597 -101 -1335 1253 -39 -1303 1369
1897A369j219j809K798n41k146K373k38k105K403n1k573K271O75k669J683R01
1913A122k512J613J168k836J216J823k627N42J934k359L64K186k426j75K578j896
1929b85q48K467j525r68K581j431j488K703p99j871K337l80j944K339j80k317
1945a609K179M36k435J761O54k369J660R38k625J349J462k548Q75J626k403O64
1961c85J886k428K19K260k142k82K280j837n42K404j644j023K542j181j431K389
1977A085p80j646K317m54j978K197L3k180J892M18k283J673P89k412J373J175
1993A219k412J028J458k361P12J716k288L67J964k153J6K136j946l55K287j712
2009c24p03K360j452j045K405j116j402K356p40j633K230m05j909K122L2k158
$$ plain form
1897 1369 150 -1659 1139 598 -1548 825 587 -1518 885 834 -1739 532 1207 -1462 221 1122
1913 1122 -1390 223 1391 -1445 -229 1594 -1033 -491 1443 -916 -552 1634 -792 -967 1611 -285
1929 -285 -1133 1334 -191 -1159 1422 -9 -1497 1206 407 -1464 873 493 -1451 888 708 -1609
1945 -1609 570 1006 -1429 332 986 -1383 277 1215 -1410 -61 1401 -1147 -272 1354 -1049 -385
1961 -385 1501 -927 -708 1552 -590 -872 1408 -429 -971 1433 -211 -1234 1308 127 -1304 1085
1977 1085 305 -1341 976 522 -1456 741 774 -1406 486 904 -1379 294 1083 -1329 44 1219
1993 1219 -1193 -165 1293 -1068 -356 1360 -928 -561 1403 -750 -734 1402 -544 -899 1388 -324
2009 -324 -1027 1333 -119 -1164 1241 125 -1277 1079 339 -1294 936 531 -1378 744 776 -1382
2025a382J827M78k210J545P82k323J310J211k374Q55J540k205N27J704k152K25
2041f42K029k003k62K155j669n15K176j562p96K361j259j223K267q62j368K191
2057A018p05j644K245k75j981J956J30j990J776L19k202J661Q36k356J140J188
2073A116k143Q85J337k244O05J819k102j6J968j746k27J989j702n60K315j359
2089f5j117K188r11j181K114q63j472K254l82j863J924Oj776J790P8k070J787
2106D41O31k273J286R15k035J131J004k250R49J542k179L11J680j813J40J731
2122A211j882j70K150j571p75K052j118q54K012j075j220K223n60j676J891j47
2138D91j600J776q2j893J800M77k110J285P71j919J188Q25k123J016J350k098
$$ plain form
2025 -1382 445 923 -1287 258 1040 -1283 27 1238 -1136 -281 1259 -946 -419 1285 -867 -642
2041 -642 1387 -616 -878 1277 -392 -907 1269 -293 -1089 1272 13 -1210 1057 195 -1173 1018
2057 1018 313 -1331 914 639 -1342 614 744 -1246 530 849 -1353 308 1144 -1212 -72 1116
2073 1116 -1027 -142 1195 -1049 -444 1375 -727 -743 1225 -521 -748 1241 -461 -1021 1294 -65
2089 -65 -1182 1006 95 -1086 1028 165 -1307 947 565 -1298 626 632 -1144 646 724 -1346 441
2106 441 1072 -1201 85 1000 -1035 96 1100 -1150 -201 1341 -838 -527 1153 -660 -520 1211
2122 1211 -671 -841 1309 -262 -1037 1015 -103 -957 1055 -20 -1240 983 423 -1253 638 491
2138 491 -1109 667 585 -1308 492 969 -1141 144 915 -1004 184 1009 -1114 -98 1252 -846
2154h46M68J458j780L62J506j920Q8J938j664m64J864j280n45J895j279q98K124
2171A027q20j339J839m29j328J802l29j686J813K45j915J354N47j778J248O63
2187I14j999J048J177j960N25J312j727M45J394j838J42J774j594l31J703j299
2203c14l77J759j318p17J976r23j091J774o31j121J802n32j460J795j9j671J423
2220C55K54j605J334M42j861J154R30j851O68J103j654N22J270j741J88J606j517
2237d03k52J610j271l20J657j220o73J835r03r82J670o34j023J673n05j295J659
2254F23j31j503J456Q5j528J361K88j655J180O52j690Q36Q51j612O66J040j642
2271g23L95J352j542K9J442j351j76J528j204m87J623r30p85J591o50j013J623
$$ plain form
2154 -846 -378 1080 -700 -338 1168 -752 -664 1274 -390 -854 1010 -270 -815 1080 -199 -1097 1027
2171 1027 207 -1132 707 278 -1050 752 423 -1263 550 795 -1120 234 781 -997 251 914
2187 914 -1085 -37 1140 -820 -295 1017 -710 -265 1129 -709 -567 1207 -387 -718 985 -314
2203 -314 -691 1068 -250 -967 1009 86 -1005 769 138 -983 819 287 -1173 622 603 -1068 355
2220 355 609 -996 338 780 -1081 73 1003 -848 -180 923 -731 -209 1061 -680 -492 1114 -403
2237 -403 -655 955 -316 -636 1021 -199 -872 963 60 -922 748 114 -909 764 259 -1036 623
2254 623 492 -1011 445 530 -998 363 651 -1004 176 828 -862 -26 825 -787 -121 919 -723
2271 -723 -328 1024 -518 -489 953 -398 -574 954 -250 -737 886 -44 -829 762 112 -901 722
2288G22m92j172J540j56j450J463N2j402J261K54j523J138M73j571R48O87j605
2305h33P74R34j550M92J091j489K48J261j401KJ355j240j85J417j108m42J525
2322H51q79p92J531o01r24J446l84j143J456j21j364J279K02j400J099L66j496
2339h74J016O39j567P19Q67j461N30R35j452L96J163j415O6J274j195r9J279j163
2357c42k44J455j005n79J432p17p05J376o24q77J462l57j136J296%j208J159P3
2375D59j326J138M14j471P95P21j440O94P43j427N42J072j470J55J202j156l1
2392c86J170j086k52J390j029n48J421p54n29J281p35p20J456m58j027J316j82
2409C28j048J209j32j221J279J66j440R22M59j132P41M51j330O91R25j432L22
$$ plain form
2288 722 230 -942 598 442 -1008 455 507 -895 366 620 -903 235 708 -863 85 772 -833
2305 -833 -59 875 -675 -183 908 -581 -333 928 -473 -471 884 -356 -541 876 -232 -674 851
2322 851 -28 -820 711 110 -814 632 248 -895 561 440 -924 355 557 -843 256 622 -874
2339 -874 142 781 -786 -67 800 -661 -131 804 -648 -252 911 -504 -438 836 -359 -458 821 -342
2357 -342 -586 869 -136 -715 717 0 -705 671 47 -830 632 275 -861 435 435 -773 386 459
2375 459 -867 271 685 -786 9 730 -710 -16 727 -700 -158 914 -556 -401 801 -355 -386
2392 -386 784 -302 -554 836 -193 -741 680 -74 -603 678 -57 -777 679 221 -806 510 328
2409 328 -720 489 357 -864 415 581 -859 63 522 -610 131 582 -748 -57 868 -564 -242
2426b42R71j127J76R90j243K0J344j071m21J307q12m13J216p96o27J512n88r82
2444g86J264k25r32J180k09j152J272R2j264R77K86j138R10K41j382R51N52j255
2462f18M56Q13j175M03Q27j334K82J171j161j07J138r22k33J170q99m35J363o84
2480E5p89J249l32q82J183l24r84J287j14j055R31K10j118R46K40j307R70N12
2498F78j313N90O59j132M64O71j217M08R67j169M1R82r29l1J038j016j99J236
2516G28p91n43J131n82n28J188n23q10J249k17j028J074j0j010R96J18j196R49
2534A95M05j248O63N69j154N74O51j251M35Q96j174J60R45j042O8J017j051r5
2552d37J146q77l40J106p09m19J135o49n99J198m32p79J082k27q45J059j24r91
$$ plain form
2426 -242 729 -398 -222 768 -475 -455 889 -182 -603 704 -108 -521 695 -101 -728 784 196 -786
2444 -786 478 253 -679 501 292 -860 412 504 -760 217 503 -635 275 516 -866 85 637 -618
2462 -618 -162 651 -524 -121 706 -628 -346 825 -336 -443 695 -227 -460 710 -189 -624 739 55
2480 55 -734 515 183 -699 484 160 -824 463 349 -706 225 435 -683 263 503 -804 166 678
2498 678 -635 -45 614 -518 -54 617 -600 -192 775 -394 -353 629 -300 -331 707 -309 -508 728
2516 728 -63 -606 525 -57 -585 603 80 -730 519 302 -726 348 338 -672 324 442 -754 195
2534 195 600 -648 15 584 -570 4 655 -596 -161 735 -439 -279 666 -376 -308 709 -342 -437
2552 -437 709 -168 -508 598 -111 -530 605 -44 -643 555 123 -656 426 199 -646 413 289 -702
2570g02J015J36j072P78L43j062O09N62j196M97P37j185L12Q97j074J41R14r85
2588c35n9J078r16k39J145q31l58J123o62n38J147n03o81J110l39p96J056j77
2606B25q69R91m1r68R19J56j056P90L43j059O33M65j074N11O57j087L00Q07j009
2625c66J31Q73r56l6J026q66k68J066o84m15J068n96n63J125m25p69J064j99q20
2644f10R77j33q95R63Q2j029Q09K59r86O76L33j023O25N28j086M09O83r69K55
2663a32P13r71J59Q97r30j15R74p36k27R48p02l65J098n65o46J045l00o98R55
2682D02k32q06J004k8r99Q39K17r60P10K54j014O95M71j097M45O37r48L26O26
2701E42r87K68Q21r67j5R08p73q6Q42p69j90J024o41m93R89m11n12Q99l87o44
$$ plain form
2570 -702 313 449 -623 155 498 -564 45 607 -589 -92 645 -540 -228 669 -405 -264 650 -335
2588 -335 -394 684 -232 -471 674 -157 -515 608 -54 -592 555 52 -629 481 142 -654 402 225
2606 225 -644 347 306 -662 257 413 -643 147 490 -569 64 529 -545 -34 623 -464 -164 643 -366
2625 -366 -235 638 -318 -354 672 -194 -462 604 -80 -495 573 -23 -586 539 114 -655 409 210 -610
2644 -610 367 234 -661 302 384 -645 164 423 -563 113 446 -577 48 576 -510 -101 582 -387 -132
2663 -132 581 -390 -231 666 -264 -379 595 -141 -368 580 -122 -487 611 46 -600 445 145 -553 402
2682 402 170 -636 368 340 -659 180 397 -563 147 401 -613 82 553 -544 -99 538 -410 -84 542
2701 542 -445 -177 644 -323 -338 570 -203 -289 553 -216 -406 618 -23 -516 473 62 -450 449 62 -582
2721e82J025j70q99Q76O8q49P58J13r67P73L70j084N30N37r46L89N59r99L41Q11
2741F54j009M7Q69p96m0Q37q30j03R98p37l80R88m76m41R01m82n29J009k82p57
2761e59Q55o0p28P90m8q47Q25K05r98O02L97q96M96M21r74M34O66r81J59P69q33
2782c05O1Q04q62n2R69p57l16R59n51l79R36n33n03J022l40o98Q97j64o85Q42
2802C45j06q12Q33J06q91O47K58q43N66L13r15M94N28r37K74O31q32J83O75q44
2822c27M3Q58p59k03Q83n98k88R01n74m40R90l76o47R08k03o75Q56j26p87Q24
2842B60Q6q82O75K26q61O04L03r15N15M86r02L10N59q17K34O18q37J07P59p51
2862b23q8P97o48j82Q30n87l38R10m46n11Q83l03n87Q42j68p17Q33oq29P35J46
$$ plain form
2721 -582 443 273 -626 250 318 -531 227 340 -627 146 516 -568 -38 499 -447 -58 501 -498 -157 654
2741 654 -355 -308 561 -235 -275 562 -268 -371 627 -110 -490 498 22 -419 482 0 -529 480 198 -559
2761 -559 296 236 -492 298 250 -597 228 433 -565 37 434 -462 34 455 -519 -85 581 -400 -241 528 -305
2782 -305 -244 560 -302 -354 615 -142 -458 501 -50 -429 507 -26 -529 493 153 -545 352 188 -497 345
2802 345 239 -573 260 366 -525 122 380 -463 103 416 -499 -5 523 -414 -140 491 -341 -158 517 -327
2822 -327 -284 574 -185 -388 495 -103 -391 510 -64 -504 486 110 -537 371 168 -507 349 223 -564 260
2842 260 346 -536 139 365 -496 108 411 -504 11 497 -405 -95 464 -353 -119 499 -338 -231 528 -223
2862 -223 -311 486 -162 -344 486 -101 -439 471 25 -486 397 94 -493 349 181 -536 297 291 -538 197 343
2883C43q55O36K82r02N35M33r22L92N54q81K49O44q52J37P30p90j1P90p05j37
2903c30Q25o06k77Q56n09l81Q73m03n23Q43k51n94P91j29o83P56K7p94O60J98
2923C49q24N59K90q39M80M51q91L21N88q28J94O41q06R5P51p57j08Q31o08k25
2943c36Q17n65l12Q84m84m65Q38k75n44P69j97o07P80p6p30O88J10p30N77J66
2963C08p65N41L27q53L87M85p73K50N22p78J81O87p89k1P56o10j62P47n82k31
2983c73Q72n12m33Q47l17m89P61k47n84Q14j09p23P07P0p08O08J06p72O10K80
3003D08q47M19M29p43L14M21p67K66O00p84M8O84o41m2O62o65j20Q77o06l17P97
3024C93l83l92P53l63m56Q19j84o80P26M4p05O34N1p58O67K27q60M89L85p65L91
$$ plain form
2883 343 -512 124 406 -496 39 472 -450 -58 496 -385 -136 508 -344 -207 523 -267 -278 512 -193 -330
2903 -330 495 -111 -388 468 -41 -422 451 48 -475 368 117 -477 314 185 -498 258 285 -509 151 349
2923 349 -475 84 374 -465 15 466 -425 -104 484 -344 -150 491 -315 -220 531 -226 -334 497 -111 -336
2943 -336 481 -84 -396 488 4 -461 377 102 -442 327 130 -477 303 227 -503 185 295 -435 142 308
2963 308 -457 84 411 -442 -55 430 -343 -93 429 -349 -168 519 -270 -291 465 -145 -307 440 -142 -373
2983 -373 499 -13 -446 401 84 -405 356 109 -475 339 230 -493 214 284 -424 184 290 -482 128 408
3003 408 -439 -20 409 -334 -20 401 -366 -100 500 -284 -236 448 -193 -235 427 -238 -358 519 -87 -404 393
3024 393 10 -382 371 8 -448 371 187 -493 233 277 -428 206 257 -501 166 393 -467 22 407 -358 33
3045C3L79q26L27N92p94J01N84n82k5O81o83p0P77n89k42P64n04k72P67m11m32
3066d25Q20k67o19P63p3o50O81k1p04P61M9p95N45L40p98M41K87q16M09N46q47
3087c73K24N59o77R7O27p30K1P71o64k06P75n13k33P72n21l28P86l80m94Q11j93
3108A31n29P12j53o18P03L0p45N97J54o88N37J99p67M79L92q12K94N36p76K20
3128a04N69p97J22P35p30p0P29n68j80P75n85l03Q42m36l94P87l26m70P66k33
3148A29o11P63j05o44O94M2p08O66P6q08O36K37p62L72L76p08K98M97p59K01N95
3169D77p54L6O36n86m6P33o33k05Q09n19l35Q25m42m03Q12l35n11P94j96o29P65
3190B93o8o87O99M4p39O23J77p93N39K90p96M32L89p71L14M80p60K10N69p36Q2
$$ plain form
3045 33 412 -414 -87 505 -289 -188 396 -186 -211 470 -213 -283 494 -95 -337 427 -77 -349 418 7 -425
3066 -425 395 128 -491 272 199 -451 230 209 -495 266 315 -480 65 405 -393 48 335 -481 -72 474 -373
3087 -373 -149 410 -267 -170 457 -273 -252 519 -145 -351 424 -89 -322 450 -71 -399 387 7 -487 324 131
3108 131 -398 314 161 -457 246 276 -469 128 282 -406 131 330 -437 42 434 -378 -84 452 -324 -104
3128 -104 465 -332 -210 525 -205 -275 454 -114 -294 481 -104 -407 435 -1 -395 392 66 -404 362 129
3148 129 -482 281 176 -468 226 268 -440 226 302 -506 130 367 -395 -23 353 -355 -57 440 -319 -118 477
3169 477 -277 -241 395 -191 -237 496 -137 -342 467 -52 -387 438 -4 -407 405 70 -441 353 157 -472 293
3190 293 225 -462 237 281 -458 165 342 -451 88 378 -418 14 403 -368 -54 426 -334 -124 445 -291 -209
3211b09O53o65k7O92o08j50P59n23k96P91m19m00P87l26m94P89j97o30P51l7o91
3232d50O76N8p52O40K04q28N19L50q15L93M22q00L26N24p95J51O22p02M0O51o73
3253b39l2P38o24j97P68m76k94P35m10l70P96l23n34P59j30n90O79m9o53O89O9
3274C12p80N79K50p62M60L19p94M17M56q32K49N94p51J27N99p36O6P17o89j44
3294c43P81n26k46P34m79l16Q11l81m91P75j99n20O93j68n83P32rp24O23J30o90
3315c96N20J92p48N01L71q36L27N04p38K17N14p57J57O85p40o5P42n99j51P32
3335D32n71k37Q45m74m51Q12k83m91P60k54n76Q05r1p16O70Q7o64N56J34p36N56
3356A13K96q14M00M00p21K93M40p60K38O04p55L8O73o21o3O83o30j41Q06n45l44
$$ plain form
3211 -209 444 -221 -248 444 -164 -314 445 -78 -374 417 -2 -402 385 59 -435 354 157 -473 278 241 -450
3232 -450 226 284 -468 172 376 -452 67 417 -398 -5 417 -383 -57 467 -328 -177 445 -257 -217 434 -239
3253 -239 -271 467 -157 -354 414 -62 -356 379 -31 -401 395 72 -462 297 167 -423 256 207 -446 243 312
3274 312 -468 111 361 -401 59 378 -416 1 457 -375 -126 468 -283 -156 443 -293 -227 490 -199 -343
3294 -343 438 -88 -334 400 -79 -395 416 35 -456 319 120 -400 293 125 -458 274 265 -459 164 294 -396
3315 -396 124 316 -432 69 440 -396 -69 435 -303 -86 428 -329 -172 513 -227 -292 450 -149 -300 432
3335 432 -139 -376 469 -5 -456 356 73 -418 342 88 -488 317 226 -490 180 267 -397 159 293 -443 113
3356 113 409 -405 -5 395 -326 -33 407 -353 -115 489 -266 -228 445 -176 -239 444 -186 -327 479 -66 -410
3377d10Q06l75m15P68l23n32Q39j83o66P40k5o72O63M2p38O45J99q10M90L29p45
3398c73L84L99p88L08N39p82J49O03o81N6O32o71m7P46n96k08P50m75k96P68m21
3419dm17Q18k78n75P62j35o25P13m4p09O96J18p88N84K43p81M88L28q19L90M93
3440D58q16K42N63p51J54O19p33K7P16o52j18P27n58k10P62m93l29P88l50m60
3460d14P56k25n31P20j28o28P00Kp05O17J44p49N46K70q00M51M06q15L22M94p76
3481c43K20N89p67R6O81p14l8P37o34j47P75n46k88P94m31m05P95l16m81P61k05
3502A33n63P15q1o45O70M2p10N80J86p46M96K95p65M11L91p78L01N05p49J78N77
3523D43p25P5O75o75r4P55n87j95P58n09l06Q08l99m67P93k40n36P38j74n95P44
$$ plain form
3377 -410 396 21 -394 374 51 -481 358 175 -491 249 224 -448 215 257 -481 164 363 -447 43 372 -373
3398 -373 11 410 -378 -70 469 -313 -164 439 -242 -186 446 -225 -272 474 -122 -330 420 -55 -351 417 -4
3419 -4 -421 397 119 -456 306 171 -454 259 215 -494 202 320 -468 116 359 -422 66 394 -425 -35 458
3440 458 -358 -116 447 -304 -150 469 -264 -237 479 -173 -291 436 -122 -332 430 -63 -392 396 46 -414
3460 -414 342 117 -414 306 178 -450 250 252 -453 164 308 -441 105 375 -425 26 432 -383 -61 433 -343
3481 -343 -123 466 -301 -205 476 -238 -276 461 -173 -320 455 -91 -379 415 -16 -421 374 58 -423 338 133
3502 133 -430 285 204 -441 229 271 -439 141 327 -419 77 372 -393 18 409 -369 -68 437 -312 -134 443
3523 443 -282 -207 468 -207 -301 454 -133 -328 430 -79 -385 423 24 -443 350 110 -426 312 138 -457 287
3544B87o0p01O60J11p19N52J90p43N02L15p86L73M35p32K54M82p30J72O01p15
3564b52J9O73o16r5O91n70j86P87m93l66P87l36m47P42k68n33Q00j54o72P11M2
3585B64o97O12R0p25N98K37q12M42L79p44L39M23p56K71N50p55R3O29o46lO27
3606D16o15p1P13n37k80P50l96l29P04l43m32P78k28o01P13m9o17O23K8o90O45
3627A82J55p92N18K91p07L96L61p81L44M96p86J61O01o40L5O02o98M3P10o13k06
3648c28P12m51k68P14l95l85P69k71n50P61j51n40O24r9n97O72J25p92N53K44
3668C47p23M40L07p71M17M02p79K25N61p23J60N87p27K7P62p00j55P72n14k16
3688c01P35n25l11Q29l85m94P91k66m66O92j55n69O55qo79O16J10o73N54J40p03
$$ plain form
3544 287 227 -474 186 297 -422 130 320 -423 79 394 -392 -19 416 -316 -62 420 -310 -138 463 -252
3564 -252 -233 440 -176 -271 420 -150 -336 451 -42 -408 379 43 -404 338 70 -463 337 183 -489 222 264
3585 264 -433 179 269 -456 142 379 -433 9 388 -356 -17 406 -350 -79 471 -284 -191 438 -208 -211 416
3606 416 -199 -270 443 -94 -374 376 -20 -349 355 12 -420 358 130 -471 242 193 -424 199 227 -463 182
3627 182 337 -455 63 354 -353 43 404 -377 -33 463 -323 -162 439 -201 -166 436 -262 -219 491 -122 -328
3648 -328 384 -67 -335 379 -16 -401 368 97 -453 308 157 -383 241 142 -455 217 342 -450 103 347
3668 347 -376 64 371 -400 17 419 -360 -135 426 -297 -137 450 -277 -250 512 -188 -343 429 -85 -301
3688 -301 434 -91 -402 427 42 -452 339 73 -393 299 144 -425 230 222 -457 159 269 -404 150 290 -413
3709d13M66L29p46L17M35o94K26N12p15J23O35o94j5O64n77j42P33n53k37P75
3729D29m46l94P75l21m39P40k31n78P45q5o54O67L2p03O35J24p19N26K66p73M22
3750A8L73p44L25M51p49K16N58p10Q1O19o47j5O66o01j23P13n17k56P29m12l50
3771c75P51l42m62P63k09n74P16q2o46O85K3p10O19J53p46N23K83p76M36L69p64
3792c65L20M81p51K00N58p03P9O35o50k9O62n76j47P08m98k63P27l97l73P36l03
3813E1m71P24j83n47O81o4o24O27M4o79N91J62p50M96L03p49L89M00p65L00N24
3834D60p77J61O14o93L8O50o53n1P24n99j98P42m57l07P20l81l86P61l04m94P15
3855B85j45n42O42n8o31O63M9p14N51K14p08M52K76p28M13M01p86K70N31p04J38
$$ plain form
3709 -413 53 382 -364 -47 388 -306 -80 432 -283 -160 475 -219 -234 430 -147 -289 444 -109 -346 429
3729 429 -17 -411 364 43 -396 344 113 -465 280 195 -459 208 240 -463 172 296 -423 103 369 -404 18
3750 18 391 -353 -28 423 -326 -110 448 -262 -181 438 -209 -224 442 -159 -282 431 -86 -342 387 -25 -375
3771 -375 376 34 -428 335 126 -448 268 186 -460 225 248 -462 157 310 -436 87 370 -406 30 399 -365
3792 -365 -45 436 -315 -115 443 -260 -181 454 -196 -225 437 -139 -286 422 -76 -339 388 -9 -382 354 51
3813 51 -420 304 121 -426 255 191 -433 194 238 -441 150 312 -438 58 361 -388 1 401 -364 -64 460
3834 460 -317 -156 458 -235 -197 453 -200 -251 473 -126 -324 418 -39 -346 374 -7 -393 368 64 -430 285
3855 285 140 -402 240 182 -449 214 263 -451 100 314 -394 58 334 -394 19 420 -366 -96 435 -269 -131
3876a31N60o93P2O69o63j07P29n27k16P24m75l02P80l89m56P64k25n13O91j75
3896A17n55P08m8o90O25J19o72N07J78p11M89L08p64L46M38o91K31M65p09J76
3916a33N81o84qO66n66j12O75n51j90P73m86l58P58l19m20P15k76n01P59j45o48
3937d70O79J6o40N90Q1p04N73K26p64M29L37o96L25L85p19K74N19p28R9N93o12
3958b07QO15o06p1P01n30k57P20l82l32P08l61m21P66k30n77P11p5n99O49k3o58
3980d51O35J32p48N00K67p16M16L26p51L56M76p66K00N44o81J04N71o45qO77n78
4001a40j69P04m61k35O78m19l32P45l03m81O94j69n12O72j11n96O44M6o84N57
4021A28J61o86M80K46p35M18L91p56K84M80p14J84N65p14Q0O54o51r1P00n54j60
$$ plain form
3876 -131 429 -264 -192 477 -186 -293 436 -91 -307 417 -58 -360 420 31 -425 339 114 -399 292 117
3896 117 -438 270 222 -468 157 276 -396 111 289 -422 67 375 -389 -43 395 -296 -65 400 -309 -133
3916 -133 448 -236 -244 422 -144 -256 419 -132 -322 451 -35 -393 365 46 -374 341 65 -436 323 178 -470
3937 -470 209 225 -415 175 256 -448 125 351 -413 16 353 -343 -18 367 -352 -78 441 -287 -188 405 -207
3958 -207 -199 416 -190 -261 440 -90 -347 373 -9 -341 367 6 -415 351 121 -456 255 180 -419 230 207 -451
3980 -451 184 316 -432 68 335 -381 35 361 -390 -34 442 -324 -124 420 -261 -157 414 -231 -239 438 -140
4001 -140 -309 395 -66 -301 377 -42 -374 371 68 -413 281 112 -400 272 161 -435 209 255 -429 128
4021 128 289 -397 83 329 -406 12 403 -353 -69 411 -303 -119 446 -268 -188 466 -185 -276 424 -130 -290
4042b90P02m91k75P48l75m08P19k68m54O81j65n46O62m6o22O04O6o48N40J61p01
4063d06M73K83p27L65L97p16K69M77p07J70N75o83L3O38o28p0P04n79j86P39m88
4084f7k93P46l80l94P33k78m78O95j54n62O74o0o13O08O4o61N33J81o93M54K88
4105C43p12L58L80o99K69M60o84J70N50o60L4O25n97p8O64n45j63P09m68l15P33
4126C74l39m09P09k81m74P25j62n83O61k7o28O13O5o65N44J98p34M40L16o88L47
4147BL61p06K78M67o87J38N62o15J7N81n78o5O78n30k17O94l97l01O71l44l81
4168c72P28k52n24O88j08n66O16l9o11O13J01p17N19K43o95M10K92p16L73M26
4188D09p34K04N32o59J09N38o26L8O31n92j31O71m49k17O35m14k74P06l46m11
$$ plain form
4042 -290 412 -79 -354 394 19 -389 330 62 -392 289 124 -422 240 194 -428 176 242 -406 134 295 -406
4063 -406 67 350 -377 -12 385 -331 -62 415 -292 -122 453 -230 -197 441 -187 -257 447 -132 -318 421 -67
4084 -67 -360 386 6 -388 345 67 -411 284 130 -432 242 182 -431 177 241 -420 113 294 -399 55 343
4105 343 -369 -11 369 -330 -61 399 -285 -115 435 -225 -191 434 -163 -241 423 -122 -285 424 -44 -359 374
4126 374 35 -374 335 54 -420 305 143 -440 221 194 -434 179 244 -421 123 321 -413 27 343 -345 2
4147 2 363 -343 -65 402 -285 -147 415 -200 -183 398 -180 -245 433 -97 -314 380 -17 -318 353 9 -372
4168 -372 356 104 -420 268 160 -406 210 171 -440 173 274 -443 76 319 -376 34 326 -390 -17 409
4188 409 -325 -121 411 -248 -139 399 -227 -189 442 -150 -281 390 -59 -276 359 -55 -329 377 31 -380
4208c80O69j59m98O24j38n29O41oo54N47J49o32M58J84o83M41L32p34L03M44o59
4229b80J87M68o54J10O09o33o2O56n17j26O36m99j98O95m08l43O76k44m15O39
4249B97k16m67O55r5n84N76N3n82M98R4o20M82K34o93L58L47o44K76L67o56K23
4270i7N06o73O7N82n68j2N84n37j16O79m67k85O87l43l35O47k95m16P06j77n51
4291d14O34n3n48N65K0o01N28J37o52M12K70o23L29L11o52K88M23o46J38M97n68
4312b05M1N36n63k8O27n18j73O51m09k59O45l49l51O77k38m60O35j21n08O02n9
4333A73n75N73Q6o46M79J82o33M10K61o59L35L70o52K13M30n86J04N02n93L4N68
4354C76n18q5N83m38j78O07l88k64O34l02l66O28k13m44O31j29n04N73j0n71N21
$$ plain form
4208 -380 289 130 -368 256 118 -411 230 224 -430 117 266 -366 92 276 -407 34 366 -368 -65 379 -280
4229 -280 -93 375 -279 -169 440 -193 -255 401 -116 -242 394 -105 -303 392 -16 -359 317 73 -342 297
4249 297 81 -386 269 174 -410 166 219 -363 135 229 -391 91 325 -368 -10 337 -307 -31 336 -320 -97
4270 -97 409 -264 -197 385 -183 -195 389 -148 -264 415 -52 -337 350 7 -328 319 24 -392 314 137 -414
4291 -414 220 167 -381 184 204 -397 131 268 -384 28 298 -325 4 315 -337 -49 374 -272 -134 363 -205
4312 -205 -164 372 -191 -219 408 -110 -283 368 -41 -300 345 -4 -355 322 84 -376 259 138 -370 232 173
4333 173 -402 171 257 -389 90 272 -361 49 310 -349 -14 356 -296 -83 347 -239 -135 367 -226 -192 376
4354 376 -142 -227 356 -82 -260 347 -41 -305 329 27 -339 289 76 -368 263 134 -370 203 193 -378 143
4375A43J06o16M57J85o39L86L09o66L05L81o43J97M64o18J03N17n56j8N79n06
4395a30j23O24m36k12O15l49k93O22k71l84O01j56m59N77p6n09N47J6n84M98J27
4416B45n96M11K21o28L55L07o49K78M00o14J61M61n88P7N44n73m0N93m81j40O18
4437C62m31k26O39l50l29O30k22m01N89j64m44N85o6n59N48O2n64M48J31n84M32
4458H6K08o22K89L50n73K12L47n79J57M95n95M8N25n06n2N70m77j55O69m63k58
4479c24O55l45k89O12l01l67O53j92m57N44j7n27N46J8n74M91J52o43L83K56n16
4500b42K60K94n90K08M13o21J24N45n82J01M61n24j23O66m77k05O62l36l28O29
4520C35l34l08N94j75m47N46o7m95M97J6n05N39M4o61N90J32n93L36K31o17L70
$$ plain form
4375 143 249 -367 90 275 -364 22 331 -335 -30 351 -292 -95 369 -249 -146 371 -185 -203 376 -130
4395 -130 -253 371 -65 -277 338 -11 -304 318 47 -337 264 108 -351 226 150 -359 188 204 -380 118 245
4416 245 -351 60 281 -347 8 315 -334 -56 344 -270 -109 352 -236 -159 385 -188 -228 365 -116 -256 362
4437 362 -69 -295 344 -6 -335 295 73 -328 261 97 -347 238 172 -387 161 223 -341 107 238 -346 86
4458 86 294 -328 -39 311 -262 -50 297 -282 -125 370 -225 -177 348 -158 -210 360 -117 -272 397 -66 -324
4479 -324 331 -14 -303 309 8 -359 294 102 -355 189 172 -355 191 209 -365 126 278 -365 18 274 -242
4500 -242 18 312 -278 -70 343 -278 -154 391 -191 -90 371 -153 -276 390 -87 -292 370 34 -294 335
4520 335 1 -307 287 112 -335 211 144 -351 146 162 -343 196 240 -421 169 301 -292 44 275 -342 28
4541B8L31o58J82M93o10J60M74o50N3O18o22J1N06l26k21N25l60k40N98k81l07
4562b96N45j49m54N92j77m23O09n9n48N03R2n67M40J13n74M33K31o31K69L78n84
4583b57J55M43o09J37N08n84j4N75n14l8N75m66j75O24l94k73N80k18l40N50j97
4604F8m03N68r0m99N19J7n19M62R3n74M50J78o07L51K80n93K72L44o11K12M38
4625C56o03R0N09n38MN32n06p3N91m41k01O22l60k70O01k83l53O07j76m54N74
4646B28q3m86N18Pn26M65J02n61L99J93n75L31K75n87K55L62n84J55M43n53Q1
4667a41N00n44rN55m81j15N90m20k04O03l45k87O11k71l60O00j94m34N90r6m91
4688c43N23J8n42M75J07n74M03K01n82L16K97n98K68L43n89J69M26n44P3M87n04
$$ plain form
4541 28 359 -299 -117 376 -234 -74 400 -250 -197 421 -201 -190 316 -10 -231 294 -66 -306 292 11 -296
4562 -296 249 100 -354 238 61 -362 247 188 -360 143 235 -332 108 221 -353 80 311 -320 -51 327 -257
4583 -257 -102 341 -268 -131 377 -207 -221 354 -160 -198 377 -89 -264 360 -34 -307 273 55 -285 265 68
4604 68 -335 233 143 -356 163 180 -339 123 216 -358 92 270 -337 14 294 -299 -27 317 -294 -82 356
4625 356 -247 -157 352 -186 -182 350 -156 -229 362 -79 -280 342 -18 -288 313 30 -323 284 108 -346 228
4646 228 145 -341 177 184 -342 123 225 -336 63 256 -319 12 287 -300 -45 317 -267 -112 331 -222 -141
4667 -141 359 -185 -194 361 -120 -235 355 -65 -269 334 -11 -298 313 42 -318 282 88 -346 244 148 -343
4688 -343 180 198 -344 131 238 -336 67 268 -314 2 299 -299 -31 312 -277 -108 318 -226 -153 334 -170
4709a70j3N16m44j43O04l96k35N99l08l13O19k64m26O61j51m72N51j10m88N68
4729A85J4n63M70J53n93L85J97n77L51K58n63J82M14n65J36M37n58P4N02n17m4
4750b22N51m28j33N45l86j97O00l33l13N92k11l70N39j40m25N72o6n31N18M4n21
4771c15M40J02n80M24K12o23L20L34n84K10L66n82J72M63n92K9N36m86n8N34m52
4792a30j13N80l86k53N95k70l12N52k31l56N91j49m71N36%m84M50L5n17M67J31
4813B65o07L60K60n52K58K99n76K45L98o16J25M77n17K7M74n21j8N79m79j69O00
4834C12l49k41N66l15k91O09k28m12N65q5m41M94l8m83N02O3n73M30J63n38L30
4855D0K12n54L09L08n98J87M11n15J03M04n18M6N19n11q0N51m06j38N39l77k13
$$ plain form
4709 -170 -183 333 -111 -254 350 -46 -281 318 10 -303 316 52 -374 287 136 -336 215 105 -383 185
4729 185 199 -364 106 259 -334 51 248 -329 22 280 -283 -101 313 -252 -116 321 -237 -163 339 -178 -222
4750 -222 329 -99 -232 313 -73 -270 330 -3 -316 276 65 -305 234 94 -331 241 175 -356 162 206 -315
4771 -315 125 227 -353 71 283 -340 -20 314 -270 -60 306 -276 -104 359 -233 -204 332 -154 -212 322 -130
4792 -130 -243 337 -49 -302 293 23 -289 263 32 -324 267 118 -353 183 183 -301 149 184 -333 134 265
4813 265 -342 18 278 -274 -16 283 -293 -48 350 -266 -141 336 -181 -154 320 -201 -219 360 -119 -288 312
4834 312 -37 -278 288 -27 -318 291 63 -349 216 131 -310 184 146 -337 165 228 -345 85 248 -290 40
4855 40 252 -302 7 315 -283 -96 315 -200 -97 307 -211 -165 354 -157 -237 314 -92 -230 309 -68 -281
4876b81N98l07l45N97j96l72N42j50m28N51k8n32M83R0n29M10J32n62L82K32n89
4897c02K67L19n37K05L47n38J32M38n20J4M85m31p1N00m23j21N57l57k40N64k62
4918B6l10N42k02l62N49j13m63N14j6m87M72N1n26M35J42n67L39K48n41K55L05
4939B91n58K11L77n45R5M50n05K3M68m50o4N14l89j70N34l15k17N28k54l10N43
4960B57j81l64N04r4m27M81j5m71M54O0n08L88J51n30L40K26n50K67L01n44J86
4981f9L75n20R8M41n06K3M58m45n5M99l87j51N26l19k35N21k32k96N06j56l69
$$ plain form
4876 -281 317 10 -335 262 66 -306 236 86 -342 209 181 -351 132 222 -307 103 235 -327 55 287 -302
4897 -302 -35 284 -253 -48 299 -239 -107 331 -189 -175 310 -121 -192 308 -115 -236 321 -36 -276 288 26
4918 26 -284 258 56 -306 243 130 -333 181 165 -322 150 201 -325 110 252 -315 24 272 -269 -14 291
4939 291 -267 -56 321 -224 -129 321 -184 -161 307 -143 -207 307 -82 -252 282 -33 -250 278 24 -286 257
4960 257 76 -288 216 122 -305 176 161 -310 144 204 -304 84 235 -295 45 271 -279 -12 289 -255 -69
4981 -69 306 -214 -116 325 -181 -158 300 -145 -200 299 -88 -239 287 -32 -267 254 22 -274 232 76 -293
$$ [...]
8191B4
##END NTUPLES=NMR FID
##END=
