##TITLE=1H_LY-12Dix.5.B
 CD3CN, 8 sc, 
 4.06.2021
##JCAMPDX= 6.0         $$ Bruker NMR JCAMP-DX V2.0
##DATA TYPE= NMR FID
##DATA CLASS= NTUPLES
##ORIGIN= UXNMR, Bruker Analytische Messtechnik GmbH
##OWNER= root
$$ XWIN-NMR		Version 3.5
$$ Fri Jun  4 12:14:30 2021 Russian Standard Time (UT+4h)  she@DPX200
##.OBSERVE FREQUENCY= 200.131506
##.OBSERVE NUCLEUS= ^1H
##.DELAY= (6, 6)
##.ACQUISITION MODE= SIMULTANEOUS
##.ACQUISITION SCHEME= undefined
##.AVERAGES= 8
##.DIGITISER RES= 18
##SPECTROMETER/DATA SYSTEM= spect
##.PULSE SEQUENCE= zg30
##.SOLVENT NAME= CD3CN
##.SHIFT REFERENCE= (INTERNAL, CD3CN, 0, 15.7039)
##AUDIT TRAIL= $$ (NUMBER, WHEN, WHO, WHERE, WHAT)
$$ ##TITLE= Audit trail, XWIN-NMR		Version 3.5
$$ ##JCAMPDX= 5.01
$$ ##ORIGIN= Bruker BioSpin GmbH
$$ ##OWNER= she
$$ F:/spectra/data/she/nmr/H-F/1/audita.txt
$$ ##AUDIT TRAIL=  $$ (NUMBER, WHEN, WHO, WHERE, WHAT)
(   1,<2021-06-04 12:13:29.28 +0400>,<she>,<DPX200>,
      <created by zg, POWCHK disabled, PULCHK disabled
       configuration hash MD5:
       00 E9 B6 7A A2 85 ED C7 34 08 36 98 17 FE 4E 26
       data hash MD5: 16K
       0C EB 9C 19 43 DD 56 59 3C 00 73 48 86 11 9A 5E>)
$$ ##END=
$$ 
$$ hash MD5
$$ A5 A4 E3 08 4D 6A D1 BA 4C 60 86 14 C3 22 64 F8
##$RELAX= 
##$RELAX= 
##$RELAX= 
##$RELAX= 
##$RELAX= 
##$RELAX= 
$$ Bruker specific parameters
$$ --------------------------
##$DU= <F:/spectra>
##$EXPNO= 1
##$NAME= <H-F>
##$PROCNO= 1
##$TYPE= <nmr>
##$USER= <she>
##$AMP= (0..31)
100 100 100 100 100 100 100 100 100 100 100 100 100 100 100 100 100 100 
100 100 100 100 100 100 100 100 100 100 100 100 100 100 
##$AQSEQ= 0
##$AQ_mod= 1
##$AUNM= <au_zg>
##$AUTOPOS= <>
##$BF1= 200.13
##$BF2= 200.13
##$BF3= 200.13
##$BF4= 200.13
##$BF5= 200.13
##$BF6= 200.13
##$BF7= 200.13
##$BF8= 200.13
##$BYTORDA= 1
##$CFDGTYP= 0
##$CFRGTYP= 5
##$CHEMSTR= <none>
##$CNST= (0..31)
1 1 145 1 1 1 1 1 1 1 1 1 1 1 1 1 1 1 1 1 1 1 1 1 1 1 1 1 1 1 1 1 
##$CPDPRG= <>
##$CPDPRG1= <>
##$CPDPRG2= <>
##$CPDPRG3= <>
##$CPDPRG4= <mlev>
##$CPDPRG5= <mlev>
##$CPDPRG6= <mlev>
##$CPDPRG7= <mlev>
##$CPDPRG8= <mlev>
##$CPDPRGB= <>
##$CPDPRGT= <>
##$D= (0..31)
0 1.2 0 0 0 0 0 0 0 0.06 0 0.03 0 0 0 0 0.0002 0 0 0 0 0 0 0 0 0 0 0 0 
0 0 0 
##$DATE= 1622794408
##$DBL= (0..7)
120 120 120 120 120 120 120 120 
##$DBP= (0..7)
150 150 150 150 150 150 150 150 
##$DBP07= 0
##$DBPNAM0= <>
##$DBPNAM1= <>
##$DBPNAM2= <>
##$DBPNAM3= <>
##$DBPNAM4= <>
##$DBPNAM5= <>
##$DBPNAM6= <>
##$DBPNAM7= <>
##$DBPOAL= (0..7)
0.5 0.5 0.5 0.5 0.5 0.5 0.5 0.5 
##$DBPOFFS= (0..7)
0 0 0 0 0 0 0 0 
##$DE= 6
##$DECBNUC= <off>
##$DECIM= 32
##$DECNUC= <off>
##$DECSTAT= 4
##$DIGMOD= 1
##$DIGTYP= 9
##$DL= (0..7)
0 120 120 120 120 120 120 120 
##$DP= (0..7)
150 150 150 150 150 150 150 150 
##$DP07= 0
##$DPNAME0= <>
##$DPNAME1= <>
##$DPNAME2= <>
##$DPNAME3= <>
##$DPNAME4= <>
##$DPNAME5= <>
##$DPNAME6= <>
##$DPNAME7= <>
##$DPOAL= (0..7)
0.5 0.5 0.5 0.5 0.5 0.5 0.5 0.5 
##$DPOFFS= (0..7)
0 0 0 0 0 0 0 0 
##$DQDMODE= 0
##$DR= 18
##$DS= 0
##$DSLIST= <SSSSSSSSSSSSSSS>
$$ [...]
##$SUBNAM2= <"">
##$SUBNAM3= <"">
##$SUBNAM4= <"">
##$SUBNAM5= <"">
##$SUBNAM6= <"">
##$SUBNAM7= <"">
##$SUBNAM8= <"">
##$SUBNAM9= <"">
##$SW= 20.0188882624521
##$SWIBOX= (0..15)
0 0 2 0 0 0 0 0 0 0 0 0 0 0 0 0 
##$SW_h= 4006.41025641026
##$TD= 16384
##$TD0= 1
##$TE= 0
##$TE2= 300
##$TE3= 300
##$TEG= 300
##$TL= (0..7)
0 120 120 120 120 120 120 120 
##$TP= (0..7)
150 150 150 150 150 150 150 150 
##$TP07= 0
##$TPNAME0= <>
##$TPNAME1= <>
##$TPNAME2= <>
##$TPNAME3= <>
##$TPNAME4= <>
##$TPNAME5= <>
##$TPNAME6= <>
##$TPNAME7= <>
##$TPOAL= (0..7)
0.5 0.5 0.5 0.5 0.5 0.5 0.5 0.5 
##$TPOFFS= (0..7)
0 0 0 0 0 0 0 0 
##$TUNHIN= 0
##$TUNHOUT= 0
##$TUNXOUT= 0
##$USERA1= <user>
##$USERA2= <user>
##$USERA3= <user>
##$USERA4= <user>
##$USERA5= <user>
##$V9= 5
##$VALIST= <valist>
##$VCLIST= <CCCCCCCCCCCCCCC>
##$VD= 0
##$VDLIST= <DDDDDDDDDDDDDDD>
##$VPLIST= <PPPPPPPPPPPPPPP>
##$VTLIST= <TTTTTTTTTTTTTTT>
##$WBST= 1024
##$WBSW= 4
##$XGAIN= (0..3)
0 0 0 0 
##$XL= 0
##$YL= 0
##$YMAX_a= 133797
##$YMIN_a= -127911
##$ZGOPTNS= <>
##$ZL1= 120
##$ZL2= 120
##$ZL3= 120
##$ZL4= 120
##$ABSF1= 10
##$ABSF2= 0
##$ABSG= 5
##$ABSL= 3
##$ALPHA= 0
##$AQORDER= 0
##$ASSFAC= 0
##$ASSFACI= 0
##$ASSFACX= 0
##$ASSWID= 0
##$AUNMP= <proc_1d>
##$AZFE= 0.1
##$AZFW= 0.1
##$BCFW= 1
##$BC_mod= 2
##$BYTORDP= 1
##$COROFFS= 0
##$CY= 11.3945322036743
##$DATMOD= 1
##$DC= 2
##$DFILT= <>
##$DTYPP= 0
##$F1P= 15.9154993809931
##$F2P= -4.1035820241983
##$FCOR= 0.5
##$FTSIZE= 0
##$FT_mod= 4
##$GAMMA= 1
##$GB= 0.15
##$INTBC= 1
##$INTSCL= 1
##$ISEN= 128
##$LB= 0.24
##$LEV0= 0
##$LPBIN= 0
##$MAXI= 10000
##$MC2= 0
##$MEAN= 0
##$ME_mod= 0
##$MI= 1.114404
##$NCOEF= 0
##$NC_proc= 0
##$NLEV= 6
##$NOISF1= 3.799351
##$NOISF2= 2.8
##$NSP= 1
##$NTH_PI= 0
##$NZP= 0
##$OFFSET= 15.70392
##$PC= 1
##$PHC0= -11212.34
##$PHC1= 24.80099
##$PH_mod= 1
##$PKNL= yes
##$PPARMOD= 0
##$PSCAL= 0
##$PSIGN= 0
##$REVERSE= no
##$SF= 200.130013532006
##$SI= 16384
##$SIGF1= 3
##$SIGF2= 2
##$SINO= 400
##$SIOLD= 16384
##$SREGLST= <1H.CDCl3>
##$SSB= 0
##$STSI= 0
##$STSR= 0
##$SW_p= 3612.71676300578
##$SYMM= 0
##$S_DEV= 0
##$TDeff= 0
##$TDoff= 0
##$TI= <>
##$TILT= no
##$TM1= 0
##$TM2= 0
##$TOPLEV= 0
##$USERP1= <user>
##$USERP2= <user>
##$USERP3= <user>
##$USERP4= <user>
##$USERP5= <user>
##$WDW= 1
##$XDIM= 8192
##$YMAX_p= 0
##$YMIN_p= 0
$$ End of Bruker specific parameters
$$ ---------------------------------
##NTUPLES= NMR FID
##VAR_NAME=  TIME,          FID/REAL,        FID/IMAG
##SYMBOL=    X,             R,               I
##VAR_TYPE=  INDEPENDENT,   DEPENDENT,       DEPENDENT
##VAR_FORM=  AFFN,          ASDF,            ASDF
##VAR_DIM=   8192,          8192,            8192
##UNITS=     SECONDS,       ARBITRARY UNITS, ARBITRARY UNITS
##FACTOR=    0.0002496,     1,               1
##FIRST=     0,             0,               0
##LAST=      2.0444736,     0,               0
##MIN=       0,             -127911,         0
##MAX=       2.0444736,     133797,          0
$$ Real data points
##PAGE= N=1
##DATA TABLE= (X++(R..R)), XYDATA
$$ [...]
2268a578J931J210k287n68K394j90k243R50J885j625j426K162P78k391r0K365
$$ -1578 353 1563 -724 -1292 1102 912 -1331 -381 1504 -121 -1547 615 1393 -998 -1088 1277
2284A277o82k054J384J562j984r26K363K10k444N20K214j193j781J817J139k224
$$ 1277 595 -1459 -75 1487 -497 -1423 940 1150 -1294 -774 1440 247 -1534 283 1422 -802
2300h02m21K395l08k306J006J939j583j387K058O89k311K9K347p11k120J320J678
$$ -802 -1223 1172 864 -1442 -436 1503 -80 -1467 591 1280 -1031 -1002 1345 634 -1486 -166 1512
2317A512j808j057K121L58k266L80K165j026j877J593J372j997p30K218pk211
$$ 1512 -296 -1353 768 1126 -1140 -760 1405 379 -1498 95 1467 -530 -1260 958 951 -1260
2333a260O91K008j332j589J821R91k127l04K234m48k089J134J732j702j174K084
$$ -1260 -569 1439 107 -1482 339 1330 -797 -1101 1133 685 -1404 -270 1462 -240 -1414 670
2349F70M88k232K13K181r35j854J532J366j978p20K215J6k215O94J979j315j544
$$ 670 1158 -1074 -861 1320 385 -1469 63 1429 -549 -1269 946 962 -1253 -559 1420 105 -1439
2366a439J799R78k121k95K243m01k108J022J778j540j272J894O53k099L7K122
$$ -1439 360 1338 -783 -1078 1165 764 -1344 -322 1456 -84 -1356 538 1191 -908 -871 1251
2382A251p23j934J306J530j738r84K017L12k114L86K008j043j705J552J216j910
$$ 1251 528 -1406 -100 1430 -308 -1292 725 1037 -1077 -691 1317 274 -1431 121 1337 -573
2398e73n70K060j44k009Q43J801j461j374J872P84k064p9K037o26j821J269J449
$$ -573 -1143 917 773 -1236 -393 1408 -53 -1427 445 1229 -835 -914 1123 497 -1324 -55 1394
2415A394j765r43K058L07k073L71J915j051j564J579J126j955n77K108m1k011
$$ 1394 -371 -1314 744 1051 -1022 -651 1264 213 -1351 228 1354 -601 -1178 930 889 -1122
2431a122O71J737j266j304J721Q04k007k73K072l39j881R09J535j448j066J844
$$ -1122 -451 1286 20 -1284 437 1241 -766 -1039 1033 694 -1187 -278 1257 -191 -1257 587
2447E87N33k039K7K001o03j733J145J287j617p25J928J49k040M30J906r78j501
$$ 587 1120 -919 -892 1109 506 -1227 -82 1205 -412 -1137 791 940 -1100 -670 1236 258 -1243
2464a243J441R44j804l02J980k96j949Q58J660j314j137J651N10j893J69J915
$$ -1243 198 1142 -662 -964 1016 720 -1229 -371 1289 -25 -1162 489 999 -894 -725 1190
2480A190p30j764J197J395j537q48J761J72j824M43J795j021j533J395J115j636
$$ 1190 460 -1304 -107 1288 -249 -1097 664 836 -988 -545 1250 229 -1304 91 1206 -430
2496d30n86J793j00j765P11J625j206j366J562Q82j728k62J728l59j627R44J437
$$ -430 -1016 777 677 -1088 -377 1248 42 -1324 238 1120 -608 -870 858 499 -1128 -184 1253
2513A253j433j063J705N51j774P3J687p06j481J264J148j635p26J813J72j740
$$ 1253 -180 -1243 462 1013 -761 -688 999 293 -1188 76 1224 -411 -1137 676 848 -892
2529h92M31J543j052j186J533P58j780l06J841k48j647P69J354j292r22J644M77
$$ -892 -461 1082 30 -1156 377 1135 -645 -951 890 642 -1005 -236 1118 -174 -1096 548 1025
2546A025j823j4J748m57j530R83J119j412p02J732K42j841K48J690o93j386J126
$$ 1025 -798 -812 936 479 -1051 -68 1051 -361 -1063 669 911 -930 -682 1008 315 -1071 55
2563E5R64j501m61J738k6j765N13J554r54j180J348O59j623j22J755l86j660Q35
$$ 55 1019 -482 -943 795 769 -996 -483 1071 117 -1063 285 944 -679 -801 954 568 -1092 -257
2581b57J366j210q48J456L23j653K31J667p39j466J155J067j435n43J566qj643
$$ -257 1109 -101 -949 507 830 -823 -592 1075 336 -1130 25 1092 -343 -886 680 672 -971
2598i71N71J527j026j238J333P87j527k53J594l21j514Q15J350j215r93J435N50
$$ -971 -400 1127 101 -1137 196 983 -544 -797 797 476 -1038 -223 1127 -88 -1081 354 904
2615I04j542m2J560n31j426J021J166j340q09J537L22j568K24J480p85j237J202
$$ 904 -638 -680 880 349 -1077 -56 1110 -230 -1039 498 820 -748 -524 956 171 -1066 136
2632A36R41j500n07J601Pj532N35J326j025j000J375O09j589j11J577l95j418
$$ 136 1077 -423 -930 671 678 -854 -319 1007 -18 -1018 357 966 -623 -734 843 448 -970
2649i70Q75J110j267p16J526K56j610K15J492o62j249J098Q53j381m51J576k4
$$ -970 -95 1015 -252 -968 558 814 -796 -581 911 249 -1000 98 951 -430 -881 695 671
2666F71j576M82J399q90j082J233O76j457k25J553k41j481O71J273j071q93J339
$$ 671 -905 -423 976 86 -996 237 913 -544 -769 784 543 -938 -267 1006 -65 -958 381
2683C81M65j501K1J503m90j364R21J068j249o64J454J85j498L13J381p67j142
$$ 381 846 -655 -634 869 379 -985 -64 1004 -245 -909 545 730 -768 -455 926 159 -983
2700i83J141P60j384k97J484j91j427O40J218j032q77J310M67j472OJ449m46j285
$$ -983 158 918 -466 -763 721 530 -897 -257 961 -71 -948 362 829 -643 -637 812 366 -919
2718i19Q51J003j183o09J389J85j468K49J397o54j186J008Q48j264m49J439mj460
$$ -919 -68 935 -248 -857 532 717 -751 -502 895 241 -945 63 911 -353 -802 637 633 -827
2736h27M42J314q26j025J114O55j337k08J425k41j383O66J185j002q49J245M03
$$ -827 -385 929 103 -922 192 847 -490 -698 727 486 -897 -231 954 -48 -897 348 751
2753G51j366P8J373n24j257R19R51j178n55J330Q2j358L94J260q03j038J118O95
$$ 751 -615 -537 836 312 -945 -26 925 -253 -808 522 604 -754 -360 900 97 -941 177 872
2771H72j298k64J338k01j264O59J077j011q20J235M67j337l8J319m16j189Q31
$$ 872 -426 -690 648 447 -817 -158 919 -92 -912 323 790 -547 -585 734 318 -871 -40
2788d0R57j122o69J289L07j343J32J255n68j070R72P85j236m78J382J01j354L13
$$ -40 917 -205 -874 415 722 -621 -489 766 198 -872 100 885 -351 -829 553 654 -700 -387
2806c87J191p35r27J086N97j303k31J376j82j257N99R93r78o44J240K82j362R0
$$ -387 804 69 -858 228 825 -478 -709 667 485 -772 -173 820 -158 -802 438 720 -642 -552
2824e52J319m61j107Q15P63j096l82J314k9j349L86J224p07r42R70N58j195j45
$$ -552 767 306 -801 14 777 -319 -701 613 584 -765 -379 845 138 -804 166 724 -471 -616
2842f16J314k40j300N70J114q34q19J078L87j202K4J278m17j216P52R88r71o60
$$ -616 698 458 -842 -272 842 8 -811 267 654 -548 -524 754 337 -879 -127 861 -110 -770
2860g70J158K12j230K24J229o03j103Q88Q27j088m18J174m0j177M79J091q27q91
$$ -770 388 600 -630 -406 823 220 -883 5 832 -256 -674 500 460 -717 -238 853 26 -865
2878h65J073N60j176j39J165k97j084P00R06j000o41J160K92j189J03J107n30
$$ -865 208 768 -408 -547 618 321 -763 -63 843 -157 -798 362 654 -535 -432 675 145
2895A45r55Q92P31j117m35J200R9j176K94J030o71q19R93N59j184k57J228q0j156
$$ 145 -810 82 813 -304 -739 461 560 -616 -322 708 37 -782 211 770 -414 -671 557 477 -679
2914f79M58R68q03p15J089M03j231p5J225k81j069O29Q26r46n03J158J70j237
$$ -679 -221 747 -56 -771 318 721 -510 -585 640 359 -710 -81 745 -201 -704 454 624 -613
2932f13J81J144n07r15Q00O09j057k49J175j00j164M30J003p07p18R28L70j113
$$ -613 -432 712 205 -710 90 699 -358 -607 568 468 -696 -266 737 30 -688 240 610 -503
2950e03J3J153l39j077O31Q70q59n61J024J95j114J65J107m88r78P52P40r36m12
$$ -503 -490 663 324 -753 -122 748 -111 -672 352 547 -567 -402 705 217 -761 -9 731 -205 -617
2969f17J054N8j130L33J060o34r06Q65O20j009k53J083j34j059M71R66p73p33
$$ -617 437 495 -635 -302 758 124 -782 83 703 -306 -559 524 390 -669 -198 768 -5 -738
2987g38R64M34j086m3J087l57r78O91P74r23n18J063J69j079K13R79n55q11Q41
$$ -738 226 660 -426 -469 618 261 -717 -26 748 -175 -693 370 539 -540 -327 652 97 -714 127
3006A27N74j035k64J084p2j035M14Q95p18o69R47L95j065r9J079k41r74N54P91
$$ 127 701 -334 -598 486 414 -621 -207 688 -30 -699 248 643 -422 -521 558 317 -657 -103 688
3025F88q14n48J013K50j096O9J075l97r30O83P19r32m05J061P7j085K55J015n86
$$ 688 -126 -674 339 589 -507 -438 637 240 -690 -7 712 -220 -625 436 513 -572 -317 698 112
3044A12q12Q49N29j025k00J081j57j019M73Q72p65o01R32K97j028M7J026l99q88
$$ 112 -700 149 678 -347 -547 534 377 -642 -169 703 -62 -663 269 566 -462 -415 611 212 -676
3063f76O79O72r06l82J011R1j033K45R26n39p62P99N09r57k32J035q0r91L77Q76
$$ -676 3 675 -231 -613 398 489 -544 -299 627 88 -674 125 634 -323 -555 480 400 -591 -214 662
3083F62o68o65Q95L89j017r0J053k12r66N02P93p73n35R71K23j047Q5J012l89
$$ 662 -6 -671 224 613 -404 -494 559 347 -619 -117 676 -97 -632 339 562 -485 -400 612 223
3102B23q77O67O38q72l54J027J1j054L02R37n74p24P78M38r26r6R79k27r42N10
$$ 223 -654 13 651 -221 -575 452 463 -591 -289 648 74 -650 128 566 -360 -456 523 296 -646 -136
3122a36P94p24n38Q80K21r52J08R43m18q35O46O62q15l95R27O6r57K76R01n58
$$ -136 658 -66 -604 276 497 -455 -347 596 178 -657 -11 651 -164 -559 368 434 -523 -247 654 96
3142I6p63P63N52q94k61R31o4r10L94Q29o83o50Q70M02r55r6R33k46q49N52O94
$$ 96 -667 96 648 -246 -507 424 360 -550 -156 673 -10 -660 210 612 -343 -439 494 248 -601 -49 645
3163F45p87n00R45K09r55J07Q70m21p12O86N20q99k57R59j0r04K96P68n83n59
$$ 645 -142 -642 303 512 -443 -336 534 113 -599 87 607 -292 -549 410 400 -504 -208 560 -23 -582
3183e82Q17L25r24q9R51j89q40M53O43o82m07Q61J63r50Q1R32l20p95N52N68p58
$$ -582 235 560 -364 -453 498 309 -531 -78 565 -117 -524 337 500 -450 -369 563 243 -552 0 568 -190
3204a90l06R01M8r61K02Q75m23p28O72M40q33j60R27j15r34L67Q10n64o03P44
$$ -190 -496 405 453 -508 -306 569 146 -582 90 530 -303 -463 464 349 -585 -218 592 28 -575 169
3224A69K93q57M0Q87l11q34N38O64p05l93Q11Q6q42K28Q05m71o99O57M97p73k17
$$ 169 462 -395 -355 532 221 -613 -75 589 -116 -509 302 388 -454 -226 579 108 -591 66 563 -210 -427
3245d27Q00p8p97L93P04n91n83P45L62q13q3Q00k09p56M90O40o91m79Q11K47q47
$$ -427 373 295 -502 -109 595 4 -579 166 528 -285 -368 432 223 -533 -43 597 -94 -573 238 485 -362
3266c62K1Q06l19p02N87N39p67l51Q65J01q39J65P51m39o06O73M14q09j86Q46
$$ -362 -341 465 146 -556 31 570 -197 -548 317 418 -421 -256 495 56 -550 123 537 -272 -458 388
3286C88p6p78L45O32n78m45P66K29q32j2Q14k38o86M62N00o48k92P69O7q08J65
$$ 388 312 -466 -121 511 -67 -512 254 483 -349 -361 453 215 -471 -9 491 -157 -449 320 387 -421 -256
3307b56P36l64o02N62L96p09j77P97n5p88K74O83m68n20O29L10p50p8Q13j77p62
$$ -256 480 116 -486 76 472 -237 -414 383 328 -460 -186 497 29 -491 138 448 -302 -380 433 256 -506
3328e06L73O58n61m49P03J98p77N2P96l03o93M75N29o21l15P37L8p55K19P00m29
$$ -506 -133 525 -36 -485 218 416 -361 -309 487 184 -509 -34 495 -126 -441 296 334 -421 -202 498 69
3349F9n66N68L93o81j43P10j08o90L52N85n17m25O26K32o97J1O87k43o18M26N16
$$ 69 -497 71 464 -217 -360 350 242 -448 -96 489 -28 -453 173 405 -292 -281 406 163 -455 -29 487
3370D87n89l49O85J40p12Q2O80l14n76M95M47o51k56P26L5p30J94O69m16n24N77
$$ 487 -102 -451 234 374 -338 -256 424 110 -466 29 476 -175 -431 295 330 -400 -206 463 47 -477 100
3391A00L69o99j49P25q0o92L09N79m89m23O32K16p03%O98k22o22M16M83n55k85
$$ 100 469 -230 -379 346 266 -426 -117 462 -27 -450 182 398 -305 -305 393 171 -451 -35 448 -107 -392
3412c92O40Q4o82J58O25l61n21N00L73o11j53O48n6o23K44N74m49m50N84K73o41
$$ -392 248 332 -350 -192 433 72 -449 51 424 -187 -340 308 252 -371 -127 447 -2 -452 132 405 -236
3433b36r1O56j21o26L34N33n11l82O23K19o92KO78k28n87M11M76n83l07O71J09
$$ -236 -327 329 208 -418 -84 449 -62 -444 179 398 -294 -292 386 158 -429 -18 458 -125 -432 239 348
3454C48o82J06O29l31n14N20L47o27j69O86m3o47K41N38m18l95N81J93o47rO62
$$ 348 -334 -228 401 70 -444 76 423 -204 -373 313 270 -377 -136 402 -16 -411 170 363 -284 -293 369
3475C69j83n74L41M51n04k67O10P2o48R3O33k69n34M23L72n52j80O34j2o57K09
$$ 369 186 -388 -47 404 -100 -367 243 315 -333 -240 393 124 -410 13 385 -167 -347 287 275 -382 -173
3496a73O03l59m94N02K96n91r0O49j01o71L04N77m50m11N52K05o28J6O56k34n96
$$ -173 430 71 -423 79 375 -216 -306 343 242 -429 -125 452 2 -409 143 348 -280 -264 392 158 -438
3517d38M04M68n09k98N75R0o18J57N76l31n09M81L55n63j47N65n4n61K74M92m35
$$ -438 -34 434 -75 -373 202 292 -326 -169 407 76 -433 48 403 -160 -307 258 204 -357 -83 409 -26
3538b6l91N28K66n98n9N71j52n22L58M35m99l20N89J53o03K9N82k42m93M29L75
$$ -26 -417 111 377 -221 -280 291 139 -383 -25 410 -89 -409 180 333 -270 -241 341 99 -394 35 410
3559D10n65k51O45Q0o32J17N58l29m32N06K97o16j41O63m2o20K31N00m09l42N39
$$ 410 -155 -406 239 319 -313 -196 362 33 -399 107 404 -212 -353 310 268 -352 -121 379 -30 -372 167
3580A67J88o27k2O32j55n37L21L75m49k24N72M7o18J08N70k54m54L86L08n14j21
$$ 167 355 -272 -294 338 183 -354 -33 342 -107 -331 241 288 -330 -222 348 94 -360 26 334 -180 -301
3601c01N82m6n85J95N31l22m16M59K28n55m2O08j35n98K93M98m07l45M94J73n84
$$ -301 281 235 -350 -155 376 54 -362 97 325 -230 -272 336 201 -397 -104 394 -13 -358 136 309 -275
3622b75L3O08k36n48L72M47m81k86N75O2n91J50N65l28m90M59L39n30j52N68o9
$$ -275 -242 366 130 -418 -46 401 -80 -366 209 271 -320 -170 395 67 -423 36 375 -155 -307 261 192
3643A92n49K71M72m12l69N20K11n45k8N35j75m71L29M12m71k83N41J07n50P9N16
$$ 192 -357 -86 386 -26 -395 125 336 -209 -237 298 123 -348 -19 393 -78 -361 180 287 -263 -184 332
3664C32k57m55M27L36n26j97N80J9n64J55N03l37m09M89K67n78j06O04o4n61K44
$$ 332 75 -380 47 383 -143 -340 240 259 -305 -150 353 16 -393 96 363 -215 -321 283 219 -342 -98
3685i8M70m24l39N59J70o05%N92j81n09L39L91m79k23N61N4n73J16N32k86m18
$$ -98 372 -52 -391 168 338 -267 -267 325 144 -365 -26 365 -114 -337 224 278 -295 -179 353 67 -351
3706c51M16K81n23j14N67n5n44K10M71l46l42M61J71n39%N44j59n33L03M39m33
$$ -351 65 346 -177 -291 276 221 -323 -113 358 12 -330 131 302 -237 -237 307 148 -385 -82 357 -76
3727g6k71N46Q1n81R9N35k21n11L90L80n08j84N76k2n42J25N70l52m30N00K58
$$ -76 -347 199 280 -301 -202 333 112 -399 -9 371 -137 -321 255 233 -309 -184 386 34 -396 104 362
3748C62n44j27O15j57m90K79M29l71l47M77J71n19J9N26j63n40L97L33m79k00
$$ 362 -182 -309 306 149 -341 -62 367 -4 -351 126 297 -222 -203 323 160 -380 17 350 -129 -329
3768c29N36J9n02J33M67j82m54L83J97m57j07N96j63n21K37N04l59m10N19K05
$$ -329 207 226 -276 -143 324 142 -312 71 268 -189 -296 300 137 -384 -147 357 -2 -412 107 312
3788C12n34j6N55j29m51K29M43m81k77N20J27n74P5O06k97m80L27L90m76k13N51
$$ 312 -222 -238 317 188 -263 -34 409 -72 -349 171 298 -276 -201 405 108 -372 -45 345 -131 -344 207
3809B07jm87J63N13l91m02M86K49n25p5N38j03m99K82M09m20l19N23J53n23qN14
$$ 207 206 -281 -118 395 4 -398 88 337 -188 -263 275 172 -327 -45 364 -56 -375 148 301 -222 -230 284
3831B84j86m35L40L43m74k07N44N3n22R0M84k75l87M09K82n24j29N77l0n36J79
$$ 284 98 -337 3 346 -128 -335 209 262 -260 -170 314 39 -348 61 343 -181 -310 267 237 -299 -120
3852a20M69l55l35M86J87n73l5N95j33n40L02M15m45k51N41Q4n93Q7N70k34m76
$$ -120 349 -6 -341 145 332 -241 -276 319 186 -354 -52 363 -82 -333 208 292 -301 -214 356 122 -354
3873c54L81L07m80j39N47m2n61J93N06l20l95M34K05m93l2N36j49n06L06M07l90
$$ -354 27 334 -146 -285 262 220 -341 -148 358 38 -357 77 282 -211 -243 293 144 -362 -56 351 -39
3894c9k91M73J25n21P3N20k39m69L71L66m54k19N23Qn23J64N09l42m37M61L16
$$ -39 -330 143 268 -253 -180 340 101 -368 3 369 -85 -304 219 227 -296 -132 377 35 -402 59 375
3915C75n37j25N46p5n23K56M73m21l60N11K00n39j9N21j58m86L55L73m78k53N54
$$ 375 -162 -287 259 184 -339 -83 390 -31 -391 120 320 -219 -238 283 125 -361 -6 367 -111 -364 190
3936A90R4n45P3M95k52m02M06K78n16j40N59j3n27J84M35l47l07M79J69n50k0
$$ 190 284 -261 -188 307 55 -347 59 337 -179 -319 240 227 -300 -116 319 -28 -335 144 313 -237 -257
3957b57N62j39m91K81L76m14k40N18R1n85Q0N41k11m65L71L26m94j55N79k9n79
$$ -257 305 166 -325 -44 332 -82 -322 196 287 -298 -218 323 112 -353 18 344 -150 -305 274 245 -334
3978c34J86N20l37l92M46K26n39k6N56j15n73L18L93l66l20M80J98o48J44M70
$$ -334 -148 372 35 -357 89 315 -224 -250 306 191 -382 -64 329 -37 -357 123 321 -327 -183 287
3998B87j40m83L04L68m27k00N10J4n44J92M62l23l86M30K68n02q8N16q9n00K71
$$ 287 147 -336 -32 336 -91 -291 219 233 -311 -119 343 20 -366 64 332 -170 -258 258 169 -331 -60
4019f0M10l94l19M96J76n34MN28j86m79L59L88m86k55N63P8n59R1N25k78m41M29
$$ -60 350 -44 -363 133 309 -225 -221 307 121 -358 1 389 -97 -352 211 289 -270 -179 346 68 -373 56
4041E6L03n21j50N59k7n40J96M68l51l58M82K02n38m0N46j37m84K99L76m17k50
$$ 56 359 -162 -312 247 220 -320 -124 344 -7 -365 117 319 -219 -259 287 150 -334 -35 341 -76 -326
4062c26N06Q7n20N8N08k27m36L71L04m53j61N10Pn31J75M68l13l71M40K32n17
$$ -326 180 267 -253 -195 313 86 -350 21 325 -128 -289 221 228 -303 -128 340 27 -344 96 328 -189
4083a89o8N37p5n36K49M39l80l24M87J77n47kN32j76m82L16M04m67k59N30N9n36
$$ -189 -257 280 205 -331 -82 357 -23 -347 140 317 -230 -232 300 124 -358 -42 362 -105 -364 166 225 -311
4105c11J59N07l27l88M35K90n24j42N11j1m97K05M08l15l17M63J55m96n4N64j56
$$ -311 -152 355 28 -360 75 365 -159 -301 210 199 -298 -93 315 0 -317 146 301 -195 -249 315 159
4126A59m93L09L51m00k31M72Q7n09R4M79k34m23L66L04m60j51M81Om98J43M90
$$ 159 -334 -25 326 -74 -305 167 254 -255 -161 318 84 -339 27 331 -129 -280 201 207 -291 -148 342
4147C42l25l47M00K41n23q6N79j40m70K42M40l90k91M61J37n11P0M52j72m53L26
$$ 342 17 -330 70 311 -212 -298 281 141 -329 -87 353 -37 -328 133 270 -241 -171 281 109 -344 -18
4168a8L65m35k32N00N9n08J41M54k93l83M17K35m76q1M82p5m22J98L87l23l41
$$ -18 347 -88 -320 180 239 -269 -128 326 33 -350 67 302 -174 -255 227 152 -270 -72 315 -8 -349
4189c49N21P2m69O1L86j32m51L56K69l38k67N34J0m34Q3L98k04l88M02L21m90
$$ -349 172 244 -225 -164 222 90 -361 -5 264 -74 -341 193 203 -231 -148 250 46 -342 60 381 -109
4210a09k01N08j7m46J37M88l71l14M33K13n04p4M91j4m96K47L50l86k28M76O0
$$ -109 -310 198 181 -265 -128 360 -11 -325 108 321 -183 -257 234 220 -276 -29 321 -65 -293 183 243
4231B43m87M1M93j68m33K99L08m03j58M74Nm90J19M69k59l48L50K18m48n4M79
$$ 243 -244 -203 290 122 -311 -12 296 -107 -265 209 214 -276 -157 312 53 -295 55 273 -175 -229 250
4252B50q7m70K09M23l30l02L97J67m70J2M88j63m60K94L71l85k46M57P0m70R7
$$ 250 163 -307 -98 325 -5 -307 90 257 -213 -201 287 124 -336 -42 329 -56 -302 155 225 -245 -148
4273a48M75k50m32L75L22m53j67M66nm66J93M21l26l51M10K40m61o8M61r2m43
$$ -148 327 77 -355 20 342 -111 -278 188 183 -283 -90 331 5 -346 64 304 -157 -225 236 144 -299
4294b99K56L71l67k78M44J37m55MM32j66l71L15K93m25j87M81M6m74R7M29k50
$$ -299 -43 328 -39 -317 127 264 -191 -187 245 79 -292 23 316 -109 -296 185 231 -243 -146 283 33
4315C3l47L88K41m71j08M86k4m74J84L99l27k89M39J58n00k8N14j27m46K56L56
$$ 33 -314 74 315 -156 -264 222 198 -276 -92 307 -20 -309 130 288 -212 -240 274 147 -299 -43 313
4336C13l82k29M83O0n02O1M90k06m00L27K66m24j20M79k1m84J57M24k64l18L67
$$ 313 -69 -298 185 245 -257 -196 294 88 -312 15 281 -143 -263 216 195 -289 -132 292 28 -290 77
4357G7J86m29m2M55r3m52K29L75l44k50M21J03m68O3M63j99m12L02L21l92j74
$$ 77 263 -166 -208 247 154 -298 -69 306 -38 -288 133 236 -232 -169 294 95 -317 -15 306 -86 -260
4378b60M46K7m77J31M43k71l75L80K65m62j13M88n2m71K18L92l23l24M41J71m75
$$ -260 186 213 -264 -133 310 39 -336 44 309 -153 -266 222 170 -301 -83 309 -14 -338 103 274 -201
4399b01kM65j49m22K89L34l86k08M45P7m72P5M21k10l49L36K48m11j32M43%m45
$$ -201 -203 262 113 -309 -20 314 -72 -280 165 242 -230 -155 266 56 -293 43 291 -120 -252 191 191 -254
4421b54J55L92k72l19L82J93m45m8M44p8m29K26L53l41k56M36J06m62K7M63j83
$$ -254 -99 293 21 -298 84 277 -168 -216 228 150 -279 -53 300 -41 -297 139 245 -217 -190 273 90
4442I0m05L13K95m04j77M71L4m71J17M38k60l48L59K42m41r4M70m7m67K01L99
$$ 90 -315 -2 293 -111 -288 183 217 -254 -137 301 41 -307 52 294 -147 -241 229 182 -285 -84 315
4463C15l28k79M06J53m45j5M42j35l91K55L10l57k07M31O7m44O5M22k04l55L29
$$ 315 -13 -292 114 267 -178 -193 249 114 -277 -22 288 -69 -276 155 222 -222 -157 265 61 -294 35
4484C5K55m14j21M44k0m26J38L90k76l08L91J88m48o1M70q3m54K40L60l43k44
$$ 35 290 -124 -245 199 179 -247 -109 281 5 -303 88 276 -172 -233 237 154 -300 -60 300 -43 -287
4505b87M27J09m64K2M77j83l89K84L10m16j42M42M2m95J28M26k56l30L36K11l94
$$ -287 140 249 -215 -193 284 101 -288 -4 306 -110 -252 190 232 -263 -135 291 35 -295 41 252 -142
4526a42o8M17m8m00J85L61l13k49L71J39m22lM50j65l89K04L93l86k35N05rl93
$$ -142 -210 207 159 -241 -56 305 -8 -257 114 253 -169 -172 278 113 -276 -72 321 -65 -300 205 196 -197
4548a97J33L92k60l92L83J84k39k84L87O4m31J00M96k96l53L85K45n17M7L89q7
$$ -197 -64 328 68 -324 59 243 4 -280 107 171 -260 -160 336 40 -313 72 317 -200 -153 236 149
4569A49m59K87L27l90k42N36M6m73M7M27j82l93L72J98l65j31M23J5m30J28L63
$$ 149 -310 -23 304 -86 -328 208 254 -219 -172 255 73 -320 52 250 -115 -246 177 192 -238 -110 253
4590B53k51k75L61J81m34o7M58o5m08J87L29l14k02L90Q1m28J9M42j55m08K91
$$ 253 2 -273 88 269 -165 -232 226 161 -247 -60 269 -45 -247 143 224 -204 -185 257 102 -306 -15
4611a5L18l93k15N24k2m99J49L84j77l19L05K32l61j54N42j34m55J89L91k82k83
$$ -15 303 -90 -305 219 197 -302 -153 231 54 -265 40 272 -89 -243 299 165 -290 -101 290 8 -275
4632b75L63J64m30j7M46j28m14K48L36l40k12L93P6m24P8M19k09l67L17K63l84
$$ -275 88 252 -178 -195 251 123 -291 -43 293 -47 -259 134 210 -214 -136 283 74 -293 24 287 -97
4653i7j20L95j6l79J67L41k91l24L91K42m05o8L93j03l99K34L24l46k35L89J67
$$ -97 -217 178 162 -217 -50 291 0 -324 67 309 -96 -164 229 126 -273 -39 285 -61 -296 93 260
4674B60n14J15L94j69l75L02K83l91j82M47M1m26Q4M08k43l27L62K33m38j00M47
$$ 260 -254 -139 255 86 -289 13 296 -95 -277 170 211 -215 -131 277 34 -293 69 302 -136 -236 211
4695B11l3m20J58L69l02k56L99J27m28l2M37j13l80K34K98l50j75M01N4m31P4
$$ 211 178 -242 -84 285 -17 -273 126 253 -175 -207 230 117 -263 -29 269 -81 -256 145 199 -232 -158
4716a58M04j91l28K94K33l83r7M22k1m27J49L86k64k90L53J73m19k8M35j05m12
$$ -158 246 55 -273 21 254 -129 -226 196 175 -252 -103 283 19 -271 82 255 -164 -192 243 138 -274
4737b74K29L40l29k28M06R4m47M9M40j90l83K96K87l70j65M35mm28J39L88k60
$$ -274 -45 295 -34 -262 144 238 -209 -160 280 90 -293 3 290 -80 -245 190 186 -242 -103 285 25
4758B5l07L41J98m01o3M08p5l96K02L37l17k28L77J28m14J6L99j51l59K83K75
$$ 25 -282 59 257 -144 -207 201 126 -270 -68 269 -48 -276 101 229 -185 -169 230 79 -280 3 278
4779B78l63j62M19L3m34J01M00k24l26L35K23m17q2M27m3m24J97L42k97k77M02
$$ 278 -85 -247 172 205 -229 -128 272 48 -278 57 280 -137 -219 208 165 -259 -62 280 -17 -294 108
4800A08J51m38j6M37j27l94K53L17l58k02M06P9m43P1M17j98l61L15K44l83j23
$$ 108 259 -179 -195 242 115 -279 -26 291 -67 -269 137 216 -227 -156 261 63 -298 17 261 -122 -245
4821b45M21qm09J51L46k50k76L40J79m00m6M10p7l94K22L16l30k01L81J01m15
$$ -245 176 168 -241 -90 256 6 -270 70 249 -151 -197 213 136 -258 -36 280 -50 -251 130 231 -184
4842a84J5M08j57l51K78K76l83j48M08L6m34J22L78k33l12L34K18m26p4M36m7
$$ -184 -169 239 82 -269 9 285 -98 -246 162 198 -236 -114 264 31 -281 53 271 -155 -229 207 160
4863A60m16J75L62k99k60L97J17m24KM24j23l90K51K86l38j75L97N6m15Q3L77
$$ 160 -256 -81 281 -18 -278 119 236 -188 -186 238 115 -275 -24 262 -76 -251 146 202 -213 -130 247
4884B47j89l07K86K19l73q4L93l6l97J53L61k64k81L50J47l82k3M07j08l96K37
$$ 247 58 -249 37 256 -117 -201 192 156 -241 -88 273 9 -272 78 225 -157 -180 227 119 -277 -40
4905d0L20l27k13L83P9m11N4M10j92l60L09K82l79j61M12km04J38L74k53l08L53
$$ -40 280 -47 -260 123 202 -209 -155 255 63 -297 12 294 -85 -246 166 164 -240 -102 272 19 -289 64
4927F4K01m00o0M10q7l85K25L13l13k44L80J37l98KL71j39l27K65K55l52j59L98
$$ 64 265 -135 -195 215 128 -257 -32 281 -32 -276 104 241 -157 -155 216 77 -250 15 270 -82 -241 157
4949A57M3l90P2L47j96k81L02J83l71r3M16m4l67J53L17k71k44L89J23m25kM21
$$ 157 200 -190 -118 229 33 -248 54 237 -134 -227 189 145 -222 -69 248 -23 -267 122 245 -180 -182 239
4971B39j21l66K31K76l22j64L85M2m32R3L98j88l30K97K12l75r2M20l8m17J55
$$ 239 118 -248 -17 259 -63 -227 158 200 -232 -139 259 71 -259 38 250 -125 -217 203 165 -252 -97
4992i7L61k47k79L40J26l60k0L95j14l63K01L05k80j95L39O3l67N8L80j75l34
$$ -97 264 17 -262 78 204 -156 -176 219 105 -258 -57 248 -32 -227 112 175 -192 -134 246 71 -263
5013b63K67K46l28j29L61J3l75J36L54k57k84L14J95l73o4L93q1l69J97L19k94
$$ -263 4 250 -78 -207 154 167 -208 -72 282 25 -259 55 250 -123 -187 206 125 -244 -47 272 -22
5034b2k41L67J20l80ML69j39l51K71K64l42j60L83M3l81P4L52k04k81L04J94l69
$$ -22 -263 104 224 -156 -152 217 78 -273 -2 262 -80 -240 143 186 -195 -121 231 27 -254 50 244 -125
5056a25q4L71k3l46J33L13k65j98L19J08l52k2L77j04l23J94K69k89j68L54N1
$$ -125 -209 162 139 -207 -74 239 -26 -224 95 203 -149 -171 206 102 -221 -27 242 -47 -215 139 190
5077A90l82N6L61j61l05K71K13l51r6L70rl85J26L43k15k68L07J60l72l4L82q1
$$ 190 -192 -136 225 64 -241 30 243 -108 -204 166 157 -228 -102 241 26 -242 65 225 -147 -181 201 120
5099A20l64J94L02k72k10L41Q8l71L0L63j37l34K44K39l03j23L37J7l46Q8L29
$$ 120 -244 -50 252 -20 -230 111 199 -172 -142 221 84 -250 -6 233 -70 -193 144 161 -185 -97 232
5120B32j96k74K87J76l30p4L48m8l27J51K88k44k15L06J13l42mL49j15l17K12
$$ 232 36 -238 49 225 -105 -179 169 121 -206 -55 233 -11 -226 80 193 -149 -153 196 81 -236 -24
5141b4K56k92j60L44M8l61N6L52j73k93K81K05l38j00L67j1l65J23L36k41k53
$$ -24 232 -60 -220 124 172 -189 -133 219 46 -247 34 239 -99 -199 168 157 -208 -85 251 10 -243
5162b43L06J56l42m4L56p9l33J72K78k59j95L41P9l52K2L47j37l00K24K23k88
$$ -243 63 219 -123 -167 189 110 -223 -51 227 -32 -227 114 193 -159 -137 210 73 -227 -3 220 -68
5183f8j31L26L6l57R5L19j83k64K70J73l33o3L46m2l36J55K86k39k32L32J15l45
$$ -68 -199 127 163 -194 -99 220 37 -227 43 216 -117 -180 166 124 -212 -57 229 -10 -242 90 205 -140
5205a40k3L60j02l22K16K50k99j63L56N8l70N3L37j62k92K73J97l33j02L60pl51
$$ -140 -163 197 95 -227 -11 239 -60 -223 133 191 -179 -126 211 49 -243 30 227 -106 -208 152 145 -206
5227b06J23K93k08k29L03J18l26l9L52p8l20J65K57k54j65L27N9l38K2L41j36
$$ -206 -83 210 2 -227 76 194 -132 -171 181 103 -217 -52 205 -49 -214 113 172 -166 -144 197 61
5248F1k83K24K13l03j10L66ql65J09L20j85k49K64J43l19n0L60p1l48J80K90k56
$$ 61 -222 2 215 -88 -198 168 160 -205 -96 224 39 -210 54 197 -122 -172 188 117 -231 -51 239 -17
5270a7k10L12R5l53L9L51j51l20K33K44k97j27L20K7l38R4L29k08k65K77J89l23
$$ -17 -227 85 180 -173 -134 217 66 -254 -21 223 -74 -201 119 146 -192 -98 231 23 -242 35 224 -99
5292i9q5L24k5l19J47K87k50k07K98J37l34k0L26j01k89K01K33k92j61L36P8l52
$$ -99 -184 140 115 -204 -57 230 -20 -227 71 208 -126 -146 180 79 -210 -9 224 -68 -229 107 185 -167
5314a67M1L32j67k66K74J74l24j05L58j4l38J10K95k29k14L31J17l57l6L71p1
$$ -167 -126 206 39 -227 47 221 -103 -208 150 136 -202 -92 203 -26 -240 91 208 -149 -185 186 115
5335A15l28J69K53k58j60L28O0l66M6L50j31k80K06K11k89j07L38kl41R5L00j83
$$ 115 -213 -44 209 -49 -209 119 179 -187 -141 209 78 -202 4 215 -74 -181 157 155 -186 -91 209 26
5357B6k36K56J41l09k8L30o2l36J54K96k50j95K94R3l35K0L38j22l10K18K45k91
$$ 26 -210 46 187 -122 -150 180 118 -218 -64 232 -18 -213 81 174 -161 -141 197 75 -235 -17 228 -63
5379f3j39L26K3l30Q9L22j86k93K71K02l22q4L46n1l28J57L01k46k27L06J33l39
$$ -63 -202 124 147 -183 -94 228 42 -251 20 222 -100 -184 162 111 -217 -60 241 -5 -232 74 207 -132
5401a32rL27j06k90J98K39k84j59L26O2l27M8K97j44k67K57J74l19r5L49j6l15
$$ -132 -141 186 80 -210 -12 227 -57 -216 110 172 -155 -107 190 46 -221 36 210 -109 -204 145 129 -186
5423a86J06K73j99k18K92J22l29k6L36q2l01J77K46k68j59L31O8l57M2L42j50
$$ -186 -80 193 -6 -224 68 190 -139 -165 171 89 -212 -35 211 -57 -216 115 183 -174 -132 210 60
5444F0k72K26K05l06r7L43ll56J08L17j88k61K82J52l42l7L43o1l20J59K71k48
$$ 60 -212 14 219 -87 -184 159 156 -200 -92 225 37 -224 58 210 -132 -169 174 113 -207 -48 223 -25
5466b5j78K92Q1l29K1L22j17k92K13K23k86j17L23Ol17Q0L04j81k42K53J53k98
$$ -25 -203 89 170 -159 -138 184 67 -225 -12 211 -75 -192 131 137 -180 -100 204 23 -219 34 187 -111
5488a11n8L23m0l23J58K75k35k03L08R0l28OL31j13k98K06K34k81j48L37K5l38
$$ -111 -169 154 114 -209 -51 224 -11 -214 94 184 -144 -138 193 80 -218 -12 222 -59 -207 130 155 -183
5510a83P3L06j64k73K68J70l12p3L34j6l33J32K82k12k13K84J10l07j9L18q2k84
$$ -183 -110 196 32 -241 27 197 -115 -188 146 130 -203 -71 211 -1 -214 70 180 -127 -146 172 90 -194
5532a94J71K33k52j52L07M9l07M0K96j34k61K28J92k86j04L06ql01J07K80k07
$$ -194 -23 210 -42 -194 113 162 -145 -105 191 57 -204 24 216 -70 -174 132 124 -177 -70 210 3
5553Ck18K73J55l28m0L23p5l00J65K60k61j70L03Q5l35K3L26j32k69K17K17k94
$$ 3 -215 58 213 -115 -155 168 93 -207 -42 218 -43 -213 90 175 -160 -137 189 57 -212 5 222 -72
5575g2j22L25K4l31Q3K91j72k31K52J51l18l5L18n1k97J23K50k03j89K79J03l11
$$ -72 -194 131 155 -176 -93 198 26 -205 47 198 -120 -155 163 112 -185 -62 188 -15 -204 75 178 -133
5597a33j2L17r9k73J83K13k55j32L11L1l32O4L19j46k68K16J91k93o8L18l0l28
$$ -133 -145 172 73 -200 -17 196 -59 -191 120 151 -181 -117 202 56 -212 4 195 -98 -166 152 122 -206
5619b06J32K89k05k12K65J27l22j4L37q6l24J78K74k68j62K99M5l03M9L15j58
$$ -206 -74 215 10 -202 63 190 -132 -146 191 105 -219 -41 233 -35 -197 102 147 -156 -107 208 50
5640E0k74K24K01k72j08K94Ml07J11K70j94k20K54J48k83m9L01o0k87J74K42k50
$$ 50 -224 0 201 -71 -179 115 119 -188 -77 193 -1 -221 33 181 -102 -151 150 90 -197 -23 219 -31
5662c1j78K86R4l07J6K82r7k63K17J89k84j16L17L0l12O5K89j72k46K78J54l27
$$ -31 -209 77 171 -136 -120 162 65 -198 19 208 -76 -192 125 155 -157 -92 197 25 -221 57 211 -116
5684a16o3L32k9l12J33K58k10j99K92R4l30qL23r7k64J52K18k41j26K99M6l20
$$ -116 -179 153 124 -188 -55 203 -7 -206 86 180 -150 -158 165 68 -196 -44 174 -67 -193 106 152 -168
5706a68N3K98j45k31K03J63k62p2K99k5k94J06K75j82j93K34J10k92qL16r2k94
$$ -168 -115 183 38 -193 10 173 -89 -161 138 113 -181 -75 200 18 -175 59 169 -123 -131 185 93 -201
5728b01J72K32k24j63K80M7k99O8K88j55k70K35J95k74j04K95j0l09J24K80k06
$$ -201 -29 203 -21 -184 96 143 -156 -88 200 45 -225 10 205 -69 -173 122 112 -197 -73 207 1
5749Ak31K72J45k97m8L02p3k76J78K36k39j74K89Q5l05rL04j03k42K05J74k54
$$ 1 -230 42 187 -110 -158 144 71 -205 -27 209 -30 -204 85 170 -135 -144 160 57 -185 20 194 -60
5771f0j13L03Pk92P9K66j70k17K43J40k82o9L14n3k73J40K24k20j62K83P8l03
$$ -60 -173 130 137 -155 -76 190 20 -197 46 186 -96 -165 149 96 -177 -37 187 -33 -195 88 166 -137
5793a37LL11j16k59J82K10k60j15L09J8l20P1K91j48k40K27J46k79o7L21l2l05
$$ -137 -134 177 61 -198 -16 194 -66 -181 128 146 -174 -103 188 40 -200 27 173 -106 -173 148 116 -189
5815a89J25K54j86j92K60J06k99rL03q8k79J71K16k29j34K58M3k87N4K77j47k34
$$ -189 -64 190 4 -188 72 178 -121 -130 173 85 -194 -23 193 -36 -170 88 131 -156 -102 175 28 -206
5837b06K09J71k52q4K74qk80J03K49j81k00K47J21k80k5K95o5k80J61K32k28j60
$$ -206 3 174 -78 -162 112 104 -176 -73 176 -5 -205 42 163 -117 -142 153 88 -192 -31 201 -27 -187
5859a87K81O2k90J9K92j23k53K07J71k55j00K79K9k97Q3K58j60k14K29J31k51
$$ -187 94 156 -134 -115 177 54 -199 8 179 -76 -176 103 132 -165 -82 176 16 -198 31 162 -89
5880h9n0K60l3k56J14K26k03j61K43Q0k67RK77r6k42J72J95k33j13K52M2k82O0
$$ -89 -139 121 88 -168 -54 172 -31 -192 51 131 -136 -127 150 54 -188 -16 179 -54 -167 85 127 -155 -95
5903i5K60j37k15K07J49k44p3K69k0k69J08K50j91j90K53J08k82j2K69p0k47J53
$$ -95 165 28 -187 20 169 -75 -148 121 101 -168 -60 190 -1 -191 62 170 -112 -124 145 75 -172 -19
5925a9K06k39j27K67N4k72K4K45j01k18J87J56k50q1K63Rk53P2K26j46j69K16
$$ -19 187 -52 -179 88 142 -130 -106 139 38 -180 7 163 -87 -168 95 104 -149 -77 149 3 -166 50
5947E0R9k48l2K51j6k57J15J92j82j23K21Q6k69J0K59r8k15J58J60k16j00K77
$$ 50 149 -99 -131 120 104 -153 -38 154 -28 -151 70 156 -113 -103 156 58 -157 1 161 -55 -155 122
5969A22%k72O4K50j32j98J99J19k40l9K56m0k61J14K17j68j58K21Q2k59J3K55
$$ 122 122 -150 -86 164 32 -166 33 152 -88 -127 129 89 -172 -58 159 -9 -167 54 136 -123 -110 145
5991A45q9k28J53J83j97j15K22L9k43N0K36j28j98J88J28j93q1K43k7k26R4K19
$$ 145 56 -172 -19 164 -33 -148 74 113 -130 -80 156 28 -170 18 146 -47 -128 115 88 -138 -44 175
6013A75j68j77K09J10k28l3K32n5k20J34J89k06j34K51N1k59L1K29j11k01J84
$$ 175 7 -170 39 149 -79 -112 120 65 -155 -21 168 -38 -172 79 130 -129 -98 131 20 -181 3
6034CJ61k43p7K55Mk36O4K11j51j56K11J10k59m1K68m1k31J11J86j69j16K08O8
$$ 3 164 -79 -156 99 103 -133 -69 142 -9 -165 46 156 -103 -144 124 83 -148 -37 149 -20 -136 72 140
6057A40k51mK54p1j99J15J62j93r4K46Rk37L5K31j11j83J73J04k09m2K33k0k37
$$ 140 -111 -115 139 68 -131 -16 146 -47 -141 105 114 -123 -88 143 32 -151 22 126 -83 -125 108 88 -149
6080a49Q1K16j63j31J88Q4k28lK42p8k15J33J92j99j08K21K4k42O0K37j29j98
$$ -149 -68 148 -15 -146 42 126 -102 -105 137 59 -156 -23 169 -30 -138 83 107 -135 -75 162 33 -165
6102a65J79J47k14p1K31j4k40R9K12j57j67J91J04k19k6K21m7k04J07J85j83j18
$$ -165 14 161 -53 -124 107 93 -147 -48 164 7 -160 31 135 -84 -110 111 64 -140 -33 152 -31 -149
6124a49J94P2k12NK04r3j74J48J59k05r1K35J0k25O2J98j26j68J97J09k30l8K29
$$ -149 45 117 -95 -90 114 21 -153 -5 154 -51 -142 93 103 -122 -60 138 12 -156 41 150 -80 -118 111
6147A11j7k37J04J89j79j16K17O6k36j4K40p9k01J48J50j92r4K34J9k35M0K19
$$ 111 94 -143 -39 150 -29 -145 72 138 -98 -112 128 49 -152 -4 146 -46 -140 94 113 -122 -82 137
6169A37j05j82J72J11k01o6K36j4k24Q4J98j42j51K02P6k13j5K10n4k03J11J81
$$ 137 32 -150 22 133 -68 -134 102 88 -136 -52 146 4 -147 55 131 -82 -97 113 59 -144 -33 148
6191A48j81j15K20M5k30K3K37j10j96J67J44k09o3K08Kk28P1K22j51j74K05J03
$$ 148 -33 -148 72 117 -113 -90 147 37 -159 8 152 -57 -120 88 90 -138 -67 155 4 -170 35 138
6213A38k37k0K40n9k19J25J91j89j19K13N1k33J7K36r6j87J67J24j88q8K23J7
$$ 138 -99 -119 121 62 -157 -32 159 -30 -149 64 115 -118 -101 135 39 -148 19 143 -45 -133 90 107
6235A07k30O6K11j31j76J76J06k00l1K09j8k28J10J77j58j37J98P3k30RK29p6
$$ 107 -123 -57 154 23 -153 23 129 -71 -102 107 89 -139 -29 148 -10 -147 51 124 -106 -97 132 56
6257E6k22J32J69j56j23J96Q6k60R1J50j15j83J97J25k24p7K32N2l28J90J72j89
$$ 56 -166 -34 135 -21 -144 52 138 -122 -31 119 4 -179 18 143 -81 -158 74 126 -202 -12 160 -29
6279b9j73K80L0k09jK65r9k01J31J77k01j16K20N0k26K8K04r6j82J73J20k15n6
$$ -29 -202 78 108 -101 -102 163 64 -137 -6 171 -30 -146 74 124 -102 -74 130 34 -148 25 145 -70 -126
6302a26K32qk28O2J99j39j44J90R2k25k0K30n1k11J12J79j86j14K31M1k43L5K44
$$ -126 106 98 -130 -68 131 -8 -152 38 130 -95 -115 115 64 -147 -35 144 -42 -156 75 116 -127 -92 152
6325A52j02k00J58J49k16o5K44j4k40P9K16j36j72J84J03k34pK36o8k22J29J73
$$ 152 50 -150 8 157 -59 -124 120 106 -134 -55 161 25 -147 37 140 -94 -101 135 67 -155 -26 147
6347A47j65j28K09M1k12K2K09q3j92J43J45j81q1K00J2k14O3J95j23j76J83J19
$$ 147 -18 -146 63 104 -108 -86 123 40 -152 -9 136 -45 -126 74 86 -128 -65 130 7 -169 14 133
6369A33k03m3K12k7k21J23J74j65j33K09P6k17%K08p8k06J70J48j97j06K37Rk11
$$ 133 -70 -113 99 72 -149 -26 148 -17 -150 59 135 -82 -82 126 48 -158 12 160 -37 -143 94 103 -108
6392a08M6J94j16j71J87J16k28n7K28j7k13J02J76j53j32J92Q1k32qK26o1j88
$$ -108 -62 132 16 -155 32 148 -80 -137 91 74 -139 -37 139 -14 -146 46 127 -105 -113 113 52 -136
6414a36J22J40j79q0J99L8k19L3K25j19j51J66R9j90l3J82l1j85L5J84j13j39
$$ -136 -14 126 -53 -133 66 104 -115 -82 143 24 -127 39 138 -52 -85 97 66 -119 -84 100 -13 -152
6436a52J94J16k29o0L10p5k21Q6J88j67j30K10Ok17O8J98q3k46K39O2k21L3J96
$$ -152 42 158 -71 -131 179 104 -117 -31 157 -10 -140 70 76 -141 -73 125 42 -204 35 97 -124 -91 105
6459A05j8j92J04J28r2j86J54J40j88m6K02p5j71J10J79j72j15J88N6k03J2K01
$$ 105 87 -105 -1 127 35 -151 3 143 -45 -91 111 36 -135 -25 154 -18 -133 55 111 -92 -80 121
6481A21p5j82J38J44j80r7K10K7k25N4K00j14j68J80J07k19m7K23k3k09R8J73
$$ 121 46 -136 2 146 -34 -131 79 106 -119 -65 135 21 -147 33 140 -79 -126 97 74 -135 -37 136
6503A36j54j28K00P1k18rK19o6j97J30J62j80r6K17L5k22K5K20j09j76J56J27
$$ 136 -18 -146 54 125 -93 -102 117 51 -146 -16 146 -34 -130 87 122 -100 -75 145 36 -140 16 143
6525A43k09n2K21k6k09Q0J76j30j37J92Q0k27nK21n3k03J16J55j64j12K09K7k12
$$ 143 -66 -118 103 77 -132 -52 124 -6 -143 49 129 -98 -103 118 65 -138 -22 133 -31 -143 66 93 -119
6548a19M6K11j12j85J53J31j86p2K24j4k08Q1J94j42j45J88R2k20k4K38m9k20
$$ -119 -73 138 26 -159 -6 125 -61 -133 91 77 -131 -50 144 2 -143 45 137 -83 -107 131 82 -138
6570a38J20J75j77j18K14L3k06J9J95q1j86J44J34j80q3K08J0k02M5J86r6j72
$$ -138 -18 157 -20 -138 76 109 -97 -78 117 36 -150 -6 128 -52 -135 73 83 -119 -74 112 16 -156
6592a56J73J09k00k5K02l6k08J01J73j45j26J94M9k10K7K07r3j77J36J54j80r5
$$ -156 17 126 -74 -99 103 67 -141 -40 133 -12 -138 56 105 -105 -78 129 36 -141 -5 149 -31 -126
6614a26K12J0k05N5J89j09j86J92J13k18l6K09l2j92Q9J81j61j39K06P7k31PK11
$$ -126 86 96 -109 -54 135 26 -160 32 145 -73 -109 100 68 -124 -35 146 -15 -154 52 129 -102 -95 116
6637A16p0j92J44J43j90r3K13M2k29M1K05r9j64J56J17j95o7K23rk20Q6J88j47
$$ 116 46 -146 -2 141 -49 -142 71 113 -116 -75 130 31 -133 23 140 -55 -122 101 92 -128 -42 146 -1
6660aj30J88P4k14k1K20m4k00J04J60j76q5J94L8k22M0J95j17j42J66J42k76J5
$$ -1 -131 57 131 -83 -104 116 72 -128 -24 136 -40 -125 69 107 -115 -75 120 3 -139 27 169 -107 -92
6683i2J71ok15M3K33r9j69J49R7k07l1K48p4j94J10J84j60j17J91M8k12L2K07
$$ -92 79 73 -142 -99 134 35 -134 15 112 -95 -126 122 48 -146 -36 148 -12 -129 62 110 -102 -70 137
6706A37q8j98J49J49j67r6K09Ok03N7J82j28j56J75R9j91m9K08l6k00J20J66j65
$$ 137 49 -149 0 149 -18 -114 95 101 -102 -45 137 9 -147 28 127 -64 -113 95 59 -141 -21 145 -20
6729b0j27K07N1k07OK17r7j78J63J28k05q0K26K9k34N9K07j38j54J91J08k34m0
$$ -20 -147 60 111 -96 -90 127 30 -148 15 143 -62 -142 84 113 -121 -62 145 7 -147 44 152 -82 -122
6752a22K26j0k02Q3J58j44j16J91P1k22j4K20n1j99J14J42j62r2K07K1k18L0K12
$$ -122 104 94 -108 -25 133 -11 -127 64 135 -87 -101 119 68 -131 -17 125 -37 -129 78 99 -119 -89 123
6775A23r5j67J57J00j91n2K30kk29P6J85j38j24J80O0k06J0K09o5k07J38J63j84
$$ 123 28 -139 18 118 -73 -125 105 103 -126 -50 135 -3 -127 53 113 -93 -83 126 61 -146 -8 155 -29
6798b9j06K10L6k15M5K01j07j91J69J35k01o2K10j7k03Q9J73j41j40J81R3k08
$$ -29 -135 75 111 -104 -59 142 35 -156 13 148 -53 -115 95 78 -125 -36 137 -4 -144 37 130 -78
6820g8k2J95l7j84J08J57j67j26K07N2k05J4J94p2j73J50J25j88o5J89K5k02M9
$$ -78 -100 95 58 -126 -18 139 -28 -154 53 105 -100 -86 108 36 -137 13 138 -50 -115 74 99 -103 -54
6843e4J92j30j50J71J18k22l3K10k3k04J15J63j71j10K01N0k21OK14q4j64J14
$$ -54 138 8 -142 29 147 -75 -108 102 79 -125 -10 153 -18 -128 73 123 -98 -92 122 38 -126 -12
6865a2J65k01q1K06K8k54P2K23j27j52J51R0j83l8K08k0j90P6J96j79j07J57J23
$$ -12 153 -48 -129 77 105 -149 -77 146 19 -133 18 108 -75 -113 95 75 -115 -39 157 -22 -129 28 151
6888A51k36m4K79p2j72P3J51j72m8J07J11k31N0J86o1j77J59Q7j76j02K31m5k18
$$ 151 -85 -129 150 78 -94 -21 130 -42 -90 17 128 -103 -53 133 72 -105 54 141 -35 -137 94 49 -169
6911a69J13J77j65j23K29O5k15RK10p1k11J13J52j87n7K54j9k03O6J07k0j24K9
$$ -169 -56 121 -44 -167 62 127 -88 -79 131 60 -151 -38 114 -73 -130 124 105 -98 -32 75 55 -69 -40
6934d0K34k55j8J50J0j85L1J62l8j89K15J1j59MJ81mj98J26N1o4j46J56O6k50
$$ -40 194 -61 -79 71 81 -104 -73 89 51 -138 77 88 -71 -67 114 110 -88 38 89 25 -121 35 101 -149
6958a49N3J96o8k14K00J26j49j78J98O0k48J31J82j65j17J50J20k13l3K27m1j94
$$ -149 -96 100 32 -182 18 144 -5 -183 15 75 -173 -42 140 -25 -142 8 128 -85 -118 109 68 -126
6980a26J09J51j51j18J97N8k04%J94o5j69J30J37j82q4J97J8j88K8J95j03j50
$$ -126 -17 134 -17 -135 62 120 -84 -84 110 45 -124 6 143 -39 -123 74 92 -96 -68 127 24 -126
7002a26J45J08j77p3K06Jj99P0J36r1j58J93N8j99K3J99p1j86J13J61j98q1K22
$$ -126 19 127 -50 -123 83 84 -115 -45 91 0 -158 35 93 -106 -83 116 45 -141 -28 133 -65 -146 76
7025G6j8j64pK20n8k31J81J17j91MJ72M5k99J24K06j70j51J18J47k26M3K21j10
$$ 76 58 -106 -113 107 49 -182 -1 116 -75 -71 101 146 -153 -29 177 7 -144 -26 121 -105 -62 159 49
7048D9j80J10J79j54j12J66O8k20J0J51nk27J51J82k17q4K24l4j29N9J03m9j82
$$ 49 -131 -21 158 4 -108 58 126 -94 -84 67 62 -165 -14 168 -49 -133 91 57 -72 -13 90 41 -141
7071a41K07J17k71O9P1Mk34K19J10j61j08J57J21l52L4K42q1j33J14K43k47j16
$$ -141 66 183 -88 -19 52 56 -178 41 151 -10 -118 39 160 -192 -158 84 3 -130 -16 227 -20 -136
7093a36J95K6k29J55P6o8j07J38J35j95k15L79n6k08P1J18n2j19J74K3j74l7J98
$$ -136 59 85 -144 11 87 19 -88 50 185 -10 -225 154 98 -110 -39 79 27 -92 82 105 -69 -106 92
7116I2k0k04J52J08j48o6J72J7k23M0K05q1j54J43Q8j87l0K12j2k24P9J86j33
$$ 92 72 -132 20 128 -20 -86 86 103 -120 -80 125 44 -110 33 121 -66 -96 116 104 -120 -41 145 12
7139A2j33J67O6j98MK17p9j81J13J51j62j11K04L0k08L5K03j03j70J60J19j83
$$ 12 -121 46 112 -86 -82 135 56 -125 -12 139 -23 -134 70 100 -108 -73 130 27 -143 17 136 -47
7161d7n9K05j5k04Q0J84j41j44J73R3j87l1J97m3j92J16J64j82m3K30n3j27l6
$$ -47 -106 99 84 -120 -40 144 3 -141 32 125 -62 -93 104 61 -131 -15 149 -33 -76 154 101 -26 -62
7184f2J70o6j65J34J28j72q3J98Mj99O4J76j20j49J77P9j80l7K04m5j81R4J58
$$ -62 108 42 -123 11 139 -33 -116 82 86 -113 -49 127 7 -142 35 114 -66 -103 101 56 -125 -31 127
7207A27j44j09J99M3k11J0K17p8j77J28J35j76q2K06J1k04N3J82j01j44J46R7
$$ 127 -17 -126 73 116 -95 -85 132 54 -123 5 140 -36 -118 88 99 -105 -52 130 29 -115 31 128
7229A28j90l6K01l3j84P4J66j24j24J63P3j94pJ81m0j77R5J44j47j01J85L2j95
$$ 128 -62 -98 103 70 -114 -40 126 2 -122 41 114 -80 -87 94 54 -123 -28 116 -31 -132 53 85 -110
7252a10K5J99j01j55J48J18j78n3J90J1k00N6J69j07j56J84Q5k11jJ87m1j90J14
$$ -110 -85 114 13 -142 6 124 -54 -107 83 94 -106 -50 119 12 -144 40 125 -86 -87 100 59 -131 -17
7275a7J39j48r9J81N4k13J1J93o2j86J19J56j76n3J62Ok17J06J54j15j19J48P9
$$ -17 122 -26 -125 56 110 -103 -92 101 39 -147 -28 128 -48 -101 61 67 -150 -44 110 -5 -124 24 103
7298A03k00j7J99n1j61P2J84j52q6J25R6j86KJ87q3j51J24J57k18q0K31K6k06
$$ 103 -97 -114 85 34 -127 -55 129 -23 -109 16 112 -74 -72 115 32 -119 5 162 -56 -136 95 121 -85
7321h5N3J66r7j37J64M6j32k8J11m5j29k3K81j72p7J25O3j31n7K46q8k56J59J25
$$ -85 -32 134 37 -100 64 110 -22 -50 61 16 -113 -136 145 -27 -104 21 84 -47 -104 142 54 -202 -43 82
7345H2j17r6J22J24j55QJ68r0k19K25J02j74j28K23l3j95O0J84o4p8O6J18j67
$$ 82 -35 -131 -9 115 -40 -32 136 46 -173 52 154 -20 -148 75 42 -153 -93 91 27 -51 15 133 -34
7368c4QJ36m4k05J30J22j44r2J68M1j60K8J24m4j69J33J02j30o9K14p3j46K2J99
$$ -34 -26 110 66 -139 -9 113 -31 -123 45 86 -74 -46 78 34 -135 -2 100 -30 -99 115 42 -104 -82 117
7392A17j03j38J12J18j64l2J97k5k08R6J68j09j38J54N9j81NJ85n5j65R2J53j69
$$ 117 14 -124 -12 106 -58 -90 107 82 -126 -30 138 29 -109 45 104 -77 -72 113 58 -107 -15 138 -31
7415c1o5J64K7j66J7J70q3j43J12J20j63o1J76jj71N2J61j24j28J60Q7j76k6J71
$$ -31 -96 68 95 -71 -54 116 33 -110 2 122 -41 -102 74 73 -98 -46 115 -9 -137 23 110 -66 -92 79
7439G9m6j57J11J34j25j21J70N6j72j0K05p7j69J36J16j62q2J82K7j87M0J77j00
$$ 79 33 -124 -13 121 -4 -125 45 101 -71 -81 124 47 -122 14 130 -32 -114 68 95 -92 -52 125 25
7462B5j38J45R4j75n6J93pj81O7J37j17j05J58O0j67k3J89n6j51R0J26j46p8J66
$$ 25 -113 32 126 -49 -105 88 81 -100 -33 104 -13 -118 40 100 -67 -90 99 43 -108 -18 108 -38 -116 50
7486E0L1j75J4J81p1j47J18J08j47n5J94j2j93O2J71j08j32J46O9j68l2K06o0
$$ 50 81 -94 -80 101 30 -117 1 109 -38 -93 101 89 -104 -42 129 21 -111 35 104 -64 -96 110 50
7509E0j67J07J43j60r6K10K3j90J6J81j10j44J37R9j22o8J78pk25Q0J59l6k25
$$ 50 -117 -10 133 -27 -123 87 110 -80 -64 117 7 -137 0 99 -23 -91 87 80 -145 -65 94 58 -167
7532a67K03K5j33KJ52jk24J19J62j53j09J78L2j58mJ74n3j60J13J29j54p9J71
$$ -167 36 61 -72 -70 82 81 -143 -24 138 -15 -124 54 86 -72 -76 98 45 -115 -2 127 -27 -106 65
7555F5K9j84L4J61p2j43J33Q8j60m8J81j3j79O9J36j10j05J49O2j69oJ77m9j69
$$ 65 94 -90 -56 105 33 -110 23 111 -49 -97 84 71 -108 -39 97 -13 -118 31 93 -76 -82 95 46 -123
7579a23J10J22j42o5J52L6j75J4J72p5j29J15J01j55m2J66kj79N4J54j00j13J31
$$ -123 -13 109 -33 -98 54 90 -85 -71 101 26 -103 12 113 -42 -84 82 80 -99 -45 109 9 -104 27
7602B7P5j65j7J72k8j58P0J39j31r1J58K9j55K6J48o6j59J15J11j59m8J70J8j78
$$ 27 102 -63 -80 92 64 -94 -24 115 -16 -107 51 80 -75 -49 99 33 -126 -11 100 -59 -107 63 81 -97
7626i7N3J64j18j14J34P8j60k2J68k3j57P7J37j30r4J63M4j73MJ77o6j51R8J20
$$ -97 -44 120 2 -112 22 100 -60 -82 86 63 -94 -17 120 -10 -104 59 103 -70 -66 111 45 -106 -8 112
7650A12j41o4J55K0j67M2J56q9j31J24Q7j62k3J55k0j63P3J51j20j04J44N6j75
$$ 112 -29 -93 62 82 -85 -43 113 24 -107 17 104 -58 -81 74 54 -109 -36 115 -5 -109 35 91 -84
7673h4J1J60m8j54J06J11j32o8J48L1j72M6J54q9j21J08J14j46n5J55pj63P1J41
$$ -84 -73 87 39 -115 -9 102 -30 -98 50 81 -91 -45 109 20 -101 7 121 -25 -80 75 68 -95 -24 117
7697A17j08j28J50P5j64j8J31o6r8Q3J24r9j29J85K0j47RJ52o2j29R2J14j38o8
$$ 117 9 -119 31 106 -58 -76 55 -11 -109 -26 98 -1 -130 55 75 -72 -63 89 27 -102 -10 104 -34 -102
7721a02J70Qj70M5J48q7j14J33O7j58k8J77k2j68P1J46j24r1J59M1j74RJ76o9
$$ -102 68 76 -94 -49 99 12 -102 31 98 -60 -88 89 67 -101 -30 116 -8 -99 60 101 -73 -64 112 43
7745D3j38Q8J11j41m8J49J5j69L2J49o5j32J11Q6j43l1J49qj74O4J42q5j15J33
$$ 43 -95 -7 104 -37 -85 64 79 -90 -58 91 26 -106 5 91 -52 -83 66 58 -116 -52 90 5 -110 23
7769B3N7j49NJ45m8j42R4J27j25q1J48L0j57K5J51p4j31J10J05j49m4J59j5j51
$$ 23 80 -69 -64 81 33 -109 -15 112 -13 -94 54 84 -73 -48 103 29 -102 8 113 -36 -80 79 64 -87
7793h7N6J46j11j05J22P6j46k4J54n4j25R1J11j26q3J52K9j59J7J55n9j33J05
$$ -87 -31 115 4 -101 21 97 -49 -73 81 27 -98 -7 104 -22 -105 47 76 -83 -66 89 30 -103 2
7816BJ01j48n1J62Nj55M6J34q2j13J29O9j52k3J71l3j39O6J12j07r6J49M1j60
$$ 2 103 -45 -96 66 71 -84 -38 96 14 -99 30 99 -53 -76 95 62 -77 -11 101 -6 -102 47 88 -72
7840g2J0J59n7j42R0J08j15p7J70Qj76L4J51p9j17J20P0j42k7J54oj69P2J34j07
$$ -72 -62 97 40 -102 -12 96 -19 -96 74 82 -94 -60 91 12 -105 15 85 -57 -84 70 64 -105 -33 101 -6
7865fj01J35N0j48PJ60o5j24P6J22j09q0J36J4j34L3J36p4j22J01R8j40l8J37
$$ -6 -107 28 78 -70 -63 97 32 -92 -16 106 -3 -83 53 67 -67 -34 102 28 -94 7 105 -35 -73 64
7889F4pj49N7J33r3j17J36O8j51j3J51l5j42R0J10j23q5J53L0j52K1J55q3j14
$$ 64 57 -92 -35 98 5 -112 24 92 -59 -72 79 44 -98 -8 102 -21 -106 47 77 -75 -54 101 18 -96
7913i6J12R2j52l4J51lj50M9J39j07r8J37N7j46mJ36k4j38O4J13j09p3J36K9j49
$$ -96 16 108 -44 -78 73 70 -80 -31 108 1 -97 40 97 -49 -53 83 59 -79 -15 98 -11 -84 52 81 -68
7938f8%J50n0j29R4R3j25m3J37J4j45K3J42q3j15J17Q1j58j7J52k1j49Q1J19j02
$$ -68 -68 82 32 -97 -3 90 -35 -78 59 73 -72 -49 93 10 -105 12 93 -65 -82 70 49 -100 -19 100 -2
7963br8J46M2j47mJ52n0j48J12J05j27p2J54J8j60L6J44q1j18J11Q2j47k3J47
$$ -2 -100 46 88 -59 -63 89 39 -109 3 108 -19 -91 63 81 -79 -43 101 20 -98 13 95 -52 -75 72
7987G2k6j37M3J40q4j08J34N2j49j5J53l4j47P5J28j30o3J41L5j48J3J45o1j26
$$ 72 46 -91 -48 92 8 -100 34 86 -63 -78 75 41 -106 -31 97 -33 -96 45 80 -68 -55 90 29 -97
8011i7J10Q8j43l0J54pj65N5J45j01j04J30N9j53lJ49l7j47Q1J21j16p6J37L4
$$ -97 13 101 -42 -72 82 75 -90 -35 110 9 -95 35 94 -59 -62 87 50 -97 -16 105 -11 -87 50 84
8035H4j60RJ63p1j26J06R8j28n3J33Oj44N0J35r9j17J31P7j49j6J39k0j37O9J19
$$ 84 -76 -67 96 25 -101 5 103 -25 -78 55 61 -83 -33 102 3 -114 17 94 -55 -71 68 48 -89 -20 99
8060I9r7r6J47M5j57KJ50m8j45J04J03j31o7J49J5j52M0J31p6j20J24P2j42l3
$$ 99 2 -94 53 98 -59 -57 93 45 -100 4 107 -24 -91 58 73 -79 -39 92 16 -104 20 92 -50 -83
8084h3J57j1j67P8J24j16p4J31M5j53jJ64n1j40Q4J08j30o0J54J9j53K2J57q2
$$ -83 74 63 -104 -26 98 -18 -92 39 84 -69 -70 94 43 -97 -13 95 -35 -95 59 78 -75 -53 104 22
8108B2j04R0R5j47l9J60j6j48N8J38r5j01J22N7j37jJ28m1j45R3J11j15q7J37
$$ 22 -82 8 103 -44 -83 77 61 -87 -29 109 14 -87 35 92 -45 -46 82 41 -104 -11 100 -15 -102 35
8132C5L4j44J4J47p2j27J10J04j38n4J45Lj42N1J25r4j17J44O5j39rJ37j5j53
$$ 35 69 -75 -61 86 14 -113 -3 101 -37 -91 54 57 -85 -34 91 -3 -120 24 89 -50 -59 78 63 -90
8156i0R0J05j17q4J39N4j56QJ45n9j14Q5R5j28o1J48J3j47L0J37q0j13J09P7j42
$$ -90 0 105 -12 -96 43 97 -59 -51 94 35 -79 6 101 -27 -88 60 73 -74 -44 93 13 -100 9 86 -56
8181e6k5J36Pj66P4J12r1q9J47K3
$$ -56 -81 55 62 -104 -30 82 -9 -98 49 72
8191G2
$$ Imaginary data points
##PAGE= N=2
##DATA TABLE= (X++(I..I)), XYDATA
0@%%%%%%%%%%%%%%%mJ2j6J6j6J6j7K5l2L3m1M8n4O2p2Q2r1J05j20J36j53J71j89
$$ 0 0 0 0 0 0 0 0 0 0 0 0 0 0 0 0 -4 8 -8 8 -8 8 -9 16 -16 17 -24 24 -30 32 -40 42 -49 56 -64 72 -81 90 -99
38i9K12k37K62k91L24l58L95m36M81n32N87o47P12p84Q64r52J053j168J299j448
$$ -99 113 -124 138 -153 171 -187 208 -228 253 -279 308 -339 373 -411 453 -499 554 -614 685 -763
58g63J619j826K076k381K768l279L982n009O661r724J7155o5158o2165K17447
$$ -763 856 -970 1106 -1275 1493 -1786 2196 -2813 3848 -5876 11279 -53879 -116044 101403
72A01403k4720j95475P8641J71999j38387j21372J72938O9337j95794o096J91152
$$ 101403 76683 -118792 -40151 131848 -6539 -127911 45027 114364 -81430 -87526 103626
83A03626n0766j70675J05944J29614j46149q0456J73539K3519j79082L1611J66662
$$ 103626 52860 -117815 -11871 117743 -28406 -108862 64677 88196 -90886 -59275 107387
94A07387q4290j34884J26891R1229j57650l8331J71656j5616j68357O7075J46231
$$ 107387 23097 -111787 15104 106333 -51317 -89648 82008 66392 -101965 -34890 111341
105A11341j11053j09347J45018O1608j64966r277J69305m2574j56715Q8472J28152
$$ 111341 288 -109059 35959 97567 -67399 -76676 92629 50055 -106660 -18188 109964
116A09964j25401q6655J49977L7082j60640J4509J55770o2311j35422J01852J01133
$$ 109964 -15437 -102092 47885 84967 -75673 -61164 94606 32295 -103127 -1275 99858
127I9858j30249n7227J45169Q574j45735L9316J32268q0930j05553J12313O7954
$$ 99858 -30391 -87618 57551 66125 -79610 -40294 91974 11044 -94509 17804 85758
138H5758j31324k3533J37013k2397j29157O4905J08928r9181p7754J22344L8837
$$ 85758 -45566 -69099 67914 45517 -83640 -18735 90193 -8988 -86742 35602 74439
149G4439j32654M043J29947m6237j15089Q3124Q9831j10500n6039J26214J6786
$$ 74439 -58215 -54172 75775 29538 -85551 -2427 87404 -23096 -79135 47079 63865
160F3865j29475K3823J20344o1822j00234R3022P1242j14057l5864J22736k835
$$ 63865 -65610 -41787 78557 16735 -83499 9523 80765 -33292 -69156 53580 50745
171E0745j19107M0797J03870p4216p9184R9262M7370j13363j1418J15246k5287
$$ 50745 -68362 -27565 76305 2089 -77095 22167 69537 -43826 -55244 60002 34715
182C4715j05167N9118Q4527q6745n6075J05007K2767j11746J2577J06780m6437
$$ 34715 -70452 -11334 73193 -13552 -69627 35380 58147 -53599 -41022 65758 19321
193A9321r0944P5434O6245r6626l5478J08012K060j08170L1058R7479o0714p7259
$$ 19321 -71623 3811 70056 -26570 -62048 45964 48024 -60146 -29088 68391 7677 -69582
205f9582Q4234N0085r9350j8860J04423j3293r8992M3582Q3856o8962o0712Q7114
$$ -69582 14652 64737 -34613 -53473 50950 37657 -61335 -17753 66103 -2859 -63571 23543
217B3543L2000r6587j034R6144k9175q5865N5878O6912p6610m1460Q9222J1966
$$ 23543 55543 -41044 -42078 54066 24891 -60974 -5096 61816 -14794 -56254 32968 44934
229D4934r2745J8286Q6651m6359p1603O9411M9127q5164k1715R2197p783q9847
$$ 44934 -47811 -29525 57126 10767 -60836 8575 57702 -27462 -49177 43020 35237 -54610
241e4610L6232P8283o0860n8782P9387L3646q9647n320R0874k3225q3098M8960
$$ -54610 -18378 59905 -955 -59737 19650 53296 -36351 -41671 49203 25978 -57120 -8160
253h160O7220o9352m4786Q2696J8527q7560Q926Q3582l4789p1310N6604N2140
$$ -8160 59060 -10292 -55078 27618 46145 -41415 -32489 51093 16304 -55006 1598 53738
265E3738p2354k8252Q0589K177q0486K3485P2165m6252n6584O3836L5182p4874
$$ 53738 -18616 -46868 33721 35898 -44588 -21103 51062 4810 -51774 12062 47244 -27630
277b7630j0470P8340j4871p3746L8248O1476n7600m2926P0993J9772p7360N389
$$ -27630 -38100 40240 25369 -48377 -10129 51347 -6253 -49179 21814 41586 -35774 -30385
289c0385P6138k9702o7359N0747N1704o6444l0698P5476O493p7160J8178P1439
$$ -30385 45753 16051 -51308 -561 51143 -15301 -45999 29477 35970 -41190 -23012 48427
301D8427m0542n8695N8370M0301o9834j7931P4117o121p1256K9227O1749m8623
$$ 48427 7885 -50810 7560 47861 -21973 -39904 34213 28092 -43164 -13937 47812 -811
313h11m6329O2502K6455o9585m076O9462j8610o2602L9175M9843n5236l2437O5117
$$ -811 -47140 15362 41817 -27768 -31844 37618 19008 -43594 -4419 45424 -9812 -42249 22868
326B2868J1920o7978R856O3892l0848n3784M8548L8764o1104k0152O7108l87o6114
$$ 22868 34788 -33190 -23334 40558 9710 -44074 4474 43238 -17866 -38018 29090 28703 -37411
339c7411K1049N8422m0017m5316N5051K8255o4284q719O6677j1569o2036L0890
$$ -37411 -16362 42060 2043 -43273 11778 40033 -24251 -32970 33707 22138 -39898 -9008
351i008N1084m7299l5391N9002J6763o4427L038O2915k2260n4561L9354M0662
$$ -9008 42076 -5223 -40614 18388 35151 -29276 -26238 36677 14417 -40144 -790 39872
363C9872n2632k3102O0516L859o1971J5323N6657l2504m5263M6520K9194n6088
$$ 39872 -12760 -35862 24654 28513 -33458 -18135 38522 6018 -39245 7275 36469 -19619
375a9619j0742O0126q067n7946K5484M9537m0106l5832N0785J8649n6917j8N7577
$$ -19619 -30361 29765 21698 -36248 -10764 38773 -1333 -37165 13620 32269 -24648 -24666 32911
388C2911j7918n2433L3333M1778m5091k6696N2634Q887n5401R326N2903k5913
$$ 32911 14993 -37440 -4107 37671 -7420 -34116 18518 27405 -27996 -18670 34233 8320
400H320m5215L9381L2694m8535j6546N3151j570n2699J9119M7387l4173l7208
$$ 8320 -36895 2486 35180 -13355 -29901 23250 21680 -31019 -11900 35487 1314 -35894
412c5894M5166K2892n1293n777N2444j2135m8724K8617M0356m1596k8052M9785
$$ -35894 9272 32164 -19129 -24906 27538 15403 -33321 -4704 35652 -5944 -33996 15789
424A5789J2655n2571M439N0260k1294m3417L5692L2731m5969j9041N1040L387
$$ 15789 28444 -24127 -19688 30572 9278 -34139 1553 34284 -11685 -30726 20314 23701
436B3701n0608J2842M5271k7948l5969L9982K3710m7461r527M9568n613m6342
$$ 23701 -26907 -14065 31206 3258 -32711 7271 30981 -16480 -26007 23561 17948 -28394
448b8394K0428L8596l3307k7483M2746J4170m7485J73M6875j4514m1142K7777
$$ -28394 -7966 30630 -2677 -30160 12586 26756 -20729 -20556 26319 11805 -29337 -1560
460a560L1348l8577j8730M5462M677m7535R642M4309k3089l6179L4551K4397m2878
$$ -1560 29788 -8789 -27519 17943 22620 -24915 -15273 29036 5947 -30232 4319 28716 -14162
473a4162j0418M6947m181m6100J8053M0108l0074k9800L9325J6521m4819j929
$$ -14162 -24580 22367 18186 -27914 -9861 30247 173 -29627 9698 26219 -18600 -20529
485b0529M5869j2307m2146K4755L3856l4496k1959M0915P998m3402O308M1657
$$ -20529 25340 13033 -29113 -4358 29498 -4998 -26957 13958 21956 -21446 -15138 26519
497B6519j9405l5651L0027K5862l7422j3293M1142m94m0916J3929L6773k5509
$$ 26519 7114 -28537 1490 27352 -10070 -23363 17779 17285 -23631 -9702 27071 1562
509A562k8901L4130J7927l9299m964M0657q516l8139K0977L1957l1095k2519L7774
$$ 1562 -27339 6791 24718 -14581 -19545 21112 12596 -25543 -4566 27391 -3704 -26223 11551
522A1551J0595m0650K617L9573j5650l4696K6941K6472l5264j5549L9711K946
$$ 11551 22146 -18504 -15887 23686 8036 -26660 281 26753 -8511 -24060 15651 18597
534A8597m0069J0060L6482k2031k9342L1615J9386l7546p656L9434m815l7245
$$ 18597 -21472 -11412 25070 3039 -26303 5312 24698 -12848 -20504 18930 14115 -23130
546b3130J6758L1383k6875k2596L4162J1736l7687R8L7247j1945l2928K2442K5609
$$ -23130 -6372 25011 -1864 -24460 9702 21438 -16249 -16151 21096 9151 -23777 -1335 24274
559B4274l0702j5780L5631M698l6843O705L4321j7497k8411K6499J9660l2787
$$ 24274 -6428 -22208 13423 18121 -18722 -12017 22304 4807 -23604 2895 22555 -10232
571a0232r212L5809k057l5094J3008L0850k2775k3391L0150J3576l4453k545L5238
$$ -10232 -19444 16365 14308 -20786 -7778 23072 297 -23094 7056 20632 -13821 -16366 18872
584A8872q663l2365J8986K6149k7365j7177L2839O524l4946M766L3396j5419k8314
$$ 18872 10209 -22156 -3170 22979 -4386 -21563 11276 17800 -17146 -12380 21016 5597 -22717
597b2717K4444K0397l0910j0435L4116m82l3708J1252K9890k0682k3089K7983
$$ -22717 1727 22124 -8786 -19221 14895 14413 -19295 -8043 21847 1165 -21924 6059
609F059J4053l2368l813L3384o683l0983J6350K5476k4271j7538K9705Q031l2154
$$ 6059 20112 -12256 -16069 17315 10632 -20351 -4001 21475 -2796 -20334 9371 17402 -14752
622a4752K018L1204j1684k7173K0086K0453k6561j1701L0300K001l1064P712K8581
$$ -14752 -12734 18470 6786 -20387 -301 20152 -6409 -18110 12190 14191 -16873 -9161 19420
635A9420j6564k3124K3757J5278k8618n860L0652l991k9570J3279K5474k1161
$$ 19420 2856 -20268 3489 18767 -9851 -15711 14941 10950 -18620 -5341 20133 -1028
647a028j8574K6946R699l0077J90L0355r899k7519J8372K1821k4784j3800K8757
$$ -1028 -19602 7344 17043 -13034 -12844 17511 7612 -19907 -1535 20286 -4498 -18298 10459
660A0459M250k9922N663K8218j4769k3773K2032J6885k6835q236K8862j245k8152
$$ 10459 14709 -15213 -9550 18668 3899 -19874 2158 19043 -7792 -16028 12834 11589 -16563
673a6563J0504K4795j8432j9183K4177J1541k7203k759K7413o260k5269J4810
$$ -16563 -6059 18736 304 -18879 5298 16839 -10364 -13123 14290 8030 -17239 -2429
685b429K0646k1534j4187K5832O207k7303K559K6000j1238k2236J8814J6520k4343
$$ -2429 18217 -3317 -17504 8328 14535 -12768 -10209 15791 4553 -17683 1131 17651 -6692
698f692r212K7172R24k6932P638K4063j5671j8832K2194J2041k6345m212K7567
$$ -6692 -15904 11268 12192 -14740 -7102 16961 1290 -17542 4652 16693 -9652 -13864 13703
711A3703m107k5786J2218K1230j9166j4730K4276P121k6754R18K6169q832k2720
$$ 13703 9596 -16190 -3972 17258 -1908 -16638 7638 14759 -11995 -11077 15092 6260 -16460
724a6460J5893J7037k1495r910K4997K078k5879N530K3908j2557j9351J8469J2728
$$ -16460 -567 16470 -5025 -14935 10062 12140 -13739 -8209 15699 3142 -16209 2260 14988
737A4988k2624n141K4603k542k4218R798K1044j5902j5523K0560Q436k3504n25
$$ 14988 -7636 -12777 11826 9284 -14934 -5136 15908 6 -15517 5043 13479 -10025 -10550
750a0550K4123o965k2246J3612J7971j8707j1620K2056L958k3556M109K2849j1434
$$ -10550 13573 6608 -15638 -2026 15945 -2762 -14382 7674 11632 -11924 -7815 15034 3600
763C600j9716J7214J4487k1229p364K3260q20k2986Q538K0798j5194j6444J9957
$$ 3600 -16116 1098 15585 -5644 -13008 10252 9432 -13554 -5016 15782 588 -15856 4101
776D101J0152k2524k705K2897n221k1215J2498J7572j8040j2408K1453N844k2570
$$ 4101 14253 -8271 -10976 11921 6700 -14515 -2017 15555 -2485 -14893 6560 12404 -10166
789a0166J487K1500q777j8598J5079J4112j9563q487K1914J800k1663N133J9471
$$ -10166 -8679 12821 4044 -14554 525 14637 -4926 -13413 8501 10301 -11362 -6229 13242
802A3242j1747j5745J7299J0556k0760m504K1871k057k0505Q660J7191j4629j2305
$$ 13242 1495 -14250 3049 13605 -7155 -11659 10212 8155 -12350 -3690 13501 -1128 -13433
815a3433J9218O402k1500p3K1425o418j8877J2403J4526j7548q711K0748K341
$$ -13433 5785 12187 -9313 -9386 12039 5621 -13256 -853 13673 -3875 -12586 8162 10503
828A0503k1735M144K0242j0249j6464J5479J0921j9296m592K1186j937k0851Q107
$$ 10503 -11232 -7088 13154 2905 -13559 1920 12841 -6455 -11047 10139 8202 -12649 -4542
841d542J8065j3358j3381J7383P332j9773q60K0370n522j8766J1045J5114j5325
$$ -4542 13523 165 -13216 4167 11499 -8274 -9134 11236 5714 -13052 -2007 13107 -2218
854b218r856J8210L648j9401K729J8816q595j6265J3424J2005j6814o417J8657
$$ -2218 -12074 6136 9784 -9617 -6888 11928 3333 -12932 492 12497 -4317 -10734 7923
867G923J40j8737O071J7080j1505j3628J5632Q654j8132k681J8922l719j7810
$$ 7923 8063 -10674 -4603 12477 972 -12656 2976 11630 -6502 -9183 9739 6020 -11790
880a1790R590J5025j4317j0811J7589N201j8974J008J8459p168j6201J2514J2340
$$ -11790 -2200 12825 -1492 -12303 5286 10487 -8487 -7479 10980 3812 -12389 125 12465
893A2465j6468p244J8560J363j8741M690J6994j0213j3676J4590R075j7323l635
$$ 12465 -4003 -11247 7313 8676 -10065 -5375 11619 1406 -12270 2320 11395 -5928 -9563
906i563J8215k151j7219P720J4526j2404j0494J5808N553j7482j01J7343n323
$$ -9563 8652 6501 -10718 -2998 11528 -876 -11370 4438 9991 -7491 -7592 9751 4428
919D428j5417J0226J2037j4081p495J6504K258j7183L191J6094q323j3364J2650
$$ 4428 -10989 -763 11274 -2807 -10302 6202 8460 -8723 -5532 10562 2239 -11125 1525
932A525R275j5700m285J7115j143j6758O439J4641j1127j1058J4649O328j6681
$$ 1525 10800 -4900 -9185 7930 6787 -9971 -3532 11109 -18 -11076 3573 9901 -6780
945f780j002J6956m427j5496R369J2429j3334q141J5881L060j6780K292J5913
$$ -6780 -7782 9174 4747 -10749 -1380 11049 -2285 -10426 5455 8515 -8265 -5973 9940
958I940p328j3438J1567R700j4567n038J6051m2j5831N067J4034r515j0854J3021
$$ 9940 2612 -10826 741 10441 -4126 -9164 6887 6845 -8986 -3919 10115 600 -10254 2767
972B767O704j5160j963J5747k915j4625P462J2025j1274q257J4004L703j5281
$$ 2767 9471 -5689 -7652 8095 5180 -9445 -1983 10042 -1232 -9489 4515 8218 -7063
985g063J128J4957n837j3020R923R690j3092n371J4944N51j5279M234J3922q567
$$ -7063 -5935 9022 3185 -9835 88 9778 -3314 -8685 6259 6810 -8469 -4235 9687 1120
999A120j1047J2015O946j4328k119J5185k823j4493P329J2227j0989q595J3520
$$ 1120 -9927 2088 9034 -5294 -7413 7772 4949 -9544 -2215 10012 -977 -9572 3948
1012C948M024j4734R07J4556n555j2949R517J0007j2334n961J3896J310j4181
$$ 3948 7972 -6762 -5855 8701 3146 -9803 -286 9721 -2613 -8574 5322 6632 -7549
1025g549L469J3180p685j0940J0970P616j3016l441J3734j137j3239N612J1539
$$ -7549 -4080 9100 1415 -9525 1445 9061 -3955 -7396 6338 5201 -8038 -2426 9113
1038I113r383q784J2017N117j3345q12J3302l731j2047P889R702j1174o464J3153
$$ 9113 -270 -9054 2963 8080 -5265 -6077 7225 3494 -8553 -664 9038 -2136 -8600 4553
1052D553K494j3658J857J2742o228j0606R976P553j2641l781J3828m12j3402M670
$$ 4553 7047 -6611 -4754 7988 1760 -8846 1130 8683 -3958 -7739 6089 5677 -7725 -3055
1066c055J1602q582q698J1696N071j3468j068J3690k967j2341O817R716j0056
$$ -3055 8547 -35 -8733 2963 8034 -5434 -6502 7188 4221 -8120 -1303 8413 -1643
1079a643o295J2369K399j3310J541J2710n129j0757Q387P636j0909l966J2425
$$ -1643 -7938 4431 6830 -6480 -4939 7771 2642 -8115 272 7908 -3001 -6967 5458
1092E458O6j2648L646J1419o926q915R617N448j1515j556J2339k330j1901N800
$$ 5458 5524 -7124 -3478 7941 1015 -7900 1717 7165 -4350 -5906 6433 4103 -7798 -1998
1106a998J0097q670p057J0783L220j1984Q67J2071m731j0861P935Q394j0264m830
$$ -1998 8099 -571 -7628 3155 6375 -5609 -4742 7329 2598 -8263 -328 8066 -2198 -7028
1120g028J1634P03j1991L452J1240p035r337R710O354j1263k559J1769j557j1263
$$ -7028 4606 5309 -6682 -3230 8010 975 -8362 1348 7702 -3561 -6120 5649 4092 -7171
1134g171N415R786q551p368J0589M126j1442l47J1233l559j0085O995Q130r561
$$ -7171 -1756 8030 -521 -7889 2700 6826 -4616 -4963 6270 2711 -7374 -379 7751 -1810
1148a810n410J0933K093j1134J610J0249n234q552Q314O178j0398l251J1213q4
$$ -1810 -7220 3713 5806 -5328 -3718 6531 1297 -7255 1059 7237 -3161 -6412 4801 4717
1162D717j0805L623R332o920p047R538M188j1051r95J1254k383j0148N707Q018
$$ 4717 -6088 -2465 6867 -53 -7100 2438 6626 -4425 -5420 5834 3451 -6697 -990 7028
1176G028q581n177J0609J941j1411J390J0856m615r068P519O283r717l013J0964
$$ 7028 -1553 -6730 3879 5820 -5591 -4201 6655 2040 -7028 491 6774 -2943 -5956 5008
1190E008l83j1010L599R753o433p374Q667M297j0162r19J0684k340j0061N202
$$ 5008 4625 -6385 -2786 6967 534 -6840 1827 6124 -4038 -4957 5727 3387 -6674 -1472
1204a472Q323p527n674R172K445r984Q75R934l984q830O607O723q470l870R573
$$ -1472 6851 -676 -6350 2822 5267 -4717 -3842 6092 2108 -6722 -115 6608 -1862 -5732 3841
1219C841O02r866K704R194n578p595P827N121r323j964R827j415r422M592Q129
$$ 3841 4443 -5423 -2719 6475 897 -6698 1129 6250 -3073 -5037 4790 3375 -6047 -1455 6674
1234F674p262n939Q977L199r941J29R804l394q691O279O751q396m279R655J187
$$ 6674 -588 -6527 2450 5649 -4292 -4163 5641 2247 -6444 -165 6586 -1810 -6089 3566 4753
1249D753r837K019R096n003p537P498N238r049k484R615n25r276L506Q039o060
$$ 4753 -5084 -3065 6031 1028 -6509 989 6227 -2822 -5306 4309 3784 -5492 -1986 6053 -7
1264go158Q111L592r081q09R286k180q404M831O856p097m623Q627J871r196J014
$$ -7 -6165 1946 5538 -3543 -4352 4934 2754 -5650 -819 6037 -1060 -5683 2944 4815 -4381 -3367
1280c367Q883l939p534O183N583q108k803R046j19q975K941Q086n571o357P719
$$ -3367 5516 1577 -5957 226 5809 -2299 -5102 3944 3825 -5150 -2209 5877 306 -6051 1668
1295A668L800q933r90R248j883q666M693P105o985m788Q492K034r132R02Q811
$$ 1668 5468 -3465 -4455 4793 2910 -5756 -1063 6042 -943 -5731 2761 4795 -4337 -3435 5376
1310E376l605p667O027N778p905l222Q767N34q838K260P978m746o355O805M150
$$ 5376 1771 -5896 131 5909 -1996 -5218 3549 4083 -4755 -2495 5483 737 -5618 1187 5337
1325E337q199j572Q637j075q247L619P009n801n059P416K683q427j8Q439k554
$$ 5337 -2862 -4434 4203 3128 -5119 -1500 5509 -292 -5351 2065 4748 -3679 -3697 4742 2188
1340B188p526M841N918o856l565Q115R42q542J648Q124m108o772O240M614p719
$$ 2188 -5338 -497 5421 -1435 -5000 3115 4057 -4485 -2837 5287 1179 -5593 647 5261 -2458
1355b458k014Q471p21q394L325P383n504n554P152L128q152l58Q379k317p780
$$ -2458 -4472 3999 3278 -5116 -1791 5592 88 -5466 1686 4814 -3338 -3696 4683 2366 -5414
1370e414M624O391o412m291P550J728q018R87P789l494o845N522N163o924k923
$$ -5414 -790 5601 -811 -5102 2448 4176 -3842 -2855 4934 1440 -5405 117 5280 -1644 -4567
1385d567P656L12p695K306P066m597n832O347L955p359j591P622j033p214L578
$$ -4567 3089 3401 -4294 -1988 5078 481 -5351 996 4951 -2408 -3999 3623 2590 -4624 -1046
1400a046O198n704m624P153K535p798n3P603k528o721M920N262o741l309P736
$$ -1046 5152 -552 -5176 1977 4512 -3286 -3339 4264 1736 -4985 -65 5197 -1544 -4853 2883
1415B883J007p863J523P158l978n785O073L969p467j835P991m85p600K828O406
$$ 2883 3890 -3973 -2450 4708 730 -5055 1018 4987 -2480 -4315 3676 3191 -4409 -1581 4825
1430D825m966m688O673K640p631m65P714j747o918L825N428n659l474O957J345
$$ 4825 -141 -4829 1844 4484 -3147 -3612 4102 2355 -4563 -738 4690 -969 -4443 2514 3859
1445C859p545P98P285k859o183M695M409o186k283P127M9p335K107O686m033n247
$$ 3859 -3686 -2888 4397 1538 -4645 50 4459 -1727 -4010 3117 3166 -4169 -2062 4624 591 -4656
1461d656N651L184o798q65P345j427p100L488O036n177m192O404J858p104O13
$$ -4656 995 4179 -2619 -3484 3861 2434 -4666 -1178 4858 -319 -4511 1893 3751 -3353 -2740
1476b740P182k897o485M768N050o105k971O883N49p092J866O691l955n621N504
$$ -2740 4442 1545 -4940 -172 4878 -1227 -4198 2685 3234 -3858 -1992 4699 744 -4877 627
1491F27L941o456j770O821o42o657K913N931m763m668O025K843o613o67O607j671
$$ 627 4568 -1888 -3658 3163 2521 -4136 -1223 4708 -55 -4723 1302 4145 -2468 -3135 3472 1801
1507A801o090L797N073n441l576O424J643o703N98O316k851n443M847M089o233
$$ 1801 -4289 -492 4581 -860 -4436 1988 3631 -3072 -2474 3842 991 -4452 395 4484 -1749
1522a749k315O860K68o693J952N888m079m545N799K822o783q75O986j202o385
$$ -1749 -4064 2796 3064 -3629 -1677 4211 132 -4413 1386 4208 -2575 -3450 3536 2334 -4051
1537d051L278N135n102l455O395J554o970M25O724k362n735M144M177n590k336
$$ -4051 -773 4362 -740 -4195 2200 3754 -3216 -2791 3933 1571 -4164 -20 4157 -1433 -3769
1552c769O479L66o704J527O165l286m936M756L241n847j341O396o19o286K449
$$ -3769 2710 3076 -3628 -2101 4064 778 -4158 598 3839 -2008 -3349 3047 2428 -3858 -1409
1567a409N460m014m040N285K194o086j61O297j782n860L524M767m889l068N834
$$ -1409 4051 37 -4003 1282 3476 -2610 -2771 3526 1744 -4116 -592 4175 -714 -3782 2052
1582B052J049o225J065O029l010n176M586L736n693j833O232k61o183K308N528
$$ 2052 3101 -3124 -2059 3970 960 -4216 370 4106 -1587 -3420 2812 2551 -3632 -1324 4204
1597D204m043m346N341K632o051o90O191j349n766L205M772m690l365N655J578
$$ 4204 161 -4185 1156 3788 -2263 -2953 3238 1889 -3877 -672 4100 -590 -3955 1700 3278
1612C278o049L45N893k234n179L852L989n060k445N751O61n867J231N431k992
$$ 3278 -2771 -2426 3467 1233 -3946 -94 3895 -1165 -3610 2141 2802 -3065 -1834 3597 605
1627F05m449M444L068n412j380N849m55n681K287M945l866l689N062K063n726
$$ 605 -3844 600 3668 -1744 -3124 2725 2270 -3411 -1124 3821 -45 -3734 1328 3391 -2335
1642b335k19N798j689n255L400M180m753k682N623Q69n890J008N538k783m676
$$ -2335 -2554 3244 1555 -3700 -300 3880 -873 -3555 2068 2937 -2953 -1945 3593 810 -3866
1657c866M245L322n272j625N728k32n623K032M969l623l844M803K359n483o35
$$ -3866 379 3701 -1571 -3196 2532 2300 -3323 -1291 3678 55 -3789 1014 3373 -2110 -2745
1672b745N603j120n197K780M305m140l016N067J462n437K49N302j959m625L499
$$ -2745 2858 1738 -3459 -679 3626 -514 -3530 1537 2999 -2438 -2189 3113 1154 -3471 28
1687B8L520m645k099N300N15n420J192M962k840l998M222K659n146j104N496n80
$$ 28 3548 -1097 -3196 2104 2619 -2801 -1609 3353 513 -3485 737 3396 -1750 -2854 2642 2062
1703B062n244K196M479l733l173M770J733n490n6N449j554m897L092L808m332
$$ 2062 -3182 -986 3493 -240 -3413 1357 3090 -2400 -2456 2993 1439 -3458 -366 3442 -890
1718h90k339N165O02n376R55N136k384m340L669L062m602j540N191j31n226J677
$$ -890 -3229 1936 2538 -2838 -1883 3253 869 -3471 198 3260 -1342 -2882 2309 2178 -3048 -1371
1734a371M684k930l647L974K242m703o29N056r77m899K419M173l542l004M368
$$ -1371 3313 383 -3264 710 2952 -1751 -2380 2676 1699 -3200 -781 3392 -150 -3154 1214
1749A214J459m839K67M848j860m435L198L497m169k100M731M02m853J319M554
$$ 1214 2673 -2166 -1899 2949 1089 -3346 -148 3349 -820 -2920 1811 2213 -2640 -1321 3233
1764C233k829l853L996K649m677j132M887o06m628K211M057l591l034M487J740
$$ 3233 404 -3449 547 3196 -1481 -2613 2274 1668 -2960 -749 3308 -283 -3317 1170 2910
1779B910m888j93M740j415m229K964L389m084k267M667R76m763N25M392k001l695
$$ 2910 -1978 -2171 2569 1154 -3075 -111 3278 -806 -3073 1594 2570 -2193 -1668 2724 723 -2972
1795b972L370K673m326j549M763K17m588J226L986k683l061L777J996m502p30
$$ -2972 398 3071 -1255 -2804 1959 2176 -2412 -1186 2800 117 -2944 833 2829 -1673 -2403
1810b403M699o29m343K022L496l276k386M277J070m737K57M649j657l926K813
$$ -2403 2296 1667 -2676 -654 2842 -434 -2820 1457 2527 -2210 -1953 2696 1039 -2887 -74
1825g4K893l829j577M558J53m625J157M193k373l326L348K120m145p00M503o15
$$ -74 2819 -1010 -2587 1971 2124 -2501 -1344 2849 476 -2850 498 2618 -1527 -2227 2276 1661
1841A661m432J811L834k893k712L603J486m207J6M247j182m015K309L313l222
$$ 1661 -2771 -960 2874 -19 -2731 872 2358 -1849 -1833 2414 1232 -2783 -474 2839 -383
1856c83k104L720Q13m097O68L960j748l694K918K641l518j450L923ll922J360
$$ -383 -2487 1233 2046 -2051 -1383 2577 829 -2865 53 2694 -824 -2274 1649 1646 -2276 -916
1872i16L678k618k958L376J973l865o04L974q36l775K185L209l231k314L828J134
$$ -916 2762 144 -2814 562 2535 -1330 -1934 2040 1204 -2571 -386 2823 -408 -2722 1106 2240
1888B240m010K39L808j624l322K833K562l662j568M043L82l959Q96L535k118k858
$$ 2240 -1770 -1531 2277 653 -2669 164 2726 -936 -2504 1539 1921 -2038 -1142 2393 275 -2583
1904b583L118J978l756r27L960k26l723J420L167k554k352L382J360l806k88L801
$$ -2583 535 2513 -1243 -2170 1790 1564 -2159 -739 2428 -126 -2478 904 2264 -1542 -1830 1971
1920A971p76l468J916K748k909j754L527P27l865M86L620j548l030K532K109l266
$$ 1971 1195 -2273 -357 2391 -518 -2272 1255 1982 -1883 -1397 2223 675 -2355 177 2286 -980
1936i80j056L718r8l789J238L365k219k577L028J467l508l23L726r00l507J966
$$ -980 -2036 1682 1584 -2205 -967 2398 179 -2398 630 2097 -1411 -1734 1992 1092 -2415 -449
1952d49K930k819j969L377Q31l602L27L546j439l081K334K334k978j295L319K37
$$ -449 2481 -338 -2307 1070 1901 -1701 -1374 2172 733 -2348 -14 2320 -658 -1953 1366 1603
1968A603l441P98L269j834k725K658J871l174q39L395k67l306J312K914k310k135
$$ 1603 -1838 -1040 2229 395 -2330 328 2199 -975 -1814 1581 1314 -1992 -680 2234 -76 -2211
1984b211K937J208l294k15L422r46l038J916K444k695j603L239N28l419O04L157
$$ -2211 726 1934 -1360 -1575 1847 901 -2137 -221 2223 -472 -2075 1164 1692 -1727 -1123 2034
2000B034j575k678K485J846l084q08L374k90l302J352K837k190k179K821J262
$$ 2034 459 -2219 266 2112 -972 -1780 1594 1304 -1998 -646 2191 1 -2178 643 1905
2015A905l202j84L294q93k965J758K451k551j647L008O96l208L61L136j367k667
$$ 1905 -1297 -1481 1813 920 -2045 -287 2164 -387 -2034 974 1670 -1538 -1177 1959 592 -2075
2031b075K118K035k770j143L043J65l036Q36K771j702k307K469J506k874o17L075
$$ -2075 43 2078 -692 -1835 1208 1373 -1663 -827 1944 242 -2065 404 1910 -964 -1581 1494
2047A494m66k892J421K498k249j818K827R22l046L9K953j034k606K014J982k749
$$ 1494 1028 -1864 -443 2055 -194 -2012 815 1737 -1309 -1270 1683 649 -1957 57 2039 -710
2063g10j165L094K62l097P06K783j620k208K384J462k923o08L105k71k945J158
$$ -710 -1875 1219 1481 -1616 -910 1873 253 -1955 429 1891 -1032 -1640 1465 1194 -1751 -593
2079e93K455j951j779K598R83k963j55K997o60k713J464K126k145j366K649N56
$$ -593 1862 -89 -1868 730 1713 -1250 -1405 1592 932 -1781 -317 1809 -336 -1702 947 1503
2095A503k921K96K844j079k438J781J755k384q94K790pk895Q43K668j577k107
$$ 1503 -1418 -1122 1722 643 -1795 -14 1741 -643 -1537 1253 1246 -1649 -806 1862 285 -1822
2111a822K182J259k615k90K800o34k736J446K324k073j617K500P06k748K93K739
$$ -1822 360 1619 -996 -1286 1514 880 -1856 -410 1914 -159 -1776 724 1430 -1318 -1025 1714
2127A714j184k502J900J953k366j143K610K02k658P57K523j595k135K179J554
$$ 1714 530 -1972 -72 1881 -485 -1628 982 1184 -1474 -717 1806 211 -1924 255 1809
2142A809k509p52K620j64k530J054K292j825j829K332J178k563l66K562n69k351
$$ 1809 -700 -1452 1168 1004 -1526 -472 1820 -5 -1834 498 1676 -887 -1253 1309 740 -1611
2158a611J440J983k127j453K552P26k656J27K484j040k109J861J561k456q97K715
$$ -1611 -171 1812 -315 -1768 784 1510 -1146 -1019 1465 425 -1684 177 1738 -718 -1615 1100
2174A100J07k642P41K277j566j747K273J070k685l13K759m69k477J238J968j942
$$ 1100 1207 -1435 -694 1583 17 -1730 543 1613 -1072 -1385 1374 905 -1572 -334 1634 -308
2190c08j291K467N75k717J69K645q85k253J560J650k137r33K531J98k650N02K467
$$ -308 -1599 868 1443 -1274 -1105 1540 655 -1598 -38 1612 -525 -1458 1073 1271 -1379 -877 1590
2207A590j168j986J743J322k244n43K537k55k546R44K246j546j671K039Q95k391
$$ 1590 422 -1564 179 1501 -743 -1286 1251 996 -1550 -606 1640 94 -1577 462 1357 -1034
2223a034o1K512p32k359J424J888j947j179K298L29k463N47K399j291k077J893
$$ -1034 -1095 1417 685 -1674 -250 1638 -309 -1488 810 1139 -1324 -777 1622 331 -1746 147
2239A47J468k230o90K410k11k369J061K131j731j664K190R81k372j90K373o56
$$ 147 1615 -615 -1305 1105 894 -1475 -414 1717 -14 -1678 512 1493 -879 -1069 1304 648
2255F48k182J417J812j974j305K295O21k377J56K245r77j927J656J481k155q89
$$ 648 -1534 -117 1695 -279 -1584 711 1332 -1045 -889 1356 379 -1548 108 1589 -566 -1455
2271a455K365J98k350N70K106j321j674J927J118k321m48K420k91k239J046J835
$$ -1455 910 1108 -1242 -672 1434 113 -1561 366 1484 -837 -1285 1135 844 -1395 -349 1486
2287A486j702j268K215N79k435J49K367q65k010J513J477k039p72K334N1k383
$$ 1486 -216 -1484 731 1310 -1125 -976 1391 526 -1484 29 1506 -533 -1305 1029 1080 -1303
2303a303O62K155j306j691J847J037k200l46K366l82k267J028J924j585j393J987
$$ -1303 -641 1514 208 -1483 364 1401 -799 -1145 1221 839 -1428 -400 1524 -61 -1454 533
2319E33P16k223NK237o94k053J330J623j798j065K129L75k250L56K125j014j816
$$ 533 1249 -974 -969 1268 574 -1479 -149 1474 -324 -1389 740 1115 -1135 -779 1346 332 -1484
2336a484J594J301k001o43K209p3k190P86J956j432j477J922Q46k192j37K232
$$ -1484 110 1411 -590 -1233 976 903 -1287 -501 1455 23 -1454 468 1314 -878 -1015 1217
2352A217n81k033J232J651j776j053K116L52k246L74K121j024j789J577J266j982
$$ 1217 636 -1397 -165 1486 -290 -1343 773 1125 -1121 -747 1374 350 -1439 138 1404 -578
2368e78o35K191n5k209P31J973j300j559J760R51k017k85K124l85k055J027J767
$$ -578 -1213 978 923 -1286 -555 1418 118 -1441 319 1270 -747 -1032 1092 707 -1348 -321 1446
2385A446j558j275J903O60k087L7K082p23j881J319J477j761q97K012K15k073
$$ 1446 -112 -1387 516 1176 -911 -874 1208 485 -1396 -77 1400 -361 -1258 754 969 -1104
2401a104N20J924j175j593J685J103k003m52K086k57j973R66J669j546j216J926
$$ -1104 -584 1340 165 -1428 257 1360 -643 -1095 991 734 -1239 -273 1396 -150 -1366 560
2417E60O50k105L4K019p07j765J340J357j813q54K067K66k076L51J895r79j533
$$ 560 1210 -895 -861 1158 451 -1314 26 1383 -430 -1284 783 1049 -1027 -676 1219 240 -1293
2434a293J507J083j900n74K089l5j987O02J741j176j327J665Q03j986k69K086
$$ -1293 214 1297 -603 -1177 912 877 -1110 -508 1233 57 -1270 395 1198 -788 -1057 1029
2450A029l19j896Q77J527j381j014J790M38k020J50J988p01j703J229J220j639
$$ 1029 710 -1186 -309 1218 -163 -1177 613 1051 -969 -819 1169 468 -1235 -6 1214 -425
2466d25o34J925rj991N88J841j121j408J505Q25j787j76J936m62j883R93J601
$$ -425 -1059 866 857 -1134 -546 1295 174 -1234 271 1096 -691 -867 1069 607 -1276 -283 1318
2483A318j370j147J645N41j824J68J808p66j678J226J363j563q41J736K14j756
$$ 1318 -52 -1199 446 987 -837 -669 1139 373 -1305 -79 1284 -279 -1120 616 830 -926
2499i26L70J729r93j482J377J150j672n60J717l3j686O72J570j242j246J607P93
$$ -926 -556 1173 180 -1302 75 1225 -447 -1007 710 677 -1009 -337 1233 -9 -1255 352 1145
2516A145j736k75J735l80j577J011J305j464r41J767M06j791J54J667p89j351
$$ 1145 -591 -866 869 489 -1088 -77 1228 -236 -1177 590 996 -795 -641 1026 237 -1114
2532a114J315R51j668n41J835K2j756N09J513j041j137J487O96j786k35J824k56
$$ -1114 201 1152 -516 -1057 778 800 -956 -447 1066 25 -1112 375 1071 -715 -950 874 618
2549F18j659P70J308j194r24J592M49j796lJ799m48j570R23J197j336p07J631
$$ 618 -1041 -271 1037 -157 -1081 511 960 -836 -839 960 512 -1058 -135 1062 -274 -981 650
2566F50K15j794L02J678p29j380J150R67j513m27J729j47j726O14J529j028j131
$$ 650 865 -929 -627 1051 322 -1058 92 1059 -454 -881 848 701 -1025 -411 1118 90 -1041
2583a041J350N80j552l9J669n06j587R61J287j306q04J505K62j636L07J604q20
$$ -1041 309 889 -663 -702 967 461 -1126 -165 1122 -184 -988 517 779 -857 -550 1054 234
2600B34j394J171J055j450n19J574l5j582N89J450j016j189J327Q23j554k88J583
$$ 234 -1160 11 1066 -384 -903 671 636 -946 -357 1093 77 -1112 215 1038 -516 -804 779
2617G79k34j526P57J347j166j033J457N79j568o1J538m97j379R83J137j384p39
$$ 779 545 -981 -224 1123 -43 -1076 381 960 -608 -669 869 372 -1007 -24 1113 -271 -1010
2634a010J570K59j591K54J443p81j184J230Q06j510l56J602j33j520O36J272j084
$$ -1010 560 819 -772 -518 925 144 -1040 190 996 -514 -870 732 599 -921 -285 987 -97
2651i7r10J419M85j584k0J565m47j392R03J060j250o49J492K07j588K55J502o89
$$ -97 -1007 412 897 -687 -707 858 411 -981 -78 982 -268 -917 575 782 -806 -551 951 262
2669B62j259J078Q99j357m66J534lj554M68J388q75j114J226O93j431k40J522
$$ 262 -997 81 980 -377 -843 691 688 -866 -398 990 115 -999 227 920 -511 -751 771
2686G71k60j442P00J224j085q82J365M42j500N7J473n48j288R70R54j275n42J473
$$ 771 511 -931 -231 993 -92 -974 391 833 -667 -610 863 315 -973 -3 951 -324 -866 607
2704F07N5j483M19J356q61j055J191O82j422k28J473k21j394O61J172j044q19
$$ 607 662 -821 -402 954 93 -962 229 911 -511 -739 734 513 -881 -220 952 -92 -911
2721i11J310M06j467M7J452m56j309Q44J025j145o60J362K13j445K18J392o31
$$ -911 399 805 -662 -615 837 381 -928 -84 941 -204 -864 498 711 -734 -516 876 245
2738B45j193R83Q55j233m47J399k2j423M60J309q33j047J140O41j327j62J399
$$ 245 -948 35 890 -343 -790 609 587 -836 -376 933 100 -947 193 834 -493 -655 744
2755G44l10j336P44J123j069p70J282L20j360J65J321o23j164R88Q73j219m88
$$ 744 434 -902 -158 965 -104 -874 408 728 -632 -467 854 231 -933 55 928 -291 -779
2772g79J318K9j311M39J194q53r74J147O59j311k65J337j78j265O27J070r66q49
$$ -779 539 568 -743 -304 890 37 -937 210 869 -442 -707 630 452 -813 -186 884 -82 -931
2790i31J251M95j337j06J307l47j157P77R28j111o42J329L02j384J15J281n35
$$ -931 320 815 -522 -628 679 332 -825 -48 880 -231 -873 456 758 -626 -511 770 235
2807B35j062R29P74j238m12J384Pj333L91J125p69q53J129M68j341p6J367k87
$$ 235 -827 102 876 -362 -774 610 617 -716 -325 800 31 -822 307 775 -566 -642 725 438
2825D38j232O37R50r66n73J215J65j342K11J304n49j096Q49P50j090l48J263n7
$$ 438 -794 -157 793 -173 -746 469 634 -708 -497 807 258 -838 11 761 -329 -677 586 529
2843E29j302M13J222p23r69R63N98j137j84J268k19j280N92J121q63q48J085M40
$$ 529 -773 -360 862 139 -830 133 731 -406 -590 678 459 -821 -229 892 29 -819 266 706
2861G06j205JJ245m16j186P65R73j000o35J131J90j188K64J159o82j011R70P45
$$ 706 -499 -498 747 331 -855 -90 883 -117 -752 379 569 -619 -355 804 122 -889 81 826
2879H26j142l68J186o8j132N06J000q69p89J112M78j191r6J163l22j037P19Q41
$$ 826 -316 -684 502 434 -698 -192 808 -61 -850 262 740 -451 -547 616 294 -743 -24 817
2897H17j018n84J170K84j212R6J117m82r36Q41P09j105m19J222R5j195K53J065
$$ 817 -201 -785 385 669 -543 -447 670 188 -748 93 802 -303 -722 500 595 -600 -347 718
2915G18o42q36R48N74j179k46J239r1j160M47R56q14o69J075L48j220jJ209l49
$$ 718 76 -760 188 762 -417 -663 576 485 -675 -228 728 -86 -755 320 668 -552 -553 656 307
2934C07j044O76P62r38m29J144O4j189K62J113n84q64Q41N41j041j54J127j79
$$ 307 -737 -61 701 -237 -666 478 542 -647 -385 728 144 -720 121 662 -379 -533 594 415
2952D15j134M96R89p45p26R43L89j078k8J129l31j071O42Q71q55n82J013K20j113
$$ 415 -719 -223 766 21 -705 238 627 -451 -479 650 319 -752 -110 761 -94 -676 337 557 -556
2971e56J52J117m87j001P54P71r50m46J063O0j085L23J021o63q45Q99N89j043
$$ -556 -404 713 226 -775 -21 750 -200 -646 417 477 -608 -285 736 73 -772 127 716 -327
2989c27k36J088j51j042N25R05q23o73J020L39j075J8J054l98r23P19P04r56m28
$$ -327 -563 525 374 -668 -143 762 -61 -734 286 625 -450 -432 622 224 -699 20 724 -232 -660
3008f60J073R8j076K40R78n69p93Q43N44j019k42J081p0j051M13Q97p02o80R29
$$ -660 413 511 -565 -325 653 84 -709 134 678 -341 -583 498 428 -623 -210 687 -15 -695 234
3027B34M11j080r0J100k17j027N42Q30q04n72J004K50j082Q2J064m26r20P22O80
$$ 234 645 -435 -525 575 358 -669 -127 703 -101 -673 331 581 -501 -419 645 219 -701 21 701
3046G01r30l77J066K0j075L19R59o32p44Q59M52r90j38J036k16r59N31P89p96
$$ 701 -229 -606 460 480 -595 -276 683 51 -693 166 618 -372 -510 526 310 -649 -118 671 -125
3065a25n38R55K49j024P4R98l96q44O72O48q88l72J017N9j022K37R50n38p70P88
$$ -125 -663 292 541 -483 -409 589 193 -651 21 669 -219 -591 426 485 -537 -300 650 112 -658 130
3085A30N27r55k51J056q2j024L63R00o49o75Q79L84j028o6J057k59r56N25P80
$$ 130 657 -298 -549 507 425 -599 -236 664 15 -660 219 603 -425 -491 566 307 -649 -124 656
3104F56p89m91R52J69j027J44J005m38q45O86N79q54k76R80p6r76L89Q75o33o87
$$ 656 -133 -624 328 497 -530 -386 619 181 -664 22 601 -253 -529 451 375 -601 -212 663 30 -657
3124f57Q25L94r18o4R63k60r04N41P52p35n27Q83K17r42J15R29m18q53O65O75
$$ -657 168 562 -356 -420 543 283 -621 -80 672 -63 -590 293 510 -432 -317 612 194 -659 6 681
3144F81q38m24R08J14r40K43Q67n46p39P65N47r18k62R59p2r27M27P86p00n97
$$ 681 -157 -581 327 441 -499 -256 611 65 -674 91 638 -280 -542 417 345 -582 -155 631 -69 -666
3164f66Q91L55r61o5R28k58q07N82O19q22l76R46J29r45J43Q64m61o58P09M40
$$ -666 225 580 -381 -446 482 224 -583 -1 618 -204 -580 366 495 -450 -307 557 96 -562 147 587
3184E87q82j97R43m8r00L20P26n58n46P95K87r13o6R51j86q73M28O97o69m41Q52
$$ 587 -295 -492 451 403 -497 -177 549 -9 -555 240 527 -386 -452 499 313 -560 -132 565 -104 -545 307
3205C07J58r38Q2R56l46q21N61N97p53l08Q86K1r51K59Q95m84p16O66M52p99j38
$$ 307 465 -473 -391 565 219 -602 -41 556 -197 -505 381 402 -549 -290 605 121 -595 71 523 -276 -414
3226d14Q91j75q74M51P47o26n41P57K45q30P9Q31l68p60N85N99p24l61P79P5q04
$$ -414 477 302 -572 -121 626 0 -541 216 461 -369 -290 541 173 -587 -2 597 -127 -488 291 366 -438
3247d38K36P54n14o45O91M71p87k30Q10n9p88L54P10n88n70P60L60q26j04Q14
$$ -438 -202 552 38 -607 84 555 -232 -462 348 289 -499 -145 565 -23 -593 167 527 -299 -403 411
3267D11j74p55M63O20o68m66Q31K25q55L6Q09l10p00N80N23p61l21Q57O2q27J91
$$ 411 237 -518 -55 565 -103 -569 262 487 -368 -332 477 167 -533 47 570 -191 -512 345 407 -420 -229
3288b29P30m69n40O84L34q10j25Q45j22p60L50O02n69m02P34J63q13O6P90k72
$$ -229 501 32 -508 176 510 -300 -425 420 298 -462 -112 490 -79 -481 253 416 -397 -331 459 187
3308A87o81M65N09o49k84P61P9q13J47P71l67o09N37M25o90j97P88m4q05K85P15
$$ 187 -494 -29 480 -169 -453 308 387 -426 -279 492 125 -484 53 478 -212 -409 379 335 -470 -185 530
3329E30m71n58O39L27p58o2P82j65p52L83O27n67m21O82J77p54Q3P43l29o39N03
$$ 530 59 -499 140 467 -291 -353 429 264 -488 -105 522 -45 -466 216 393 -361 -278 465 136 -503 0
3350@M74o20k66O98J2p12K31O45m31n21N94L30o65j18O94j10o73L42N83n22m31
$$ 0 474 -146 -412 286 298 -414 -183 462 31 -490 104 434 -231 -349 345 235 -438 -96 487 -35 -466
3371d66O38K56p11k0O94k04o50M22N28n91l42O84J37p37R2P03l06o17N09M67o55
$$ -466 172 428 -283 -303 391 187 -463 -41 487 -104 -446 238 375 -362 -270 433 127 -490 19 486 -169
3392a69k60P13M0p20J96O46m12n08N77L20o70j10P10j15o63L22N52m93l97O20
$$ -169 -429 284 324 -396 -200 446 34 -474 103 423 -247 -357 353 238 -425 -103 449 -44 -441 179
3412A79J92o81N6O44k51n70M28M55n65k58O32N8o59J46O10l44n34N18L68o08j78
$$ 179 371 -310 -254 390 139 -431 -3 452 -113 -371 261 319 -340 -194 416 72 -462 56 424 -184 -362
3433c62O52k4o49K26N86m32m64N90K96o59j12O84j11o41L28N49n12l81O30K09
$$ -362 290 266 -383 -157 429 -3 -467 123 419 -240 -352 332 221 -420 -92 457 -55 -436 194 403
3453D03o92%O66k19n73M26M42n87k69O88M9o78J40O07l35m62M90L06o21j12O59
$$ 403 -289 -289 377 158 -415 11 453 -134 -403 285 334 -344 -204 403 68 -394 96 402 -219 -331 328
3474C28q8o14K44N20m13l67N68J58o38J0O58j85n93L46M45m90k66N96Q9o55J16
$$ 328 240 -374 -130 390 -23 -390 178 336 -302 -292 366 181 -412 -66 379 -111 -377 219 308 -347 -231
3495b31O36k82n52M39L86n38k00O36j8o48K03O20l73n04M99L14n75j05O42j31
$$ -231 405 123 -429 10 396 -142 -342 294 276 -372 -169 451 78 -426 73 387 -188 -293 349 218
3515B18o36L12N56m63l98N57K01o10L2O01k58n39M23M26n21k71N73N9n76J63N30
$$ 218 -418 -106 450 -13 -411 146 347 -263 -231 370 112 -427 -4 422 -99 -370 203 262 -314 -151 379
3536C79l49m62N07L21n73j53N73m7n42K53M78m26l81N58K39o05n6O02j60n20L50
$$ 379 30 -432 75 396 -177 -330 243 196 -346 -93 385 -41 -422 136 375 -230 -286 316 156 -364 -14
3557a4M37n07l18O12J59o32J8N91k29m96M18L72n72k35O67M3o46J32N67l34m18
$$ -14 423 -84 -402 210 369 -263 -245 346 117 -379 39 411 -161 -396 271 314 -332 -200 367 33 -385
3578c85M86K61o00j03O41p0n79K28M71m03l04N32J38o05L4O12j91n29L27L94m56
$$ -385 101 362 -238 -341 300 230 -349 -121 350 -53 -357 175 313 -292 -258 354 163 -366 -39 355 -101
3599a01k17N45N2o05J27N72k66m74M06L10n07j16N63o0n99K31N42l52m44M67K78
$$ -101 -318 227 279 -326 -199 373 107 -367 39 349 -158 -274 289 229 -370 -139 403 51 -393 74 352
3620C52n72o5O05j33n92L15M98m44l51N28J72o01O4N83k34n45L96M28n03k53N49
$$ 352 -220 -285 320 187 -405 -90 408 -36 -387 141 313 -288 -224 359 125 -420 -24 404 -99 -352 197
3641A97N6n55J61N12l35m28M75K91n43j24N49o1n21K63M47m15l48N18J97n57k1
$$ 197 253 -302 -141 371 36 -392 83 374 -169 -293 256 195 -326 -63 384 -31 -379 139 336 -221 -242
3662b42N35j67m78L39L80m70k70N55J20n82P5N33k66m63M34L33n44j91O09K2n87
$$ -242 293 126 -352 -13 367 -103 -373 182 302 -280 -205 328 62 -401 33 366 -178 -369 240 262 -325
3683c25J61N27l49m02N03K50n83p1N89q2n62K67M56m11l29N36J41n84M3N61k04
$$ -325 -164 363 14 -388 115 365 -218 -289 300 218 -344 -77 379 -32 -361 175 316 -268 -225 336 132
3704A32m80L44L57m76j91N40L6n71J34N17k95l99M10K76n25q8N37o9n34K22N02
$$ 132 -348 -4 353 -123 -314 226 262 -309 -175 342 47 -352 58 334 -191 -279 258 189 -345 -123 379
3725C79l88l54M87J70n66L4N63j66n20L29M01m26k74N06J38n72O3N78k84m39L63
$$ 379 -9 -363 124 294 -272 -238 325 159 -361 -32 369 -57 -331 175 313 -259 -196 382 98 -341 22
3746B2L73n22j99N61J0n48J52N16l04m07M21K53m98o3M91j12n14L07M13m01k72
$$ 22 395 -127 -326 235 245 -303 -151 365 61 -346 75 328 -170 -233 258 146 -368 -61 352 -49 -321
3767c21M56J00m52j4N80k48m52L00L84m80j62N36j3n26R7N67k67m38L98K72m63
$$ -321 135 235 -217 -231 349 101 -351 -51 333 -147 -309 227 214 -312 -215 352 85 -353 45 317 -146
3788a46o8N39j02n50J75M87l35l77N12K08n28l5N45j34o38L75M56m67k40M89R9
$$ -146 -214 325 223 -327 -152 335 0 -377 135 343 -185 -220 325 191 -447 -72 384 -83 -323 166 265
3809B65n37Q2N18k32m93M47L26n14j89N56k5n04J82M61l54l38M43K46n38o0M95
$$ 265 -272 -190 328 96 -397 50 376 -138 -327 229 204 -300 -118 343 -11 -349 94 340 -198 -258 237
3830B37q6m71K93L80m21k63N02J40n45K5N11j81m45L36L48m81k00N44O3n75J25
$$ 237 151 -320 -27 353 -68 -331 171 311 -234 -209 302 121 -324 12 360 -121 -321 223 286 -289 -164
3851a64N06k87l91M21K58n44r7N79o2n67K15M75l63l38M91J67n60jN70j52n19
$$ -164 342 55 -336 85 343 -201 -298 281 219 -348 -133 342 -21 -359 132 299 -261 -262 308 156 -363
3872c63L09L89m20k37N40L7n58J09N54k63m50L75L05m59j18N08o3n31K17M76l33
$$ -363 -54 335 -85 -322 218 255 -303 -194 360 97 -353 22 327 -132 -250 258 195 -336 -119 357 24
3893B4l56M29K05n01j6N20j58m98L00M25m10l08N00J18n33P8N18k71m69M06L77
$$ 24 -332 97 302 -199 -215 305 147 -351 -51 374 -36 -344 156 274 -259 -181 337 66 -403 3 380
3914C80m84k33N46K4n46J71N10l47m23M78K89n41j11N46p3n05K67M35m35l18N31
$$ 380 -104 -337 209 233 -313 -142 368 21 -402 76 365 -176 -287 259 186 -319 -52 383 -52 -370 161
3935A61J75n61KN17j80m40L52L27m82j94N39N1n42J24M64k71l77M31K33n24r5
$$ 161 336 -225 -223 294 114 -326 26 353 -129 -323 216 267 -275 -151 313 42 -335 96 329 -195 -290
3956b90N56n5n18J91M45l51l07M80J53n46JN59j49n26L13L94m38k39N39P7n94
$$ -290 266 211 -307 -116 329 -22 -329 151 304 -242 -241 318 169 -357 -44 350 -88 -327 212 289 -305
3977c05J05N57k53m60L87L13m90j37N58o0n50K08N14m09l53M78K03n04k6N60k56
$$ -305 -200 357 104 -356 31 344 -146 -283 275 215 -335 -127 387 -22 -375 103 306 -198 -224 336 80
3998H0m16K73M31m91k11M57J48n23R0N04k72m40L93L29m84j65N11Jn18J79M73
$$ 80 -336 -63 368 -123 -334 123 271 -252 -162 342 70 -370 23 352 -132 -297 214 215 -303 -124 349
4019C49l33l76M55K50n24p1N22r7m96K74M26m35l10N16J70n59ON50j92m85L52
$$ 349 16 -360 95 345 -179 -250 272 175 -321 -47 379 -56 -366 150 320 -239 -233 317 125 -360 -8
4040hL65m77k29N51N9n63J24N15k88m12M21K75n15j16N45n6n08K18M35l71l04
$$ -8 357 -120 -349 202 261 -302 -178 337 49 -363 58 333 -182 -298 247 191 -317 -99 336 -35 -339
4061c39M88J57n22j4N23j48m62K87L77m21k25M94P4n27P7N09k36m29L66L13m94
$$ -339 149 306 -216 -230 293 145 -317 -30 347 -74 -299 195 269 -258 -181 328 92 -337 29 342 -152
4082a52j53N35kn48J72M88l14l97M56K35n20q9N49q9n36K68M74m39k69M72J31
$$ -152 -305 230 228 -320 -148 340 26 -371 85 320 -200 -289 260 171 -365 -97 377 -62 -331 141 272
4103B72n68O8N13j87m72L46L77m88j71N65K3o33J94M68k46l72M02K42m70j07N00
$$ 272 -296 -228 285 98 -374 -28 349 -139 -310 255 278 -355 -161 307 61 -311 91 333 -137 -244 256
4124B56p6m80K15M16l46l07M44J47n10K3M90j35m84L23L44m10k39N01R4n40Q0
$$ 256 180 -300 -85 331 -15 -322 122 269 -241 -218 272 137 -347 -24 320 -90 -329 172 266 -274 -194
4145a94N20k48m34L57L17m89r8N12o5m66J43N06l45l71M40K25n20k4N35j10n09
$$ -194 326 78 -356 1 318 -171 -269 243 178 -288 -145 361 16 -355 85 310 -210 -234 301 191 -318
4166c18K68M04l84k90M88J37n40N4M89k08m25L43L29m38j75M47K9m89J74L56k14
$$ -318 -50 354 -30 -320 168 305 -235 -181 308 100 -325 18 347 -91 -266 181 210 -279 -105 251 37
4187C7m18M59K46m83o2M22Nm68J92L95l72k87M14K80n15q8N03j38l99K59L22l80
$$ 37 -381 78 324 -159 -221 201 206 -262 -70 325 -47 -334 80 360 -155 -243 260 122 -277 -18 304 -76
4209g6k44M92P1m74O9M87j95m31L71K90n44j34N81l8n29K08M15l15k84L92J62
$$ -76 -320 172 243 -231 -162 325 130 -301 70 360 -184 -318 263 225 -304 -96 319 4 -280 112 274
4230B74m90j1N08j22m70K42L57l55k21M39P9m85P0M73j96m02K96L08m03j36M65
$$ 274 -216 -227 281 159 -311 -69 288 -67 -288 151 230 -255 -185 288 92 -310 -14 294 -109 -245 220
4251B20j1m87J52M54k68l61L53K47m48p1M82r9m74K28M31l50l19M31J64m73J0
$$ 220 209 -278 -126 328 60 -301 52 299 -149 -220 262 163 -311 -83 348 -2 -321 110 274 -199 -189
4272a89M82j92m44L09L78m09k44M55R1m79R1M47k51l88L62K98m54j37M59j2m53
$$ -189 293 101 -343 -34 344 -65 -309 146 237 -242 -151 296 45 -343 19 317 -137 -274 185 173 -280
4293b80J93M02l18l34M18K12m56o4M63r3m14K55L33l82k35M54J32n03L1M63j79
$$ -280 -87 315 -3 -337 81 293 -163 -227 236 143 -271 -16 317 -65 -300 154 286 -217 -186 277 98
4314I8l91L23K73m30j67M87M2m93J08M38k63l43L91K39m92j00N20m1m92J92L99
$$ 98 -293 30 303 -127 -294 193 235 -258 -150 288 25 -318 73 312 -180 -280 240 199 -293 -101 298
4335B98l21k89M53J42n11JM99j40m30K61L31l72j92M61M5m77R5M49k13l76L19
$$ 298 -23 -312 141 283 -228 -227 272 132 -298 -37 294 -78 -270 191 236 -241 -146 303 90 -286 33
4356C3K64m17j11M65m9m49J70M14l03l05L71J80m42l2M62j32m33K46L67l45k53
$$ 33 297 -120 -231 234 185 -264 -94 320 17 -288 83 263 -179 -211 251 119 -314 -68 299 -46 -299
4377b99M18J15m73O9M49k01m15L35L20m18j93M79J2m63J38M50k90l52L84K38m58
$$ -299 119 234 -239 -170 279 78 -337 -2 318 -100 -293 186 198 -265 -127 323 33 -319 65 303 -155
4398a55r4M89q2m37K24L91l43k92M29J39m59LM41j43m00K77L15l76k02M35O1m54
$$ -155 -249 240 158 -279 -55 336 -7 -299 130 269 -190 -187 254 111 -289 -12 303 -73 -275 160 221 -233
4420b33Q2M11k26l37L40K43m34j00M54k3m41J63L78k88k91L94J85m58m3M80j03
$$ -233 -151 260 34 -303 37 280 -154 -254 200 177 -264 -101 277 -11 -302 92 277 -181 -224 256 153
4441A53m42K47L59l59k47M41J12m81M4M61j75m15L19K96m19j65M70J1m74J36M24
$$ 153 -289 -42 317 -42 -289 152 264 -217 -173 288 113 -302 17 313 -106 -271 199 210 -264 -128 296
4462B96k60l45L71K25m41p7M46p0m18K00L66l18k65M03J23m43NM48j45l87K62
$$ 296 36 -309 62 287 -154 -231 215 145 -273 -73 293 -25 -290 113 236 -207 -202 246 101 -286 -24
4483b4L06l59j87M23O2m45Q3M17k12l52L32K56m26j14M57j8m72J69M04k85l09
$$ -24 282 -77 -264 159 221 -224 -141 276 64 -288 44 300 -126 -240 217 199 -273 -104 300 15 -294
4504b94L92J73m59m2M89j10m43K45L42l57k08M17P9m70P2M36j67m01K95K69l71
$$ -294 98 271 -188 -230 259 149 -294 -49 293 -64 -272 145 224 -246 -174 262 95 -306 -11 258 -113
4525a13j42M39m5m11J70L82k44l57M15J62m18n6M31r0m01J98M65m28k17L33J67
$$ -113 -255 184 139 -272 -102 280 36 -321 94 256 -162 -218 213 123 -278 -80 385 -43 -260 73 240
4546B40m48j6M99k55l03L01L31m61k53N51%m67K11L38j71l90L50J87l70j77N28
$$ 240 -208 -224 275 20 -283 18 349 -112 -365 186 186 -281 -70 268 97 -293 57 244 -126 -303 225
4567B25p6m47K39L65l29l01M62J16m13k9M30j38l65K64K76l57k27M62P3m51P2
$$ 225 149 -298 -59 306 -23 -324 138 254 -159 -188 242 104 -261 3 279 -78 -305 157 230 -221 -149
4588a49L98j77l43L26K22m09j22M57qm31J28L58k50k66L49J69m39l9M30m9m34
$$ -149 249 72 -271 55 277 -132 -254 203 195 -236 -108 250 0 -266 83 252 -187 -226 204 155 -279
4609b79K50K56l05j88M16L7m34R7L98j32m19L05K86l98j22M25jm50J36M28k41
$$ -279 -29 227 -78 -266 150 187 -247 -150 248 116 -303 2 288 -110 -232 193 192 -258 -122 306 65
4630F5l53L35K33m06q1M37o8m33J99L76l02k73L67J38m05mM30j57l91K74L00l37
$$ 65 -288 47 280 -126 -207 230 162 -271 -72 304 2 -271 96 234 -171 -175 255 98 -293 -19 281 -56
4652e6j90L73N3m15J19M19k82l26L62J89l50j37M21jn00K37L43k79l09M13J76
$$ -56 -246 127 180 -235 -116 303 21 -305 57 246 -104 -241 180 179 -321 -84 259 -20 -329 84 260
4673B60l95o9M17o4m11K23L45l44k46M27J18m51J4M34j71l64L03K72m15j51M43
$$ 260 -135 -204 213 149 -262 -39 306 -38 -284 143 261 -190 -176 258 87 -277 26 298 -117 -268 175
4694A75L0m36J03L72k36k88L45J95m27o8M38n6m01J70L34k84k27L62J35m35PM29
$$ 175 205 -231 -128 244 8 -280 65 260 -167 -235 203 147 -254 -84 250 -34 -261 101 236 -199 -192 237
4716B37j28l77K41K80l26j83M19M1m39R0M30k18l38L08K43l91j07M39m5m40J66
$$ 237 109 -268 -27 253 -73 -256 163 204 -235 -145 285 67 -271 37 280 -111 -218 221 176 -264 -98
4737i8M04l04k93L84J67m46j7M34j04m28K42L49l51k12M02P5m35N5M25j96l55
$$ -98 306 2 -291 93 260 -186 -203 231 127 -301 -59 290 -61 -273 129 204 -231 -176 249 53 -302
4758c02L04K67l88j28M24km13J46L68k62k91L49J89m05n2M05q1l81K18L18l12
$$ -302 2 269 -119 -247 177 175 -238 -92 276 14 -277 72 261 -144 -196 209 128 -253 -35 283 -29
4779b9k39M03J05m30L4M09j56l67K71K87l76j67M25K8m31J02M05k54l31L62K19
$$ -29 -268 135 240 -190 -156 253 97 -270 1 288 -88 -255 170 198 -233 -131 274 20 -311 51 270
4800B70m26r7M58n7m29K00L55k97k76L95J57m32j2M38j46l72K57K96l61j73M06
$$ 270 -156 -253 205 148 -281 -81 274 -23 -299 96 253 -179 -191 247 101 -271 -14 282 -79 -252 154
4821A54M7m01P3L89k10l19L01K21l75r3M06k0m17J70L38k68k71L62J64m28k3M06
$$ 154 201 -200 -127 262 52 -267 34 255 -120 -213 193 173 -244 -74 264 -4 -275 87 251 -177 -200 206
4843B06r0l70K12L08l32k07M03P8m16L7M15j74l60L04K55l80j47M29K0m30J07
$$ 206 116 -254 -42 266 -66 -273 130 208 -208 -171 244 70 -290 14 269 -111 -258 171 191 -239 -132
4864a32M09k51k97L55J79m11o5M39o8l99J78L36l01k21L69J04m19J8M13j35l65
$$ -132 277 26 -271 84 263 -148 -213 226 158 -241 -63 273 -28 -249 120 224 -195 -177 236 101 -264
4885b64K38K80l27j61L81M2m11Q1L92k06l11K89K14l62q5L98m4m10J86L59k83
$$ -264 -26 254 -73 -234 147 189 -222 -141 251 45 -266 23 237 -125 -210 188 144 -266 -80 279 -4
4906dk60L39J52l93mM10j33l86K47L19l32k12L92Q6m16O7L99k07l55L25K54l85
$$ -4 -264 75 227 -166 -170 240 107 -279 -32 287 -45 -257 135 221 -195 -128 271 64 -291 34 288 -97
4928i7j41M09j4l96J49L65k81k83L61J77l97n4L92q6l47K12K79l02k08L81J02
$$ -97 -238 171 157 -239 -90 275 -6 -289 72 249 -148 -202 190 104 -243 -31 248 -54 -262 119 221
$$ [...]
8191c7
##END NTUPLES=NMR FID
##END=
