##TITLE=1H_LY-12Dix.4.B
 CD3CN, 8 sc, 
 4.06.2021
##JCAMPDX= 6.0         $$ Bruker NMR JCAMP-DX V2.0
##DATA TYPE= NMR FID
##DATA CLASS= NTUPLES
##ORIGIN= UXNMR, Bruker Analytische Messtechnik GmbH
##OWNER= root
$$ XWIN-NMR		Version 3.5
$$ Fri Jun  4 10:24:08 2021 Russian Standard Time (UT+4h)  she@DPX200
##.OBSERVE FREQUENCY= 200.131506
##.OBSERVE NUCLEUS= ^1H
##.DELAY= (6, 6)
##.ACQUISITION MODE= SIMULTANEOUS
##.ACQUISITION SCHEME= undefined
##.AVERAGES= 8
##.DIGITISER RES= 18
##SPECTROMETER/DATA SYSTEM= spect
##.PULSE SEQUENCE= zg30
##.SOLVENT NAME= CDCl3
##.SHIFT REFERENCE= (INTERNAL, CDCl3, 0, 15.7039)
##AUDIT TRAIL= $$ (NUMBER, WHEN, WHO, WHERE, WHAT)
$$ ##TITLE= Audit trail, XWIN-NMR		Version 3.5
$$ ##JCAMPDX= 5.01
$$ ##ORIGIN= Bruker BioSpin GmbH
$$ ##OWNER= she
$$ F:/spectra/data/she/nmr/H-F/1/audita.txt
$$ ##AUDIT TRAIL=  $$ (NUMBER, WHEN, WHO, WHERE, WHAT)
(   1,<2021-06-04 10:22:42.28 +0400>,<she>,<DPX200>,
      <created by zg, POWCHK disabled, PULCHK disabled
       configuration hash MD5:
       00 E9 B6 7A A2 85 ED C7 34 08 36 98 17 FE 4E 26
       data hash MD5: 16K
       6C AB 96 32 5C 95 53 8F 1C 9B 18 CE C8 78 BB 38>)
$$ ##END=
$$ 
$$ hash MD5
$$ 47 A7 13 2E B7 D0 4F 85 14 7E 15 0F FF 55 84 29
##$RELAX= 
##$RELAX= 
##$RELAX= 
##$RELAX= 
##$RELAX= 
##$RELAX= 
$$ Bruker specific parameters
$$ --------------------------
##$DU= <F:/spectra>
##$EXPNO= 1
##$NAME= <H-F>
##$PROCNO= 1
##$TYPE= <nmr>
##$USER= <she>
##$AMP= (0..31)
100 100 100 100 100 100 100 100 100 100 100 100 100 100 100 100 100 100 
100 100 100 100 100 100 100 100 100 100 100 100 100 100 
##$AQSEQ= 0
##$AQ_mod= 1
##$AUNM= <au_zg>
##$AUTOPOS= <>
##$BF1= 200.13
##$BF2= 200.13
##$BF3= 200.13
##$BF4= 200.13
##$BF5= 200.13
##$BF6= 200.13
##$BF7= 200.13
##$BF8= 200.13
##$BYTORDA= 1
##$CFDGTYP= 0
##$CFRGTYP= 5
##$CHEMSTR= <none>
##$CNST= (0..31)
1 1 145 1 1 1 1 1 1 1 1 1 1 1 1 1 1 1 1 1 1 1 1 1 1 1 1 1 1 1 1 1 
##$CPDPRG= <>
##$CPDPRG1= <>
##$CPDPRG2= <>
##$CPDPRG3= <>
##$CPDPRG4= <mlev>
##$CPDPRG5= <mlev>
##$CPDPRG6= <mlev>
##$CPDPRG7= <mlev>
##$CPDPRG8= <mlev>
##$CPDPRGB= <>
##$CPDPRGT= <>
##$D= (0..31)
0 1.2 0 0 0 0 0 0 0 0.06 0 0.03 0 0 0 0 0.0002 0 0 0 0 0 0 0 0 0 0 0 0 
0 0 0 
##$DATE= 1622787762
##$DBL= (0..7)
120 120 120 120 120 120 120 120 
##$DBP= (0..7)
150 150 150 150 150 150 150 150 
##$DBP07= 0
##$DBPNAM0= <>
##$DBPNAM1= <>
##$DBPNAM2= <>
##$DBPNAM3= <>
##$DBPNAM4= <>
##$DBPNAM5= <>
##$DBPNAM6= <>
##$DBPNAM7= <>
##$DBPOAL= (0..7)
0.5 0.5 0.5 0.5 0.5 0.5 0.5 0.5 
##$DBPOFFS= (0..7)
0 0 0 0 0 0 0 0 
##$DE= 6
##$DECBNUC= <off>
##$DECIM= 32
##$DECNUC= <off>
##$DECSTAT= 4
##$DIGMOD= 1
##$DIGTYP= 9
##$DL= (0..7)
0 120 120 120 120 120 120 120 
##$DP= (0..7)
150 150 150 150 150 150 150 150 
##$DP07= 0
##$DPNAME0= <>
##$DPNAME1= <>
##$DPNAME2= <>
##$DPNAME3= <>
##$DPNAME4= <>
##$DPNAME5= <>
##$DPNAME6= <>
##$DPNAME7= <>
##$DPOAL= (0..7)
0.5 0.5 0.5 0.5 0.5 0.5 0.5 0.5 
##$DPOFFS= (0..7)
0 0 0 0 0 0 0 0 
##$DQDMODE= 0
##$DR= 18
##$DS= 0
##$DSLIST= <SSSSSSSSSSSSSSS>
$$ [...]
##$SUBNAM2= <"">
##$SUBNAM3= <"">
##$SUBNAM4= <"">
##$SUBNAM5= <"">
##$SUBNAM6= <"">
##$SUBNAM7= <"">
##$SUBNAM8= <"">
##$SUBNAM9= <"">
##$SW= 20.0188882624521
##$SWIBOX= (0..15)
0 0 2 0 0 0 0 0 0 0 0 0 0 0 0 0 
##$SW_h= 4006.41025641026
##$TD= 16384
##$TD0= 1
##$TE= 0
##$TE2= 300
##$TE3= 300
##$TEG= 300
##$TL= (0..7)
0 120 120 120 120 120 120 120 
##$TP= (0..7)
150 150 150 150 150 150 150 150 
##$TP07= 0
##$TPNAME0= <>
##$TPNAME1= <>
##$TPNAME2= <>
##$TPNAME3= <>
##$TPNAME4= <>
##$TPNAME5= <>
##$TPNAME6= <>
##$TPNAME7= <>
##$TPOAL= (0..7)
0.5 0.5 0.5 0.5 0.5 0.5 0.5 0.5 
##$TPOFFS= (0..7)
0 0 0 0 0 0 0 0 
##$TUNHIN= 0
##$TUNHOUT= 0
##$TUNXOUT= 0
##$USERA1= <user>
##$USERA2= <user>
##$USERA3= <user>
##$USERA4= <user>
##$USERA5= <user>
##$V9= 5
##$VALIST= <valist>
##$VCLIST= <CCCCCCCCCCCCCCC>
##$VD= 0
##$VDLIST= <DDDDDDDDDDDDDDD>
##$VPLIST= <PPPPPPPPPPPPPPP>
##$VTLIST= <TTTTTTTTTTTTTTT>
##$WBST= 1024
##$WBSW= 4
##$XGAIN= (0..3)
0 0 0 0 
##$XL= 0
##$YL= 0
##$YMAX_a= 152686
##$YMIN_a= -161258
##$ZGOPTNS= <>
##$ZL1= 120
##$ZL2= 120
##$ZL3= 120
##$ZL4= 120
##$ABSF1= 10
##$ABSF2= 0
##$ABSG= 5
##$ABSL= 3
##$ALPHA= 0
##$AQORDER= 0
##$ASSFAC= 0
##$ASSFACI= 0
##$ASSFACX= 0
##$ASSWID= 0
##$AUNMP= <proc_1d>
##$AZFE= 0.1
##$AZFW= 0.1
##$BCFW= 1
##$BC_mod= 2
##$BYTORDP= 1
##$COROFFS= 0
##$CY= 11.3945322036743
##$DATMOD= 1
##$DC= 2
##$DFILT= <>
##$DTYPP= 0
##$F1P= 15.9154993809931
##$F2P= -4.1035820241983
##$FCOR= 0.5
##$FTSIZE= 0
##$FT_mod= 4
##$GAMMA= 1
##$GB= 0.15
##$INTBC= 1
##$INTSCL= 1
##$ISEN= 128
##$LB= 0.24
##$LEV0= 0
##$LPBIN= 0
##$MAXI= 10000
##$MC2= 0
##$MEAN= 0
##$ME_mod= 0
##$MI= 1.114404
##$NCOEF= 0
##$NC_proc= 0
##$NLEV= 6
##$NOISF1= 3.799351
##$NOISF2= 2.8
##$NSP= 1
##$NTH_PI= 0
##$NZP= 0
##$OFFSET= 15.70392
##$PC= 1
##$PHC0= -11211.17
##$PHC1= 22.20099
##$PH_mod= 1
##$PKNL= yes
##$PPARMOD= 0
##$PSCAL= 0
##$PSIGN= 0
##$REVERSE= no
##$SF= 200.130013532006
##$SI= 16384
##$SIGF1= 3
##$SIGF2= 2
##$SINO= 400
##$SIOLD= 16384
##$SREGLST= <1H.CDCl3>
##$SSB= 0
##$STSI= 0
##$STSR= 0
##$SW_p= 3612.71676300578
##$SYMM= 0
##$S_DEV= 0
##$TDeff= 0
##$TDoff= 0
##$TI= <>
##$TILT= no
##$TM1= 0
##$TM2= 0
##$TOPLEV= 0
##$USERP1= <user>
##$USERP2= <user>
##$USERP3= <user>
##$USERP4= <user>
##$USERP5= <user>
##$WDW= 1
##$XDIM= 8192
##$YMAX_p= 0
##$YMIN_p= 0
$$ End of Bruker specific parameters
$$ ---------------------------------
##NTUPLES= NMR FID
##VAR_NAME=  TIME,          FID/REAL,        FID/IMAG
##SYMBOL=    X,             R,               I
##VAR_TYPE=  INDEPENDENT,   DEPENDENT,       DEPENDENT
##VAR_FORM=  AFFN,          ASDF,            ASDF
##VAR_DIM=   8192,          8192,            8192
##UNITS=     SECONDS,       ARBITRARY UNITS, ARBITRARY UNITS
##FACTOR=    0.0002496,     1,               1
##FIRST=     0,             0,               0
##LAST=      2.0444736,     0,               0
##MIN=       0,             -161258,         0
##MAX=       2.0444736,     152686,          0
$$ Real data points
##PAGE= N=1
##DATA TABLE= (X++(R..R)), XYDATA
0 0 0 0 0 0 0 0 0 0 0 0 0 0 0 8 -8 8 -8 16 -16 16 -24 24 -32 40 -46 50 -59 72 -81 94 -106 122 -138 159 -178
35 -178 201 -227 255 -284 319 -353 394 -435 483 -538 595 -656 723 -795 876 -966 1065 -1172
53 -1172 1293 -1426 1575 -1744 1938 -2160 2419 -2723 3090 -3540 4105 -4847 5860 -7330 9683
68 9683 -14211 39807 -123560 33139 93641 -161258 120622 -872 -115010 146532 -71441
79 -71441 -55847 144664 -131414 26739 92956 -144100 92352 24021 -122804 135869 -53495
90 -53495 -65400 135864 -108605 4498 100684 -133882 73850 36774 -120011 118518 -33091
101 -33091 -75766 129812 -91681 -10421 103374 -122182 55653 49452 -119299 105125 -16913
112 -16913 -83489 123639 -75649 -25077 106948 -112484 39575 60535 -118064 91847 -630
123 -630 -90912 117115 -59719 -38861 108873 -101279 22577 70942 -114194 76360 15539
134 15539 -95630 107024 -41976 -51358 106885 -86608 5659 78123 -106343 59075 29999
145 29999 -96459 93707 -24574 -60683 101407 -70489 -9476 81738 -95723 42229 41047
156 41047 -94166 79843 -9484 -66615 94435 -55838 -21401 83130 -85780 27909 49476
167 49476 -91185 67691 2940 -70749 88034 -43410 -31074 83597 -76961 15927 56050
178 56050 -88089 57315 13510 -73967 81937 -32170 -39583 83321 -68150 4591 61681
189 61681 -83834 46492 23323 -75730 74521 -20773 -47133 81269 -57940 -6472 65688
200 65688 -77781 34788 32434 -75725 65228 -8984 -53244 77222 -46501 -17027 67918
211 67918 -70005 22724 40147 -73971 55159 2160 -57710 72006 -35215 -26195 68730
222 68730 -62074 11630 46516 -71359 45501 12024 -60738 66374 -24934 -33709 68294
233 68294 -54362 2083 51137 -68065 36800 20260 -62530 60553 -15688 -39768 66749
244 66749 -46628 -6356 54344 -63715 28180 27053 -62695 53964 -7206 -44306 64015
255 64015 -38610 -13925 56243 -58466 19482 33051 -61736 46523 1230 -47817 60251
266 60251 -30128 -21080 57215 -52492 10701 38437 -60047 38878 9465 -50856 56104 -21608
278 -21608 -27996 57728 -46283 1974 43423 -57799 31088 17358 -53150 51459 -13278 -34174
290 -34174 57365 -39771 -6132 47304 -54688 23340 24203 -54227 46027 -5340 -39025 55503
302 55503 -32658 -13301 49344 -50077 15666 29371 -53294 39693 1719 -41862 52087 -25373
314 -25373 -19114 49584 -44551 8400 33151 -51044 32984 8113 -43400 47831 -18249 -23974
326 -23974 48852 -38874 1772 36158 -48578 26722 13980 -44828 43806 -11467 -28766 48273
338 48273 -33453 -4755 39276 -46185 20547 19823 -46251 39779 -4775 -33496 47577 -27933
350 -27933 -11247 42203 -43436 14022 25498 -46960 34877 2094 -37325 45575 -21609 -17216
362 -17216 43611 -39218 7219 29947 -45771 28827 8496 -39322 41772 -14844 -21952 43014
374 43014 -33752 787 32702 -42839 22320 13805 -39547 36944 -8531 -25269 41169 -28211
386 -28211 -4611 34239 -39530 16523 18096 -39343 32540 -3090 -28096 39542 -23349 -9441
398 -9441 35759 -36719 11379 21983 -39400 28843 1770 -30980 38473 -18994 -14175 37548
410 37548 -34152 6250 25997 -39386 24867 6851 -33572 36756 -14101 -18752 38487 -30626
422 -30626 830 29286 -38126 19983 11844 -35005 33600 -8507 -22642 37747 -25749 -4596
434 -4596 31202 -35174 14414 15995 -34835 29254 -3114 -25291 35707 -20523 -9231 31920
446 31920 -31638 9201 19211 -33966 24964 1599 -27171 33497 -15861 -13013 32296 -28509
458 -28509 4860 21900 -33308 21464 5594 -28971 31861 -11912 -16488 32925 -25953 914
470 914 24591 -32855 18131 9527 -30653 30049 -7907 -19768 33157 -22997 -3150 26900 -31718
483 -31718 14259 13402 -31649 27251 -3382 -22661 32230 -18972 -7367 28248 -29211 9645
495 9645 16768 -31314 23411 1153 -24617 30260 -14494 -11160 28703 -26000 4997 19521 -30198
508 -30198 19290 5281 -25787 27861 -10305 -14262 28688 -22970 1032 21707 -29063 15717
520 15717 8771 -26805 25809 -6706 -16972 28672 -20276 -2445 23584 -27981 12519 11819 -27584
533 -27584 23788 -3360 -19338 28399 -17509 -5771 25046 -26486 9084 14639 -27804 21189
545 21189 208 -21296 27284 -14045 -9072 25757 -24051 5257 17047 -27098 17882 3815
557 3815 -22622 25437 -10175 -12183 25833 -21029 1304 19108 -25825 14275 7262 -23495 23158
570 23158 -6415 -14858 25527 -18070 -2220 20805 -24544 10974 10339 -24239 21000 -2949 -17221
583 -17221 25102 -15229 -5385 22134 -23170 7894 12932 -24583 18806 173 -19063 24352
595 24352 -12403 -8196 22964 -21399 4759 15110 -24253 16158 3242 -20201 22827 -9287
607 -9287 -10636 22973 -19010 1596 16771 -23175 13127 6126 -20809 20758 -6014 -12810 22506
620 22506 -16290 -1508 18115 -21767 10009 8775 -21149 18569 -2960 -14768 21988 -13691
632 -13691 -4386 19347 -20466 7097 11246 -21554 16576 -29 -16617 21528 -11173 -7105 20404
645 20404 -19105 4308 13414 -21625 14530 2700 -18081 20733 -8588 -9608 20947 -17277
657 -17277 1420 15159 -20957 12021 5266 -18769 19121 -5792 -11567 20594 -14914 -1291
669 -1291 16251 -19605 9263 7532 -18907 16995 -2973 -13141 19708 -12274 -3759 16881 -17998
682 -17998 6633 9425 -18854 14965 -415 -14516 18953 -9907 -5997 17563 -16677 4221
694 4221 11275 -18979 13217 2020 -15902 18392 -7718 -8187 18272 -15497 1919 13088 -19041
707 -19041 11442 4427 -17122 17561 -5411 -10274 18597 -13877 -554 14572 -18407 9158
719 9158 6752 -17663 15919 -2887 -11933 18079 -11664 -2929 15434 -17040 6515 8728 -17526
732 -17526 13681 -307 -13020 16956 -9147 -4991 15714 -15327 4021 10226 -17052 11558
744 11558 1909 -13832 15954 -6964 -6795 16030 -13892 1813 11625 -16725 9815 3865 -14623
757 -14623 15223 -5155 -8508 16449 -12778 -200 13053 -16540 8185 5825 -15472 14380
769 14380 -3242 -10223 16627 -11299 -2313 14204 -15824 6180 7668 -15840 12934 -1080 -11645
782 -11645 16130 -9192 -4431 14826 -14351 3783 9234 -15499 10880 1170 -12513 14992 -6772
795 -6772 -6296 14834 -12520 1468 10359 -14765 8855 3148 -13035 13821 -4633 -7851 14712
808 14712 -10937 -508 11304 -14166 7161 4798 -13525 12867 -2900 -9203 14714 -9707
820 -9707 -2162 12256 -13749 5724 6391 -14078 11922 -1174 -10494 14560 -8293 -3785 13022
833 13022 -13041 4072 7866 -14287 10584 692 -11531 13937 -6422 -5454 13331 -11730 2056
846 2056 9106 -13863 8698 2642 -12064 12760 -4319 -6911 13159 -10094 26 10030 -13090
859 -13090 6759 4392 -12332 11450 -2402 -8134 12837 -8596 -1718 10763 -12352 5118 5812
872 5812 -12541 10382 -868 -9155 12661 -7400 -3135 11497 -11774 3728 7086 -12761 9394
885 9394 551 -10044 12411 -6134 -4443 11995 -11000 2245 8156 -12697 8163 2006 -10702
898 -10702 11789 -4584 -5769 12103 -9776 538 9000 -12109 6565 3494 -10956 10713 -2865
911 -2865 -6893 11812 -8313 -1120 9636 -11304 4898 4874 -11071 9509 -1216 -7905 11412
924 11412 -6903 -2569 10147 -10533 3497 6044 -11219 8556 180 -8812 11178 -5698 -3848
937 -3848 10690 -9890 2216 7084 -11346 7621 1458 -9569 10856 -4477 -5002 10993 -9137
950 -9137 900 7952 -11205 6464 2768 -10001 10147 -3072 -6056 10884 -7998 -541 8580
963 8580 -10548 5016 4014 -10088 9034 -1585 -6883 10452 -6658 -1903 9017 -9739 3535
976 3535 5153 -10045 7872 -172 -7605 9996 -5398 -3068 9394 -9026 2277 6125 -10089
989 -10089 6952 1053 -8326 9738 -4310 -4187 9819 -8414 1076 7020 -10114 6061 2171
1002 2171 -8918 9420 -3256 -5248 10083 -7687 -173 7803 -9861 4966 3319 -9239 8706
1015 8706 -1974 -6140 9892 -6558 -1449 8241 -9149 3638 4337 -9178 7642 -635 -6835
1028 -6835 9378 -5220 -2633 8462 -8212 2302 5196 -8987 6518 586 -7356 8841 -4000
1041 -4000 -3640 8627 -7463 1170 5939 -8937 5643 1659 -7935 8517 -2993 -4598 8865
1054 8865 -6882 133 6691 -8942 4873 2688 -8468 8167 -1991 -5510 9016 -6204 -935
1067 -935 7357 -8703 3877 3768 -8736 7434 -795 -6264 8746 -5142 -2012 7699 -8011 2679
1081 2679 4676 -8637 6347 455 -6778 8142 -3862 -3024 7780 -7085 1414 5386 -8304
1094 -8304 5218 1537 -7074 7516 -2776 -3845 7812 -6357 344 5993 -8107 4307 2460
1107 2460 -7402 7096 -1910 -4583 7967 -5821 -549 6624 -8002 3577 3309 -7751 6750
1120 6750 -1073 -5308 8092 -5220 -1494 7199 -7710 2667 4195 -7913 6090 -85 -5931
1133 -5931 7861 -4258 -2460 7469 -7033 1551 4922 -7745 5109 990 -6368 7297 -3080
1146 -3080 -3417 7472 -6074 356 5476 -7313 4029 1938 -6602 6659 -2019 -4181 7402 -5244
1160 -5244 -645 5933 -6987 3167 2759 -6827 6196 -1133 -4846 7394 -4633 -1434 6381 -6787
1174 -6787 2515 3491 -7114 5832 -341 -5483 7398 -3977 -2241 6776 -6478 1726 4197 -7215
1188 -7215 5211 553 -5994 7114 -3096 -3048 6927 -5871 752 4820 -7050 4299 1547 -6292
1202 -6292 6469 -2020 -3791 6802 -4993 -254 5259 -6622 3287 2425 -6429 5792 -1020 -4395
1216 -4395 6637 -4185 -1119 5665 -6253 2442 3180 -6541 5241 -190 -4898 6543 -3585 -1826
1230 -1826 6025 -6029 1756 3841 -6711 4801 540 -5417 6464 -2984 -2559 6323 -5679 976
1244 976 4438 -6701 4172 1292 -5787 6157 -2214 -3262 6429 -5046 62 4950 -6392 3279
1258 3279 2124 -5957 5535 -1253 -3883 6271 -4190 -852 5301 -5905 2335 2886 -5987 4861
1272 4861 -322 -4421 6056 -3373 -1679 5576 -5464 1497 3511 -6025 4292 447 -4894 5916
1286 5916 -2731 -2386 5821 -5166 834 4069 -6119 3838 1150 -5330 5768 -2118 -3036 6020 -4777
1301 -4777 140 4569 -6047 3277 1839 -5633 5422 -1373 -3626 6016 -4136 -644 4962 -5702
1315 -5702 2456 2561 -5691 4756 -479 -4084 5743 -3327 -1397 5167 -5212 1583 3190 -5634 4068
1330 4068 358 -4477 5449 -2572 -2104 5309 -4759 804 3714 -5600 3507 1035 -4830 5258 -1996
1345 -1996 -2714 5548 -4468 178 4243 -5624 3039 1674 -5170 5076 -1430 -3279 5703 -4083 -466
1360 -466 4697 -5506 2462 2295 -5381 4707 -732 -3800 5655 -3447 -1219 4995 -5109 1648 2885
1375 2885 -5360 4060 72 -4185 5350 -2647 -1937 5091 -4561 815 3385 -5216 3375 822 -4488
1390 -4488 4990 -1882 -2565 5129 -4039 121 3781 -5080 2854 1429 -4762 4771 -1338 -3114 5261
1405 5261 -3680 -446 4220 -5036 2422 1976 -5039 4572 -785 -3580 5329 -3305 -980 4564 -4949
1420 -4949 1907 2542 -5256 4194 -117 -4031 5209 -2695 -1617 4740 -4578 1181 3054 -5197 3551
1435 3551 642 -4329 4838 -1915 -2230 4780 -4019 408 3515 -4972 2836 1369 -4502 4382 -1187
1450 -1187 -2754 4740 -3483 -247 3860 -4784 2272 1939 -4682 4073 -637 -3181 4799 -3111 -770
1465 -770 4244 -4686 1786 2448 -4866 3815 -159 -3590 4849 -2752 -1303 4546 -4556 1243 2935
1480 2935 -4984 3400 454 -3945 4694 -2181 -1902 4702 -4143 529 3394 -4807 2805 1137 -4156
1495 -4156 4336 -1448 -2488 4699 -3524 -246 3768 -4496 2078 1746 -4254 3851 -757 -2951 4598
1510 4598 -2938 -865 4033 -4227 1500 2235 -4367 3493 -213 -3351 4561 -2491 -1368 4241 -4048
1525 -4048 1030 2614 -4496 3224 262 -3691 4551 -2097 -1859 4448 -3849 561 3019 -4540 2881
1540 2881 817 -3994 4349 -1528 -2355 4490 -3426 -42 3382 -4353 2318 1426 -4136 3918 -839
1555 -839 -2823 4381 -2813 -705 3656 -4023 1613 1966 -4181 3398 -172 -3185 4204 -2247 -1237
1570 -1237 3829 -3741 1042 2428 -4241 2970 367 -3482 4065 -1795 -1677 3998 -3544 594 2786
1585 2786 -4282 2688 819 -3721 3996 -1431 -2085 4150 -3342 150 3149 -4234 2311 1293 -3911
1600 -3911 3768 -949 -2486 4155 -2922 -398 3438 -3997 1737 1799 -3981 3324 -342 -2874 3999
1615 3999 -2332 -1002 3622 -3619 1077 2233 -3943 2798 255 -3152 3792 -1787 -1511 3741 -3280
1630 -3280 504 2604 -3882 2395 752 -3376 3628 -1306 -1906 3828 -3031 86 2906 -3879 2117
1645 2117 1153 -3572 3530 -955 -2282 3915 -2790 -324 3194 -3791 1740 1570 -3721 3256 -492
1660 -492 -2647 3847 -2374 -815 3390 -3553 1198 2011 -3756 2802 107 -2946 3614 -1757 -1315 3475
1676 3475 -3133 573 2374 -3643 2277 682 -3135 3352 -1191 -1754 3506 -2749 51 2698 -3536
1691 -3536 1851 1142 -3270 3134 -768 -2105 3559 -2500 -346 2961 -3467 1525 1512 -3418 2966 -433
1707 -433 -2429 3585 -2242 -744 3203 -3332 1127 1870 -3512 2680 -16 -2693 3499 -1842 -1185 3348
1723 3348 -3071 618 2241 -3457 2217 507 -2908 3247 -1261 -1615 3363 -2628 28 2519 -3261
1738 -3261 1714 1007 -3021 2943 -720 -2022 3315 -2210 -467 2723 -3059 1290 1375 -3105 2693 -324
1754 -324 -2311 3282 -1915 -816 2895 -2955 1001 1687 -3227 2509 4 -2584 3258 -1640 -1139 3045
1770 3045 -2822 668 1966 -3277 2242 385 -2805 3132 -1228 -1505 3104 -2524 205 2256 -3167
1785 -3167 1808 870 -2919 2830 -685 -1847 3031 -2095 -280 2476 -2949 1307 1319 -2978 2462 -177
1801 -177 -2146 2900 -1688 -708 2611 -2730 875 1656 -2977 2151 179 -2337 2824 -1412 -993 2752
1817 2752 -2619 574 1910 -3024 1935 463 -2496 2758 -1163 -1239 2858 -2475 284 2130 -3006
1832 -3006 1693 784 -2622 2634 -828 -1535 2885 -2178 -113 2338 -2850 1275 1142 -2677 2337 -390
1848 -390 -1826 2793 -1770 -592 2484 -2578 771 1489 -2655 1957 43 -2065 2629 -1359 -968 2577
1864 2577 -2307 387 1735 -2609 1674 359 -2209 2539 -1062 -1217 2645 -2129 134 1920 -2597
1879 -2597 1491 622 -2354 2458 -818 -1450 2689 -1974 -110 2077 -2563 1291 879 -2468 2329 -507
1895 -507 -1706 2644 -1688 -474 2202 -2398 900 1183 -2484 2012 -109 -1939 2503 -1296 -851 2289
1911 2289 -2139 473 1479 -2431 1641 340 -2085 2304 -877 -1134 2318 -1858 136 1699 -2360
1926 -2360 1353 632 -2201 2158 -605 -1359 2338 -1696 -117 1847 -2329 1152 860 -2270 2053 -375
1942 -375 -1526 2362 -1543 -342 1991 -2285 923 1078 -2322 1897 -127 -1713 2302 -1298 -623 2097
1958 2097 -2111 587 1337 -2295 1585 219 -1860 2153 -939 -947 2152 -1825 179 1579 -2184 1233
1974 1233 591 -1961 1947 -562 -1205 2136 -1537 -135 1732 -2085 961 836 -2030 1804 -299 -1400
1990 -1400 2122 -1351 -380 1831 -2023 767 994 -2082 1705 -127 -1554 2132 -1210 -566 1937 -1947
2006 -1947 581 1185 -2121 1539 103 -1693 2052 -980 -789 1986 -1766 307 1381 -2077 1273
2021 1273 428 -1805 1887 -623 -1050 1991 -1478 -48 1567 -1932 949 742 -1852 1650 -276 -1262
2037 -1262 1923 -1220 -334 1663 -1826 662 959 -1886 1476 -43 -1417 1876 -1051 -531 1752 -1736
2053 -1736 487 1107 -1914 1372 107 -1523 1869 -917 -685 1848 -1674 296 1273 -1908 1214 332
2069 332 -1611 1791 -715 -884 1878 -1500 49 1425 -1844 954 582 -1681 1613 -400 -1119 1834
2085 1834 -1221 -285 1551 -1674 619 829 -1707 1383 -105 -1312 1767 -961 -570 1649 -1533 357
2101 357 1016 -1705 1207 132 -1425 1713 -759 -732 1689 -1430 221 1146 -1718 1122 290 -1525
2117 -1525 1691 -613 -873 1734 -1348 55 1264 -1707 990 463 -1609 1604 -423 -1053 1734 -1168
2133 -1168 -169 1383 -1642 761 705 -1683 1414 -126 -1245 1663 -911 -474 1477 -1486 460 930
2149 930 -1672 1176 182 -1377 1570 -635 -682 1536 -1327 191 1121 -1643 978 410 -1453 1466
2165 1466 -462 -813 1561 -1246 40 1239 -1646 857 560 -1532 1416 -345 -944 1591 -1174 -120
2181 -120 1338 -1631 720 709 -1589 1313 -184 -1093 1597 -1012 -319 1464 -1526 477 908 -1606
2197 -1606 1116 84 -1217 1522 -742 -578 1530 -1345 169 1103 -1557 889 367 -1336 1422 -478
2213 -478 -803 1572 -1162 -88 1249 -1481 695 551 -1389 1326 -313 -949 1564 -1059 -248 1331
2229 1331 -1455 585 654 -1448 1261 -196 -1074 1569 -948 -365 1390 -1408 468 784 -1497 1186
2245 1186 -34 -1189 1549 -781 -540 1456 -1291 254 943 -1493 1005 217 -1301 1450 -516 -753
2261 -753 1476 -1110 -3 1114 -1431 767 483 -1378 1303 -256 -945 1463 -922 -234 1205 -1361
2277 -1361 554 656 -1421 1172 -87 -1080 1422 -804 -373 1271 -1315 435 782 -1448 1110 46
2293 46 -1158 1415 -703 -469 1348 -1257 313 888 -1465 988 187 -1231 1387 -550 -639 1411 -1151
2310 -1151 95 1023 -1424 783 409 -1288 1262 -315 -813 1382 -980 -158 1153 -1352 551 630
2326 630 -1333 1094 -80 -997 1346 -777 -379 1229 -1230 343 791 -1341 978 101 -1087 1326
2342 1326 -620 -507 1304 -1149 227 885 -1350 895 215 -1146 1299 -508 -593 1329 -1086 106
2358 106 960 -1346 787 334 -1230 1241 -360 -743 1332 -971 -89 1056 -1299 615 529 -1265 1102
2375 1102 -144 -923 1289 -788 -307 1159 -1198 363 730 -1295 924 111 -1034 1231 -557 -509
2391 -509 1229 -1069 166 878 -1283 772 274 -1114 1186 -404 -618 1279 -985 36 964 -1264
2407 -1264 667 387 -1153 1130 -308 -714 1273 -944 -88 1042 -1253 558 511 -1197 1057 -178
2423 -178 -828 1264 -811 -250 1118 -1174 391 673 -1214 934 22 -956 1226 -611 -460 1197 -1025
2440 -1025 153 834 -1192 728 240 -1059 1132 -393 -646 1220 -875 -54 928 -1150 589 390
2456 390 -1118 1071 -228 -770 1221 -788 -197 982 -1122 471 475 -1131 1006 -137 -840 1211 -718
2473 -718 -289 1040 -1093 383 576 -1166 926 -8 -939 1170 -575 -411 1088 -989 232 724 -1165
2490 -1165 792 198 -1030 1101 -356 -589 1128 -827 15 865 -1129 594 410 -1086 983 -140
2506 -140 -735 1101 -689 -181 946 -1075 416 553 -1130 866 9 -829 1076 -594 -293 988 -1025
2523 -1025 307 649 -1125 786 96 -870 1054 -518 -361 1035 -960 217 747 -1107 709 203
2539 203 -923 1007 -393 -490 1072 -868 47 845 -1077 544 357 -989 910 -215 -633 1073 -715
2556 -715 -176 945 -1002 337 544 -1016 796 -24 -765 1054 -561 -350 1010 -938 174 668 -1018
2573 -1018 678 124 -849 1009 -442 -466 1024 -851 76 733 -1001 605 220 -890 990 -345 -536
2590 -536 1045 -765 -5 794 -977 523 302 -937 918 -227 -643 1047 -670 -169 846 -933
2606 -933 378 445 -986 817 -28 -766 1021 -505 -343 929 -849 188 607 -997 668 161 -873
2623 -873 959 -347 -507 980 -759 44 743 -987 551 314 -933 895 -226 -586 976 -676
2639 -676 -64 790 -954 470 390 -948 843 -130 -642 972 -623 -158 829 -930 365 443 -960 766
2657 766 -33 -715 954 -528 -270 882 -871 229 596 -977 649 131 -803 921 -360 -427 940
2674 940 -772 46 723 -946 518 312 -878 852 -200 -578 967 -633 -115 808 -907 379 434
2691 434 -908 788 -75 -655 955 -550 -223 849 -869 287 487 -921 708 3 -712 911 -470
2708 -470 -296 859 -810 200 547 -919 639 107 -764 881 -367 -405 884 -739 80 664 -904
2725 -904 509 258 -832 807 -205 -521 905 -617 -95 760 -868 373 428 -888 721 -28 -650
2742 -650 887 -491 -249 836 -817 225 539 -897 633 70 -716 874 -407 -336 858 -764 128
2759 128 600 -878 560 147 -741 824 -333 -399 867 -696 54 646 -846 485 247 -749 788
2776 788 -225 -469 872 -610 -69 719 -809 354 365 -806 696 -79 -598 872 -484 -240 791
2793 791 -762 183 494 -845 594 68 -711 849 -353 -403 832 -685 66 593 -841 510 182
2810 182 -763 798 -250 -483 832 -612 -23 634 -801 440 258 -782 753 -170 -516 827 -544
2827 -544 -89 658 -778 369 341 -794 706 -57 -581 808 -447 -197 708 -736 241 442 -835 600
2845 600 75 -691 782 -343 -343 777 -672 100 571 -843 482 240 -747 734 -186 -459 797 -585
2863 -585 -33 672 -813 385 359 -786 683 -80 -519 801 -511 -117 703 -780 299 409 -780
2880 -780 612 -31 -545 778 -457 -171 720 -747 212 459 -788 535 57 -598 745 -385 -288 751
2898 751 -669 91 546 -771 466 171 -670 716 -252 -407 795 -574 -47 660 -737 344 308 -715
2916 -715 656 -105 -524 825 -476 -183 730 -718 235 408 -743 587 -1 -593 790 -402 -261
2933 -261 731 -652 153 453 -735 528 40 -618 752 -330 -323 729 -607 76 494 -721 474 141
2951 141 -642 706 -237 -397 737 -538 -12 566 -704 379 268 -706 661 -98 -502 758 -431
2968 -431 -140 647 -679 254 385 -755 563 31 -599 745 -342 -265 698 -634 143 478 -763 490
2986 490 126 -639 703 -261 -338 702 -580 59 509 -727 436 184 -654 653 -198 -393 698 -535
3004 -535 -4 560 -692 357 255 -657 604 -107 -434 705 -445 -97 617 -671 256 359 -699 549
3022 549 -6 -535 704 -361 -220 677 -625 120 465 -720 458 138 -613 675 -259 -348 702 -575
3040 -575 17 534 -709 392 213 -668 642 -166 -426 693 -503 -55 567 -670 322 279 -663 586
3058 586 -99 -449 694 -424 -110 592 -630 265 332 -664 546 -22 -497 686 -366 -197 628 -610
3076 -610 151 418 -687 476 91 -579 654 -273 -321 673 -549 41 518 -706 382 224 -636 614
3094 614 -145 -412 704 -476 -61 589 -663 299 313 -661 570 -65 -474 693 -414 -134 630 -634
3112 -634 224 353 -659 512 -5 -499 677 -347 -191 625 -594 150 392 -639 443 56 -527 642
3130 642 -290 -268 637 -544 46 463 -639 368 169 -577 613 -185 -366 674 -462 -67 546 -616
3148 -616 299 272 -637 567 -71 -479 691 -371 -175 610 -589 201 354 -654 500 9 -538 658
3166 658 -309 -241 606 -545 128 389 -650 440 73 -544 633 -240 -279 601 -504 67 413 -626 394
3185 394 154 -574 575 -160 -342 607 -441 -25 475 -608 306 246 -598 547 -59 -423 617 -363 -121
3204 -121 560 -586 211 360 -650 463 45 -515 615 -286 -225 585 -549 113 428 -640 394 125
3222 125 -542 581 -223 -281 596 -512 30 455 -637 323 178 -538 530 -157 -304 591 -447 -17 486
3241 486 -577 277 230 -546 502 -85 -367 590 -393 -94 529 -548 191 314 -563 438 -6 -438 595
3260 595 -311 -201 584 -514 92 394 -597 365 99 -507 577 -214 -309 604 -467 -12 461 -583 306
3279 306 170 -537 543 -142 -356 598 -412 -66 485 -546 252 227 -540 490 -72 -385 582 -342 -111
3298 -111 498 -506 204 260 -544 446 -2 -426 560 -273 -190 509 -474 126 333 -552 389 80 -499 546
3318 546 -193 -278 545 -442 23 418 -574 310 192 -540 503 -104 -360 577 -386 -75 473 -556 238 265
3338 265 -561 472 -39 -403 550 -306 -125 496 -510 177 304 -542 418 17 -427 518 -269 -174 508 -468
3358 -468 111 340 -543 344 66 -451 497 -197 -230 509 -417 31 384 -542 287 148 -504 462 -124 -320
3378 -320 535 -372 -57 458 -511 214 252 -523 434 -17 -387 551 -310 -165 497 -485 134 329 -537 388
3398 388 38 -437 517 -238 -207 508 -441 71 346 -524 316 89 -449 478 -175 -254 509 -386 13 383 -487
3419 -487 267 144 -473 438 -116 -295 501 -329 -62 419 -479 204 228 -499 415 -14 -369 505 -265 -145
3439 -145 474 -466 118 329 -513 357 74 -432 498 -198 -245 519 -420 31 377 -515 293 132 -475 460
3459 460 -148 -289 517 -376 -34 408 -493 225 187 -470 425 -85 -320 492 -321 -88 424 -445 173 238 -447
3480 -447 381 -20 -352 496 -259 -147 456 -425 113 305 -477 342 53 -410 491 -192 -237 509 -397 7
3500 7 359 -502 277 141 -470 468 -124 -331 525 -341 -53 414 -494 214 206 -496 430 -53 -358 503 -283
3521 -283 -111 423 -451 181 245 -488 388 22 -369 487 -231 -153 435 -412 109 287 -494 331 68 -407 456
3542 456 -180 -209 455 -383 47 351 -502 271 134 -456 432 -109 -285 485 -357 -38 410 -500 213 233 -486
3563 -486 401 -34 -351 488 -300 -113 455 -486 147 298 -498 365 40 -372 490 -240 -166 471 -427 98
3583 98 329 -474 314 80 -403 438 -193 -210 468 -387 28 349 -471 255 115 -415 423 -132 -261 475 -354
3604 -354 -42 394 -456 199 192 -456 398 -62 -333 494 -292 -128 444 -451 129 274 -470 357 21 -397 504
3625 504 -233 -189 487 -422 66 321 -481 311 76 -424 484 -170 -252 484 -378 11 344 -479 268 125 -453
3646 -453 439 -128 -282 470 -324 -42 378 -446 226 171 -444 410 -68 -329 461 -278 -93 400 -431 164
3666 164 238 -464 376 11 -368 477 -220 -169 462 -422 94 324 -490 329 89 -436 461 -163 -239 481 -391
3687 -391 19 379 -499 266 148 -456 445 -102 -286 472 -349 -44 391 -480 202 205 -464 405 -56 -312 474
3708 474 -296 -86 410 -438 157 251 -456 362 17 -345 453 -240 -146 438 -412 89 310 -463 308 63 -401
3729 -401 451 -188 -220 477 -386 20 368 -484 267 147 -448 442 -110 -288 493 -352 -49 403 -479 215
3749 215 212 -470 417 -58 -340 487 -297 -113 429 -456 170 261 -455 385 -1 -341 470 -244 -145 446 -417
3770 -417 101 287 -456 320 59 -390 438 -191 -200 462 -379 46 327 -470 273 137 -430 423 -127 -272 484
3791 484 -348 -40 394 -474 207 199 -466 407 -51 -329 494 -293 -106 449 -459 147 268 -482 381 14 -365
3812 -365 494 -239 -155 463 -413 101 301 -465 317 62 -392 460 -202 -197 464 -375 30 332 -447 268 104
3833 104 -412 427 -139 -267 471 -336 -20 371 -442 213 167 -447 407 -71 -325 485 -293 -117 417 -443
3853 -443 163 247 -488 382 5 -393 494 -236 -185 461 -423 91 299 -499 326 77 -427 472 -179 -229 473
3874 473 -386 32 338 -474 285 124 -450 430 -130 -268 461 -339 -5 356 -462 223 178 -458 403 -62
3894 -62 -304 468 -290 -66 392 -454 175 241 -487 374 7 -372 471 -242 -145 441 -437 104 314 -500 339
3915 339 80 -424 469 -199 -219 490 -416 39 370 -508 283 139 -456 437 -133 -271 494 -364 -26 411
3935 411 -499 220 181 -462 401 -74 -309 477 -317 -73 427 -446 164 240 -457 381 -15 -334 485 -275 -140
3956 -140 452 -435 108 291 -478 341 49 -398 474 -211 -212 487 -412 53 358 -498 299 129 -452 473 -147
3977 -147 -294 522 -368 -35 411 -488 238 177 -467 428 -97 -343 511 -319 -85 426 -454 192 223 -481 396
3998 396 -25 -360 496 -253 -134 442 -422 133 266 -471 363 44 -391 466 -211 -194 444 -398 73 317
4018 317 -489 296 98 -440 445 -147 -272 475 -370 -6 387 -501 253 171 -484 443 -83 -318 509 -322
4038 -322 -79 439 -483 189 246 -486 404 -16 -363 503 -272 -125 464 -439 126 290 -495 352 45 -382
4058 -382 485 -209 -176 446 -406 65 321 -473 297 92 -416 429 -162 -240 464 -366 3 371 -465 240 163
4079 163 -438 416 -89 -297 488 -325 -56 440 -462 182 236 -490 405 -25 -366 508 -275 -142 462 -452
4099 -452 125 278 -487 351 52 -396 481 -217 -203 464 -410 56 329 -489 302 105 -418 441 -163 -236 451
4120 451 -364 11 354 -464 246 143 -437 402 -108 -287 455 -312 -51 395 -441 178 227 -451 388 -26
4140 -26 -336 478 -264 -122 448 -428 112 285 -482 338 39 -390 475 -213 -201 472 -405 51 332 -484 288
4161 288 103 -429 445 -159 -240 481 -360 -10 366 -461 228 150 -435 406 -95 -280 463 -314 -66 389 -417
4182 -417 183 206 -429 364 -41 -316 468 -242 -115 406 -394 118 249 -434 334 36 -364 455 -200 -184 448
4203 448 -374 54 302 -470 280 83 -428 433 -153 -255 448 -345 -19 355 -455 246 164 -449 406 -85
4223 -85 -299 456 -278 -73 372 -424 186 207 -451 356 -19 -321 437 -230 -118 393 -395 126 253 -426 316
4244 316 51 -350 418 -177 -178 417 -364 63 287 -444 266 103 -387 388 -131 -228 425 -334 -8 361 -454
4265 -454 214 176 -435 379 -64 -292 448 -294 -65 412 -435 164 242 -437 348 -3 -321 443 -238 -116 423
4286 423 -394 97 267 -437 300 44 -339 430 -170 -171 418 -350 39 302 -420 246 87 -356 378 -128 -236
4307 -236 429 -321 -31 328 -405 194 142 -397 372 -78 -279 447 -278 -87 393 -392 153 222 -424 357 -11
4328 -11 -321 451 -229 -137 421 -378 101 270 -430 311 54 -375 435 -164 -187 432 -338 34 298 -424 257
4349 257 104 -378 392 -121 -246 416 -287 -9 321 -402 204 151 -395 363 -69 -266 417 -255 -72 353
4369 353 -394 160 216 -411 342 -2 -302 419 -196 -118 411 -374 105 259 -430 309 62 -346 413 -178 -183
4390 -183 428 -362 41 311 -435 255 104 -395 387 -116 -233 416 -323 -10 336 -417 213 158 -400 356
4410 356 -67 -259 415 -271 -53 351 -381 153 190 -393 325 -14 -281 407 -217 -104 384 -363 103 246
4430 246 -395 291 40 -332 402 -177 -178 402 -356 39 282 -424 250 97 -377 391 -142 -236 419 -320 -13
4451 -13 334 -415 213 154 -398 368 -81 -263 426 -264 -56 345 -395 160 190 -389 334 -16 -287 407 -223
4472 -223 -101 361 -360 117 226 -392 287 23 -314 389 -185 -150 362 -330 60 262 -402 243 81 -355
4492 -355 369 -138 -212 395 -317 -7 319 -408 210 138 -392 361 -82 -251 411 -281 -56 358 -397 149 192
4513 192 -395 342 -23 -281 424 -228 -101 371 -363 119 236 -385 295 19 -309 399 -184 -136 375 -337
4533 -337 51 253 -375 246 65 -312 374 -142 -196 371 -300 11 291 -382 210 113 -366 356 -89 -244 409
4554 409 -262 -37 333 -378 178 179 -391 336 -36 -294 426 -224 -81 376 -369 123 229 -399 320 15 -316
4575 -316 407 -177 -135 378 -340 68 256 -401 265 71 -334 370 -132 -188 359 -300 27 272 -387 227 111
4596 111 -348 345 -87 -217 364 -272 -21 309 -366 170 159 -370 324 -37 -254 380 -240 -60 354 -368
4616 -368 141 216 -391 296 26 -289 402 -205 -115 380 -358 72 260 -387 263 65 -326 373 -154 -168 383
4637 383 -318 30 285 -390 211 103 -343 344 -119 -185 362 -268 -8 309 -350 192 144 -339 350 -40 -230
4658 -230 380 -220 -84 339 -368 124 170 -348 278 -15 -269 365 -256 -97 395 -317 71 211 -376 282
4678 282 56 -314 395 -215 -206 397 -356 51 314 -399 226 85 -332 363 -105 -212 398 -283 -19 304 -355
4699 -355 187 134 -349 334 -55 -234 374 -233 -46 326 -340 142 159 -352 293 -18 -272 351 -192 -103 324
4720 324 -325 88 206 -366 264 33 -306 360 -152 -151 357 -315 48 265 -383 224 98 -337 364 -108 -208
4741 -208 376 -293 0 307 -382 201 146 -354 334 -52 -248 370 -242 -46 328 -346 158 174 -359 302 -18
4762 -18 -255 362 -205 -86 323 -324 90 207 -358 251 27 -283 344 -163 -134 339 -305 47 248 -354 222
4783 222 67 -319 334 -123 -187 351 -282 -5 288 -364 204 126 -353 337 -81 -225 378 -255 -42 322 -365
4804 -365 155 177 -368 319 -21 -269 375 -227 -98 341 -342 95 200 -368 261 14 -286 343 -169 -134 332
4825 332 -316 61 227 -355 227 68 -301 336 -123 -163 352 -276 19 271 -351 202 113 -316 318 -84 -206
4846 -206 367 -260 -33 299 -343 166 159 -349 317 -29 -238 366 -223 -70 341 -344 117 199 -376 279 3
4867 3 -285 361 -186 -121 350 -330 65 240 -352 222 52 -298 328 -136 -176 347 -269 9 269 -337 190
4888 190 95 -289 322 -98 -188 332 -245 -26 298 -343 172 120 -338 301 -40 -257 348 -189 -117 360 -334
4909 -334 126 184 -363 299 -72 -301 378 -188 -144 342 -305 124 231 -350 263 50 -295 348 -141 -168 346
4930 346 -287 26 245 -344 230 98 -307 328 -85 -186 343 -234 -3 258 -323 185 134 -312 289 -42
4950 -42 -213 325 -200 -48 271 -315 135 164 -326 259 -7 -253 331 -182 -94 305 -301 97 206 -348 242
4971 242 44 -278 336 -153 -150 337 -294 47 243 -365 207 82 -296 306 -100 -165 333 -260 7 277 -327
4992 -327 167 123 -312 288 -57 -203 331 -213 -37 289 -301 110 148 -314 248 -27 -230 315 -182 -77 301
5013 301 -285 79 183 -323 219 25 -255 317 -150 -126 318 -268 42 228 -318 210 80 -281 318 -93
5033 -93 -166 346 -243 -1 277 -327 165 106 -297 301 -70 -210 337 -203 -54 277 -303 124 151 -315 257
5054 257 -24 -233 306 -179 -92 284 -283 77 178 -304 219 18 -250 301 -132 -120 293 -250 48 207 -302
5075 -302 193 60 -270 300 -86 -160 311 -228 13 247 -303 166 108 -299 287 -58 -200 324 -215 -32 280
5096 280 -298 132 153 -308 269 -3 -228 319 -180 -80 289 -283 84 178 -308 220 32 -243 291 -131 -122
5117 -122 282 -253 43 197 -299 180 56 -252 278 -87 -134 294 -224 11 236 -287 156 95 -265 260 -60
5138 -60 -177 298 -210 -23 260 -293 116 136 -292 248 -15 -210 308 -178 -70 279 -280 76 170 -310 227
5159 227 20 -244 299 -142 -125 297 -256 38 196 -299 181 60 -261 270 -90 -139 285 -215 9 217 -272
5180 -272 164 99 -263 252 -48 -176 287 -183 -32 241 -269 104 127 -280 224 -8 -205 290 -163 -72 276
5201 276 -274 76 175 -298 210 16 -241 293 -133 -114 292 -266 42 207 -304 189 56 -262 272 -104 -142
5222 -142 302 -233 8 239 -280 156 95 -263 257 -52 -162 289 -199 -35 241 -258 110 146 -263 229 -20
5243 -20 -192 286 -159 -84 249 -254 67 158 -270 205 18 -230 291 -129 -109 276 -241 40 192 -289 193
5264 193 65 -249 288 -101 -142 297 -218 3 217 -287 165 95 -275 274 -63 -171 298 -195 -34 235 -267
5285 -267 122 115 -281 237 -17 -201 283 -155 -69 250 -252 90 145 -288 207 11 -225 277 -116 -104 251 -212
5307 -212 6 164 -270 177 65 -240 265 -83 -127 267 -228 24 222 -289 169 97 -258 266 -58 -166 289
5328 289 -198 -20 242 -292 129 120 -289 243 -28 -191 285 -175 -52 259 -278 93 158 -279 209 19 -205
5349 -205 273 -133 -84 266 -231 42 175 -263 173 48 -219 262 -100 -111 278 -211 19 212 -251 150 90
5370 90 -227 250 -73 -146 285 -195 -23 242 -269 121 108 -257 255 -44 -190 299 -172 -57 256 -261 100
5391 100 146 -275 223 -8 -219 291 -136 -81 283 -240 55 169 -271 201 26 -221 279 -101 -117 271 -217
5412 -217 25 195 -249 163 78 -236 258 -65 -145 274 -181 -14 206 -256 131 94 -255 238 -35 -177 268
5433 268 -167 -39 237 -253 97 135 -274 225 -10 -219 283 -150 -79 261 -252 75 164 -280 216 32 -236
5454 -236 289 -112 -106 269 -229 45 187 -277 180 74 -248 260 -63 -133 256 -210 1 216 -258 141 94
5475 94 -255 221 -50 -150 264 -179 -34 228 -255 98 115 -264 200 -15 -182 261 -152 -59 253 -238 88
5496 88 159 -274 203 28 -217 294 -113 -90 278 -215 58 197 -272 185 54 -224 275 -80 -128 273 -211
5517 -211 21 206 -269 152 83 -244 243 -62 -149 252 -192 -9 205 -260 113 108 -246 214 -16 -178 248
5538 248 -147 -52 221 -237 80 140 -263 198 16 -204 257 -122 -78 251 -214 56 173 -266 172 45 -207
5559 -207 264 -92 -116 269 -225 11 203 -273 156 77 -253 237 -69 -155 267 -202 -26 224 -250 119 104
5580 104 -235 221 -31 -176 251 -160 -48 231 -233 77 135 -249 190 1 -179 241 -125 -76 241 -208 42
5601 42 155 -239 167 34 -185 239 -99 -97 244 -201 6 191 -242 151 66 -230 229 -71 -150 261 -186 -23
5623 -23 195 -244 127 95 -249 236 -54 -193 262 -163 -46 221 -227 96 122 -246 208 -11 -193 262 -123
5644 -123 -78 230 -209 59 149 -238 171 45 -199 231 -81 -100 243 -178 18 174 -234 145 57 -219 224
5665 224 -60 -138 239 -187 -11 190 -246 125 94 -234 219 -32 -175 250 -155 -35 213 -258 92 123 -267
5686 -267 200 1 -190 248 -119 -55 244 -229 74 158 -248 163 34 -204 222 -94 -95 226 -202 32 185
5707 185 -250 138 61 -214 208 -71 -124 226 -177 -11 193 -228 115 86 -214 195 -50 -141 240 -155 -31
5728 -31 212 -245 82 118 -235 193 -15 -162 250 -151 -57 235 -219 78 151 -229 191 19 -198 246 -120
5749 -120 -83 247 -204 30 165 -236 159 56 -206 233 -78 -128 242 -174 -5 181 -227 109 72 -208 205
5770 205 -48 -145 220 -139 -28 195 -199 96 91 -219 188 -7 -157 236 -117 -55 217 -204 62 131 -231 177
5792 177 12 -188 239 -110 -91 229 -194 48 155 -238 152 48 -205 224 -87 -113 230 -185 7 168 -238
5813 -238 125 70 -210 205 -55 -134 222 -159 -6 181 -206 96 100 -208 176 -12 -158 214 -124 -41 189 -183
5835 -183 69 123 -213 161 20 -168 217 -100 -66 213 -180 36 146 -206 145 38 -180 216 -92 -97 222
5856 222 -178 20 167 -228 115 59 -203 209 -59 -136 219 -156 -30 173 -208 90 79 -204 186 -22 -139
5877 -139 217 -118 -31 191 -180 64 120 -184 164 11 -151 199 -94 -64 186 -165 46 135 -201 136 39 -160
5899 -160 195 -63 -85 197 -166 13 157 -214 116 47 -189 188 -56 -117 201 -150 -10 159 -196 101 87
5920 87 -187 182 -25 -127 207 -134 -33 179 -196 73 101 -181 156 7 -145 196 -96 -55 178 -175 40
5941 40 122 -187 131 35 -147 176 -90 -94 175 -144 2 131 -185 102 45 -151 158 -54 -103 196 -132 -22
5963 -22 153 -175 89 67 -173 172 -43 -134 184 -119 -28 165 -165 88 101 -181 162 -16 -140 200 -90 -60
5985 -60 171 -162 57 98 -177 129 9 -149 179 -77 -87 174 -136 19 108 -178 97 41 -153 161 -44 -98
6007 -98 167 -116 -10 135 -168 86 55 -166 140 -23 -121 164 -106 -19 136 -165 69 83 -174 146 5 -120
6029 -120 176 -88 -50 163 -164 52 99 -183 137 18 -143 168 -77 -66 162 -155 24 110 -173 104 38 -150
6051 -150 142 -56 -78 153 -130 -9 131 -153 85 62 -144 135 -23 -101 153 -105 -24 151 -148 49 93 -158
6073 -158 123 -2 -113 155 -86 -37 150 -148 39 109 -164 117 4 -129 157 -80 -58 158 -135 16 114
6094 114 -158 108 27 -138 154 -64 -93 154 -134 -7 126 -161 88 48 -146 144 -32 -94 162 -89 -26 143
6116 143 -138 67 89 -142 131 -12 -111 148 -77 -51 146 -123 46 78 -144 97 3 -129 150 -65 -76 138
6138 138 -124 31 93 -156 99 27 -146 151 -57 -74 153 -125 19 121 -158 90 45 -154 149 -34 -98 158
6160 158 -112 -2 121 -142 63 67 -147 129 -10 -106 156 -83 -33 143 -144 55 90 -155 104 0 -99 122
6182 122 -94 -63 132 -130 15 80 -124 63 39 -124 135 -35 -92 178 -104 53 99 -162 140 25 -158 164
6204 164 -32 -88 134 -118 1 125 -151 85 59 -138 140 -21 -99 160 -105 -16 125 -138 58 64 -150 117
6226 117 -12 -109 140 -73 -46 141 -133 33 73 -147 105 13 -124 140 -65 -55 123 -119 21 99 -136 86
6248 86 39 -114 136 -30 -67 137 -105 1 123 -143 88 51 -130 132 -28 -82 157 -106 -16 132 -142 65
6270 65 70 -149 125 -12 -103 155 -103 -20 137 -144 47 83 -152 114 10 -108 142 -71 -61 126 -126 16
6292 16 96 -131 93 32 -106 128 -48 -55 125 -107 17 102 -138 71 47 -112 134 -32 -74 137 -103 -13 120
6315 120 -122 66 38 -113 130 -40 -91 144 -92 -11 142 -129 47 86 -153 91 -15 -127 148 -84 -79 103
6337 103 -182 21 123 -173 86 13 -114 150 -17 -77 104 -182 -81 90 -81 85 91 -173 64 -8 -112 161
6359 161 -129 2 110 -81 46 71 -151 126 2 -70 128 -50 -9 89 -141 40 37 -161 115 -43 -130 98
6381 98 -76 -32 116 -140 39 80 -145 110 14 -115 128 -60 -34 131 -123 35 86 -136 106 24 -124 116
6403 116 -32 -61 125 -116 16 92 -128 73 45 -116 111 -18 -75 117 -86 -14 110 -130 52 47 -120 93
6425 93 -12 -80 115 -79 -17 108 -119 38 68 -117 93 17 -97 127 -80 -35 126 -111 25 91 -129 90
6447 90 20 -94 134 -54 -44 136 -109 21 90 -126 75 32 -110 114 -42 -70 136 -93 -5 104 -113 53
6469 53 57 -116 104 -22 -78 121 -76 -26 109 -96 25 54 -110 103 -11 -90 124 -60 -27 118 -106 35 88
6492 88 -114 101 26 -92 123 -41 -49 117 -101 11 84 -131 85 21 -112 121 -43 -66 129 -88 7 90 -117
6515 -117 73 36 -117 112 -24 -82 122 -79 -20 87 -109 38 59 -111 102 -8 -90 123 -56 -31 115 -98
6537 -98 33 68 -108 90 19 -90 127 -35 -45 101 -93 23 78 -121 73 25 -95 123 -38 -58 118 -96
6559 -96 1 95 -126 76 42 -120 109 -24 -67 135 -80 -14 116 -113 58 61 -116 108 -5 -87 125 -72 -27
6582 -27 106 -110 37 60 -113 90 17 -81 109 -53 -40 108 -94 25 88 -102 66 19 -86 105 -31 -58 111
6605 111 -84 6 83 -112 66 28 -102 103 -25 -60 117 -83 -1 101 -112 55 48 -105 110 -7 -64 117 -68
6628 -68 -17 109 -114 38 69 -109 88 0 -78 109 -42 -32 109 -90 24 68 -108 64 20 -82 106 -33 -34
6651 -34 113 -84 12 80 -100 56 33 -83 92 -27 -51 98 -81 -3 87 -111 50 43 -92 91 -20 -71 102
6674 102 -66 -9 95 -99 42 59 -102 89 0 -76 107 -72 -38 112 -93 36 58 -108 86 1 -83 104 -58
6697 -58 -47 106 -83 6 72 -92 65 20 -86 94 -27 -59 96 -70 -5 74 -91 54 26 -88 81 -10 -63 93
6721 93 -53 -9 84 -76 44 40 -95 96 -1 -65 106 -44 -13 98 -89 41 62 -108 78 1 -96 98 -45 -37
6745 -37 96 -95 22 64 -108 62 14 -90 89 -32 -43 98 -75 11 64 -83 65 37 -93 78 -17 -58 87
6768 87 -62 -5 80 -82 38 51 -80 69 -6 -46 93 -43 -8 96 -74 35 57 -91 71 6 -66 90 -48
6791 -48 -29 89 -93 17 70 -101 67 16 -80 82 -41 -30 95 -87 20 75 -96 59 25 -88 92 -30 -50
6814 -50 100 -67 -2 78 -84 36 41 -80 83 -10 -48 88 -50 -15 82 -75 29 43 -71 56 1 -75 76 -28
6838 -28 -34 75 -70 22 53 -88 70 3 -81 84 -32 -38 78 -71 1 49 -94 55 18 -78 89 -24 -45 92 -68
6863 -68 7 68 -83 63 35 -75 86 -18 -55 87 -54 2 70 -77 37 36 -65 65 -7 -55 80 -39 -16 72
6887 72 -69 28 51 -77 45 12 -64 67 -34 -36 74 -53 13 48 -86 49 14 -75 76 -21 -35 90 -64 1 66
6912 66 -87 60 12 -60 88 -22 -39 93 -46 8 81 -54 47 49 -77 66 -6 -41 85 -50 -3 66 -57 26
6936 26 46 -68 53 16 -48 68 -30 -16 74 -53 23 43 -55 53 15 -50 73 -21 -26 65 -57 19 53 -67 43 22
6962 22 -55 61 -15 -34 68 -51 7 64 -66 45 29 -63 76 -18 -49 68 -48 -6 53 -72 39 38 -75 59 -7
6987 -7 -55 64 -41 -21 57 -68 22 54 -60 47 12 -51 68 -23 -21 61 -53 14 50 -66 47 23 -54 58 -10 -20
7013 -20 60 -44 7 59 -59 39 36 -59 56 -8 -26 86 -48 6 69 -76 39 27 -59 61 -10 -49 63 -48 -10 66
7039 66 -63 23 38 -64 55 -2 -49 74 -46 -19 68 -63 32 45 -56 56 21 -38 69 -32 -43 47 -43 -7 50
7064 50 -72 59 22 -40 62 -5 -64 46 -43 -1 50 -46 39 9 -104 107 -8 -24 62 -57 -17 58 -31 32 32 -74
7090 -74 105 -95 12 47 -15 38 59 -27 41 98 -73 44 -31 -58 134 -18 -41 106 -49 25 47 -81 62 24 -71
7115 -71 55 -10 -42 62 -41 10 37 -68 31 13 -76 52 -20 -38 57 -41 -6 46 -47 27 31 -60 54 -11 -47 59 -45
7142 -45 -4 51 -82 25 23 -57 50 -2 -45 67 -36 -9 69 -59 21 35 -70 43 10 -49 70 -30 -26 58 -67 10
7168 10 33 -77 35 20 -54 48 -24 -28 61 -58 -2 47 -62 25 15 -46 44 -19 -36 61 -47 -7 48 -50 18 16 -61 55
7196 55 -4 -37 65 -42 -13 51 -62 21 30 -56 50 -10 -60 59 -32 -19 52 -61 10 36 -57 44 -2 -49 54 -41 -33
7223 -33 60 -60 -4 30 -63 23 -5 -53 47 -23 -49 51 -44 -7 33 -53 29 33 -39 54 -4 -32 51 -33 -2 52 -45 20 29 -60
7253 -60 46 3 -39 47 -28 -11 55 -50 24 36 -50 46 4 -51 63 -20 -25 45 -48 0 32 -53 44 9 -62 49 -23 -17 67
7282 67 -50 9 32 -48 41 14 -35 48 -7 -19 49 -38 -2 45 -43 30 16 -39 43 -20 -33 55 -31 -11 46 -49 27 27 -40 35
7312 35 -12 -38 59 -33 -19 48 -50 11 32 -60 34 -8 -42 56 -28 -30 52 -50 4 26 -57 36 2 -50 52 -26 -27 51 -26 7
7342 7 41 -49 45 12 -42 55 -12 -24 45 -39 -11 27 -43 21 13 -43 35 -1 -40 38 -26 -11 33 -46 0 23 -40 31 12 -34 46
7373 46 -21 -12 44 -43 25 31 -40 43 2 -39 44 -24 -28 46 -41 13 44 -50 33 -1 -36 41 -17 -12 46 -38 -3 30 -46 40 13 -41
7405 -41 41 -4 -23 47 -35 -8 25 -51 17 9 -42 22 2 -23 50 -23 -10 48 -38 11 26 -42 39 -4 -20 40 -16 -22 46 -40 4
7436 4 24 -36 35 6 -33 43 -24 -20 40 -34 7 34 -41 27 12 -45 39 -16 -20 47 -35 -3 34 -38 7 14 -47 39 -17 -40 36 -29
7468 -29 -8 26 -45 6 21 -32 28 5 -30 32 -18 -16 35 -33 16 16 -29 30 4 -21 35 -7 -10 31 -28 16 27 -33 32 -3 -46 41
7500 41 -12 -17 27 -19 11 33 -40 22 8 -47 41 -1 -31 30 -24 2 30 -39 9 4 -36 38 4 -25 33 -13 6 40 -33 6 23
7531 23 -34 28 13 -24 46 -11 -13 28 -36 12 22 -30 22 0 -21 25 -6 -12 44 -31 6 29 -30 25 7 -27 27 -20 -22 46 -37 -1
7563 -1 43 -34 21 10 -27 41 -15 -17 32 -30 -13 25 -38 19 18 -34 24 -2 -14 40 -2 3 39 -25 9 16 -27 27 -1 -25 30 -15 -5
7596 -5 32 -27 7 10 -29 22 1 -37 29 -15 -21 27 -22 -4 18 -37 17 6 -31 37 -2 -22 38 -29 6 30 -36 14 12 -24 29 -8
7628 -8 -34 38 -12 -4 22 -39 23 15 -43 39 -2 -33 33 -20 -11 25 -25 10 4 -27 12 -6 -30 32 -22 -15 16 -32 -1 21 -39 15 9 -26
7662 -26 35 -18 -19 39 -24 8 19 -36 14 0 -29 33 -6 -18 37 -15 -9 36 -36 17 6 -33 30 -13 -36 43 -23 -12 22 -28 16
7693 16 24 -37 28 -10 -30 33 -21 -6 25 -26 0 4 -35 24 -1 -26 31 -21 -17 28 -34 9 27 -34 32 -3 -19 30 -15 -14 31 -10
7725 -10 10 16 -39 22 9 -32 28 -20 -22 28 -38 7 24 -29 31 5 -39 24 -19 -25 45 -27 -14 30 -35 23 6 -42 35 -6 -16 36
7757 36 -23 2 19 -34 24 25 -27 28 4 -23 37 -17 -9 35 -25 7 25 -31 27 9 -21 30 -10 -7 31 -40 3 26 -48 12 -2 -29
7789 -29 27 -15 -10 32 -41 0 32 -25 15 1 -42 34 -15 -15 31 -31 5 37 -24 20 26 -29 33 -11 -16 45 -22 -2 33 -35 15 22 -34
7822 -34 28 -4 -23 32 -19 -12 32 -30 9 16 -39 24 -8 -35 37 -19 -5 33 -27 13 15 -43 25 -2 -35 32 -22 -25 41 -25 1 19
7854 19 -38 23 13 -35 42 -5 -26 44 -25 1 31 -34 19 21 -38 44 6 -18 48 -26 -8 31 -34 10 8 -29 34 -3 -29 42 -12
7885 -12 6 35 -25 14 26 -36 39 3 -38 40 -14 -6 29 -21 4 18 -31 17 32 -33 46 -12 -2 41 -25 2 31 -34 24 23 -34
7916 -34 42 -13 -20 35 -28 -4 32 -39 10 16 -41 28 2 -23 26 -35 -5 29 -39 16 16 -26 29 4 -29 40 -16 -15 41 -22 22 26 -27
7949 -27 34 18 -29 42 -22 -14 46 -28 5 33 -43 27 7 -37 34 -2 -15 35 -22 -9 34 -47 24 15 -43 32 -10 -25 38 -28 -2
7980 -2 35 -39 5 23 -48 36 -2 -24 46 -12 -13 41 -43 21 28 -32 32 7 -20 38 -16 -13 43 -27 10 22 -44 35 14 -29 40 -12
8012 -12 -12 36 -23 5 31 -30 21 -1 -35 23 -12 -21 36 -29 -3 35 -35 14 5 -43 38 3 -26 47 -19 -9 36 -39 18 26 -45 38
8044 38 10 -31 36 -16 -1 42 -34 14 22 -45 20 10 -34 31 -22 -28 47 -28 0 34 -39 25 12 -27 37 -14 -23 34 -45 -1 40 -32
8076 -32 19 24 -46 35 -9 -30 39 -25 -3 40 -30 16 21 -42 24 9 -36 43 -17 -15 51 -41 27 30 -37 37 10 -35 40 -30 -16 35
8108 35 -43 8 20 -54 30 -1 -55 33 -21 -21 44 -42 8 40 -42 18 -2 -47 41 -6 -23 35 -28 5 30 -46 20 19 -40 39 -16
8139 -16 -21 48 -18 -6 38 -39 18 22 -43 35 -7 -32 43 -24 -18 43 -37 6 30 -44 35 -4 -43 32 -33 -19 35 -41 -5 27 -59 26
8171 26 6 -51 52 -18 -19 62 -46 6 40 -49 25 -4 -38 51 0 -31 41 -39 -12 34
8191C4
$$ Imaginary data points
##PAGE= N=2
##DATA TABLE= (X++(I..I)), XYDATA
0 0 0 0 0 0 0 0 0 0 0 0 0 0 0 -8 8 -8 8 -8 9 -16 16 -24 24 -28 32 -40 43 -49 57 -65 75 -85 96 -107 122 -138
36 -138 155 -171 190 -211 235 -261 289 -320 353 -387 427 -470 518 -570 628 -693 764 -843 933
55 933 -1038 1154 -1290 1453 -1644 1880 -2174 2553 -3059 3769 -4830 6574 -9864 18012 -72551
70 -72551 -62736 152686 -134123 22939 101277 -151798 94741 30046 -133882 143032 -51485
81 -51485 -75126 145568 -111650 -173 110450 -141934 74555 44224 -130976 123686 -28713
92 -28713 -85545 137391 -91772 -16391 111350 -127180 53836 56718 -127235 107047 -11190
103 -11190 -91129 127760 -73755 -30783 112486 -115048 36793 66831 -123370 92138 4713
114 4713 -96977 119729 -57830 -43746 113369 -103510 20683 76724 -119511 77286 19945
125 19945 -101701 110521 -41442 -56068 112731 -89843 3938 84606 -112420 60234 34462
136 34462 -103272 97713 -23767 -65797 107869 -73649 -11998 88858 -101757 42178
146 42178 46324 -100776 82836 -7124 -72176 99783 -56856 -25420 89267 -89373 25839
157 25839 54876 -95789 68453 6555 -75657 91188 -42447 -35895 88402 -78122 12316
168 12316 61294 -90700 56119 17591 -77987 83397 -30268 -44204 87056 -68258 1121
179 1121 66325 -86042 45172 27118 -79602 75825 -18914 -51419 84952 -58067 -9600
190 -9600 69968 -80149 33858 35709 -79655 66972 -7353 -57229 80894 -46878 -19843
201 -19843 71915 -72483 21814 43375 -77519 56616 4115 -61434 74877 -34931 -29234
212 -29234 71928 -63467 10132 49607 -73880 45901 14507 -64102 68073 -23702 -37130
223 -37130 70985 -54506 -416 54471 -69613 35774 23276 -65460 61129 -13727 -43207
234 -43207 69078 -46087 -9209 57769 -65110 26574 30487 -65684 54136 -4726 -47769
245 -47769 66188 -37760 -16938 59368 -59642 17826 36160 -64359 46797 3497 -50925
256 -50925 62176 -29344 -23855 59825 -53298 9045 41033 -61788 38810 11418 -53146
267 -53146 57223 -20700 -30293 59451 -46398 462 45374 -58755 30657 19036 -54996 51928
279 51928 -12068 -36366 58642 -39212 -7913 49121 -55187 22443 26043 -56055 46245 -3744
291 -3744 -41457 56953 -31888 -15504 51575 -50903 14434 31920 -55695 39910 4022 -44914
303 -44914 53708 -24289 -21839 51992 -45352 6957 35950 -53450 33089 10638 -46486 49127
315 49127 -16897 -26736 50892 -39146 78 38689 -50066 26126 16334 -46894 44005 -9974
327 -9974 -30674 49178 -33100 -6105 40958 -46835 19545 21738 -47423 39125 -3231 -34627
339 -34627 47665 -27220 -12260 43264 -43676 13012 27057 -47860 34284 3499 -38443 45992
351 45992 -21152 -18450 45139 -39886 6143 31976 -47176 28546 10084 -41036 42816 -14529
363 -14529 -23778 45258 -34699 -615 35324 -44572 21987 15760 -41675 38059 -7913 -27572
375 -27572 43493 -28613 -6616 36890 -40526 15411 20074 -40776 32735 -2060 -29994 40893
387 40893 -22885 -11492 37577 -36597 9667 23587 -39789 28055 3072 -32150 38704 -17822
399 -17822 -15928 38352 -33270 4608 26911 -39281 24104 7900 -34554 36980 -13008 -20445
411 -20445 39281 -29912 -601 30236 -38362 19657 12797 -36386 34386 -7758 -24529 39119
423 39119 -25598 -5879 32645 -36124 14375 17319 -36820 30268 -2127 -27531 37193 -20201
435 -20201 -10736 33446 -32403 8814 20725 -35713 25397 3037 -29253 34292 -14843 -14678 33301
448 33301 -28428 3851 23303 -34158 20869 7371 -30345 31533 -10285 -17873 33096 -25113
460 -25113 -292 25580 -33046 17124 11175 -31597 29358 -6291 -20918 33193 -22200 -4275
472 -4275 27832 -31941 13385 14871 -32545 26912 -2217 -23732 32730 -18791 -8286 29556
484 29556 -30046 9071 18397 -32597 23378 2239 -25862 30980 -14431 -12150 30088 -26802
496 -26802 4398 21116 -31384 19141 6461 -27046 28357 -9830 -15472 29800 -23046 -89
508 -89 23132 -29486 14874 10035 -27588 25610 -5747 -18136 29257 -19712 -3885 24728 -27847
521 -27847 11233 13107 -28068 23239 -2183 -20424 28747 -16727 -7246 26022 -26288 7900
533 7900 15824 -28307 20872 1188 -22400 27872 -13581 -10411 26867 -24209 4380 18276 -27860
546 -27860 17820 4688 -23799 26060 -9870 -13340 26855 -21241 665 20176 -26545 14219
558 14219 8090 -24589 23564 -5842 -15976 26243 -17818 -3058 21625 -24763 10436 11148 -24893
571 -24893 20912 -2137 -18125 25439 -14660 -6406 22829 -23084 6996 13908 -25035 18387
583 18387 1273 -19955 24490 -11694 -9318 23650 -21308 3866 16199 -24816 15862 4310
595 4310 -21298 23195 -8719 -11882 23905 -19045 752 17967 -23823 12912 7083 -21897 21156
608 21156 -5561 -13928 23415 -16276 -2302 19145 -22231 9651 9593 -21979 18712 -2332 -15683
621 -15683 22501 -13298 -5232 19952 -20440 6461 11877 -21846 16352 704 -17262 21626
633 21626 -10541 -7985 20742 -18780 3515 14079 -21754 14131 3582 -18738 20674 -7866
645 -7866 -10504 21285 -17014 764 15939 -21377 11837 6213 -19842 19334 -5093 -12715 21229
658 21229 -14742 -1976 17171 -20210 9109 8467 -20066 17289 -2281 -14243 20413 -12086
670 -12086 -4486 17763 -18513 6227 10385 -19707 14859 477 -15287 19118 -9415 -6674 17979
683 17979 -16732 3606 12065 -19268 12685 2979 -16296 18027 -7042 -8748 18359 -15201 1212
696 1212 13776 -19015 10710 5322 -17381 17073 -4842 -10755 18765 -13708 -1114 15368 -18655
709 -18655 8604 7603 -18216 15776 -2425 -12546 18661 -11693 -3542 16433 -17525 6055
721 6055 9565 -18226 13793 75 -13750 17773 -9246 -5806 16800 -15717 3326 11141 -17500
734 -17500 11400 2465 -14377 16328 -6755 -7654 16671 -13787 952 12331 -16639 9293 4471
747 4471 -14948 15087 -4612 -9320 16673 -12118 -1146 13460 -16050 7491 6236 -15607 14151
760 14151 -2741 -10941 16855 -10684 -3138 14620 -15545 5656 8033 -16196 12997 -664 -12402
773 -12402 16647 -8840 -5168 15341 -14482 3516 9655 -16134 11258 1603 -13416 15669 -6521
786 -6521 -7112 15394 -12717 1165 10902 -15340 9074 3746 -13867 14106 -4137 -8634 14959
799 14959 -10719 -915 11754 -14359 6992 5517 -14151 12618 -2065 -9903 14567 -9016 -2687
812 -2687 12482 -13583 5232 6991 -14440 11476 -352 -11021 14411 -7651 -4276 13266 -12983
825 -12983 3587 8477 -14664 10279 1407 -11973 13992 -6112 -5852 13722 -12033 1764 9793
838 9793 -14441 8683 3274 -12632 12988 -4175 -7384 13662 -10426 -255 10775 -13556 6661
851 6661 4998 -12820 11489 -2157 -8593 13194 -8591 -2137 11423 -12471 4653 6446 -12828
864 -12828 10012 -355 -9549 12709 -6973 -3719 11894 -11549 2998 7620 -12824 8894 1146
877 1146 -10371 12403 -5638 -5107 12345 -10788 1525 8696 -12755 7806 2561 -11063 11907
890 11907 -4279 -6388 12533 -9801 44 9594 -12386 6458 3988 -11502 10938 -2668 -7539
903 -7539 12268 -8304 -1535 10172 -11479 4776 5258 -11532 9619 -951 -8452 11734 -6681
916 -6681 -3050 10559 -10477 3071 6433 -11412 8283 648 -9151 11165 -5224 -4349 10869
929 10869 -9645 1651 7466 -11384 7214 2052 -9854 10748 -3966 -5558 11143 -8908 335
942 335 8412 -11254 6155 3310 -10382 10150 -2735 -6613 11201 -7948 -970 9130 -10809
955 -10809 4859 4516 -10596 9164 -1324 -7464 10849 -6596 -2298 9513 -9907 3326 5525
968 5525 -10428 7897 120 -8073 10265 -5148 -3546 9726 -8911 1816 6444 -10155 6674
981 6674 1449 -8560 9692 -3872 -4657 9910 -8101 552 7302 -10020 5715 2642 -9140
994 -9140 9261 -2753 -5734 10113 -7354 -625 8070 -9847 4760 3731 -9612 8718 -1614
1007 -1614 -6692 10126 -6388 -1809 8639 -9334 3547 4764 -9719 7760 -305 -7383 9679
1020 9679 -5087 -2959 8829 -8434 2183 5586 -9460 6563 1018 -7814 8959 -3696 -3983
1033 -3983 8795 -7425 863 6285 -9083 5395 2181 -8145 8286 -2541 -4879 8809 -6644
1046 -6644 -218 6962 -8895 4468 3233 -8568 7785 -1524 -5744 8918 -5955 -1236 7647
1059 7647 -8712 3564 4216 -8940 7237 -488 -6535 8921 -5101 -2283 8178 -8243 2413
1072 2413 5158 -8944 6296 691 -7040 8438 -3945 -3293 8296 -7382 1115 5886 -8583
1085 -8583 5088 1848 -7319 7659 -2670 -4180 8153 -6352 -104 6395 -8045 3965 2780
1098 2780 -7464 6967 -1634 -4931 8078 -5508 -1115 6890 -7686 3069 3595 -7702 6491
1111 6491 -770 -5621 8141 -4838 -1985 7400 -7426 2295 4383 -7945 6033 110 -6296 8111
1125 8111 -4066 -2923 7755 -6955 1304 5101 -7914 5220 1103 -6766 7664 -2984 -3826
1138 -3826 7795 -6121 170 5695 -7543 4139 2165 -7006 6878 -1756 -4613 7524 -5069
1151 -5069 -891 6062 -6988 3094 3018 -7101 6123 -709 -5226 7320 -4179 -1777 6424 -6583
1165 -6583 2224 3770 -7219 5563 160 -5760 7210 -3535 -2511 6780 -6330 1507 4486 -7398
1179 -7398 5040 994 -6283 7039 -2810 -3292 7023 -5899 655 5107 -7335 4284 1863 -6620
1193 -6620 6573 -1894 -4007 7015 -5137 -343 5600 -6909 3242 2764 -6696 5794 -829 -4591
1207 -4591 6740 -4182 -1304 5922 -6331 2206 3513 -6657 5033 117 -5082 6474 -3362
1220 -3362 -2127 6192 -5862 1351 4135 -6644 4433 861 -5505 6321 -2737 -2820 6470 -5541
1234 -5541 616 4731 -6696 3904 1581 -5932 6108 -2042 -3518 6617 -5034 -166 5218 -6531
1248 -6531 3216 2313 -6184 5675 -1176 -4157 6540 -4221 -1058 5555 -6043 2256 3054 -6158
1262 -6158 4923 -210 -4664 6201 -3294 -1917 5726 -5446 1298 3702 -6066 4162 686 -5069
1276 -5069 5850 -2481 -2656 5882 -4952 517 4253 -6031 3565 1410 -5434 5614 -1820 -3279
1290 -3279 6059 -4561 -156 4768 -6030 3026 2100 -5776 5328 -1141 -3838 6127 -4063 -844
1304 -844 5176 -5816 2365 2779 -5910 4845 -353 -4330 5966 -3323 -1629 5391 -5334 1468
1318 1468 3386 -5797 4096 476 -4673 5560 -2505 -2344 5486 -4740 589 3903 -5596 3340 1247
1333 1247 -4959 5157 -1746 -2964 5542 -4200 -129 4351 -5466 2765 1878 -5244 4923 -1128 -3532
1348 -3532 5689 -3792 -787 4786 -5403 2237 2454 -5489 4673 -513 -4038 5745 -3300 -1441 5120
1363 5120 -5164 1586 3044 -5582 4181 234 -4477 5505 -2580 -2159 5229 -4625 790 3551 -5404
1378 -5404 3452 999 -4739 5043 -1737 -2762 5199 -3967 13 3971 -5140 2728 1705 -4931 4593
1393 4593 -979 -3256 5144 -3426 -617 4294 -4996 2173 2271 -5145 4314 -383 -3733 5207 -3024
1408 -3024 -1185 4636 -4896 1676 2787 -5326 4013 161 -4134 5184 -2620 -1757 4916 -4692 1068
1423 1068 3345 -5366 3496 841 -4471 4892 -1962 -2343 4994 -4178 325 3793 -5145 2769 1533
1438 1533 -4623 4408 -1184 -2872 4930 -3503 -422 4139 -4793 1994 2140 -4679 3916 -485 -3277
1453 -3277 4822 -2949 -1060 4391 -4544 1407 2630 -4770 3592 68 -3682 4833 -2534 -1616 4662
1468 4662 -4367 904 3082 -4869 3275 563 -4042 4780 -2104 -2172 4876 -4070 329 3526 -4830
1483 -4830 2804 1160 -4342 4494 -1448 -2715 4901 -3490 -343 3870 -4575 2126 1786 -4464 4012
1498 4012 -675 -3209 4743 -2783 -1056 4080 -4165 1395 2308 -4465 3472 23 -3552 4536 -2198
1513 -2198 -1632 4220 -3874 815 2758 -4491 3101 580 -3887 4408 -1771 -2094 4381 -3665 392
1528 392 3144 -4556 2778 1062 -4178 4273 -1336 -2527 4517 -3367 -102 3534 -4485 2306 1608
1543 1608 -4371 3938 -733 -2941 4475 -2833 -691 3794 -4220 1630 2153 -4403 3414 -33 -3312
1558 -3312 4248 -2183 -1330 3941 -3786 915 2612 -4289 2876 588 -3560 4009 -1641 -1850 4047
1573 4047 -3462 340 3025 -4220 2426 1094 -3774 3807 -1218 -2237 4160 -3197 -76 3339 -4189
1588 -4189 2103 1501 -3987 3661 -814 -2633 4258 -2855 -545 3622 -4056 1635 1919 -4097 3351
1603 3351 -288 -2976 4175 -2352 -1101 3780 -3750 1016 2362 -4051 2847 346 -3259 3890 -1729
1618 -1729 -1659 3822 -3285 379 2720 -3899 2321 911 -3461 3593 -1169 -2107 3854 -2884 -133 3041
1634 3041 -3784 1892 1351 -3640 3374 -730 -2452 3903 -2607 -517 3323 -3736 1563 1726 -3817
1649 -3817 3174 -316 -2788 3913 -2270 -945 3507 -3580 1106 2113 -3861 2839 176 -3048 3764
1664 3764 -1797 -1424 3634 -3254 525 2516 -3743 2315 764 -3215 3427 -1189 -1889 3610 -2757
1679 -2757 -48 2830 -3523 1757 1270 -3341 3098 -641 -2269 3573 -2337 -558 3061 -3350 1309
1694 1309 1641 -3450 2843 -253 -2567 3579 -2036 -947 3269 -3250 958 1968 -3542 2626 126
1709 126 -2845 3547 -1712 -1343 3400 -3050 541 2284 -3531 2308 563 -3042 3385 -1242 -1758 3462
1725 3462 -2672 9 2600 -3352 1792 1087 -3167 3013 -671 -2147 3362 -2168 -494 2799 -3099
1740 -3099 1272 1516 -3236 2626 -132 -2454 3227 -1714 -931 2929 -2885 849 1825 -3279 2357 255
1756 255 -2680 3160 -1410 -1251 3057 -2771 524 2117 -3335 2121 611 -2880 3068 -1115 -1574 3143
1772 3143 -2587 172 2401 -3284 1804 1002 -3023 2848 -695 -1898 3140 -2208 -286 2642 -3065
1787 -3065 1292 1434 -3043 2441 -183 -2178 2997 -1728 -772 2782 -2776 746 1791 -3000 2030
1802 2030 272 -2383 2834 -1307 -1142 2853 -2515 335 2054 -2947 1756 601 -2517 2749 -1031
1817 -1031 -1438 2952 -2343 27 2273 -2915 1527 877 -2638 2645 -789 -1685 3010 -2143 -269 2468
1833 2468 -2819 1257 1182 -2752 2442 -410 -1969 2946 -1778 -673 2591 -2588 806 1497 -2742 2067
1849 2067 39 -2198 2779 -1311 -1077 2639 -2274 332 1761 -2641 1685 485 -2346 2568 -880
1864 -880 -1403 2647 -1964 -22 1960 -2561 1428 782 -2455 2431 -583 -1635 2664 -1792 -278 2121
1880 2121 -2526 1205 1018 -2558 2295 -346 -1817 2664 -1608 -509 2269 -2459 937 1279 -2624
1895 -2624 2057 -4 -2032 2539 -1276 -848 2353 -2226 532 1566 -2558 1683 404 -2180 2339
1910 2339 -849 -1178 2374 -1904 108 1812 -2422 1290 797 -2239 2102 -482 -1431 2346 -1632 -231
1926 -231 1977 -2316 999 1040 -2309 1931 -223 -1615 2343 -1451 -475 2088 -2244 786 1226 -2358
1942 -2358 1807 -30 -1776 2333 -1282 -702 2208 -2125 530 1433 -2356 1599 256 -1905 2237
1957 2237 -961 -987 2244 -1873 181 1645 -2258 1278 612 -2018 2031 -566 -1269 2214 -1539 -217
1973 -217 1805 -2087 897 916 -2062 1763 -224 -1495 2140 -1266 -503 1900 -1969 635 1132 -2108
1989 -2108 1590 37 -1651 2093 -1088 -701 1980 -1879 466 1288 -2149 1489 233 -1764 2078
2004 2078 -903 -882 2054 -1767 251 1463 -2111 1283 464 -1850 1935 -632 -1105 2066 -1537 -60
2020 -60 1622 -2007 960 757 -1909 1694 -285 -1303 1983 -1225 -403 1742 -1818 603 1019 -1905
2036 -1905 1442 20 -1480 1895 -972 -652 1819 -1678 338 1208 -1895 1259 240 -1588 1835
2051 1835 -793 -838 1874 -1576 176 1340 -1900 1168 401 -1681 1807 -644 -1012 1925 -1456 -20
2067 -20 1469 -1858 979 586 -1753 1691 -394 -1188 1902 -1232 -291 1586 -1740 677 834 -1791
2083 -1791 1449 -68 -1379 1803 -921 -597 1637 -1537 353 1053 -1752 1219 238 -1516 1679 -643
2099 -643 -826 1663 -1367 125 1213 -1718 1032 445 -1594 1609 -461 -967 1704 -1270 -13 1332
2115 1332 -1729 911 604 -1679 1544 -311 -1092 1723 -1152 -191 1431 -1714 733 777 -1736 1401
2131 1401 -111 -1238 1690 -970 -426 1529 -1589 457 1001 -1717 1163 203 -1366 1560 -678 -676
2147 -676 1567 -1388 159 1204 -1657 923 478 -1471 1442 -416 -892 1607 -1194 -86 1339 -1586
2163 -1586 712 656 -1520 1329 -265 -1011 1624 -1092 -258 1426 -1568 571 774 -1566 1263 -141
2179 -141 -1143 1635 -980 -421 1512 -1500 404 899 -1597 1155 55 -1260 1617 -777 -638 1581
2195 1581 -1353 148 1100 -1565 948 326 -1366 1482 -491 -873 1589 -1118 -119 1257 -1457 708
2211 708 569 -1451 1326 -230 -1077 1575 -922 -338 1336 -1376 510 716 -1505 1217 -62 -1188
2227 -1188 1550 -811 -491 1391 -1362 388 839 -1551 1148 78 -1268 1533 -694 -601 1449 -1297
2243 -1297 255 964 -1545 1034 262 -1361 1457 -510 -777 1471 -1160 27 1120 -1489 796 509
2259 509 -1432 1297 -251 -963 1453 -936 -231 1248 -1399 523 722 -1475 1114 2 -1103 1405
2275 1405 -744 -444 1320 -1296 326 876 -1483 991 175 -1190 1383 -616 -559 1389 -1247 193
2291 193 978 -1468 919 285 -1239 1348 -510 -676 1429 -1157 62 1082 -1441 790 442 -1319
2307 -1319 1280 -351 -848 1420 -1002 -153 1186 -1364 561 620 -1367 1124 -103 -1021 1394 -774
2323 -774 -386 1281 -1222 298 816 -1362 936 149 -1133 1322 -556 -570 1320 -1116 124 938 -1352
2340 -1352 806 314 -1187 1268 -426 -704 1344 -1032 11 1021 -1339 728 425 -1244 1215 -323
2356 -323 -797 1343 -965 -114 1105 -1316 589 546 -1318 1115 -145 -931 1334 -800 -303 1196 -1214
2373 -1214 380 722 -1313 942 75 -1049 1260 -567 -514 1252 -1071 126 907 -1291 736 314
2389 314 -1131 1182 -359 -701 1269 -951 -70 1009 -1241 597 463 -1191 1109 -243 -804 1282
2405 1282 -865 -197 1086 -1204 488 549 -1226 1037 -149 -898 1281 -779 -324 1159 -1165 367
2421 367 659 -1246 940 21 -996 1252 -601 -472 1203 -1050 171 805 -1235 784 237 -1089
2437 -1089 1157 -375 -669 1215 -887 -55 940 -1157 580 444 -1150 1045 -159 -828 1200 -735
2453 -735 -225 1018 -1120 435 577 -1202 948 -27 -925 1166 -634 -342 1054 -1077 330 661 -1216
2470 -1216 880 67 -981 1149 -523 -432 1102 -1018 217 765 -1207 774 223 -1025 1089 -387
2486 -387 -562 1116 -907 29 870 -1184 576 424 -1091 973 -168 -725 1111 -748 -186 986 -1102
2503 -1102 376 608 -1124 827 26 -862 1070 -593 -362 1070 -998 206 733 -1112 719 154
2519 154 -913 1041 -480 -451 1114 -928 99 791 -1092 647 241 -939 1026 -382 -532 1109
2535 1109 -861 -16 861 -1063 518 346 -983 955 -250 -665 1109 -737 -188 936 -1003 370
2551 370 505 -1026 831 -49 -823 1074 -552 -390 1003 -898 170 666 -1030 686 145 -921 1020
2568 1020 -385 -549 1042 -785 9 759 -1019 572 271 -973 964 -245 -608 1037 -712 -76
2584 -76 809 -981 504 377 -987 917 -150 -680 1027 -641 -172 848 -976 396 456 -1027 826
2601 826 -21 -774 987 -525 -323 915 -890 229 614 -1027 683 158 -878 949 -344 -490 968
2618 968 -778 37 758 -998 525 355 -947 867 -164 -620 987 -666 -132 849 -960 381 466
2635 466 -966 787 -59 -685 975 -590 -221 877 -932 302 529 -970 730 11 -741 946 -521
2652 -521 -312 905 -868 206 592 -977 651 112 -803 914 -384 -436 950 -773 54 718 -955
2669 -955 525 290 -877 859 -196 -568 973 -642 -134 831 -913 356 442 -934 748 -38 -700
2686 -700 946 -524 -279 863 -846 219 545 -946 668 70 -768 923 -431 -358 888 -792 143
2703 143 611 -931 592 146 -812 868 -357 -436 907 -744 56 675 -916 507 264 -826 836
2720 836 -218 -530 912 -632 -90 753 -876 361 404 -876 727 -54 -646 902 -512 -263 849
2737 849 -825 189 540 -911 591 92 -756 861 -369 -405 877 -740 55 640 -901 520 198
2754 198 -794 813 -274 -474 884 -659 -21 666 -848 447 269 -799 776 -200 -526 869 -592
2771 -592 -87 716 -816 360 342 -820 712 -91 -611 867 -480 -247 767 -761 213 461 -858
2788 -858 614 67 -741 824 -347 -406 813 -690 46 594 -850 498 229 -811 782 -200 -512
2805 -512 832 -592 -54 666 -829 402 346 -840 715 -91 -563 817 -512 -139 703 -802 323
2822 323 398 -826 652 -28 -599 792 -453 -200 719 -765 226 467 -843 572 70 -672 765 -358
2840 -358 -319 777 -697 87 571 -839 465 227 -738 721 -214 -450 817 -595 -56 688 -812 332
2858 332 370 -776 647 -66 -551 827 -515 -188 745 -760 227 445 -792 589 1 -617 793 -436
2876 -436 -273 768 -710 146 486 -785 534 61 -634 766 -369 -337 776 -652 64 533 -764
2893 -764 452 159 -677 729 -266 -432 796 -566 -54 621 -744 352 276 -733 689 -98 -549 806
2911 806 -451 -207 696 -702 217 407 -778 607 29 -646 785 -362 -318 735 -653 117 483 -786
2929 -786 507 126 -682 735 -280 -382 723 -596 61 523 -760 447 181 -702 684 -198 -419
2946 -419 722 -528 -15 567 -733 358 271 -720 632 -94 -489 729 -451 -124 631 -702 253 383
2964 383 -750 552 46 -590 715 -343 -269 696 -653 122 508 -760 456 165 -664 681 -258 -381
2982 -381 730 -581 3 569 -751 371 245 -688 631 -158 -426 728 -504 -64 598 -710 312
2999 312 289 -683 593 -98 -480 718 -456 -124 619 -661 230 363 -673 538 -9 -526 699 -368
3017 -368 -243 658 -617 125 453 -696 448 117 -604 660 -259 -364 697 -552 7 553 -718 353
3035 353 235 -672 620 -140 -456 728 -478 -95 616 -680 283 329 -691 576 -50 -506 709 -404
3053 -404 -155 626 -654 217 368 -701 521 5 -527 665 -347 -228 636 -606 141 423 -682 457
3071 457 89 -579 644 -275 -317 659 -545 25 486 -673 355 202 -632 607 -160 -424 704 -475
3089 -475 -90 592 -664 260 327 -687 552 -45 -504 705 -383 -193 646 -623 170 387 -695 500
3107 500 28 -555 673 -319 -265 635 -584 94 416 -674 434 80 -569 633 -265 -315 649 -533 39
3126 39 453 -645 378 162 -606 604 -183 -394 654 -464 -52 515 -630 290 262 -648 550 -55
3144 -55 -481 668 -367 -169 604 -604 195 367 -683 494 66 -557 647 -284 -268 616 -556 85
3162 85 427 -679 421 136 -588 607 -226 -326 613 -505 35 471 -653 357 183 -590 549 -162
3180 -162 -362 603 -456 -13 507 -620 290 254 -599 507 -79 -408 606 -378 -121 560 -593 198 349
3199 349 -622 457 39 -479 610 -298 -228 615 -561 66 435 -639 364 139 -562 573 -222 -337
3217 -337 626 -510 -10 495 -621 298 206 -562 534 -148 -370 629 -435 -71 534 -573 246 261 -552
3236 -552 493 -79 -394 624 -358 -138 534 -542 180 299 -565 451 -6 -447 601 -295 -219 565 -489
3255 -489 86 359 -584 390 89 -530 572 -202 -329 587 -455 -20 452 -593 294 199 -580 535 -102
3274 -102 -398 603 -386 -86 507 -553 253 274 -587 499 -20 -427 581 -317 -142 515 -515 184 296
3293 296 -579 434 20 -461 547 -274 -187 509 -483 111 341 -574 373 85 -485 517 -186 -262 520 -438
3313 -438 26 412 -575 295 183 -528 488 -102 -358 559 -380 -67 492 -540 228 299 -560 449 -15
3332 -15 -415 565 -300 -152 541 -515 143 351 -563 394 67 -439 536 -262 -211 528 -473 71 355 -555
3352 -555 328 83 -464 496 -195 -251 518 -432 12 393 -525 279 164 -484 459 -119 -323 532 -358 -61
3372 -61 451 -509 213 253 -517 432 -26 -393 543 -288 -165 500 -474 124 335 -530 384 69 -452 526 -220
3393 -220 -249 528 -436 38 380 -546 309 127 -489 483 -146 -285 513 -395 -16 392 -503 253 175 -476 451
3414 451 -94 -315 509 -334 -61 427 -469 190 243 -473 392 -20 -354 499 -284 -130 476 -455 116 318
3434 318 -505 339 64 -428 490 -215 -239 509 -411 12 385 -520 272 152 -478 472 -123 -319 530 -359
3454 -359 -64 433 -506 215 219 -493 421 -51 -361 511 -294 -109 450 -450 166 250 -470 380 2 -372 499
3475 499 -236 -154 443 -407 104 298 -479 328 52 -404 473 -179 -222 467 -381 23 344 -496 274 137 -460
3496 -460 450 -106 -317 496 -349 -60 412 -502 208 236 -523 411 -27 -386 496 -285 -124 458 -467 138
3516 138 300 -517 363 44 -396 479 -227 -168 463 -425 96 334 -496 318 90 -410 450 -176 -224 459 -402
3537 -402 24 352 -483 249 147 -438 420 -119 -272 497 -353 -48 417 -471 192 218 -469 402 -38 -336
3557 -336 507 -278 -138 474 -456 126 303 -484 365 46 -403 509 -229 -199 508 -421 63 351 -491 303
3577 303 86 -426 476 -182 -258 493 -376 -12 371 -469 238 132 -443 431 -123 -291 483 -328 -48 375
3597 375 -457 199 178 -447 391 -54 -351 492 -279 -118 432 -421 145 262 -471 364 36 -385 496 -205
3617 -205 -189 475 -406 65 326 -512 327 110 -450 479 -144 -277 492 -373 -12 376 -488 265 165 -478
3637 -478 423 -88 -310 472 -323 -55 391 -463 201 210 -476 378 -45 -317 463 -276 -93 416 -424 163 267
3658 267 -465 352 39 -360 453 -211 -157 446 -405 92 325 -486 302 100 -420 450 -159 -245 493 -386 4
3679 4 377 -496 241 177 -469 426 -100 -302 489 -338 -69 425 -479 186 234 -475 386 -33 -349 486 -285
3700 -285 -113 450 -430 139 282 -449 348 32 -355 469 -229 -162 448 -389 86 301 -465 292 78 -402
3720 -402 438 -176 -230 462 -372 11 353 -470 247 137 -443 430 -111 -305 492 -333 -67 404 -477 191
3740 191 223 -483 398 -23 -362 504 -281 -131 453 -440 144 287 -483 367 33 -390 482 -225 -167 463 -405
3761 -405 91 312 -469 300 70 -407 450 -180 -211 450 -380 15 339 -459 255 121 -426 412 -118 -282
3781 -282 459 -342 -51 387 -457 202 210 -449 400 -49 -341 500 -303 -108 451 -432 150 280 -488 367 24
3802 24 -393 491 -233 -177 477 -421 83 322 -477 313 83 -428 462 -166 -233 465 -375 19 344 -474 266
3823 266 131 -437 433 -119 -276 462 -340 -54 355 -450 202 163 -443 387 -56 -323 465 -280 -105 413
3843 413 -439 159 252 -463 366 23 -382 468 -221 -180 459 -423 93 331 -488 322 97 -428 465 -168 -231
3864 -231 478 -387 12 367 -507 260 161 -469 436 -100 -282 470 -349 -45 381 -478 206 210 -443 382 -49
3885 -49 -319 467 -292 -88 412 -448 165 258 -454 363 21 -347 453 -245 -142 463 -413 93 318 -478 320
3906 320 85 -403 461 -193 -232 497 -397 8 380 -496 244 149 -456 442 -116 -304 520 -365 -57 420 -491
3927 -491 198 203 -478 415 -59 -345 496 -308 -117 429 -443 152 253 -467 371 -5 -374 481 -250 -159 449
3948 449 -409 100 293 -467 325 54 -409 474 -189 -220 478 -385 33 346 -492 273 119 -461 454 -130
3968 -130 -311 500 -344 -45 402 -506 225 206 -498 440 -50 -369 513 -307 -111 435 -478 175 259 -508 395
3989 395 6 -392 497 -249 -164 448 -437 120 291 -498 335 63 -410 459 -195 -213 449 -410 52 332 -494
4010 -494 278 107 -445 421 -148 -263 481 -362 -18 375 -500 225 192 -470 406 -70 -321 497 -314 -96
4030 -96 439 -472 174 274 -497 394 9 -370 501 -262 -153 484 -440 103 326 -494 334 69 -403 473
4050 473 -210 -218 474 -410 34 343 -489 288 104 -439 434 -160 -256 460 -355 -19 373 -472 221 152 -451
4071 -451 404 -79 -315 471 -308 -91 416 -453 164 236 -463 386 -16 -353 499 -244 -161 467 -430 105 301
4092 301 -501 351 75 -415 474 -196 -217 486 -393 43 347 -501 277 128 -446 443 -150 -264 476 -351
4112 -351 -23 383 -472 223 169 -438 406 -69 -299 462 -305 -76 410 -434 169 221 -440 373 -13 -334 463
4133 463 -249 -130 434 -405 112 298 -463 327 54 -386 463 -199 -206 467 -398 19 341 -485 270 111 -434
4154 -434 441 -141 -269 487 -356 -28 390 -463 223 177 -450 405 -63 -309 480 -287 -90 404 -434 166
4174 166 231 -437 374 -20 -333 473 -229 -132 424 -397 106 267 -431 314 46 -364 435 -189 -186 427 -371
4195 -371 54 305 -462 275 113 -418 420 -141 -265 447 -337 -25 373 -457 222 188 -444 398 -62 -314
4215 -314 462 -282 -75 407 -436 165 243 -450 366 5 -346 455 -241 -133 423 -401 98 272 -444 308
4235 308 46 -358 414 -188 -179 412 -359 51 311 -434 246 104 -387 383 -138 -225 428 -333 -14 350 -433
4256 -433 182 168 -415 358 -68 -291 451 -288 -91 407 -424 130 233 -434 344 -3 -336 453 -236 -156 442
4277 442 -388 77 290 -444 298 50 -373 433 -181 -202 430 -359 19 303 -423 234 96 -391 384 -126
4297 -126 -237 419 -298 -39 332 -402 190 159 -406 368 -61 -290 424 -256 -89 365 -390 146 213 -430 344
4318 344 13 -342 441 -200 -152 409 -371 88 272 -448 300 65 -384 430 -171 -215 422 -355 11 309 -447
4339 -447 242 109 -418 380 -116 -263 419 -321 -39 332 -432 190 170 -403 348 -45 -276 409 -244 -71
4359 -71 359 -390 131 214 -405 313 14 -305 414 -206 -125 395 -377 91 276 -421 282 56 -359 404 -162
4380 -162 -201 425 -349 16 318 -440 245 122 -403 383 -113 -252 427 -328 -52 353 -435 183 172 -411 352
4401 352 -59 -284 439 -264 -84 370 -394 140 214 -410 322 0 -309 401 -204 -124 382 -355 82 254 -393
4422 -393 280 41 -338 387 -159 -177 391 -324 32 289 -408 235 93 -388 379 -120 -238 416 -315 -24
4442 -24 343 -416 188 156 -398 371 -55 -286 434 -268 -88 379 -395 145 224 -416 329 4 -307 427 -200
4463 -200 -121 379 -362 102 262 -403 280 39 -335 386 -182 -171 386 -322 37 272 -402 228 92 -355 354
4484 354 -132 -222 384 -307 -17 304 -399 183 137 -381 338 -69 -261 418 -261 -65 361 -378 147 202 -403
4505 -403 328 -7 -308 430 -226 -118 383 -367 111 242 -412 302 30 -340 399 -174 -166 386 -326 41 270
4526 270 -395 231 80 -355 360 -132 -213 372 -298 -10 283 -386 192 113 -364 335 -77 -237 391 -250 -53
4547 -53 329 -369 157 181 -388 324 -8 -294 404 -212 -97 366 -367 110 245 -412 294 43 -326 392 -175
4568 -175 -159 389 -338 61 273 -419 246 97 -357 360 -146 -201 387 -312 5 297 -398 193 125 -370 328
4589 328 -86 -227 380 -270 -39 323 -370 158 169 -364 300 -32 -255 380 -230 -85 343 -347 98 221
4609 221 -368 269 15 -302 380 -188 -142 389 -337 58 272 -401 240 60 -345 364 -166 -204 395 -322 -4
4630 -4 295 -389 192 117 -361 346 -101 -232 407 -266 -31 311 -355 160 162 -352 313 -52 -269 375 -234 -89
4652 -89 353 -319 121 202 -345 287 -7 -300 391 -195 -114 361 -360 43 227 -397 260 73 -362 440 -121
4673 -121 -209 365 -294 40 262 -366 212 108 -366 372 -71 -217 405 -257 -20 311 -370 161 161 -363 321
4694 321 -21 -255 395 -220 -65 344 -346 131 198 -372 297 2 -284 351 -194 -116 325 -328 80 209 -377
4715 -377 233 33 -303 327 -145 -171 346 -309 26 261 -372 208 107 -354 331 -107 -197 359 -287 -24 299
4736 299 -375 175 152 -366 316 -52 -240 394 -249 -60 337 -368 118 186 -377 290 2 -278 360 -200 -116
4757 -116 338 -338 68 217 -362 249 22 -304 344 -167 -163 346 -293 30 251 -367 203 80 -322 318 -111
4778 -111 -200 361 -273 -21 286 -355 174 123 -329 315 -60 -244 368 -250 -64 313 -348 137 175 -369 298
4799 298 -22 -279 372 -199 -118 350 -344 82 219 -378 263 33 -305 354 -178 -159 357 -314 40 251 -369
4820 -369 224 80 -317 332 -127 -181 351 -276 -2 271 -337 185 125 -326 308 -81 -213 359 -231 -39 297
4841 297 -334 137 155 -351 292 -35 -266 372 -214 -105 329 -346 100 214 -370 272 13 -308 357 -190
4861 -190 -152 347 -328 40 237 -371 228 61 -334 345 -140 -189 353 -291 -6 270 -346 192 109 -335 316
4882 316 -76 -202 362 -237 -38 288 -324 158 138 -350 278 -42 -238 353 -188 -76 335 -313 102 150 -383
4903 -383 258 8 -290 355 -200 -109 368 -315 29 205 -349 220 -2 -349 349 -133 -162 325 -283 23 255
4924 255 -362 196 110 -335 321 -89 -206 347 -242 -17 280 -343 158 139 -321 268 -46 -227 333 -217 -63
4945 -63 287 -326 92 161 -344 236 -14 -254 316 -186 -117 295 -313 41 195 -348 211 45 -285 314 -142
4966 -142 -150 329 -286 16 252 -354 185 94 -313 303 -98 -207 346 -256 -22 282 -345 142 132 -326 299
4987 299 -64 -231 345 -218 -72 305 -319 89 162 -327 250 -14 -263 322 -176 -116 290 -283 48 181 -325
5008 -325 208 36 -273 304 -136 -151 319 -251 21 213 -321 193 72 -288 309 -89 -181 334 -228 -22 262
5029 262 -321 158 124 -316 290 -65 -239 330 -206 -66 284 -328 121 150 -341 257 -15 -260 314 -168 -105
5050 -105 287 -284 70 170 -334 216 29 -279 292 -128 -131 291 -259 40 205 -316 188 69 -278 270 -89
5071 -89 -163 305 -219 2 242 -300 151 112 -288 268 -45 -201 306 -193 -61 266 -316 110 163 -316 233
5092 233 -17 -242 305 -179 -103 285 -295 63 181 -337 206 29 -262 298 -137 -134 304 -259 36 234 -316
5113 -316 184 72 -265 274 -80 -160 289 -208 -6 233 -282 132 112 -274 256 -49 -182 292 -200 -52 246
5134 246 -276 95 139 -291 225 -16 -220 297 -186 -104 272 -279 65 170 -314 216 30 -255 302 -127 -129
5155 -129 293 -249 41 219 -309 184 74 -282 285 -91 -153 305 -212 -12 237 -286 144 112 -268 253 -50
5176 -50 -167 286 -187 -47 246 -267 97 125 -281 223 -8 -204 273 -157 -88 260 -255 45 174 -286 192
5197 192 31 -247 277 -126 -129 285 -239 39 210 -288 176 78 -260 291 -89 -155 311 -215 -3 236 -287
5218 -287 150 109 -281 265 -52 -185 308 -185 -45 255 -271 104 126 -282 229 -10 -218 288 -156 -91 248
5239 248 -244 59 159 -276 188 24 -236 267 -115 -125 261 -220 43 190 -272 179 69 -255 267 -76
5259 -76 -152 299 -206 3 235 -283 149 107 -275 259 -42 -179 293 -184 -42 251 -282 116 133 -303 222
5280 222 -1 -220 278 -152 -80 250 -268 71 159 -297 188 26 -235 259 -132 -107 265 -234 34 193 -269
5301 -269 166 66 -235 256 -91 -123 276 -219 21 224 -272 137 98 -254 238 -55 -167 279 -202 -42 242
5322 242 -277 101 125 -279 220 -35 -204 294 -183 -78 258 -280 62 154 -302 205 7 -238 288 -149 -111
5343 -111 268 -236 45 194 -270 189 50 -231 267 -106 -136 268 -207 2 204 -251 142 80 -249 249 -61
5364 -61 -153 280 -187 -34 215 -258 103 106 -258 228 -28 -209 273 -161 -80 237 -261 79 137 -286 211 -5
5386 -5 -238 283 -141 -119 261 -256 48 193 -283 198 50 -252 275 -100 -134 276 -217 12 198 -281 160
5407 160 73 -261 237 -65 -159 258 -188 -18 216 -259 106 109 -256 208 -29 -181 253 -166 -69 231 -266 81
5429 81 139 -276 196 -1 -214 253 -136 -86 252 -257 48 184 -287 194 47 -235 269 -109 -121 283 -224
5450 -224 22 209 -275 167 82 -259 258 -84 -155 284 -210 -13 212 -275 129 98 -264 226 -44 -180 260
5471 260 -172 -55 223 -253 74 123 -256 194 -1 -193 250 -138 -73 241 -235 61 166 -253 190 28 -211
5492 -211 270 -112 -109 273 -214 43 197 -271 171 63 -249 261 -95 -143 286 -210 5 226 -276 138 90
5513 90 -271 225 -69 -173 268 -191 -44 227 -265 95 114 -261 211 -22 -185 264 -141 -66 239 -239 75
5534 75 149 -252 184 21 -196 249 -118 -92 251 -218 41 175 -250 153 52 -224 244 -88 -130 255 -193
5555 -193 16 202 -268 126 82 -256 236 -72 -181 261 -201 -43 218 -271 97 111 -259 216 -39 -194 270
5576 270 -161 -68 239 -236 69 142 -260 195 17 -194 267 -113 -91 239 -205 50 159 -251 161 40 -221
5597 -221 228 -93 -124 242 -186 -4 180 -245 130 61 -234 228 -60 -154 242 -184 -41 198 -258 99 97 -268
5619 -268 216 -28 -184 254 -161 -75 230 -250 95 132 -271 211 10 -199 263 -116 -82 233 -221 55 173
5640 173 -247 180 45 -209 227 -94 -106 236 -190 23 168 -258 125 72 -230 220 -56 -142 230 -171 -17
5661 -17 199 -242 102 100 -244 186 -32 -165 245 -156 -51 233 -246 79 134 -246 184 4 -192 259 -137
5682 -137 -64 255 -228 53 177 -256 171 47 -203 253 -98 -125 237 -201 -11 189 -241 142 55 -216 214
5703 214 -73 -135 243 -183 -24 180 -239 84 91 -230 206 -31 -160 230 -145 -51 206 -219 75 115 -229 187
5725 187 -6 -186 243 -124 -74 229 -203 59 157 -235 184 21 -214 249 -108 -106 234 -204 20 167 -247
5746 -247 142 52 -234 231 -69 -153 230 -194 -18 163 -249 109 67 -240 200 -40 -159 239 -148 -46 194
5767 194 -217 89 112 -222 183 0 -161 211 -113 -57 204 -200 58 142 -229 160 23 -183 221 -91 -94 217
5789 217 -194 32 157 -245 139 54 -206 216 -82 -126 225 -195 -5 176 -243 117 61 -225 195 -54 -151
5810 -151 235 -149 -31 191 -215 87 112 -223 163 3 -163 227 -119 -55 215 -183 52 130 -212 148 20
5831 20 -165 207 -83 -92 206 -177 23 143 -212 126 42 -187 190 -76 -112 207 -173 -4 158 -225 107 57
5853 57 -216 201 -49 -137 225 -157 -30 193 -209 87 96 -215 181 -15 -153 227 -111 -51 206 -206 72 138
5875 138 -212 168 11 -169 209 -85 -80 199 -169 31 134 -203 122 27 -166 183 -63 -100 195 -153 -13
5896 -13 152 -197 100 60 -191 173 -40 -117 215 -154 -22 175 -199 86 86 -195 170 -30 -137 224 -116 -50
5918 -50 192 -186 71 112 -199 166 15 -148 199 -97 -66 195 -181 40 132 -200 130 21 -170 178 -81
5939 -81 -90 185 -147 2 138 -197 92 39 -170 166 -47 -113 184 -125 -14 147 -183 78 71 -182 162 -9
5961 -9 -124 198 -108 -46 164 -163 65 103 -187 160 12 -150 194 -93 -63 178 -168 47 112 -195 118 27
5983 27 -176 175 -74 -79 171 -164 7 122 -191 93 44 -191 163 -53 -106 163 -132 -18 128 -177 81 72
6005 72 -163 144 -10 -119 161 -100 -22 143 -158 60 88 -169 125 8 -123 164 -80 -53 151 -166 30
6026 30 100 -191 108 12 -142 155 -82 -80 174 -162 7 113 -182 93 36 -155 157 -64 -101 178 -143 -18
6048 -18 140 -168 80 69 -141 139 -27 -101 170 -93 -20 155 -138 53 81 -143 117 -2 -108 151 -77 -48
6070 -48 154 -129 37 102 -154 102 7 -125 152 -79 -77 157 -131 -2 115 -160 100 28 -156 156 -62 -100
6092 -100 164 -119 -3 124 -160 86 54 -165 150 -21 -108 168 -97 -24 144 -147 55 82 -147 133 4
6113 4 -116 164 -78 -46 149 -131 43 95 -158 103 17 -126 149 -52 -70 127 -126 8 97 -153 88 35 -146
6136 -146 134 -47 -85 160 -118 -1 124 -159 84 57 -153 142 -27 -86 150 -105 -12 136 -156 71 89 -156
6158 -156 127 -16 -118 163 -95 -36 137 -149 35 89 -156 111 7 -118 143 -75 -56 142 -145 20 92
6179 92 -158 88 12 -148 140 -36 -59 147 -87 18 96 -116 65 36 -145 137 6 -107 123 -232 50 137
6201 137 -141 57 61 -142 128 -34 -93 138 -89 -25 142 -134 74 71 -164 115 -8 -118 156 -96 -59 132
6223 132 -145 31 74 -157 97 10 -128 133 -66 -69 141 -120 2 101 -144 71 37 -123 121 -41 -76 128
6245 128 -100 -9 112 -124 64 57 -131 124 -18 -94 146 -93 -24 120 -139 39 60 -153 118 -13 -111 141
6267 141 -96 -45 136 -147 26 85 -145 106 6 -115 136 -81 -61 138 -132 19 85 -135 97 17 -127 135
6289 135 -51 -66 147 -112 -1 98 -131 78 40 -128 129 -42 -86 133 -82 -13 107 -148 48 47 -154 109
6311 109 -19 -112 160 -109 -36 120 -136 41 79 -151 104 -29 -108 136 -71 -66 136 -124 26 83 -132 116
6333 116 42 -131 127 -90 -28 135 -121 8 69 -127 25 101 -118 164 -28 -95 89 -84 -19 30 -89 121
6355 121 127 -116 144 -53 -105 154 -128 -2 132 -112 7 52 -129 70 -11 -115 144 -61 -12 103 -152 38
6377 38 48 -113 78 13 -97 109 -53 -49 135 -126 28 109 -137 89 28 -115 133 -44 -70 136 -109 2 115
6400 115 -133 70 38 -123 115 -33 -79 134 -88 -17 95 -131 39 50 -119 98 -12 -89 118 -88 -32 107
6422 107 -105 22 72 -111 89 10 -90 126 -64 -45 130 -108 23 96 -117 92 16 -121 133 -57 -67 136
6444 136 -109 8 94 -127 72 21 -127 123 -38 -82 117 -96 -20 105 -136 53 35 -126 107 -9 -86 126
6466 126 -76 -34 99 -116 36 70 -110 91 7 -96 127 -52 -57 106 -96 13 67 -119 80 25 -92 109
6488 109 -31 -52 108 -95 10 71 -126 75 19 -131 109 -41 -78 122 -102 -11 92 -142 55 39 -135 108
6510 108 -18 -89 118 -87 -27 111 -126 49 65 -130 97 12 -87 118 -62 -32 105 -96 23 68 -110 81
6532 81 22 -103 108 -48 -51 110 -88 -1 85 -112 58 40 -98 104 -40 -60 97 -94 -7 79 -120 52 30 -116
6556 -116 94 -25 -84 111 -90 -22 93 -130 41 52 -112 103 1 -81 122 -80 -27 113 -113 39 71 -121
6578 -121 90 15 -89 111 -45 -39 113 -96 15 82 -116 76 21 -102 95 -44 -53 101 -83 -10 76 -111 48
6601 48 31 -112 85 -21 -83 105 -84 -17 80 -114 34 47 -103 92 -22 -76 120 -76 -11 111 -106 39 66
6624 66 -99 86 2 -74 129 -55 -36 111 -94 8 64 -124 57 12 -94 98 -46 -57 102 -98 -11 77 -103
6647 -103 52 34 -108 87 -32 -71 102 -74 -20 80 -100 42 41 -94 83 -15 -75 104 -66 -35 102 -93 41
6670 41 43 -100 81 4 -84 122 -50 -40 109 -88 19 66 -113 75 9 -102 104 -39 -56 94 -84 1 68 -103
6694 -103 60 13 -105 95 -35 -63 94 -69 -7 79 -89 54 48 -92 91 -5 -63 100 -47 -19 85 -85 33
6717 33 56 -86 81 12 -73 103 -33 -24 85 -76 32 64 -94 72 9 -86 97 -45 -50 94 -93 11 60 -116
6741 -116 62 20 -97 86 -43 -53 94 -100 -7 82 -113 40 43 -105 84 -23 -45 102 -61 -2 93 -68 30
6764 30 46 -84 76 -4 -56 97 -55 -24 84 -85 17 62 -86 59 4 -72 96 -48 -31 88 -83 14 58 -90
6788 -90 58 13 -79 89 -44 -46 91 -80 8 73 -89 54 36 -82 99 -30 -52 106 -66 10 87 -85 51 41
6812 41 -85 84 -2 -56 93 -49 -24 75 -76 29 45 -91 67 1 -67 82 -26 -37 80 -75 1 58 -78 62
6836 62 17 -68 84 -38 -41 79 -61 11 70 -87 57 26 -77 89 -11 -30 103 -59 1 83 -78 44 47 -68
6860 -68 94 -2 -54 90 -51 -4 67 -73 46 49 -77 72 -1 -53 81 -47 -20 77 -73 16 45 -81 53 -4 -58
6885 -58 70 -33 -26 64 -63 11 61 -72 43 23 -61 76 -16 -36 80 -63 10 70 -72 49 27 -67 71 -15 -45
6910 -45 78 -46 -10 63 -74 46 37 -77 71 -12 -56 81 -49 -18 65 -72 22 33 -74 50 -10 -53 69 -42
6934 -42 -19 65 -64 19 52 -66 40 12 -53 65 -26 -21 64 -48 11 50 -65 48 39 -50 68 -8 -40 81 -46 4
6960 4 60 -77 38 29 -69 65 -9 -44 66 -53 -17 56 -76 31 37 -71 63 -10 -47 73 -45 -19 69 -77 16 42
6986 42 -77 41 2 -64 66 -32 -25 80 -55 6 48 -58 41 20 -59 68 -16 -27 78 -48 1 51 -52 26 23 -58
7012 -58 55 -5 -44 64 -52 -25 60 -70 15 20 -74 49 -12 -59 66 -52 -26 54 -77 19 20 -81 46 -4 -55 65
7038 65 -39 -25 78 -60 7 48 -63 51 20 -47 87 -21 -34 93 -23 -1 48 -59 44 -4 -28 60 -8 -24 66
7063 66 -24 -25 32 -76 17 12 -86 45 13 -15 65 -15 -46 11 -29 44 17 -66 73 37 -37 89 -66 -26 37 -46 -12 21 -118
7092 -118 15 17 -57 24 18 23 43 -42 -33 84 -30 62 8 -43 78 -1 -50 80 -61 32 38 -90 25 45 -44 43 -31 -44
7120 -44 56 -49 -1 60 -57 17 30 -52 55 9 -33 66 -35 -10 59 -53 22 45 -45 56 9 -40 74 -42 -22 63
7146 63 -54 19 54 -65 43 7 -42 68 -30 -21 60 -53 13 36 -71 40 15 -54 55 -25 -35 58 -53 -15 37 -59
7172 -59 30 22 -49 53 -17 -51 57 -27 -3 59 -45 29 37 -45 57 6 -28 74 -23 -14 66 -42 18 23 -51 45 -3 -56 60
7201 60 -27 -28 59 -59 7 31 -60 46 11 -58 61 -24 -28 56 -55 3 44 -65 33 18 -45 58 -27 -37 65 -44 -6
7228 -6 44 -41 28 18 -45 54 6 -34 59 -27 -4 55 -54 17 34 -47 43 -7 -37 53 -22 -19 51 -50 11 30 -56 40 11 -45
7258 -45 51 -22 -24 57 -54 10 37 -61 32 13 -40 66 -22 -32 58 -40 5 58 -60 36 25 -48 53 -14 -25 58 -46 -1
7286 -1 48 -61 25 27 -45 50 -4 -34 53 -30 -18 37 -52 16 19 -65 29 -14 -49 42 -40 -23 38 -49 0 13 -57 30 7 -39 46
7317 46 -18 -13 46 -43 8 36 -41 31 21 -41 53 -13 -22 57 -35 15 48 -66 34 13 -38 48 -15 -31 55 -41 -12 50 -50 15
7347 15 20 -47 29 -9 -36 36 -38 -20 21 -60 -4 22 -44 26 -8 -29 39 -17 -7 49 -47 4 36 -41 26 12 -34 55 -18 -17 57
7378 57 -31 7 34 -45 35 14 -43 42 -18 -35 55 -45 -18 38 -47 14 19 -50 45 -10 -38 41 -26 -17 31 -45 11 26 -45 34 -9
7409 -9 -44 36 -19 -6 39 -41 8 28 -34 37 14 -15 43 -2 -2 37 -25 22 38 -42 31 13 -38 50 -14 -15 33 -31 -5 25 -43 31
7441 31 10 -45 37 -12 -36 40 -27 -7 28 -60 20 10 -41 41 -2 -34 40 -22 -16 29 -31 16 24 -31 28 5 -29 37 -14 -1 41
7472 41 -22 5 25 -26 39 18 -27 40 -13 -11 38 -29 -1 23 -31 24 2 -39 22 -22 -21 21 -32 -5 14 -46 20 15 -42 35 -9 -28
7504 -28 38 -25 10 44 -28 30 26 -29 41 0 -17 45 -28 -6 39 -34 22 24 -32 27 -4 -27 30 -22 -6 32 -38 -4 18 -38 22
7535 22 3 -36 23 -23 -22 33 -36 -2 13 -51 24 -8 -34 36 -21 -17 35 -29 -9 24 -36 22 18 -27 22 -3 -10 37 -15 5 39 -29
7567 -29 15 19 -34 36 5 -25 38 -29 -20 27 -27 8 13 -49 17 8 -29 24 -21 -15 16 -34 -3 11 -43 12 -1 -33 24 -22 -18 26 -36
7600 -36 7 23 -38 16 16 -24 38 -4 -12 46 -20 9 28 -28 22 18 -40 35 -7 -22 28 -29 -3 31 -39 18 11 -37 19 -14 -38 31
7632 31 -38 -16 24 -47 13 6 -39 28 3 -23 24 -17 -11 31 -23 17 28 -22 18 23 -21 32 -14 -11 37 -13 1 29 -25 26 12 -25
7664 -25 34 -11 -19 41 -32 2 23 -30 15 23 -29 16 -9 -29 34 -20 -10 32 -41 0 6 -34 21 -9 -28 37 -21 -12 27 -32 11 17 -30
7697 -30 32 18 -30 45 -22 -10 39 -18 2 21 -29 39 11 -30 37 -16 -9 36 -20 11 26 -24 23 7 -35 28 -6 -18 40 -40 -2
7728 -2 20 -44 9 8 -40 25 -11 -30 34 -35 -9 27 -25 23 16 -28 28 2 -25 44 -21 -2 42 -35 17 23 -23 45 11 -20 40 -20
7760 -20 -4 37 -41 5 18 -35 27 7 -23 33 -10 -3 42 -30 -9 19 -33 17 8 -30 26 -20 -26 28 -30 0 36 -39 16 14 -30 39
7792 39 -3 -25 54 -19 4 37 -25 22 31 -27 34 0 -23 43 -17 -3 29 -39 9 13 -24 26 -9 -28 33 -22 -15 22 -30 13 14 -41
7824 -41 30 7 -32 34 -8 -7 42 -21 11 23 -35 30 4 -39 42 -8 -5 46 -31 1 36 -23 34 13 -36 41 11 -23 36 -11 -1
7855 -1 31 -38 18 8 -49 30 2 -28 22 -25 -14 38 -47 6 14 -44 23 -8 -33 37 -27 -11 32 -32 -5 29 -38 16 3 -40 25
7886 25 -4 -11 36 -24 6 27 -47 23 6 -31 32 -6 -12 32 -17 9 42 -22 22 20 -45 33 -4 -36 37 -37 -6 28 -53 12 18 -51
7918 -51 21 -12 -43 31 -34 -22 33 -46 14 27 -50 32 2 -22 45 -19 -5 47 -25 13 36 -31 31 5 -36 39 -6 -11 38 -29 9
7949 9 28 -31 27 14 -29 29 -2 -25 39 -25 -8 34 -36 17 19 -41 40 -16 -29 34 -19 -17 21 -43 24 26 -42 36 -7 -30 29 -21
7981 -21 -9 42 -42 21 28 -36 34 1 -24 30 -15 -4 40 -31 -7 32 -33 15 10 -42 32 -10 -27 41 -41 -8 19 -41 7 7 -50 36
8013 36 -13 -26 31 -35 -22 32 -45 2 13 -39 22 -2 -29 44 -28 -21 35 -37 16 21 -35 41 8 -32 41 -3 -10 38 -24 4 29 -45
8045 -45 28 14 -32 53 -21 -29 38 -33 -1 25 -42 19 -1 -50 41 -10 -23 42 -30 -5 27 -40 17 18 -49 36 -6 -30 31 -15 -8 43
8077 43 -40 18 30 -40 31 10 -31 49 -16 -10 42 -28 5 18 -37 24 11 -29 44 -22 -17 26 -44 8 36 -60 22 4 -58 39 -18
8108 -18 -31 24 -41 -14 30 -57 18 12 -38 45 -2 -20 47 -31 -4 32 -40 21 11 -48 39 4 -30 44 -33 -2 45 -38 9 30 -43
8139 -43 34 7 -25 53 -20 -19 41 -42 18 38 -48 25 1 -42 52 -26 -28 31 -43 -9 41 -50 23 16 -49 36 -15 -24 39 -35 1 42
8171 42 -38 30 4 -40 51 -7 -26 45 -35 -8 40 -47 19 23 -37 47 -2 -37 42 -34
8191c4
##END NTUPLES=NMR FID
##END=
