##TITLE=1H_LY-12Dix.3.B
 CD3CN, 8 sc, 
 3.06.2021
##JCAMPDX= 6.0         $$ Bruker NMR JCAMP-DX V2.0
##DATA TYPE= NMR FID
##DATA CLASS= NTUPLES
##ORIGIN= UXNMR, Bruker Analytische Messtechnik GmbH
##OWNER= root
$$ XWIN-NMR		Version 3.5
$$ Thu Jun  3 10:55:24 2021 Russian Standard Time (UT+4h)  she@DPX200
##.OBSERVE FREQUENCY= 200.131506
##.OBSERVE NUCLEUS= ^1H
##.DELAY= (6, 6)
##.ACQUISITION MODE= SIMULTANEOUS
##.ACQUISITION SCHEME= undefined
##.AVERAGES= 8
##.DIGITISER RES= 18
##SPECTROMETER/DATA SYSTEM= spect
##.PULSE SEQUENCE= zg30
##.SOLVENT NAME= CD3CN
##.SHIFT REFERENCE= (INTERNAL, CD3CN, 0, 15.7039)
##AUDIT TRAIL= $$ (NUMBER, WHEN, WHO, WHERE, WHAT)
$$ ##TITLE= Audit trail, XWIN-NMR		Version 3.5
$$ ##JCAMPDX= 5.01
$$ ##ORIGIN= Bruker BioSpin GmbH
$$ ##OWNER= she
$$ F:/spectra/data/she/nmr/H-F/1/audita.txt
$$ ##AUDIT TRAIL=  $$ (NUMBER, WHEN, WHO, WHERE, WHAT)
(   1,<2021-06-03 10:51:51.67 +0400>,<she>,<DPX200>,
      <created by zg, POWCHK disabled, PULCHK disabled
       configuration hash MD5:
       00 E9 B6 7A A2 85 ED C7 34 08 36 98 17 FE 4E 26
       data hash MD5: 16K
       54 41 3C 99 2E 0A EA D1 26 CB 00 FB 07 FA E1 E0>)
$$ ##END=
$$ 
$$ hash MD5
$$ D6 26 DA 43 60 E2 FF F5 BD A7 A0 BC 6F F0 87 DA
##$RELAX= 
##$RELAX= 
##$RELAX= 
##$RELAX= 
##$RELAX= 
##$RELAX= 
$$ Bruker specific parameters
$$ --------------------------
##$DU= <F:/spectra>
##$EXPNO= 1
##$NAME= <H-F>
##$PROCNO= 1
##$TYPE= <nmr>
##$USER= <she>
##$AMP= (0..31)
100 100 100 100 100 100 100 100 100 100 100 100 100 100 100 100 100 100 
100 100 100 100 100 100 100 100 100 100 100 100 100 100 
##$AQSEQ= 0
##$AQ_mod= 1
##$AUNM= <au_zg>
##$AUTOPOS= <>
##$BF1= 200.13
##$BF2= 200.13
##$BF3= 200.13
##$BF4= 200.13
##$BF5= 200.13
##$BF6= 200.13
##$BF7= 200.13
##$BF8= 200.13
##$BYTORDA= 1
##$CFDGTYP= 0
##$CFRGTYP= 5
##$CHEMSTR= <none>
##$CNST= (0..31)
1 1 145 1 1 1 1 1 1 1 1 1 1 1 1 1 1 1 1 1 1 1 1 1 1 1 1 1 1 1 1 1 
##$CPDPRG= <>
##$CPDPRG1= <>
##$CPDPRG2= <>
##$CPDPRG3= <>
##$CPDPRG4= <mlev>
##$CPDPRG5= <mlev>
##$CPDPRG6= <mlev>
##$CPDPRG7= <mlev>
##$CPDPRG8= <mlev>
##$CPDPRGB= <>
##$CPDPRGT= <>
##$D= (0..31)
0 1.2 0 0 0 0 0 0 0 0.06 0 0.03 0 0 0 0 0.0002 0 0 0 0 0 0 0 0 0 0 0 0 
0 0 0 
##$DATE= 1622703111
##$DBL= (0..7)
120 120 120 120 120 120 120 120 
##$DBP= (0..7)
150 150 150 150 150 150 150 150 
##$DBP07= 0
##$DBPNAM0= <>
##$DBPNAM1= <>
##$DBPNAM2= <>
##$DBPNAM3= <>
##$DBPNAM4= <>
##$DBPNAM5= <>
##$DBPNAM6= <>
##$DBPNAM7= <>
##$DBPOAL= (0..7)
0.5 0.5 0.5 0.5 0.5 0.5 0.5 0.5 
##$DBPOFFS= (0..7)
0 0 0 0 0 0 0 0 
##$DE= 6
##$DECBNUC= <off>
##$DECIM= 32
##$DECNUC= <off>
##$DECSTAT= 4
##$DIGMOD= 1
##$DIGTYP= 9
##$DL= (0..7)
0 120 120 120 120 120 120 120 
##$DP= (0..7)
150 150 150 150 150 150 150 150 
##$DP07= 0
##$DPNAME0= <>
##$DPNAME1= <>
##$DPNAME2= <>
##$DPNAME3= <>
##$DPNAME4= <>
##$DPNAME5= <>
##$DPNAME6= <>
##$DPNAME7= <>
##$DPOAL= (0..7)
0.5 0.5 0.5 0.5 0.5 0.5 0.5 0.5 
##$DPOFFS= (0..7)
0 0 0 0 0 0 0 0 
##$DQDMODE= 0
##$DR= 18
##$DS= 0
##$DSLIST= <SSSSSSSSSSSSSSS>
$$ [...]
##$SUBNAM2= <"">
##$SUBNAM3= <"">
##$SUBNAM4= <"">
##$SUBNAM5= <"">
##$SUBNAM6= <"">
##$SUBNAM7= <"">
##$SUBNAM8= <"">
##$SUBNAM9= <"">
##$SW= 20.0188882624521
##$SWIBOX= (0..15)
0 0 2 0 0 0 0 0 0 0 0 0 0 0 0 0 
##$SW_h= 4006.41025641026
##$TD= 16384
##$TD0= 1
##$TE= 0
##$TE2= 300
##$TE3= 300
##$TEG= 300
##$TL= (0..7)
0 120 120 120 120 120 120 120 
##$TP= (0..7)
150 150 150 150 150 150 150 150 
##$TP07= 0
##$TPNAME0= <>
##$TPNAME1= <>
##$TPNAME2= <>
##$TPNAME3= <>
##$TPNAME4= <>
##$TPNAME5= <>
##$TPNAME6= <>
##$TPNAME7= <>
##$TPOAL= (0..7)
0.5 0.5 0.5 0.5 0.5 0.5 0.5 0.5 
##$TPOFFS= (0..7)
0 0 0 0 0 0 0 0 
##$TUNHIN= 0
##$TUNHOUT= 0
##$TUNXOUT= 0
##$USERA1= <user>
##$USERA2= <user>
##$USERA3= <user>
##$USERA4= <user>
##$USERA5= <user>
##$V9= 5
##$VALIST= <valist>
##$VCLIST= <CCCCCCCCCCCCCCC>
##$VD= 0
##$VDLIST= <DDDDDDDDDDDDDDD>
##$VPLIST= <PPPPPPPPPPPPPPP>
##$VTLIST= <TTTTTTTTTTTTTTT>
##$WBST= 1024
##$WBSW= 4
##$XGAIN= (0..3)
0 0 0 0 
##$XL= 0
##$YL= 0
##$YMAX_a= 163916
##$YMIN_a= -168790
##$ZGOPTNS= <>
##$ZL1= 120
##$ZL2= 120
##$ZL3= 120
##$ZL4= 120
##$ABSF1= 10
##$ABSF2= 0
##$ABSG= 5
##$ABSL= 3
##$ALPHA= 0
##$AQORDER= 0
##$ASSFAC= 0
##$ASSFACI= 0
##$ASSFACX= 0
##$ASSWID= 0
##$AUNMP= <proc_1d>
##$AZFE= 0.1
##$AZFW= 0.1
##$BCFW= 1
##$BC_mod= 2
##$BYTORDP= 1
##$COROFFS= 0
##$CY= 11.3945322036743
##$DATMOD= 1
##$DC= 2
##$DFILT= <>
##$DTYPP= 0
##$F1P= 15.9154993809931
##$F2P= -4.1035820241983
##$FCOR= 0.5
##$FTSIZE= 0
##$FT_mod= 4
##$GAMMA= 1
##$GB= 0.15
##$INTBC= 1
##$INTSCL= 1
##$ISEN= 128
##$LB= 0.24
##$LEV0= 0
##$LPBIN= 0
##$MAXI= 10000
##$MC2= 0
##$MEAN= 0
##$ME_mod= 0
##$MI= 1.114404
##$NCOEF= 0
##$NC_proc= 0
##$NLEV= 6
##$NOISF1= 3.799351
##$NOISF2= 2.8
##$NSP= 1
##$NTH_PI= 0
##$NZP= 0
##$OFFSET= 15.70392
##$PC= 1
##$PHC0= -11562.38
##$PHC1= 13.40099
##$PH_mod= 1
##$PKNL= yes
##$PPARMOD= 0
##$PSCAL= 0
##$PSIGN= 0
##$REVERSE= no
##$SF= 200.130013532006
##$SI= 16384
##$SIGF1= 3
##$SIGF2= 2
##$SINO= 400
##$SIOLD= 16384
##$SREGLST= <1H.CDCl3>
##$SSB= 0
##$STSI= 0
##$STSR= 0
##$SW_p= 3612.71676300578
##$SYMM= 0
##$S_DEV= 0
##$TDeff= 0
##$TDoff= 0
##$TI= <>
##$TILT= no
##$TM1= 0
##$TM2= 0
##$TOPLEV= 0
##$USERP1= <user>
##$USERP2= <user>
##$USERP3= <user>
##$USERP4= <user>
##$USERP5= <user>
##$WDW= 1
##$XDIM= 8192
##$YMAX_p= 0
##$YMIN_p= 0
$$ End of Bruker specific parameters
$$ ---------------------------------
##NTUPLES= NMR FID
##VAR_NAME=  TIME,          FID/REAL,        FID/IMAG
##SYMBOL=    X,             R,               I
##VAR_TYPE=  INDEPENDENT,   DEPENDENT,       DEPENDENT
##VAR_FORM=  AFFN,          ASDF,            ASDF
##VAR_DIM=   8192,          8192,            8192
##UNITS=     SECONDS,       ARBITRARY UNITS, ARBITRARY UNITS
##FACTOR=    0.0002496,     1,               1
##FIRST=     0,             0,               0
##LAST=      2.0444736,     0,               0
##MIN=       0,             -168790,         0
##MAX=       2.0444736,     163916,          0
$$ Real data points
##PAGE= N=1
##DATA TABLE= (X++(R..R)), XYDATA
$$ [...]
2134a207J418N87k243K644j197j349L024k322j31K250k613J286O70k267K544r89
$$ -1207 211 798 -1445 1199 2 -1347 1677 -645 -776 1474 -1139 147 817 -1450 1094 105
2150A05j467K939k110l48K293k465J131P72k232K446r24j509K937k087l25K260
$$ 105 -1362 1577 -533 -881 1412 -1053 78 850 -1382 1064 140 -1369 1568 -519 -844 1416
2166A416k470J217O92k243K497r87j483K908k087k17K146k462J344N26k229K585
$$ 1416 -1054 163 855 -1388 1109 122 -1361 1547 -540 -757 1389 -1073 271 797 -1432 1153
2182A153j088j432K907k082j66K069k442J341N08k223K546r67j492K854j944k71
$$ 1153 65 -1367 1540 -542 -708 1361 -1081 260 768 -1455 1091 124 -1368 1486 -458 -729
2198g29K038k360J222O19k224K448p70j606K799j777m71K091k247J050P78k233
$$ -729 1309 -1051 171 790 -1434 1014 244 -1362 1437 -340 -811 1280 -967 83 861 -1372
2214a372K327o27j668K694j692m62K057k240J121P60k268K336o32j686K665j667
$$ -1372 955 328 -1340 1354 -338 -800 1257 -983 138 898 -1370 966 334 -1352 1313 -354
2230c54l99J964k211J228O23k258K407p54j593K667j724k90J939k269J259N90
$$ -354 -753 1211 -1000 228 851 -1407 1000 246 -1347 1320 -404 -694 1245 -1024 235 825
2246H25k247K358o86j574K610j649l03J892k221J172O82k278K286n12j654K540
$$ 825 -1422 936 250 -1324 1286 -363 -666 1226 -995 177 859 -1419 867 355 -1299 1241
2262A241j495m59J920k149J010Q30k260K148l28j724K444j372n47J923k117R77
$$ 1241 -254 -713 1207 -942 68 898 -1362 786 458 -1266 1178 -194 -741 1182 -935 42
2278D2Q87k279K139l12j758K428j404m95J908k110J039Q38k233K115m43j620K409
$$ 42 929 -1350 789 477 -1281 1147 -257 -752 1156 -954 85 923 -1310 805 362 -1258 1151
2295A151j516l24J883k175J121P78k256K130m45j581K380j491k90J841k150J054
$$ 1151 -365 -689 1194 -981 140 918 -1338 792 347 -1234 1146 -345 -635 1206 -944 110
2311A10Q08k237K057l66j589K375j429m09J912k113Q55R76k215J884j73j617K266
$$ 110 918 -1319 738 372 -1217 1158 -271 -680 1232 -881 -26 950 -1265 619 446 -1171 1095
2328A095j301n27J925k067P75J063k197J823j01j649K229j295n38J940k053P87
$$ 1095 -206 -733 1192 -875 -100 963 -1234 589 488 -1161 1068 -227 -765 1175 -878 -91
2344i1J043k133J799j97j545K197j394l99J916k088Q73R81k124J818l08j462K207
$$ -91 952 -1181 618 421 -1124 1073 -321 -720 1196 -892 -19 962 -1162 656 348 -1114 1093
2361A093j436l45J913k061Q13R67k076J729k65j426K171j361m06J936k044O70
$$ 1093 -343 -688 1225 -836 -23 944 -1132 597 332 -1094 1077 -284 -690 1246 -798 -128
2377a28J087k070J584p4j489K107j205n72J958j927N06J150k012J532J1j548K107
$$ -128 959 -1111 473 399 -1090 1017 -188 -760 1198 -729 -223 927 -1085 447 458 -1090 1017
2394A017j172o65J987j874M36J193j945J498l8j469K062j248n68J953j896N41
$$ 1017 -155 -820 1167 -707 -271 922 -1023 475 437 -1032 1030 -218 -786 1167 -729 -188
2410a88J128j929J539j67j436K087j275n27J934j857N40J038j866J502j96j378
$$ -188 940 -989 550 383 -1053 1034 -241 -768 1166 -691 -151 887 -979 523 327 -1051
2426a051K065j249n39J930j813M51J092j861J418p1j453K041j068p26J965j678
$$ -1051 1014 -235 -774 1156 -657 -206 886 -975 443 372 -1081 960 -108 -834 1131 -547
2442e47K43J164j803J316O0j490K029r88q55J983j624J62J209j752J272P9j500
$$ -547 -304 860 -943 373 433 -1057 972 -16 -871 1112 -512 -350 859 -893 379 458 -1042
2459a042K004r94q32J936j592K23J129j723J350l0j480K026j050q03J920j557
$$ -1042 962 -32 -864 1072 -520 -297 832 -891 459 429 -1051 975 -75 -878 1042 -515
2475e15K63J070j691J344r1j433J979j020p69J895j535K50J076j697J283J4j518
$$ -515 -252 818 -873 471 380 -1053 926 -94 -863 1032 -503 -253 823 -874 409 423 -1095
2492a095J966q41r10J889j397Q5J112j667J197J36j568J942p10j043J910j351
$$ -1095 871 30 -880 1009 -388 -303 809 -858 339 475 -1093 849 139 -904 1006 -345
2508c45k0J182j664J151K25j598J886o67j052J853j307mJ137j611J181J70j574
$$ -345 -365 817 -847 304 529 -1069 817 150 -902 951 -356 -360 777 -834 347 517 -1057
2525a057J885p30r85J804j320Q8J091j614J212J07j540J858p29r27J743j292J33
$$ -1057 828 98 -887 917 -403 -315 776 -838 374 481 -1059 799 70 -857 886 -406 -273
2542b73J064j629J198J63j598J819o01j018J752j187%J113j601J072K83j616J754
$$ -273 791 -838 360 523 -1075 744 143 -875 877 -310 -310 803 -798 274 557 -1059 695
2559F95m70j103J765j154j12J209j633R80M52j684J702l62j154J702j117j01J197
$$ 695 225 -878 887 -267 -379 830 -803 177 629 -1055 647 285 -869 833 -284 -385 812
2576H12j623J008M33j656J672m11j090J654j117m7J153j608J042L91j612J623
$$ 812 -811 197 630 -1026 646 235 -855 799 -318 -365 788 -820 222 613 -999 624
2592F24m15j008J593j142K9J117j601J035L96j632J599l88j013J586j075l5J164
$$ 624 209 -799 794 -348 -319 798 -803 232 628 -1004 595 207 -806 780 -295 -330 834
2609H34j593R23N02j648J508k59j082J582j024j42J253j608Q18O42j695J457j34
$$ 834 -759 164 666 -982 526 267 -815 767 -257 -399 854 -754 64 706 -989 468 334
2626C34j165J574r58k25J277j587P75O71j654J436j69j128J562r94j82J260j553
$$ 334 -831 743 -215 -440 837 -750 25 696 -958 478 309 -819 743 -251 -433 827 -726
2643g26P74O31j580J370j96j031J496j015j00J205j546Q04N92j567J378k24j031
$$ -726 48 679 -901 469 273 -758 738 -277 -377 828 -718 86 678 -889 489 265 -766
2660g66J513r93j63J233j494P02O41j546J298j36j077J519r25k67J309j485N85
$$ -766 747 -246 -409 824 -670 32 673 -873 425 289 -788 731 -194 -461 848 -637 -52
2677e2P64j594J251l3j156J535q65l69J367j445M95Q20j548J207k9j150J538q78
$$ -52 712 -882 369 336 -820 715 -150 -519 848 -597 -102 718 -830 377 348 -802 736 -142
2695a42l81J373j442N16P71j506J205p2j089J493q93l25J305j369N25O79j435
$$ -142 -523 850 -592 -76 695 -811 394 322 -767 726 -167 -492 813 -556 -31 648 -787
2712g87J217j58j053J494q74l54J309j340M77O97j412J164j00j092J507q26m27
$$ -787 430 272 -781 713 -161 -515 794 -546 -69 628 -784 380 280 -812 695 -131 -558
2729e58J360j314L94P91j450J127jj181J527p42n59J421j277K89Q55j448J101
$$ -558 802 -512 -118 673 -777 350 349 -832 695 -47 -606 815 -462 -173 682 -766 335
2746C35M6j205J527p34n71J409j250K85Q38j416J084Qj174J498p35n29J338j207
$$ 335 381 -824 703 -31 -602 807 -443 -158 680 -736 348 356 -818 680 -55 -584 754 -453
2764d53L39P24j364J132o2j122J488p45m99J300j190L44P10j346J101k5j147J475
$$ -453 -114 610 -754 378 316 -806 682 -63 -562 738 -452 -108 602 -744 357 332 -815 660
2782F60o94n49J314j146K84P51j365J084M7j242J503n98o87J375j115K01Q32j378
$$ 660 -34 -583 731 -415 -131 620 -745 339 386 -856 647 49 -638 737 -378 -177 655 -723
2800g23J028J26j278J478n60o93J344j094J98Q08j378J052J33j299J435n15o73
$$ -723 305 431 -847 631 71 -622 722 -372 -174 634 -744 308 441 -858 577 62 -611
2817f11J297j057K48P22j353J103K7j226J413n41n73J180j042K86O94j313J075
$$ -611 686 -371 -123 599 -754 349 376 -850 563 22 -551 629 -413 -127 567 -746 329
2834C29N4j211J418n39n80J168r95K64P04j345R96J67j237J361m35p01J246j011
$$ 329 383 -828 590 51 -529 639 -356 -92 612 -733 263 430 -807 554 119 -582 664 -347
2852c47J83Q03j363R84K24j299J339l88p27J240r96J70Q42j400R75K64j333J317
$$ -347 -164 639 -724 260 484 -815 524 136 -591 649 -347 -177 665 -735 240 504 -829 488
2870D88l58p21J212r60J87P78j330R43K12j243J272l97o17J152r82K49P34j321
$$ 488 130 -591 621 -339 -152 626 -704 239 451 -792 480 83 -534 618 -364 -115 619 -702
2888g02R48J91j189J234l88n78J089r44K34P20j315R17K44j203J210l57o34J135
$$ -702 246 437 -752 482 94 -484 605 -339 -105 615 -700 217 461 -742 468 111 -523 612
2906F12r57J61Q31j341Q54L45j246J182l01p01J175r45J10Q86j356Q21L90j277
$$ 612 -345 -184 647 -694 160 505 -741 441 140 -561 614 -331 -221 665 -691 130 520 -757
2924g57J174k79o95J160r36J26Q68j309P83L48j190J111l03o02J105r21J52Q19
$$ -757 417 138 -557 603 -333 -207 661 -648 135 483 -707 404 101 -501 604 -317 -165 654
2942F54j281P74L18j136J079l22n57J076r34J62P86j233P46L05j093J053l12n74
$$ 654 -627 147 465 -671 408 86 -471 605 -329 -167 619 -614 132 437 -656 397 85 -489
2960d89J111r39Q0Q87j273O87M13j141J033k44o36J113r10L9R40j267O52M66j189
$$ -489 622 -317 -237 650 -623 64 477 -664 369 125 -511 602 -308 -269 671 -596 56 522 -667
2979f67J037k18o88J140q78oR56j226N97M72j145J000k65o34J125q80L7R10j201
$$ -667 370 152 -536 604 -274 -280 676 -550 47 519 -626 374 109 -525 600 -280 -243 667 -534
2998e34O04L86j081R94k91n64J085q92O9Q46j170O03L58j030R88k90n69J091q77
$$ -534 70 456 -625 369 78 -486 599 -293 -224 622 -548 55 413 -617 371 81 -488 603 -274
3017b74J7Q85j185N91M17j074R88k27o56J116q44o1R40j174N72M54j109R96k08
$$ -274 -257 628 -557 34 451 -623 365 138 -518 598 -246 -307 633 -541 31 485 -624 372 164
3036A64p31J172q20j20R93j159N26M66j109R90k19p25J163q23r0R45j122N49M14
$$ 164 -567 605 -215 -335 658 -501 25 491 -618 372 153 -572 591 -232 -322 623 -499 50 464
3055D64j089R83k39o72J128p85p6Q78j085N46L45j025R93k65o44J113p76p7Q71
$$ 464 -625 358 119 -553 575 -210 -286 592 -493 53 398 -627 366 101 -543 570 -206 -283 588
3074E88j077N41L71j057J011k22o98J121p34j44R04j084N19M26j091J018j80p89
$$ 588 -489 52 423 -634 377 155 -543 578 -156 -300 604 -480 39 465 -626 392 212 -577
3092e77J158p34j94R39j076N13M52j122R97j46q15J155p07j78R18j067N37M09
$$ -577 581 -153 -347 592 -484 29 481 -641 356 210 -605 550 -157 -335 583 -484 53 462
3110D62j116J021j96p65J117o95j41Q71j028N45L63j077R89k02p13J081o78j02
$$ 462 -654 367 171 -594 523 -172 -313 558 -470 75 438 -639 350 148 -565 516 -162 -264
3128b64Q23j032N58L42j075R96j53p45J082o43j62Q27j035N20M14j113J008j17
$$ -264 559 -473 85 427 -648 348 195 -550 532 -111 -273 554 -481 39 453 -660 348 231
3146B31q17J121o51k03Q76j031M87M75j143R87o2q67J096o18k20R06j053N10M84
$$ 231 -586 535 -116 -319 557 -474 13 488 -655 332 270 -597 499 -119 -339 567 -486 24 508
3165E08j165R72n6q37J063o23j56Q39j002N03M35j113R33p2p70J008n94j21P96
$$ 508 -657 315 259 -578 485 -138 -294 545 -457 46 481 -632 301 229 -541 467 -127 -248 548
3184E48j005N25M05j106R28o4p72J017n90j46Q14j029N04M47j117R09j7p95J016
$$ 548 -457 68 473 -633 295 231 -541 476 -114 -260 554 -475 29 476 -641 268 251 -544 472
3203D72n86j92Q74j059M61N38j171R14M6q62J031n75k19Q97j051M62N45j164Q94
$$ 472 -114 -306 568 -491 -30 508 -663 251 297 -565 466 -109 -328 569 -482 -20 525 -639 255
3222B55L8q43J014n76k04Q88j047M74N40j139Q52J0p80R51n72j31Q31j022M76
$$ 255 293 -550 464 -112 -316 572 -475 -1 539 -600 252 262 -518 433 -139 -270 561 -461 15
3241A5N02j118Q42kp48R41n63j31Q18j014M47N10j117Q35K6p76R86n80j72Q80
$$ 15 517 -601 241 239 -509 432 -131 -262 556 -458 -11 499 -618 217 243 -533 453 -127 -299 581
3261E81j037L90N94j144Q12R2q27R92n55k43R44j049L73O22j140Q22P3q33J002
$$ 581 -456 -66 528 -616 196 288 -539 453 -102 -345 599 -450 -77 545 -595 227 300 -533 469
3280D69n80k29R49j060L91O12j116P86M7p73R57n86j90R06j008L80N57j072P81
$$ 469 -111 -340 609 -451 -60 552 -564 222 269 -504 453 -133 -323 583 -425 -45 512 -560 221
3299B21Op40R64n88j89R06r99L59N52j047P63mp09R56n80k02R30j011L28O06j088
$$ 221 227 -513 451 -137 -326 580 -419 -60 492 -555 208 204 -505 451 -129 -331 599 -412 -84 522 -566
3320e66P65N0p73J006n63k74R68j012K94O36j087P63O9q02J016n82k85R79j001
$$ -566 199 249 -524 482 -81 -355 613 -399 -105 531 -556 207 276 -526 490 -92 -377 602 -399
3339c99K95O28j066P42N2p76R98n71k77R48r60K83N80r95P28Pp23R58n72k44R14
$$ -399 -104 524 -542 200 252 -524 474 -97 -374 574 -386 -103 477 -518 210 217 -506 452 -120 -364 550
3360E50r19K81N58r78P15J4p30R56n46k61R25r20K69N81j000P16L9p71R88n10
$$ 550 -369 -88 470 -508 207 221 -509 447 -99 -360 565 -355 -86 495 -505 211 250 -521 467 -43
3380d3l25R45r13K23O07j014P06Q5q16J010n00l55R57r05K08O24j011P03R0q18
$$ -43 -368 577 -336 -113 494 -520 186 271 -545 465 -35 -390 567 -338 -130 494 -517 186 276 -542
3400e42R91m92l40R18q78K27N86r73P05M3p57R48m93l14Q93q40K19N51r46P03
$$ -542 449 -43 -383 535 -343 -116 470 -503 202 245 -512 436 -57 -371 522 -318 -99 452 -494 209
3420B09K4p34R21m57l14Q63q26K41N32r44O88N3p76R30m33l46Q96q33J94N97r99
$$ 209 233 -501 420 -37 -351 512 -314 -73 459 -485 203 256 -520 410 -23 -369 527 -306 -112 485 -514
3441e14O85J28q41R33l88m03R08q19J74O08j003O91J48q72R55l68m17R00p99J84
$$ -514 171 299 -542 391 3 -400 508 -311 -137 471 -532 159 307 -565 390 22 -395 505 -294 -110
3461a10N75r74O77J35q29R14l69l78Q53p95K13N57r59O65J27q05Q87l78l51Q17
$$ -110 465 -509 168 303 -526 388 19 -359 494 -301 -88 469 -490 175 302 -503 384 6 -345 472
3481D72p61K12N37r60O65J27q17Q92l59l69Q34p65J71N96r85O50J78q61Q96l31
$$ 472 -289 -77 460 -500 165 292 -525 367 8 -361 473 -292 -121 475 -510 140 318 -543 353 22
3501B2l99Q65p93J65O49j028O47K21q97Q98l00m36Q80p81J50O45j011O37K18q65
$$ 22 -377 488 -305 -140 509 -519 128 349 -548 350 50 -386 494 -287 -137 508 -503 134 352 -513
3521e13Q62l06m03Q45p81J74O15r92O31K05q45Q33l02l67Q12p66J75O05r78O29
$$ -513 349 43 -360 485 -296 -122 493 -499 132 337 -508 325 23 -344 468 -298 -123 482 -496 133
3541A33K00q38Q21k97l65Q26p83J49O48r92N88K65q68Q26k75m12Q67p72J16P03
$$ 133 333 -505 316 19 -346 480 -303 -154 494 -498 90 355 -513 313 38 -374 493 -279 -163 540
3561E40j035N78K96q82Q16k19m87R29q08J07P19j036N59K67q58Q18k54m34R24
$$ 540 -495 83 379 -503 313 94 -393 536 -272 -165 554 -482 77 344 -514 304 50 -384 540
3580E40q03R8O84j016N67K82q12P71k99l33Q08p31R0O43r44N22K71p98P45k68
$$ 540 -263 -165 519 -497 70 352 -460 311 12 -321 487 -244 -154 489 -455 67 338 -460 285 17
3600A7l71Q16p83J31O87r98O01K67q31P82k72m33Q67p67J39O26r37M64M32q98
$$ 17 -354 462 -321 -190 497 -501 100 367 -464 318 46 -387 480 -287 -148 478 -459 5 437 -461
3620d61Q04l16m17Q76p48N9P69r88M47L37q36P95k97l98Q95p54mP56r33M14L40
$$ -461 343 27 -390 486 -262 -203 566 -422 25 362 -474 321 24 -374 521 -233 -237 519 -414 0 340
3641C40p94P35k51m02Q74p22JP48r47M25L37q08P52k51l89Q02o99P6O65q80M61
$$ 340 -454 281 30 -372 502 -220 -219 529 -418 7 344 -464 288 37 -352 450 -249 -173 492 -388 73
3662G3K74p72P37k50m87R33p35LP75r70L98L68p98Q07k84m93R19p20m9Q05r34
$$ 73 347 -425 312 62 -425 508 -227 -224 551 -419 -21 347 -451 356 72 -421 498 -222 -271 534 -400
3683d00M95L10q98Q01k52n40R54o85q7Q28r66N10L18q66P63k11n17R65o84o8P13
$$ -400 95 405 -493 308 56 -484 470 -215 -302 526 -440 70 388 -478 285 74 -443 522 -162 -230 483
3704D83q53M19K91q16P60j97m84Q90o83j6O78q56L90L33q24Q28k50m67Q46o54
$$ 483 -370 49 340 -476 284 87 -397 493 -190 -206 472 -384 6 339 -485 343 93 -374 472 -182
3724a82o5P52r48N23K39q39Q03j88n23R13o48j07P62q88M07L57q75Q35k49n60
$$ -182 -247 505 -443 80 319 -520 283 95 -428 485 -163 -270 492 -396 11 368 -507 328 79 -481
3744d81R69o78m4P66r22M16L40q67Q30j94n72R26o59p1P43q84M44K89q34P66j78
$$ -481 488 -190 -234 532 -390 26 366 -501 329 135 -437 489 -170 -241 502 -382 62 351 -483 283 105
3765A05n14Q79o46n1P15q85M40L06q55P97j82n32Q84o27n8P00q79M35L07q52P90
$$ 105 -409 470 -176 -227 488 -397 43 349 -506 291 109 -423 461 -166 -224 476 -403 32 339 -513 277
3786B77j66n49R00o32p8P47r31M44L62r03Q10j36n88R03o32p7P49r17M47L79r19
$$ 277 111 -438 462 -170 -248 499 -432 12 374 -529 281 145 -443 460 -172 -249 500 -417 30 409 -510
3807e10Q01j31n89Q89o17p6P49r18M32L76r00P76j56n44Q59o17m3P18r09M51L33
$$ -510 291 160 -429 460 -157 -233 516 -402 30 406 -494 282 126 -418 441 -176 -219 499 -410 41 374
3828C74q75P61j45n30Q46o18k3O97r12M46L49q71P47j23n31Q53o14n2P18r10M28
$$ 374 -501 260 115 -415 431 -187 -210 487 -425 21 370 -501 246 123 -408 445 -169 -221 497 -413 15
3849A5L88r12P66r6n78Q73o20o8P55r37M25M13r20P69j18n87Q93o33o7P63r55
$$ 15 403 -509 257 161 -417 456 -164 -232 523 -414 11 424 -496 273 155 -432 461 -172 -239 524 -431
3870d31M29M23r15P39j02n64Q57o32k9P21q98M20L87q82P10j19n15Q33o26k9P19
$$ -431 -2 421 -494 245 143 -421 436 -196 -225 496 -402 18 405 -477 233 114 -401 432 -194 -223 496
3891D96q95M01L91q59O99j23n03Q30o26k4P41r21L89M07q71P02q7n38Q55o36o1
$$ 496 -399 2 393 -466 233 110 -393 437 -189 -213 528 -393 -4 403 -468 234 147 -391 464 -172 -233
3912b33P59r23L70M40q86P16q7n58Q63o32r4P95r32L59M58q82O94r1n42Q34o01
$$ -233 526 -397 -27 413 -473 243 156 -402 461 -171 -265 530 -402 -43 415 -467 227 136 -406 428 -173
3933a73r4P72q92L58M40q50O60r9n11Q28o22o1P44q63L37M13q05O50j28m89Q28
$$ -173 -267 505 -387 -29 411 -439 221 122 -389 439 -183 -244 500 -363 -26 387 -418 232 104 -385 443
3954D43o01p4P58q81L40M09q28O62j00n17Q36n94j13P84q88L09M45q41O74q6n45
$$ 443 -158 -232 526 -355 -15 394 -434 228 128 -389 447 -147 -260 524 -364 -55 390 -451 223 137 -408
3975d08Q71o13j44Q13q91L01M74q55O70p5n57Q63n87j52P94q68L23M34q27O64
$$ -408 463 -150 -294 519 -372 -71 403 -452 218 143 -414 449 -138 -290 504 -364 -41 393 -434 230
3995B30r5n35Q36n80j27P71q35K96M17p84O39j08n19Q31n78j23P56q11K94L97
$$ 230 135 -400 436 -144 -271 500 -335 -39 378 -406 233 125 -394 437 -141 -264 492 -319 -25 372
4015C72q01O51j03n37Q52n55j58P78q36K78M28q12O60p5n79Q68n47j93Q08q38
$$ 372 -429 222 119 -418 434 -121 -279 499 -337 -59 369 -443 217 142 -437 431 -116 -309 499 -339
4035c39K77M46q47O84n0o03Q73n23k19P98q11K58M46q23O64o5n89Q63n38k00P77
$$ -339 -62 384 -463 221 171 -432 441 -82 -301 497 -314 -56 390 -433 231 166 -423 440 -98 -298 479
4056D79p91K65M34q09O44o8n79Q24m96j82P34p68K69M03q00O45n8n83Q24m80j99
$$ 479 -312 -47 387 -422 222 154 -425 399 -97 -279 455 -313 -44 359 -441 204 146 -437 387 -93 -292
4077b92P52p65K58M22q28O50k9o18Q45m67k33P83p86K49M41q37O69k0o45Q70m76
$$ -292 460 -305 -47 375 -453 197 168 -450 395 -72 -305 478 -308 -59 382 -455 214 194 -451 419 -57
4098e7k46P79p90K63M50q48O47no36Q41m65k35P49p54K42M41q14O38j3o12P88
$$ -57 -303 476 -314 -51 399 -449 198 193 -443 398 -67 -302 447 -307 -65 376 -438 200 187 -425 363
4119C63m38k25P34p45K59M17q07O32k2n96P84m23k15P26p43K42M36q17O08K7o26
$$ 363 -75 -300 434 -311 -52 365 -442 190 168 -428 356 -67 -282 444 -299 -57 379 -438 170 197 -429
4140d29P92m34k11P45p59K34M62q32O11L9o50Q09m14k62P62p61K00N06q55N99
$$ -429 363 -71 -282 463 -296 -62 400 -432 179 218 -432 377 -37 -299 463 -298 -98 408 -447 152
4160A52P2o58P83l99k49P49p57K19M98q45N70P7o29P61m02k36P29p38K24M74q06
$$ 152 224 -434 349 -50 -299 450 -307 -88 410 -435 135 212 -417 344 -58 -294 435 -303 -79 395 -411
4181d11N65M9o15P53m06k09P17p38K14M93q21N40Q7o10P25l84k23P31p41J86N11
$$ -411 154 203 -412 341 -65 -274 443 -295 -81 412 -409 131 218 -392 333 -51 -274 457 -284 -98 413
4202D13q22N42R3o38P52l86k61P77p61J82N34q39N30J14o51P44l91k41P67p54
$$ 413 -409 133 226 -412 340 -46 -307 470 -291 -109 425 -414 116 230 -421 323 -68 -309 458 -296
4222b96J63N59q37N18J15o31P41l78k54P51p36J66N25p91M98J02n97P17l86k39
$$ -296 -133 426 -411 107 222 -409 332 -46 -300 451 -285 -119 406 -385 113 215 -382 335 -51 -290
4242b90P36p09J58N27p92M91R9n94O97l76k36P44p13J30N61q12M82J18o11P24
$$ -290 446 -263 -105 422 -370 121 220 -374 323 -53 -289 455 -258 -128 433 -379 103 221 -390 334
4262C34l66k88P80p29J04N89q13M65J56o39P41l70k96Q06p32J08N78q09M73J44
$$ 334 -32 -320 460 -269 -165 424 -389 76 232 -407 334 -36 -332 474 -258 -150 428 -381 92 236
4282B36o30P34l70k97Q03p16Q8N70p78M62J12n94P18l70k84P72o97R6N48p59M55
$$ 236 -394 340 -30 -327 476 -240 -152 418 -360 102 214 -380 338 -32 -316 456 -241 -145 403 -356 99
4303I9J10n86P12l61k92P68o86P5N57p50M50J03n90P25l71l12Q06o94O3N73p66
$$ 99 209 -377 335 -26 -318 450 -236 -161 396 -354 96 199 -391 334 -37 -349 457 -237 -174 399 -367
4324c67M56J35o32P46l64l24Q26p06O2O02p96M61J30o33P57l59l32Q04o74M8N68
$$ -367 89 224 -408 338 -26 -350 476 -230 -168 434 -362 99 229 -404 353 -6 -338 466 -208 -160 408
4345D08p54M37J35o04P11l54k96P63o54O1N25p15M42R8n98P17l31l24P63o31N1
$$ 408 -346 91 226 -378 333 -21 -317 446 -208 -147 378 -337 105 203 -395 322 -9 -333 430 -201 -150
4366a50N18p24M50J05n97P20l39l35P85o33M2N55p26M25J35o40P26k98l59P79
$$ -150 368 -356 94 199 -398 322 -17 -352 433 -200 -158 397 -329 96 231 -409 317 19 -340 439
4386D39o50N5N66p66M69J53o88P53l07l61P82o56M8N55p63M53J34o08P08k73l66
$$ 439 -211 -156 410 -356 113 266 -422 331 24 -337 445 -211 -163 392 -371 82 216 -392 316 43 -323
4407c23P31o19Q4M88p59M61J17n82P27l42l63P55n82R9M84p45M93O6n43O19k72
$$ -323 408 -211 -127 361 -398 63 180 -402 325 -17 -380 375 -207 -108 376 -369 124 190 -353 266 -6
4428fl52P69o19J01N34p45L99J60o03O60k58l47P10o05P4N16p41M35J79o69P15
$$ -6 -358 411 -208 -107 427 -318 81 241 -362 298 40 -307 403 -202 -128 388 -353 82 261 -408 307
4449C07k62l84P45o04L5N45p49M49J49o32O78k55l44P02n84O4N08p28M41J48o29
$$ 307 45 -339 406 -198 -163 382 -367 82 231 -401 277 22 -322 380 -204 -140 368 -360 81 229 -400
4470d00O73k54l16O75n66O9M85o96M10J54o27O57k45l04O63n79P5N01p33M34J69
$$ -400 273 19 -297 378 -188 -119 366 -330 80 234 -393 264 19 -285 378 -201 -126 375 -358 76 245
4491B45o27O46k29l47P01n84N4N36p55M31J87o49O59k36l45P06n94M3N62p66M09
$$ 245 -382 264 35 -312 389 -195 -141 395 -360 71 258 -391 268 32 -313 393 -201 -158 404 -362 47
4512D7K01o51O65k30l51P11n92M9N31p19L97J88o16O30k42l12O73n77P3N08o99
$$ 47 248 -403 262 32 -319 392 -200 -151 380 -339 58 246 -370 260 18 -294 379 -198 -125 383 -316
4533c16L81J73n97O13k41k81O48n90Q0N16p20L94J72n87O08k35l03O79o00N9N29
$$ -316 65 238 -359 254 13 -268 380 -210 -130 386 -334 60 232 -355 253 18 -285 394 -206 -147 382
4554C82p32L91J93o12O27k37l19P03o13M4N71p36L72K13o11O20k39l16P01o01
$$ 382 -350 41 234 -378 249 12 -307 396 -217 -173 398 -338 34 247 -364 256 17 -299 402 -199
4574a99L7N57p19L76J95n85O07k59k85O76n96M7N43p01L61J80n62N68k34k97O73
$$ -199 -162 395 -324 52 247 -338 269 10 -275 401 -195 -148 395 -306 55 235 -327 241 7 -290 383
4595C83n76N3N14o85L61J73n73N81k34k95O89n87L8N29o84L50J80n66N96k43l09
$$ 383 -193 -140 374 -311 50 223 -350 231 -3 -298 391 -196 -158 371 -313 37 217 -349 247 4 -305
4616c05P11n93J9N58p17L56K03n84O18k39l30P21n97KN53o72L30K00n68O02k61
$$ -305 406 -187 -168 390 -327 29 232 -352 266 27 -303 418 -179 -177 376 -296 34 234 -334 268 7
4637Gl06O90n65J0N34o54L33J75n32N65k51k97O62n48J9N07o30L25J49n24N77
$$ 7 -299 391 -174 -164 370 -284 49 224 -308 257 6 -291 371 -177 -158 349 -281 44 193 -331 246
4658B46k55k90O73n42JN23o38L30J50n35O07k57l21P01n53j2N43o45L34J60n58
$$ 246 -9 -299 374 -168 -167 356 -282 48 198 -337 270 13 -308 393 -160 -172 371 -274 60 220 -338
4679c38O11k40l38P14n49k6N21o34L25J74n59O20k50l44P00n41k6N18o17L20J63
$$ -338 273 33 -305 409 -140 -166 355 -279 46 220 -339 281 31 -313 387 -154 -180 338 -279 41 204
4700B04n43N99k38l24O55n04j6M95o01L25J37n26N88k31l11O49n08j2M93o01L31
$$ 204 -339 260 22 -302 353 -151 -167 328 -273 52 189 -337 251 20 -291 358 -150 -162 331 -270 61
4721F1J41n33N75k14l32O54m92j2M96o22L27J56n71O20k06l55O70m91m4N11o40
$$ 61 202 -331 244 30 -302 352 -140 -152 344 -278 49 205 -366 254 48 -307 363 -128 -172 339 -301
4742c01L45J76n85O14j99l65O78n03l1N03o24L41J70n64N99j95l70O64m90l1M84
$$ -301 44 220 -365 249 50 -315 363 -140 -171 332 -292 49 219 -345 254 59 -311 353 -137 -168 316
4763C16o02L42J57n49N78j92l43O27m73j0M84o08L43J50n56N67j84l38O24m68
$$ 316 -286 56 213 -336 242 50 -293 334 -139 -149 335 -273 70 220 -336 231 47 -291 333 -135
4783a35oM78o13L39J63n87N95j89l55O56m79j5M96o41L32J98o06N94j61l68O35
$$ -135 -141 337 -276 63 226 -361 234 45 -310 346 -133 -148 348 -293 39 237 -369 225 64 -304 331
4804C31m75j8N15o62L56J91n92N83j62l52O23m68j6M76o18L35J91n60N47j66l46
$$ 331 -144 -162 353 -309 47 238 -354 229 67 -285 338 -130 -146 330 -288 47 238 -322 225 59 -287
4825b87O07m65J1M65o09L26J86n61N33j53l38O04m56%M63o02L29J80n63N38j54
$$ -287 320 -145 -134 331 -278 48 234 -327 206 53 -285 319 -137 -137 326 -276 53 233 -330 208 54
4846E4l42O10m68pM98o30L14K10n89N61j55l44O22m81PM91o50L38K11o01N59j40
$$ 54 -288 322 -146 -153 345 -285 29 239 -350 211 56 -288 334 -147 -140 351 -299 39 250 -351 208 68
4868F8l37O08m80j1N04o25K95K26n66N26j54l16N89m72mM78o08L07K00n28M90
$$ 68 -269 339 -141 -152 352 -273 22 248 -318 208 54 -262 327 -145 -149 329 -279 28 228 -300 190
4889A90j50l10N72m48mM80o05L00J98n26M96j59l12N99m70jM95o10K78K22n40
$$ 190 40 -270 302 -146 -150 330 -275 25 223 -303 193 34 -278 321 -149 -150 345 -265 13 235 -305
4910c05N07j59l06N98m67k4N12o11K76K22n56N18j58l17O12m78k8N21o18K73K19
$$ -305 202 43 -263 335 -132 -156 356 -255 21 243 -313 205 47 -270 342 -136 -164 357 -261 12 231
4931B31n30M96j57l09N97m80j6M78n66K61K01m95M74j59k85N80m62k8M89n65K39
$$ 231 -299 197 40 -269 328 -152 -168 310 -256 5 206 -289 185 26 -259 321 -141 -169 320 -245 -6
4952fK08m79M67j63k88N71m42k5M85n63K36K15n03M83j58k97N92m62k9N02n90
$$ -6 202 -277 190 27 -261 310 -132 -157 328 -235 1 216 -287 196 38 -259 333 -129 -158 344 -246
4973b46K48K20n13M86j59l14O12m49o7N15n72K31K10n02M93j46l30N93m31o2N00
$$ -246 2 222 -291 195 36 -278 334 -115 -182 333 -239 -8 202 -300 193 47 -283 310 -121 -183 317
4994C17n36K19J96m73M68j48l14N82m30n7M81n17K21J92m53M45j50k96N60m11
$$ 317 -219 0 196 -277 191 43 -271 311 -119 -176 305 -212 9 201 -252 193 43 -253 307 -104
5014a04n7M69n21K19J85m63M58j40l24N91m13o9M79n22K17J95m94M77j32l31N89
$$ -104 -161 308 -213 6 191 -272 186 46 -278 313 -100 -169 310 -212 5 200 -294 183 51 -280 309
5035C09m05r3M97n34K13K10m97M79j29l32N71l91p2M69n06K09J97m75M72j30l35
$$ 309 -96 -189 308 -226 -13 197 -300 179 50 -282 289 -102 -174 295 -211 -2 195 -280 192 62 -273
5056b73N74l84p7M51m79K11J71m55M58j34l13N37l68p4M30m69J98J79m49M44j18
$$ -273 301 -83 -160 291 -188 23 194 -261 197 63 -250 287 -81 -155 275 -194 4 183 -266 178 60
5077F0l17N36l55r4M46m77J94K01m75M62j26l38N64l53r5M51m97K01K07m94M73
$$ 60 -257 279 -76 -170 276 -201 -7 194 -281 181 55 -283 281 -72 -167 284 -213 -12 195 -299 174
5098A74j05l53N67l55r7M48m75K10K00m89M45r8l27N27l38p3M09m59J92J91m60
$$ 174 69 -284 283 -72 -169 279 -196 14 214 -275 170 72 -255 272 -66 -139 270 -189 3 194 -266
5119b66M28r0l21M96l16p0M01m63K00J96m68M18p3l37N10l15q5M19m66J94J99
$$ -266 162 72 -249 247 -69 -139 262 -201 -1 195 -273 145 72 -265 245 -70 -155 264 -202 -8 191
5140A91m69M20o3l32N05l29q9M44m93K07K27m97M26m8l58N16l26q9M52m95J96
$$ 191 -278 142 79 -253 252 -77 -166 278 -215 -8 219 -278 148 100 -258 258 -68 -157 295 -200 -4
5161dK36n07M23o7l30M96l20p8M23m65J79K38m68L73n6l08M58k92p8M10m61J81
$$ -4 232 -275 148 81 -249 247 -73 -151 272 -193 -14 224 -244 129 73 -235 223 -69 -147 263 -198 -17
5183a7K13m43L65n4l02M57k90q2M21m65J77K27m66L73l0l14M71l17p3M30m87J86
$$ -17 196 -247 118 64 -238 219 -71 -153 268 -197 -20 207 -259 114 84 -230 241 -76 -149 281 -206 -20
5205b0K55m87L71j4l31M70l13r0M44m80J68K56m90L70k7l24M76l06j01M49m71
$$ -20 235 -252 119 105 -226 244 -69 -159 285 -195 -27 229 -261 109 82 -242 234 -72 -173 276 -195
5226a95J55K60m69L65l6l06M47l00q0M27m44J45K47m40L28k0l08M44k91q0M13
$$ -195 -40 220 -249 116 80 -226 221 -79 -159 268 -176 -31 216 -224 104 84 -224 220 -71 -151 262
5247B62m28J36K50m43L26j8l07M57k93r7M33m43J12K72m55L37nl27M84l13j12
$$ 262 -166 -30 220 -223 103 85 -222 235 -58 -155 278 -165 -53 219 -236 101 96 -231 253 -60 -172
5268a72M63m64J16K69m43L33k1l22M83k99j20M54m59J26K75m57L41j0l22M53k86
$$ -172 291 -173 -57 212 -231 102 81 -241 242 -57 -177 277 -182 -56 219 -238 103 93 -229 224 -62
5289f2j24M45m23J11K60m18L12j4l10M53k77j23M46m22J05K42m10L15l3l03M74
$$ -62 -186 259 -164 -53 207 -211 101 87 -223 230 -47 -170 276 -146 -41 201 -209 106 73 -230 244
5310B44k88j25M47m24R8K67m30L22l1l20M72k84j37M69m41Q9K83m46L39k4l25
$$ 244 -44 -169 278 -146 -48 219 -211 111 80 -240 232 -52 -189 280 -161 -72 211 -235 104 80 -245
5331b45M95k92j53M70m36J04K54m30L55m3l25M90k91j42M62m22R9K55m19L29l7
$$ -245 250 -42 -195 275 -161 -57 197 -233 122 79 -246 244 -47 -189 273 -149 -50 205 -214 115 78
5352G8l09M66k76j31M37m07R3K50m05L19l4l19M60k64j51M49m07J17K22m24L52
$$ 78 -231 235 -41 -172 265 -142 -49 201 -204 115 81 -238 222 -42 -193 256 -151 -34 188 -236 116
5373A16m2l33M83k65j49M56m16R2K55m33L51l3l44N03k86j44M61m22J06K38m31
$$ 116 74 -259 224 -41 -190 266 -150 -58 197 -236 115 82 -262 241 -45 -189 272 -150 -44 194 -237
5394b37L57k2l52N09k76j63M44m01J05K33m33L65l0l40M77k58j47M07l82J13K16
$$ -237 120 98 -254 255 -21 -184 260 -141 -36 197 -236 129 99 -241 236 -22 -169 238 -144 -31 185
5415A85m09L35k7l31M60k52j46M14l73J12K11m09L51l2l38M64k45j44M22l84R9
$$ 185 -224 111 84 -247 213 -39 -185 229 -144 -32 179 -230 121 89 -249 215 -30 -174 248 -136 -37
5436c7K36m38L54k1l41M70k52j29M15m17J32K33m54L79l6l50M81k53j40M22l96
$$ -37 199 -239 115 94 -247 223 -29 -158 257 -160 -28 205 -249 130 94 -256 225 -28 -168 254 -142
5457a42J15K43m59L51j4l33M52k44j38M09m12J38K28m34L53j4l31M32k46j20L99
$$ -142 -27 216 -243 108 94 -239 213 -31 -169 240 -172 -34 194 -240 113 99 -232 200 -46 -166 233
5478B33l96J24K35m29L26kl22M33k43j28M05l97J36K27m35L46ol43M39k36j30
$$ 233 -163 -39 196 -233 93 91 -231 202 -41 -169 236 -161 -25 202 -233 113 107 -236 203 -33 -163
5499a63M20m12J25K39m62L60jl51M53k45j31M21m12J14K48m35L32pl35M43k43
$$ -163 257 -155 -30 209 -253 107 106 -245 208 -37 -168 253 -159 -45 203 -232 100 93 -242 201 -42
5520d2j19M04m17J27K36m29L32J0l30M19k46j01L84l98J39K36m12K97Ql16M39
$$ -42 -161 243 -174 -47 189 -240 92 102 -228 191 -55 -156 228 -170 -31 205 -207 90 98 -218 221
5541B21k61j05L86l97J22K40m25L24ql16M25k46j05L96m23J43K45m48L37j1l30
$$ 221 -40 -145 241 -156 -34 206 -219 105 97 -219 206 -40 -145 251 -172 -29 216 -232 105 94 -236
5562b36M40k59j09M23m44J34K57m38L07J4l14M40k61j01M03m15J13K57m28L09
$$ -236 204 -55 -164 259 -185 -51 206 -232 75 89 -225 215 -46 -147 256 -159 -46 211 -217 92
5582I2Kk98M10k54r5L96m03J04K45m10L12j2k79L99k55r3L84m03J16K44m00K90
$$ 92 94 -204 206 -48 -143 253 -150 -46 199 -211 101 89 -190 209 -46 -139 245 -158 -42 202 -198 92
5604I2mk89M03k51j06L99l99J13K34m01L04j8l04M27k56j07M24m16J12K37m13
$$ 92 88 -201 202 -49 -155 244 -155 -42 192 -209 95 77 -227 200 -56 -163 261 -155 -43 194 -219
5625b19L07ll02M33k59j24M23m14J17K37l95L07k1k83M25k69j10L97l85R5K41
$$ -219 88 85 -217 216 -43 -167 256 -158 -41 196 -199 108 87 -196 229 -40 -150 247 -138 -43 198
5646A98l86K84k6k59M05k53j16L90l80Q7K41l87K96l3k56M06k46j34M02l83J00
$$ 198 -188 96 70 -189 216 -37 -153 237 -143 -56 185 -202 94 61 -195 211 -35 -169 233 -150 -50
5667e0K32l66K78k8k75M17k48j22M14l95J02K33l82K95k2k98M33k56j22M07l91
$$ -50 182 -184 94 66 -209 208 -40 -162 252 -143 -41 192 -190 105 83 -215 218 -38 -160 247 -144
5688a44J03K23l85L20l7k76M24k63j20L92l65Q0K29l61K73k8k71M12k36j23L70
$$ -144 -41 182 -203 117 80 -196 228 -35 -155 237 -128 -48 181 -180 93 65 -206 206 -30 -153 217
5709B17l41P1K25l52K71j8k84M00k34j15L75l43P7K18l42K77k8k81M04k28j23
$$ 217 -124 -53 172 -180 91 73 -211 189 -45 -160 215 -128 -51 167 -175 102 74 -207 197 -31 -154
5730a54L87l55Q9K18l74K98k5k91M12k21j51L89l43R7J99l66K94j9k96M17k27
$$ -154 233 -122 -33 185 -189 109 84 -207 205 -16 -167 222 -121 -24 175 -191 103 84 -212 205 -22
5751b2j39L78l30Q4K01l72L01k0k99L97k08j25L53l12O4J97l45K85j4k84L80j95
$$ -22 -161 217 -113 -29 172 -200 101 81 -218 179 -29 -154 199 -113 -49 148 -197 88 74 -210 170 -25
5773b5j22L42l10P4J86l25K76ok82L76j98j37L56l31Q6K20l67K77Rl00L85j87
$$ -25 -147 195 -115 -41 145 -180 96 90 -192 184 -14 -151 205 -126 -40 180 -187 90 99 -201 184 -3
5795cj57L67l23P7K10l72K96j6k98L94j99j28L59l26Q5K04l61K74Kk97L76j81
$$ -3 -160 207 -116 -39 171 -201 95 79 -219 175 -24 -152 207 -119 -34 170 -191 83 85 -212 164 -17
5817a7j23L31l04Q5J89l39K59J0k75L51j75j26L25l07P9K01l41K51J9k76L35j65
$$ -17 -140 191 -113 -28 161 -178 81 91 -184 167 -8 -134 191 -116 -37 164 -177 74 93 -183 152 -13
5839a3j19L27l29J01J97l54K63J3k88L54j67j34L53l28P9K19l62K58J9k81L56
$$ -13 -132 195 -134 -33 164 -190 73 86 -202 152 -15 -149 204 -124 -45 174 -188 70 89 -192 164
5860A64j84j24L39l23P6K31l74K60L0k89L50j66j27L40l15P0K13l38K39K2k77
$$ 164 -20 -144 195 -128 -52 179 -195 65 95 -194 156 -10 -137 203 -112 -42 171 -167 72 94 -183
5881a83L38j66j24L34l01N9K15l42K22L0k62L32j68j12L09k94O6K18l31K05M1
$$ -183 155 -11 -135 199 -102 -43 172 -170 52 82 -180 152 -16 -128 181 -113 -47 171 -160 45 86
5902H6k62L14j65j12L32l08O4K22l53K30M3k73L32j79j14L53l34P0K29l49K32
$$ 86 -176 138 -27 -139 193 -115 -51 171 -182 48 91 -182 150 -29 -143 210 -124 -54 175 -174 58
5923E8L3k74L37j76j10L35l12M4K32l25K15M6k65L18j75j12L25k82M1K13l21K11
$$ 58 91 -183 154 -22 -132 203 -109 -65 167 -158 57 103 -162 156 -19 -131 194 -88 -47 166 -155 56
5945E6L4k49K87j58j20L34k84M1K15l11J91L7k31K97j68j18L39l02M0K36l33K10
$$ 56 90 -159 128 -30 -150 184 -100 -59 156 -155 36 73 -158 139 -29 -147 192 -110 -70 166 -167 43
5967D3M7k55L10j65j22L46k95L8K25l25K08K2k55L38j75j29L48k97K7K36l13J95
$$ 43 90 -165 145 -20 -142 204 -91 -53 172 -153 55 77 -178 160 -15 -144 204 -93 -66 170 -143 52
5989E2K7k51L18j65j31L40k84L2K08k94J91J7k35L15j68j20L30k73K1K05k79J87
$$ 52 79 -172 146 -19 -150 190 -94 -62 146 -148 43 60 -175 140 -28 -148 182 -91 -70 135 -144 43
6011D3L1k33K97j49j33L28k66J9K19k89J88K0k42L20j50j48L38k75K4K18k97K00
$$ 43 74 -159 138 -11 -144 184 -82 -63 156 -133 55 75 -167 153 3 -145 193 -82 -58 160 -137 63
6033F3K3k68L43j60j50L35k78K2K31l08J91L4k55L30j57j47L28k65K5K21k99J90
$$ 63 86 -182 161 1 -149 186 -92 -70 161 -147 44 78 -177 153 -4 -151 177 -88 -63 158 -141 49
6055D9K6k45L10j44j52L22k48J1K19k70J75K3k34K99j39j46L20k50J7K03k87J96
$$ 49 75 -170 140 -4 -156 166 -82 -71 148 -122 53 76 -158 141 2 -144 176 -74 -57 146 -141 55
6077E5K7k58L12j27j37L11k52J3K07l01K04J7k61L34j50j50L35k59J9K16l10K00
$$ 55 82 -176 136 9 -128 183 -69 -56 151 -150 54 71 -190 144 -6 -156 179 -80 -61 155 -155 45
6099D5L4k70L28j35j45L08k51K6K00l00K14L5k72L30j54j47L26k42K8J76k73J94
$$ 45 79 -191 137 2 -143 165 -86 -60 140 -160 54 89 -183 147 -7 -154 172 -70 -42 134 -139 55
6121E5L9k56L10j31j44K89k36K9J90k86J95N0k62K79j07j55K96k28K2J90k87K07
$$ 55 94 -162 148 17 -127 162 -74 -45 145 -141 54 104 -158 121 14 -141 155 -73 -51 139 -148 59
6143E9K8k73L16j24j50L14k53K8K01l09K11M0k69L19j36j32L02k51L2J97k87J96
$$ 59 87 -186 130 6 -144 170 -83 -55 146 -163 48 88 -181 138 2 -130 172 -79 -47 150 -137 59
6165E9L5k58L06j31j27K88k35J9J92k89J97M1k49K88j18j34K76k31K6J81k75J76
$$ 59 94 -164 142 11 -116 172 -63 -44 148 -141 56 97 -152 136 18 -116 160 -71 -45 136 -139 37
6187C7N9k64K87j15j35K81k29J7J92k77J91M4k52K79j20j31K92k38L0K07l02J98
$$ 37 96 -168 119 4 -131 150 -79 -62 130 -147 44 88 -164 115 -5 -136 156 -82 -52 155 -147 51
6209E1N0k76K90j12j21K96k45K1K01k90J89M3k57K82j10j33K96k50L8J97l00J64
$$ 51 101 -175 115 3 -118 178 -67 -46 155 -135 54 97 -160 122 12 -121 175 -75 -37 160 -140 24
6231B4O7k42K67j05j31K81k48K4J89k64J66N3k29K54j08j29K90k44K6K04k80J61
$$ 24 91 -151 116 11 -120 161 -87 -63 126 -138 28 81 -148 106 -2 -131 159 -85 -59 145 -135 26
6253B6N2k31K61j03j29K86k45K5K31l11J74O0k42K66j14j38L01k46K0K20k96J66
$$ 26 78 -153 108 5 -124 162 -83 -58 173 -138 36 96 -146 120 6 -132 169 -77 -57 163 -133 33
6275C3N3k39K91j43j27L03k46J1K31l00J48O8k44K73j06j23K76k29LJ98k58J69
$$ 33 86 -153 138 -5 -132 171 -75 -64 167 -133 15 83 -161 112 6 -117 159 -70 -67 131 -127 42
6297D2L0k28K69q8j65L01k23L5J50k38J06J29k05J36k3k13K77j86L7K56l45K09
$$ 42 72 -156 113 25 -140 161 -62 -27 123 -115 -9 120 -85 51 28 -185 92 -94 -57 199 -146 63
6319F3J1k28K94j08j62K97k27LK15k79J62M1k33K63j17j43L05k37RK11k71J58
$$ 63 74 -154 140 32 -130 167 -60 -57 158 -121 41 82 -151 112 -5 -148 157 -80 -71 140 -131 27
6341B7M6k23K66j20j35L02k32%K11k58J46M6k10K52j09j34K93k18nK08k55J23
$$ 27 73 -150 116 -4 -139 163 -69 -69 142 -116 30 76 -134 118 9 -125 168 -50 -55 153 -102 21
6363B1O3k39K78j19j18K71j85o2K43k80J23N4k06L20j22j87L27k32J7J82l09K20
$$ 21 84 -155 123 4 -114 157 -28 -90 153 -127 -4 50 -156 164 42 -145 182 -50 -33 149 -160 60
6385F0J6k16K74j54j25K95k32J9J87k34J84Jk60K92j05j49L08k25QJ75k28J45
$$ 60 76 -140 134 -20 -145 150 -82 -63 124 -110 74 75 -185 107 2 -147 161 -64 -56 119 -109 36
6407C6K1j87K59j01j49K73j98%J74k40J68J4k10K64r8j54K66k06J6J89k55J52
$$ 36 57 -130 129 28 -121 152 -46 -46 128 -112 56 70 -140 124 26 -128 138 -68 -52 137 -118 34
6429C4M2k20K58r5j49K70j94k3J97k48J70L5k27K55j09j37K90k14NJ98k67J74
$$ 34 76 -144 114 19 -130 140 -54 -77 120 -128 42 77 -150 105 -4 -141 149 -65 -60 138 -129 45
6451D5L1k27K71j08j47K76j90pJ88k50J67L7k38K65r0j36K66j97kJ85k61J58M4
$$ 45 76 -151 120 12 -135 141 -49 -56 132 -118 49 86 -152 113 23 -113 153 -44 -46 139 -122 36 80
6474H0k24K53r3j42K57j82LJ64k33J49N6k30K51j06j10K52k07lJ84k43J48N7k30
$$ 80 -144 109 16 -126 131 -51 -48 116 -117 32 88 -142 109 3 -107 145 -62 -65 119 -124 24 81 -149
6497a49K62q5j48K68k01PJ86k68J73N8k43K53q0j54K68j94OJ78k63J62N5k24K40
$$ -149 113 28 -120 148 -53 -46 140 -128 45 103 -140 113 33 -121 147 -47 -41 137 -126 36 91 -133 107
6520A07q2j34K52j93LJ75k42J48M7k24K33o3j34K31j79kJ85k45J42N4k26K39q1
$$ 107 25 -109 143 -50 -47 128 -114 34 81 -143 90 27 -107 124 -55 -57 128 -117 25 79 -147 92 11
6543A1j26K44j89J2J76k38J37O6k30K37p5j32K49j98MJ82k49J57O0k30K34p9j36
$$ 11 -115 129 -60 -48 128 -110 27 93 -137 100 25 -107 142 -56 -52 130 -119 38 98 -132 102 23 -113
6566a13K57k02JJ88k45J41O4k30K20p4j16K49k08J1J93k55J40N5k11K25q3j26
$$ -113 144 -58 -57 131 -114 27 91 -139 81 7 -109 140 -68 -57 136 -119 21 76 -135 90 7 -119
6588a19K41j82LJ86k36J36N3k09K22p9j08K26j82NJ81k35J16P5k17K10p8j17K47
$$ -119 122 -60 -57 129 -107 29 82 -127 95 16 -92 134 -48 -43 138 -97 19 94 -123 87 9 -108 139
6611A39j88jJ83k35J35M8k01K18r2j22K47k01PK06k60J41N5k00K17r4j18K46k03
$$ 139 -49 -50 133 -102 33 81 -120 98 6 -116 131 -70 -63 143 -117 24 79 -121 96 2 -116 130 -73
6634g3RJ88k42J36N4j92K15r3j09K47j99QJ72k14J15L3j46K03j02r1K10j91PJ46
$$ -73 -64 124 -118 18 72 -120 95 2 -107 140 -59 -51 121 -93 22 55 -91 112 10 -81 129 -62 -55 91
6658I1k00J49L1j78K06j51n4K46k07k3J89j96J12J3o7Q8l2j50K43j52NJ17j19
$$ 91 -109 40 71 -107 99 -52 -106 140 -67 -90 99 -97 15 28 -39 49 17 -133 110 -42 -37 80 -39
6681c9N8M8j52J98j49p1K57k33K2J84j80M0R9j60J56l9q1J98j52m4J57k13J51
$$ -39 19 67 -85 113 -36 -107 150 -83 -61 123 -57 -17 82 -78 78 39 -42 156 4 -40 117 -96 55
6704E5K1j42J64q9j42K67k03kK00k27J01K8j35J52n3o2J81j94J0J73j91R4N8j84
$$ 55 76 -66 98 9 -133 134 -69 -71 129 -98 3 31 -104 48 -5 -67 114 -80 -70 103 -88 6 64 -120
6728a20K16r9r3J94j65m4K23k47J36J21j62J14k3j31K56j99n5K13k23J40k0j14
$$ -120 96 -3 -96 98 -67 -111 112 -135 1 122 -40 74 51 -80 176 -23 -78 135 -88 52 32 -82
6750h2J58n3r9K07j58rJ44j83J09L7j70J84p0j11K08j42rJ38j75R8L8j68J83o9
$$ -82 76 23 -76 131 -27 -36 108 -75 34 71 -99 85 15 -96 112 -30 -39 99 -76 22 60 -108 75 6
6774Fj02K00j46%J36j70Q7M8j56J78o6j13K03j34j2J42j82J16M0j84K00p5j01
$$ 6 -96 104 -42 -42 94 -76 11 59 -97 81 15 -98 105 -29 -41 101 -81 35 75 -109 91 16 -85
6797h5K02j49qJ42j80J13L3j70J88q0q3J73j51QJ54j90J04L7j71K04r6r5K07j48
$$ -85 117 -32 -40 102 -78 35 68 -102 86 6 -77 96 -55 -47 107 -83 21 58 -113 91 -5 -100 107 -41
6821d1LJ32j69R2M4j64J79o2j26K14j47j3J74j81R3Pj01J45n8j36K08j34j3J44
$$ -41 -38 94 -75 17 61 -103 76 14 -112 102 -45 -58 116 -65 28 35 -66 79 21 -115 93 -41 -54 90
6845I0j28M6O2j80J92n0j25J90j23j7J44j82J02N2j70J66n1j07J85j31LJ23j72
$$ 90 -38 8 70 -110 82 32 -93 97 -26 -43 101 -81 21 73 -97 69 18 -89 96 -35 -32 91 -81
6868h1J01L8j78J89m5j14J79j27KJ27j75R2M6j63J71m4j03J81j21pJ22j73R4N7
$$ -81 20 58 -120 69 24 -90 89 -38 -36 91 -84 8 54 -109 62 18 -85 96 -25 -32 90 -83 11 68
6892F8j51J57m2j09J74j19rJ24j61Q5N9j60J48m3q9J69j41j4J40j71R4N5j54J45
$$ 68 -83 74 32 -77 97 -22 -31 93 -68 17 76 -84 64 21 -68 101 -40 -54 86 -85 9 64 -90 55
6916E5n0q7J72j34qJ43j66Q2N9j63J53l3j06J76j24jJ33j68Q7N0j55J47m0q6J51
$$ 55 5 -82 90 -44 -52 91 -75 7 66 -97 56 23 -83 93 -31 -32 101 -67 20 70 -85 62 22 -64 87
6941H7j11j2J38j65P8N6j57J49m1r3J54j13j3J32j59Q2N1j59J52m3q7J66j31k
$$ 87 -24 -36 102 -63 15 71 -86 63 22 -71 83 -30 -43 89 -70 12 63 -96 56 13 -74 92 -39 -41
6965d1J29j62P7N9j59J54n4q0J69j30j2J36j62Q0O4j48J45n5q4J65j23j5J46j65
$$ -41 88 -74 3 62 -97 57 3 -77 92 -38 -50 86 -76 4 68 -80 65 10 -74 91 -32 -47 99 -66
6989f6P8N5j54J56n3r7J69j17j6J41j70J06M5j67J51l0q6J53j33J0J48k11R4N6
$$ -66 12 67 -87 69 16 -81 88 -29 -45 96 -74 32 77 -90 61 31 -55 98 -35 -25 123 -88 6 62
7013F2j32J25m0j02J75j23k8J47j53N9P4j48J41l8r3J71j23j9J39j70R2N4j52
$$ 62 -70 55 15 -87 88 -35 -63 84 -69 -10 64 -84 57 19 -74 97 -26 -45 94 -76 16 70 -82
7036h2J54m6j01J68j20j8J50j65O2N9j37J42n0r3J71j21k9J52j64O5N3j38J36
$$ -82 72 26 -75 93 -27 -45 105 -60 2 61 -76 66 16 -77 94 -27 -56 96 -68 -3 50 -88 48
7059D8l9q3J49p7n2J20j27P2O0j49J64n8j32J79j77L5J51j30M9M8j17J41n4r5
$$ 48 9 -74 75 -2 -54 66 -61 11 71 -78 86 28 -104 75 -102 -67 84 -46 3 51 -66 75 21 -74
7083g4J79j25k5J48j56P5M9j54J57n0r7J69j19j2J27j57P4O0j53J43m6r4J70j18
$$ -74 105 -20 -45 103 -53 22 71 -83 74 24 -73 96 -23 -35 92 -65 9 69 -84 59 13 -81 89 -29
7107b9j6J29j52O6N8j49J44l5j06J74j15k5J38j47O9M9j37J41l7q7J58j09k2J27
$$ -29 -45 84 -68 -2 56 -93 51 16 -90 84 -31 -56 82 -65 4 53 -84 57 20 -67 91 -18 -40 87
7131H7j36P0N2j47J48m8j00J81j17k4J35j51O9N4j58J57n3j07J93j32j6J29j51
$$ 87 -49 21 73 -74 74 26 -74 107 -10 -34 101 -50 19 73 -85 72 19 -88 105 -27 -43 86 -65
7154f5Q5M3j55J60n7r3J79j31j4J29j45Q0N2j62J65n6r3J63j01l2J41j43O9N1
$$ -65 20 63 -92 68 11 -82 97 -34 -48 81 -64 16 68 -94 71 15 -78 85 -16 -48 93 -50 19 70
7178G0j50J52l9j01J59r5j7J00j36P6O2j60J53m2j02J60j01k5J29j46N3L0j15
$$ 70 -80 72 33 -68 91 -4 -21 79 -57 19 81 -79 74 32 -70 90 -11 -36 93 -53 0 30 -85
7201h5J40k9j06J70j19j9J31j70R4M4j44J48m2r2J51j02rJ33j55P9N2j40J33l7
$$ -85 55 26 -80 90 -29 -48 83 -87 7 51 -93 55 13 -79 72 -30 -39 94 -61 18 70 -70 63 26
7225B6j06J74j10k3J29j53P7N7j38J35l0j07J50r8lJ13j53P0N8j43J28k1r1J39
$$ 26 -80 94 -16 -39 90 -63 14 71 -67 68 38 -69 81 -17 -20 93 -60 10 68 -75 53 32 -59 80
7249H0j06j0J24j47O8L1j21J25k9q3J42j07KJ19j54P2M9j35J36l0q8J48j03rJ24
$$ 80 -26 -36 88 -59 9 40 -81 44 15 -68 74 -33 -31 88 -66 6 55 -80 56 26 -62 86 -17 -26 98
7274I8j56P9N6j45J38n2q9J61j16OJ23j46O0N0j30J24l1r2J45j07j7J29j44N8
$$ 98 -58 21 77 -68 70 18 -71 90 -26 -20 103 -43 17 67 -63 61 30 -62 83 -24 -41 88 -56 2
7298BO0j39J25l2q4J49r8j2J06j37O0O8j33J16m1q4J46r1k2J30j48P5O0j47J18
$$ 2 62 -77 48 16 -68 81 -17 -29 77 -60 0 68 -65 51 10 -74 72 -19 -41 89 -59 16 76 -71 47
7323D7k1q0J34r8j2J19j47O7N4j21J19l6p9J41j01j7J13j37N4O7j39J22k5q6J33
$$ 47 26 -54 80 -18 -30 89 -58 9 63 -58 61 25 -54 87 -14 -31 82 -55 -1 66 -73 49 24 -62 71
7348G1r7j7J12j28O0N7j31J03nq7J36r4j7J18j33M7N9j16J21m5q5J49r6j8J20
$$ 71 -26 -43 69 -59 1 58 -73 30 25 -62 74 -20 -37 81 -52 -5 54 -62 59 14 -71 78 -18 -36 84
7373H4j39O6N3j17J17m1p2J27r8j6J19j30O4L8j27J21m2p6J46j01j4J11j23N4
$$ 84 -55 11 64 -53 64 23 -49 78 -20 -36 83 -47 17 55 -72 49 7 -69 77 -24 -38 73 -50 4
7397DM8j18J11m2p0J34r0k6J21j23M6O3j37J21j8q2J25q8rJ12j25N0M7j09J04
$$ 4 52 -66 45 3 -67 67 -23 -49 72 -51 -5 58 -79 42 24 -58 67 -21 -30 82 -43 7 54 -55 49
7422D9k4q5J37q3l1J16j21N3M3j13J11k8q8J41q8k6J10j31N4O0j13R6k6q7J34
$$ 49 25 -60 77 -6 -37 79 -42 11 54 -59 52 24 -64 77 -11 -37 73 -58 -4 56 -57 39 13 -74 60
7447F0q5j9J09j17N6M0j20J17j3q8J32q8k6J13j13N6M3j13J01k3p9J22p9j8R8
$$ 60 -25 -44 65 -52 4 44 -76 41 28 -60 72 -16 -42 71 -42 14 57 -56 45 22 -57 65 -14 -32 66
7472F6j08N5L6j10J06k1q0J29p6k2R4j07M3M9j16J00k5p4J23p6l1J00j05N3M5
$$ 66 -42 13 49 -61 45 24 -56 73 -3 -25 69 -38 5 54 -62 38 13 -61 62 -14 -45 55 -50 3 48
7497D8j09R6k2q8J44q7rQ9r3K3P1j16J14n1o7J08n9l6J13j23N9Q6j43R5j8p3J15
$$ 48 -61 35 13 -75 69 -18 -27 62 -31 -8 63 -53 61 10 -57 51 -8 -44 69 -54 5 91 -52 43 25 -48 67
7524F7n5p1J14r1K3M8q2R9n6o1R4o9pO2o9N2N3j39J11J7q4R0l7k4O3p8k5Q2p2
$$ 67 12 -59 55 -36 -13 35 -47 52 -4 -65 29 -40 -47 15 -54 -2 51 -88 23 40 -44 46 9 -15 48 -30 -55 27 -45
7553d5P5J1j36J54o0k0J25j35N0P8j62J02j9q2J34r5j7J51j22K8M7j21R5k8m7
$$ -45 30 41 -95 59 -1 -21 104 -31 19 97 -65 37 18 -64 70 -25 -42 109 -13 15 62 -59 36 8 -39
7578c9J28o6p0P6j10N3P1j10O8L0q1P5m6n8J70j49L6Q5r5N6j1n3P9n6j6R9j09
$$ -39 89 23 -47 29 -81 -28 43 -67 1 31 -50 25 -21 -79 91 -58 -22 63 -32 24 13 -40 39 -17 -33 66 -43
7605d3M2N5j08P5J5r0J17o8l0J07j02L0O4j24R7pq3J21p2l3R9r8M0N3j22R7j2
$$ -43 -1 54 -54 21 36 -54 63 -5 -35 72 -30 0 64 -60 37 30 -53 68 -4 -37 62 -36 4 57 -65 32 20
7632B0p0R1n1k2Q9r5K4O4j13Q0Nq2J06p2k8J09r4L0O2j06P7lp0J05o4k2R7j00
$$ 20 -50 41 -10 -32 57 -38 -14 50 -63 17 22 -60 46 -26 -54 55 -39 -9 53 -53 24 21 -49 56 -8 -30 67 -33
7660c3K5N5r5P8np5J09o1k6Q9r4L6M5j01P6Jp2J00o5l0J06j03L4N1j08Q7Or2J09
$$ -33 -8 47 -48 30 25 -50 59 -2 -28 61 -33 3 48 -53 23 24 -48 52 -13 -43 63 -40 -6 45 -63 24 30 -62 47
7689D7o0k1Q9q5K6L9r1Q1j5o2J02n7k8Q9p7J4O0r1O4mo2J03o0j8P7q2J9M8r9R6
$$ 47 -13 -34 55 -30 -4 35 -56 25 10 -52 50 -7 -35 54 -23 -9 51 -40 24 20 -42 61 1 -17 60 -22 -3 45 -54 42
7719D2j8o5J00o3k8P9o8J7N5o8K7J2m7P8l9q4Q7k1qJ01j38K6O9q4J10r6j3O7o2
$$ 42 24 -41 59 -4 -32 47 -21 -4 51 -17 10 22 -25 53 14 -70 17 -4 -12 89 -49 -23 46 -38 72 -24 -37 30 -32
7748c2K1O0q7O9Lp6Q6m6k7R4r2K6M9p8N6Po3Q4m7k9P9q1K0N5r9P0Pp5Q5l8l6Q1
$$ -32 -11 49 -38 31 34 -42 44 -2 -29 65 -27 -1 48 -30 26 33 -30 54 7 -22 57 -24 -4 51 -48 22 29 -46 39 1 -35 46
7780D6p2K0L8p7O8j3o3R1l9m0Q6q9M1M2q0O4j0n6Q1m3j6P8p8K3N0r8P9kp1R2m2
$$ 46 -26 -6 32 -45 23 10 -53 38 -1 -41 45 -44 -3 39 -41 23 13 -43 38 -5 -21 57 -21 2 52 -46 33 31 -40 52 10
7811A0l2P4o6J7M5p6O1j5p1R0l9l8Q2o5J3M4p8N7J2p0P6m0k8P2n9J8M0p5N8J1
$$ 10 -22 52 -14 3 48 -28 33 18 -53 37 -2 -40 42 -23 -10 34 -44 13 25 -45 31 -9 -37 35 -24 -6 34 -41 17 28
7841B8p5Q1l3l5Q2p1J1M5o6N1Oo4P1k1l5P0o8J6N0p7N7Ln4Q6n1m2Q4p0J5L5o8
$$ 28 -47 34 1 -34 48 -23 -12 33 -33 18 24 -40 31 10 -25 45 -23 -7 43 -34 23 26 -28 58 7 -35 49 -21 -6 29 -39
7872c9M7J0n9P0l1m0P2n3J1M9p7N8lo1P1k2l3N9n4J3N1p6O4Jo3O1j8l0O5n5ON6
$$ -39 8 18 -41 29 -2 -42 30 -23 -12 37 -40 18 15 -46 25 3 -30 29 -25 -12 39 -37 27 28 -35 26 8 -22 43 -12 -6 50
7904E0q9O5On9P7m0k9P1q0K4L5p0N0K0o8O9k6l3P1o6J5M5o9M1Om7O0k9l6O2m7
$$ 50 -39 26 32 -27 50 10 -19 52 -28 -4 31 -39 11 31 -37 32 6 -27 44 -22 -7 38 -31 10 16 -31 29 0 -36 26 -21
7935b1PM1n4L6K5o3N3j5m0O5m9KM9o5L6K4o3P0k1l0O0n4JN1p6M9J7o6O3k7l4O1
$$ -21 -14 27 -27 9 34 -29 24 9 -31 34 -15 -13 36 -29 7 31 -32 38 17 -13 47 -7 -6 45 -31 18 35 -31 32 5 -29 32
7967C2m4lN5o8L3Rn6O9k7l2P0n9pN3m8K4Om2N4k1k9O2m2jM7o7M3J8o1N5j6k7O1
$$ 32 -12 -15 40 -28 5 14 -42 27 0 -32 38 -21 -28 25 -23 1 7 -35 19 -2 -31 31 -11 -12 35 -32 11 29 -32 23 7 -20 41
8000D1n8ON6p1L5J7n6O2j8m0O4m8MM7o6K4K2n7N7on0N9m2KM6o2L3J1n1N3ql1O3
$$ 41 -17 -11 45 -26 9 26 -30 32 14 -26 38 -10 -6 41 -25 -1 21 -36 21 15 -35 24 -18 -16 30 -32 1 12 -39 14 6 -25 38
8033C8m3jL9o5L6J5n4O7k0m5O2l1j5N6o0L1K4o5N9qm4O4l3j4M4n1K4K4o3N0Mn7
$$ 38 -5 -6 33 -32 4 19 -35 32 12 -33 29 -2 -17 39 -21 10 34 -31 28 20 -24 40 7 -7 37 -14 10 34 -29 21 25 -32
8065c2N9l3j9O6o9J8L1m8L7mm8P0l9qN7n9J3K8m9N0Lo9P4m0qM9n9L1K5n2L9Kl8
$$ -32 27 -6 -25 41 -28 -10 21 -27 10 6 -42 28 -11 -19 38 -21 -8 20 -29 21 24 -45 29 -11 -19 30 -29 2 27 -25 14 16 -22
8098b2N7m5lN3n2J5J8m6M6%m3N8m8j0O1o0J5K2n3N6nm8O7n2LM8o9K6L1m9L0Om3
$$ -22 35 -10 -13 40 -12 3 21 -25 21 21 -22 36 -12 -22 39 -21 -6 16 -37 19 14 -34 33 -19 -16 32 -37 -11 20 -29 1 7 -36
8131c6O3l7lN4n5J0K7n0N1lm9O2m3lN1n9K7L1p3N5J0o2N7k4l0O3n0J7J8n2M7p
$$ -36 27 -10 -13 41 -14 -4 23 -27 24 21 -28 34 -9 -12 39 -20 7 38 -35 20 30 -32 25 1 -29 34 -16 1 19 -33 14 7
8163Gl6N1l3k1N9n3J6L0o8N5ln8P4l2j3N6n8J5L6o4N1Jm9O0k9j1N5o6
$$ 7 -29 22 -11 -32 27 -26 -10 20 -48 7 4 -54 20 -12 -25 31 -27 -12 24 -40 11 12 -37 23 -6 -17 38 -28
8191b8
$$ Imaginary data points
##PAGE= N=2
##DATA TABLE= (X++(I..I)), XYDATA
0@%%%%%%%%%%%%%qJ6j6J6j6K2l0L2m0M8n6O4p2Q8j02J15j31J50j69J89k14K42
$$ 0 0 0 0 0 0 0 0 0 0 0 0 0 0 -8 8 -8 8 -8 14 -16 16 -24 24 -32 32 -40 48 -54 61 -70 80 -89 100 -114 128
35A28k71L05l42L80m22M68n20N77o38P05p76Q54r43J039j142J258j386J528j688
$$ 128 -143 162 -180 200 -222 246 -274 303 -335 370 -406 448 -495 544 -598 660 -726 802 -886
54h86J865k066K297k565K880l253L703m261M972n907P196r077J2055j7418K9649
$$ -886 979 -1087 1210 -1355 1525 -1728 1975 -2286 2686 -3221 3975 -5102 6953 -10465 19184
69A9184r6930N585K36077l02852J60219Q3502k59976K56189p7002j57146K82998
$$ 19184 -77746 -72161 163916 -138936 21283 104785 -155191 100998 23996 -133150 149848
80A49848k12385n046K11343k61720J33828P7678k31887K32270q0352j28770K51454
$$ 149848 -62537 -67583 143760 -117960 15868 93546 -138341 93929 13577 -115193 136261
91A36261j98275O282J88300k48822J40432N9446k18744K30521q5022j24727K52332
$$ 136261 -62014 -55732 132568 -116254 24178 83624 -135120 95401 10379 -114348 137984
102A37984j99363L568J91922k47814J30512P2080k22993K20388o5464j35663K42477
$$ 137984 -61379 -57811 134111 -113703 16809 88889 -134104 86284 20820 -114843 127634
113A27634j75282j4877J87735k24618J07362P5645k02809J94363n4638j22926
$$ 127634 -47648 -62525 125210 -99408 7954 83599 -119210 75153 20515 -102411
123a02411K16450j58631q920J64978k05351J07346O0184j85487J88172o2408j09946
$$ -102411 114039 -44592 -53512 111466 -93885 13461 73645 -111842 76330 13922 -96024
134i6024K07804j59702j659J58892k03150J08507N9543j85841J85010n5257j15791
$$ -96024 111780 -47922 -49581 109311 -93839 14668 74211 -111630 73380 18123 -97668
145i7668K04086j46464j3634J59661j89251Q9362O7599j75297J62393l9091j11494
$$ -97668 106418 -40046 -53680 105981 -83270 6092 73691 -101606 60787 21696 -89798
156h9798J82551j24717j6587J42324j67599Q0365N7805j56780J50211m1380r7570
$$ -89798 92753 -31964 -48551 93773 -73826 6539 64344 -92436 57775 16395 -81175
167h1175J70053j23021q228J32031j64721Q5128N1590j55023J53211m3402r8530
$$ -81175 88878 -34143 -42371 89660 -75061 10067 61657 -93366 59845 16443 -82087
178h2087J72208j23360j2109J36535j64537P8344O0037j55888J44252l1184j02768
$$ -82087 90121 -33239 -45348 91187 -73350 4994 65031 -90857 53395 22211 -80557
189h0557J62496j07947j9886J29471j48064O6454N8237j41094J28136k7567r1520
$$ -80557 81939 -26008 -45894 83577 -64487 1967 60204 -80890 47246 19679 -71841
200g1841J45689r9522j3848J15422j37149O6916M8733j31557J24550l1275q4824
$$ -71841 73848 -25674 -39522 75900 -61249 5667 54400 -77157 47393 16118 -68706
211f8706J41339r9482j1075J13709j36492O5381N0828j32533J21508k5276q8781
$$ -68706 72633 -26849 -37924 75785 -60707 4674 55502 -77031 44477 19201 -69580
222f9580J39396r1545j8647J14352j29211N4934N5232j26513J09900j8063q4724
$$ -69580 69816 -21729 -40376 73976 -55235 -301 54931 -71582 38318 20255 -64469
233f4469J28452q3387j7635J05274j20754N3665M9245j18469J06510k1217p7787
$$ -64469 63983 -19404 -37039 68235 -52519 1146 50391 -68078 38432 17215 -60572
244f0572J23715q4911j2661J01365j20547N6280M7131j17912J07053k1220p8828
$$ -60572 63143 -21768 -34429 66936 -53611 2669 49800 -68112 38941 17721 -61107
255f1107J23512q2572j6199J02941j17045M9425N1912j14929R7462j3483p8183
$$ -61107 62405 -20167 -36366 66575 -50470 -1045 50867 -64062 33400 19917 -58266
266e8266J14427p2157j9234R6289j05752M2804M8716j05092Q8655j3105p0485
$$ -58266 56161 -15996 -35230 61059 -44693 -1889 46827 -58265 30390 17285 -53200
277e3200J06068o9691j4739Q9987j02754M4355M4542j02463Q9252j5436o8990
$$ -53200 52868 -16823 -31562 58425 -44329 26 44568 -57895 31357 15921 -53069
288e3069J07081p1368j4724R1987j04777M3178M8101j04766Q7906j1012p2425
$$ -53069 54012 -17356 -32080 59907 -44870 -1692 46409 -58357 29549 18537 -53888
299e3888J06201o6256j9930R1899r9119L6611M9640r9113Q0064p839o8076R8142
$$ -53888 52313 -13943 -33873 58026 -41093 -4482 45158 -53955 26109 18270 -49806 48336
311D8336o1509j8164Q5162r2668L5608M4956r2595P6930r944o3367R4252o0994
$$ 48336 -13173 -31337 53825 -38843 -3235 41721 -50874 26056 16112 -47255 46997 -13997
323a3997j5831Q2451r0875L5235M4258r1202P5235q679o4109R3389n7833j9311
$$ -13997 -29828 52623 -38252 -3017 41241 -49961 25274 16595 -47514 45875 -11958 -31269
335c1269Q3254q7250K9600M7016q8560O8938m182o3086Q8037n2390k0330P9208
$$ -31269 51985 -35265 -5665 41351 -47209 21729 17547 -45539 42498 -9892 -30222 48986
347D8986q1705K7200M4192q3589O6312n593n9217Q5303n2691j7732P6581q1173
$$ 48986 -32719 -5519 38673 -44916 21396 15803 -43414 41889 -10802 -28534 48047 -33126
359c3126K8707M1959q2498O7318p026n8914Q5903n2749j8825P7239q0095K6262
$$ -33126 -4419 37540 -44958 22360 15334 -43580 42323 -10426 -29251 47988 -32107 -5845
371e845M3733q1371O3684l538n9258Q2031m7258k1637P4301p3039K1150M2450
$$ -5845 37888 -43483 20201 16663 -42595 39436 -7822 -29459 44842 -28197 -7047 35403
383C5403p4703N7231k406n4680P5535m3998j9569O9198o8837K0856L9162p1038
$$ 35403 -39300 17931 15525 -39155 36380 -7618 -27187 42011 -26826 -5970 33192 -37846
395c7846N5958l833n2589P4407m3920j8930O8573o8632K0870L9413p1757N6123
$$ -37846 18112 14279 -38310 36097 -7823 -26753 41820 -26812 -5942 33471 -38286 17837
407A7837k611n4432P5023m2034k1862O9556o6442J7498M0726o9868N2655m55n3196
$$ 17837 15226 -39206 35817 -6217 -28079 41477 -24965 -7467 33259 -36609 16046 15591 -37605
420c7605P1343l9049k1569O6042o2700J6657L8019o5981N0770j639n0129O8565
$$ -37605 33738 -5311 -26880 39162 -23538 -6881 31138 -34843 15927 14288 -35841 32724
432C2724l8424j9768O3179o0853J6958L6234o4084M9755j714m9280O7157l6835
$$ 32724 -5700 -25468 37711 -23142 -6184 30050 -34034 15721 14007 -35273 31884 -4951
444d951k0646O2352n8503J4701L6873o2486M6585Q89m9023O3823l2999k1702N9751
$$ -4951 -25597 36755 -21748 -7047 29826 -32660 13925 14814 -34209 29614 -3385 -25087 34664
457C4664n4535J2730L5413n9229M4315O24m6744O1539l2545k0053N7646n4027
$$ 34664 -19871 -7141 28272 -30957 13358 13982 -32762 28777 -3768 -23821 33825 -20202
469b0202J4058L3872n8887M5145l68m6447O1898l3074j9765N7675n4327J4246
$$ -20202 -6144 27728 -31159 13986 13618 -32829 29069 -4005 -23770 33905 -20422 -6176
481f176L4253n9345M4703R38m7241O0839l0705k1283N6659n1232J1617L4067n6245
$$ -6176 28077 -31268 13435 14373 -32868 27971 -2734 -24017 32642 -18590 -6973 27094 -29151
494b9151M0919K304m4835N6437k7923k0045N2692m7965J1307L1748n3308L9259
$$ -29151 11768 14072 -30763 25674 -2249 -22294 30398 -17567 -6260 25488 -27820 11439
506A1439J828m2738N4252k7103j8961N0821m7055J1699L0974n3017L9253K156
$$ 11439 13267 -29471 24781 -2322 -21283 29538 -17517 -5818 25156 -27861 11392 13548
518A3548m3125N4220k6476j9826N1194m6635J0578L2010n2950L7980L642m3287
$$ 13548 -29577 24643 -1833 -21659 29535 -17100 -6522 25488 -27462 10518 14160 -29127
530b9127N2722k4860k0020M9788m5027J0186L1013n1225L6963L048m1601N1117
$$ -29127 23595 -1265 -21285 28503 -16524 -6338 24675 -26550 10413 13461 -28140 22977
542B2977k4748j8548M8107m4313J0766K9906n0194L6254K937m0575M9664k3881
$$ 22977 -1771 -20319 27788 -16525 -5759 24147 -26047 10207 13144 -27431 22233 -1648
554a648j8136M6888m2962R942K9745m9062L4340M337m0120M7401k1306j8828M5178
$$ -1648 -19784 27104 -15858 -5916 23829 -25233 9107 13444 -26676 20725 -581 -19409 25769
567B5769m0119P966K9149m6392L1770M781l8111M4961k0474j7685M3369l9358
$$ 25769 -14350 -6384 22765 -23627 8143 12924 -25187 19774 -700 -18385 24984 -14374
579a4374Q382K8175m5619L1758M232l7331M4715k1099j7005M3266l9945Q942K8290
$$ -14374 -5992 22183 -23436 8322 12554 -24777 19938 -1161 -18166 25100 -14845 -5903 22387
592B2387m6030L2046M398l7662M4677k0820j7456M3354l9161P856K8695m4790
$$ 22387 -23643 8403 12801 -24861 19816 -1004 -18460 24894 -14267 -6411 22284 -22506
604b2506K9981N271l6454M2122j9143j6850M1075l6746P186K7168m2238K8112
$$ -22506 7475 12746 -23708 18414 -729 -17579 23496 -13250 -6064 21104 -21134 6978
616F978M841l4230L9944j8449j5727L9341l5427O902K6206m0835K7037M833l3216
$$ 6978 11819 -22411 17533 -916 -16643 22698 -12729 -5827 20379 -20456 6581 11414 -21802
629b1802L8980j7992j5563L8904l4960O237K6468m0461K6219N596l3118L8308
$$ -21802 17178 -814 -16377 22527 -12433 -6196 20272 -20189 6030 11626 -21492 16816
641A6816j7191j6008L8462l4096N565K6233l9309K5493N237l1956L7541j7625
$$ 16816 -375 -16383 22079 -12017 -6452 19781 -19528 5965 11202 -20754 16787 -838
653h38j5133L7779l4025O042K5687l8690K5287M826l1240L6788j7531j4691L7053
$$ -838 -15971 21808 -12217 -6175 19512 -19178 6109 10935 -20305 16483 -1048 -15739 21314
666B1314l3190N820K5249l7674K4234N032l0672L5532j6225j5024L6077l1106
$$ 21314 -11876 -6056 19193 -18481 5753 10785 -19887 15645 -580 -15604 20473 -10633
678a0633M293K4781l5607K2041N392k9117L3495j5012j4470L4470k9653L916K3694
$$ -10633 -6340 18441 -17166 4875 10267 -18850 14645 -367 -14837 19633 -10020 -6104 17590
691A7590l4268K1468M927k8143L3152j5233j4064L4226k9832M081K3520l4258
$$ 17590 -16678 4790 9717 -18426 14726 -507 -14571 19655 -10177 -6096 17424 -16834
703a6834K1826M728k8175L3562j5576j4327L4537k9981L874K3850l4153K1563
$$ -16834 4992 9720 -18455 15107 -469 -14796 19741 -10240 -6366 17484 -16669 4894
715D894N070k8218L2923j4805j4643L3676k8486L311K3001l2409K0523M601k6975
$$ 4894 9964 -18254 14669 -136 -14779 18897 -9589 -6278 16723 -15686 4837 9438 -17537
728a7537L1599j4335j4083L2450k7081K948K2149l0971J9420M456k6042L0412
$$ -17537 14062 -273 -14356 18094 -8987 -6039 16110 -14861 4559 9015 -17027 13385
740A3385j3496j3871L1571k5974K428K1702l0272J8719M743k5884K9980j2644
$$ 13385 -111 -13982 17589 -8385 -5957 15745 -14527 4192 8935 -16949 13031 387
752C87j4327L1255k5124J665K1450k9532J8237M729k5350K9667j2628j4079L0776
$$ 387 -13940 17315 -7809 -6144 15306 -14226 4011 8740 -16610 13057 429 -13650 17126
765A7126k5099J985K0973k9321J8662M360k5218K9766j2837j4030L0448k4829
$$ 17126 -7973 -5988 14985 -14336 4326 8686 -16532 13234 397 -13633 16815 -8014
777h014K097K0638k8813J8497M278k4950K9092j2285j4153K9772k3595J476K0313
$$ -8014 -5917 14721 -14092 4405 8683 -16267 12825 540 -13613 16159 -7436 -5960 14353
790A4353k7570J7164M665k4235K7379j0930j3938K8234k1757J005J9256k6077
$$ 14353 -13217 3947 8612 -15623 11756 826 -13112 15122 -6635 -5630 13626 -12451
802a2451J6190M358k3227K6450j0506j3474K7531k1267R74J8812k5834J6047M353
$$ -12451 3739 8097 -15130 11320 814 -12660 14871 -6396 -5422 13390 -12444 3603 7956
815G956k3015K6374j0438j3295K7364k1527J204J8749k6184J6432M559k3336K6478
$$ 7956 -15059 11315 877 -12418 14946 -6581 -5377 13372 -12812 3620 8179 -15157 11321
828A1321j0149j3564K6996k1103J080J8383k5486J6145M437k2649K5603r936j3079
$$ 11321 1172 -12392 14604 -6499 -5419 12964 -12522 3623 8060 -14589 11014 1078 -12001
841a2001K5976k0388J235J7767k4565J5508M405k1912K4313r285j2642K4830j9260
$$ -12001 13975 -6413 -5178 12589 -11976 3532 7937 -13975 10338 1053 -11589 13241 -6019
854f019J082J7194k3632J4620M553k1405K3270q491j2445K4080j8412P60J6916
$$ -6019 -4937 12257 -11375 3245 7798 -13607 9663 1172 -11273 12807 -5605 -4845 12071
867A2071k3115J3923M793k1006K2564p962j2093K3402j8153J030J6347k3059J4210
$$ 12071 -11044 2879 7672 -13334 9230 1268 -10825 12577 -5576 -4546 11801 -11258 2952
880B952M514k0788K2763q279j1804K3328j8518J323J6235k3116J4380M499k0540
$$ 2952 7466 -13322 9441 1162 -10642 12686 -5832 -4509 11726 -11390 2990 7489 -13051
893a3051K2484q319j1499K2850j8410J427J6110k2700J3924M801k0147K1365p561
$$ -13051 9433 1114 -10385 12465 -5945 -4518 11592 -11108 2816 7617 -12530 8835 1274
906A274j1357K1712j7146J111J5479k1363J2891M686j9135K0079p108j0799K0815
$$ 1274 -10083 11629 -5517 -4406 11073 -10290 2601 7287 -11848 8231 1123 -9676 11139
919A1139j6417J084J5057k0795J2327M700j8700J9486o866j0421K0504j6338J191
$$ 11139 -5278 -4194 10863 -9932 2395 7095 -11605 7881 1015 -9406 11098 -5240 -4049
932d049J4895k0876J2367M660j8706J9668o922j0384K0631j6556J136J4975k0915
$$ -4049 10846 -10030 2337 6997 -11709 7959 1037 -9347 11284 -5272 -4136 10839 -10076
945a0076J2266M725j8374J9453p006j0070K0264j6529J259J4686k0534J2128M634
$$ -10076 2190 6915 -11459 7994 988 -9082 11182 -5347 -4088 10598 -9936 2192 6826
958F826j7884J8911o886r872J9684j5942R73J4450j9600J1291M747j7171J7841
$$ 6826 -11058 7853 967 -8905 10779 -5163 -4190 10260 -9340 1951 6698 -10473 7368
971G368o444r611J9006j5216O74J4346j8934J0460M978j6757J7000n883r505J8481
$$ 7368 924 -8687 10319 -4897 -4223 10123 -8811 1649 6627 -10130 6870 987 -8518 9963
985I963j4556N20J3962j8450J0222M651j6370J7029o202r228J8702j4884N86J4012
$$ 9963 -4593 -4073 9889 -8561 1661 6312 -10058 6971 769 -8459 10243 -4641 -4055 9957
999I957j8624J0334M494j6230J7224o483q993J8740j5182P00J3958j8611J0316
$$ 9957 -8667 1667 6161 -10069 7155 672 -8321 10419 -4763 -4063 9895 -8716 1600
1012A600M518j6017J7020o348r009J8363j4690L48J3726j7729R596M594j5273
$$ 1600 6118 -9899 7121 773 -8236 10127 -4563 -4215 9511 -8218 1378 5972 -9301
1025i301J6031n926q763J7523j3835R4J3304j6803Q958M524j4756J5343n562q724
$$ -9301 6730 804 -7959 9564 -4271 -4177 9127 -7676 1282 5806 -8950 6393 831 -7893
1039g893J7119j3181k03J3105j6266Q564M377j4499J5236n604q661J7221j3203
$$ -7893 9226 -3955 -4158 8947 -7319 1245 5622 -8877 6359 755 -7906 9315 -3888
1052c888k53J3177j6383Q552M379j4545J5325n600q592J7181j3221j65J2862j6271
$$ -3888 -4141 9036 -7347 1205 5584 -8961 6364 764 -7828 9353 -3868 -4033 8829 -7442
1066g442Q773M058j4372J5472n723q556J7059j3048l27J2671j5758Q420M023j3872
$$ -7442 1331 5389 -8983 6489 766 -7790 9269 -3779 -4106 8565 -7193 1227 5250 -8622
1080h622J4906n426q430J6400j2353n66J2298j4989P893M101j3474J4173m858
$$ -8622 6284 858 -7572 8828 -3525 -4091 8207 -6782 1111 5212 -8262 5911 1053
1093A053q525J5775j1431r20J1863j4163P450L917j3076J3809m768q349J5558
$$ 1053 -7472 8303 -3128 -4048 7815 -6348 1102 5019 -8057 5752 984 -7365 8193
1106H193j1267q16J1654j4127P616L678j3134J4051m908q327J5650j1388o45J1496
$$ 8193 -3074 -3890 7764 -6363 1253 4931 -8203 5848 940 -7387 8263 -3125 -3770 7726
1120G726j4261P899L455j3132J4285n070q283J5676j1376o74J1347j4049P733
$$ 7726 -6535 1364 4819 -8313 5972 902 -7381 8295 -3081 -3755 7592 -6457 1276
1133A276L530j2896J3822m666q188J4980j0690q10J0818j3314P387L424j2474
$$ 1276 4806 -8090 5732 1066 -7122 7858 -2832 -3642 7176 -6138 1249 4673 -7801
1146g801J3287m256q230J4429r933j139J0496j2596O841L483j2069J2711l977
$$ -7801 5486 1230 -7000 7429 -2504 -3643 6853 -5743 1098 4581 -7488 5223 1246
1159A246q104J4052r642j135J0406j2553O806L566j2177J2641l838q110J3979
$$ 1246 -6858 7194 -2448 -3583 6823 -5730 1076 4642 -7535 5106 1268 -6842 7137
1172G137r597r95J0248j2625P052L333j2183J2843m019p984J3988r758p99J0174
$$ 7137 -2460 -3455 6793 -5832 1220 4553 -7630 5213 1194 -6790 7198 -2560 -3359 6815
1186F815j2710P114L350j2137J2692l851p910J3626r403q71R881j2288O775L429
$$ 6815 -5895 1219 4569 -7568 5124 1273 -6637 6989 -2414 -3285 6596 -5692 1083 4512
1200D512j1802J2095l416p828J3057q798j143R677j1674O149L638j1374J1299
$$ 4512 -7290 4805 1389 -6439 6618 -2180 -3323 6354 -5320 829 4467 -6907 4392
1213D392k936p617J2421q371j078R403j1480O060L663j1318J1184k851p579J2332
$$ 4392 1456 -6161 6260 -2111 -3189 6214 -5266 794 4457 -6861 4323 1472 -6107 6225
1227F225q386r76R377j1591O191L612j1329J1275l081p366J2435q723p47R469
$$ 6225 -2161 -3137 6240 -5351 840 4452 -6877 4398 1317 -6049 6386 -2337 -3084 6385
1241F385j1844O321L689j1426J1181k921p308J2133q520o82R242j1576O101L687
$$ 6385 -5459 862 4551 -6875 4306 1385 -5923 6210 -2310 -2992 6250 -5326 775 4462
1255D462j1108J0728k681p165J1715q081q96R095j1071N505L897j0691R999k253
$$ 4462 -6646 4082 1401 -5764 5951 -2130 -3026 6069 -5002 503 4400 -6291 3708 1455
1269A455o974J1180p637j012Q905j0720N185L997j0516R690k084o887J1036p568
$$ 1455 -5519 5661 -1976 -2988 5917 -4803 382 4379 -6137 3553 1469 -5418 5618 -1950
1283a950j044Q919j0731N158L997j0443R690k221o694J1047p885p45Q918j0993
$$ -1950 -2994 5925 -4806 352 4349 -6094 3596 1375 -5319 5728 -2157 -2902 6016 -4977
1297d977N433L912j0501R847k391o664J1091p918p72Q874j0805N291L846j0230
$$ -4977 456 4368 -6133 3714 1323 -5341 5750 -2168 -2940 5934 -4871 420 4266 -5964
1311e964R582k399o462J0860p720r03Q839j0388M743M026r838Q874j976o307J0323
$$ -5964 3618 1219 -5243 5617 -2103 -3006 5833 -4555 188 4214 -5624 3250 1274 -5033 5290
1326E290p158j063Q555r902M364L998r520Q538j828o236J0190o984j198Q534r764
$$ 5290 -1868 -2931 5624 -4278 86 4084 -5436 3102 1274 -4962 5228 -1756 -2954 5580 -4184
1341d184M208L965r352Q525j991o084J0284p238j088Q583r941M396L871r394Q760
$$ -4184 24 3989 -5363 3162 1171 -4913 5371 -1867 -2955 5628 -4313 83 3954 -5440 3320
1356C320k192o087J0408p370j084Q589r869M367L786r174Q632k276n955J0247
$$ 3320 1128 -4959 5449 -1921 -3005 5584 -4285 82 3868 -5306 3326 1050 -4905 5342
1370E342p220j170Q516r528M075L843q934Q167j958n962R894o668j445Q306q937
$$ 5342 -1878 -3048 5468 -4060 15 3858 -5076 3091 1133 -4829 5065 -1603 -3048 5258 -3679
1385c679L574L817q575P776j771n916R711o351j669Q272q680L272L858q431P624
$$ -3679 -105 3712 -4863 2913 1142 -4774 4937 -1414 -3083 5189 -3491 -219 3639 -4792 2832
1400B832j713n815R641o357j576Q143q783L494L699q480P925j905n878R851o533
$$ 2832 1119 -4696 4945 -1412 -2988 5155 -3628 -134 3565 -4915 3010 1105 -4773 5078 -1455
1415a455j590Q144q773L594L570q382Q021k047n829R791o513j594Q085q582L452
$$ -1455 -3045 5099 -3674 -80 3490 -4892 3129 1082 -4747 5044 -1469 -3063 5022 -3560 -108
1430a08L617q231P710j780n902R422n965j832P842q012L080L596p939P243j513
$$ -108 3509 -4722 2988 1208 -4694 4728 -1237 -3069 4773 -3239 -159 3437 -4502 2741 1228
1445A228n870R102n499j998P692p683K784L618p848P052j286n907Q984n292k041
$$ 1228 -4642 4460 -1039 -3037 4655 -3028 -244 3374 -4474 2578 1292 -4615 4369 -923 -2964
1460b964P549p636K887L442p891P301j401n956R169n425k048P577p759L002L406
$$ -2964 4585 -3051 -164 3278 -4613 2688 1287 -4669 4500 -925 -2973 4604 -3155 -153 3253
1475C253p885P413j447n911R087n479j943P415p714L107L417p910P325j250o024
$$ 3253 -4632 2781 1334 -4577 4510 -969 -2912 4503 -3211 -104 3313 -4597 2728 1478 -4546
1490d546Q795n069k140P232p239K816L419p643O888r77o041Q441m589k301P099
$$ -4546 4249 -820 -2960 4272 -2967 -151 3268 -4375 2513 1536 -4505 3936 -653 -2954 4145
1505D145o866K488L524p535O507o85o038Q219m261k355O922o731K458L416p536
$$ 4145 -2721 -233 3291 -4244 2263 1578 -4460 3759 -502 -2857 4065 -2666 -208 3208 -4328
1520d328O590p37n967Q305m404k240O925o958K658L362p633O769p83n917Q298
$$ -4328 2262 1525 -4442 3863 -541 -2781 4144 -2814 -156 3206 -4427 2342 1559 -4358 3940
1535C940m538k095O798p059K832L334p633O797p39n942Q132m390k187O700o790
$$ 3940 -598 -2693 4105 -2954 -122 3212 -4421 2376 1637 -4305 3827 -563 -2750 3950 -2840
1550b840K614L430p386O354n15n825P713m057k213O563o481K343L559p263N943
$$ -2840 -226 3204 -4182 2172 1657 -4168 3545 -512 -2725 3838 -2643 -300 3259 -4004 1939
1565A939k05n838P404l688k299O455o258K187L513p175N834k30n721P447l781
$$ 1939 1734 -4104 3300 -388 -2687 3768 -2490 -303 3210 -3965 1869 1639 -4082 3365 -416
1580d16k182O487o457K254L528p243N907k80n590P466l990j956O403o661K426
$$ -416 -2598 3889 -2568 -314 3214 -4029 1878 1598 -3992 3474 -516 -2472 3931 -2730 -304
1595c04L507p284N976k94n525P399m025j975O378o573K292L614p073N674j09n452
$$ -304 3203 -4081 1895 1601 -3924 3475 -550 -2525 3853 -2720 -428 3186 -3887 1787 1678 -3774
1611c774P032l748k052O242o233K017L729o863N253J32n429O732l421k186O182
$$ -3774 3258 -490 -2542 3700 -2533 -516 3213 -3650 1603 1735 -3694 3038 -383 -2569 3613
1626C613n921J737L765o654M937J59n270O620l430k046O222o059J765L772o747
$$ 3613 -2308 -571 3194 -3460 1477 1636 -3634 2986 -444 -2490 3732 -2327 -562 3210 -3537
1641c537M983J12n159O677l578j888O158o189J909L611o729N164m9n060O778l727
$$ -3537 1446 1558 -3601 3076 -502 -2390 3768 -2421 -512 3099 -3630 1534 1485 -3575 3203 -524
1657e24j878O154o179J812L647o536M989K4m919O505l568j935O018n897J597L700
$$ -524 -2402 3752 -2427 -615 3032 -3504 1485 1509 -3410 3095 -473 -2408 3610 -2287 -690 3010
1673C010o279M635K35m920O204l228k149N946n493J241L791o020M252L26m822
$$ 3010 -3269 1366 1601 -3319 2885 -343 -2492 3454 -2039 -798 2993 -3027 1225 1551 -3271
1688c271O028l109k157N948n378J168L739o001M229K66m779O106l143k089N926
$$ -3271 2757 -352 -2509 3439 -1939 -771 2968 -3033 1196 1462 -3317 2789 -354 -2443 3483
1703C483n425J223L574n964M384O2m654O255l337k028N951n508J230L560n894
$$ 3483 -1942 -719 2855 -3109 1275 1337 -3317 2938 -399 -2427 3524 -1984 -754 2806 -3088
1718c088M361J05m595O123l197k132N781n231J068L507n611M133K10m574N903
$$ -3088 1273 1378 -3217 2906 -291 -2423 3358 -1873 -805 2702 -2909 1224 1434 -3140 2763
1733B763k910k380N695m807O88L582n286L744L25m460N614k692k404N601m588
$$ 2763 -147 -2527 3168 -1639 -951 2631 -2655 1089 1414 -3046 2568 -124 -2528 3073 -1515
1748a515O13L514n220L665L24m475N617k627k364N536m575P04L347n212L820J26
$$ -1515 -902 2612 -2608 1057 1381 -3094 2523 -104 -2468 3068 -1507 -803 2544 -2668 1152 1278
1764A278m402N762k807k228N520m683Q36L208n213L934N0m351N768k754k268N362
$$ 1278 -3124 2638 -169 -2397 3123 -1560 -724 2484 -2729 1205 1255 -3096 2672 -82 -2350 3012
1780C012m509P53L115n007L790J23m261N524k530k393N217m183M77L192m770L450
$$ 3012 -1497 -744 2371 -2636 1154 1277 -2984 2540 10 -2383 2834 -1349 -872 2320 -2450 1000
1796A000L74m254N187k190k475M999l901M18L129m666L352M37m304N104k062k480
$$ 1000 1374 -2880 2307 117 -2358 2641 -1260 -842 2287 -2379 973 1410 -2894 2210 148 -2332
1812b332M932l792M47L004m637L423K69m221N156k175k313M907l947O64K874m732
$$ -2332 2600 -1192 -745 2259 -2378 1045 1314 -2907 2249 74 -2239 2668 -1279 -615 2259 -2473
1828b473L542K40m200N141k154k235M740l871O70K765m636L506K45m120M988j979
$$ -2473 1069 1309 -2891 2250 96 -2139 2601 -1270 -600 2165 -2471 1035 1280 -2840 2148 169
1844A69k292M573l629M89K795m479L275M91m088M634j659k315M323l355L49K744
$$ 169 -2123 2450 -1179 -690 2105 -2374 901 1392 -2696 1938 279 -2036 2287 -1068 -719 2025
1860B025m245L048N85m049M460j513k364M251l258L76K777m293L022N90m017M466
$$ 2025 -2220 828 1413 -2636 1824 311 -2053 2198 -1060 -684 2093 -2200 822 1412 -2605 1861
1876A861j556k253M133l362O50K604m366L183M63m011M495j634k124M120l358
$$ 1861 305 -1948 2185 -1177 -527 2077 -2289 894 1357 -2654 1841 207 -1917 2203 -1155
1891a155O48K505m288L144M37l859M367j595k063M026l282N19K582m168K888O83
$$ -1155 -507 1998 -2290 854 1291 -2568 1799 204 -1859 2167 -1115 -596 1986 -2182 706 1389
1907A389l812M044j288k127L798k985L44K596m004K637Q19l766L800j037k189
$$ 1389 -2423 1621 333 -1794 2004 -981 -637 1959 -2045 592 1411 -2355 1445 408 -1781
1922a781L692k797J99K625l885K494Q54l666L710j116k093L698k908L40K570l912
$$ -1781 1911 -886 -687 1938 -1947 547 1401 -2265 1445 329 -1764 1934 -974 -634 1936 -1976
1938a976K558P63l628L790j275j955L701k996M05K539l903K554O99l492L720j331
$$ -1976 582 1345 -2283 1507 232 -1723 1978 -1018 -613 1926 -1977 577 1276 -2216 1504 173
1954A73j828L645l010L86K556l818K371Q39l421L495j095j923L520k760J73K546
$$ 173 -1655 1990 -1020 -634 1922 -1896 475 1314 -2107 1388 293 -1630 1890 -870 -697 1849
1970A849l578K090R42l299L289r55j992L493k608m1K658l467J853J067l219L138
$$ 1849 -1729 361 1303 -1996 1293 338 -1654 1839 -769 -810 1848 -1619 234 1301 -1918 1220
1986A220r06j924L420k612K4K602l452J923R44l184L238j065j841L464k702R5
$$ 1220 314 -1610 1810 -802 -778 1824 -1628 295 1239 -1945 1293 228 -1613 1851 -851 -756
2002g56K584l459J970Q30l077L246j178j728L457k751J14K566l403J907Q62l039
$$ -756 1828 -1631 339 1169 -1908 1338 160 -1568 1889 -862 -748 1818 -1585 322 1184 -1855
2018a855L140j061j809L398k536r7K578l209J644R69k941K938q69j881L324k346
$$ -1855 1285 224 -1585 1813 -723 -820 1758 -1451 193 1162 -1779 1159 290 -1591 1733 -613
2034f13k84K616l065J457J071k926K833p55j928L264k229l32K552k977J487R34
$$ -613 -897 1719 -1346 111 1182 -1744 1089 334 -1594 1670 -559 -891 1661 -1316 171 1105
2050A105k841K919q93j883L337k350k72K525k994J561Q53k790K967j016j782L309
$$ 1105 -1736 1183 290 -1593 1744 -606 -878 1647 -1347 214 1067 -1723 1244 228 -1554 1755
2066A755k392j77K446l001J631P97k789K963r53j858L254k227l19K420k814J474
$$ 1755 -637 -814 1632 -1369 262 1059 -1730 1233 280 -1578 1676 -551 -870 1550 -1264 210
2082B10Q31k735K825q02j947L195k007m95K439k660J256R51k715K697o26k039
$$ 210 1041 -1694 1131 329 -1618 1577 -430 -925 1514 -1146 110 1061 -1654 1043 417 -1622
2098a622L131j840n85K395k588J243Q98k683K714o66j997L132j887n14K333k618
$$ -1622 1509 -331 -916 1479 -1109 134 1032 -1651 1063 397 -1600 1532 -355 -869 1464 -1154
2114a154J335Q25k681K802p50j923L091j959l89K208k625J482P16k672K850p57
$$ -1154 181 1006 -1675 1127 377 -1546 1545 -414 -803 1405 -1220 262 978 -1694 1156 399
2130C99j962L043j873m58K214k517J375P58k620K716o45k006K977j711n64K212
$$ 399 -1563 1480 -393 -851 1363 -1154 221 979 -1641 1075 430 -1576 1401 -310 -874 1338
2146A338k411J209R18k652K492l80k091K891j526o52K153k283J120R09k622K466
$$ 1338 -1073 136 1054 -1598 894 514 -1577 1314 -212 -864 1289 -994 126 1035 -1587 879
2162H79l40k076K829j481o29K136k372J183R00k636K506l88j987K787j578m82
$$ 879 539 -1537 1292 -189 -818 1318 -1054 129 1029 -1607 899 511 -1476 1311 -267 -749
2178g49K035k428J317Q37k640K576m40j956K746j600m49K022k409J289Q87k606
$$ -749 1286 -1142 175 1012 -1628 948 508 -1448 1298 -302 -751 1271 -1138 151 1038 -1568
2194a568K442l24j968K609j433n16K007k306J153J025k638K288j37k071K536j242
$$ -1568 874 550 -1418 1191 -242 -758 1249 -1057 96 1121 -1517 771 634 -1437 1099 -143
2210a43o56K056k200R85J089k587K123l6k038K492j229o24K050k266R88J127k629
$$ -143 -799 1257 -943 42 1131 -1456 667 631 -1407 1085 -144 -768 1282 -984 4 1131 -1498
2227a498K139k8j958K429j279m91J932k304J108J034k609K223j26j889K448j369
$$ -1498 641 613 -1345 1084 -195 -686 1246 -1058 50 1084 -1525 698 572 -1317 1131 -238
2243b38m60J960k348J115J068k565K159r3j862K347j317m72J953k266J003J176
$$ -238 -698 1262 -1086 29 1097 -1468 691 598 -1264 1083 -234 -706 1247 -1019 -16 1160
2259A160k542J992N9j938K267j161o25K020k135Q03J281k506J813J88j960K222
$$ 1160 -1382 610 669 -1269 998 -163 -788 1232 -903 -100 1181 -1325 488 676 -1284 938
2275I38j072o55K041k138P62J292k508J796J82j909K243j109o15K009k170Q19
$$ 938 -134 -789 1252 -886 -124 1168 -1340 456 638 -1271 972 -137 -752 1257 -913 -94
2291i4J187k447J883M1j803K291j258n19J999k233Q55J183k395J862K4j742K226
$$ -94 1093 -1354 529 570 -1233 1058 -200 -719 1280 -953 -98 1085 -1310 552 576 -1166 1060
2308A060j261n32J970k157P92J215k337J778P9j806K207j150p05K059k024N83
$$ 1060 -201 -733 1237 -920 -128 1087 -1250 528 607 -1199 1008 -142 -847 1212 -812 -229
2324b29J349k291J608J81j821K119j023p62K083j968N12J368k276J539K15j830
$$ -229 1120 -1171 437 618 -1203 916 -107 -869 1214 -754 -242 1126 -1150 389 604 -1226
2340a226K159r95p76K066j933M89J282k230J610R7j741K206j122o77K018j977
$$ -1226 933 -62 -838 1228 -705 -216 1066 -1164 446 543 -1198 1008 -114 -791 1227 -750
2356g50N52J209k181J661K9j687K196j127p01J990j928N17J189k098J620N1j707
$$ -750 -198 1011 -1170 491 520 -1167 1029 -98 -799 1191 -737 -220 969 -1129 491 542 -1165
2373a165K165j069q36K048j816L54J324k051J439J90j748K051r00r22K044j684
$$ -1165 1000 -69 -905 1143 -673 -319 1005 -1046 393 583 -1165 886 -14 -936 1108 -576
2389e76K61J352k051J377K61j819K058q12r88K037j610K19J282j991J387J57j739
$$ -576 -315 1037 -1014 363 624 -1195 863 51 -937 1100 -510 -291 991 -1000 387 544 -1195
2406a195K093q75r07J996j666L04J174j978J469J03j680K086q92q82J920j639
$$ -1195 898 23 -884 1112 -554 -250 924 -1054 415 518 -1162 924 32 -850 1070 -569
2422e69L22J122j934J480J15j697K069q48r51J898j551K33J214j904J371K77j792
$$ -569 -247 875 -1059 421 536 -1161 908 60 -891 1007 -544 -311 903 -1001 370 647 -1145
2439a145J949o49j075J866j387J12J258j858J271L55j877J917n33j153J886j313
$$ -1145 804 155 -920 946 -441 -329 929 -929 342 697 -1180 737 204 -949 937 -376
2455c76N1J257j862J229L63j835J894n41j061J818j357J41J183j875J292K96j794
$$ -376 -325 932 -930 299 662 -1173 721 180 -881 937 -420 -279 904 -971 321 617 -1177
2472a177J920n60j024J748j334J75J087j835J334K88j772J884n38j037J738j330
$$ -1177 743 183 -841 907 -427 -252 835 -1000 334 622 -1150 734 196 -841 897 -433
2488d33J26J178j836J242M39j825J772l78j133J693j209K2J246j805J131N72j921
$$ -433 -307 871 -965 277 716 -1109 663 285 -848 845 -364 -342 904 -901 230 802 -1119
2505a119J698k54j224J702j118n8J304j818J053O26j902J643k22j186J681j140
$$ -1119 579 325 -899 803 -315 -373 931 -887 166 792 -1110 533 311 -875 806 -334
2521c34J6J230j812J074N60j848J674k74j109J644j170M9J186j804J090N36j772
$$ -334 -318 912 -900 174 734 -1114 560 286 -823 821 -349 -300 886 -918 172 708 -1064
2538a064J637l12j035J598j198O6J214j816J046O40j798J546j83j118J560j096
$$ -1064 573 261 -774 824 -374 -308 906 -910 136 776 -1022 524 341 -777 783 -313
2554c13n5J281j759R22P46j831J469r0j216J602j039j78J411j745P88Q46j815
$$ -313 -368 913 -846 76 822 -1009 460 370 -846 756 -283 -461 950 -795 -7 839 -976
2571i76J364k6j202J579j019j76J417j742P81Q13j789J374q7j103J567j053j26
$$ -976 388 362 -840 739 -280 -456 961 -781 0 813 -976 398 311 -792 775 -278 -404
2588d04J355j727P83P57j714J377j36j032J526j093p6J326j733P86P78j688J318
$$ -404 951 -776 7 764 -950 427 291 -741 785 -308 -384 942 -791 -5 773 -915 403
2605D03p0j075J504j032j83J386j654O42Q75j685J243jj152J530r57l26J487j614
$$ 403 333 -742 762 -270 -453 933 -721 -79 796 -889 354 353 -799 731 -226 -552 935 -679
2623f79N28R98j713J166J01j220J525q86l73J494j574N04R55j667J159M9j164
$$ -679 -151 847 -866 300 401 -819 706 -180 -553 941 -633 -129 826 -841 318 367 -797
2640g97J530r13l40J459j564N19Q79j595J146Jj079J493r43k87J410j551N19Q62
$$ -797 733 -180 -520 939 -625 -106 773 -822 324 325 -754 739 -204 -491 919 -632 -113 749
2658G49j584J152K2j106J491q95l65J409j468M28R11j557J103R7j189J485p96
$$ 749 -835 317 339 -767 724 -171 -536 873 -595 -167 744 -813 290 387 -802 683 -113
2675a13m97J486j414L17J008j576J039K07j277J488p04n96J501j348K57J015j555
$$ -113 -610 876 -538 -221 787 -789 250 457 -820 668 -36 -632 869 -479 -222 793 -762
2692g62J025J81j269J492p06n68J456j340L05R31j520J044J28j194J445p10m90
$$ -762 263 444 -825 667 -39 -607 849 -491 -186 745 -775 269 397 -797 648 -62 -552
2709e52J361j302L42Q56j501J076R4j207J463o68n49J350j247L01Q77j467J048
$$ -552 809 -493 -151 705 -796 280 374 -833 630 -38 -587 763 -484 -183 694 -773 275
2726B75J43j249J440n94o29J401j224K14R68j510R90K89j356J435n05p27J401
$$ 275 418 -831 609 15 -614 787 -437 -223 745 -765 225 514 -842 593 88 -639 762
2743G62j154J60R96j525R77L02j383J427m69p40J402j154J72R62j503R76K85j330
$$ 762 -392 -232 764 -761 216 518 -865 562 93 -647 755 -399 -227 735 -768 208 493 -837
2761h37J379m75o62J299j122K39Q86j475R95K36j286J361m85o31J281j133K40
$$ -837 542 67 -595 704 -418 -179 707 -768 227 463 -823 538 53 -578 703 -430 -190
2778a90Q89j451R64K90j307J315m23o61J291j111J96R48j501R32L94j391J302
$$ -190 699 -752 212 502 -805 510 87 -574 717 -394 -198 750 -751 181 575 -816 486
2795D86l32p74J329j060J01J018j507Q69M41j399J287l10p67J310j065J14J027
$$ 486 154 -620 709 -351 -250 768 -739 130 571 -828 459 149 -618 692 -373 -259 768
2812G68j510Q49M52j358J216k79p07J269j104J94R47j460Q58M07j303J244l85
$$ 768 -742 107 559 -799 417 138 -569 700 -404 -210 737 -723 135 542 -761 483 98
2829I8o35J208j063K06R18j417Q42M51j301J145l56o11J186j050J77R76j492Q15
$$ 98 -537 671 -392 -186 732 -685 157 608 -693 452 96 -515 671 -379 -202 774 -718 97
2847I7M91j332J130k44p12J236j029Q1J064j467P11N65j350J112k08p17J235j022
$$ 97 588 -744 386 142 -570 666 -363 -282 782 -685 26 591 -759 353 145 -572 663 -359
2865c59O3J081j476O95O01j324J075j95p01J198r97P6J022j419P01N22j230J048
$$ -359 -296 785 -691 4 605 -719 356 161 -540 658 -339 -263 759 -660 41 563 -667 381
2883C81k63o27J167j018J01R96j369O79M87j181J030k86n98J151j012R8J013j344
$$ 381 118 -509 658 -360 -259 737 -632 47 534 -647 383 97 -501 650 -362 -264 749 -595
2901e95O16N38j210J005k37o68J191r61oJ082j347N49O01j231R96j81p02J226
$$ -595 21 559 -651 354 117 -551 640 -321 -327 755 -592 -43 558 -673 323 142 -560 666
2919F66r45o2J116j344N08O35j223R81j57p25J215r35q1J093j297N15N63j133
$$ 666 -279 -341 775 -569 -61 574 -649 332 175 -550 665 -270 -351 742 -555 -40 523 -610
2937f10R68k15o68J175r48l4J035j245N33N03j081R43k48o24J148r13n9J031j205
$$ -610 358 143 -525 650 -298 -332 703 -542 -9 494 -587 356 108 -516 632 -281 -340 691 -514
2956e14N09M93j087R51k40o81J188q62j26J074j187M31N67j125R26j65p35J213
$$ -514 -5 488 -599 352 112 -569 619 -243 -369 705 -482 -51 516 -609 317 152 -583 630
2974F30q27j96J124j191L90O01j157R34j22p69J223p96k33J095j170L93N67j100
$$ 630 -197 -393 731 -460 -70 531 -626 308 186 -583 640 -156 -389 706 -464 -71 496 -604
2992f04R28j58p33J192q10j96J030j123M25N11j041R12j88p00J142p95j73R95
$$ -604 324 166 -567 625 -185 -381 649 -474 -49 462 -579 333 145 -555 587 -208 -381 614
3010F14j075M23N08j053R29j82p37J151p53k13J042j100M00N50j104R08j08p98
$$ 614 -461 -38 470 -583 346 164 -573 578 -175 -388 654 -446 -46 504 -600 308 200 -598
3028e98J184p19k58J067j097L58N98j150R05n3q59J203o70l19J071j092L41N96
$$ -598 586 -133 -391 676 -421 -63 535 -615 290 237 -622 581 -89 -408 663 -429 -88 508
3046E08j134R08o9q12J166p08k48J011j087M01N56j111R13p7p78J097o88k06R52
$$ 508 -626 282 213 -599 567 -141 -389 622 -465 -64 492 -619 294 217 -561 536 -152 -358 594
3065E94j050M25N18j091R10q3p89J092o74k16R71j044M17N50j123Q83l7q44J093
$$ 594 -456 -31 487 -604 306 223 -566 526 -148 -364 607 -437 -20 530 -593 290 253 -591 502
3084E02o13k51J012j073L82O01j189Q82K0q82J106n82l06J036j088L51O50j196
$$ 502 -111 -362 650 -423 -41 560 -629 253 273 -609 497 -85 -391 645 -443 -92 558 -638
3102f38Q65M8q66J093n95k64R76j064L83N97j165Q73K9q19J050o06k24R20j043
$$ -638 227 275 -591 502 -93 -357 619 -445 -62 535 -630 243 272 -547 503 -103 -327 593 -450
3121d50L91N74j105Q56rp71J012o25k01R27j051M03O01j140Q20N2q10R90n87k29
$$ -450 -59 515 -590 266 257 -514 498 -127 -328 599 -452 -49 552 -588 232 284 -526 464 -123 -352
3141c52R59j047L68O53j182P98J00q79J022n52k82J012j056L12P17j191P66J27
$$ -352 607 -440 -72 581 -601 197 297 -582 440 -112 -394 618 -438 -126 591 -600 166 293
3159B93q71J032n35k84J011j065L11O87j168P59J15q15J007n67k44R58j053L22
$$ 293 -578 454 -81 -365 646 -419 -108 579 -589 170 285 -530 477 -90 -334 624 -429 -107
3177a07O43j098P49Q7p49R41n93j94R27j050L29O61j092P23R9p69R56n82k47R74
$$ -107 536 -562 187 274 -475 466 -127 -321 606 -444 -115 546 -546 177 276 -493 463 -119 -366 608
3197F08j041L12O93j113O96J24q08R84n72k99J067j059K27P94j154O73J69q39
$$ 608 -433 -121 572 -541 155 279 -529 455 -117 -416 651 -408 -181 613 -541 132 301 -538
3215e38R92n31l12J058j051K17P71j150O72J53p94R79n47l01J027j032K24P22
$$ -538 454 -77 -389 669 -382 -165 606 -544 128 281 -513 466 -81 -382 645 -387 -163 559
3233E59j085O59J22p50R56n79k50J001j027K26P06j050O53J21p49R40n60k93J016
$$ 559 -526 133 255 -495 461 -118 -368 633 -394 -168 538 -512 141 262 -487 453 -107 -400 616
3252F16j009K07P28j050O49J29p77R71n51l36J054j002J88P62j079O40J63q33
$$ 616 -393 -186 542 -508 141 270 -507 464 -87 -423 631 -371 -183 579 -500 140 303 -530
3270e30R88n24l87J099r75J33P84j078O25J54q48J031n27l88J091r76J26P53j058
$$ -530 458 -66 -453 646 -329 -196 588 -490 135 289 -559 472 -55 -443 648 -328 -202 551 -507
3289e07O35J22p90R92n23l42J017r49J64O86j016O57R6p64R84n23l49R96r13J41
$$ -507 128 250 -540 452 -71 -413 604 -345 -181 505 -511 146 242 -522 462 -61 -410 586 -327 -186
3309a86O72r69O44R7p81R92n14m03J049r06J12P34j028O47J46q52J003m63m52
$$ -186 486 -483 161 258 -523 469 -45 -448 601 -305 -193 541 -487 160 306 -546 457 -6 -458
3328d58J060q98R8P53j041O32J56q77J024m59m61J062q87J05P17j030O37J46q42
$$ -458 602 -296 -198 555 -486 146 302 -575 449 -10 -471 591 -296 -191 526 -504 133 279 -563
3347e63R92m44m21J010q56J01O73r80O39J20q13R91m52m24R79q28J06O56r49O26
$$ -563 429 -15 -436 574 -282 -181 492 -488 151 271 -542 449 -3 -427 552 -276 -170 486 -463 163
3367A63J25q13R64m33m30R87q47J00O94r80O22J63q57R58l87m85J008q21Q1P05
$$ 163 288 -525 439 6 -424 563 -284 -184 510 -470 152 315 -542 416 29 -456 552 -269 -188 517
3387E17r99O06K06q92R54l64n05J030q17O2P21r95N86K11q72R39l58m64R65p94
$$ 517 -482 124 330 -562 392 28 -477 553 -264 -202 519 -476 110 321 -551 388 30 -434 531 -263
3407b63R5O82r77N91J87q45R18l51m35R20p80R4O48r44N76J84q15Q79l30m30R08
$$ -263 -168 514 -463 128 315 -530 388 37 -398 522 -258 -164 484 -460 116 300 -515 364 34 -396 512
3428E12p77R3O80r66N69K26q59Q85l17m67R41p68L2P33r94N56K72q74Q73k95m94
$$ 512 -265 -172 508 -458 111 337 -522 363 46 -421 520 -248 -216 517 -477 79 351 -523 350 55 -439
3449d39R62p81N0P56j005N24L03q86Q54k69m80R32p60O4P24r98N29K68q46Q25
$$ -439 523 -258 -208 548 -457 67 370 -516 338 69 -411 521 -239 -175 549 -449 80 348 -498 327
3469C27k73m50R11p72N4P11r62N23K64q04P94k92m05Q79p68O8P02r59N12K93q35
$$ 327 54 -396 515 -257 -203 508 -454 69 333 -471 323 31 -374 505 -263 -195 507 -452 60 353 -482
3490d82Q01k67m62R10p42K0P64r89M78L44q64P98k39n01R49p67JQ19j004M55L69
$$ -482 319 52 -410 500 -242 -222 542 -447 31 375 -489 309 70 -431 518 -249 -248 571 -433 22 391
3511C91q76Q00k30m96R43p58k5Q10r87M39L56q47P80k35m64R14p54j0P88r66M38
$$ 391 -485 315 85 -411 532 -226 -251 559 -428 11 367 -480 300 65 -399 515 -239 -249 539 -427 11
3532A1L26q01P67k51m58R07p35mP71r31M17L13p99P77k56m57R09p23m3P98r33
$$ 11 337 -464 303 52 -406 501 -234 -238 533 -398 19 332 -467 310 54 -403 506 -217 -260 538 -395
3553c95L91L58q05P47k27n01R75p44p9Q28r60L90M06q59P81k29n25R92p16j27
$$ -395 -4 354 -451 296 69 -432 543 -201 -280 548 -412 -22 384 -475 306 77 -448 544 -172 -299
3573b99Q21r10L74L69q31P95k58n32J008p50q1Q27q94L60L13p79P91k79m31Q84
$$ -299 522 -388 -14 355 -476 319 61 -471 537 -213 -294 533 -361 -1 312 -467 324 45 -386 498
3593D98p03m7P59q53L49L30q08P89k10n34Q93n81j69Q53r43L93L24p89P48k20
$$ 498 -205 -252 507 -346 3 333 -475 314 104 -430 463 -118 -287 566 -377 16 340 -449 299 79
3613G9n18R37o76j33Q60r42L49M11q36P80k03n76J007o58k44Q82r19L80L56q30
$$ 79 -439 498 -178 -311 549 -393 -44 367 -469 311 108 -468 539 -119 -363 519 -400 -20 336 -494
3633d94Q00k25n67R79o33j74Q58r20L51L67q03P91k17o11R65n41k10P39p80L32
$$ -494 306 81 -486 493 -140 -314 544 -376 -25 342 -461 330 113 -498 467 -74 -284 455 -325 7
3653GL22p52O83j66n38R63o85j22P60q25L25L94q43P89k03n57R19o31n4P05q76
$$ 7 329 -423 260 94 -444 519 -166 -288 472 -353 -28 366 -477 312 109 -448 471 -160 -214 491 -385
3674c85L46M45r67Q38j15o27R30n91j29P74p99K18M70r56Q25j24o47R93o24j72
$$ -385 -39 406 -561 277 162 -465 465 -126 -255 519 -280 -62 408 -548 277 153 -494 499 -125 -297
3694b97P81q67L36M51r07P76j50n82R24o25j02P62p99K80L88q35P64j44o46R25
$$ -297 484 -383 -47 404 -503 273 123 -459 465 -160 -262 500 -299 -19 369 -466 298 154 -492 433
3714D33n36j74P55p94K83M00q30P18j05o23R39n80j65P58q08L30L99q67O93p6
$$ 433 -103 -277 478 -316 -33 367 -463 255 150 -473 466 -114 -279 479 -329 1 400 -467 226 150
3734A50o85R78n34k15Q16q40K86M75r60Q06j00o47R15n47k02Q12q55L10M43q89
$$ 150 -535 443 -91 -306 510 -330 -44 431 -529 277 177 -470 445 -102 -304 508 -347 -37 406 -483
3754d83P36n2o43R06n76j65P73q59L24M21q72P23o1o21Q85n68j53P75q53L39M21
$$ -483 253 201 -442 464 -112 -277 496 -363 -39 382 -490 233 172 -449 436 -132 -285 490 -363 -24 397
3775C97q75P12n3o24Q64n36j74P85q56L26M49q92P12o1o64R26n50k05Q53q86K87
$$ 397 -478 234 181 -443 421 -115 -289 496 -360 -34 415 -477 235 174 -490 436 -114 -319 534 -352 -65
3796f5N09r26O94k6o47R13n58k01Q46q92K97M91r14P04k9o55R12n51k05Q26q82
$$ -65 444 -482 212 186 -461 452 -106 -307 539 -353 -56 435 -479 225 196 -459 453 -98 -303 523 -359
3817c59K78M89q75O89n0o12Q85n76j70Q11q76K89M84q43O50n3n87Q66n78j74Q21
$$ -359 -81 408 -467 222 172 -440 445 -131 -301 510 -366 -77 407 -436 214 161 -426 440 -138 -312 509
3838E09q51K74M82q67O64m3o07Q86n77j89Q56q72K57N22q94O64l1o45R28n68k17
$$ 509 -342 -68 414 -453 211 168 -439 447 -130 -319 537 -335 -78 444 -450 214 183 -462 466 -102 -319
3859c19Q73q71K26N41r02O58l3o50R45n73k39Q95q75K35N11q76O34l7n83Q83n63
$$ -319 554 -317 -91 450 -452 206 173 -477 468 -105 -344 551 -324 -89 422 -454 180 143 -440 443 -120
3880a20j97Q48q63K45M82q36O48n2n75Q83n79k02Q27q25K41M71q10O32o4n74Q73
$$ -120 -317 531 -332 -87 395 -441 207 155 -420 463 -116 -318 509 -316 -75 396 -414 218 154 -420 453
3901D53n65k20Q61q32K15M98q30O38m9o24R10n54k57Q89q37K02N10q46O39l2o49
$$ 453 -112 -332 529 -303 -88 410 -420 218 169 -455 455 -99 -356 533 -304 -102 408 -438 201 169 -480
3922d80R31n47k69R00q28J91M98q34O44n0o24R06n26k51Q49p96J84M71p91O38
$$ -480 451 -96 -365 535 -293 -102 396 -438 206 156 -468 438 -88 -339 510 -286 -102 369 -422 216
3942B16n2o01Q93n22k62Q19p61J73M59p72O28n6o00Q83n18k82Q52p69J73M93q06
$$ 216 164 -437 456 -66 -328 491 -270 -97 362 -410 218 162 -438 445 -73 -355 497 -272 -99 394 -412
3963d12O16j5o56R04m97l17Q75p80J79N08q34O26j4o78R22m83l23Q84p58J49N10
$$ -412 204 189 -467 437 -60 -377 498 -282 -103 405 -429 197 183 -495 427 -56 -379 505 -253 -104 406
3984D06q36O20po62R13m66l15Q49p46J51M77p99O17j5o35Q72m48l20Q25p41J67
$$ 406 -430 190 183 -479 434 -32 -347 502 -244 -93 384 -415 202 187 -448 424 -24 -344 481 -260 -93
4005i3M69p94O19j4o40Q61m56k85P92p31J74M70p94O26qo54Q62m28l28Q27p42
$$ -93 376 -418 201 187 -453 408 -48 -333 459 -272 -98 372 -422 204 196 -458 404 -24 -352 475 -267
4026b67J54N10q19O13K7p09Q93m22l40Q39p32J44N33q54O18M7p08Q68m00l36Q23
$$ -267 -113 397 -422 191 218 -491 402 -20 -360 479 -253 -109 424 -430 188 235 -473 395 -5 -341 482
4047D82p25J49N06q45O06M4o83Q55l96l20P80p10J49M89q16N98M2o56Q22l92l12
$$ 482 -243 -94 412 -433 173 217 -466 389 -7 -327 453 -257 -108 381 -435 163 205 -451 371 -21 -333
4068c33P76p06J69M89q27N97O0o77Q08l77l20P82p06J50N25q32N83R6p12Q24l72
$$ -333 443 -263 -94 395 -432 165 225 -452 356 -21 -341 441 -265 -115 410 -422 161 257 -455 369 -3
4089cl45Q02p07J44N40q59N82J06p35Q38l60l44Q01p14J40N49q58N64R5p02Q10
$$ -3 -348 454 -253 -109 431 -428 154 260 -475 363 3 -341 460 -254 -114 435 -423 141 236 -466 344
4110C44l58l35Q08p16J37N24q25N40J08o71P77l54k93P56p12J51N06p94N38J07
$$ 344 -14 -349 459 -257 -120 404 -421 119 227 -444 333 -21 -314 442 -270 -119 387 -407 131 238
4130B38o72P80l57l14P72o91J07N49q06N14J22o71P78l54l40P99p01R1N84q28
$$ 238 -434 346 -11 -325 447 -244 -137 412 -394 120 242 -429 349 -5 -345 454 -247 -156 428 -400
4150d00N12J52p09P89l47l55Q36p14P1N95q24M95J40o86P72l43l48Q17o89P7N68
$$ -400 112 264 -445 344 -3 -358 478 -236 -165 430 -394 101 241 -445 327 -16 -364 453 -236 -159 409
4171D09p95M73J44o52P36l16l41Q10o84O2N66p78M67J19o29P45l37l36P93o71
$$ 409 -386 87 231 -421 315 -1 -342 468 -216 -154 412 -366 101 220 -409 336 -1 -337 456 -215
4191b15L9N89p65M44J53o54P32l26l62Q23o70K5O15p91M46J71o82P65l29l97Q43
$$ -215 -176 413 -352 92 245 -409 323 -3 -365 458 -212 -187 428 -363 83 254 -428 337 8 -389 454
4212D54o54qO36p87M18J74o74P61l12m01Q49o55J1O07p62M32J60o65P48l02l91
$$ 454 -200 -208 428 -359 59 233 -441 320 8 -393 456 -199 -188 419 -343 89 249 -416 332 30 -361
4233c61Q17o28KN85p43M05J53o34P37l11l81Q06o15j4N76p25M11J50o47P44l05
$$ -361 456 -172 -170 415 -328 77 230 -404 333 22 -359 447 -168 -182 394 -331 80 230 -417 327 22
4254B2m13Q32o11m1O06p29M13J69o90P74k97m42Q64o19n9O29p54M08J95p00P69
$$ 22 -391 441 -170 -211 395 -334 79 248 -442 332 35 -407 457 -162 -221 408 -346 62 257 -443 326
4275C26k83m54Q66o15n5O27p45M05J87o99P62k62m47Q28n85n0N84p14M11J54o67
$$ 326 43 -411 455 -160 -215 412 -333 72 259 -440 322 60 -387 441 -144 -194 390 -324 87 241 -426
4296d26P50k74m41Q11n65n0N62p03M15J50o63P47k67m37Q09n70l9N79p14L97J82
$$ -426 324 50 -391 420 -145 -195 367 -336 79 229 -434 313 46 -391 418 -152 -191 388 -326 71 253
4317B53o96P57k47m62Q15n54q1O08p16M04J83p07P62k35m81Q23n63q1O21p34M16
$$ 253 -443 314 67 -395 420 -134 -215 393 -323 81 264 -443 319 84 -397 426 -137 -218 403 -331 85
4338H5J92p11P49k25m76Q00n43o5N84p18M01J82o89P15k16m38P61n31n2N60p05
$$ 85 277 -434 315 90 -386 414 -129 -194 390 -328 73 255 -434 281 65 -373 388 -143 -195 365 -340
4359c40M00J89o88P10k00m50P55n22l1N48o86L89J89o99P22k11m52P82n39o3N97
$$ -340 60 249 -439 271 71 -379 376 -146 -177 371 -315 74 263 -436 286 75 -377 405 -134 -197 400
4380D00p18L85K10p10P10j85m77P84n41m6N83p41M10K35p05O71j76m68P80n41
$$ 400 -318 67 277 -433 277 92 -385 399 -142 -188 395 -346 64 299 -406 265 89 -379 401 -140
4400a40o1O10p26L54K59p01O41j56m64P48n09NN42p44L93J68n68O30j63m87P66
$$ -140 -201 409 -317 37 296 -405 236 80 -384 364 -145 -140 402 -342 51 219 -349 281 118 -369 397
4421C97n42M9M92p54M16K19o87O52k08m21O85m38m2O03p53L72K36o95O44j71m01
$$ 397 -145 -96 396 -358 58 277 -410 242 34 -387 298 -140 -182 421 -332 40 276 -419 225 54 -347
4442c47P38n27n5N93p19L58K65p26O70j57m57P49n28n7N97p30L55K58o89O39j51
$$ -347 391 -136 -191 402 -317 41 306 -420 250 93 -364 385 -143 -200 397 -333 22 280 -409 230 79
4463G9m26P29n34m3N88p15L54K48o48O08j54m14O95m97m5N53o87L46K36o45O09
$$ 79 -347 382 -152 -195 393 -322 32 280 -368 240 86 -328 367 -130 -175 378 -309 37 273 -372 237
4484B37j55m00O96n24m7N83p02L36K58o72O17j53m27P32n28m8O03p18L26K70o76
$$ 237 82 -318 378 -146 -193 390 -312 24 282 -390 227 74 -353 379 -149 -197 406 -312 14 284 -392
4505c92O22j35m54P47n23q3O21p16L23K65o59O23j62m28P40n09q8O02o74L02K46
$$ -392 230 95 -359 388 -135 -218 403 -313 10 275 -384 239 77 -351 389 -120 -208 394 -280 22 268
4526B68o36O06j57m09P08n03p0N70o58L04K34o19O08j85l94P21n25p0N76o59K94
$$ 268 -368 238 81 -328 380 -123 -193 377 -281 23 257 -362 246 61 -333 388 -137 -207 369 -290 4
4547DK49o28O17j63m38P40n17p3N83o52K96K35o32O31j82m49P73n20r5O18o69
$$ 4 253 -375 242 79 -359 381 -136 -209 374 -278 18 253 -379 252 70 -379 394 -126 -221 397 -272
4568b72K92K39o47O37j75m30P49n02j07N96o34K77K30o16O30j84m29P37m97j07
$$ -272 20 259 -388 249 74 -356 393 -109 -216 380 -254 23 253 -363 267 83 -346 391 -106 -213
4588b13N80o31K75K02n67N93j73m06O98m71r5N48o05K84K14n88O03j83m18P12
$$ -213 367 -264 11 213 -354 239 66 -340 358 -113 -208 340 -265 19 233 -355 248 65 -353 359
4608C59m64j17N78o13K83K21o07O22j84m41P35m74j20N98o29K75K42o41O26j59
$$ 359 -105 -222 356 -257 26 247 -360 262 78 -363 372 -102 -222 376 -253 22 264 -377 249 90
4628I0m57P47m63j12N68o24K88K05o16O17j56m38P11m65j06N55n94K74J97n96
$$ 90 -367 380 -83 -195 373 -251 37 242 -374 243 87 -351 360 -105 -211 344 -250 24 221 -375
4648c75O07j59m23O91m41j08N26n82K92J97n91O07j47m32O81m27j12N22n85L13
$$ -375 232 73 -350 341 -100 -208 318 -264 28 225 -366 241 94 -338 343 -84 -196 326 -259 54
4668E4J94o01N98j44m53O94m26j11N47o22L01K36o43O20j32m81P20m26j30N49
$$ 54 248 -353 245 101 -352 342 -84 -195 352 -270 31 267 -376 244 112 -369 351 -75 -205 344
4688C44n97K86K16o24N99j32m56P04m35j07N31o01K84K19o07N92j31m25O56l97
$$ 344 -253 33 249 -375 224 92 -364 340 -95 -202 329 -272 12 231 -376 216 85 -340 316 -81
4708h1r5M90n66K92J90n83N74j13m31O40l89r4M99n93K84K26o01N72j11m32O40
$$ -81 -176 314 -252 40 230 -353 221 108 -323 317 -72 -166 333 -260 24 250 -351 221 110 -322 318
4729C18m09j03N25n99K91K46o36N80j04m56O61m08j13N45o02K75K66o54N76r6
$$ 318 -91 -194 331 -268 23 269 -367 213 109 -347 314 -94 -207 338 -264 11 277 -377 199 103
4749A03m54O58m06j03N41o03K86K33o17N52q0m38O39l87r2N15o07K88K30o03N43
$$ 103 -351 307 -99 -202 339 -264 22 255 -362 190 110 -328 311 -76 -168 347 -260 28 258 -345 198
4770A98r9l98O22m00r6N08n85K57K44n95N44j07l97O16l96j03N18o03K61K83o17
$$ 198 99 -299 323 -77 -173 335 -250 7 251 -344 200 93 -304 312 -84 -187 331 -272 -11 272 -345
4791c45N44r0m43O47m09j12N59o23K55K89o22N31q0m33O58m29j01N64o33K66K88
$$ -345 199 109 -334 313 -96 -208 351 -272 -17 272 -350 181 101 -332 326 -103 -204 360 -273 -7 281
4812B81o29N28p5m21O37m07j03N45o03K53K69o06N04p9l90O16m04j05N25n91K43
$$ 281 -348 180 105 -316 321 -86 -189 356 -247 6 275 -331 173 94 -296 320 -84 -189 336 -255 -12
$$ [...]
8191b3
##END NTUPLES=NMR FID
##END=
