##TITLE=1H_LY-12Dix.2.B
 CD3CN, 8 sc, 
 2.06.2021
##JCAMPDX= 6.0         $$ Bruker NMR JCAMP-DX V2.0
##DATA TYPE= NMR FID
##DATA CLASS= NTUPLES
##ORIGIN= UXNMR, Bruker Analytische Messtechnik GmbH
##OWNER= root
$$ XWIN-NMR		Version 3.5
$$ Wed Jun  2 10:29:53 2021 Russian Standard Time (UT+4h)  she@DPX200
##.OBSERVE FREQUENCY= 200.131506
##.OBSERVE NUCLEUS= ^1H
##.DELAY= (6, 6)
##.ACQUISITION MODE= SIMULTANEOUS
##.ACQUISITION SCHEME= undefined
##.AVERAGES= 8
##.DIGITISER RES= 18
##SPECTROMETER/DATA SYSTEM= spect
##.PULSE SEQUENCE= zg30
##.SOLVENT NAME= CDCl3
##.SHIFT REFERENCE= (INTERNAL, CDCl3, 0, 15.7039)
##AUDIT TRAIL= $$ (NUMBER, WHEN, WHO, WHERE, WHAT)
$$ ##TITLE= Audit trail, XWIN-NMR		Version 3.5
$$ ##JCAMPDX= 5.01
$$ ##ORIGIN= Bruker BioSpin GmbH
$$ ##OWNER= she
$$ F:/spectra/data/she/nmr/H-F/1/audita.txt
$$ ##AUDIT TRAIL=  $$ (NUMBER, WHEN, WHO, WHERE, WHAT)
(   1,<2021-06-02 10:28:47.29 +0400>,<she>,<DPX200>,
      <created by zg, POWCHK disabled, PULCHK disabled
       configuration hash MD5:
       00 E9 B6 7A A2 85 ED C7 34 08 36 98 17 FE 4E 26
       data hash MD5: 16K
       B3 04 B1 BD CE E5 24 75 F9 CE BC 44 A9 ED DD 42>)
$$ ##END=
$$ 
$$ hash MD5
$$ CC 59 51 97 BC DE 5D C4 CA EA B5 05 D4 E3 40 F4
##$RELAX= 
##$RELAX= 
##$RELAX= 
##$RELAX= 
##$RELAX= 
##$RELAX= 
$$ Bruker specific parameters
$$ --------------------------
##$DU= <F:/spectra>
##$EXPNO= 1
##$NAME= <H-F>
##$PROCNO= 1
##$TYPE= <nmr>
##$USER= <she>
##$AMP= (0..31)
100 100 100 100 100 100 100 100 100 100 100 100 100 100 100 100 100 100 
100 100 100 100 100 100 100 100 100 100 100 100 100 100 
##$AQSEQ= 0
##$AQ_mod= 1
##$AUNM= <au_zg>
##$AUTOPOS= <>
##$BF1= 200.13
##$BF2= 200.13
##$BF3= 200.13
##$BF4= 200.13
##$BF5= 200.13
##$BF6= 200.13
##$BF7= 200.13
##$BF8= 200.13
##$BYTORDA= 1
##$CFDGTYP= 0
##$CFRGTYP= 5
##$CHEMSTR= <none>
##$CNST= (0..31)
1 1 145 1 1 1 1 1 1 1 1 1 1 1 1 1 1 1 1 1 1 1 1 1 1 1 1 1 1 1 1 1 
##$CPDPRG= <>
##$CPDPRG1= <>
##$CPDPRG2= <>
##$CPDPRG3= <>
##$CPDPRG4= <mlev>
##$CPDPRG5= <mlev>
##$CPDPRG6= <mlev>
##$CPDPRG7= <mlev>
##$CPDPRG8= <mlev>
##$CPDPRGB= <>
##$CPDPRGT= <>
##$D= (0..31)
0 1.2 0 0 0 0 0 0 0 0.06 0 0.03 0 0 0 0 0.0002 0 0 0 0 0 0 0 0 0 0 0 0 
0 0 0 
##$DATE= 1622615326
##$DBL= (0..7)
120 120 120 120 120 120 120 120 
##$DBP= (0..7)
150 150 150 150 150 150 150 150 
##$DBP07= 0
##$DBPNAM0= <>
##$DBPNAM1= <>
##$DBPNAM2= <>
##$DBPNAM3= <>
##$DBPNAM4= <>
##$DBPNAM5= <>
##$DBPNAM6= <>
##$DBPNAM7= <>
##$DBPOAL= (0..7)
0.5 0.5 0.5 0.5 0.5 0.5 0.5 0.5 
##$DBPOFFS= (0..7)
0 0 0 0 0 0 0 0 
##$DE= 6
##$DECBNUC= <off>
##$DECIM= 32
##$DECNUC= <off>
##$DECSTAT= 4
##$DIGMOD= 1
##$DIGTYP= 9
##$DL= (0..7)
0 120 120 120 120 120 120 120 
##$DP= (0..7)
150 150 150 150 150 150 150 150 
##$DP07= 0
##$DPNAME0= <>
##$DPNAME1= <>
##$DPNAME2= <>
##$DPNAME3= <>
##$DPNAME4= <>
##$DPNAME5= <>
##$DPNAME6= <>
##$DPNAME7= <>
##$DPOAL= (0..7)
0.5 0.5 0.5 0.5 0.5 0.5 0.5 0.5 
##$DPOFFS= (0..7)
0 0 0 0 0 0 0 0 
##$DQDMODE= 0
##$DR= 18
##$DS= 0
##$DSLIST= <SSSSSSSSSSSSSSS>
$$ [...]
##$SUBNAM2= <"">
##$SUBNAM3= <"">
##$SUBNAM4= <"">
##$SUBNAM5= <"">
##$SUBNAM6= <"">
##$SUBNAM7= <"">
##$SUBNAM8= <"">
##$SUBNAM9= <"">
##$SW= 16.9725357007746
##$SWIBOX= (0..15)
0 0 2 0 0 0 0 0 0 0 0 0 0 0 0 0 
##$SW_h= 3396.73913043478
##$TD= 16384
##$TD0= 1
##$TE= 0
##$TE2= 300
##$TE3= 300
##$TEG= 300
##$TL= (0..7)
0 120 120 120 120 120 120 120 
##$TP= (0..7)
150 150 150 150 150 150 150 150 
##$TP07= 0
##$TPNAME0= <>
##$TPNAME1= <>
##$TPNAME2= <>
##$TPNAME3= <>
##$TPNAME4= <>
##$TPNAME5= <>
##$TPNAME6= <>
##$TPNAME7= <>
##$TPOAL= (0..7)
0.5 0.5 0.5 0.5 0.5 0.5 0.5 0.5 
##$TPOFFS= (0..7)
0 0 0 0 0 0 0 0 
##$TUNHIN= 0
##$TUNHOUT= 0
##$TUNXOUT= 0
##$USERA1= <user>
##$USERA2= <user>
##$USERA3= <user>
##$USERA4= <user>
##$USERA5= <user>
##$V9= 5
##$VALIST= <valist>
##$VCLIST= <CCCCCCCCCCCCCCC>
##$VD= 0
##$VDLIST= <DDDDDDDDDDDDDDD>
##$VPLIST= <PPPPPPPPPPPPPPP>
##$VTLIST= <TTTTTTTTTTTTTTT>
##$WBST= 1024
##$WBSW= 4
##$XGAIN= (0..3)
0 0 0 0 
##$XL= 0
##$YL= 0
##$YMAX_a= 143309
##$YMIN_a= -123542
##$ZGOPTNS= <>
##$ZL1= 120
##$ZL2= 120
##$ZL3= 120
##$ZL4= 120
##$ABSF1= 10
##$ABSF2= 0
##$ABSG= 5
##$ABSL= 3
##$ALPHA= 0
##$AQORDER= 0
##$ASSFAC= 0
##$ASSFACI= 0
##$ASSFACX= 0
##$ASSWID= 0
##$AUNMP= <proc_1d>
##$AZFE= 0.1
##$AZFW= 0.1
##$BCFW= 1
##$BC_mod= 2
##$BYTORDP= 1
##$COROFFS= 0
##$CY= 11.3945322036743
##$DATMOD= 1
##$DC= 2
##$DFILT= <>
##$DTYPP= 0
##$F1P= 15.9154993809931
##$F2P= -4.1035820241983
##$FCOR= 0.5
##$FTSIZE= 0
##$FT_mod= 4
##$GAMMA= 1
##$GB= 0.15
##$INTBC= 1
##$INTSCL= 1
##$ISEN= 128
##$LB= 0.24
##$LEV0= 0
##$LPBIN= 0
##$MAXI= 10000
##$MC2= 0
##$MEAN= 0
##$ME_mod= 0
##$MI= 1.114404
##$NCOEF= 0
##$NC_proc= 0
##$NLEV= 6
##$NOISF1= 3.799351
##$NOISF2= 2.8
##$NSP= 1
##$NTH_PI= 0
##$NZP= 0
##$OFFSET= 15.70392
##$PC= 1
##$PHC0= -11571.61
##$PHC1= 23.80099
##$PH_mod= 1
##$PKNL= yes
##$PPARMOD= 0
##$PSCAL= 0
##$PSIGN= 0
##$REVERSE= no
##$SF= 200.130013532006
##$SI= 16384
##$SIGF1= 3
##$SIGF2= 2
##$SINO= 400
##$SIOLD= 16384
##$SREGLST= <1H.CDCl3>
##$SSB= 0
##$STSI= 0
##$STSR= 0
##$SW_p= 3612.71676300578
##$SYMM= 0
##$S_DEV= 0
##$TDeff= 0
##$TDoff= 0
##$TI= <>
##$TILT= no
##$TM1= 0
##$TM2= 0
##$TOPLEV= 0
##$USERP1= <user>
##$USERP2= <user>
##$USERP3= <user>
##$USERP4= <user>
##$USERP5= <user>
##$WDW= 1
##$XDIM= 8192
##$YMAX_p= 0
##$YMIN_p= 0
$$ End of Bruker specific parameters
$$ ---------------------------------
##NTUPLES= NMR FID
##VAR_NAME=  TIME,          FID/REAL,        FID/IMAG
##SYMBOL=    X,             R,               I
##VAR_TYPE=  INDEPENDENT,   DEPENDENT,       DEPENDENT
##VAR_FORM=  AFFN,          ASDF,            ASDF
##VAR_DIM=   8192,          8192,            8192
##UNITS=     SECONDS,       ARBITRARY UNITS, ARBITRARY UNITS
##FACTOR=    0.0002944,     1,               1
##FIRST=     0,             0,               0
##LAST=      2.4114304,     0,               0
##MIN=       0,             -123542,         0
##MAX=       2.4114304,     143309,          0
$$ Real data points
##PAGE= N=1
##DATA TABLE= (X++(R..R)), XYDATA
0@%%%%%%%%%%%%%Qj6J6j6J6k2L0l2M0m8N6o5P4q9J04j21J38j58J82k09K37k67
$$ 0 0 0 0 0 0 0 0 0 0 0 0 0 0 8 -8 8 -8 8 -14 16 -16 24 -24 32 -33 41 -48 56 -65 73 -85 97 -112 125 -142
35a42L02l39L82m29M77n30N90o57P31q10Q92r84J088j200J321j456J603j764J947
$$ -142 160 -179 203 -226 251 -279 311 -346 385 -425 467 -517 571 -629 692 -764 839 -925 1022
54A022k149K373k626K916l250L637m093M639n313O163p268Q780j0986J4539k1423
$$ 1022 -1127 1246 -1380 1536 -1714 1923 -2170 2469 -2844 3319 -3949 4831 -6155 8384 -13039
69a3039N5400j40658N6779J84571k37992N4277J66776j99481R418J97527j89635
$$ -13039 42361 -98297 -41518 143053 -94939 -40662 126114 -73367 -63949 133578 -56057
80e6057k0304J90745j48375m4133J89336j44495n4466K00663j23916r4154K06677
$$ -56057 -76361 114384 -33991 -78124 111212 -33283 -87749 112914 -11002 -105156 101521
91A01521r4656j13875J99784p0227j43591K04017l1153j75362J76633J6555j80217
$$ 101521 6865 -107010 92774 22547 -121044 82973 51820 -123542 53091 69646 -110571
102a10571J46451M0118j81431J24837P0227j83129R1734R0605j67146P0621R6672
$$ -110571 35880 75998 -105433 19404 89631 -93498 -1764 88841 -78305 -7684 88988
113H8988j67045N8864J19819j68024K8248J40040j53776K456J52242j44219k6339
$$ 88988 -78057 -19193 100626 -67398 -39150 100890 -52886 -50430 101812 -42407 -68746
124f8746J71567j21310o5866J71494q5016q7413J59785o0267j03599J52294l1657
$$ -68746 102821 -18489 -84355 87139 2123 -85290 74495 14228 -89371 62923 31266
135C1266j18971J33021o315j19071J18246N080j25765J13175K6116j37691R6856
$$ 31266 -87705 45316 39001 -80070 38176 43256 -82509 30666 56782 -80909 15947
146A5947M9349j40708Q0335O9406j46555N9988R7300j43273K6842J14752j25461
$$ 15947 65296 -75412 4923 74329 -72226 -12238 85062 -58211 -31369 83383 -42078
157d2078J186J20953j10870k0518J27754r2107m2349J24766p2356n3173J21020
$$ -42078 -40892 80061 -30809 -51327 76427 -15680 -58029 66737 -5619 -58792 62228
168F2228o1846o5594J23969m6399q2632J20599k7526r5506J15636q738j10568
$$ 62228 382 -65212 58757 12358 -70274 50325 22799 -72707 42929 34191 -76377
179g6377J07302J7506j21174Q7457M1167j20187O6962N7327j16570M7580P1367
$$ -76377 30925 48431 -72743 14714 55881 -64306 2656 59983 -56587 -9007 62360
190F2360j08570K8220P8547r8670J5231Q3563r3866K839R2860q7845j3416J00783
$$ 62360 -46210 -17990 60557 -38113 -22882 60681 -33185 -30346 62514 -25331 -38747 62036
202F2036p8602l0187J07420o6887m9199J11464m9300o7715J08208k8713q1006
$$ 62036 -16566 -46753 60667 -6220 -55419 56045 6745 -60970 47238 18525 -62481
213f2481R9550q997q9098Q7497Q032r1769P5090K0875r2438O4479L1714r3388
$$ -62481 37069 28072 -61026 26471 34503 -57266 17824 38699 -53739 10740 42454 -50934
225e0934N4775M2872r4909M4377N5978r6029K9819P0189r2122J2024Q0973q4012
$$ -50934 3841 46713 -48196 -3819 52159 -43870 -14051 56138 -35984 -23960 57013 -26999
237b6999n801Q8920p2293k4290R1599n6173l8336Q7776m2459m6707Q4880l1328
$$ -26999 -32800 56120 -16173 -40463 51136 -5037 -43373 44403 1944 -44763 40117 8789
249H789n5627Q1164j9222o1866P6389j0362o8252P5247J061p8977O9403J7835
$$ 8789 -46838 34326 15104 -46762 29627 19265 -48987 26260 27321 -51656 17747 35582
261C5582q4825N8136L1690q7343M6981M6465q7930L0181N9142p9756J4347O2838
$$ 35582 -49243 8893 40583 -46760 221 46686 -41244 -11063 48079 -31677 -17330 45508
273D5508p1878M844O7726o6391p652P1610n6480j7318P1197n0515k4676P6079
$$ 45508 -26370 -21526 46200 -20191 -27843 43767 -12713 -30031 41166 -9349 -34025 42054
285D2054m3955l8953P8273k9834m9896P4183j8416n8453P2049m000o9010O2336
$$ 42054 -1901 -40854 37419 7585 -42311 31872 13456 -44997 27052 23052 -45958 16378
297A6378J3164o9753M9445K1030o8583M3322K9964p0890L2856L9644o6910K3757
$$ 16378 29542 -40211 9234 30264 -38319 5003 34967 -35923 -3067 36577 -30333 -6576
309f576M3239o6523J8704N3166o7681M998O2829n9612p497O5472n3605j7706P1686
$$ -6576 36663 -29860 -11156 42010 -25671 -20673 42156 -17456 -24953 40519 -13086 -30792 40894
322D0894m4620l3387P1096k8655m0952O3870k0154m4852O2486j0728n2802N5845
$$ 40894 -3726 -37113 33983 5328 -35624 28246 8092 -36760 25726 14998 -37804 18041
334A8041J146n3055M8827N036n5942M8469J5127o3773L9292K8430o2253K8950
$$ 18041 19187 -33868 14959 19995 -35947 12522 27649 -36124 3168 31598 -30655 -1705
346a705L4504o2470K1851M5764o1717O479N3296n1326l865N2444m6442r697N7364
$$ -1705 32799 -29671 -7820 37944 -23773 -17294 36002 -15324 -19189 33255 -13187 -22884 34480
359C4480m1061k1439N7546l0288k5996N4326k7451l0729N8865k0508m2660N6479
$$ 34480 -6581 -28020 29526 -762 -26758 27568 117 -30612 28253 7745 -34915 21564
371B1564p531m6894N0555q70n1760M8481J1202n8224L7155K3467n3885K6768K6260
$$ 21564 14033 -32861 17694 16824 -34936 13545 24747 -33477 3678 27145 -26740 28 26288
384B6288n2116K2289L3672n1928J1316L9089m4729M885L8972m3799R58M6257m2030
$$ 26288 -25828 -3539 30133 -21795 -10479 28610 -16119 -11234 27738 -16061 -15103 31154 -10876
397a0876j0838N0100l3045j7976M9384k8888k4797N3177k0557l5971M9609q131
$$ -10876 -21714 28386 -4659 -22635 26749 -2139 -26936 26241 5684 -30287 19322 11191
409A1191l8769M3082k864m1022M1271M963m5552L4233J3076m3767K8742J5787
$$ 11191 -27578 15504 12640 -28382 12889 17852 -27700 6533 19609 -24158 4584 20371
421B0371m5493K6497K3946m8217J7415L1554m4245R886L4604m2743L484M1206
$$ 20371 -25122 1375 25321 -22896 -5481 26073 -18172 -8286 26318 -16425 -12941 28265
433B8265l8974p696M3516l0021j4045M1604k5123j8626M2637j9035k5241M0075
$$ 28265 -10709 -18405 25111 -4910 -18955 22649 -2474 -21100 21537 2502 -22739 17336
445A7336j1733k7272L7521q651l0971L8185k248l6909L4455N640l8763L0217J1119
$$ 17336 5603 -21669 15852 7201 -23770 14415 12167 -24742 9713 15353 -23410 6807 17926
458A7926m1553K6166J9400m2929J7773K5671l9538J1094K8414l7469N733L2524
$$ 17926 -23627 2539 21939 -20990 -3217 22454 -17084 -5990 22424 -15045 -9312 23212
470B3212l4482j369L4267k9612n856L4887k6991j0577L7394k2789j7117L7678
$$ 23212 -11270 -12639 21628 -7984 -13840 21047 -5944 -16521 20873 -1916 -19033 18645
482A8645j6897k1929L7048j1555k7292L5902l926l1859L1305L319l3031K6490
$$ 18645 1748 -20181 16867 5312 -21980 13922 9996 -21863 9442 12761 -20270 6220
494F220Q376l3835K2300J3492l4023J7338J7536l3186J3293K0993l3003R066K5200
$$ 6220 14596 -19239 3061 16553 -17470 -132 17404 -15782 -2489 18504 -14499 -5433 19767
507A9767l2166L775K8890l0161j799L2108k7162p995L4269k2488j3961L4582j6999
$$ 19767 -12399 -8624 20266 -9895 -11694 20414 -6748 -14743 19526 -2962 -16923 17659 660
520F60j8884L3407j1255k2365L0992o265k4537K8729j997k6730K6341K663k8395
$$ 660 -18224 15183 3928 -18437 12555 6290 -18247 10482 8485 -18245 8096 10759 -17636
533a7636K3353O811k9754K0601J1618l1448J6151J7143l0871J0523K0777k9262
$$ -17636 5717 12528 -17226 3375 14993 -16455 -304 16839 -14032 -3509 17268 -11994
545a1994N864K4195k7583Q8K6913k3585m932K7027k0277p947K8025j7823j2353
$$ -11994 -6130 18065 -9518 -9430 17483 -6102 -11034 15993 -4284 -12231 15794 -2029 -14382
558a4382K8721j3500j5703K7717j0637j8310K8531p007k3334K7329m86k5812K3324
$$ -14382 14339 839 -14864 12853 2216 -16094 12437 5430 -17904 9425 8939 -16873 6451
571F451L809k6642K0937Q347k8586J6289J3713k6957J1011J5412k5294Q606J8108
$$ 6451 10260 -16382 4555 12902 -15684 605 14318 -12639 -1628 13784 -11510 -2904 15204
584A5204k5257L927K1246k2159j97K1428k0529k411K4175j9465q067K6183j4447
$$ 15204 -10053 -6126 15120 -7039 -7236 14192 -6337 -8748 15427 -4038 -12105 14078 -369
597c69j2294K4792j1245j4645K5491p747j9424K3891j640k0656K0088O34k0823
$$ -369 -12663 12129 884 -13761 11730 3983 -15441 8450 6810 -13846 6242 6876 -13947
610a3947J9687L617k3749J6909Q503k3263J3230J0030k3349J2122J3838k4946
$$ -13947 5740 9357 -14392 2517 11020 -12243 987 11017 -12332 -210 13628 -11318
622a1318P211J8197k2115K624J8703k0551K36K1588j9155n571K2854j3808q698
$$ -11318 -4107 14090 -8025 -5401 13302 -7249 -7013 14575 -4580 -10151 12703 -1105 -9803
635i803K0631j1604r767K1695r534j3954K0985m771j5183J8681l421j6416J9634
$$ -9803 10828 -776 -10543 11152 1618 -12336 8649 3878 -11305 7376 3955 -12461 7173
648G173j43k0466J7087N232k0287J3543O776k0685J2692J0672k2376P942J4608
$$ 7173 7030 -13436 3651 8883 -11404 2139 8915 -11770 922 11594 -10782 -2840 11768
661A1768j9506M234J4424j8599L107J7194j8401j660J8919j4550m120J7876j3776
$$ 11768 -7738 -3504 10920 -7679 -4572 12622 -5779 -7439 11480 -3070 -7190 10686 -3090
674c090n528K0387j2117j0663K0429p047j2553J8174n224j3996J8698j723j7559
$$ -3090 -8618 11769 -348 -11011 9418 2371 -10182 7992 2768 -11228 7470 5747 -11812
687a1812J5817L112j6808J2490L893j6910J2321O889j8812Q779J0319j6880O018
$$ -11812 4005 7117 -9691 2799 6692 -10218 2103 8992 -9820 -1041 9278 -7602 -1584
700a584J0489j6955N368J3672j7658R92J6213j4668j891J6027j3743l737J8283
$$ -1584 8905 -8050 -2682 10990 -6668 -5676 10537 -4131 -6022 10005 -3738 -7475 10808
713A0808j1956q268J8186p591r752J6231o296j0714J6968l994j3764J5392k40
$$ 10808 -1148 -9416 8770 1179 -8573 7658 1362 -9352 7616 3622 -10142 5250 5010
726E010j3980J3274Q53j4798J3169L796j6868J0307P305j5950P533Q433j5862
$$ 5010 -8970 4304 5157 -9641 3528 7324 -9544 763 8068 -7882 -349 8084 -7778
739g778O022J1213j5867K232J3171j3355k74J3071j2324j743J4576j1179m803
$$ -7778 -1756 9457 -6410 -4178 8993 -4362 -4636 8435 -3889 -5632 8944 -2235 -7038
752g038J4986q647o289J4571p737p906J5697n762j0911J5111k590j2152J3700
$$ -7038 7948 -699 -6988 7583 -154 -8060 7637 1875 -9036 6075 3485 -8667 5033
765E033o57j3406J2993K124j4827J0672M903j4513Q461O367j4463O808Q443j4275
$$ 5033 4376 -9030 3963 6087 -8740 1932 6835 -7678 783 7150 -7313 -505 7938 -6337
779f337M220R948j3031K276J0759j2465M82J2340j1498k205J3259r611m367J3523
$$ -6337 -2117 7831 -5200 -2924 7835 -4630 -4148 8192 -3306 -5511 7748 -1863 -6230 7293
793G293p929o454J3778n715q509J3139l423r696J2281j596j0793J1517L33j1725
$$ 7293 -636 -7090 6688 973 -7536 5603 2180 -7516 4765 3169 -7624 3893 4226 -7499
807g499J0379K163j2326R210L941j2889P803N825j3127O088P627j3056M062R364
$$ -7499 2880 5043 -7283 1927 5868 -7021 782 6607 -6520 -432 7195 -5861 -1799 7565
821G565j2407J750J0585j1213l82J1403r861k559J1868p979m337J1548o372n493
$$ 7565 -4842 -3092 7493 -3720 -4102 7301 -2560 -5119 6749 -1230 -5567 5981 -391 -5884
835e884J1547n089p127J1496l054q502J0615j350r339J0142L17j0684R139K661
$$ -5884 5663 574 -6553 4943 1889 -6613 4002 2652 -6687 3455 3772 -6912 2227 4888
849D888j1187P394M129j1159O345N687j1653M447P608j0819K412Q046j0033J515
$$ 4888 -6299 1095 5224 -5935 410 6097 -5556 -1109 6499 -4320 -1908 6138 -3895 -2380
863b380R043r998m58J0353q506k403J0272p402l397J0996o486n747J1305l911
$$ -2380 6663 -3335 -3793 6560 -1946 -4349 5923 -1479 -4876 6120 -366 -6113 5192 1281
877A281p261R994k350p673R787r68r267Q798J609r463O846K501r185O484L706
$$ 1281 -5980 4014 1664 -6009 3778 2810 -6457 2341 3950 -5513 1333 3834 -5351 1133 4839
892D839j0212M974N859r557L013O186r141K614P534r671M03R278q052j664Q953
$$ 4839 -5373 -399 5460 -4097 -1084 5102 -4039 -1425 6109 -3562 -3159 6119 -1933 -3597 5356
907E356p027k296R757o518m502J0152m199n646Q974l360n882R432k429p845Q956
$$ 5356 -1671 -3967 5790 -728 -5230 4922 723 -4923 4051 691 -5191 4241 1812 -6033 2923
922B923Q0q225P273P87q221P342K158r718N844M597r081L754M928q606L337O241
$$ 2923 3003 -5222 2051 2838 -5383 1959 4117 -5601 243 4840 -4241 -487 4441 -4165 -828 5413
938E413r018J134P707p293n04P119o702o95Q152o673k825Q852m693l892P988m235
$$ 5413 -3605 -2471 5236 -2057 -2561 4558 -2144 -2839 5313 -1360 -4185 4667 -26 -3918 4070 -165
954a65m284Q953l423o521Q670r90o967P236m12p167P525R24q726O139L193q097
$$ -165 -4449 4504 1081 -5440 3230 2240 -4727 2509 2097 -5070 2455 3379 -5347 792 3985 -4112
970d112M409L306p894M335M616q585K413O133p213R84N815o997O81P215o957j726
$$ -4112 297 3603 -4291 44 4660 -3925 -1512 4621 -2592 -1608 4207 -2790 -2109 5106 -1851 -3577
986c577P990m849k860P074m311l189P899l566n211P594j377n529O405j090n692
$$ -3577 4413 -436 -3296 3778 -533 -3722 4177 611 -4600 2994 1617 -3912 2493 1403 -4289
1001d289O878m9p199N904J857o893M706J985p096M880L387q103L194N055p098
$$ -4289 2589 2540 -4659 1245 3102 -3791 915 2900 -4196 684 4071 -4032 -838 4217 -2881
1016b881J763N033o833J326O238o773p22O942n030j755O290m570k093O993l964
$$ -2881 -1118 3915 -2918 -1592 4646 -2127 -2849 4093 -937 -2692 3598 -972 -3065 3928 -36
1031c6l841O957k172m414O122j685m766O413o44o075N626J055o087M590J522o268
$$ -36 -3877 3080 908 -3506 2616 931 -3835 2578 1934 -4141 1485 2540 -3547 1043 2565 -3703
1047c703M407K691o909L085L976o250J999M086o092J646M954o170L63N691n313
$$ -3703 704 3395 -3514 -429 3547 -2703 -704 3382 -2710 -1064 3890 -2280 -1917 3774 -1539
1062a539n83N750m968j274O416m372k688O522l052l474O134k302m113O142j234
$$ -1539 -2122 3628 -1340 -2614 3802 -570 -3258 3264 212 -3262 2872 570 -3543 2599 1365
1077A365n094N533J17n349M730Q65n546M220J817n837L319K760n685K492L372
$$ 1365 -3729 1804 1921 -3428 1302 2167 -3379 841 2658 -3179 140 2900 -2785 -293 3079
1092C079n662J775M182n538P48M815n050k15N245m562j107N574l906k008N667
$$ 3079 -2583 -808 3374 -2164 -1416 3399 -1651 -1866 3379 -1183 -2290 3284 -622 -2630 3037
1107C037l191k714N689k476l441N591j651m057N337q20m616M982J08n028M405
$$ 3037 -154 -2868 2821 345 -3096 2495 844 -3213 2124 1304 -3312 1670 1778 -3250 1155
1122A155R67n245L833J815n546L049K881n455J947L509n022J142L972m780K51
$$ 1155 2122 -3123 710 2525 -3021 28 2909 -2546 -599 2910 -2112 -970 3002 -1778 -1527
1137a527M559m169p47M660l548j292M886l211k176N178k295k989M847j599l312
$$ -1527 3032 -1137 -1884 2776 -772 -2064 2822 -389 -2565 2613 318 -2671 2176 577 -2735
1152b735M864j108m139M752P6m611L948P57m601L691J318n140L091K476m995K003
$$ -2735 2129 1021 -3118 1634 1710 -2901 1047 1804 -2797 894 2212 -2928 163 2639 -2356 -353
1168c53K786m601J715L233m875Q46M198m244k96M157l627o52M519l486j767M990
$$ -353 2433 -2168 -453 2780 -2095 -1249 2949 -1295 -1591 2566 -1061 -1713 2806 -680 -2447 2543
1184B543k312k637M368j632k693M459j318l659M435Lm069L448M99l824L456P96
$$ 2543 231 -2406 1962 330 -2363 2096 778 -2881 1554 1557 -2512 936 1435 -2389 1067 1863
1200A863m600L088K033m542K041K228m241K033K729m797J145L850m145j4L671
$$ 1863 -2737 351 2384 -2158 -117 2111 -2130 -97 2632 -2165 -1020 2830 -1315 -1329 2342
1215B342l616m0M027l735j129M669k634k004M037k030j984M314j851l084M373
$$ 2342 -1274 -1314 2713 -1022 -2151 2518 -116 -2120 1917 -113 -2097 2217 366 -2718 1655
1230A655n05l500L432k0l360L529L78m272L073J758m170J993J920l832J924K383
$$ 1655 1150 -2350 1082 1062 -2298 1231 1609 -2663 410 2168 -2002 -9 1911 -1921 3 2386
1246B386m332J075L386l648J04L098l292J96L565l618p75M170k574j585L729k197
$$ 2386 -1946 -871 2515 -1133 -1029 2069 -1223 -1027 2538 -1080 -1855 2315 -259 -1844 1885 -312
1262c12j620M155k125k618M191q03l043L374m95k959L579L7l857L013J322l730
$$ -312 -1932 2223 98 -2520 1671 868 -2175 1199 704 -2255 1324 1361 -2496 517 1839 -1891
1278a891K043J409l475K155J883m038J271K919l375K99K663l053L04L277l274
$$ -1891 152 1561 -1914 241 2124 -1914 -643 2276 -1099 -800 1863 -1190 -886 2391 -883
1293h83p49L795k337j403L287k011j432L745j878k387L784q23k674L116n80k622
$$ -883 -1632 2163 -174 -1577 1710 -301 -1733 2012 134 -2253 1531 708 -1966 1150 570 -2052
1309b052L368k32l498L017R43l368K183R59l328K316J575l821J568K486l437P40
$$ -2052 1316 1084 -2414 603 1546 -1822 361 1320 -2008 308 1883 -1938 -370 2116 -1321 -581
1325e81K446l119N22K943l185m05L411k308j084L078k019j158L395j857k021L459
$$ -581 1865 -1254 -732 2211 -974 -1379 2032 -276 -1360 1718 -301 -1459 1936 79 -1942 1517
1341A517q69k423K929n12k426K961k59l080K865O71l190K138R65l126K089J388
$$ 1517 648 -1775 1154 642 -1784 1177 918 -2162 703 1374 -1816 322 1287 -1839 250 1638
1357A638l453J534K108l125P77K239k957N71K586k983qK985k448p08L001k141
$$ 1638 -1815 -281 1827 -1298 -521 1718 -1239 -668 1918 -1065 -1073 1912 -536 -1244 1757 -384
1373c84r89L162j798j715L250j127k075K965o18k476K860o5k824K467O14k896
$$ -384 -1373 1789 -9 -1724 1526 399 -1676 1289 671 -1805 1055 990 -1834 633 1247 -1649
1389a649K029R41k938J698J444l101J349J861k964P66K298k832K82K580k648k46
$$ -1649 380 1321 -1617 81 1525 -1576 -227 1634 -1330 -564 1734 -1098 -816 1764 -884 -1130
1405a130K849k289p47L019j982j112K986j559j569K980j150k002K867n06k382
$$ -1130 1719 -570 -1317 1702 -280 -1392 1594 35 -1534 1446 296 -1706 1161 655 -1727
1420a727K714j23k523K344M14k800K142R73l003J677J416k876J251J700k886Q09
$$ -1727 987 864 -1659 685 1099 -1701 441 1414 -1589 88 1504 -1372 -121 1579 -1307 -498
1436d98K242k748J42K477k371k10K579k218o87K902j813j230K822j410j410K796
$$ -498 1744 -1004 -862 1615 -756 -966 1613 -605 -1292 1610 -203 -1433 1389 -21 -1431 1365
1452A365j193j873K903n91k267K538j74k273K399J00k682K290P99k867J668J195
$$ 1365 172 -1701 1202 611 -1656 882 708 -1565 834 934 -1748 542 1341 -1526 142 1337
1468A337k685J415J450k885J007K091k700K94K198k312Q0K363k372m64K847j841
$$ 1337 -1348 67 1517 -1368 -361 1730 -970 -676 1522 -790 -710 1653 -719 -1183 1664 -177
1484a77j194K658j317j300K669j215j812K848n10k278K370n5k189K297R2k627
$$ -177 -1371 1287 -30 -1330 1339 124 -1688 1160 650 -1628 742 687 -1502 795 887 -1740
1500a740K188Q49k728J503J103k459J433J242k805J140J942k639L90K002k247
$$ -1740 448 1297 -1431 72 1175 -1284 149 1391 -1414 -274 1668 -971 -581 1421 -826
1515h26K90K151k418k29K701j893r77K470j412r91K519j380j571K756o31k053
$$ -826 -536 1615 -803 -1032 1669 -224 -1201 1269 -143 -1134 1385 5 -1566 1190 559 -1494
1531a494K242j90j951K209m5k432K100P73k558J411R89k306J395J165k671J034
$$ -1494 748 558 -1393 816 771 -1661 439 1212 -1346 65 1054 -1252 143 1308 -1363 -329
1547c29J889k458L06J887k088K80K002k254j89K486j787p82K254j433p73K361
$$ -329 1560 -898 -592 1295 -793 -513 1489 -765 -954 1532 -255 -1037 1217 -216 -989 1372
1563A372j439j341K602p50j754K134m14j692K181k46k225K099N29k361J472P85
$$ 1372 -67 -1408 1194 444 -1310 824 410 -1282 899 653 -1572 527 1056 -1305 167 952
1579I52k179J420J018k530J032J706k303L83J708k023L39J904k188j58K362j741
$$ 952 -1227 193 1211 -1319 -287 1419 -884 -501 1207 -816 -477 1427 -761 -919 1443 -298
1595b98o89K152j418p41K341j432j285K503p97j588K099m82j607K179k91k164
$$ -298 -987 1165 -253 -994 1347 -85 -1370 1133 336 -1252 847 365 -1242 937 646 -1518
1611a518K101L73k166J502N06k018J579P91k423J134J425k263O69J485k110N23
$$ -1518 583 956 -1210 292 798 -1220 359 1150 -1273 -139 1286 -977 -308 1177 -933 -410
1627d10J773k175k5K239j792n27K129j553o63K283j366j188K410q34j501K061
$$ -410 1363 -812 -837 1402 -390 -917 1212 -341 -1004 1279 -87 -1275 1135 301 -1200 861
1643H61m98j604K146l56j939K015K06k085J641M24k039J567P11k306J299J176
$$ 861 363 -1241 905 549 -1390 625 831 -1254 387 811 -1228 339 1050 -1256 43 1219
1659A219k228Q38J347k127O52J590k120K17J908j842k06J960j651m23K121j488
$$ 1219 -1009 -171 1176 -951 -299 1291 -829 -612 1296 -546 -752 1208 -443 -866 1255 -233
1675b33q53K233j059j236K128p40j457K105m34j765K001oj968J763L43k065J551
$$ -233 -1086 1147 88 -1148 980 240 -1217 888 454 -1311 690 684 -1284 479 822 -1243 308
1692C08O85k193J275J032k171R54J276k115O73J499k045L63J725j936K9J913j761
$$ 308 993 -1200 75 1107 -1064 -110 1166 -949 -276 1223 -822 -459 1266 -670 -641 1272 -489
1709d89l25K020j499o30K072j268r45K131r46j288K075n97j496J965k91j754J891
$$ -489 -814 1206 -293 -923 1149 -119 -1064 1067 121 -1167 908 311 -1185 780 489 -1265 626
1726F26J09j970J613M66j990J382P31k120J179J125k169P89J390k017N10J572
$$ 626 735 -1235 378 844 -1146 236 967 -1153 26 1151 -1018 -229 1161 -856 -346 1226
1742A226k004K10J869j825k52J951j518m51J947j422p27K156j130j145K045p56
$$ 1226 -778 -568 1301 -524 -776 1175 -343 -794 1153 -269 -996 1160 30 -1115 930 174
1758A74j249J955n91j513K001j83j801J715J56j777J562L51k010J437Q42k114
$$ 174 -1075 880 289 -1224 777 594 -1207 508 664 -1113 449 800 -1210 227 1069 -1045
1774a045R57J118j915P54J246k032N02J683j900j7J763j580j86J823j591n15K137
$$ -1045 -88 1030 -885 -131 1115 -917 -415 1268 -632 -649 1114 -466 -652 1171 -420 -935 1202
1791A202j242j015J986q66j047J948q15j359K058l52j683J735%j604J619Q8j883
$$ 1202 -40 -1055 931 65 -982 966 151 -1208 850 498 -1185 550 550 -1054 565 653 -1230
1808a230J563O26j996J092Q39j810R96R32k019P87J437j928K11J553j614Q8J614
$$ -1230 333 959 -1037 55 894 -916 80 1012 -1007 -220 1217 -711 -500 1053 -561 -473 1141
1825A141j689k50J985j349p80J873r95q30J899r57j232K076m62j571J711j06j509
$$ 1141 -548 -798 1187 -162 -942 931 -64 -894 1005 48 -1184 892 430 -1141 570 464 -1045
1842a045J653k7j808J622N02j959J164P39j786J072Q61k012Q63J341j900L38J405
$$ -1045 608 581 -1227 395 897 -1062 102 841 -945 127 988 -1024 -161 1180 -720 -382 1023
1859A023j653K70J507j762o1J865j450n50J772j142o27J859j115j034K021o30
$$ 1023 -630 -360 1147 -615 -676 1189 -261 -811 961 -181 -808 1051 -64 -1098 923 293
1875B93j379J730l07j378J721j65j751J686L73j911J257O41j814J142Q34k020
$$ 293 -1086 644 337 -1041 680 515 -1236 450 823 -1088 169 810 -1004 138 972 -1048
1891a048R02J280j919M51J368j733L49J528j818k3J863j515m31J759j264n10J867
$$ -1048 -146 1134 -785 -334 1034 -699 -350 1178 -640 -663 1200 -315 -746 1013 -251 -761 1106
1908A106j230q97J998q04j209J800n33j280J828l62j638J760J47j779J416L57
$$ 1106 -124 -1021 977 173 -1036 764 231 -1049 779 417 -1221 539 686 -1093 323 680
1924F80j751J358N94j988J085J079j948O91J205j825N36J436j884J52J767j623
$$ 680 -1071 287 881 -1107 -22 1057 -891 -200 1005 -820 -284 1152 -732 -580 1187 -436
1940d36k47J743j410l93J887j345p66K017r72j064J875p17j180J868n14j484J796
$$ -436 -683 1060 -350 -743 1144 -201 -967 1050 78 -986 889 172 -1008 860 346 -1138 658
1957F58j11j628J575J06j692J485L93j912J264P86j894R28R90j836P10J248j880
$$ 658 547 -1081 494 600 -1092 393 786 -1126 138 924 -970 -42 948 -888 -178 1070 -810
1974h10M08J526j733M7J651j564k03J799j431n47J927j152q50J903r05j078J917
$$ -810 -402 1124 -609 -562 1089 -475 -678 1121 -310 -857 1070 -82 -932 971 66 -1012 905
1991I05o39j356J873l38j541J718m0j686J586K31j806J411M98j864J180P91j898
$$ 905 266 -1090 783 445 -1096 622 582 -1104 482 713 -1093 318 816 -1048 132 923 -975
2008i75R36J028j872O82J257j847L91J499j720N5J653j540k32J764j398n18J884
$$ -975 -39 989 -883 -201 1056 -791 -400 1099 -621 -566 1087 -453 -685 1079 -319 -837 1047
2025A047j141q62J891q42j087J851o06j345J834k49j590J647N8j658J504K78j821
$$ 1047 -94 -956 935 93 -994 857 251 -1094 740 491 -1099 548 606 -1052 452 730 -1091
2042a091J366O40j912J023R25j835Q02J084j869N91J378j779J93J517j574%J607
$$ -1091 275 915 -997 26 951 -884 -82 1002 -867 -276 1102 -677 -484 1033 -541 -541 1066
2059A066j532k85J827j275o78J793r63q34J788q39j114J862m61j427J660j30j480
$$ 1066 -466 -751 1076 -199 -877 916 -47 -881 907 68 -1046 816 355 -1072 588 458 -1022
2076a022J572N1j710J467M99j851J098P62j755R41R19j885P31J298j811K79J427
$$ -1022 550 601 -1109 358 857 -994 104 866 -889 52 971 -914 -183 1115 -696 -417 1010
2093A010j579J28J512j598j81J795j330n81J732j062o59J757j001r66J892o00
$$ 1010 -569 -441 1071 -527 -708 1087 -243 -824 908 -154 -813 944 -57 -1023 869 269
2109B69j292J648l02j292J593j82j560J565K84j733J201N18j643J095P01j850
$$ 269 -1023 625 323 -969 624 442 -1118 447 731 -1002 199 717 -926 169 870 -980
2125i80Q90J147j783M23J256j572L03J388j679JJ732j423m44J671j141n24J723
$$ -980 -90 1057 -726 -303 953 -619 -316 1072 -607 -606 1126 -297 -741 930 -211 -735 988
2142I88j117q46J891p25j177J668m59j167J652l64j466J664P9j643J325L15j566
$$ 988 -129 -975 916 191 -986 682 223 -944 708 344 -1122 542 621 -1022 303 618 -948
2159i48J254M51j796J099R00j779O67J038j625N67J198j753K71J559j526j75J549
$$ -948 306 757 -1039 60 960 -819 -152 886 -739 -172 1026 -727 -456 1103 -423 -598 951
2176I51j282k95J666j263o59J846q86r97J685o27j066J711m85j405J699m1j547
$$ 951 -331 -626 1040 -223 -882 964 78 -919 766 139 -927 784 299 -1106 593 552 -995
2193i95J382J72j528J354L28j750J168P45j739Q19Q92j646P04J073j762M32J387
$$ -995 387 559 -969 385 713 -1037 131 876 -863 -44 848 -798 -94 979 -783 -351 1036
2210A036j560O0J395j387o9J558j365m25J733j037p45J633q11q70J692o51j199
$$ 1036 -524 -464 931 -456 -525 1033 -332 -757 976 -61 -806 827 16 -854 838 187 -1012
2227a012J689k51j390J458l6j422J411J98j674J243N92j692R21P63j630P88R70
$$ -1012 677 426 -964 494 458 -964 447 645 -1029 214 806 -886 35 798 -832 -44 926
2244I26j719N30J237j575K26J311j471O1J477j411k50J611j151n09J573r70o57
$$ 926 -793 -263 974 -601 -375 936 -535 -474 1003 -408 -658 953 -198 -707 866 -104 -761
2261g61J623q11r50J647m99j154J510k50j279J451j0j473J305L16j565J083N43
$$ -761 862 51 -899 748 249 -905 605 355 -924 527 517 -956 349 665 -900 183 726
2278G26j596R28P80j638O74J027j584M03J203j502J66J370j411r7J490j249l43
$$ 726 -870 58 838 -800 -126 901 -683 -280 923 -579 -413 957 -454 -551 939 -310 -653
2295f53J547j068n65J583q78p93J603o57r97J564m22j155J456j85j274J357M7
$$ -653 894 -174 -739 844 -34 -827 776 119 -878 686 264 -891 565 380 -894 463 510
2312E10j416J241L04j513J028N73j520Q24P66j550O23J009j506L14J190j389J04
$$ 510 -906 335 639 -874 154 727 -793 31 797 -753 -130 879 -627 -313 877 -512 -408
2329d08J318j326j55J488j127m84J511r01o37J503p59q58J558m96j106J443k44
$$ -408 910 -416 -571 917 -210 -694 817 -84 -721 782 23 -835 723 227 -879 564 320
2346C20j160J342r1j325J304K11j449J038M42j405Q99N91j500P56Q64j491M34
$$ 320 -840 502 411 -914 390 601 -848 190 632 -773 126 717 -783 -27 837 -654 -220
2363b20J022j338K73J110j338K9J361j191l00J362r40m34J383q69o76J515o08
$$ -220 802 -536 -263 847 -491 -462 899 -292 -592 770 -170 -604 779 -90 -766 749 141
2380A41r61J384l30j001J304k14j213J307J21j355J036L25j291R51M23j443Q45
$$ 141 -820 564 234 -767 537 323 -890 417 538 -817 219 544 -747 204 627 -816 29
2397B9P59j434N05Q69j280M08R33j353K06J222j206j33J211j000k06J253r84m69
$$ 29 788 -646 -141 728 -552 -144 789 -564 -358 864 -342 -475 736 -264 -470 783 -201 -670
2415f70J427p14p45J285m73p87J279m11j022J320n0j218J074J50j169J012K65
$$ -670 757 43 -702 583 110 -677 602 191 -831 489 439 -779 295 445 -724 288 553
2432E53j362R09O44j401N57P62j243M97Q37j360L13J134j214n2J139j020j04J180
$$ 553 -809 100 744 -657 -100 662 -581 -84 753 -607 -294 840 -374 -426 713 -307 -411 769
2450G69j034l50J359p67o12J219n70o42J254n25q89J318j96j065J075lj027J041
$$ 769 -265 -615 744 -23 -635 584 14 -628 626 101 -788 530 334 -731 344 341 -686 355
2468C55J09j243R62M53j282O53N99j198N88P16j315L83J001j187N3J033j028j6
$$ 355 464 -779 183 636 -646 7 606 -592 -4 712 -603 -220 781 -406 -353 680 -348 -364
2486c64J120j054k64J309q30n18J203o28n78J242n78q08J276k63r65J084j16r56
$$ -364 756 -298 -562 747 -83 -601 602 -26 -604 638 60 -748 528 265 -700 384 268 -688
2504f88J068J4j167J004L11j199P53M26j142O89N69j249M91Q25j162K42Q76j063
$$ -688 380 394 -773 231 542 -657 96 522 -620 69 638 -611 -120 705 -457 -215 661 -402
2522d02J23J012j082j13J181q72l63J136p30m51J193o28o91J226l70q41J101k01
$$ -402 -279 733 -349 -462 719 -153 -516 620 -110 -561 632 4 -687 539 169 -672 429 228
2540B28r21J084m3j088R90K12j110P79L49j107P21M94j195N45P03j121L29P77
$$ 228 -693 391 348 -740 250 462 -648 131 480 -627 94 588 -607 -62 641 -480 -151 626
2558F26j061K22R06j058KJ045q93k09J052p87l24J127o97n42J159m86p09J111
$$ 626 -435 -213 693 -365 -363 682 -211 -420 632 -155 -479 648 -49 -591 568 82 -627 484
2576D84l15q40J096j44r76J001P6j040Q66K30j083P76M03j156O17N92j131M41
$$ 484 169 -671 425 281 -695 306 382 -658 208 438 -645 131 534 -622 -5 587 -544 -103
2594a03P23j106K94Q42j042J08R48r68n5J024q64k32J061p22m07J094n86n68J098
$$ -103 620 -486 -192 650 -392 -284 664 -304 -359 665 -199 -431 630 -92 -499 595 9 -559 539
2613E39m20p23J052k43q29J002p6r66R33J43j047P76L29j063O62M68j110N02P07
$$ 539 119 -604 448 205 -624 378 302 -664 269 412 -635 141 470 -593 69 537 -573 -71 636
2632F36j122L00Q14j028J53R05j008k5J048q76k57J054p07l56J075o54n08J125
$$ 636 -486 -186 628 -400 -247 658 -350 -375 673 -203 -460 594 -113 -469 606 -48 -556 569
2650E69m55p04J044k65p64J004j69r16R87P1j019P95K42r85P03L43j087O12N93
$$ 569 114 -590 454 189 -575 429 260 -656 331 402 -617 178 420 -565 138 481 -606 6 599
2669E99j101L56P25r93K37Q02j033Q3R90r01k06J024p28k87J041p17m66J160m80
$$ 599 -502 -146 579 -414 -177 625 -408 -325 665 -236 -442 582 -146 -433 608 -109 -575 585 105
2688A05p08J046k88p24J027k29q96J041M0j034Q23J95r62P68K76j107O86N48j116
$$ 105 -603 443 155 -569 458 229 -667 374 414 -620 203 398 -564 204 480 -627 59 607 -509
2707e09M03O48r80L40P04j063J79R44r32j23R68p88j71R97p64m19J170n35o61
$$ -509 -106 542 -438 -98 606 -457 -278 666 -266 -389 579 -209 -380 617 -147 -566 604 69 -592
2726e92J028l36o60J034k94q84J073K4j027Q31K00r74P90K70j132P19N65j142
$$ -592 436 100 -560 474 180 -704 369 393 -634 197 397 -577 213 483 -649 70 635 -507
2744e07M25O44j009L78P16j114J93R84r81r8R48q04j06R83q40l32J137n99n71
$$ -507 -82 562 -447 -69 647 -467 -274 710 -271 -369 579 -225 -331 652 -188 -520 617 18 -553
2763e53J015m04n93J042l72q19J091o9r71Q86Q4r31Q33J95j109P64M96j126M97
$$ -553 462 58 -535 507 135 -684 407 338 -633 253 337 -594 239 434 -675 89 585 -541 -44
2782d4N94j046M32O98j116K47R29r88l4R42q63q9J008q74k96J135o49n25J053
$$ -44 550 -496 -64 634 -482 -235 694 -294 -328 614 -249 -338 670 -204 -500 635 -14 -539 514
2801E14m89n59J064m27p49J069j65q74R28j3q96Q98Q5j043P91L68j065N85M85
$$ 514 25 -534 530 103 -646 423 258 -616 312 299 -597 301 386 -657 134 502 -563 22 507
2820E07j031M89O20j093L19Q44j012P3R00r18l3R91q68k60J106o86m56J065n36
$$ 507 -524 -35 585 -508 -189 655 -357 -284 616 -302 -335 656 -212 -472 634 -52 -508 557 21
2839B1n66J102m47p39J080k12q47R62o8r03R13R9j039Q20L01j047O33M26j039
$$ 21 -545 557 110 -629 451 239 -608 354 286 -617 296 395 -644 176 477 -570 63 489 -550
2858e50N48N74j079L71P44j016J77Q43r56K8R53q84j82J044p47l43J051o10n07
$$ -550 -2 572 -507 -136 608 -408 -231 612 -344 -316 637 -247 -429 615 -132 -475 576 -34 -541
2877e41J100m61p07J091k74q11R85r0r18R41P5j014Q16K71j057O99M25j092N52
$$ -541 559 98 -609 482 208 -603 382 292 -626 315 390 -624 192 463 -594 105 530 -562 -10
2896a0N80j073L93P13j051K45Q28r77N0R21q91j07R78p84k75J039o57m51J048
$$ -10 570 -503 -110 603 -448 -203 625 -352 -302 619 -272 -379 599 -185 -460 579 -78 -529 519
2915E19m91n84J046l70p22J037j82q72R50lr30Q61J61j044P76L79j102N83N32
$$ 519 28 -556 490 120 -602 435 253 -619 331 328 -602 259 420 -624 152 531 -571 12 544
2934E44j043M44O43j080L16Q19j019Q5R05q96n7R65q58k09J051p02m07J017n30
$$ 544 -499 -55 588 -492 -176 643 -376 -291 614 -282 -339 626 -232 -441 610 -92 -499 518 -12
2953a2n01J032m73o59J069k38q34R46p0q40Q91J7r65Q44K78j064O25M52j000N36
$$ -12 -513 519 46 -613 456 218 -616 330 260 -580 311 328 -637 207 485 -579 46 498 -502 34
2973C4N36j103M15P67j048J44Q47r04M7R03r37j20J080p78l86J044n97m26J046
$$ 34 570 -533 -118 649 -399 -255 592 -312 -265 638 -299 -419 661 -117 -503 541 -56 -482 564
2992E64n57o33J140l13q11R65j44p84R26p0r49R09K05j040O79L51r62O27M11j083
$$ 564 7 -626 514 201 -610 355 211 -573 353 283 -666 243 448 -592 87 438 -524 103 514 -569
3012e69N12O82j051K51P28r17J83Q07r80j4J034q28k89R85o41l42J034o51n30
$$ -569 -57 625 -426 -175 553 -364 -181 626 -354 -368 666 -162 -451 534 -107 -449 585 -66 -596
3031e96J143m07p36R90k21p47R97j69r35R83J26j026P40K49r43P06L36j100O06
$$ -596 547 140 -596 394 173 -574 423 254 -681 302 428 -598 142 391 -552 154 490 -610 -4
3050dO11j075L38O64r56L08P20j023J24R46q79j42R08p35j71R80p60l98J121n22
$$ -4 607 -468 -130 534 -422 -114 606 -417 -293 653 -226 -368 540 -195 -366 614 -146 -544 577 55
3070E5o07R86l58o16J015k95q37J010J2r56Q13J32r20Q00K32j106O98N35j089
$$ 55 -552 434 76 -540 475 180 -657 353 365 -591 222 354 -566 234 466 -640 58 593 -496
3089d96M28N96r89L97O71j075K37Q73r41qQ68q19o4R40q17k81J069o13m77R88
$$ -496 -68 528 -461 -64 607 -468 -231 642 -299 -307 561 -258 -322 618 -199 -480 589 -24 -501 487
3109D87m84m99R91m05p01J032j80q37R00l6q47Q67Q4j002P86L29j017N73M47r94
$$ 487 3 -496 495 90 -611 421 241 -596 304 268 -579 288 372 -630 156 485 -532 41 488 -506
3129e06N17N71j071L42P83r97J25Q27r04K7R28q92j69J023p17l38R90n99m30J022
$$ -506 11 582 -489 -147 636 -361 -236 591 -313 -286 642 -250 -419 604 -113 -451 539 -60 -490 532
3149E32m95o22J043l00p31R37j69p66Q98l5r01Q28J60r35O97K95r92O25M48j026
$$ 532 37 -585 458 158 -573 364 195 -571 327 292 -609 219 379 -556 141 436 -556 69 517 -509
3169e09M59O14r81K83P02r42J53Q59r25l2R21q12j92R88p14l36J016n78n01J022
$$ -509 -50 564 -417 -134 568 -374 -221 638 -287 -319 602 -210 -402 586 -128 -464 552 -26 -527 495
3189D95m32o18R91k93p29R48j21q41Q96K6r05P92J62r48O86L42r81N61M48r80
$$ 495 63 -555 436 143 -586 362 241 -600 296 322 -583 209 371 -577 109 451 -530 31 479 -501
3209e01M32N89r44K73P29r41J44Q04q64k5R11q00k19R70o43l37R64n57n27J068
$$ -501 -69 520 -424 -151 578 -363 -219 585 -279 -304 607 -193 -412 558 -85 -422 542 -15 -542 526
3229E26m08o91R68k06p59Q99o3q92R04J06r85P57K64r61O34L58j010N50N71j019
$$ 526 118 -573 395 189 -570 329 266 -626 278 384 -601 156 420 -541 93 451 -559 -9 562 -457
3249d57L17O51q86K19O98r05P8Q94q38j43R13o90k26R37o86l65J055m98o11R54
$$ -457 -140 511 -375 -156 542 -363 -285 609 -229 -372 541 -149 -375 562 -124 -489 566 68 -543 411
3269D11k73o23Q98k54p70R83l1r41P88J86r25P30K33j023O57N09j050M10O12r40
$$ 411 138 -485 413 159 -611 372 341 -600 188 374 -551 179 412 -611 46 555 -495 -85 527 -413
3289d13L17O49j006K07Q89r38n6Q93p50j21R05p69k71J050n90n00R52l99n11R46
$$ -413 -96 553 -453 -246 643 -295 -351 542 -208 -329 576 -193 -464 586 -4 -504 448 49 -462 484
3309D84l88o89J004j21q58Q25L8q12P86Q0r67P65L58j037N24M85r59M86N36j061
$$ 484 96 -593 411 290 -568 257 295 -517 269 349 -618 147 505 -532 -8 477 -482 4 540 -521
3329e21L57Q06j001Q3Q25q49L2Q67q79j53J062p26l87R74n35m12R89n41n91J089
$$ -521 -164 642 -359 -276 549 -300 -268 599 -280 -433 629 -97 -484 490 -45 -457 532 -9 -600 489
3349D89k92p57R00j49p09Q93j01q98Q93J75r91O60K94r01O07L69j033N22O24j014
$$ 489 197 -560 340 191 -518 375 274 -624 269 444 -547 113 407 -494 113 482 -551 -29 595 -419
3369d19K58O93q94K04P54r66K4R93q29k44R52o74k59R84o76m59J106m56o66R67
$$ -419 -161 532 -362 -158 596 -370 -346 647 -182 -426 526 -148 -407 577 -99 -558 548 92 -574 393
3389C93k79o59R68k24q35R63M3r48P77J60q86P27K20r95O32M96j015L94N62r07
$$ 393 114 -545 423 199 -636 327 370 -578 199 359 -527 200 420 -575 57 553 -462 -68 494 -413
3409d13L40O46r89J87Q42q92m0Q63p65j13R12p58k97J039n78n07J001m41n63R95
$$ -413 -73 573 -416 -229 613 -279 -319 544 -221 -334 578 -180 -477 562 -16 -523 478 37 -526 469
3429D69l60p20R98j34q46Q76Rq73Q37J30r96P51L38j008N72M42r64M76N44r98
$$ 469 109 -611 387 253 -593 283 292 -581 256 386 -610 141 479 -529 43 485 -479 -3 541 -457
3449d57L50O99r50J61P63q80O1Q39q29j18R21o96k81R43n92m03R73m80n55R83
$$ -457 -107 592 -358 -197 566 -314 -253 586 -243 -361 560 -136 -417 526 -66 -469 504 24 -531 452
3469D52l24o82R33j69p91Q98k9q82Q11J62r52P05L08r86N96M63j022M76N81r82
$$ 452 128 -554 379 210 -581 317 288 -594 217 379 -573 132 440 -546 50 513 -509 -33 548 -434
3489d34L09P10r59J59Q07q78%Q62p92j36R09o94k89R49n55m31R32m38n37R39k92
$$ -434 -125 585 -374 -215 592 -286 -286 576 -216 -352 557 -137 -426 523 -32 -463 469 31 -506 433 141
3510A41o92Q99j33p63Q34j2q45P99J53r33O55L28r31N26M53r74M27O28r80K45
$$ 141 -551 348 215 -548 286 274 -571 228 381 -552 103 431 -500 26 479 -495 -68 560 -420 -175
3530a75P39q99J10Q06q74k8R31p74k49R51o05l53R46n51m82J000l82o52R14j94
$$ -175 564 -335 -225 581 -293 -321 610 -164 -413 538 -67 -420 526 -25 -507 493 111 -541 373 179
3550A79o99Q57j02q10Q40R6r10O82K56q84N77L46r54N21N43r68K70O66q58J76
$$ 179 -520 337 235 -575 265 361 -549 133 389 -495 82 428 -526 -5 538 -430 -160 506 -352 -176
3570a76P19q89N6R00q06j97R15o30k65R18o25m22J047m42o50R54k54o52Q94k11
$$ -176 543 -346 -290 610 -196 -393 522 -108 -373 545 -80 -502 545 103 -547 407 153 -499 395 184
3590A84p76R22J8r16P34J93q55O48K36r47O09M79r89L58N64q32K86N90r16J80
$$ 184 -592 330 348 -568 166 359 -496 152 388 -559 50 529 -460 -102 462 -370 -84 506 -410 -230
3610b30Q21q44p8Q31o81j35Q55p08k79J000n26n30R07l31n23Q89l24o95R64p9
$$ -230 591 -253 -331 500 -181 -316 539 -169 -448 552 26 -504 403 72 -451 438 114 -581 383 304
3630C04q70P95Q3q12P28J27r36O97L79r80M46M84q57M05N07r58K96P51q92L2P64
$$ 304 -566 229 312 -500 228 355 -581 116 495 -485 -39 445 -412 -7 500 -458 -162 589 -303 -271 493
3651D93p27j4P82p69j53R38o19l68Q60m46l77Q69m41n58R44k05p26P86m5p03P77
$$ 493 -234 -248 534 -235 -388 550 -69 -437 423 -23 -400 469 28 -530 414 209 -517 269 224 -479 298
3672B98j9q52P72K45r45N49L60q59M97M21r63M04O47r09J51P01p86R1P34q30l0
$$ 298 279 -573 199 444 -501 48 408 -451 46 467 -496 -92 555 -354 -203 498 -288 -197 537 -293 -323
3693c23Q89o77k74Q52n37l03Q57n16m59R29l13o07Q02j71o14P98j21p53P88J01
$$ -323 566 -111 -385 467 -70 -373 484 -32 -491 438 125 -482 320 149 -465 333 212 -541 247 348
3713C48q31O07K24p88N57K84q74M64N08q89K85N76q20K07O62q52O1Q14p37j47
$$ 348 -483 124 348 -440 117 401 -473 -9 499 -390 -105 471 -349 -142 520 -332 -271 543 -194 -341
3733c41Q23o25k11Q55n74l68R16m23n07Q41k85n66Q23j88o84P98j7p49O69J02
$$ -341 482 -143 -354 501 -73 -441 475 52 -455 386 101 -465 358 170 -514 284 267 -482 187 289
3753B89p49O14J94q27N36L57q30L94M60q06K81N51p89J48O67p49LP35o84j07P96
$$ 289 -460 154 348 -479 57 414 -416 -22 438 -368 -87 464 -325 -177 490 -259 -256 479 -205 -312 484
3774D84o07k63Q55n06l85Q47l83m95Q45k60o10P99j17o93P53J0p62O72J50p96
$$ 484 -123 -386 469 -37 -422 425 42 -453 392 132 -478 321 204 -489 264 274 -488 184 334 -462
3794d62N73K57q04M79L73q16L49M86p79K42N57p68J36O59p20l5P32o18j55P51
$$ -462 111 368 -436 43 416 -400 -51 435 -344 -102 455 -313 -177 482 -238 -273 459 -159 -314 437
3814D37n46k58Q02m58m10Q21l28m99P92k28o04P98r8p06P03P9p43O22J62q11N79
$$ 437 -109 -367 435 -23 -433 388 60 -439 353 125 -479 319 221 -485 218 297 -446 176 338 -473 106
3835A06L03q37M11M52p97L11M97q10K22O38p72J7P02o39n2O86o26j33P95n47l33
$$ 106 409 -428 -17 435 -362 -51 446 -364 -142 496 -276 -259 443 -196 -248 438 -188 -321 474 -73 -406
3856d06P81l64l87P36l21m92P99j88o26P05k3o38O49K3p33O57K19q30M78L50p57
$$ -406 375 11 -376 360 39 -453 346 158 -468 237 214 -424 225 248 -485 172 391 -439 39 389 -368
3877c68L96L76q15L51N63q14J15O44o75L5O51p00n4P85n93k65P70m42k90P21m16
$$ -368 28 404 -411 -60 503 -311 -196 448 -227 -192 459 -241 -295 490 -103 -368 402 -40 -330 391 -25
3898b5m02Q19k77n68P03q5n58O35p2o52O93J07p58M98K62o82M45K60p60M20M72
$$ -25 -427 392 115 -453 250 165 -393 242 170 -482 211 318 -440 58 320 -362 83 343 -417 3 475
3919D75p96J89N51o68J28N60p21M6P29o32j79P23n03j99P22n18l21Q34l50n05
$$ 475 -321 -132 419 -249 -121 439 -282 -236 493 -139 -318 405 -98 -297 425 -93 -414 420 70 -435
3939d35P25j93m85O91j84n94P26Lo94N55J30o29N26J43p33N00L51p70K95M24o47
$$ -435 290 97 -388 303 119 -475 251 254 -440 115 245 -384 142 285 -448 52 403 -367 -72 352 -295
3960b95K57M28p13J99N97o70l0O27n45p3O41n72j85P72m41l75P16l08l72O88k97
$$ -295 -38 390 -323 -124 473 -197 -227 400 -145 -218 423 -149 -334 438 -3 -378 338 30 -342 346 49
3981D9m92P59j20o25O14K4n97N80N5o91N67K32p33L88L07o53L52L45p13K64N23
$$ 49 -443 316 196 -429 185 209 -388 192 247 -444 123 355 -378 10 317 -336 16 361 -352 -88 435
4002D35o81O2N47n57K8N71n96o5O77m82k39O57l66k96O64l48l99P27k09n32O36
$$ 435 -246 -184 363 -194 -166 405 -191 -256 421 -61 -300 357 -9 -305 359 11 -388 339 130 -402 234
4023B34q3n28O04k6o47O00J46p04M64K46o70M06K94p03L23M38o99J86M88o23J14
$$ 234 151 -377 227 201 -446 154 300 -404 60 306 -364 42 336 -367 -44 394 -305 -119 369 -254 -140
4044a40N31o21J6O07n21j44O40m47j95O41l89l06O62k73m13O28j81m52O05q9n41
$$ -140 391 -230 -214 393 -128 -272 368 -79 -274 367 -22 -328 334 61 -352 276 95 -357 248 159 -382
4065c82N81L5o14N07J37o34M38K34o61L76L30o65K54M38o52J44N24o16N1N60n63
$$ -382 199 234 -380 127 264 -370 68 302 -359 17 347 -318 -64 374 -278 -134 390 -226 -175 385 -178
4086a78n5O08n03j58O45m16k42O27l31l38O54k34m37O25j33m84N72m5n32N41N4
$$ -178 -233 375 -128 -286 359 -57 -299 328 -3 -341 313 79 -358 267 134 -350 222 177 -355 186 240
4107B40n95M62J64n95L82K36o18L29L46o53K18M41n87J18M71n77M9N57n67p3O15
$$ 240 -355 107 271 -324 58 294 -324 5 351 -302 -84 357 -230 -112 359 -218 -169 388 -179 -252 363
4128C63m53j76O12m03k63O62l21l89O42j96m16N76j23m86N99k3n75N07J09n68
$$ 363 -90 -266 346 -57 -320 342 21 -368 274 78 -338 238 115 -371 228 205 -370 137 246 -322
4148c22M23J59n87L81K74o29K57L77n66J71L86n57J12N03n55l7N49m36j02N29
$$ -322 101 260 -327 54 328 -301 -44 333 -233 -62 324 -233 -121 382 -173 -210 339 -97 -199 330
4168C30m28j80O35l63l23O08k21l66N68j97m35O27p4n57N13P0n29M51Q3n75M58
$$ 330 -98 -278 357 -6 -329 279 58 -308 260 63 -372 255 181 -376 137 207 -322 129 212 -363 95
4189I5K25o42L06L36n66K23L37n84J85M54n46KM89m32l7M72m65q4N85l93k68N74
$$ 95 320 -322 -16 320 -246 -23 314 -270 -85 369 -177 -175 314 -118 -155 317 -148 -232 353 -40 -308 266
4211B66k41k77N17k46l41N84j36m74N09Lm75M63J5n31M86J49o03L27K83n43K90
$$ 266 25 -252 265 19 -322 262 126 -348 161 164 -311 152 167 -364 122 271 -332 -5 278 -265 25
4232B5K68n81K41M04n66P0M63m71L0M39m83l3N46m16k05N42k72k26M99k81k93
$$ 25 293 -288 -47 357 -209 -139 324 -147 -117 322 -161 -194 352 -64 -269 273 1 -225 274 -7 -300
4253c00N64j63m17M74l0l90M28k8m74M67R8n31L29K11m83K84K13n62K86L60n68
$$ -300 264 101 -316 158 128 -262 166 138 -336 131 229 -302 27 238 -245 39 252 -310 -24 336 -232
4274b32J19M19m73P3M08m99J0N32m34j61N19l26j68N07l28k50N58k07l72M90r0
$$ -232 -113 306 -167 -94 314 -185 -175 357 -77 -238 281 -45 -213 294 -34 -284 274 67 -305 185 95
4295I5l58M46q4m23M75N0m99L52J38m50L20J65n19K88K95n23J49L44m51J14L65
$$ 95 -263 183 99 -324 151 201 -298 54 192 -258 62 227 -292 -4 291 -232 -83 261 -190 -76 289
4316B89m83M3M68m31q1M66l42j18M72l23k17N33k33l18M98j52l40M87j16m07M77
$$ 289 -194 -151 317 -114 -195 271 -71 -189 283 -40 -257 276 43 -275 223 71 -269 218 102 -305 172
4337A72pm75M05R8m60L41J39m97L08K32m96K00L04m63J35L38m60P5M07m21l1M24
$$ 172 165 -310 95 193 -267 74 213 -284 24 256 -240 -40 264 -199 -64 274 -186 -111 296 -125 -156 268
4359B68l60p9M37l29j53M83k77k42M83j95k95M64j22l58M44l9m08M13K8m37L64
$$ 268 -92 -171 266 -63 -216 267 -10 -252 231 36 -259 205 83 -275 169 130 -278 135 163 -274 90
4380I0J01m69L25J72m79K65K52m90J82L14m58J18L60m49N0L97l94n2M28l35j03
$$ 90 191 -278 47 219 -260 5 257 -233 -51 263 -195 -77 283 -166 -116 281 -113 -165 263 -72 -175
4401a75M21k82j63M48k31k63M52j42l06M06q7l41M25k8m11L84O3m21L23J18m55
$$ -175 246 -36 -199 249 18 -245 207 65 -241 165 78 -263 162 134 -277 107 170 -251 72 190 -265
4422b65L03J95m88K24K72m45J54K89m42J09L69m30LM19l60o5M10l28j05M47k77
$$ -265 38 233 -255 -31 241 -204 -50 239 -203 -94 275 -155 -152 267 -93 -158 252 -76 -181 266 -11
4443a1k12M48j85k59M11j55k81M28q3l64L76L0l86L26M6l79L25J28m50K42K20
$$ -11 -223 225 40 -219 192 37 -244 184 101 -263 113 143 -243 83 129 -250 75 203 -247 -5 215
4464B15m00J68K23m28J70L22m60O5L68l73QL62l64l3M26l36j51M45k22j98M07
$$ 215 -185 -17 206 -222 -52 270 -190 -125 243 -130 -122 240 -124 -157 269 -67 -218 227 5 -193 214
4485B14k16k27M55j63l22M14m6l30L55l4l61L74O0m28K76J57l71K15J52l92K26
$$ 214 -2 -229 226 63 -259 155 109 -221 134 100 -261 113 173 -255 21 178 -193 22 174 -218 8
4506HK30m16R8L02l47N7K91l61K3L75l45r3L84k26j35L59k43j71M44j95k70L98
$$ 8 238 -178 -80 222 -125 -68 223 -138 -115 260 -85 -178 206 -20 -155 204 -39 -210 234 39 -231 167
4528A67q6k87L68q5l15L88Jl79K96R4l59K56Q8l77K61J86m14J57K39l54J15K37
$$ 167 81 -206 162 77 -238 150 151 -228 68 162 -197 59 147 -230 31 217 -197 -40 199 -155 -40 197
4550A97l58Q2L22l41m9L48k56p1L14k62r0L80k17k16L65j09k27L47j17k64L81
$$ 197 -161 -79 243 -98 -147 201 -55 -126 188 -74 -164 216 -1 -217 148 39 -188 159 42 -222 159
4571A59m7l44L17M6l15K67N5l63K78J51l98J78K04l36J32K06l69J17L02l67ML19
$$ 159 112 -232 85 131 -184 83 138 -225 53 204 -194 -16 188 -148 -16 190 -179 -62 240 -127 -123 196
4593A96k82k6L13k86o8L66k36j56L37j41j84L38j50k18L47o6l09L15J7k96K79
$$ 196 -86 -112 201 -85 -153 213 -23 -179 158 17 -167 171 21 -197 150 84 -225 90 107 -189 90
4614I0K5l28K67J11l61K05J61l37J75J69l51J44K54l67M9K92k93LK94k95l8L39
$$ 90 115 -213 54 165 -196 9 170 -167 8 177 -174 -30 224 -143 -94 198 -95 -92 202 -93 -131 208
4636B08k57j11L26j79j49L21j47j97L40q9k58L11m0k55K70Kk89K73N6l32K24J19
$$ 208 -49 -160 166 -13 -162 159 12 -185 155 66 -192 119 79 -176 94 96 -193 80 136 -196 28 147
4658A47l09J70J50l21J41K05l11O8K52k98K9K78k95pL01k59p2L24k28j24L37j77
$$ 147 -162 8 158 -163 -22 183 -128 -60 192 -106 -77 201 -94 -101 200 -59 -131 193 -35 -159 178 1
4680Aj75L37j34k05L10p4k60K99pk74K66K6k86K25Q1l09J92J45l06J35J71l08
$$ 1 -174 163 29 -176 134 60 -200 99 92 -182 84 110 -176 49 130 -179 13 158 -148 -13 158 -150
4702a50J10K17k91M0K59k67nK52k35k6K86k21j06L09j71j36K98j57j66L23j10
$$ -150 -40 177 -114 -74 185 -82 -87 165 -70 -96 190 -31 -137 172 1 -135 163 6 -160 163 53
4723E3k46L15l6k56K63jk64K57L7l11K33J02l03J73J26l01J51J82l17Q4K37k73
$$ 53 -193 122 86 -170 93 92 -172 85 122 -189 44 146 -157 16 142 -159 -8 174 -143 -59 178 -95
4745i5K1K27k53J5K71k50p9K94j64j14K66j49j39L01j21k03K83l1k27K47m0k30
$$ -95 -74 153 -100 -85 186 -64 -143 151 -13 -127 139 -10 -149 152 31 -172 111 80 -147 100 60 -170
4767a70K62K2k95K24Q5k72J77Q3k71J70J52l21J22K05k79M8K10k60L2K57k50o4
$$ -170 92 114 -181 43 128 -144 33 116 -155 15 167 -154 -32 173 -106 -58 152 -108 -76 181 -69 -133
4789a33K77j76q5K46j66j06K96j37j80K79o4j86K37n2k06K65rk62K09O2k26J55
$$ -133 144 -32 -117 129 -37 -143 153 16 -164 115 51 -135 102 50 -156 109 100 -162 47 109 -117 38
4811C8O5k51J86J13k78Q8J81k44O0J79k54O6K23k51l1K59j96m3K27j90o7K81j76
$$ 38 103 -148 38 151 -127 -39 142 -102 -42 137 -117 -51 172 -79 -110 149 -47 -90 137 -53 -120 161 -15
4834a5j44K68q2j53K32q3j72K52k0k45K20L8k17J74M1k32J75J08k70J00J57k11
$$ -15 -159 109 27 -126 106 23 -149 103 83 -162 58 96 -121 53 94 -138 37 145 -125 -25 132 -79
4856g9N6J48k34O4K07k52%K18j79l4K09j71p6K75j68j18K57j11j39K27q6j67K59
$$ -79 -23 125 -109 -45 162 -90 -90 128 -51 -85 124 -47 -123 152 -16 -134 123 12 -127 100 14 -153 106
4879A06m3k36K25K9k17J94K3k28J85R0k61J25J39k28R3J41k45P9J90k39RK09k02
$$ 106 63 -173 52 81 -136 58 81 -147 38 128 -133 -8 131 -97 -4 137 -108 -29 161 -78 -69 140 -62
4902f2j2K06j87m9K47j69j07K52j09j33K35j01j47K43n7k01K18Lj94J86J5k21
$$ -62 -74 132 -55 -104 143 -26 -133 119 10 -123 112 11 -136 107 50 -151 67 70 -124 62 77 -144
4924a44J90O0k47J56J11k41J09J32k37Q2J82k45L7J96j97j2K05j99k4K26j61q7
$$ -144 46 106 -141 15 126 -115 -6 126 -111 -29 153 -92 -55 141 -56 -68 137 -62 -86 140 -21 -108
4946a08K33j27j23K34j01j51K44o7j74K20k6j82K01rj96J88L7k25J59R3k44J33
$$ -108 125 -2 -125 109 8 -143 101 34 -140 80 54 -128 73 64 -132 56 93 -132 27 120 -124 9
4968IJ20k49J06J56k48O6J83k37L6K00k03k0K36k04m6K36j49j10K47j21j28K31
$$ 9 129 -120 -14 142 -106 -40 143 -94 -58 142 -61 -81 155 -49 -95 141 -8 -118 129 8 -120 111
4990A11r2j49K29m9j94K16Mk11J88L7k26J72O1k30J46J09k27J00J23k18P5J72
$$ 111 19 -130 99 50 -144 72 76 -135 53 90 -136 36 97 -133 13 122 -105 -5 118 -100 -25 147
5012A47k33J8K11j98j3K02j90l3K34j77q0K49j41j17K36j03j34K31p3j89K35q
$$ 147 -86 -68 143 -55 -68 134 -56 -89 145 -32 -112 137 -4 -121 115 12 -122 109 36 -153 82 74
5034G4k15K03Nk00J88M4k48J72Q8k29J18J26k35J03J47k49N7J93k02OJ92k05%
$$ 74 -141 62 67 -133 55 99 -149 23 111 -118 0 126 -109 -6 141 -108 -51 142 -60 -54 138 -67 -67
5057f7K20j88p2K44j45j06K33j14j22K36j04j67K44m1j85K07k5j84K03K4k42J72
$$ -67 153 -35 -107 137 -8 -114 119 5 -117 119 15 -152 92 51 -134 73 48 -136 67 91 -151 21
5079B1P7k33J55Q3k41J34J31k46P5J79k16K8J79k13K7K20k09n4K39j45q8K15j26
$$ 21 98 -135 20 103 -138 -4 127 -119 -44 135 -81 -53 126 -87 -60 160 -49 -103 136 -9 -97 118 -8
5102hr5K29j14j51K28l4j81K01l3j82K12J4k34J81N9k17J47P3k30J53J11k48R5
$$ -8 -103 126 12 -139 89 55 -126 75 42 -140 72 86 -148 33 92 -125 22 95 -135 18 129 -119 -24
5125b4J58k12M2J60k14L2K11k12k9K25j63o4K20j50q1K36j15j57K46o2j56J92
$$ -24 134 -78 -36 124 -90 -58 153 -59 -88 137 -26 -90 130 -20 -101 135 20 -137 109 47 -109 83
5147H3m2j72K13pk23J88M4k14J65M8k22J56J08k49J07J47k25P8J36k11M4K04k29
$$ 83 41 -131 82 75 -148 40 84 -130 35 83 -139 17 125 -124 -17 130 -95 -17 119 -92 -48 156 -73
5170g3rK27j94m6K26j74o3K40j50j16K42r0j46K40q9j58K39m9k07K18J8k13J80
$$ -73 -82 145 -49 -95 131 -43 -106 134 -16 -132 110 20 -126 114 25 -133 106 57 -150 68 86 -127 53
5193E3L6k31J78Q3k50J14J31k18Q6J41k44Q2J78k27K2J88j83pK06j90l0K25j53
$$ 53 89 -142 36 119 -131 -17 114 -104 -18 123 -121 -39 139 -88 -66 122 -61 -68 138 -52 -82 143 -10
5216a0j07K34j22j19K30r9j55K47n1j94K22k0j99K08Ok15J94N3k40J56R0k25J23
$$ -10 -117 117 -5 -124 106 7 -148 99 48 -146 76 56 -143 65 71 -144 50 103 -137 19 109 -116 7
5239GJ09k43J08J64k43L6J95k08NJ99k01oK27k01n2K36j40j05K38j22j22K33p7
$$ 7 116 -127 -19 145 -98 -62 133 -75 -70 129 -72 -78 149 -52 -104 132 -8 -113 125 3 -119 114 37
5262C7j60K20l9j92K20k1k13K07K3k24J84O4k39J64P9k31J25J17k38J00J46k26
$$ 37 -123 97 58 -134 86 65 -148 59 82 -142 42 106 -133 31 110 -121 4 121 -117 -17 129 -97
5284i7N7J80k26K2K10k10j0K22j91n8K20j37q6K33j29j19K33p9j60K18m5j75J96
$$ -97 -40 140 -86 -64 146 -64 -74 148 -43 -101 119 -18 -104 129 0 -119 114 35 -125 93 48 -127 69
5307F9j8j92K05J9k29J75N6k13J42Q8k31J27J20k37Q6J62k17M4J81k14J4K07k06
$$ 69 51 -141 64 83 -146 29 85 -128 14 102 -129 -2 118 -119 -33 129 -88 -44 137 -77 -63 144 -62
5330f2k7K30j78n6K16j52p5K22j24j28K42o8j64K10n3j63K17j9k11J88M2k10J57
$$ -62 -89 141 -37 -93 123 -29 -104 118 -6 -134 108 40 -124 86 33 -130 87 68 -143 45 87 -123 34
5353C4M6k07J45Q2k36J16J33k10N9J47k19P3J70k08mK10j80k2J80j50m5K26j59
$$ 34 80 -127 18 100 -136 -20 113 -97 -38 109 -110 -37 133 -75 -79 131 -49 -71 109 -41 -86 140 -19
5376a9r5K26j05j10K01p8j50K29m2j85K07jj96J65K3j89J64N6k30J28J16k13Q5
$$ -19 -114 112 7 -103 98 20 -130 99 57 -128 79 78 -118 47 70 -119 45 101 -129 -1 115 -98 -13
5399a3J16k10P8J50k11K9J77j79j3J83j55k9K13j61q3K35j13j17K06r1j19K19
$$ -13 103 -107 -29 121 -90 -61 116 -63 -76 107 -48 -77 136 -25 -108 127 14 -103 103 12 -107 112
5421A12q1j62K15l0j73J80Lk04J99K4k22J55R2k19J01J19k26J03J25k10M7J74
$$ 112 31 -131 84 54 -119 61 64 -140 59 83 -139 16 108 -111 -10 109 -117 -14 111 -99 -52 122
5443A22j87KJ68j72rK05j71o4K08j20q7K15j11j22K32q0j44J93j9j68J84j8j79
$$ 122 -65 -63 105 -67 -76 129 -42 -106 102 -18 -105 110 -1 -123 109 29 -115 78 59 -109 75 57 -122
5466a22J90J5k07J50O0j95J28P9k09J13J19k23O4J65k13M4J47j84J4J97j86l8
$$ -122 68 83 -124 26 86 -109 19 98 -111 2 121 -102 -38 127 -86 -42 105 -79 -65 132 -54 -92
5488i2K06j41p0J98j28p5K06j08j27K08n5j32J89l4j54J78Qk04J77L8j92J39N7
$$ -92 114 -27 -97 101 -27 -102 104 -4 -131 77 22 -110 79 45 -109 69 77 -127 50 88 -104 35 92
5511I2j95J18R6k18Q9J27k00O2J45j99M1J70j95jJ79j57k9J92j37o8J94j08j04
$$ 92 -103 15 111 -107 -18 109 -91 -29 116 -83 -42 128 -67 -68 111 -46 -75 117 -20 -88 106 -2 -106
5534a06J98p2j34J97n4j52K08j7j95J79K2j90J63M4j97J26Q5k11J13J03j96Q2
$$ -106 92 20 -114 83 29 -123 85 68 -127 52 74 -116 47 91 -106 20 105 -106 7 110 -86 -4
5556dJ20k04M6J62j88OJ74j70j6J91j55m6K04j35q7K07r9j13K07p9j28J92m0j62
$$ -4 116 -88 -42 120 -68 -62 112 -58 -74 117 -38 -84 120 -15 -102 105 6 -107 100 21 -107 85 45 -117
5580a17J77%j85J66L8j92J44N9k04J38P8j98R5J05j88O6J34j90L3J66j87J5J63
$$ -117 60 60 -125 41 79 -113 31 90 -114 24 102 -96 -1 104 -84 -18 116 -74 -41 125 -62 -47 116
5603A16j57l5J75j31n2J96j21j00K02p7j22J99o4j37J88k5j70J78Oj81J58K9j77
$$ 116 -41 -76 99 -32 -84 112 -9 -109 93 16 -106 93 29 -108 80 55 -115 63 69 -112 46 75 -102
5626a02J27O7j95J07R8j93P0J32j96N7J47j91J5J69j49l0J74j43l3J87j29p2J71
$$ -102 25 92 -103 4 102 -91 -21 111 -85 -28 119 -72 -57 112 -37 -67 107 -36 -69 118 -11 -83 88
5649H8r0r4J80p3j24J93l8j60J73Nj67J51K1j65J39N6k03J22Q5j82Q6J00j80O2
$$ 88 -2 -96 84 11 -113 80 42 -118 55 60 -107 44 65 -100 39 95 -108 14 99 -83 3 103 -77 -15
5673a5J30j96M3J38j46kJ46j59oJ81j28p6J95j09p9J70q2j00J88o1j61J87qj52
$$ -15 115 -81 -38 100 -46 -48 98 -61 -67 114 -14 -90 105 -4 -83 87 5 -95 93 32 -129 58 50 -102
5697a02J37J2j53J56L6j92J21P9j82R3R5j91Q4J15j91N1J49j73QJ52j50j3J62
$$ -102 35 47 -106 50 86 -106 15 94 -88 5 100 -91 -7 108 -83 -32 117 -56 -48 104 -46 -59 103
5720A03j38n6K01j30o5J84j09q4J85p6j21J68j8j39J57j6j60J63K4j87J39N3j73
$$ 103 -35 -91 110 -20 -85 99 -10 -94 91 15 -106 62 44 -95 62 46 -114 49 73 -114 25 78 -95
5743i5J11P4j89R6J11j90N3J40j62K3J41j71RJ72j69l2J75j13n9J70j06q2J86
$$ -95 16 90 -99 -3 108 -82 -29 111 -51 -28 113 -58 -49 123 -46 -78 97 -16 -75 95 -11 -93 93
5766I3q1j22J85m7j38J79l1j44J71mj78J39O0j79J24O4j91J01J06j94O8J28j73
$$ 93 12 -110 75 28 -110 69 38 -106 65 61 -117 22 82 -97 27 91 -100 1 107 -87 -19 109 -64
5789f4L4J36j72J5J70j59k4J70j14o0J79j27o6J83q2j02J68n4j30J71m1j36J67
$$ -64 -30 106 -66 -51 119 -40 -64 106 -8 -68 111 -16 -82 101 19 -83 85 31 -99 72 31 -105 62
5812F2kj78J55K8j69J34M9j71J09P7j78Q0J16j90O1J35j85L2J53j69LJ57j45l0
$$ 62 60 -118 37 65 -104 30 79 -92 17 94 -84 -4 112 -78 -17 118 -67 -35 118 -51 -48 109 -36 -66
5836f6J71j28o4J87r1j08J85o1j28J86m0j52J82k2j61J60J2j66J34M4j60J07O8
$$ -66 105 -23 -87 100 9 -99 86 25 -103 83 43 -109 73 51 -110 50 62 -104 30 74 -86 21 89
5859H9j77P6J13j86P1J27j86M4J41j64J6J58j68j6J70j39m7J74j13p8J87q3j13
$$ 89 -88 -12 101 -85 -14 113 -73 -29 112 -52 -36 122 -46 -62 108 -31 -78 96 -17 -95 92 9 -104
5882a04J91o0j38J78k9j44J67j0j58J48K0j73J46M1j74J12P9j95R0J04j67N2J26
$$ -104 87 27 -111 67 38 -106 61 51 -107 41 61 -112 34 75 -99 13 92 -103 -13 91 -76 -24 102
5905A02j75K6J60j72pJ86j45m2J82j28o9J90j03r7J88p7j23J80m9j35J74k5j47
$$ 102 -73 -47 113 -59 -66 120 -25 -67 115 -13 -82 108 5 -92 96 19 -104 76 27 -108 66 41 -106
5928a06J52J5j57J40K4j71J31P0j82P8J09j83O1J16j69N1J30j76J5J58j34l6J64
$$ -106 46 61 -96 44 68 -103 28 98 -84 -6 103 -80 -19 97 -72 -21 109 -67 -52 106 -28 -64 100
5951A00j28l5J69j12q4J82q4j02J80o4j15J71l2j63J56J5j52J36J8j74J48N1j91
$$ 100 -28 -63 106 -6 -90 92 8 -94 86 22 -93 78 46 -117 39 54 -98 38 56 -118 30 81 -110
5974a10J06Q7j71O8J11j83O7J44j86J2J61j54qJ55j50k7J86j34o2J70q5q1J76
$$ -110 -4 83 -88 -20 91 -92 -25 119 -67 -55 106 -48 -56 99 -51 -78 108 -26 -88 82 -3 -84 92
5997I2p9j13J90n1j48J75mj54J46J2j79J60L3j76J04P3j77R5R0j83P8J24j85K9
$$ 92 13 -100 90 39 -109 66 62 -92 54 66 -113 47 80 -96 8 81 -96 -1 89 -94 -16 108 -77 -48
6021d8J60j71J8J45j57pJ73j38n0J75j09p5J90j04r5J79n2j35J66k5j39J73j9
$$ -48 112 -59 -41 104 -53 -60 113 -25 -75 100 -9 -84 106 2 -93 86 34 -101 65 40 -99 74 55
6044E5j61J55L3j87J26N8j69J07O8j85R3J10j97N1J40j71L4J32j69RJ76j66j5
$$ 55 -106 49 82 -105 21 79 -90 17 85 -100 -7 103 -94 -43 97 -74 -40 92 -77 -68 108 -58 -73
6067g3J72j22n3J84j24p8J97q1j31J82m4j32J85m1j55J73Oj82J53K7j69J35M9
$$ -73 99 -23 -76 108 -16 -94 103 22 -109 73 29 -103 82 41 -114 59 65 -117 36 63 -106 29 78
6090G8j84J12Q4j93R2J03j72N9J17j73L2J44j61JJ57j36l5J81j45m1J83j10r4
$$ 78 -106 6 90 -103 -11 92 -80 -21 96 -77 -45 99 -62 -61 96 -40 -75 106 -39 -80 103 -7 -101
6113a01J86p3j18J96p1j31J88l1j56J69j1j50J52Oj67J32N6j88J16R2j91Q3J08
$$ -101 85 12 -106 90 19 -112 76 45 -111 58 47 -103 49 55 -112 20 76 -112 4 96 -95 -12 96
6136I6j93O0J44j76J9J53j54j4J66j40l4J75j27n5J69j01p8J77q4j16J89m6j26
$$ 96 -97 -37 107 -69 -50 103 -51 -65 101 -39 -73 102 -25 -80 89 -12 -90 87 3 -113 76 30 -96
6159i6J65j8j59J55K5j74J45L5j85J27O0j87J13Q4j80O3J21j81M4J36j73K6J50
$$ -96 69 51 -108 47 72 -102 43 78 -107 20 80 -107 6 90 -90 -27 94 -87 -43 93 -80 -54 96
6182I6j42k2J64j34m2J80j12p8J88j00r9J82n9j22J78m0j49J65Mj67J53K2j60
$$ 96 -46 -68 96 -38 -80 100 -12 -90 98 -2 -101 81 22 -100 78 38 -111 54 58 -109 44 66 -94
6205i4J23N6j84J09Q7j90Q7J02j83O3J23j86K9J70j63rJ46j43j1J77j42o6J88
$$ -94 29 85 -99 10 97 -93 -6 96 -87 -24 99 -87 -58 112 -51 -60 86 -57 -68 109 -33 -99 89
6228H9j02p2J77q8j01J83n0j52J73qj44J54j3j64J54L5j70J04Q0j69Q1R5j81P9
$$ 89 -13 -85 92 4 -97 86 36 -116 57 49 -95 59 46 -118 36 71 -99 5 85 -84 -3 92 -89 -10
6252a0J14j77L3J46j67J3J49j64kJ66j38n9J82j07n8J61r7q4J95q1j32J82j8j42
$$ -10 104 -73 -40 106 -61 -48 101 -63 -65 101 -37 -96 86 -21 -79 82 -15 -99 96 15 -117 65 47 -95
6276i5J63j9j54J59Rj74J31O3j79J17N7j79J01J03j88N0J34j53J7J21j54J9J60
$$ -95 68 49 -105 54 63 -111 20 83 -96 21 78 -101 0 103 -85 -35 99 -54 -37 84 -70 -51 109
6299A09j54l8J69j22l3J65j24o9K00j08j14J96n0j20J64m1j42J82j7j75J61L7
$$ 109 -45 -83 86 -36 -69 96 -28 -97 103 -5 -119 77 27 -93 71 30 -112 70 53 -122 39 76
6321G6j70J31L5j79J20Q5k00R7J01j72N2J09j76N7J45j83rJ85j52k5J65j35n3
$$ 76 -94 37 72 -107 13 98 -102 -5 96 -76 -24 85 -91 -34 111 -72 -81 104 -48 -73 92 -43 -96
6344i6J98j11r0J86p3j15J78m7j47J82j1j67J56K2j72J42L2j62J28O3j89Q8R8
$$ -96 102 -9 -99 87 14 -101 77 30 -117 65 54 -113 43 65 -107 35 67 -95 33 96 -93 -5 93
6367I3j81Q1J10j88M8J42j73RJ57j58mJ62j48k9J78j31o5J88r4q9J87r2j14J98
$$ 93 -88 -7 103 -85 -37 105 -68 -59 98 -60 -64 98 -50 -79 99 -32 -97 91 -3 -92 95 3 -111 87
6391H7n1j51J75pj53J50Rj77J48N0j80J14O9j74R5R0j81P1J28j77K2J58j75K2
$$ 87 36 -115 60 53 -100 50 59 -118 30 80 -100 14 83 -91 4 94 -87 -16 112 -65 -43 115 -60 -38
6415c8J53j67pJ77j54m9J77j01p4J66q7j06J96o5j35J90l9j45J71qj69J55K8j84
$$ -38 115 -52 -59 118 -36 -85 92 -9 -83 83 -4 -110 86 21 -114 76 37 -108 63 55 -114 41 69 -115
6439a15J47N2j86J05R2j97Q9J18j96O2J36j82M0J46j74JJ75j53k4J76j30n6J78
$$ -115 32 84 -102 3 95 -102 -13 105 -91 -29 107 -75 -35 111 -63 -62 113 -40 -64 112 -18 -74 104
6462A04j13q5J86r2j06J97p8j23J94n2j41J61Mj58J45K9j81J44O8j99J16Q1j85
$$ 104 -9 -94 92 0 -106 91 13 -110 84 32 -109 52 56 -102 43 72 -109 35 103 -96 20 101 -84
6485h4Q6J03j99N7J46j80K6J50j63qJ79j57l8J87j29o8J83j01q2J83q3j26J92
$$ -84 2 105 -94 -37 109 -71 -45 105 -58 -66 113 -44 -82 105 -24 -92 91 -10 -92 91 8 -118 74
6508G4m1j49J79k5j53J65Oj73J43M8j81J29O5k00J20J03k09Q8J33j94L8J45j87
$$ 74 33 -116 63 38 -115 50 56 -117 26 74 -107 22 87 -113 7 110 -99 -11 122 -72 -34 111 -76
6531g6K7J69j72j9J80j51m0J82j33o4K10j06j21J97o6j25J88m4j50J77lj87J75
$$ -76 -49 120 -52 -71 109 -42 -82 100 -33 -97 113 7 -114 83 17 -108 80 36 -114 63 60 -127 48
6554D8K1j71J38M3j94J48Q0k17R7J06j84O8J17j83N8J57k07K6J74j68k4J74j56
$$ 48 69 -102 36 79 -115 33 113 -104 -7 99 -85 -17 100 -83 -25 132 -75 -49 125 -43 -67 107 -49
6577d9l9K09j51r1K05q5j03J92q2j26J95l9j66J83J1j83J58J5j69J60M9k22J36
$$ -49 -88 121 -30 -121 84 -1 -104 88 6 -120 75 36 -130 53 64 -119 39 54 -115 45 94 -128 8
6600HR0j93R8R7j96P9J44k01K6J61j69OJ70j75mJ98j60p0K04j14q4J97j24r1K06
$$ 8 98 -95 3 100 -96 -17 127 -74 -48 113 -56 -50 120 -55 -59 139 -21 -91 113 -1 -85 112 -12 -103 103
6625A03q1j53K02k3j73J82qj81J86M1k19J68N4k00J19O6j90R5J28k18Q3J43k07
$$ 103 22 -131 71 48 -125 57 49 -132 54 95 -124 44 98 -102 17 83 -107 -12 116 -102 -19 124 -83
6648h3N6J42j98M5J69j67j8J41q7j25K25j16q4K16q1j40K06p0j24J72n4j57K00
$$ -83 -27 115 -83 -38 131 -36 -54 87 0 -125 100 -16 -100 116 35 -105 101 31 -93 79 25 -132 68
6671F8j3k02J88K5j67J34M1j75J17J10k07R3N8j63O4J37j72j1J95k10PJ82j44
$$ 68 55 -147 41 66 -101 33 74 -101 16 126 -81 12 70 -93 -29 108 -64 -75 120 -90 -83 99 -45
6694d5j6J19j04n9K38j34j06J64o5j36K57p7j35K28k9j64J05L1k04J39N0k01J35
$$ -45 -61 58 -46 -105 133 -1 -107 57 -8 -144 113 36 -99 129 100 -64 41 72 -132 7 57 -144 -9
6717iO4j57O6J75k12L0J12j71R5J63k38M0J81j63k9J72j21o4J84j30p0K01j20
$$ -9 55 -102 -36 139 -73 -43 69 -102 -7 156 -82 -42 139 -24 -53 119 -2 -66 118 -12 -82 119 -1
6740aj06K08q7j27K07m8j65J89j5j58J62J0j84J48M9j90J13J00k05J09J01k04
$$ -1 -107 101 14 -113 94 46 -119 70 55 -103 59 69 -115 33 82 -108 5 105 -100 9 110 -94
6762i4P4J29k04N5J57k00L6J73j81pJ85j66l0J94j39p4J95j03r9J94q4j20J90
$$ -94 -20 109 -95 -40 117 -83 -47 126 -55 -62 123 -43 -73 121 -18 -92 103 0 -99 95 11 -109 81
6785H1n1j44J79j5j75J65J7j71J43N6j96J24Q9k00R6J18k09Q8J22k06N7J58j89
$$ 81 30 -114 65 50 -125 40 57 -114 29 85 -111 13 102 -98 -2 116 -93 -5 117 -89 -32 126 -63
6808f3QJ73j66j6J86j52m1J91j28p6J91j14q9K16r6j40J91l6j50J74j0j94J92
$$ -63 -55 118 -48 -64 122 -30 -71 120 -8 -84 107 -7 -96 120 24 -116 75 39 -111 63 53 -141 51
6831E1K2j99J60M8j82J20P4k02J05J22k14P0J55k00M7J48j82QJ79j80k7J94j46
$$ 51 73 -126 34 82 -100 20 94 -108 -3 119 -95 -25 130 -70 -23 125 -57 -49 130 -50 -77 117 -29
6854b9n2J95j32o7J97j05j21K04o6j24J87m9j59J99j6k03J92K9k02J54M4k01J59
$$ -29 -81 114 -18 -85 112 7 -114 90 24 -100 87 38 -121 78 62 -141 51 80 -122 32 76 -125 34
6877C4P4k21J11J11k07P5J31j95O8J54k13J3J86j56k5J72j55l5K10j44r5K10r6
$$ 34 108 -113 -2 109 -98 -23 108 -87 -19 135 -78 -65 121 -35 -60 112 -43 -78 132 -12 -107 103 7
6900Gj02J90q8j27K10m2j77J88Kj73J64Qj80J63N6k30J43R0k13J07R7k05J04J38
$$ 7 -95 95 7 -120 90 48 -129 59 61 -112 52 60 -120 43 99 -131 12 102 -111 -4 93 -112 -8 130
6924A30k25N3J69j80J1J70j87J1J84j77m5K10j33p4J84j00r3K04q6j67K14l3j56
$$ 130 -95 -42 127 -53 -42 128 -59 -48 136 -41 -86 124 -9 -83 101 1 -92 112 26 -141 73 40 -116
6947a16J79j3j74J73K2j90J42P5k04J22P5k03J19J16k16P5J39k07M4J54j80J6
$$ -116 63 50 -124 49 71 -119 23 98 -106 16 91 -112 7 123 -93 -18 121 -86 -42 112 -68 -52
6969e2J76j74k0J88j41m5J84j35q0K19j11j18K01n5j38J85m4j54J87j2j89J71
$$ -52 124 -50 -70 118 -23 -68 116 -19 -99 120 9 -109 92 37 -101 84 40 -114 73 61 -128 43
6991D3L5j93J35O3j97J27R4k09R0J32k01N9J38j84K4J67j81jJ84j66k9J85j40
$$ 43 78 -115 20 83 -114 13 107 -102 -12 120 -81 -22 116 -68 -44 123 -58 -59 125 -41 -70 115 -25
7014b5o3J99j11r7K06q9j28K11p8j43K11m6j57J76jj80J50M1j99J49O1j93J13
$$ -25 -88 111 0 -97 109 20 -108 103 25 -118 93 47 -110 66 65 -115 35 76 -123 26 87 -106 7
7037GR0j98Q0J31j75OJ94k15QK00j61n6K03j88l9K91k18q1K27j41r5K08q0j23
$$ 7 97 -101 -21 110 -65 -59 135 -80 -72 128 -33 -89 114 -74 -113 178 -40 -121 106 -35 -130 78 -2 -125
7061a25K33q3j44K20p1j60K16j8j99J81L8j95J18P9k02J08J12k16P8J32j90N1
$$ -125 108 25 -119 101 30 -130 86 68 -131 50 88 -107 11 90 -112 -4 108 -108 -30 102 -88 -37
7083c7J46j85K2J66j68oJ87j56m6J85j25q2K15j05j15K04p6j25J92m7j66J94j6
$$ -37 109 -76 -54 112 -56 -62 125 -31 -77 108 -17 -99 116 11 -104 100 24 -101 91 44 -122 72 56
7106E6j76J64K4j78J54M8k14J40R0k07R4J11k00P6J24j90M4J57j76jJ67j63j4
$$ 56 -120 44 68 -110 44 92 -122 18 108 -99 -5 106 -94 -18 106 -84 -40 117 -59 -60 107 -56 -70
7129g0J92j57m8K03j21q9J90r9j04K20q0j59K08k2j76J79j6j63J63K5k10J63P1
$$ -70 122 -35 -83 120 -1 -90 100 1 -103 117 37 -122 86 64 -112 67 51 -112 51 76 -134 29 100
7152A00k05J19P8j96J11J03k01O8J50j94K4J63j85NJ83j74l2K09j38p8J98j26
$$ 100 -105 14 92 -104 7 110 -91 -23 127 -67 -43 120 -65 -60 123 -51 -83 126 -12 -90 108 -18
7174a8p5K08r5j43K16m2j57J87k0j78J88J0k03J67M6k04J35N8k04J34J01k17P1
$$ -18 -93 115 20 -123 93 51 -106 81 61 -117 71 81 -122 45 91 -113 22 80 -124 10 111 -106 -35
7197c5J54j96M0J42j78L4J68j93j3K00j42n9J94j40o9K09j16j12K16p1j42J96
$$ -35 119 -77 -37 105 -73 -39 129 -64 -77 123 -19 -78 116 -24 -93 116 0 -112 104 33 -109 87
7219H7n1j55K04l6j80J91L2j98J56L6j90J45O3k16R6J30k05O7J31j96N5J50k02
$$ 87 36 -119 85 49 -131 60 92 -106 50 86 -104 41 104 -112 -16 114 -91 -24 107 -89 -34 116 -86
7242h6K1J81j61k5J79j51n0K19j42j00K25r9j06J81n9j34K04o5j63K06j2j69J52
$$ -86 -65 116 -45 -70 109 -42 -92 127 -15 -115 110 11 -95 86 27 -107 97 32 -131 75 63 -106 46
7265D6K5j90J72L1j98J33Q3k01R7J07k01P7J31j97K8J79j88jJ59j49j4J96j69
$$ 46 71 -119 53 84 -114 19 102 -99 -2 105 -96 -19 112 -85 -57 122 -66 -67 92 -57 -71 125 -44
7288d4n3J98j11r4K08r3j07K00o6j60J96j6j74J73Oj84J75K6k08J46O7j94J16
$$ -44 -97 101 -10 -104 104 11 -96 104 38 -122 74 58 -116 57 63 -121 54 80 -128 18 85 -109 7
7311GR3j99R4J23k05N8J55j88J6J59j74lJ81j74l4J98j28p3J94j23q7K07q8j28
$$ 7 100 -99 -5 118 -87 -29 126 -62 -46 113 -61 -64 117 -57 -91 107 -21 -94 100 -23 -110 97 9 -119
7335a19J97n1j39J83k2j70J83J3j94J70M6k10J35P2k10J09J16j97O9J38j99L9
$$ -119 78 27 -112 71 49 -121 62 75 -119 51 97 -113 22 94 -116 -7 109 -88 -19 119 -80 -41
7357d1J54j89K3J67j69j1J68j53l4K00j30r6K10j09j01K03q8j26K00m3j57J81
$$ -41 113 -76 -53 114 -55 -66 102 -51 -85 115 -15 -111 99 -10 -111 92 4 -122 78 35 -122 59
7379E9rj69J74J9k01J52O8k12J33R0k12J01J19k14O9J48k04L2J65j87K1J81j76
$$ 59 50 -119 55 74 -127 25 93 -119 14 104 -108 -7 112 -102 -33 115 -89 -57 108 -79 -58 123 -53
7402e3l5K11j54o2K07j21r9K08r5j26K15o4j55J84j8j65J86j3j86J77L8j98J39
$$ -53 -88 123 -31 -93 114 -7 -106 102 7 -119 96 32 -123 61 43 -122 64 51 -135 42 80 -118 21
7425B1O3j98J35Q9k27J19J22k08M6J70k11L8J71k04JJ99j76m0K01j42o0K00j21
$$ 21 84 -114 21 110 -117 2 124 -84 -38 132 -79 -41 130 -74 -73 126 -50 -90 111 -31 -91 109 -12
7448a2j04K18q9j30K00n2j57K18m9j74J88J2j89J69K5j93J46O6k13J25J04k10
$$ -12 -116 102 13 -117 83 31 -126 92 43 -131 57 69 -120 49 74 -119 27 93 -120 5 109 -101
7470a01Q3J23k04P6J58k31M2J70j80mJ87j74k4K03j60o7K17j18j04J95q0j26K18
$$ -101 -18 105 -99 -23 135 -96 -54 116 -64 -68 119 -55 -79 124 -36 -103 114 -4 -108 87 7 -119 99
7493I9o9j51K03k4j74J79Nj89J78J8k02J49Q7k24J14R4j93J00J02k06O5J69k13
$$ 99 30 -121 82 58 -116 63 68 -121 57 75 -127 22 109 -115 -1 93 -100 0 102 -104 -39 130 -83
7516h3L3J55j74OJ89j79l8K15j49p5J98j21q6K19j06j38K10m9j46J80k2j63J83
$$ -83 -50 105 -69 -63 126 -53 -91 124 -25 -100 98 -23 -109 110 4 -134 76 27 -119 61 39 -124 59
7539E9Rk03J77N5k05J27O6j97J30R4k18P5J46j93L5J57j99M1J71j87j5K03j60
$$ 59 68 -135 42 97 -108 19 85 -112 18 112 -106 -31 115 -78 -43 114 -85 -44 127 -60 -75 128 -32
7562c2m4J84j34p3K13j21j06K10q2j36K03n7j45J96l6j72J91J9k07J56N0j92J46
$$ -32 -76 108 -26 -99 114 -7 -113 97 15 -121 82 25 -120 76 40 -132 59 78 -129 27 77 -115 31
7585C1P3k08R7J19k02P7J37k12M4J68j91J5J69j73k4J92j61m8K05j35q2K07r5
$$ 31 104 -104 -7 112 -90 -13 124 -88 -44 124 -67 -52 117 -56 -80 112 -49 -97 108 -27 -109 98 3
7608Cj27K05p2j26J96m9j56J97l2j60J74Lj79J60M1j94J35P2j95J12R8k02P9J40
$$ 3 -124 81 9 -117 79 30 -126 71 39 -121 53 56 -123 37 78 -116 19 91 -104 8 106 -96 -17 123
7632A23k03M4J51j86K6J63j78j8J98j69m7J95j29p7J90q8j11K01p0j34K00m4j59
$$ 123 -80 -36 115 -71 -45 118 -60 -78 120 -49 -96 99 -30 -107 83 -5 -116 85 15 -119 81 37 -122
7655a22J94j8j72J73J8j86J43N3j90J24P8k06J03J13k01P5J28j90M5J66j87KJ82
$$ -122 72 54 -118 55 73 -113 30 83 -107 17 95 -111 -8 105 -96 -21 107 -83 -38 128 -59 -57 125
7678A25j78j8J89j51n4J99j29q7K00r7j13K00o3j47J95l4j57J68Pj69J50M3j95
$$ 125 -53 -71 118 -33 -87 112 -17 -104 96 -1 -114 86 23 -124 71 37 -120 48 55 -114 36 79 -116
7701a16J41P7k02R9R8j84Q7J15j93N6J38j82J2J67j73mJ79j64k4J91j30p9J94
$$ -116 25 102 -100 -1 97 -87 0 115 -78 -22 116 -66 -54 113 -60 -64 115 -49 -73 118 -12 -91 103
7724A03j01r3J80p7j32J98m9j50J81j8j58J67Nj72J49M1j82J11Q0j79R9J03k04
$$ 103 2 -91 89 12 -120 78 29 -121 60 42 -116 51 56 -116 33 74 -108 3 83 -96 3 106 -98
7747i8P4J42j89L8J40j71K4J53j71k1J93j48n3J80j06p6J86j07r2J88o5j25J75
$$ -98 -24 118 -71 -33 107 -64 -40 113 -58 -79 114 -34 -87 93 -13 -89 97 -10 -102 86 21 -104 71
7770G1m6j27J67j9j64J65K3j73J26N3j76J17O7j93J05J04j82O4J18j72M9J44j88
$$ 71 25 -102 65 46 -118 47 70 -103 23 76 -100 17 84 -109 -4 100 -82 -18 100 -72 -23 121 -67
7793f7K3J64j50k5J72j44m2J85j37p1J95r7j03J71o5j06J76n5j24J85k8j51J26
$$ -67 -44 120 -30 -55 117 -27 -69 116 -21 -92 103 6 -97 74 9 -97 79 24 -100 85 57 -94 32
7816C2J8j62J41M6j90J28P3j86R2R7j77Q7R8j82M0J49j60PJ53j51j0J72j42o4
$$ 32 50 -112 29 75 -115 13 86 -100 -8 89 -88 -1 97 -85 -45 104 -56 -49 104 -47 -57 115 -27 -91
7840i1J95j02p6J59p8r2J69p5j31J84l1j50J61oj45J59Rj70J23N7j69J05P8j81
$$ -91 104 2 -74 85 7 -85 84 9 -122 62 31 -119 42 36 -109 50 59 -111 12 69 -100 5 83 -98
7864i8R4R9j79N6J25j57K0J33j55K2J36j53k2J86j29n5J69r7q7J85q4j10J82m7
$$ -98 -4 95 -84 -28 97 -60 -40 93 -62 -40 96 -57 -79 107 -22 -77 92 -5 -92 93 9 -101 81 34
7888C4j25J49j9j50J61Pj75J39L7j63J22N7j66R3P9j70P9J13j74L6J33j42J4J42
$$ 34 -91 58 39 -111 50 57 -118 21 58 -105 17 74 -92 1 80 -90 -11 102 -72 -36 97 -45 -31 111
7912A11j60LJ61j44l4J64j07o9J77j13p8J76o5j00J48l8j35J58mj53J41J7j61
$$ 111 -49 -46 115 -29 -63 101 -6 -75 102 -11 -89 87 22 -78 70 32 -103 55 51 -102 39 56 -105
7935a05J33L9j66J09O4j78R6R6j73N1J29j63L0J22j38QJ40j28k4J61j20n8J77
$$ -105 28 67 -99 10 74 -104 -8 88 -85 -34 95 -68 -38 84 -54 -46 94 -34 -58 103 -17 -75 102
7958A02j07p6J72q9q3J56n2j08J58k9j44J56Lj62J44K4j58J07O5j66J00P3j79
$$ 102 -5 -81 91 2 -81 75 23 -85 73 44 -100 56 59 -103 41 65 -93 14 79 -87 13 86 -93
7981i3Q0R0j62M9J23j59L3J18j38lJ65j31m0J66j08o3J62r6p6J72o7j13J60m8
$$ -93 -13 77 -85 -36 87 -72 -39 79 -59 -62 103 -28 -68 98 -10 -73 89 -7 -83 89 22 -91 69 21
8005B1j12J45k4j39J51Lj47J11M0j41J08N3j62R0Q1j63O7J05j49L8J02j43K3J39
$$ 21 -91 54 30 -109 42 45 -102 9 49 -92 16 69 -93 -3 78 -85 -18 87 -62 -24 78 -65 -42 97
8029I7j43j5J42j16l0J58j18m6J66r3q2J54n6r9J56m1j30J53j8j36J36J2j48J11
$$ 97 -46 -61 81 -35 -65 93 -25 -71 95 2 -80 74 18 -81 75 34 -96 57 39 -97 39 51 -97 14
8053A4M5j60J18N8j67Q6P7j47O6R8j72M9J22j51J5J26j27LJ34j23l2J55j00n8
$$ 14 59 -101 17 75 -92 -6 71 -76 -10 88 -84 -35 87 -64 -49 77 -50 -47 87 -36 -68 87 -13 -71
8077g1J50q5o8J48o8j06J70k7j34J38jj36J42pj49J35L9j73J00O8j54Q9Q0j64
$$ -71 79 -6 -74 74 6 -100 70 43 -91 47 46 -90 52 45 -104 31 70 -103 -3 65 -89 0 80 -84
8101h4N7J11j54K0J35j33KJ39j37rJ44j17m3J48r9n7J51p6p6J43m6j07J43j9j18
$$ -84 -27 84 -70 -50 85 -48 -46 93 -44 -53 91 -26 -69 79 -20 -77 74 -2 -78 65 19 -88 55 36 -82
8126h2J41j5j37J36J6j56J21M8j51R0O3j56O8R6j54M1J06j45K6J15j39K2J25j16
$$ -82 59 44 -93 43 59 -97 24 72 -79 11 74 -82 -14 82 -72 -31 75 -70 -44 71 -68 -46 79 -37
8150c7j7J33j07k7J41j12n4J59o8q7J35m5j01J44l5j15J40kj37J24J9j44J13L1
$$ -37 -54 79 -28 -55 86 -26 -80 79 11 -76 59 14 -87 57 22 -93 47 45 -92 32 51 -93 20 51
8174E1j40J04O3j48O8P8j51N9J02j54L2J27j41mJ31j16j6
$$ 51 -89 15 78 -70 -2 76 -75 -16 86 -68 -36 91 -50 -54 77 -39 -55
8191e5
$$ Imaginary data points
##PAGE= N=2
##DATA TABLE= (X++(I..I)), XYDATA
0@%%%%%%%%%%%%%%JrJ6j6J6j6K2l0L2l8M6n1N9p0P9q9J04j20J34j51J71j91K15
$$ 0 0 0 0 0 0 0 0 0 0 0 0 0 0 0 1 -8 8 -8 8 -8 14 -16 16 -22 24 -27 32 -38 41 -48 56 -64 70 -81 90 -101 114
37A14k41K67k96L30l68M09m51M96n49O05o66P34q09Q93r83J083j197J325j467
$$ 114 -127 140 -156 174 -194 215 -236 260 -289 316 -350 384 -425 468 -515 568 -629 696 -771
56g71J631j821K041k302K618l010L508m165N069o392Q512j2400K1596p7081l1915
$$ -771 860 -961 1080 -1222 1396 -1614 1894 -2271 2798 -3594 4918 -7482 14114 -62967 -94882
71i4882K38191j80245o2454K20784j38958r1351K26350j15977j18305K12110p2139
$$ -94882 143309 -36936 -99390 121394 -17564 -108915 117435 1458 -116847 95263 23124
82B3124j33303J93308n8525j36712J93403l7493j66506J86511j232j79227J64848
$$ 23124 -110179 83129 24604 -112108 81295 43802 -122704 63807 62575 -116652 48196
93D8196K5477j92921J53506O2267k10873J16299J06097j99891P4526J22257j84085
$$ 48196 73673 -119248 34258 96525 -114348 1951 108048 -91843 -17317 104940 -79145
104g9145M8296J40454j73338J3636J52897j46742j0345J49074j34528k1701J61425
$$ -79145 -30849 109605 -63733 -50097 102800 -43942 -54287 94787 -39741 -61442 99983
115I9983j27114n1615J72675j02226p7162J71609q1913j00060J76246n3178j31770
$$ 99983 -27131 -78746 93929 -8297 -85459 86150 4237 -95823 80423 27245 -104525
126a04525J63609j1971j43950J37853J4088j47109J19823L9239j51610R3551O2084
$$ -104525 59084 47113 -96837 41016 55104 -92005 27818 67057 -84553 8998 71082
137G1082j41956P1160O9771j37664O0771Q5552j40707L9559J04848j33187J7139
$$ 71082 -70874 286 70057 -67607 -6836 78716 -61991 -22432 82416 -50771 -33632
148c3632J17817j26724n591J35921j13374l8857J43629q5764o2755J37864o3466
$$ -33632 84185 -42539 -48130 87791 -25583 -64440 79189 -6575 -69330 68534 5068
159E068p8708J33713m0923r4759J22086j7840r9868J09332n106j05190J04549
$$ 5068 -73640 60073 19150 -75609 46477 28637 -71231 38101 32995 -72195 32354
170C2354J0968j16035R3722L0994j21205Q0175M8826j26444O4780P1410j27378
$$ 32354 43322 -72713 21009 52003 -69202 10973 59799 -66645 -1865 69545 -57833
181e7833L9545R0156j16200J5257R8891j03115m602J04953q8093k3351J04973
$$ -57833 -18288 71868 -44332 -29075 69816 -33299 -37901 67052 -21041 -44392 60581
192F0581p1997l5211J02691o1646m5528J05032n0830n9897J05776l6409p3645
$$ 60581 -11416 -46627 56064 -5582 -51110 53922 3092 -56805 48971 12562 -61083
203f1083J04069k0328q7722R9532l2j00007Q8039K1438j05602P2080L9740j05531
$$ -61083 42986 22658 -65064 34468 34436 -65571 22468 43906 -61696 10384 50124 -55407
215e5407N4657N3906j00670L8349O2944r4397K4999O9765q8980J3139P6735q4104
$$ -55407 -750 53156 -47514 -9165 53779 -40618 -15619 54146 -34834 -21695 55040 -29064
227b9064P47Q4762p8571j4749R2999o8149l2429R6662n3760m8267R6507l7411
$$ -29064 -28317 56445 -22126 -36875 56124 -12025 -44454 52208 -1552 -49819 46688 9277
239I277o2859R1599j8482p2332Q0948k937p5359P1807Q273p8947O3449K0211q0567
$$ 9277 -53582 38017 19535 -52797 28151 25214 -50145 21662 29935 -49012 14437 34648 -45919
252d5919N3959K9094q1542M7879L9256q6428L8015N4278q6229K2531O5226q1385
$$ -45919 8040 37134 -44408 3471 42727 -43701 -5686 48592 -37637 -15106 50120 -31265
264c1265Q602P4733p5393q710Q2000o1908k4451P9989m8873l2226P8510m0264
$$ -31265 -22663 52070 -23323 -32033 49967 -11941 -36392 43597 -5276 -37502 41008 744
276G44m2069P7591k7826m9851P2063j8775n4092P1066j0596o4464O8272N038p1668
$$ 744 -41325 36266 8440 -41411 30652 11877 -42215 28851 18255 -46209 22063 27101 -44567
289d4567N8233J7562p4216N0498L0324p8607L7231M5429p3956K0881N0651o6504
$$ -44567 13666 31228 -42988 7510 37834 -40773 -3542 41887 -32069 -11188 39463 -27041
301b7041J2738N5329o4187J807O2007n6288q770O2189n0820j4130O7352m8115
$$ -27041 -14303 41026 -23161 -21354 40653 -15635 -24405 37784 -13036 -27166 40186 -7929
313g929k7112P2980l6192l9280P0124k5833m6599P0021j5054n8435O4714K067
$$ -7929 -35041 37939 1747 -37533 32591 6758 -39841 30180 15126 -43309 21405 23472
325B3472o2469N2280J1247o1091M6600J8954o4582L7611K9887o1350K7176L2760
$$ 23472 -38997 13283 24530 -36561 10039 28993 -35589 2022 31909 -29441 -2265 30495
337C0495n9114K4141M0058o2680J3412N1440n6849M23N4212n1185p205O0432m6557
$$ 30495 -28619 -4478 35580 -27100 -13688 37752 -19097 -18674 35538 -15647 -22852 37580 -8977
350h977k1687O4098l2709l1644N8360k4153l4882N8290j7638m4009N5406n325
$$ -8977 -30664 33434 725 -30919 27441 3288 -31594 26696 9058 -34951 20455 15130
362A5130m6934M7905p49m8096M8318O034n6809M3020J9516n7864L2668K5802n7345
$$ 15130 -31804 16101 15352 -32744 15574 21608 -35201 7819 27335 -30529 2139 27941 -29404
375b9404K7498L5109n9429J4773M5227n1132K382M4871m4541k098M8072m1658
$$ -29404 -1906 33203 -26226 -11453 33774 -17358 -14976 29895 -14646 -16744 31328 -10330
387a0330j2265N0941l1790j8989M7273k7439k1603N0535k3854l1951N1471j2541
$$ -10330 -22595 28346 -3444 -22433 24840 -2599 -24202 26333 2479 -29472 21999 9458
399I458l8081M6278o047m1646M5764K436m9617L9257J5184m9407K9041J9963m7313
$$ 9458 -28623 17655 11608 -30038 15726 18162 -31455 7802 22986 -26421 2620 22583 -24730
412b4730K4863K5701m8645J6625L2680m3980R023L3618m1804N824L9011m1734
$$ -24730 133 25834 -22811 -6186 26494 -17486 -8463 25155 -16649 -10825 28186 -13548
424a3548l624M4559l4617j1987M4204k9487j7442M6872k3719k7083M6044j2829
$$ -13548 -17172 27387 -7230 -19217 24987 -4500 -21942 24930 1211 -25872 20172 7343
436G343l1968M0297o456l3708L8049l84l7950L3283P351l7880K7848J0538l8612
$$ 7343 -24625 15672 9216 -24492 13557 13173 -24777 8506 15857 -22023 5825 16363 -22249
449b2249K6157J6240m2045K0505K3798m1036J3766K8003m0165Q316L4053l8580
$$ -22249 3908 20148 -21897 -1392 22406 -18630 -4864 23139 -17026 -8710 25343 -13237
461a3237p56L8249l2249p934L8106k7368j2629L9245k2659j8832L8604j6052k2433
$$ -13237 -13993 24256 -7993 -15927 22179 -5189 -17818 21427 -1232 -20064 18540 2488 -19945
474a9945L6360j1923k5558L6124o820l0494L3843Q8l3336L0199N797l5922K6492
$$ -19945 16415 4492 -21066 15058 8238 -22256 11587 11675 -21661 8538 14335 -21587 4905
487D905J2946l7773J9789J9458l5990J3133K3067l3866P923K6461l1673K249K8908
$$ 4905 17851 -19922 -133 19325 -16665 -3532 19535 -14331 -6408 20053 -11620 -9371 19537
500A9537k8443k364L0472k6008o770L2685k3055j2100L4242j8954j7250L4889
$$ 19537 -8906 -11270 19202 -6806 -13576 19109 -3946 -16046 18196 -758 -18008 16881
512A6881j4147k2439L4362q118k6902L1961j824k9830K8335M106l1205K3865Q875
$$ 16881 2734 -19705 14657 6539 -20363 11598 9774 -20056 8279 12385 -18820 5045 13920
525A3920l1184J9786J2564l1165J6000J6464l0776J1670J9757k9837P693K3184
$$ 13920 -17264 2522 15086 -16079 -79 16385 -14391 -2721 17036 -12801 -5108 18076
537A8076k9111K511K7110k6321l634K8876k2334q315K9890j8755j3424L0477j3386
$$ 18076 -11035 -8524 18586 -7735 -11369 17507 -4827 -13142 16748 -2007 -15431 15046 1660
550A660j7735K8462q733j9655K7200n544k2669K6152o89k4953K3247K904k5935
$$ 1660 -16075 12387 3654 -16001 11199 5655 -17014 9138 8449 -16504 6743 9647 -16288
563a6288K1938O463k9010J9182J2722k9680J3453J6524k8023R647J9551k7695
$$ -16288 5650 12113 -16897 2285 15007 -14673 -1220 15304 -12719 -3072 16479 -11216
575a1216M558K3515k4303j290K3718k0528l777K4358j9026p901K6011j4758j1944
$$ -11216 -6658 16857 -7446 -8736 14982 -5546 -9323 15035 -3991 -11892 14119 -639 -12583
588a2583K4537j1483j3482K5066r457j8054K5457l620k1454K2027N36k2119K0561
$$ -12583 11954 471 -13011 12055 2598 -15456 10001 6381 -15073 6954 7490 -14629 5932
601E932L895k5050J7740R787k4925J2388J1923k3088J0721J3815k4348P473J8025
$$ 5932 9827 -15223 2517 12304 -12621 -233 11690 -11398 -677 13138 -11210 -3737 14288
614A4288k2570K770J8746k0593J080K0888k0658l701K4043j6505q594K2912j3081
$$ 14288 -8282 -5512 13234 -7359 -6279 14609 -6049 -9750 14293 -2212 -10806 12106 -975
627i75j0373K3548j0848j5068K3420m826j7536J9431j791j7106J8711J34j9951
$$ -975 -11348 12200 1352 -13716 9704 4878 -12658 6773 4982 -12124 6587 6721 -13230
640a3230J7114N027k0298J3280O652j9801J2852R243k2352R605J4299k0937M780
$$ -13230 3884 8911 -11387 1893 8545 -11256 1596 10839 -11513 -1908 12391 -8546 -3766
653c766J5209j9217L258J7595j9533j460K0596j5473n644J9118j2917o409K0115
$$ -3766 11443 -7774 -4516 13079 -6454 -7914 12682 -2791 -8435 10683 -2234 -8643 11472
666A1472j2026j0516K0888p371j2880J8310n444j3264J9103l608j7331J8143J887
$$ 11472 -554 -11070 9818 2447 -10433 7877 2433 -10831 8272 4664 -12667 5476 7363
679G363j8433J4236M051j8083J3366O859k0211R864J1401j8305N444J1606j6590
$$ 7363 -11070 3166 7217 -10866 2500 9359 -10852 -988 10413 -7892 -2448 9158 -7432
692g432M710J3388j7375J101J6254j4450k300J5466j2939k987J7227j2781p101
$$ -7432 -2722 10666 -6709 -5608 10646 -3804 -6104 9362 -3577 -6564 10663 -2118 -9219
705i219J8917q808j0093J7280o655j1134J7904m547j4806J6862K33j5634J3496
$$ -9219 9698 890 -9203 8077 1422 -9712 8192 3645 -11161 5701 5934 -9700 3796
718C796J874j5211J3053L763j7207J0895P449j6508P696Q333j5830O844J0431
$$ 3796 5670 -9541 3512 7275 -9932 963 8412 -8096 -400 7933 -7897 -1053 9378
731I378j6756L657J3436j4726K13J3685j3130j374J5156j2208m936J6204q794
$$ 9378 -7378 -3721 9715 -5011 -4798 8887 -4243 -5617 9539 -2669 -7605 8599 -195
744a95p444J4890o812q311J5120n282j0832J4692k194j1961J3101p66j2684J3091
$$ -195 -7639 7251 439 -7872 7248 1966 -8866 5826 3632 -8329 4772 4006 -8678 4413
758D413J268j4891J1652M626j5287R166O424j5226P623Q674j5576M827J0963j4160
$$ 4413 5681 -9210 2442 7068 -8219 947 7371 -7855 -232 8442 -7134 -2307 8656 -5504
772e504K080J1684j2914K84J2812j1837k316J3566r723m261J3382q288n760J3902
$$ -5504 -3424 8260 -4654 -4370 8442 -3395 -5711 7855 -1868 -6129 7253 -1035 -6795 7107
786G107o688q104J3853m150r844J2982j983j1178J2157M05j2438J0592K809j2806
$$ 7107 419 -7685 6168 2018 -7826 5156 3173 -8005 4152 4557 -7881 2711 5520 -7286
800g286Q848M537j2968P380O229j3058N642P785j2774L952R132j2431K157J0480
$$ -7286 1562 6099 -6869 511 6740 -6318 -676 7109 -5665 -1713 7419 -5012 -2855 7625
814G625j1754J46J1621j0739j990J2528r242m229J2847p290o082J2648n341p760
$$ 7625 -4129 -3983 7638 -3101 -5091 7437 -1805 -6034 6813 -477 -6559 6089 748 -7012
828g012J2191l119r021J1010j188r556J0090K35j0458R301K278j1183P699M004
$$ -7012 5179 2060 -6961 4049 2861 -6695 3395 3630 -6828 2473 4751 -6432 1267 5271
842E271j1201O464N420j1663M925P462j1380K675Q570j0440J228R439j0077o82
$$ 5271 -5930 534 5954 -5709 -784 6678 -4702 -2027 6543 -3897 -2669 6770 -3307 -3989
856c989J0740q598k873J0606p045l706J0738o436n343J1381m551p114J0560k825
$$ -3989 6751 -1847 -4720 5886 -1159 -4865 5873 -563 -5906 5475 924 -6190 4370 1545
870A545p683J0306j686r343R932R81j0334P845K701r899O823L755j0623N502O003
$$ 1545 -6138 4168 2482 -6861 3071 4052 -6282 1563 4264 -5635 1188 4943 -5680 -178 5825
885E825j0216L037O675r038K242P255r339P04Q958q147j558Q843o862k063R375
$$ 5825 -4391 -1354 5321 -3717 -1475 5780 -3559 -2855 6103 -2044 -3602 5241 -1621 -3684 5691
900E691o835m012J0541m758o079R554l066o339R421k334p990R322J26q836P459
$$ 5691 -1144 -5156 5385 627 -5452 4102 1036 -5303 4118 1784 -6206 3116 3242 -5594 1865
915A865J254q376P178J983r662O365M403r609M110N060q752L677N848r500K071
$$ 1865 3119 -5257 1921 3904 -5758 607 5010 -4599 -489 4571 -4181 -504 5344 -4156 -2085
930b085P938q376l67P843o977r09Q332o888k843R320m787m533Q127l544m444Q360
$$ -2085 5853 -2523 -2890 4953 -2024 -2933 5399 -1489 -4332 4988 201 -4332 3795 251 -4193 4167
946D167l317o143Q657j086p145P176j81o968P373N45q647O753L056q762M688L670
$$ 4167 850 -5293 3364 2278 -4867 2309 2128 -4840 2533 3078 -5569 1184 4240 -4522 166 3836
962C836q119M442M563r075K941O604p992P71O406o947N74P013p211j197Q204n444
$$ 3836 -4283 159 4722 -4353 -1412 5192 -2800 -2029 4377 -2570 -1996 5017 -2194 -3391 4813 -631
978f31k822P332m504k911P944m231m957Q302j803o031O729q34n803O816j75p301
$$ -631 -3453 3879 -625 -3536 4408 177 -4780 3522 1719 -4312 2417 1583 -4220 2596 2421 -4880
994d880O230K080p343M431K484o857M460L219p874L324N058p197J644N026o677
$$ -4880 1350 3430 -3913 518 3002 -3855 605 3824 -4050 -726 4332 -2865 -1221 3805 -2872
1009b872J590N890p199j18P318n782j792O813m847k097P321m511l856P637k474
$$ -2872 -1282 4608 -2591 -2709 4609 -1173 -2965 3848 -999 -3096 4225 -286 -4142 3495 1021
1024A021m825O396j615m746O489j029o040O098Q87o353M686J538o132M498K353
$$ 1021 -3804 2592 977 -3769 2720 1691 -4349 1749 2636 -3717 969 2507 -3625 873 3226
1039C226o964L500L962o559K012M285o120J595N034o308K21O059n243j081N851
$$ 3226 -3738 -238 3724 -2835 -823 3462 -2658 -1063 3971 -2337 -2116 3943 -1300 -2381 3470
1054C470m576j411O218m377k569O632l181l528O234k460l962O365j713n083O082
$$ 3470 -1106 -2517 3701 -676 -3245 3387 206 -3322 2912 452 -3510 2855 1142 -3941 2141
1069B141k22n602N188O32n744M722J620o280L809K878o087K618L476n780J879
$$ 2141 1919 -3683 1505 2137 -3607 1115 2735 -3545 264 3142 -2945 -327 3149 -2631 -752
1084g52M145n626Q34M819n055j52N105m586q93N525m098j946N823l260k816N776
$$ -752 3393 -2233 -1399 3420 -1635 -1787 3318 -1268 -2161 3364 -734 -2680 3143 -117 -2933 2843
1100B843k451l567N694j584m259N383o67m726M986J41n139M534R94n409L929J801
$$ 2843 392 -3175 2519 935 -3324 2059 1392 -3334 1652 1793 -3346 1188 2182 -3227 702 2503
1116B503n580L264K640n609K416L366n416J604L959n240P10M698m752m95N009
$$ 2503 -3077 187 2827 -2782 -366 3000 -2416 -812 3147 -2093 -1383 3315 -1437 -1932 3077
1131C077l909j312N035l319k081N232k491k961M969j593l341M731j069l967M690
$$ 3077 -832 -2144 2891 -428 -2509 2723 232 -2729 2240 647 -2694 2037 968 -2999 1691
1146A691p6m584M031P61m586L608J253n052L263K363n240K184L002m816J654L326
$$ 1691 1615 -2969 1062 1823 -2763 845 2098 -2954 309 2672 -2568 -384 2618 -2198 -544 2782
1162B782m939R97M235m525k22M363l747n85M417l685j332N059k861k476M731j899
$$ 2782 -2157 -1160 3075 -1450 -1672 2691 -1056 -1641 2776 -909 -2241 2818 -43 -2519 2212 313
1178C13k707M579j572l503M712l31m234L757N39l967L416P67m526L187K029m727
$$ 313 -2394 2185 613 -2890 1822 1491 -2743 1014 1553 -2414 1002 1769 -2757 430 2459 -2268
1194b268J941K555m145J672K637m526J264L694m297M9L830l589j15L939l805r07
$$ -2268 -327 2228 -1917 -245 2392 -2134 -870 2824 -1473 -1424 2406 -1183 -1298 2641 -1164 -2071
1210b071M843k983k105M425k089k079M271k053k852M677q44l736L803n3l413L552
$$ -2071 2772 -211 -2316 2109 20 -2059 2212 159 -2693 1984 1140 -2596 1207 1154 -2259 1293
1226A293J48m147L493J397m423K260J896l814K004K074m307J490L305m080K14
$$ 1293 1441 -2706 787 2184 -2239 21 1917 -1897 107 2181 -2126 -636 2669 -1411 -1197
1241a197L367l273K8L494l521p19M295k693j792L792j933j612L809k082k425M332
$$ -1197 2170 -1103 -1075 2419 -1102 -1821 2474 -219 -2011 1781 -152 -1764 2045 -37 -2462 1870
1257A870j002l248L604l79l008L588k68l829L546J008m055K401J452l626K287
$$ 1870 868 -2380 1224 845 -2163 1425 1157 -2672 874 1882 -2173 228 1680 -1946 341
1272C41J795m243J681K874l794M36K893l092L71L035l426m42L859k593j391L426
$$ 341 2136 -2107 -426 2448 -1346 -910 1983 -1109 -738 2297 -1129 -1571 2288 -305 -1696 1730
1288A730j914j433L597j932k284L889q55k938L185l47k615L147j89l383L137Q27
$$ 1730 -184 -1617 1980 48 -2236 1653 798 -2140 1045 698 -1917 1230 1041 -2342 795 1622
1304A622l591K185J180l242K227J382l802J783K450l629Q53K404l098P57K711
$$ 1622 -1969 216 1396 -1846 381 1763 -2039 -256 2194 -1435 -582 1822 -1276 -519 2192
1319B192l472M8L534k781r88L333k208j099L351j999j823L630j203k397L063n79
$$ 2192 -1280 -1232 2302 -479 -1467 1866 -342 -1441 1910 -89 -1912 1718 515 -1882 1181 602
1335F02k446L039l46k969K876N82l221K207R67l012K012J244l383J664K044l213
$$ 602 -1844 1195 849 -2120 756 1338 -1883 324 1291 -1721 291 1535 -1848 -184 1860 -1353
1351a353P64K350l069O89K597l115P1L010k573p13L091k128r15L116j986j507
$$ -1353 -589 1761 -1308 -619 1978 -1137 -1066 1944 -629 -1342 1749 -379 -1294 1822 -164 -1671
1367a671L338j329k030L062q79k293K973l27k735K725M29l090K199R15k955J865
$$ -1671 1667 338 -1692 1370 491 -1802 1171 844 -1891 834 1263 -1827 372 1287 -1668 197
1383A97J352l197J450J906l065Q12K204k777L30K536k665j37K797k354o44K920
$$ 197 1549 -1648 -198 1708 -1357 -545 1659 -1118 -788 1748 -917 -1054 1743 -611 -1255 1665
1399A665k044r81K959j621j563L053j204j976L054p99k228K821k30k608K544K19
$$ 1665 -379 -1360 1599 -22 -1585 1468 264 -1712 1342 543 -1685 1136 906 -1702 842 1061
1415A061k729K231P95k958J849J202k946J434J669k931R47K045k811M44K347k489
$$ 1061 -1668 563 1358 -1600 249 1451 -1495 -61 1608 -1323 -376 1669 -1142 -698 1649 -840
1431h40q4K582k343n47K898j947j218K944j442j493K790j057j886K883o66k292
$$ -840 -924 1658 -685 -1232 1666 -281 -1499 1445 3 -1490 1300 243 -1643 1240 574 -1718
1447a718K614r9k374K366J74k650K306P09k930J797J187k738J456J375k876J218
$$ -1718 896 797 -1577 789 963 -1687 619 1328 -1602 195 1382 -1356 100 1475 -1401 -183
1463a83J911k861N01K239k459J26K332k401k51K759k082j001K739j475j184K623
$$ -183 1728 -1133 -632 1607 -852 -726 1606 -795 -1046 1713 -369 -1370 1369 -106 -1290 1333
1479A333j351j598K908p65k256K533q4k224K249N3k498K269P21k852J631J237
$$ 1333 -18 -1616 1292 527 -1729 804 720 -1504 745 798 -1700 569 1290 -1562 69 1306
1495A306k566J329J304k755J158J944k739L76K150k251J77K101k379p0K659k127
$$ 1306 -1260 69 1373 -1382 -224 1720 -1019 -643 1507 -744 -567 1534 -845 -915 1744 -383
1511c83q59K600j509r69K480j505j367K855r29k034K445k70j943K206k05k280
$$ -383 -1242 1358 -151 -1120 1360 -145 -1512 1343 414 -1620 825 555 -1388 818 613 -1667
1527a667K302N07k671J628J037k356J338J107k607J194J790k600L82K001k113
$$ -1667 635 1142 -1529 99 1136 -1220 118 1225 -1382 -188 1602 -998 -616 1385 -728
1542g28K21J976k280p9K556j969q70K435j360r09K313j423j239K655r24j809K268
$$ -728 -507 1469 -811 -890 1666 -303 -1173 1262 -98 -1007 1306 -117 -1356 1299 375 -1434 834
1559H34l76j710K130l52k082K239L15k423J637P47k162J446Q36k461J303J527
$$ 834 458 -1252 878 526 -1556 683 998 -1425 212 959 -1203 243 1079 -1382 -79 1448
1575A448k482N53J751k064L60J818k207kK350j861p19K252j367p74K219j405j170
$$ 1448 -1034 -481 1270 -794 -434 1384 -823 -825 1525 -336 -1055 1197 -170 -944 1275 -130 -1300
1592a300K531q69j713K193m16j656K106l59k009K147K82k294J614O57k127J526
$$ -1300 1231 362 -1351 842 426 -1230 876 517 -1492 655 937 -1357 257 914 -1213 313
1608C13O93k372J346J342k348O60J599k084N28J566k143K47K048j896m13K155
$$ 313 1006 -1366 -20 1322 -1026 -366 1233 -851 -323 1243 -900 -653 1395 -501 -914 1241
1624A241j593n11K108j448r83K355r50j455K111n77j493K139m17j978K159J20
$$ 1241 -352 -863 1245 -203 -1186 1169 219 -1236 875 298 -1195 944 527 -1451 708 828
1640H28k138J694N12k099J504P05k278J328J192k316Q19J398k026N99J547k142
$$ 828 -1310 384 896 -1203 301 1006 -1272 56 1248 -1068 -249 1149 -877 -278 1269 -873
1656h73K97J953j974j87K050j712l87K093j566p51K269j180j186K154q17j339
$$ -873 -576 1377 -597 -784 1266 -446 -833 1260 -306 -1057 1212 32 -1154 1000 183 -1156
1672a156K090n60j687K082j18j945J793K86k024J596N80k181J380R81k225J004
$$ -1156 934 374 -1313 769 651 -1294 499 785 -1239 357 937 -1244 136 1117 -1108 -104
1688a04J282k160O87J555k111L36J805j928m8J940j719l37K034j521o57K114j278
$$ -104 1178 -982 -295 1260 -851 -515 1290 -638 -686 1254 -465 -802 1232 -289 -946 1168 -110
1705a10r47K142r89j248K109o63j495K032l67j703J905oj922J707L69j993J439
$$ -110 -1057 1085 96 -1152 957 294 -1201 831 464 -1239 666 660 -1262 445 814 -1179 260
1722B60O69k086J229J026k160Q61J366k036N22J525j964K48J812j857j93J995
$$ 260 929 -1157 72 1098 -1062 -201 1165 -871 -349 1176 -788 -540 1272 -585 -778 1217
1738A217j577m92K018j396p59K164j139j178K110p19j344J967n61j508K004k16
$$ 1217 -360 -852 1166 -230 -989 1175 36 -1142 968 249 -1095 872 311 -1197 807 591
1754E91j852J783K09j862J535L58j954J449P48k113J049J094j956P80J201k004
$$ 591 -1261 522 731 -1131 404 762 -1192 257 1005 -1108 -59 1035 -921 -141 1060 -944
1770i44N90J601j971P5J807j629j84J775j558m14K077j357r36K053q73j114J921
$$ -944 -354 1247 -724 -649 1158 -471 -655 1120 -438 -852 1225 -132 -1068 985 112 -1002 919
1787I19p76j311K067m10j735J818O2j709J584J34j852J604N59k095J174R31j882
$$ 919 143 -1168 899 489 -1246 572 634 -1075 509 643 -1209 395 954 -1141 33 964 -918
1804i18R17R63j970Q22J389j993K79J583j635R4J540j677j03J930j491o87J946
$$ -918 -1 962 -1008 -186 1203 -790 -511 1072 -563 -469 1071 -606 -709 1221 -270 -957 989
1821I89j034q23J820r76j064K053o10j544J817j30j520J615n1j747J678M16k024
$$ 989 -45 -868 952 -24 -1088 965 355 -1189 628 498 -1022 593 542 -1205 473 889 -1135
1838a135J229Q18j832J006Q43j960R20J298k021L97J503j667J93J491j730j3J884
$$ -1135 94 912 -920 86 929 -1031 -111 1187 -834 -437 1066 -601 -408 1083 -647 -660 1224
1855A224j565n28J848j127o41J793j126r03K027p68j352J819l51j349J681k51
$$ 1224 -341 -869 979 -148 -789 1004 -122 -1025 1002 234 -1118 701 350 -999 682 431
1871D31j619J741K09j890J335N96j770J154O92j960J032J207k022N07J424j739
$$ 431 -1188 553 762 -1128 207 803 -967 187 879 -1081 -49 1158 -864 -357 1067 -672
1887f72L01J481j779L8J855j581m68J849j241n71J838j209q69K060q41j283J854
$$ -672 -371 1110 -669 -631 1224 -357 -825 1024 -217 -788 1050 -159 -1028 1032 191 -1092 762
1904G62m83j288J781m12j555J808O2j811J465L74j732J327N17j932J171R93j967
$$ 762 279 -1009 772 360 -1195 613 675 -1136 329 703 -1029 298 815 -1117 54 1047 -920
1921i20P12J203j797N60J322j864K69J722j702k15J781j414l85J841j352p27K035
$$ -920 -208 995 -802 -242 1080 -784 -515 1207 -495 -710 1071 -343 -728 1113 -239 -966 1069
1938A069r94j109J897o65j202J856n31j487J868j06j723J581J94j712J459L79
$$ 1069 75 -1034 863 198 -1004 852 321 -1166 702 596 -1127 454 648 -1064 395 774
1954G74j894J287P70j935R52R85j838P65J166j896M89J496j762Q0J623j548j69
$$ 774 -1120 167 937 -998 -46 939 -899 -134 1032 -864 -375 1121 -641 -561 1062 -486 -655
1971f55J747j451m66J908j200q21J903q99j053J898o83j317J880l36j569J727
$$ -655 1092 -359 -825 1083 -117 -938 965 66 -987 911 228 -1089 791 455 -1114 613
1987F13k6j684J578K36j827J422N57j917J140Q48j914R11J071j902O53J295j829
$$ 613 587 -1097 481 717 -1110 312 869 -1048 92 940 -974 -63 1008 -894 -241 1054 -775
2004g75L66J498j734Q1J652j589j97J758j394m95J865j174q11J908q94j049J843
$$ -775 -409 1089 -645 -564 1088 -501 -698 1060 -334 -829 1036 -138 -949 959 65 -984 859
2021H59o44j270J834l46j534J707Kj670J512K79j801J357O21j917J060R22j862
$$ 859 215 -1055 779 433 -1101 606 608 -1062 450 729 -1072 285 906 -1011 49 971 -891
2038h91Q09J081j860O02J382j840K11J585j621m5J637j515k73J821j334o67J867
$$ -891 -82 999 -861 -259 1123 -717 -506 1079 -542 -587 1050 -465 -738 1083 -251 -918 949
2055I49j006q65J796q42j052J877n64j384J729j69j478J565j6j614J509L67j839
$$ 949 -57 -922 874 32 -1020 857 293 -1091 638 469 -1009 556 540 -1074 435 802 -1037
2072a037J188P26j764R43Q62j832P82J245j860L24J466j605J03J493j584j17J780
$$ -1037 151 877 -887 56 918 -914 -132 1113 -747 -423 1043 -562 -459 1034 -550 -667 1113
2089A113j410n83J823j061p29J743r58r56J902o54j310J709k69j339J585j86j528
$$ 1113 -297 -880 943 -118 -847 896 -62 -1018 884 230 -1080 629 360 -979 606 420 -1108
2106a108J616K15j783J274N56j657J061O50j785R63J051j843N11J254j587L16
$$ -1108 508 723 -1060 214 770 -887 174 824 -961 2 1053 -790 -279 975 -612 -296
2122b96J311j651R7J670j490m11J721j147n37J663j098p80J883p84j216J739m02
$$ -296 1015 -636 -539 1131 -359 -770 951 -196 -733 930 -168 -948 935 151 -1065 674 272
2139B72j244J625l22j452J688O1j710J355M05j608J194M51j741J134Q75j854P14
$$ 272 -972 653 331 -1121 567 628 -1082 273 678 -930 264 715 -1026 108 983 -871 -157
2156a57J095j636N27J144j695L39J516j608j34J575j298k62J583j305n13J836
$$ -157 938 -698 -171 973 -722 -383 1133 -475 -609 966 -332 -594 989 -316 -829 1007
2172A007j013r65J740o39j035J647n28j299J739j38j591J460K08j562J321L25
$$ 1007 -6 -971 769 130 -905 742 214 -1085 654 516 -1075 385 593 -969 352 677
2188F77j744J236P47j813Q01R68j641O61J066j741M65J409j639L8J485j397j01
$$ 677 -1067 169 916 -897 -96 872 -769 -108 958 -783 -318 1091 -548 -510 975 -422 -523
2205e23J528j382l65J758j123p36J668q08q51J651p21j117J739l54j367J493m6
$$ -523 1005 -377 -742 1016 -107 -843 825 17 -834 817 96 -1021 718 364 -1003 490 444
2222D44j397J407J27j626J301N44j722R59P56j622Q11R25j737N84J263j631J78
$$ 444 -953 454 581 -1045 256 800 -922 37 793 -829 -18 907 -830 -246 1017 -614 -436
2239d36J379j452K9J475j411k48J653j184n76J634r55p02J646q29r71J695m95
$$ -436 943 -509 -480 995 -416 -664 989 -195 -771 863 -92 -794 852 23 -948 747 252
2256B52j200J536k60j260J451o8j459J387K58j583J145N03j573R64P26j654P41
$$ 252 -948 588 328 -932 519 451 -1008 379 637 -946 199 702 -871 93 819 -835 -94
2273i4J008j612M37J178j503K09J343j450n3J505j274l64J565j065n84J613q93
$$ -94 914 -698 -261 917 -586 -377 966 -484 -537 968 -306 -670 895 -170 -754 859 -34
2290c4q28J641o54j022J555m06j172J479j78j342J410O6j459J261L22j530J070
$$ -34 -862 779 125 -897 658 252 -920 559 381 -961 449 515 -944 317 639 -891 179
2307A79N31j538Q64P47j549O71R66j540L99J167j428J37J290j335r0J444j192
$$ 179 710 -828 36 783 -766 -95 871 -669 -270 897 -531 -394 896 -439 -529 915 -277
2324b77l89J503r61o06J515p95q30J572n39j109J477k36j203J350o2j331J296
$$ -277 -666 837 -124 -730 785 -10 -840 732 193 -916 561 325 -878 472 410 -921 375
2341C75K06j490J097M79j470R01O02j485P60Q74j536M63J062j376K51J124j348
$$ 375 581 -909 188 667 -803 98 700 -785 -25 849 -687 -224 838 -538 -287 837 -511
$$ [...]
8191F8
##END NTUPLES=NMR FID
##END=
