##TITLE=1H_LY-11.Dix.1B
 CD3CN, 8 sc, 
 1.06.2021
##JCAMPDX= 6.0         $$ Bruker NMR JCAMP-DX V2.0
##DATA TYPE= NMR FID
##DATA CLASS= NTUPLES
##ORIGIN= UXNMR, Bruker Analytische Messtechnik GmbH
##OWNER= root
$$ XWIN-NMR		Version 3.5
$$ Tue Jun  1 10:48:13 2021 Russian Standard Time (UT+4h)  she@DPX200
##.OBSERVE FREQUENCY= 200.131506
##.OBSERVE NUCLEUS= ^1H
##.DELAY= (6, 6)
##.ACQUISITION MODE= SIMULTANEOUS
##.ACQUISITION SCHEME= undefined
##.AVERAGES= 8
##.DIGITISER RES= 18
##SPECTROMETER/DATA SYSTEM= spect
##.PULSE SEQUENCE= zg30
##.SOLVENT NAME= CDCl3
##.SHIFT REFERENCE= (INTERNAL, CDCl3, 0, 15.7039)
##AUDIT TRAIL= $$ (NUMBER, WHEN, WHO, WHERE, WHAT)
$$ ##TITLE= Audit trail, XWIN-NMR		Version 3.5
$$ ##JCAMPDX= 5.01
$$ ##ORIGIN= Bruker BioSpin GmbH
$$ ##OWNER= she
$$ F:/spectra/data/she/nmr/H-F/1/audita.txt
$$ ##AUDIT TRAIL=  $$ (NUMBER, WHEN, WHO, WHERE, WHAT)
(   1,<2021-06-01 10:47:11.50 +0400>,<she>,<DPX200>,
      <created by zg, POWCHK disabled, PULCHK disabled
       configuration hash MD5:
       00 E9 B6 7A A2 85 ED C7 34 08 36 98 17 FE 4E 26
       data hash MD5: 16K
       42 BE B8 0C C2 41 2A 8A 30 8A 1D E6 BD 13 F2 75>)
$$ ##END=
$$ 
$$ hash MD5
$$ 59 E9 3E CA B1 20 28 4C 5D 28 B5 AA 28 2C E7 39
##$RELAX= 
##$RELAX= 
##$RELAX= 
##$RELAX= 
##$RELAX= 
##$RELAX= 
$$ Bruker specific parameters
$$ --------------------------
##$DU= <F:/spectra>
##$EXPNO= 1
##$NAME= <H-F>
##$PROCNO= 1
##$TYPE= <nmr>
##$USER= <she>
##$AMP= (0..31)
100 100 100 100 100 100 100 100 100 100 100 100 100 100 100 100 100 100 
100 100 100 100 100 100 100 100 100 100 100 100 100 100 
##$AQSEQ= 0
##$AQ_mod= 1
##$AUNM= <au_zg>
##$AUTOPOS= <>
##$BF1= 200.13
##$BF2= 200.13
##$BF3= 200.13
##$BF4= 200.13
##$BF5= 200.13
##$BF6= 200.13
##$BF7= 200.13
##$BF8= 200.13
##$BYTORDA= 1
##$CFDGTYP= 0
##$CFRGTYP= 5
##$CHEMSTR= <none>
##$CNST= (0..31)
1 1 145 1 1 1 1 1 1 1 1 1 1 1 1 1 1 1 1 1 1 1 1 1 1 1 1 1 1 1 1 1 
##$CPDPRG= <>
##$CPDPRG1= <>
##$CPDPRG2= <>
##$CPDPRG3= <>
##$CPDPRG4= <mlev>
##$CPDPRG5= <mlev>
##$CPDPRG6= <mlev>
##$CPDPRG7= <mlev>
##$CPDPRG8= <mlev>
##$CPDPRGB= <>
##$CPDPRGT= <>
##$D= (0..31)
0 1.2 0 0 0 0 0 0 0 0.06 0 0.03 0 0 0 0 0.0002 0 0 0 0 0 0 0 0 0 0 0 0 
0 0 0 
##$DATE= 1622530030
##$DBL= (0..7)
120 120 120 120 120 120 120 120 
##$DBP= (0..7)
150 150 150 150 150 150 150 150 
##$DBP07= 0
##$DBPNAM0= <>
##$DBPNAM1= <>
##$DBPNAM2= <>
##$DBPNAM3= <>
##$DBPNAM4= <>
##$DBPNAM5= <>
##$DBPNAM6= <>
##$DBPNAM7= <>
##$DBPOAL= (0..7)
0.5 0.5 0.5 0.5 0.5 0.5 0.5 0.5 
##$DBPOFFS= (0..7)
0 0 0 0 0 0 0 0 
##$DE= 6
##$DECBNUC= <off>
##$DECIM= 32
##$DECNUC= <off>
##$DECSTAT= 4
##$DIGMOD= 1
##$DIGTYP= 9
##$DL= (0..7)
0 120 120 120 120 120 120 120 
##$DP= (0..7)
150 150 150 150 150 150 150 150 
##$DP07= 0
##$DPNAME0= <>
##$DPNAME1= <>
##$DPNAME2= <>
##$DPNAME3= <>
##$DPNAME4= <>
##$DPNAME5= <>
##$DPNAME6= <>
##$DPNAME7= <>
##$DPOAL= (0..7)
0.5 0.5 0.5 0.5 0.5 0.5 0.5 0.5 
##$DPOFFS= (0..7)
0 0 0 0 0 0 0 0 
##$DQDMODE= 0
##$DR= 18
##$DS= 0
##$DSLIST= <SSSSSSSSSSSSSSS>
$$ [...]
##$SUBNAM2= <"">
##$SUBNAM3= <"">
##$SUBNAM4= <"">
##$SUBNAM5= <"">
##$SUBNAM6= <"">
##$SUBNAM7= <"">
##$SUBNAM8= <"">
##$SUBNAM9= <"">
##$SW= 16.9725357007746
##$SWIBOX= (0..15)
0 0 2 0 0 0 0 0 0 0 0 0 0 0 0 0 
##$SW_h= 3396.73913043478
##$TD= 16384
##$TD0= 1
##$TE= 0
##$TE2= 300
##$TE3= 300
##$TEG= 300
##$TL= (0..7)
0 120 120 120 120 120 120 120 
##$TP= (0..7)
150 150 150 150 150 150 150 150 
##$TP07= 0
##$TPNAME0= <>
##$TPNAME1= <>
##$TPNAME2= <>
##$TPNAME3= <>
##$TPNAME4= <>
##$TPNAME5= <>
##$TPNAME6= <>
##$TPNAME7= <>
##$TPOAL= (0..7)
0.5 0.5 0.5 0.5 0.5 0.5 0.5 0.5 
##$TPOFFS= (0..7)
0 0 0 0 0 0 0 0 
##$TUNHIN= 0
##$TUNHOUT= 0
##$TUNXOUT= 0
##$USERA1= <user>
##$USERA2= <user>
##$USERA3= <user>
##$USERA4= <user>
##$USERA5= <user>
##$V9= 5
##$VALIST= <valist>
##$VCLIST= <CCCCCCCCCCCCCCC>
##$VD= 0
##$VDLIST= <DDDDDDDDDDDDDDD>
##$VPLIST= <PPPPPPPPPPPPPPP>
##$VTLIST= <TTTTTTTTTTTTTTT>
##$WBST= 1024
##$WBSW= 4
##$XGAIN= (0..3)
0 0 0 0 
##$XL= 0
##$YL= 0
##$YMAX_a= 118013
##$YMIN_a= -115403
##$ZGOPTNS= <>
##$ZL1= 120
##$ZL2= 120
##$ZL3= 120
##$ZL4= 120
##$ABSF1= 10
##$ABSF2= 0
##$ABSG= 5
##$ABSL= 3
##$ALPHA= 0
##$AQORDER= 0
##$ASSFAC= 0
##$ASSFACI= 0
##$ASSFACX= 0
##$ASSWID= 0
##$AUNMP= <proc_1d>
##$AZFE= 0.1
##$AZFW= 0.1
##$BCFW= 1
##$BC_mod= 2
##$BYTORDP= 1
##$COROFFS= 0
##$CY= 11.3945322036743
##$DATMOD= 1
##$DC= 2
##$DFILT= <>
##$DTYPP= 0
##$F1P= 15.9154993809931
##$F2P= -4.1035820241983
##$FCOR= 0.5
##$FTSIZE= 0
##$FT_mod= 4
##$GAMMA= 1
##$GB= 0.15
##$INTBC= 1
##$INTSCL= 1
##$ISEN= 128
##$LB= 0.24
##$LEV0= 0
##$LPBIN= 0
##$MAXI= 10000
##$MC2= 0
##$MEAN= 0
##$ME_mod= 0
##$MI= 1.114404
##$NCOEF= 0
##$NC_proc= 0
##$NLEV= 6
##$NOISF1= 3.799351
##$NOISF2= 2.8
##$NSP= 1
##$NTH_PI= 0
##$NZP= 0
##$OFFSET= 15.70392
##$PC= 1
##$PHC0= -11198.71
##$PHC1= 7.800994
##$PH_mod= 1
##$PKNL= yes
##$PPARMOD= 0
##$PSCAL= 0
##$PSIGN= 0
##$REVERSE= no
##$SF= 200.130013532006
##$SI= 16384
##$SIGF1= 3
##$SIGF2= 2
##$SINO= 400
##$SIOLD= 16384
##$SREGLST= <1H.CDCl3>
##$SSB= 0
##$STSI= 0
##$STSR= 0
##$SW_p= 3612.71676300578
##$SYMM= 0
##$S_DEV= 0
##$TDeff= 0
##$TDoff= 0
##$TI= <>
##$TILT= no
##$TM1= 0
##$TM2= 0
##$TOPLEV= 0
##$USERP1= <user>
##$USERP2= <user>
##$USERP3= <user>
##$USERP4= <user>
##$USERP5= <user>
##$WDW= 1
##$XDIM= 8192
##$YMAX_p= 0
##$YMIN_p= 0
$$ End of Bruker specific parameters
$$ ---------------------------------
##NTUPLES= NMR FID
##VAR_NAME=  TIME,          FID/REAL,        FID/IMAG
##SYMBOL=    X,             R,               I
##VAR_TYPE=  INDEPENDENT,   DEPENDENT,       DEPENDENT
##VAR_FORM=  AFFN,          ASDF,            ASDF
##VAR_DIM=   8192,          8192,            8192
##UNITS=     SECONDS,       ARBITRARY UNITS, ARBITRARY UNITS
##FACTOR=    0.0002944,     1,               1
##FIRST=     0,             0,               0
##LAST=      2.4114304,     0,               0
##MIN=       0,             -115403,         0
##MAX=       2.4114304,     118013,          0
$$ Real data points
##PAGE= N=1
##DATA TABLE= (X++(R..R)), XYDATA
$$ [...]
2145c44q49K308j373o76K308j622j197K769r22j818K196m15j489K181o12k058
2161a613K449K32k436J664N93k041J641N63k527J537J441k543O18J559k000O43
2177b20J566k392L04K282k034n35K132j480m54K128j688r30K629j075j582K179
2193H30n95j381K138o78j789K347rk200J750L36j917J739L68k347J651J066k425
2210a116R80J258k069Q75J325k311N98J918k113m5J876j776j13K021j810o04K398
2227A292j300j178K098q77j135K113q15j571K221k69j879J867M0j837J789K67
2243H26k173J616Q51k190J113R56k018J045J143k194P81J569k086K95J656j890
2259g00J48J861j878k96K106j483o89J988j225q20K062j099j186K161o30j521
$$ plain form
2145 -344 -1193 1115 -258 -934 1374 -248 -1445 1324 402 -1416 780 365 -1124 1057 445 -1613
2161 -1613 836 1068 -1368 296 889 -1152 489 1052 -1475 62 1503 -1040 -422 1137 -863 -220
2177 -220 1346 -1046 -742 1540 -494 -1029 1103 -377 -831 1297 -391 -1321 1308 233 -1349 830
2193 830 235 -1146 992 314 -1475 872 863 -1337 413 749 -1168 571 939 -1408 243 1309 -1116
2210 -1116 -136 1122 -947 -72 1253 -1058 -460 1458 -655 -700 1176 -600 -713 1308 -502 -1106 1292
2227 1292 -8 -1186 912 35 -1100 1013 198 -1373 848 579 -1300 567 607 -1230 559 826
2243 826 -1347 269 1120 -1070 43 999 -1019 26 1169 -1025 -244 1325 -761 -466 1190 -700
2259 -700 -552 1309 -569 -865 1241 -242 -931 1057 -168 -988 1074 -25 -1211 950 320 -1201
2275a201J929k99j671J862K8j898J652M49j973J323O96j973J177R61k088Q97J286
2292A157k022N53J499j903K40J654j775m5J814j592l26J891j438o27J986j174
2308a08q98K004r38j163J995o20j442J870k62j577J713mj738J611L62j930J294
2325A69P24j899J052R19j928Q54J257j963M00J509j697J53J546j673p5J839j512
2342c25n49J883j142o96J773j080q76K028q15j326J837l90j337J678l06j519J783
2359F21N9j821J399M41j625J215M54j844J217R68k015O57J271j645L92J216j713
2376g53L04J661j659l02J704j202m08J608j282n82J993r84j192J795m54j104J563
2393G06n25j285J812j34j676J441K62j484J280J84j711J391P46j930P77R97j537
$$ plain form
2275 -1201 728 429 -1242 620 648 -1250 402 851 -1122 201 897 -1076 101 1062 -1026 -129 1157
2292 1157 -865 -312 1187 -716 -476 1178 -597 -642 1172 -420 -746 1145 -293 -920 1066 -108
2308 -108 -1006 998 60 -1103 892 272 -1170 700 438 -1139 574 570 -1168 443 805 -1125 169
2325 169 893 -1006 46 965 -963 -109 1148 -815 -415 1094 -603 -450 1096 -577 -652 1187 -325
2342 -325 -874 1009 -133 -829 944 -136 -1012 1016 201 -1125 712 322 -1015 663 357 -1162 621
2359 621 680 -1141 258 699 -926 289 743 -1101 116 1084 -931 -274 997 -648 -256 960 -753
2376 -753 -449 1212 -447 -749 955 -247 -655 953 -329 -911 1082 98 -1094 701 247 -857 706
2393 706 181 -1104 708 574 -1102 339 601 -883 397 581 -1130 261 1007 -923 -146 851 -686
2410f86O71Q73j725O47J375j734J4J478j289n6J391j454k69J849j132r03J653
2427G03o28q17J499p83j021J834l28j519J422J02j301J291J5j566J426N59j801
2444i13Q53P93j410Q00O53j709Q05J220j702J74J278j274J69J168j520K7J693
2461A105j296n78J489q24m88J427j023p45J796n95j249J426j58j051J329k84j351
2478a070J506K87j648R77N81j347Q94N00j614Q94J042j640K90J131j266L04J029
2495H50j480J61J527j339m00J441r18l44J328j074n44J661p63r52J419m09q88
2512g24J357m75j138J511j9j429J128K79j241J016K94j462R95P18j542N74Q97
2529G39j338M80R49j473K69J315j308j60J303j045k02J292j071m18J503q39p46
$$ plain form
2410 -686 -15 858 -867 -220 1155 -579 -565 913 -376 -432 959 -495 -764 1085 -47 -950 703
2427 703 75 -742 757 -26 -1047 787 459 -1060 362 464 -837 454 469 -1097 329 888 -913
2444 -913 -60 733 -677 123 776 -933 -128 1092 -610 -436 842 -432 -263 905 -615 -588 1105
2461 1105 -191 -769 720 -104 -592 835 -188 -933 863 268 -981 445 287 -764 565 281 -1070
2478 -1070 436 723 -925 52 633 -714 180 680 -934 -40 1002 -638 -348 783 -483 -179 850
2495 850 -630 -469 1058 -281 -681 760 -158 -502 826 -248 -792 869 106 -846 573 164 -724
2512 -724 633 158 -980 531 512 -917 211 490 -751 265 559 -903 92 810 -732 -158 739
2529 739 -599 -119 830 -643 -374 941 -367 -527 776 -269 -471 821 -250 -668 835 -4 -750
2546g50J413n93p95J398n10j028J419j97j175J205j1j139J139R6j331J079M07
2563F27j398Q17N99j347O71P74j398M39J008j287J54J094j188L9J203j140k29
2580e62J365r45m88J346p46o50J363n75q54J329l69r68J240j74j090J192J6j211
2598g81J073K21j253R24L96j315P89O03j312N97P35j283M43R00j267K16J063j147
2616c98NJ111j051j52J236r39m34J283o88n89J229n77p37J295l63j008J203o9
2634C57j035J051%j101J057K34j296Q45M95j207O55N37j229O20P57j302L20R23
2652F81j086J72Q77j120J23J139j097k44J193p67l65J094p82m34J286o13p84J180
2670D53k58p83J040k83r13J208J4j245R35L56j079P28K98j142P93N85j287M25
$$ plain form
2546 -750 663 70 -725 673 163 -865 554 357 -818 387 376 -763 376 472 -859 220 627
2563 627 -771 46 645 -702 -31 743 -655 -216 792 -495 -341 753 -435 -396 807 -333 -562
2580 -562 803 -142 -630 716 -30 -680 683 108 -746 583 214 -754 486 312 -778 414 430 -781
2598 -781 292 513 -740 184 580 -735 54 657 -655 -58 677 -606 -163 737 -530 -314 749 -398
2616 -398 -393 718 -333 -485 751 -188 -622 661 -27 -616 613 36 -701 594 231 -777 426 357
2634 357 -678 373 373 -728 329 563 -733 112 607 -600 55 592 -637 -17 740 -562 -242 681
2652 681 -405 -233 644 -476 -353 786 -311 -555 638 -129 -494 600 -182 -616 670 57 -727 453
2670 453 195 -588 452 169 -744 464 478 -767 168 524 -555 173 471 -671 122 707 -580 -155
2688a55Q14j057K90P24j143K79J053j163j53J131p94k02R51q77k20J236p70o34
2706f90J168m21n92J015m85p14J254k28j062R86J25r03Q48J6j030R86L56j265
2724f36N83O44j013M47N37j132M69Q97j188L5R69q42k4Q51r60q5J200q76n00J111
2744D87m94m65R83o21n57J231l85r04J006n9p54Q91j84r13J076J58j150P13L88
2763D47r08O02L00j073O74O67j171K48P89q71J92O99j021J17J052r16l24J006
2781E09n79k90R07p16m24J200m84p98R96j60o77Q89k73q02J069Qj026P63K45q42
2801d85O80J71j011P58M77j095L88O23q52L14N56r63K80Q29r39o1Q66o94j27Q40
2821E55p60k47J058o04n57R52l20n56Q74l39o56R88j41q70Q17R7q27P37J21r28
$$ plain form
2688 -155 659 -398 -108 616 -527 -248 805 -358 -511 620 -174 -376 575 -302 -522 714 -56 -690
2706 -690 478 57 -535 480 -5 -719 535 307 -755 231 356 -547 301 317 -713 273 629 -636
2724 -636 -53 591 -422 25 562 -570 -101 796 -392 -357 612 -230 -254 597 -363 -448 752 -124 -624 487
2744 487 -7 -472 511 -110 -667 564 179 -725 281 222 -532 359 175 -738 338 496 -654 59 447
2763 447 -461 141 441 -632 42 709 -462 -214 575 -296 -104 595 -426 -309 743 -173 -497 509
2781 509 -70 -360 547 -169 -593 607 123 -675 321 161 -516 373 100 -702 367 375 -651 112 357 -485
2801 -485 195 366 -645 113 590 -505 -117 506 -346 -32 524 -439 -159 670 -269 -330 536 -158 -285 555
2821 555 -205 -452 606 2 -555 397 77 -479 395 56 -600 388 247 -623 194 291 -536 201 322 -606
2841f06P17L51r72M74M84q70M05M85r22L59O73r09J12P40p65J5P68p50j16Q75
2861E48o57k86Q63n03l75Q64m42n15R14k75o60Q25j06p17P65J7p97P00J88q61
2881e10N86L18q71M86M37q85L56N63q54K32O44q07R7P22p55k5P66o68j43Q13o15
2902a13k75Q42m69l92Q15l78m74Q22k74n95Q03j19o70P06j2p13O80J35q15N61
2922F5L23p89M06L78p89L82N04q38J82O55p20L8O67o87l7P65o55k16Q05m61l13
2943c35P21m35l51Q25l54n60P90j36n84O65j10n92P20J2p73N93K23o90M67J91
2963B87p11M92L72q43K71N66o79J27M98o67J25O62p14j24P51m77k20O59m93k40
2983c58Q28m26n37P75j31n15O09j73n06P28n5p41O15J91o63M69J23o66N44L10
$$ plain form
2841 -606 111 462 -510 -36 448 -422 -17 468 -454 -95 578 -331 -219 521 -244 -229 539 -211 -327 548
2861 548 -109 -395 468 -35 -410 454 12 -503 411 136 -524 301 195 -522 243 260 -537 163 351 -510
2881 -510 76 394 -477 9 446 -439 -83 480 -374 -142 502 -305 -208 514 -241 -266 500 -168 -311 502 -113
2902 -113 -388 454 -15 -407 408 30 -444 378 104 -491 312 193 -477 229 217 -496 184 319 -496 65
2922 65 388 -401 5 383 -406 -24 480 -358 -176 479 -241 -203 464 -223 -260 505 -150 -366 439 -22 -335
2943 -335 386 -49 -400 425 71 -489 301 165 -419 246 136 -456 264 276 -497 96 319 -371 96 287
2963 287 -424 68 440 -403 -132 434 -245 -118 380 -287 -162 500 -214 -338 413 -64 -284 375 -118 -358
2983 -358 470 44 -493 282 151 -364 245 72 -434 294 239 -502 113 304 -359 110 233 -433 111 421
3003D21q15K94M82o12J90L78o62K55N68p40m4O89m84j32N70n29j15P58m81m30
3023d39P26j88m31O03k52m42P66j18p24O12J50o14M72P8o34N68K52q02L40M36
3043C59o17K46L27o63K85N46p55LO35m86l3M68n09j9O74n43k75O86k95k93N47
3064B88l59k57P15k76n25N92N7n63N43j20n70O75J18p24L81L60o10K71K89o67
3084c82L45N06p37P0N62n21L1M82n99L8O89n69k58O71l30k39N62l98k68P20k86
3105H9m91O09p2m30N16j33n08O58L1o67M46K14n64L66J68o06M06L69p10J86M79
3126C56n67J21M47o07O2O31n84j36O25l98j83N66m13k35P01l36m26O42j76m13
3146c23N63j41m80O13m8n71N10J01n49M29J26o03M27K51o35K96L62n90J96L98
$$ plain form
3003 421 -394 -100 382 -230 -40 338 -324 -69 499 -241 -285 404 -80 -212 358 -171 -286 472 -9 -439
3023 -439 287 99 -332 271 19 -423 343 225 -499 113 263 -351 121 199 -435 133 385 -417 -77 359
3043 359 -258 -12 315 -348 -63 483 -272 -269 366 -120 -153 315 -194 -213 461 -82 -357 329 34 -259 288
3064 288 -71 -328 387 111 -414 178 235 -328 215 95 -475 200 318 -406 -25 335 -275 -4 285 -382
3084 -382 -37 469 -268 -198 364 -157 -126 356 -243 -205 484 -85 -343 328 -2 -241 321 -77 -345 375 89
3105 89 -402 207 135 -295 221 88 -420 238 269 -398 48 262 -302 64 232 -374 32 401 -309 -123 356
3126 356 -211 -90 357 -250 -188 443 -141 -277 348 -50 -233 333 -80 -315 386 50 -376 266 90 -323
3146 -323 240 99 -381 232 184 -387 123 224 -325 104 230 -373 54 305 -330 -34 328 -262 -66 332
3166C32n87J31M97n53j3N52m92r0N88m62j88O41l66l16O36k59l87O04j72m65N79
3187B10n7n14N46K0n81N01J27n96M00K14n90L52K75o07K68L72n85J44M43n61R7
3208a22M95n44k9N65m66j36N53l93j80N89l51l03O16k26m08N65j31m53N76o2n56
3229d01N27J02n67M05J60n75M24K28o54L23L76o06J75L88n61J74M68n89J1N67
3249C75m81q0M91m23q0N76m39k61O35k49l60N32k31l14N80j65m96N59K1n17M40
3270A13K7n08N10J31o58L67L44n93K25L24n67K61M10o56R0N66n01m8M91m83l3
3291a88O00n02k27O57k91k94M97k68k62O20k57m83N97k9m73M40m4m60N47L6o20
3312d04M11K70n39K53K15n41L48L38o71J63N12n04PM25m85O1N64n37j78O44l30
$$ plain form
3166 332 -255 -124 373 -180 -193 359 -133 -223 365 -97 -285 356 -10 -326 310 51 -336 268 96 -369 210
3187 210 153 -361 185 205 -376 125 252 -344 56 270 -320 32 307 -300 -32 340 -245 -101 342 -219 -122
3208 -122 373 -171 -200 365 -101 -237 316 -77 -257 332 -19 -322 294 68 -340 225 94 -359 217 155 -401
3229 -401 126 228 -339 66 226 -349 75 303 -351 -28 348 -258 -83 305 -256 -82 386 -203 -192 375
3249 375 -106 -186 305 -118 -198 378 -61 -322 313 64 -296 236 5 -309 271 106 -390 169 190 -327 113
3270 113 140 -368 142 273 -385 -18 326 -267 -42 282 -285 -24 386 -270 -180 386 -115 -163 328 -155 -188
3291 -188 412 -90 -317 340 49 -245 252 -16 -278 342 85 -398 199 170 -303 137 93 -367 180 216 -404
3312 -404 7 277 -262 -9 206 -335 13 351 -320 -157 355 -149 -142 283 -202 -141 423 -114 -292 352 22
3333B2k54N28l35k26O45l06m51O19n8m53M64j01m33N68l1o07M60K03n41L09J65
3354A87n40L90K79o49J90M42m93Q9L51m96J26N07n57q8N94l63j77M98l59j83O22
3375C70l31l95O11j26m06N04j40m24N86l8o06M89J57n41L71J20n49M10K42o42
3395c38K58L81n30J71L21n49J78M74n73k1N30l85q6M48m07p8N72l80l01N82k02
3416F5l13N07k08l60N79j04n20N05O7m85M02N6n23M43J73o12L06L16n47K16K99
3437B62n42K02M20n73M1M90m48k9M63m44m6N40m16j89N47k82k41N00k49k80N37
3458B63j74l91N04p6m09M45om56M30R9n32L52K10n35K88K45n17K24L39n45J48
3479i4M00m97M8M47m54m8N00m15j15N20l40k03N18k65k68N04j99l23N02j32l93
$$ plain form
3333 22 -232 296 -39 -265 380 74 -377 242 184 -269 195 94 -339 229 198 -409 51 254 -287 22 187
3354 187 -353 37 316 -333 -143 299 -194 -105 246 -250 -124 383 -174 -262 332 -31 -208 290 -69 -252 370
3375 370 39 -356 255 129 -277 227 87 -337 249 211 -395 94 251 -290 81 201 -348 62 304 -338
3395 -338 -80 301 -229 -58 263 -286 -108 366 -207 -228 302 -83 -169 279 -128 -206 366 -14 -315 267 65
3416 65 -248 259 51 -309 270 166 -354 151 218 -267 135 191 -332 111 284 -328 -22 294 -253 -37 262
3437 262 -280 -78 342 -231 -190 300 -148 -177 286 -158 -204 336 -80 -269 278 -4 -245 255 6 -274 263
3458 263 89 -302 202 126 -283 162 156 -300 130 229 -303 49 259 -276 12 257 -260 -36 303 -242 -94
3479 -94 306 -191 -143 304 -150 -198 302 -113 -228 292 -48 -251 267 2 -266 238 39 -284 218 86 -307
3500c07M75k2m22M04M2m41L80Q9m83L30J98m93K48K41m73J99L07m97J04M12m33
3521a42JM10l92k2M44m05j33N29k90k54M90k29k46M91j88l75N04n8m00M00j5l87
3543b67M18K5m89L74J80m79K45J90m19K28K44n01J48L78m24K7L49l81M5M00m20
3564a29r3M85k78j88M10k23j87M76k56l14M93p2l71L80m0l56M29nm90L92J67m60
3586b30K44J55m15K84K16n29J91L58m33O0L05l89J06L58m29n9M66k94j24L56k62
3607f5q6M30k82k62M68r6l06L56j00k65M20q0m29L89J09m10K43J00l67L07J56
3628B30n14K18L16m19Q3K69l79J34L22m40lM36l18q8L55l01n3M24l04k27M61j22
3650H0k71L47j28k27M10j20l58L87N6l65K54O0l45L10J11m41K20K42l84J26J95
$$ plain form
3500 -307 168 146 -276 128 170 -271 109 198 -285 45 243 -250 -2 239 -234 -35 272 -225 -121 291 -142
3521 -142 -141 269 -123 -145 299 -106 -239 290 0 -254 236 7 -239 252 64 -311 193 135 -265 135 120 -267
3543 -267 151 176 -313 61 241 -238 7 197 -222 6 250 -251 -103 275 -149 -122 227 -154 -109 291 -129
3564 -129 -222 263 -15 -203 207 -16 -203 273 17 -297 196 124 -247 133 93 -263 166 161 -329 63 230 -230
3586 -230 14 169 -246 38 254 -275 -84 274 -159 -99 206 -183 -77 281 -148 -207 259 -35 -159 197 -65
3607 -65 -151 279 -3 -265 203 107 -199 157 57 -208 212 132 -297 92 201 -209 34 134 -233 74 230
3628 230 -284 -66 250 -169 -86 183 -196 -62 260 -180 -183 253 -65 -153 202 -99 -152 272 -32 -259 202 80
3650 80 -191 156 28 -199 211 91 -267 120 176 -189 65 125 -220 90 201 -240 -20 222 -162 -36 159
3671A59l47J55K80m35K5M07l34n9L46l04l6M00l13j83M50j89k13L60j62k18M25
3692B14j32l45L85J6l18K75J0l16L27O9m09K32J85l54J62J71l66J87K37m14O3
3713a21L37l16k1K98l09LL72l29j32M15k08j76L58j92j91M33j62l10L98l8l13
3734b04L31l3l14L49M3m13K81J49l73J95J63l66J82K26l97J02K91l39L7K78l34
3755a46K4L47l20q2L74k41j41L58k00j53L67j66k58L95r8k71L56o4l18L72j1l63
3777b39L25R4l76K37J43l80K08J73l61Q7K92m25J20L54m33J17K79l16JL13k94
3798h1p8L66k27j94L74j83j52L62j51k58L73o5k85L14k2k88L07K7l47K84J07l76
3820a93K19J53l48J80J91l90J38K75l62N1K75l26M4L10l49m4L97k75j32L45j98
$$ plain form
3671 159 -188 -33 247 -188 -163 244 -90 -149 197 -107 -143 257 -56 -239 211 22 -191 169 7 -211 214
3692 214 82 -263 122 138 -180 95 105 -211 116 185 -224 8 193 -161 1 172 -194 -7 230 -184 -121
3713 -121 216 -100 -121 177 -132 -129 243 -86 -218 197 -11 -187 171 -21 -212 221 59 -251 147 109 -204
3734 -204 127 94 -220 129 172 -241 40 189 -184 11 174 -192 -10 216 -181 -79 212 -127 -90 188 -146
3755 -146 -122 225 -95 -177 197 -44 -185 173 -27 -180 187 21 -237 158 60 -211 145 81 -237 135 124 -239
3777 -239 86 180 -196 41 184 -196 12 185 -176 -89 203 -222 -102 252 -181 -64 215 -101 -100 213 -81
3798 -81 -159 207 -20 -214 160 -23 -175 187 36 -222 151 86 -199 115 93 -195 112 139 -208 76 183 -193
3820 -193 26 179 -169 11 202 -188 -50 225 -137 -86 189 -137 -93 217 -132 -176 221 -54 -186 159 -39
3841c9j30L60k14k03L95j04k71L19m6k44L34o9l20L28P9l51K18J03l09K34J06
3862A76l72J82K36l60O3K47l05Q9K66l76NL71k80j12L17k21o9L52k63j66M03j48
3884C5k44L36j01k04L47r3l10L47M9l45K39N6k75K60Q0l78K16K09l53R0K06l06
3906a39J19K35l74M4L40k94o2K82k38k2L19k82j56M10j61k10L08j19j81L58j35
3927D2k95L78J3l39K73K7k91L16L3l90K71J82l53J37J61l12J66K03l99R9L19l13
3949g2l1K66k74K3L02l03r2L70j93j72L02j63j37L55j78k52L88m7k90K79j8k53
3971a90L01Nl55K87J39l52J93J37l42K11J80l98J30K92l49L1K54k89M2L00l33
3992a06n2L72k46j22L11j99j36L63j90k16L63p5k55K93o9k42L25j5l38K96R1l27
$$ plain form
3841 -39 -169 191 -23 -226 169 65 -206 113 67 -177 157 88 -232 96 175 -176 42 145 -164 70 176
3862 176 -196 -14 222 -138 -75 172 -133 -44 222 -154 -149 222 -58 -170 147 -74 -143 209 -54 -220 183 35
3884 35 -209 127 26 -178 169 76 -234 113 162 -183 56 112 -163 97 177 -201 15 224 -129 -39 167 -139
3906 -139 -20 215 -159 -115 225 -69 -131 151 -87 -109 210 -72 -228 182 21 -189 119 0 -181 177 42
3927 42 -253 125 138 -201 72 99 -192 124 157 -233 38 220 -133 4 165 -147 19 222 -177 -78 241 -72
3949 -72 -103 163 -111 -88 214 -89 -181 189 -4 -176 126 -37 -174 181 3 -249 139 92 -198 81 63 -190
3971 -190 111 116 -239 48 187 -165 28 165 -177 34 214 -184 -54 238 -111 -80 174 -115 -73 227 -106
3992 -106 -158 214 -32 -154 157 -42 -178 185 -5 -221 142 67 -188 105 36 -206 119 104 -234 62 153 -174
4014a74K14R4l19K22J54l73J45K47l32Q2K28l24P2K95l55k0L61k79p6L29k57j04
4036a70L71k42j69L66j34k18L39j19k47L56m7l19L15L2l18K64O0l20K53J10l67
4057b04K01J78l33J33K01l28R7K65l34J5L14l03l4L22k62o1L33k46j31L59j79
4078Cj92L61j37k49L63q8k77L34k5l11L23K0l39K87O9l46K42J30l62J91J97l44
4100a50J20K22l32Q4K54l27L1L08l01l7L14k52q7L55k45j51L80j83k04L49j20
4121B8k29L48j04k79L67j3l35L05L8l29K91O8l69K52J70l90J75J96l51J43K33
4142B15l85R1L17l38j8L22k91j8L14l03q0L84k32j64L39j64j81L70j74k46L81
4163A39m5l12L07%k83L07J0l63K93J35l73J95J63l36J83J93m06J43L04l74M2K68
$$ plain form
4014 -174 40 134 -185 37 191 -182 -37 210 -122 -40 188 -136 -64 231 -124 -144 217 -62 -138 191 -66 -170
4036 -170 201 -41 -210 156 22 -196 143 24 -223 133 86 -233 82 114 -204 60 120 -200 53 163 -204
4057 -204 -3 175 -158 -25 176 -152 -55 210 -124 -109 205 -98 -132 190 -72 -133 200 -46 -177 182 3
4078 3 -189 172 35 -214 149 61 -216 118 93 -218 105 125 -214 73 142 -204 38 168 -194 -3 194 -150
4100 -150 -30 192 -140 -56 198 -129 -98 210 -91 -128 186 -66 -153 202 -43 -194 186 3 -201 148 28
4121 28 -201 147 43 -236 131 118 -217 88 126 -203 88 156 -213 39 209 -181 -6 190 -161 -18 215
4142 215 -170 -79 238 -100 -118 204 -87 -105 209 -94 -174 210 -22 -186 153 -11 -192 178 4 -242 139
4163 139 94 -218 89 89 -194 113 123 -240 53 188 -185 10 173 -163 20 213 -193 -50 254 -120 -78 190
4185A90l11N2L02l58m8L93k48j60L36j86j24L43k03k19L89q5k77L12m6k58L32
4206A26m2l35L21J00l57K03J19l02K08J41l87J66K68l54N9K45l02Q6K79l90J3
4227a35L96k85j23L29k29j16L64k59j90M07q5k89L21o4k55M11j14l36L08N2l36
4248b28L17K6k47J51J60l68J69K50l62J04J90k61P9K71m60R2L48k62j24L37k21
4269c9p8L61k59k14M06j79j74L10j39j53L10j21l09L81Kl34K71N6l30L17P7m10
4291b48K57J91l54J36J84l15J39K19l60P2L18l23j7K87k62k6L28k91j05L58j87
4312Aj80L43j74j78L58j38k67L55l6l00K96Ml04L18L0l63K74J24l46J87J65l50
4334a81J83K21l86R9K76l28L6K84k94j0L28k87q8L54k27j38L31j83j62L46j56
$$ plain form
4185 190 -121 -69 233 -125 -173 220 -28 -188 148 -38 -162 181 -22 -241 148 63 -214 98 52 -206 126
4206 126 84 -251 70 170 -187 16 135 -167 41 182 -205 -39 229 -125 -66 179 -123 -37 242 -148 -135
4227 -135 261 -24 -147 182 -47 -163 201 -58 -248 159 74 -215 106 42 -213 198 84 -252 56 108 -228
4248 -228 89 115 -132 19 179 -189 -20 230 -132 -28 162 -99 -20 251 -209 -117 231 -31 -155 182 -39
4269 -39 -117 244 -15 -229 177 -2 -176 134 -5 -158 152 31 -278 103 105 -229 42 98 -232 85 162 -248
4291 -248 9 200 -154 -18 166 -149 -10 209 -151 -79 239 -84 -101 186 -76 -102 226 -65 -170 188 1
4312 1 -179 164 -10 -188 170 32 -235 120 84 -216 80 84 -220 98 128 -235 39 163 -183 4 169 -181
4334 -181 2 223 -163 -64 212 -116 -80 204 -90 -100 228 -59 -147 207 -20 -158 173 -10 -172 174 18
4355A8k24L33o8k66L06j7k96L04K7l42K71J10l52K15J39l54J96J91l62J33K41
4376B03l43Q7K59l24K2L17l08k9L42k82j03L59k23j50L52j72j98L51j26k55L43
4397A22m7k92L00J4l10K75O0l27K39J19l60K09J59l33J64J95l48J16K69l41L1
4418h6L06l09j0L23k99n3L57k51j34L58k05j70L65j73k31L80j00k85L18j5k84
4439a98L03j4l30K95R0l37J87J23k80J05K28m26J75K74l57J05K37k80M7K92l32
4460i3kL19k59j38L52k10j11L39k10j89M00j42k70L38o5k57L45q2l08L31O4l72
4482b20K42R0l13K42J03l76K11K32l73J03K35l10R7K35l44M5L37k89p6L13k20
4503c6p8L23k58j30L84j56k35L14r0k13L38j08k87L47J7l51K65O1k92K63N2l76
$$ plain form
4355 18 -206 127 59 -207 99 82 -214 90 117 -225 46 156 -196 19 158 -196 0 191 -171 -38 203
4376 203 -140 -53 206 -118 -96 221 -87 -116 226 -56 -159 200 -23 -173 179 7 -191 160 34 -221 122
4397 122 75 -217 83 97 -213 62 122 -205 34 153 -207 2 161 -172 -8 187 -161 -45 224 -117 -86
4418 -86 220 -89 -99 224 -75 -128 229 -22 -156 202 -3 -173 192 19 -212 168 68 -217 101 86 -198
4439 -198 105 91 -239 56 146 -191 -4 119 -161 -56 172 -254 -79 195 -162 -57 180 -100 -53 239 -93
4460 -93 -95 224 -35 -173 179 -31 -142 197 -13 -202 198 56 -214 124 59 -198 147 65 -243 88 152 -220
4482 -220 22 112 -201 41 144 -232 -21 211 -162 -59 176 -134 -37 198 -146 -101 236 -53 -129 184 -36
4503 -36 -114 209 -49 -179 205 49 -186 128 38 -175 163 55 -232 115 132 -219 46 107 -185 78 130 -246
4525b46K63J76l66J43J85l23J51K08l80J02L18l22k2K93k59oL17l08r5L91j95
4546B5j97L23j31j75L31j39k55L54j6l25K79J6k87K93K1l62K80J44l57J57J64
4567A43l19J78J92l82J19K90l30J1K74k76PL19l24o3L85k32j57L37j84j45L42
4588A85j73k30L75p2k95L08j8k73L02kl40K82J08l46K02J34l31J90J69l58J41
4609d2K49l40N0K65l00M6K95l24k6L58k80r3L32k23j21L65k06j98L81j42k43L40
4631A43q0k52L27l9l22L13M3l45K68Q7l49K36J43l73J90J97l45J15K28l27P8K72
4653B08l27K0L11k84m5L19k46r3L49k23j44L52j70k09L50j28k35L51p4k94L23
4674A11kl24L06L7l54K78R9l59K19J56l58J77J99l55J28K44l46P0K82l18NL40
$$ plain form
4525 -246 17 193 -173 -30 155 -168 -17 191 -189 -87 231 -91 -113 180 -79 -85 232 -76 -171 220 25
4546 25 -172 151 20 -155 176 37 -218 136 120 -205 74 90 -197 96 117 -245 35 179 -178 -21 143
4567 143 -176 2 194 -188 -69 221 -109 -98 176 -100 -93 226 -98 -161 224 -8 -165 172 -12 -157 185
4588 185 12 -218 157 85 -210 98 80 -193 109 107 -233 49 157 -189 13 147 -184 6 175 -183 -42
4609 -42 207 -133 -83 182 -118 -72 223 -101 -127 231 -49 -142 190 -33 -154 211 5 -193 188 46 -197 143
4631 143 63 -189 138 99 -223 90 133 -212 56 143 -206 30 173 -200 -10 187 -158 -43 185 -142 -64 208
4653 208 -119 -99 212 -72 -117 202 -44 -137 212 -11 -155 197 27 -182 168 40 -195 156 82 -212 111
4674 111 109 -215 91 128 -226 52 151 -208 11 167 -191 -14 185 -170 -42 202 -144 -74 208 -110 -105 235
4696B35k98o4L38k34j08L33k07j62L64j69k10L34r3k45L30n8l01L23J2l37K85
4717F8O0l43K56J07l66K20J84l84J54K31l50J07K55l50N7L24l37k5L42k73o1L55
4739B31k83j08L79k03j92L46j29k13L45j26k66L59k8l23K96K5k97K72M6l64K64
4760C1J50l79J74J83l38J61K03l74J15L07l63J3L17k97J1L11l17n8L90k42j61
4781a63L44j82j41L52j87k29L85p6k97L03j0k71L08l1l35L05R7l68K07J27l16
4802a78J86J55l87J65K69l50M6K60k97O6K75l42pL70k68j21L46k19j05L48k26
4823a4j77M04j37k64L37q2k33L32p4l32L63M0l63K49Q7l12K39Q9l77K13K15l72
4845a69J05K16l07J11K41l57M0L45l07o1L14k42m2L29k54j47L97j80k06L32j26
$$ plain form
4696 235 -63 -127 211 -23 -131 202 -5 -167 197 28 -182 152 59 -186 144 86 -215 108 120 -217 68
4717 68 128 -215 41 148 -218 2 186 -198 -44 187 -163 -56 199 -151 -94 230 -107 -132 210 -63 -124 231
4739 231 -52 -160 219 16 -176 170 41 -172 173 47 -219 140 112 -211 85 110 -187 85 131 -233 31
4760 31 181 -198 -24 159 -179 -18 185 -189 -74 233 -130 -117 200 -97 -86 225 -92 -150 240 -2 -163
4781 -163 181 -1 -142 210 23 -206 179 103 -194 109 99 -172 136 105 -230 75 172 -196 11 138 -178
4802 -178 8 163 -224 -59 210 -140 -94 166 -131 -65 210 -132 -139 231 -37 -158 188 -31 -136 212 -14
4823 -14 -191 213 76 -188 149 67 -166 166 92 -240 123 163 -200 49 136 -176 63 152 -225 -12 203 -169
4845 -169 -64 152 -155 -44 197 -160 -120 225 -82 -143 171 -71 -113 216 -38 -185 212 32 -174 158 32
4866C2j97L57j30k79L61k4l13K77L2l04K83M3l68K58J56l75J69J73l36J60K17
4887A92l73R8K93l30J3K85k89%L18k86q0L75k33j54L34j61j61L60j71k36L58n7
4909I5k89L03k5k65K99pl23K69J04l61K07J36l34J92J66l64J53K43l49O7K62l17
4931a38N3K94l16k6L32k55r8L42k21j25L56j93j84L50j19k26L26p7k65L12k3l01
4953b02K92L4l12K55O7l21K11J31l37J63J98l46J21K34l40P8K75l20J8K97k83
4974h7l8L34k74q1L38k17j37L36j68j78L38j23k23L14n2k67K97k7k90K95L9l19
4996a90K39R1l28K06J33l28J64J93l41J00K32l12Q0K34l05L6K99k84n1L16k31
5017d7p0L07k28j14L47j71j99L38j19k17L28r6k60L27j8l11K73L5k84K45O9l42
$$ plain form
4866 32 -165 192 62 -217 144 120 -193 84 116 -188 95 138 -230 28 184 -191 -22 151 -185 -25 192
4887 192 -181 -83 210 -120 -107 178 -111 -111 207 -79 -159 216 -17 -171 163 2 -159 201 30 -206 152 95
4909 95 -194 109 84 -181 118 111 -212 57 161 -200 7 143 -191 1 167 -197 -44 199 -150 -83 179 -138
4931 -138 -85 209 -107 -133 199 -56 -154 188 -33 -158 198 5 -179 171 52 -174 152 75 -190 122 99 -202
4953 -202 90 124 -188 67 134 -187 24 155 -182 -19 179 -167 -46 188 -152 -74 201 -119 -101 196 -87
4974 -87 -125 209 -65 -146 192 -25 -162 174 6 -172 166 43 -180 134 82 -185 112 85 -205 90 129 -190
4996 -190 49 140 -188 18 151 -177 -13 180 -161 -61 171 -141 -61 173 -132 -96 203 -81 -132 184 -47
5017 -47 -117 190 -38 -152 195 24 -175 163 44 -173 155 59 -201 126 108 -203 70 105 -179 66 135 -207
5039b07K31J48l47J42J84l07J24J92l23P9K74k90j4K74k39k0K85k61p6L53k17
5060a5j61L29j31j72L17j36k19L33m7k82K76Qk69K77jl22K74J05l47J76J54l06
5082a59J61J61l49J34K53l31K7K54k46K2K69l20pL26k23j29L02j46j16K82j68
5103cj72L59j15k48L04l6k36K75p1k57L23N1l54K16Q1k84K11J09l75J73K39l64
5125a74J22K20k87Q6K15l39M3L31k48j10K89k08n8K81k14j26L93j39l29L49o8
5146B9j44K08j6k79K65M0k84J98Q1l09K96Q5l78K40J74l43Q0K17l16J22K01l26
5168a59Q2L01l20j4K66k25l8K99k50j05L59j89j72L15j29j63L19j47k32L39k6
5189A11k86K60J7k82K59K6l09K47J27l46J73J44l03J60J64l27J04K42k96J3K63
$$ plain form
5039 -207 24 172 -175 -33 151 -156 -32 160 -163 -84 190 -100 -114 160 -79 -99 186 -75 -151 202 -15
5060 -15 -176 153 22 -150 167 31 -188 145 98 -184 92 100 -169 108 107 -215 59 164 -183 -7 147 -159
5082 -159 2 163 -186 -52 201 -130 -103 151 -95 -73 196 -124 -131 195 -28 -157 145 -1 -117 165 -3
5103 -3 -175 184 69 -179 125 89 -147 128 57 -200 123 174 -180 36 117 -167 44 153 -222 -49 190 -174
5125 -174 -52 168 -119 -33 182 -157 -114 217 -31 -141 148 -60 -118 163 -51 -177 216 77 -252 97 29
5146 29 -115 93 77 -202 63 103 -181 17 98 -211 85 170 -208 32 206 -137 -57 160 -156 -34 167 -159
5168 -159 -77 224 -96 -110 156 -69 -107 192 -58 -163 196 7 -165 150 21 -142 177 30 -202 137 111
5189 111 -175 85 102 -180 79 105 -204 43 170 -176 -3 141 -162 -2 162 -165 -61 181 -115 -102 161
5210A61k75K4K77k87m2L32k18j18L19j91j39L31j68j99L60r6k53L12o0k50L01
5231A21j9l11K85O2l27K27J01l12J91J28l29J57K05l25Q8K21k94N4K48k87MK92
5253A80k49o4L13k14r6L03j81j47L20j36j94L30j06k26L04n3k59K85kk94K71M1
5275A26l16K29J01l15J79J44l28J60J90l15Q4K38l11M7K50k84J3L01k59o6L02
5296A70k09r8L11j80j38L33j54k08L22q5k19K89n8k47K87J0l10K56N3l00K20Q7
5318A32l26K17J42l37J25K06l06J00K07l12O9K72l10j1L14k59l8K89k35q8L38
5339A89j84j72L19j23j80L01j13k20L40m8k75K42M1k79K45L3k92K35J09l40J62
5360a0J54k93J48J61l37J15K55l22K2K69k57MK65k87l0L58k47j31L28j75j21L14
$$ plain form
5210 161 -114 -90 187 -100 -142 190 -28 -146 173 -18 -157 174 6 -193 167 71 -182 130 70 -180 121
5231 121 102 -209 76 138 -189 38 139 -173 18 146 -183 -26 179 -146 -58 163 -131 -77 171 -116 -112 180
5253 180 -69 -133 180 -34 -130 173 -8 -155 165 29 -165 165 59 -167 137 84 -175 110 108 -186 85 126
5275 126 -190 39 140 -175 4 148 -180 -20 170 -145 -61 177 -134 -87 163 -121 -108 193 -66 -132 170
5296 170 -39 -137 174 -6 -144 189 35 -173 149 64 -155 134 76 -171 116 126 -184 72 125 -175 45 132
5318 132 -194 23 165 -172 -47 159 -147 -47 160 -152 -83 189 -121 -132 182 -77 -115 174 -61 -149 189
5339 189 5 -167 152 29 -151 150 37 -183 157 109 -166 76 117 -162 83 116 -176 59 168 -172 -10
5360 -10 144 -149 -1 160 -177 -62 193 -129 -107 162 -95 -91 174 -113 -143 215 -32 -163 165 -10 -131 183
5382A83j82j81L60r3k63K81j9k35K68k7k91K96O3l34J97J17k85J69J22l29J65
5403a8K06l28O0K34k74N1K46l04JL25k78q3K97j78p0K89k36j23L71j55k03K97
5425A27q9j86L01q8k72L33K4l37K53O4k77K22P0l40K12J80l55J12K08k87R8K06
5447A79l25M2L01k91m0K82k18m5K80k39r4L53j77j87L10j13j80L25j17k55L41
5468A32k2k91K64K6k75K70K4l24K50J30l52J64J60l09J46J82l50J12K70l26K2
5489i7K70k75QK91k89o6L53k13j45L18j52j52L21j54k12L35o0k68K98k6k54K87
5511A18j7k94K63R1l37J90J36l10J85J42l47J56K20l40O8K54l07N5K61l06qL24
5533A97k51j00L30k14j15L35j89j84L55j21k31L20o3k52L03k0k90K87L0l08K37
$$ plain form
5382 183 1 -180 180 87 -176 105 86 -149 119 92 -199 97 160 -174 23 140 -145 24 146 -183 -18
5403 -18 188 -140 -80 154 -120 -69 177 -127 -126 199 -79 -162 135 -43 -113 176 -60 -183 188 33 -170 127
5425 127 38 -148 153 65 -207 126 150 -187 66 130 -147 75 145 -195 17 197 -158 -46 162 -125 -27 179
5447 179 -146 -104 197 -94 -134 148 -70 -115 165 -74 -168 185 8 -179 131 18 -162 163 46 -209 132
5468 132 110 -181 83 109 -166 104 128 -196 54 184 -168 -4 156 -153 -7 175 -175 -63 207 -119 -97
5489 -97 173 -102 -94 197 -92 -158 195 -18 -163 155 3 -149 172 18 -194 141 81 -187 111 85 -169 118
5511 118 101 -193 70 161 -176 14 150 -160 25 167 -180 -24 196 -144 -76 178 -129 -74 187 -119 -127 197
5533 197 -54 -154 176 -38 -153 182 -7 -191 164 43 -188 132 69 -183 120 100 -190 97 127 -181 56
5554E6R3l16K06J33l46J70J82l34J13K27l18P5K46l01K6K84l01j9L23k69q0L31
5576A81k01j38L39j87j74L54j22k44L38p2k53L10m2k78K97L0l36K48R7l19K04
5597C2J27l33J77J74l42J14K28l10P4K30l03K8K96k76o0L12k25q5L14k19j13L54
5619A94j93j83L41j05k19L00p2k61L40l1l12K81M7k94K40O9l36K26J43l48J52
5640b1K08l22R6K06l34R0K70k99l3L12k35o4L14k47j28L95k00j94L05j03j77K96
5662A35j23k03L60q9k79K87J6k82K67J6k95K94Q6l76J91J46l25J83J55l49J92
5683GK05l28J4K69k72pL02k91m2L73k34j82L59j57j41K48j44r3L02n8l02K56J2
5706I6k12J98K4l11L35J06m63K38J88l70J82R4l01K06K16l74Q2K52k84mK73l43
$$ plain form
5554 56 149 -167 39 172 -174 -4 178 -156 -43 184 -134 -59 187 -114 -88 196 -105 -124 199 -70 -150 181
5576 181 -20 -158 181 -6 -180 174 52 -192 146 74 -179 131 89 -189 108 138 -198 50 147 -172 32
5597 32 159 -174 3 177 -165 -51 177 -133 -59 171 -132 -104 192 -84 -144 168 -57 -142 172 -47 -160 194
5619 194 1 -182 159 54 -165 135 63 -198 142 111 -201 80 127 -167 73 142 -194 32 175 -173 -21
5640 -21 187 -135 -39 167 -167 -77 193 -106 -139 173 -62 -126 188 -59 -187 208 8 -186 119 16 -161 135
5662 135 12 -191 169 80 -199 88 104 -178 89 105 -190 104 190 -186 5 151 -174 9 164 -185 7
5683 7 212 -116 -102 167 -105 -112 190 -101 -143 230 -4 -186 173 16 -125 123 -21 -114 188 130 -172 84 96
5706 96 -116 82 106 -205 130 236 -227 11 199 -171 11 105 -196 10 226 -148 -66 186 -98 -102 171 -172
5728a72M3L56k99n1L16k41l4K21j92j19K91j13j53K51l6k28K96r2k33K75M3k94
5750a65J82J13k34J85J23l74J43K47l61Q7K22l03J30K16l56O7K39k63OK49k18
5771f5k0K57k51q3L38j66j86L05j22j80L22j14k27L13ok86K43M6k51K18N9l28
5793a84K41J32l45J57J65k76J05J72l19R6K46k78j3K68k55j4K59k36o0L11k01
5814b9j26K94j30j48L06j50j99L13o1k34K92m0k52K66Nk64K31P0k89J70J37k97
5836a35J54J52l25J13K21k94R2J91k70pK80k92j4L28k66p9K95j49j69L24j69j30
5858a49L03p9k54L06n3k58L15l2k29K37K9l22K54O5k98K20Q7k73J30J76l09J07
5880b7K19l04L5K47k73J8K61k83k3K92k21p8K79j75j18K81j33j48K96r9k17K81
$$ plain form
5728 -172 -129 227 -72 -123 193 -48 -82 139 -53 -172 119 6 -147 104 68 -160 136 44 -189 86 129 -165
5750 -165 17 130 -104 81 204 -170 -27 220 -141 -54 168 -135 -5 211 -145 -78 161 -102 -96 153 -65
5771 -65 -85 172 -79 -162 176 10 -176 129 7 -173 149 35 -192 121 115 -171 72 118 -133 85 144 -184
5793 -184 57 189 -156 1 166 -110 -5 167 -152 -56 190 -88 -101 167 -88 -102 157 -79 -139 172 -29
5814 -29 -155 139 9 -139 167 17 -182 131 70 -164 128 88 -164 102 107 -157 74 144 -145 25 162 -135
5836 -135 19 171 -154 -41 180 -114 -22 169 -101 -108 172 -120 -134 194 -72 -151 144 -5 -174 150 -19 -149
5858 -149 154 75 -179 127 74 -184 131 99 -130 107 136 -186 68 133 -165 55 142 -131 -1 175 -134 -27
5880 -27 192 -112 -77 170 -103 -85 176 -107 -130 162 -59 -137 142 -33 -151 130 -3 -151 145 46 -171 110
5902A10l4k18K46k8k36K58L5k97K30Q9k88J81R3k90J73J61l16J01J92k64N9K02
5924A59k74N5K51k84l6K77k05o7K66k02q7L17j80j70L04j05j70K61q3j95K93k1
5946A04k69K23N2k40J97M7k67K13J17l18J33J71k65R6J63k77Q8K19k85kK54k16
5968f2k7K28k31k8L06k25j26L00j25j36K61j44j61L04p4k39K53K2k29K23nk52
5990a67K60O2l03J68J36k52J31J02k73J29K07k95K4K15k08PK08k57MK86k35r4
6012a45K74j52q7K52j82j17L14j23k00K67m5j96K55o6k18K70J8k85K08Q6k49J78
6034E7O6k77J84J63l17R5J87k42P1J68k72N5K55k53n2K44j77n5K48j99r1L14j50
6057B2j80K82q8j73K56r3k00K95k3k63K21M3k37K09M3k82K19J07k94J22J55k53
$$ plain form
5902 110 76 -142 104 76 -160 98 133 -164 66 155 -133 48 141 -149 24 185 -131 -30 162 -102 -43 159
5924 159 -115 -60 191 -93 -129 148 -57 -124 142 -60 -147 170 -10 -180 124 19 -151 110 27 -168 125 104
5946 104 -165 58 110 -130 67 114 -153 60 177 -141 -8 163 -102 -6 157 -120 -32 187 -98 -100 154 -62
5968 -62 -89 139 -92 -120 186 -39 -165 135 10 -126 135 -9 -170 134 60 -179 74 96 -133 90 85 -167
5990 -167 93 155 -148 20 156 -96 35 137 -136 -7 200 -95 -71 144 -64 -57 151 -106 -102 184 -51 -145
6012 -145 129 -23 -110 142 -40 -157 157 34 -166 101 56 -140 115 49 -169 101 119 -166 42 128 -121 57
6034 57 123 -154 30 193 -124 -29 158 -84 -13 155 -117 -62 193 -60 -112 132 -45 -100 148 -51 -142 172 22
6057 22 -158 124 36 -137 119 26 -174 121 98 -165 56 99 -138 71 114 -168 51 158 -136 -14 141 -112
6079a12J11J53k87Q8K29k74NK44k31pK46k43m5K92j82j41K80j21j35K57j13j67
6101a53K73o0k22K54j7k18K31J1k63K30P6k79J74J03k70J48J29k82J29J74k82
6122a14N8K15k48L3K14k44nK47k12o6K76j84r8K51j41j36K94j03j88K54m6k09
6144a52K53k8k27K38J8k38J82P4k59J67J14k79J28J59k80R8J84k52N9J95k57J9
6166h4K41k47k0K63k08o5K69j80j03K72j59j30K83j01j83K71o7k06K63k9k34K40
6188H6L9k82J99R3k64J73J05k83J60J45k61N0K12k61J9J91k41Q6K13k63l2K16
6210A00j41j20L09j62j66L42j69j43L03j26j71K63p5j94K72m3k57K55M3k65K29
6231H4L4k67J99J00k89J32J75k68Q8J54k60Q5K16k84RK52k15l2K28k18l9K81j97
$$ plain form
6079 -112 -1 152 -135 -47 182 -92 -87 157 -74 -81 165 -78 -123 169 -13 -154 126 5 -130 127 14 -153
6101 -153 120 60 -162 92 75 -143 88 99 -164 66 142 -137 37 140 -130 18 147 -135 -6 168 -114
6122 -114 -56 159 -89 -56 158 -86 -91 156 -56 -122 154 -30 -128 123 -18 -154 140 37 -151 103 57 -152
6144 -152 101 73 -154 84 102 -136 46 120 -139 28 142 -137 -9 150 -130 -32 152 -100 -41 154 -103 -84
6166 -84 157 -90 -110 153 -55 -120 149 -31 -134 138 -21 -151 132 31 -152 119 52 -154 109 80 -154 86
6188 86 125 -157 42 135 -129 44 149 -134 26 171 -90 -40 172 -89 -70 121 -120 -34 179 -84 -116 100
6210 100 -41 -161 148 -14 -180 162 -7 -150 153 27 -144 119 44 -150 122 79 -178 77 120 -145 84
6231 84 118 -149 50 150 -139 -7 168 -100 -12 142 -118 -33 183 -101 -92 160 -55 -87 141 -77 -116 165 -32
6254c2j32K95j11j39K42j26j51K96p4k46K61Rk19K08Nk46K46O1k95J71J32k68
6276a13J37J22k86J44J91l23N3K43k40J9K00k48lK76k29r3K86j50j06K37j40j32
6298a55L01j10k13K64k5j94K23k9k19K47L3k89K02J04k51J59P9k74J76J61l00
6319a10P5J95k37N7J68k62M5K58k74l9K69j83n6K41k01q7K96j55j59K68p7j53
6341a21K33q4j97K89k4k61K21M9k31J86M8k56J89J20k94J13J62k31Q8J46k70Q4
6363d1K35k74j7K44k09k0K40k34n2K96j88j31K65j17j34K59j13j70K83m5k50K42
6385F9K2k31K28Kk34K16Q4k89J57J30k62J21J43k64R0J92k62K7K26k38MK17k31
6408h3k2K71j98j04K73j51j21K68j46j47K86r6j97K60m6j89K46k9k44K62K7k68
$$ plain form
6254 -32 -164 131 20 -119 123 -3 -154 142 68 -178 83 92 -127 81 86 -160 86 147 -148 23 155 -113
6276 -113 24 146 -140 4 195 -128 -75 168 -72 -53 147 -101 -104 172 -57 -150 136 -14 -120 117 -23 -155
6298 -155 146 36 -177 87 62 -132 91 62 -157 90 123 -166 36 140 -111 48 127 -147 29 190 -110
6319 -110 -35 160 -77 -20 148 -114 -69 189 -85 -124 145 -38 -94 147 -54 -141 155 0 -159 109 32 -121
6341 -121 112 28 -169 120 96 -165 56 105 -126 60 108 -148 41 161 -133 -20 142 -89 -1 145 -125 -41
6363 -41 194 -80 -97 147 -62 -82 158 -76 -128 168 -20 -151 114 -3 -137 122 9 -161 122 77 -173 69
6385 69 91 -140 88 90 -144 72 156 -133 24 154 -108 13 156 -108 -18 174 -88 -61 165 -73 -69 148 -83
6408 -83 -105 166 -32 -136 137 -14 -135 133 -13 -160 126 30 -167 93 47 -142 104 75 -169 93 120 -148
6430a48J93Q0k45J57J05k71J42J63k77Q8J72k50L2K27k36k4K59k27m0K51j83q5
6452a17K53j52j22K56j10j70K65p2j97K79n2k17K50kk41K20L8k56K01P9k68J68
6474C3J24k73J15J61k75P9J98k60M0K11k20lK36k37m4K66j88p8K55j60j39K85
6496A26j19j66K62o5j97K42l3k10K44J1k60K26O1k53J69Q5k62J78J24k92J22J63
6518A56k48Q2J74k61N9K29k63k4K59k05n7K34j91n5K65j72j40K77r1j69K32p9
6540A2j60K61m6k42K35L9k29J84L9k37J95R0k85J44J48k38R7J47k53R1K00k81
6562h9K0K44k12k5K01k10rK53k17j01K78j24j28K28j19j37K83r9k16K51nk07K09
6585F9pk23K38M2k81J85J21k55J22J17k54J45J60k84N6K19k19JK00k27J1K49k26
$$ plain form
6430 -148 45 125 -120 37 142 -129 13 176 -101 -13 159 -91 -59 168 -68 -92 167 -60 -100 151 -32 -117
6452 -117 136 -16 -138 118 8 -162 103 31 -166 113 61 -156 94 92 -149 71 109 -147 54 133 -135 33
6474 33 157 -116 -1 160 -115 -36 162 -98 -58 153 -67 -70 166 -71 -115 151 -37 -115 140 -20 -159 126
6496 126 7 -159 103 38 -159 83 50 -160 84 95 -165 61 122 -131 38 123 -139 39 163 -129 -7 156
6518 156 -92 -10 164 -97 -38 191 -72 -96 163 -42 -99 135 -56 -111 154 -18 -158 119 28 -141 91 12
6540 12 -148 113 67 -175 60 99 -130 54 93 -144 51 141 -144 0 148 -90 7 154 -99 -8 192 -89
6562 -89 -69 175 -37 -62 139 -71 -80 173 -44 -145 133 9 -119 109 -10 -147 136 37 -179 72 67 -140 69
6585 69 62 -161 77 119 -162 23 144 -111 11 128 -126 19 179 -105 -49 170 -49 -48 152 -75 -64 185 -41
6608d1q0K67j56q8K22j57j08K92j33j99K86n7j95K31n1j95K59Lk73K09Q7k41J55
6631C7O8k47J67J30k84J03J83k39N5J78k40L8K43k53l6K42j71o0K21j82o9K72
6653A56j52j51K56p1j64K30q7j76K76m1k31K19L3k27J93L5k52K05R2k75J41J31
6675A40k41J11J33k52Q5J96k58K1K18k06j5K10k03m7K63j73j13K54j06j34K37
6696A20j15j48K66o3k09K32k2k04K14Mk12J96N5k53J73R3k41J34J21k55J16J60
6718A62k59N6J93k31L4J92k16MK26k02o6K49j64r6K52j39j28K50j01j56K36n6
6740D0j78K34m0j99K14K2k34J94O7k46J61R5k47J31J23k44J07J50k53Q3J79k31
6762g2L3J93k18pK19k04l0K28j83p2K31j34r8K33j16j43K45p2j86K34k4j91K19
$$ plain form
6608 -41 -121 146 -10 -98 124 -33 -141 151 18 -181 105 48 -147 84 33 -162 97 100 -173 36 123 -118 37
6631 37 105 -142 25 155 -129 -26 157 -82 -27 151 -89 -51 192 -61 -97 145 -26 -86 135 -47 -116 156
6653 156 4 -147 109 38 -126 104 17 -159 117 76 -155 64 97 -130 63 98 -154 51 143 -132 9 140
6675 140 -101 10 143 -109 -24 172 -86 -65 153 -53 -68 142 -61 -108 155 -18 -131 123 17 -117 120
6696 120 5 -143 123 60 -149 83 61 -143 71 75 -137 59 114 -139 34 127 -114 20 141 -114 2 162
6718 162 -97 -41 152 -79 -45 147 -69 -65 161 -41 -107 142 -22 -118 134 -5 -133 117 16 -140 96 40
6740 40 -138 96 56 -143 71 93 -141 53 120 -126 35 130 -117 14 137 -107 0 150 -103 -20 159 -72
6762 -72 -39 154 -64 -71 148 -56 -86 142 -41 -113 118 -16 -114 119 3 -140 105 33 -153 81 57 -134 85
6785H5j1k08J85O0k32J59P1k26J48J14k45R6J64k32N5J70k24K4K10k11k1K16j80
6808c3n1K14j72o6K42j60j21K47q7j42K15o9j56K30n1j99K25J8k16J85K1k16J95
6831E3P0k54J37J32k15P6J18k12J00J54k35J8K07j97j3J99j95pK13j88q0K34j08
6854Gj20K04j02j05K44r3j89K25j4j85J79lj75K04K5k33J64Q5k12J22Q0k11J37
6877C4J18k46O4J78j93J7J49j91K5K02k01o4K37j26r4J95j26r3K42j14j67K31
6899G7l5j67J81l4j56K13lk33J85P2k08J34O5k05J49J06k48Q9J55j98M9J33k08
6922h7P1J80k24k2K09j50m4J78j45n3K16j37j23K17o4j38J86o4j26K21m8k04J98
6945D7L0j82J35K5j74J62Q7k33J04J33k09Q6P1j55P5J14j94L7J65j47j1J38j38
$$ plain form
6785 85 74 -134 51 111 -121 38 109 -117 31 145 -100 -4 160 -72 -17 153 -71 -47 163 -48 -69 147 -33
6808 -33 -84 130 -42 -108 134 -26 -147 100 13 -129 86 17 -139 91 40 -159 66 84 -132 53 74 -142 53
6831 53 123 -131 6 138 -77 -1 117 -95 5 159 -76 -58 149 -48 -61 138 -57 -64 149 -39 -119 115 7
6854 7 -113 91 -11 -116 128 35 -154 71 57 -128 51 48 -127 77 102 -131 33 118 -94 28 108 -103 34
6877 34 152 -94 -30 148 -45 -28 121 -70 -45 157 -44 -108 129 3 -91 104 -22 -115 127 13 -154 77
6899 77 42 -125 56 22 -134 79 76 -157 28 100 -108 26 91 -114 35 141 -107 -18 137 -61 -12 121 -87
6922 -87 -16 164 -60 -82 127 -23 -67 111 -34 -87 129 -8 -131 86 22 -116 70 6 -120 101 53 -151 47
6945 47 77 -105 30 55 -119 43 130 -103 1 134 -75 11 82 -73 2 116 -78 -41 124 -23 -34 104 -34
6968c4oK35k58q9L00j39j10K05j16j06K16p3j60J92lj61J63qj76J85M0k31J47
6991A3Q8j95J15J05k14R2J57k38L6J59j57mJ57j84K6J70j51q4K39j29j23K42j23
7014cr2K28j10j49K07o1j32J81o6q7J36K0j87J40N8j68J16O8k20J35Q2j87J74
7037H3J3k09J25Q2j61M5J42j87J5J73j45p6K38j66n6J67r2j00J99p9j71K25J7
7060H2k15J31P6j92J79l3j78J63L3j73J45P8j58M4Q8j85Q4J80k76Q1J93j92L2
7083a3J61k13L4J28q7r8J77j43o1K59j86j02K57r8j76K33p8j22J50j9j05J60j
7106E7j57J56J4j44J76K9k59Q3J55k00L6K13k21K5J73k07P3J33j95MJ52j06q0
7129i0J92j32r0K29j07q1J66q3j08J92n4j57J69J4j54J32J6j57J45L8j97J35Q9
$$ plain form
6968 -34 -40 195 -63 -152 148 9 -101 104 -12 -118 98 25 -135 57 54 -107 56 48 -128 57 97 -134 13
6991 13 101 -94 21 126 -88 4 161 -77 -41 118 -39 -43 114 -70 -44 126 -25 -109 130 1 -122 120 -3
7014 -3 -95 133 23 -126 81 20 -112 69 3 -84 52 72 -115 25 83 -85 31 99 -121 14 96 -91 83
7037 83 96 -113 12 94 -67 -22 120 -67 -52 121 -24 -100 138 -28 -84 83 -9 -109 90 11 -160 65 82
7060 82 -133 -2 74 -118 61 28 -150 13 46 -127 18 96 -62 -18 70 -115 -31 149 -127 -46 147 -45 -13
7083 -13 148 -65 -31 97 10 -88 89 -54 -115 144 -42 -144 113 15 -161 72 -6 -128 22 3 -102 58 57
7106 57 -100 56 70 -74 102 131 -128 -45 110 -90 -54 159 -62 -37 136 -71 2 135 -60 -56 96 -10 -90
7129 -90 102 -30 -120 109 2 -79 87 4 -104 88 34 -123 46 60 -94 38 54 -103 42 80 -117 18 107
7152A07j74O3J06j72P8J18k01L4J67j53pJ40j51LJ70j52n8J99j12p0J57j06p5
7175h9J89q9j45J92k1j33J38k3j24J74j0j86J38P8j69Q4O0j52J09R3k04O2J48
7198A20j56J5J24j59L1J64j73m3J89j22m5J44j14m5J87j16j05J91n0j21J49n8
7220Gr4J69l2j74J60L4j54J16K1j52J45M7k02R8J17j64N9R3j59N9J34j84J5J55
7244A14j33l0J40j26k9J77j26q2J83q0r3J65q0r2J74o0j32J65j0j34J32J6j48
7267h9J33L9j83J24O9j63Q3O5j58R2J16j91M1J35j45PJ22j42PJ56j38m4J69j07
7291bp3J57q4r1J78o1j31J58j7j26J49k4j34J44J4j52J22M7j62J15N9j74J09Q4
7315A05j81O7J17j61N0J14j62K0J51j54kJ52j40l4J54j13o1J73r2r3J72o1j13
$$ plain form
7152 107 -67 -4 102 -70 8 126 -75 -41 126 -27 -34 106 -45 -42 128 -24 -82 117 5 -65 92 -14 -89
7175 -89 100 11 -134 58 37 -96 42 19 -105 69 59 -127 11 89 -80 4 64 -88 21 114 -90 -28 120
7198 120 -36 -21 103 -56 -25 139 -34 -77 112 -10 -55 89 -25 -70 117 1 -104 87 37 -84 65 7
7220 7 -87 82 50 -124 36 70 -84 32 53 -99 46 93 -109 -11 106 -58 1 94 -65 -6 128 -56 -41 114
7244 114 -19 -49 91 -35 -64 113 -13 -95 88 8 -85 80 0 -92 82 22 -110 55 45 -89 43 59 -89
7267 -89 44 83 -100 24 93 -70 13 78 -80 12 128 -63 -22 113 -32 -25 97 -45 -38 118 -20 -64 105 -2
7291 -2 -75 82 -2 -93 85 24 -107 51 34 -92 57 33 -101 43 57 -95 27 74 -88 27 86 -88 21 105
7315 105 -76 -9 108 -53 -3 111 -51 -31 120 -34 -36 116 -24 -58 96 -17 -78 95 3 -90 82 21 -92
7338i2J60m5j32J64qj56J56K1j60J16N0j59J10N6j55R4Q2j71P4J00j68N9J20j66
7362e0L1J29j49jJ48j35k5J47j13n3J70j07q9J88p3j21J54l7j21J59k6j40J49
7385C5J5j51J34K7j57J25N7j66R2R6j75P1R8j57O2J15j75L2J44j46j0J41j36j4
7409d3J52j23o3J89j11p8J56q4o9J54o9j26J83l7j39J40Mj24J34J3j68J26P1j79
7433i1J02O8j58Q5J01j84O4J31j51J9J13j38J3J55j57k9J68j16o2J58j02o7J76
7456I8r8r8J66m4j21J50l9j17J68j7j72J66L2j56J03M3j58J27O4j89R1J17j72
7479e6N7R6j49N3J32j73nJ67j35l3J40j09l7J65j29q2J81o3j07J45n7j05J82n7
7503B1j43J60K5j55J30Nj38J47L2j89J19Q6j75Q4P8j65R0J12j91M0J45j44oJ38
$$ plain form
7338 -92 68 23 -109 55 47 -109 47 68 -92 24 74 -85 25 81 -74 20 102 -69 5 105 -63 -4 116 -50
7362 -50 -19 110 -39 -40 108 -27 -52 95 -18 -71 99 -8 -97 91 18 -103 51 14 -107 52 26 -114 35
7385 35 50 -101 33 60 -97 28 85 -81 11 107 -68 3 101 -56 6 121 -54 -22 122 -24 -34 107 -29 -43
7409 -43 109 -14 -77 112 1 -77 79 -5 -74 80 11 -115 68 31 -108 32 36 -88 46 59 -109 17 88 -91
7433 -91 11 79 -79 6 107 -77 -13 118 -33 -14 99 -39 -26 129 -28 -57 111 -5 -67 91 -11 -78 98
7456 98 0 -98 68 24 -97 53 14 -103 65 48 -124 42 74 -82 21 64 -94 33 97 -92 -1 116 -56
7479 -56 1 97 -52 1 133 -40 -45 122 -13 -46 94 -15 -52 113 -16 -98 83 20 -87 58 1 -104 78 21
7503 21 -122 38 63 -92 38 43 -95 52 84 -105 14 100 -75 9 87 -78 12 124 -67 -27 118 -26 -32 106
7527A06j41MJ49j39n1J79r9p3J49r3p9J79p5j32J81k6j25J28j5j28J54Lj69J43
7551C0N4j61J06N1j69J13R2j91O8J26j67L3J14j48L4J34j54j3J55j19m2J51j13
7574a6m5J61r7r6J69n2j05J54o0j15J63j3j57J48K9j51J19L0j47J13O2j66P3R8
7598I9j65O4J09j63M0J33j69J3J62j42j6J41j21n1J68j12o4J65q5q9J58p4r6J63
7622F8n6j22J63j9j31J35Pj45J22M7j69J23O1j68R4Q6j66O5J12j70M2J32j55N
7646c9J51j43k5J68j29m4J64j21n4J59q4j03J79p7q7J60n8j04J29j5j25J38J5
7669E5j41J27K4j56J07O3j53Q9Q1j63P6Q7j56N0J29j61J1J38j32qJ50j38m1J60
7693I8j01o3J50p6r0J66o7j08J60l6j31J37lj29J39nj42J37M0j57R8N8j50R2P6
$$ plain form
7527 106 -35 -31 118 -21 -72 107 8 -65 84 -9 -88 91 16 -116 65 39 -86 42 27 -101 53 56 -113 30
7551 30 84 -77 29 80 -89 24 116 -75 -7 119 -48 -15 99 -49 -15 119 -35 -48 107 -12 -54 97 -16
7574 -16 -61 100 3 -93 76 24 -81 73 13 -102 61 48 -109 39 68 -83 36 66 -81 32 94 -72 1 99
7598 99 -66 -2 107 -56 -16 117 -52 -39 123 -19 -35 106 -15 -66 102 -10 -74 91 6 -83 75 1 -95 68
7622 68 12 -110 53 34 -97 38 45 -100 22 69 -100 23 84 -84 10 96 -70 -5 107 -63 -21 111 -44 -39
7646 -39 112 -31 -56 112 -17 -61 103 -18 -72 87 3 -100 79 2 -85 75 17 -87 42 27 -98 40 55
7669 55 -86 41 65 -91 16 79 -74 15 96 -67 9 96 -60 -10 119 -42 -31 107 -25 -33 117 -21 -62 98
7693 98 -3 -66 84 8 -82 84 17 -91 69 33 -98 39 36 -93 46 41 -101 36 76 -81 17 75 -75 17 93
7718I3j62O6J05j53L7J16j38J8J36j47j4J64j33m5J52r9n7J61j08q7J79n9j08
7741h3J40l5j12J46k2j45J49L0j54J08L0j30J07N5j68R2R8j59M8R9j37M0J23j65
7765d5RJ52j32l0J37j15k2J44j22m7J64p3r5J38o1p8J51m4j28J46qj34J21Kj20
7790i0J26L0j67J12Q0j56P1Q4j55P5R9j74M3J41j47%J19j15KJ33j45k8J66j07
7814cn1J24q0o2J66q7j05J61l1j07J16oj27J55j9j50J38M8j58R0N5j42R5O8j64
7839g6O7J21j61L4J15j44K0J38j48j3J55j11m9J47j12l2J50j05r9J84o4j03J45
7862E9l7j05J57m3j31J52Oj43J10K8j30J14M4j62R2Q1j57O8R3j43M0J07j47K1
7886b6J40j40kJ28j27j4J55j16p2J64p4r4J48o2r2J66o9j25J72k1j37J47j0j33
$$ plain form
7718 93 -69 -3 102 -51 -14 102 -36 -18 118 -29 -43 121 -12 -57 95 -4 -61 100 -8 -95 84 25 -83
7741 -83 57 22 -90 56 34 -111 38 68 -86 22 52 -78 29 84 -84 8 106 -53 -5 94 -43 -3 120 -45
7765 -45 -36 116 -16 -46 91 -24 -46 98 -24 -71 93 20 -75 63 2 -76 75 31 -97 49 41 -93 28 30 -90
7790 -90 36 66 -101 11 91 -65 6 90 -65 10 109 -65 -22 119 -28 -28 91 -24 -22 111 -34 -62 104 -3
7814 -3 -54 70 -10 -72 94 7 -98 63 32 -75 41 35 -92 63 44 -106 32 80 -78 12 67 -75 20 88 -76
7839 -76 -9 112 -49 -15 100 -44 -24 114 -34 -47 108 -3 -52 95 -17 -49 101 -4 -103 81 17 -86 59
7862 59 22 -83 74 31 -100 52 58 -85 25 53 -77 37 81 -81 11 92 -65 3 96 -47 -7 100 -47 -26
7886 -26 114 -26 -28 100 -27 -41 114 -2 -74 90 16 -78 70 8 -84 82 13 -112 60 39 -98 49 39 -94
7910i4J38J8j55J22M6j43Q8O5j51P7R9j73O5J01j41K1J13j25rJ42j27l2J51j08
7934a2m4J51j00q0J60o9r6J60m7j21J64l4j29J42Oj42J21K8j40J09M7j44R1O1
7958H2j30O5Q0j50N0J13j42J8J21j34rJ33j17l3J60j18n1J50r7n1J36p6r2J53
7982F1m1j14J51l1j21J36oj22J25L8j56R3N2j36Q5O8j50P1J01j60M9J08j49L7
8006a1J24j54RJ42j23l2J33j05l1J39j04o5J52o6q9J32l3j06J47m0j13J41lj30
8030h6J14K8j42J22K7j53R8P4j51O9Q3j32M8J04j58M3J25j41qJ30j12j1J27j21
8054b3m1J58q5p8J47q4o7J41o9j00J56k3j27J42j8j05J14Oj47J25N1j60R8N1j33
8079g1R1O2j57O5J17j45QJ13j18J9J25j41j8J59j08n6J36q7n6J44q6q5J65n6j05
$$ plain form
7910 -94 44 62 -93 29 75 -68 20 85 -66 11 110 -63 2 103 -38 -17 96 -29 -38 104 -23 -55 96 -12
7934 -12 -56 95 -5 -85 75 6 -90 70 23 -98 66 32 -97 45 51 -91 30 58 -82 27 74 -70 21 82
7958 82 -48 17 97 -53 -3 110 -32 -14 107 -27 -36 97 -20 -53 107 -11 -62 88 -9 -60 76 0 -92 61
7982 61 20 -94 57 26 -95 41 35 -87 38 76 -80 13 65 -71 14 82 -68 3 104 -56 -7 101 -48 -11
8006 -11 113 -41 -32 110 -13 -45 88 -17 -48 91 -13 -78 74 8 -81 51 18 -88 59 19 -94 47 44 -86
8030 -86 28 56 -86 36 63 -90 8 82 -69 0 83 -49 -1 103 -55 -12 113 -28 -36 94 -18 -29 98 -23
8054 -23 -64 94 9 -69 78 -6 -73 68 -1 -101 55 32 -95 47 29 -76 38 44 -103 22 73 -87 11 62 -71
8079 -71 20 82 -75 -10 107 -38 -30 83 -35 -16 109 -32 -50 109 1 -55 81 -6 -62 82 -4 -89 76 20 -85
8104h5J26j8j01J35k0j35J27L0j50J03N2j37R4N9j62Q6Q9j34M1R4j35M9R6j49
8128d5J7J36j18k7J29j08k3J32j13n3J64q1r1J50n6r3J45m7j12J44Lj40J20J6
8152D9j35J19L0j57J08Q3j75P8Q0j30O3Q5j46M1J14j36NJ23j34pJ34j14l3J59
8176A04r2p3J40p9p9J54o5r5J35j6j28J33jj33J41
$$ plain form
8104 -85 41 23 -78 57 37 -98 29 59 -91 12 64 -73 21 80 -82 4 93 -41 0 94 -41 8 104 -45
8128 -45 -28 108 -10 -37 92 -16 -39 93 -20 -73 91 10 -81 69 13 -80 65 18 -94 50 53 -87 33 49
8152 49 -86 33 63 -94 14 97 -78 0 80 -50 13 98 -48 -7 107 -29 -24 99 -35 -42 92 -22 -55 104
8176 104 12 -61 79 0 -79 75 10 -85 50 34 -94 39 38 -95 46
8191D6
$$ Imaginary data points
##PAGE= N=2
##DATA TABLE= (X++(I..I)), XYDATA
0@%%%%%%%%%%%%%%%jRj6J6j6J6k2L0l2L8m6M9n7O7p6Q9j02J13j26J43j63J84k04
38a07K26k52K81l12L47l85M25m68N15n70O28o89P59q38R24j019J126j248J389
57G32j549J737j961K229k561K983l539M305n426P225j0526J8343o5867l1256K02839
72A17708j38025o3007J70244r5232p1192J65484q9653q1770J62400o7623r6683
83h7349J64744o1843j19798J78846k3255j66748J53731L5055j62967J03896N1407
94F5719j42258R1072N4028j45283P9560P1513j45901O8095Q6355j56900N1404
105b2596J24430j58160J604J48309j18083l3985J31664r1597l5694J26975q6964
116a4097m8333J32617p5484o3581J38596o4461q8539J48477l3328j22308J28212
$$ plain form
0 0 0 0 0 0 0 0 0 0 0 0 0 0 0 0 0 -1 8 -8 8 -8 8 -14 16 -16 22 -24 25 -32 35 -41 48 -54 59 -67 76 -87 97 -107
38 -107 119 -133 148 -164 183 -202 223 -245 270 -300 328 -361 398 -440 484 -535 591 -657 732
57 732 -817 920 -1041 1188 -1373 1610 -1929 2376 -3050 4175 -6351 11992 -53875 -85131 117708
72 117708 -20317 -83324 86920 -8312 -79504 85980 -3673 -85443 76957 9334 -87349
83 -87349 77395 15552 -104246 74600 51345 -115403 38328 73383 -89584 14312 65719
94 65719 -76539 14533 68561 -76722 2838 74351 -71550 -3455 82900 -74000 -22596
105 -22596 101834 -56326 -54722 93587 -24496 -58481 73183 -18414 -54108 72867 -14097
116 -14097 -62430 70187 -5297 -68878 69718 5257 -83282 65195 31867 -90441 37771
127C7771J0491j21569R4710K2927j09437Q5170K7740j13608P8872M1852j19210
138f4291O9760N9282j29448N3148R0469j27576J4357J06546r9628j0263R7592
149E9948q2182j3762R6604p9929k4147J04239p3567l8768J13868o4619o3321J22435
161E6799l7686q9529J07363n668r1055Q4568M433q4726P9287R514r0694P6420
173A9026K1685j00114P0422M0985j10239N3669O7032j07402K3313P9573q6904
184b8954M532P4465p4807N57P4977p3772o776Q4128p1926k2358R5602o2112m5077
197e1521J01184l9135o4707Q9485j6270o7325P4767p501o4549P1361m411p1067
209d9689P3508O369q4542O9560K7097r4736N2646M8817r0621L0546N8061p8281
$$ plain form
127 37771 48262 -73307 21403 44330 -65107 20063 47803 -65805 13067 54919 -64291
138 -64291 5469 64751 -64697 -11549 78920 -48656 -34299 72247 -27381 -37644 59948
149 59948 -22234 -35996 60608 -19321 -43468 60771 -12796 -51564 62304 -2315 -65636 56799
161 56799 19113 -70416 36947 31279 -59776 24792 29225 -55501 23786 33300 -57394 19026
173 19026 40711 -59403 11019 52004 -58235 -4566 62466 -44936 -21623 57950 -28954
184 -28954 -24422 50043 -24764 -24207 50770 -23002 -29778 54350 -17576 -39934 55668 -6444 -51521
197 -51521 49663 10528 -54179 35306 19036 -48289 26478 18977 -45572 25789 21378 -49689
209 -49689 23819 30188 -54354 15206 42303 -52433 213 49030 -41591 -11045 47016 -31265
221c1265J6487N7323p0277J2475N9148p1136P181O9890p2775r113Q3652o1597
233a0007l1131Q5403m1867m4439P7074k6211m8257O8430j8295m8874O5660j5356
245A2130n4472P0352o523p0444O7516J4935p9342N0969L2145p4800L5569L8769
257C6804o9153K5835M2590o4715K0489M5083o6650J7259N7164p0927R63P2288
269D7030o0039k0226P2427m3011k8954O7212l3380l4606O3647k5239l7792O1205
281B8274k2117m3006O6495j4580n9226O4629O691o6994M8144K0098o1946L7606
293D068K5096o0146L0318L0873n7689K4405L3468n9583K2927M5161o5782P590
305a9294O0479n5604j1427N9952m1848j7559N7085l6163k3516N7078k8995k7919
$$ plain form
221 -31265 -14778 42545 -27732 -15257 43891 -27245 -20064 49826 -22949 -32062 51590 -10007
233 -10007 -41138 44265 2398 -42041 35033 8822 -39435 28995 10700 -38174 27486 12130
245 12130 -42342 28010 21487 -48957 18559 33494 -45848 5121 37266 -37534 -1965 36804
257 36804 -32349 -6514 36076 -28639 -8150 36933 -29717 -12458 44706 -26221 -25258 47030
269 47030 -13009 -33235 39192 -3819 -32773 34439 1059 -33547 30100 4861 -32931 28274
281 28274 6157 -36849 29646 15066 -44160 20469 27160 -39834 8310 28408 -33538 4068
293 4068 29164 -30982 -664 30209 -27480 -3075 30393 -29190 -6263 38898 -26884 -19294
305 -19294 41185 -14419 -25846 34106 -7742 -25301 31784 -4379 -27895 29183 188 -27731
317b7731N5645k7053l3484O2732j9820n0129O1137K78n6970M6091J1078n2331
329c0557L8947J5214n3192L2978K1799n1448K7855K4188n4515K6872L6258o0813
341b6414J1689N0680n0191n083M8285l9335q402M7496l6392j4629M9265l0332
353c363j9210M8980k9574k4913N7501k2940m2042N5939l714m7072M2453L658m3144
366b7441L9009O628m6742L5429J4375m6849L0577J7183n0696K9923K9430n6866
378b6040J5286M2642m6640N91L9423l7743n28L9652l7628o741M3564l2141j2278
391a8581M3840l0886j7895N1242k5122l3017N0451q265l7595L8854k704l4250
403b3928L7569q92l9042L6386O622m1577L2456J0970m5637L1333K1776n1375J9328
$$ plain form
317 -27731 27914 861 -32623 30109 10289 -39840 21297 21575 -35395 10696 21774 -30557
329 -30557 8390 23604 -29588 3390 25189 -26259 1596 25784 -28731 -1859 34399 -26414
341 -26414 -14725 35955 -14236 -19319 28966 -10369 -18771 28725 -7667 -22296 26969 -3363
353 -3363 -22573 26407 -3167 -28080 29421 6481 -35561 20378 16664 -30408 12045 15703 -27441
366 -27441 11568 18196 -28546 6883 21258 -25591 4986 22169 -28527 1396 30826 -26040
378 -26040 -10754 31888 -14752 -14161 25262 -12481 -13009 26643 -10985 -17726 25838 -6303 -18581
391 -18581 25259 -5627 -23522 27720 2598 -30419 20032 11767 -25828 13026 10322 -23928
403 -23928 13641 12749 -26293 10093 16715 -24862 7594 18564 -27073 4260 26036 -25339 -6011
416f011L3420m3877P375L1986l7479N985L3017l8324Q84L8095l4851n341M0093
429B4972l3078j1796M6274k7298k4387M5694j3907k9002L7325q476k7447L6062
441A4936o525l1707L5668m49l5215L3558M790m0247L1465J4902m4670K1624K4391
454B2521l9546J2389K4538l5523J0558K6394l6432O619L1285l5511J066L5738
466B4096l4294o511M1562k8527j7375M1123j8007k1579L5717j3249k1852L4738
478A5842j1087k5519L5205o316l0181L4453j14l5849L1355R585l8734K2740J6934
491A8314l5127J5627J8081l2328J3587J9821l3447J0998K4661l4482N788L0826
503B2319l3294k583L5524k7522j0957L5230k0227j4736L2531j6410j6178L2228
$$ plain form
416 -6011 27409 -16468 -9093 22893 -14586 -8601 24416 -13908 -13024 25071 -9780 -15121 24972
429 24972 -8106 -19902 26372 -926 -25313 20381 6474 -22528 14797 6321 -21126 14936
441 14936 8411 -23296 12372 11923 -23292 10266 15056 -25191 6274 21176 -23494 -1870 22521
454 22521 -17025 -4636 19902 -15621 -5063 21331 -15101 -8482 22803 -12708 -11642 24096
466 24096 -10198 -16709 24853 -3674 -21049 20074 2067 -19512 16205 2956 -18896 15842
478 15842 4755 -20764 14441 8125 -22056 12397 12283 -23566 7789 17374 -21360 1380 18314
491 18314 -16813 -1186 16895 -15433 -1846 17975 -15472 -4474 20187 -14295 -8507 22319
503 22319 -10975 -13558 21966 -5556 -16513 18717 -1510 -16246 16285 -125 -16303 15925
515A5925j4634j9501L4142j1221k5812L4763l648l1745L0460M903l3000K3722
527D354J0237l1498J8806J2823l0022J6035J4584l0892J4436J9376l3375R100
539f036K6574l1419L45K9517k5634n425K9217k1395q967K8945j7873j1504K8604
552A4949j6261j4121L1434j4169k1195L3145o123k7097K8372R34k7312K4242M326
565A1124k8132K1397Q433k8164J7931J0483k8653J7330J4758l2496J2380K2843
577A9234l0491L444K4818k4978l67K4730k2979m040K6305j9343p599K5475j7601
590c392r120K8472j6746j6416L1091q622k2327K6032k474k1727K3403n24k3791
603a6141K2133M136k4767J8738O028k5283J9211R868l0319J5164J8499k8998O529
$$ plain form
515 15925 1291 -18210 15932 4711 -21101 13662 10014 -21731 8729 13632 -19368 4354
527 4354 14591 -16907 1899 14722 -15300 735 15319 -15573 -1137 18239 -15136 -6036
539 -6036 20538 -10881 -10536 18981 -6653 -12078 17139 -4256 -13223 15722 -2151 -13655 14949
552 14949 -1312 -15433 16001 1832 -19363 13782 7659 -19438 8934 9868 -17444 6798 11124
565 11124 -17008 4389 12822 -15342 2589 13072 -15581 1749 16507 -15989 -3609 19234
577 19234 -11257 -7813 17005 -7973 -8340 16390 -6589 -10629 15676 -3667 -11266 14209 -3392
590 -3392 -12512 15960 -786 -17202 13889 5267 -17060 8972 6498 -15229 8174 7650 -16141
603 -16141 5992 10128 -14639 4099 10127 -15156 4055 13923 -16396 -1232 17267 -11731 -5202
616e202K0297k4195L922K0556k3828N59K3375k0868l395K2957j9508m815K6498
629A6353j9115j2381K9381j1066j8082K4424n648j7240K2609m286j9782K1981
641G148K97k1112J9171K011k2201K0098O152k7486J6022J4494k5899Q268J5495
654A2458k2126P011J6276k3111L950J9812k0921J96K0008k0368j286K4308k0243
667d036r092K7157j2503j3988K2515q514j3139K2153p677j6695K2238k744j8440
680a2765J9503j030j9763K0549L235k4898J6374J1047k3061R377J1459j9878R092
693g59J2436k1801O209J6614j9994K354J7060j9388R40K0990j9583n909K3916
706A3085j3036j0311K0171j0033r527K0581r879j3177K1510n401j5779J9538l283
$$ plain form
616 -5202 15095 -9100 -5178 15378 -8450 -7891 15484 -5384 -8779 14178 -5330 -10145 16353
629 16353 -2762 -15143 14238 3172 -14910 9514 3866 -13374 9235 4949 -14833 7148
641 7148 7445 -13667 5504 7515 -14686 5412 11564 -15922 100 14594 -11305 -3037 12458
654 12458 -9668 -2657 13619 -9492 -5542 14270 -6651 -6455 13553 -6815 -8101 16207 -4036
667 -4036 -13128 14029 1526 -12462 10053 1539 -11600 10553 2876 -13819 8419 5675 -12765
680 -12765 6738 5708 -14055 6494 9729 -15169 1205 12252 -10809 -1432 10027 -9851 -759
693 -759 11677 -10124 -3915 12699 -7295 -4941 12119 -7269 -6329 14661 -4922 -10831 13085
706 13085 49 -10262 9909 -124 -9651 10930 1051 -12126 9384 3983 -11796 7742 4459
719D459j7410K0436K90k1951J7205P161k1084J1433Q178j8764J0768R248k0479
732a0510Q582J3071j9546N083J4386j8959K966J7833j8761k520K0224j3762o554
745h467J8044j1087o566J8300j0672r531J9541p792j2185J9005n538j4625J9477
758G904j958j8460J7120L372j8433J3001M864j7308J2082O212j8680J0642R329
771I687j9131Q003J1987j9286N109J5364j8316K05J7131j4580k927J6177j2369
784b946l927J6466j1660o167J7731r779r030J8292p276j2199J8186l405j4884
797a0598J5930L10j5200J3462J994j5079J2596L353j6369J1841N899j7875J0107
810C71R372j8535O677J2399j7263L006J3744j5169N76J4118j3712j083J4758j2895
$$ plain form
719 4459 -12951 7485 7775 -14176 3029 10190 -10894 539 8717 -10047 721 9969 -10510
732 -10510 -1928 11143 -8403 -3320 11066 -7893 -4927 12906 -5855 -8375 11849 -1913 -8467
745 -8467 9577 -1510 -8076 10224 -448 -9979 9562 1770 -10415 8590 3052 -11573 7904
758 7904 5946 -12514 4606 7978 -10455 2546 7410 -9898 2184 8396 -10284 358 9687
771 9687 -9444 -1441 10546 -8740 -3631 11733 -6583 -6378 10753 -3827 -6754 9423 -2946
784 -2946 -6873 9593 -2067 -8234 9497 -282 -9312 8980 1704 -10495 7691 4286 -10598
797 -10598 5332 5642 -9558 3904 5898 -9181 3415 6768 -9601 2240 8139 -9736 371
810 371 9743 -8792 -2115 10284 -6979 -3973 9771 -5398 -4822 9296 -4416 -5499 9259 -3636
824c636k893J6193j2020o115J7795r031r737J7058n298j1447J5245k860j2259
837i005J4119o97j3093J2806R14j3872J2472K929j6071J1109O926j6813P447R427
851H598j5306N033J0269j4875L166J2009j3834R06J2561j3000k65J4110j3185
864c813l391J6632j0315p395J5694o917q297J4713n621r951J4636k959j1392J3023
878D647j214j1666J3053J08j4512J2286M687j5402Q240O827j3619O551P398j4119
892f735N088R896j3306K270J0213j2234J915J1703j3430j119J4871j0813n253
905f934J3942p607n622J3326p383p472J4219m730r360J2754l269r557J3398k307
919C398j2892J3252K431j4234R173M512j2316Q066M828j3383O959P538j3031M208
$$ plain form
824 -3636 -6529 9664 -2356 -8471 9324 293 -9444 7614 2316 -9131 6114 3254 -9005
837 -9005 5114 4417 -8676 4130 5044 -8828 3644 6573 -9498 1611 8537 -8276 -829 8598
851 8598 -6708 -1675 8594 -6281 -3115 8894 -4940 -4034 8527 -4473 -4738 9372 -3813
864 -3813 -7204 9428 -887 -8282 7412 495 -7802 6911 1290 -8661 5975 3016 -8376 4647
878 4647 3433 -8233 4820 4928 -9584 2702 7389 -8013 227 7054 -6565 -14 7384 -6735
892 -6735 -1647 8249 -5057 -2787 7426 -4808 -2893 8810 -4620 -5739 9132 -1681 -6934
905 -6934 7008 -599 -6221 7105 -278 -7750 6469 1739 -7621 5133 1864 -7693 5705 3398
919 3398 -9494 3758 6189 -8045 1128 5640 -6676 1390 6218 -7165 -206 7332 -5699 -1491
933a491Q201j2068L865R718j3473P99J3053j0848l183J1982q087l233J1657q225
947a333n037J3004o054p125J1940m794p474J3036l882j0971J2937M36j2174R582
961B091K058j0762R200K378j2442Q473N298j2472O077O039j2136N810Q042j3543
975e889K755J1164j1110q49J0098q974o37J0507r461k899J2042p231n017J1111
989E610o038n440J2272n276q861J2339j200r927R375r0q985R611L96j0984R146
1004A948L329j1380O905M066j1222P040O008j2958M383R136j1188J211Q572r535
1018c685J299R213j0295q26J1154q367l133J0535p244l814J1662o458o818J1987
1032E210k949q318R525j546p682R576r86r419R260J463j0124P592K612j0295P308
$$ plain form
933 -1491 6710 -5358 -1493 8225 -5248 -4449 8604 -2244 -5427 6555 -1532 -4765 6892 -1333
947 -1333 -6370 6634 580 -6545 5395 601 -6873 6163 2281 -8690 4247 4683 -7491 2091
961 2091 4149 -6613 2587 4965 -7477 996 6294 -6178 -101 5938 -6198 -388 7654 -5889
975 -5889 -3134 8030 -3080 -3929 6169 -2805 -3442 7065 -2396 -5295 6747 -484 -5501 5610
989 5610 -428 -5868 6404 1128 -7733 4606 3406 -6521 2854 2764 -6221 3390 3786 -7198 1948
1004 1948 5277 -6103 802 4868 -6354 686 6694 -6264 -1881 7255 -3933 -2722 5850 -3685
1018 -3685 -2386 6827 -3468 -4294 6860 -1507 -4640 5895 -1349 -5163 6499 41 -6777 5210
1032 5210 2261 -6057 3468 1922 -5760 3816 2830 -6589 2671 4134 -5990 1602 4214 -6081 1227
1047A227M383j1706N248P143j0581K608P125r460K286P768r933R31R477r132j138
1062c754R862q260k415J1008p222m986J1233m627o411R880l203o548R690k503
1076A744p867R674o07q989Q726J014r869P799L128j0491N953N062r888M000N605
1091D994r257L253O411r405K159P703r250N24Q976q600j433R863p280l329R956
1106E285n588m431R565m602n323R543l644o321R779k449p885R549m20r185Q301
1121B174J703r408O775K940r349N709M167r377M354N175r192L426O299r378J978
1136b004P986q799m38Q652p156j710Q617o385k810R074n330m219Q925m200m884
1151d681R105l638o473R637j506q168Q223L27q036P300J087q621O895K769r191
$$ plain form
1047 1227 5610 -6096 -848 6295 -4286 -1678 5447 -4013 -1727 6041 -3892 -2961 6516 -2616 -3754
1062 -3754 6108 -2152 -4567 6441 -781 -5767 5466 839 -5572 4308 1105 -5443 4247 1744
1076 1744 -6123 3551 2944 -6045 2681 3695 -6174 1625 4753 -5738 215 5277 -4611 -611 4994
1091 4994 -4263 -1010 5401 -4004 -1845 5858 -3392 -2868 6108 -2492 -3925 5938 -1342 -4671 5285
1106 5285 -303 -4734 4831 229 -5094 4449 805 -5516 4263 1814 -6071 3478 3058 -6127 2174
1121 2174 3877 -5531 1244 4184 -5165 544 4711 -4666 -312 4863 -4329 -903 5396 -3982 -2004
1136 -2004 5982 -2817 -3255 5397 -1759 -3469 5148 -1237 -4047 5027 -303 -4522 4403 203 -4681
1151 -4681 4424 786 -5687 3950 2444 -5724 2499 2826 -5210 2090 3177 -5444 1451 4220 -4971
1166d971N271L843q697M754M636r600L614O960r200R53P546p529J0P508p347j133
1182c382Q693o106l048Q182m863l304Q504m781n063R548k525p117P911n87o636
1197d574P243m03p638P343J593q386N621K559p890N531L069r332M862N853r169
1212c718J906O418p552J440O335p952N45P965p026j697P742n677j797Q116o060
1227a012l725R525l598n984P833j650n471P291j748o535P720L46p621N999J406
1242B776p163N944J923q688N367M691q696K587N247p118K348N108p933J631P029
1257E053p338m19P103o267p81P639o587k604R058m464m602P684k961m274P554
1272C794k978n619Q049r62o802O605J69o576O523Q63q126N759L482q002L427L931
$$ plain form
1166 -4971 300 4143 -4554 200 4836 -4764 -1150 5810 -3390 -2437 5109 -2420 -2410 5098 -2249 -3382
1182 -3382 5311 -795 -3843 4339 -524 -3828 4676 -105 -5168 4380 1855 -5262 2649 2062 -4574
1197 -4574 2669 2266 -5372 1971 3564 -4822 799 3358 -4532 999 4068 -5264 -402 5451 -3718
1212 -3718 -1812 4606 -2946 -1506 4829 -3123 -2578 5387 -1639 -3336 4406 -1271 -3068 5048 -1012
1227 -1012 -4737 4788 1190 -4794 3039 1389 -4082 3209 1461 -5074 2646 2992 -4629 1370 2776
1242 2776 -4387 1557 3480 -5208 159 4850 -3846 -1259 3988 -3130 -782 4326 -3607 -1976 5053
1257 5053 -2285 -2704 4399 -1868 -2649 4990 -1597 -4201 4857 393 -4209 3475 514 -3760 3794
1272 3794 816 -4803 3246 2284 -4518 2087 2256 -4320 2203 3066 -5060 699 4181 -3821 -394 3537
1288C537o922L213M154p786K365O061p147M41O096o363J91O879o710j626Q152
1303D535m870l334P165l751l117P426l872m686P976j943n719O848j080n760P034
1318B852m04p402O481K068p518M417K614o766M275L070p631L341M849p208J610
1333a352N155o550J273N945o915m92P265n331k170O638m218k217O767m244l447
1348c893P422k801m633O802j925m986O983j104o402O539Q22o787N096J588o398
1363c677M850K053p156M203L528p208K928M344o953K087N255o920N96O254n834
1378a650q55O145m941j333O348m614k334O829l730l553O844k618m425O726j507
1393A332n381O173j88n764N456O35n965N042J344o418M579K403o838L734L549
$$ plain form
1288 3537 -3385 -172 3982 -3804 -1439 4622 -2525 -2084 4012 -2351 -2160 4719 -1991 -3617 4535
1303 4535 -335 -3669 3496 -255 -3372 4054 182 -4504 3472 1529 -4190 2658 1578 -4182 2852
1318 2852 2448 -4954 1527 3595 -3923 494 3108 -3658 617 3687 -3944 -603 4246 -2962 -1352
1333 -1352 3803 -2747 -1474 4471 -2444 -2936 4329 -1002 -3172 3466 -752 -2969 3798 -446 -3893
1348 -3893 3529 728 -3905 2897 972 -4014 2969 1865 -4537 2002 2824 -3963 1133 2721 -3677
1363 -3677 1173 3226 -3930 273 3801 -3407 -479 3865 -3088 -1001 4254 -2666 -2070 4184 -1650
1378 -1650 -2505 3640 -1301 -2634 3714 -900 -3234 3595 -135 -3688 3156 538 -3887 2839 1332
1393 1332 -4049 2124 1936 -3828 1628 2263 -3702 1340 2684 -3734 845 3248 -3590 144 3693
1408C693o940K632M540o581J479N074o150N18N621n657m47O007n079j341O340
1423C709m568k412O837l509l756O564k131m339O065j347m885N862l24n553N221
1438A434P49n693M698J398o298M277K762o595K937L748o073K094M029o083J507
1453a109N004n882J63N412n113l66N608n125j283O538m257k912O387k866l277
1468c078N969k534m005O264j319n008N447j83m925N081J40n748N030J809o384
1483c444L403K904n611K730L021n919K269M263n781P37M621m893M94M739n377
1498a844l69O103m532k201N820l141k294N496l262k988O203k103m294N405j027
1513I72m045N319j007n168N595Q68o047L868J981n123L378J850n721L194L409
$$ plain form
1408 3693 -3247 -615 3925 -2656 -1177 3897 -2253 -1735 3886 -1771 -2218 3789 -1290 -2631 3709
1423 3709 -859 -3271 3566 57 -3699 2865 734 -3605 2460 1113 -3772 2090 1766 -3787 1434
1438 1434 2183 -3510 1188 2586 -3712 565 3327 -3268 -331 3417 -2656 -562 3467 -2616 -1109
1453 -1109 3895 -1987 -1824 3588 -1525 -1891 3717 -1408 -2691 3847 -410 -3322 3065 199 -3078
1468 -3078 2891 357 -3648 2616 1297 -3711 1736 1553 -3372 1709 1849 -3899 1131 2940 -3444
1483 -3444 -41 2863 -2748 -18 3003 -2916 -647 3616 -2165 -1428 3193 -1700 -1206 3533 -1844
1498 -1844 -2213 3890 -642 -2843 2977 -164 -2458 3038 -224 -3212 2991 888 -3406 1999 972
1513 972 -3073 2246 1239 -3929 1666 2534 -3513 355 2336 -2787 591 2441 -3280 -86 3323
1528C323n824J488L880m896J272M005n478M16N577m645j587N189l185j454M876
1543B957l596k148N892k563l597N181j438l373N090j565m418N521J45n369M046
1558G65J116m606L769R39n346L837K478n737K299L074m939K038L264n525J303
1573a271M745m913m70M598l714n08M489m044j311N500l065k695M940k021k683
1588b423M921j992l678N263m99m534M089L07m061L968L47m856L902J748n168K681
1604A5K208m676K571K553n370J900L936m901M30L906m099L59M071m397m88M980
1620B998l528j675M621k790j783M844k675k928N183j205l746M164m67l484M103
1635A632l00m258L998R71m596L009J459m352K884J922m968K221L145m642R99L244
$$ plain form
1528 3323 -2501 -1013 2867 -2029 -757 3248 -2230 -1814 3763 -882 -2469 2720 -465 -1919 2957
1543 2957 -639 -2787 3105 542 -3055 2126 688 -2685 2405 840 -3578 1943 2088 -3281 765
1558 765 1881 -2725 1044 1983 -3363 474 2952 -2785 -486 2588 -2351 -313 2951 -2574 -1271
1573 -1271 3474 -1439 -1909 2689 -1025 -1533 2956 -1088 -2399 3101 36 -2659 2281 260 -2423
1588 -2423 2498 506 -3172 2091 1592 -2942 1147 1454 -2607 1361 1708 -3148 754 2502 -2666 15
1604 15 2223 -2453 118 2671 -2699 -799 3137 -1764 -1334 2572 -1527 -1168 2903 -1494 -1982 2998
1620 2998 -530 -2205 2416 -374 -2157 2687 12 -2916 2267 1062 -2684 1480 1013 -2471 1632
1635 1632 1332 -2926 1072 2043 -2553 456 1915 -2437 447 2369 -2599 -378 2767 -1875 -876 2368
1651B368m026Q56L442m307K08M272l815p80M279l273j135M569l041k113M874j960
1667D18k873M265j268k887M185r92l538M179k2m066L533P52m168L121J401m468
1683b428K475K254m298J623K605m010J210K955m048O61L535l824j09L888l411
1698i22p77M131k943j458M224k383j983M168j879k423M133j382k873M076q45l394
1714b530L906l7l858L405P43l923K853J217m018K460J859m125J764K459l876J184
1730e17K760l844O70L415l638l00L704k917q19L628k689j233L979k250k040L888
1746A797j472k293L694j304k719L938n93l470L432K95l412K978M67l652K963J239
1762A888m043K132J893l645J749J976l897J481K911l909K89L326l067j57L152
$$ plain form
1651 2368 -1658 -802 2640 -1667 -1459 2813 -1002 -1782 2497 -776 -1911 2658 -383 -2496 2378 418
1667 418 -2455 1810 542 -2345 1840 848 -2690 1489 1467 -2599 934 1686 -2482 639 2040 -2428
1683 -2428 47 2301 -1997 -374 2231 -1779 -569 2386 -1662 -1001 2534 -1290 -1399 2489 -922
1698 -922 -1699 2432 -511 -1969 2255 -128 -2111 2057 178 -2245 1888 506 -2367 1709 864 -2530
1714 -2530 1376 1339 -2519 886 1629 -2294 559 1776 -2242 218 2077 -2048 -284 2175 -1701 -517
1730 -517 2243 -1601 -931 2484 -1154 -1454 2250 -667 -1486 2142 -547 -1780 2199 -51 -2091 1797
1746 1797 325 -1968 1726 422 -2297 1641 1048 -2422 1010 1305 -2107 871 1338 -2314 649 1888
1762 1888 -2155 -23 1870 -1775 -26 1950 -1947 -466 2445 -1464 -1175 2151 -916 -1073 2079
1777B079l052n05L803k653j537L666j760j671L432j769k163L973r95l155L383
1792A076J4k948K909n3l196L068P83l779K308J396l275J994J358l792J982K492
1808B337l950P22K811k960L44K657l308J80L556l105r12L403k152r97L322k350
1824d02j562M019j510k710L348m59k399K956o56k818L389K84l553K447J039l085
1840a672K198R33l576K241K086l825R33K440k934Q17K152l354P21L171l269n05
1856a443L233k382n64L072k651j035L884j963k156L366j038j925L091j228k388
1871b127L596l25l231K751M85k840K475M58l319K504J503l628J399J991k963J135
1887a36J852l302R73K792l188j16K876k504k21K823k699o52L533k166j627L208
$$ plain form
1777 2079 -973 -1478 2325 -328 -1865 1801 41 -1630 1802 33 -2130 1843 848 -2307 1076
1792 1076 1090 -1858 1051 998 -2198 870 1653 -2126 182 1578 -1697 297 1655 -2137 -155 2337
1808 2337 -1613 -891 1920 -1040 -696 1961 -1347 -1167 2389 -716 -1628 1775 -377 -1374 1948 -402
1824 -402 -1964 2055 545 -2165 1183 724 -1675 1281 625 -2193 1196 1480 -2073 374 1413 -1672
1840 -1672 526 1459 -2117 124 2210 -1615 -682 1758 -1176 -359 1793 -1561 -840 2331 -938 -1443
1856 -1443 1790 -592 -1156 1916 -735 -1770 2114 151 -2005 1361 323 -1602 1489 261 -2127
1871 -2127 1469 1144 -2087 664 1149 -1691 784 1242 -2077 427 1930 -1698 -299 1692 -1271 -136
1887 -136 1716 -1586 -613 2179 -1009 -1125 1751 -753 -974 1849 -850 -1502 2031 -135 -1762 1446
1903A446j434j540L098j524k038L482p72k682K936j76k549K808p9l092K802R06
1919A592l345J898J331k995J678J470l269J357K287l177M80K423k720K85K625
1934A920k881l06L227k296j143K995j692j194K962j714j678L279j042k227K911
1949A121o08k304K914l40k826K846M75l040K143Q32k840K038J025l188J778J734
1965A760l183J095K048k931P58K328k979J85K826k523n03K787k105p65K872j962
1981b92j221L096j452j805K975r39k076K871n21k473K693N0k661K373M47k744
1997a679K131P80k946J885J292l024J481J705l003J016K053k834N59K317k688
2012i55J72K579k497l39K785k161p78K825j863j187L001j419j768K883q57k021
$$ plain form
1903 1446 12 -1528 1570 46 -1992 1490 718 -1964 972 796 -1753 1055 976 -2116 686 1592
1919 1592 -1753 145 1476 -1519 159 1629 -1640 -283 2004 -1173 -693 1730 -990 -705 1920
1934 1920 -961 -1267 1960 -336 -1479 1516 -176 -1370 1592 -122 -1800 1479 437 -1790 1121
1949 1121 513 -1791 1123 783 -2043 803 1278 -1762 381 1213 -1627 411 1436 -1752 26 1760
1965 1760 -1423 -328 1720 -1211 -453 1875 -1104 -919 1907 -616 -1119 1668 -437 -1202 1670 -292
1981 -292 -1513 1583 131 -1674 1301 362 -1714 1157 636 -1837 856 906 -1755 618 1065 -1679
1997 -1679 452 1232 -1714 171 1463 -1561 -80 1625 -1378 -362 1691 -1143 -584 1733 -955
2012 -955 -783 1796 -701 -1040 1745 -416 -1194 1631 -232 -1419 1582 163 -1605 1278 421 -1600
2028a600K652m98k256K629k2k661K262N76k641J891Q00k761J772J327k963J204
2044b89J825k679P45J870k642O03K327k612p9K549k146l97K476k088o12K894j855
2061a10j380K869j127j560K540j013j781K784n27k381K406J77k307K025K04k485
2077a666K146Q64k905J435J491k521R76J428k543R36J993k647J69K283k057p5
2093f93K125k198k53K719j963j115K705j210j215K331j284j335K765q76k073K446
2109H76k02j954K144k60k224K386M27k761J653J087k295J279R14k518J362J614
2125A528k693N19J987k085K40J823k281Q2K551k073q76K467j270q57K143j461
2141b56j032K698j077j870K386l11j676K087n14j976K422J66k547J766P62k101
$$ plain form
2028 -1600 1052 554 -1702 927 905 -1756 506 1082 -1559 332 1132 -1629 143 1470 -1493 -289
2044 -289 1536 -1143 -398 1472 -1170 -567 1760 -852 -931 1618 -528 -925 1551 -537 -1149 1745 -110
2061 -110 -1490 1379 252 -1308 1232 219 -1562 1222 695 -1686 720 897 -1410 615 819 -1666
2077 -1666 480 1344 -1561 -126 1365 -1156 -180 1248 -1295 -359 1634 -1013 -844 1439 -618 -693
2093 -693 1432 -766 -1019 1700 -263 -1378 1327 117 -1098 1233 -51 -1386 1379 503 -1570 876
2109 876 674 -1280 864 604 -1620 766 1193 -1568 85 1172 -1123 156 1070 -1448 -86 1528
2125 1528 -1165 -646 1341 -744 -504 1319 -962 -880 1671 -402 -1278 1189 -81 -938 1205 -256
2141 -256 -1288 1410 333 -1537 849 538 -1138 949 435 -1541 881 1047 -1500 266 1028 -1073
2157a073J481N16k395J674J286k725Q22J676k114N94J487k318M96K207k275m33
2173a094K306j502n16K034j695p37K610j296j558K361n51j478K057o66j733K403
2189I45p3k323J820N29k007J577M01k227J683R89k530R95J409k069P77J307k307
2206a104P09J895k269n2K064j730k16J934j794m23K361j519j080K240r81j136
2222a101K149r29j481K341l91j994J932J47j817J702J85k057J681P22k278J207
2238A8J058k081R80J186k209P57J673k139J72J759j765K7J809j828k24K118j615
2255c04p14K104j244q45K110j126j213K229o77j557J951l14j565J852j44j831
2271a288J833L13k064J449O72k029J222R57k089Q99J317k037M93J500j867K79
$$ plain form
2157 -1073 408 924 -1471 203 1489 -1236 -414 1262 -852 -258 1229 -1089 -593 1614 -661 -1094
2173 -1094 1212 -290 -806 1228 -467 -1204 1406 110 -1448 913 362 -1116 941 275 -1458 945
2189 945 872 -1451 369 898 -1109 468 869 -1358 325 1314 -1216 -221 1188 -881 -104 1203 -1104
2206 -1104 -395 1500 -769 -821 1243 -487 -703 1231 -563 -986 1375 -144 -1224 1016 35 -1101
2222 -1101 1048 119 -1362 979 588 -1406 526 673 -1144 558 743 -1314 367 1089 -1189 18
2238 18 1076 -1005 -25 1161 -1048 -291 1382 -757 -585 1174 -591 -564 1245 -583 -807 1311 -304
2255 -304 -1018 1086 -158 -1003 1107 -19 -1232 997 320 -1237 714 400 -1165 687 543 -1288
2271 -1288 545 858 -1206 243 915 -1114 108 1065 -1024 -125 1192 -845 -352 1148 -719 -440
2287d40J637j821l2J897j650m07J959j378p06K002j140r49K026q81j220J974o17
2304B54j427J920l03j611J774j4j774J631L06j917J394O65j937J109Q82j928R08
2321f8J180j980N05J492j786J90J576j672m7J792j580m73J943j167p67J812j016
2338f6r20J960p91j323J886l44j450J649k15j486J739K6j877J503N08j786J185
2355A98N81j807J160Q82j997P67J249j708M36J185j721M10J579j792j71J818j306
2372b37m84J633j191n19J888j082j094J864n22j180J606m91j244J817k10j760
2388a206J549L92j625J144L40j616J305O57j945Q78J070j644N76R59j676O66J355
2405A179j851L7J632j331j65J368j343j43J727j321p60J817p59q70J521p73r31
$$ plain form
2287 -440 1197 -624 -656 1241 -409 -816 1143 -235 -941 1061 -79 -1028 998 117 -1103 871 254
2304 254 -1173 747 444 -1167 607 593 -1181 450 756 -1161 233 898 -1039 70 952 -976 -68
2321 -68 1112 -868 -363 1129 -657 -467 1109 -563 -610 1182 -398 -871 1072 -95 -862 950 -66
2338 -66 -986 974 183 -1140 746 402 -1048 601 386 -1100 639 665 -1212 291 799 -987 198
2355 198 779 -1028 132 1014 -983 -216 1033 -675 -239 946 -775 -365 1214 -578 -749 1069 -237
2372 -237 -721 912 -279 -798 1090 8 -1086 778 256 -924 682 191 -1053 764 554 -1206
2388 -1206 343 735 -890 254 594 -1022 283 940 -1005 -127 943 -701 -125 834 -842 -176 1179
2405 1179 -672 -635 997 -334 -499 869 -474 -617 1110 -211 -971 846 87 -783 738 -35 -966
2422i66J834m80j514J564J11j385J205N4j438J458L98j868R95Q89j554O87P64
2439G54j618P83J187j793J89J433j298J7J170j401M8J659j409n72J662q24o30
2456f43J393r38o49J773p44j244J572j68j117J269k77j227J561R7j680J125N99
2473G02j405Q43M56j506R84R16j748M12J225j323J77J054j391K03J491j430l92
2490g32J551r08m58J305r94m99J659q27j042J545l31j002J276l93j063J501j11
2507D77j446J232K89j312J016K41j401J091O36j632O41R45j344M24Q74j377L83
2524b63J208j414n0J348j081k41J289j064m00J564q93q08J461n15q33J310m69
2541A49r79J439k37j251J258O6j231J114J58j356J084M44j450P89O64j323O40
$$ plain form
2422 -966 868 388 -1126 438 549 -836 369 423 -1015 443 841 -1027 -32 857 -697 -10 754
2439 754 -864 -81 1106 -687 -498 935 -363 -346 824 -577 -529 1130 -279 -851 811 -13 -643
2456 -643 750 -188 -837 936 192 -1052 520 352 -765 504 227 -1000 561 658 -1022 103 702
2473 702 -703 140 596 -910 74 990 -758 -346 879 -444 -267 787 -604 -401 1090 -340 -732
2490 -732 819 -89 -547 758 -236 -735 924 97 -945 600 269 -733 543 150 -913 588 477
2507 477 -969 263 552 -760 256 497 -904 187 823 -809 -168 777 -567 -143 731 -646 -263
2524 -263 945 -469 -519 829 -252 -493 796 -268 -668 896 3 -805 656 141 -692 618 149
2541 149 -830 609 372 -879 379 445 -786 328 486 -870 214 658 -792 -3 661 -662 -22
2558b2O98j389N46R76j379K32J123j220M4J194j159j83J351r76m65J338p59n93
2576f43J354o67q01J394m04j030J295j50j128J194L3j247J068K86j311R00M44
2593E87j311P72O27j357N85Q03j308L85R40j254K15J080j186JJ152j061j50J232
2611G52r78l68J303p66n96J277n76p22J290m38r31J244j48j046J074J6j113J040
2629C14K14j279Q78N16j256O06N94j210N82P59j315L33R96j154Q9R82j063M3J124
2648G53j073k47J245p92m27J131p38m34J267o69p71J288k93q71J060k34q59J145
2666D81q6j161J010K84j113P44K93j096Q13N13j342N10Q73j128K10P73j053K60
2684b15R68j144r4J162q36k87J002q00k68J229q02o59J267l67p43J010l77o80
$$ plain form
2558 -22 676 -713 -167 809 -570 -338 785 -435 -391 803 -356 -539 812 -164 -629 709 -50 -643
2576 -643 711 44 -757 637 233 -797 498 348 -780 414 447 -800 268 554 -757 143 587
2593 587 -724 48 675 -682 -97 706 -602 -217 723 -531 -316 764 -422 -421 731 -330 -480 752
2611 752 -226 -594 709 -57 -653 624 48 -674 616 178 -753 491 343 -703 371 387 -726 314
2629 314 528 -751 127 643 -613 -7 587 -623 -41 718 -597 -264 732 -422 -333 649 -414 -371 753
2648 753 -320 -567 678 -114 -541 590 -148 -582 685 16 -755 533 240 -631 429 195 -664 481
2666 481 395 -766 244 528 -585 159 452 -644 169 682 -660 -150 723 -405 -195 578 -475 -215
2684 -215 753 -391 -485 677 -159 -446 556 -244 -512 717 -85 -744 523 156 -587 423 46 -634
2702f34J192l05j031J085J18r94Q25N9r71R67K66j272O74O52j052M03N19j047
2720e46N27P65j239J29J054r14r0Q76q95o4J142r29m78J206m99n66R68n21n29
2739f03J199m39r35J119j5q87Q57q2q84J040J05j185P87M49r95N69L16j013O89
2758I2N96j240L30Q53r28J46O77r47J87R84j027k37J102o45l42Q97o73l49J145
2777F21n74p62J089j61p33Q49k19p63J063m4j093Q40L33r36O18K26r59P40M56
2796E91j158M30P19r18K60N84r61L18Q36j034m9R65p08j70Q00p29j54J006o85
2815e7n08J016l69n61Q72l56o09J013k04q92Q65J29q43O68J26q67P47K91j029
2834e68N37N40r26L58N34r09L23P20r65Q5Q23p66l8P68p49q3Q98p11l08R31n05
$$ plain form
2702 -634 558 253 -778 307 425 -569 256 315 -656 311 577 -695 -21 631 -421 -18 501 -546
2720 -546 -19 746 -493 -364 690 -224 -314 562 -333 -397 745 -184 -662 544 45 -521 447 -74 -603
2739 -603 596 157 -778 341 326 -561 296 214 -670 370 475 -710 77 526 -469 100 416 -597 92
2758 92 688 -552 -222 631 -297 -151 526 -421 -234 750 -277 -514 588 -57 -399 498 -175 -524 621
2777 621 47 -715 374 213 -520 329 110 -653 410 366 -727 113 446 -490 128 354 -605 135 591
2796 591 -567 -137 582 -336 -76 508 -453 -135 701 -333 -382 583 -125 -295 505 -224 -378 628 -57
2815 -57 -565 451 82 -479 393 37 -572 441 237 -655 210 339 -504 164 290 -577 170 461 -568
2834 -568 -31 509 -417 -59 475 -434 -111 609 -356 -271 552 -214 -252 516 -233 -316 582 -129 -437 494 -11
2855a1m06Q66m29n08R19l13o56Q50j21p00P87m8p84P63J22q71O23L08q69M93M21
2876D36q82L92N38q68K24O59q07R8P31p73m7Q23o83k01Q57n94k93Q54m67m28Q40
2897D09l51n03Q20k68o01Q21j18o87P23J2p47O77J04p90O09K68q13M44L66p82
2917d07L72M75q47K46O50p73N9O70o80j8P42o72j94Q49n15l42P88m08l95Q06l41
2938F5n49Q23j45o30O71o1o16P08%p83O50K36p82M62K60p11M64L30q23L37N44
2959D50p16J33N04o73J61O15p41n9P84n31k39O59m47k15P57m60m49Q13j90n55
2979c99O38j26n26P20r4p48O73K26p26M23J96o44N14K43q28L80N20p10J54M50
2999C36o41K14N68p68mP34n34j56N67m74q7O96n54l44P93k47m51O01k30l90P06
$$ plain form
2855 -11 -417 449 20 -488 431 118 -538 312 191 -509 278 230 -554 209 331 -540 83 391 -478 15 436
2876 436 -446 -54 484 -384 -160 499 -308 -210 521 -252 -299 524 -159 -360 497 -97 -390 464 -3 -431 409
2897 409 58 -445 375 107 -494 327 209 -478 245 257 -490 187 291 -499 110 378 -435 9 375 -407
2917 -407 -35 440 -407 -161 489 -284 -225 445 -235 -253 489 -183 -377 472 -43 -385 403 -5 -400 406 65
2938 65 -484 339 194 -436 235 174 -442 266 266 -517 133 369 -413 49 309 -402 62 392 -431 -94 450
2959 450 -266 -133 371 -302 -141 474 -267 -326 458 -73 -312 347 -100 -315 442 -18 -467 346 156 -399
2979 -399 239 113 -413 307 213 -535 138 364 -362 61 257 -387 127 370 -458 -78 442 -268 -114 336
2999 336 -305 -91 477 -291 -295 439 -95 -251 316 -158 -245 451 -103 -447 346 99 -352 249 19 -371 335
3020C35j90o49O67J22o38M33J17n86N59J90q21M00M81o86J80M02o29K66N13p69
3040c03K9P05n42j03N38n19m1O86n50l17P60k99l57N78k92l14P17k77n73P02l7
3061A91m77M81p0n23N75R1o22L22L78o45L39K48o47L53M47p59J04O26n66j2M76
3082C10n21J6O61o05k29P16l36k91N75l58k64P17l42n10O97o2n00N19r3m83O24
3103B41%o73N08K16n93L47J80n90M44K92p28K32M84n73R2M19n51J22N41o01j06
3124b97O66m20k21N85l91k24O79l57m24O73j48m60N61j27m62O17m8o30N50J47
3144B69o10M25J62n95M24K44o64L03L84o04J96L77n81J65M73n84K2N66n04j14
3164b46N66m28j41N93l83k86O28k84l53N94j76m44O05r6n23N55L3n80M90J33o19
$$ plain form
3020 335 145 -504 163 285 -353 80 197 -389 170 360 -461 -61 420 -266 -86 316 -313 -47 466 -303
3040 -303 -274 431 -111 -214 324 -195 -236 450 -100 -417 343 44 -313 265 -27 -341 376 99 -474 228 191
3061 191 -286 195 125 -398 177 268 -354 -32 346 -299 40 288 -359 -6 441 -318 -214 412 -154 -166 310
3082 310 -211 -195 466 -139 -368 348 12 -279 296 -62 -326 391 49 -461 236 174 -326 193 100 -383 241
3103 241 241 -432 76 292 -301 46 226 -364 80 372 -356 -124 360 -213 -121 298 -253 -131 410 -191 -297
3124 -297 369 -51 -272 313 -78 -302 377 20 -404 269 121 -339 222 95 -367 250 202 -428 122 269
3144 269 -341 84 246 -349 75 319 -345 -42 342 -262 -66 311 -270 -105 368 -216 -194 372 -132 -246
3164 -246 320 -108 -249 344 -39 -325 303 19 -334 260 84 -360 245 149 -374 181 214 -366 124 257 -362
3185c62M30K27o26L62K98o33K64L87o06J63M49n57O0M97n36k1N59m76j29N63l87
3206g4j92N83l51k85N98k37l92N65j36m17N56r5n08N42N1n65M30J65n57L87K18
3227B86o32L37L77o38J85M04n45J40M55n97M7N80n27j19N56m02j36N82m38k37
3247c22O33k83l62N59k01l39N67j85m63N83J3n57M39Q0m94M66Q7o01M16K79n96
3268b81K25L19n28K52L62o33J26N65n49o3N08m37l8N44n04j79O76l24l46N48k35
3289Hk98N87k49m59O33m3n29M49J6m37M98J2o10M82K42n91K57K54n06L20K84o42
3311c22K16M85n34J0M08m45O9N02n57j16O68l76k79N27k78k17N84l17m21O59r4
3332A72n04M87m3m41N40k0o21N10K23n85K73K11n21L67K40o43K65M43n51O6L87
$$ plain form
3185 -362 68 295 -331 31 329 -304 -40 347 -259 -96 353 -204 -144 353 -183 -204 355 -121 -250 313 -74
3206 -74 -266 317 -34 -319 279 42 -350 215 79 -338 218 123 -385 157 208 -357 73 238 -319 68 286
3227 286 -346 -9 368 -270 -85 319 -226 -86 369 -228 -181 399 -128 -247 309 -93 -229 353 -85 -322
3247 -322 311 28 -334 225 24 -315 252 67 -396 187 200 -357 82 162 -332 134 221 -380 36 315 -281
3268 -281 -56 263 -265 -13 349 -284 -158 407 -142 -205 303 -134 -172 372 -132 -311 365 41 -305 243 8
3289 8 -290 297 48 -411 222 179 -350 99 115 -322 176 188 -422 60 302 -289 -32 222 -284 36 320 -322
3311 -322 -106 379 -155 -145 263 -182 -113 389 -168 -284 384 8 -271 256 -22 -239 345 28 -393 266 172
3332 172 -332 155 112 -329 211 191 -430 80 303 -282 -9 202 -319 48 288 -355 -90 353 -198 -132 255
3353B55m65J19M53n64l9N98l83j97M86l41j34N57l68l14O25j51m39M96j21l84
3373c11N62p1n73N14J40n52L53J21n13M14K21o76K93M05n63J31L71n09J41M51
3393C49n77NN72m25j28M78l99q9N75m27k64O10j96l53M89j82l07N51j62m89N34
3414A65M3m88L98M5m73M30J48o20L47L15n57K03K97n22K20L88n86P1N11m75n5
3435a95M86m33n4N41m29k26N94k72k83N14k25k87N31j95m14N45l9m45M37qm38
3456b95M28P1n25L81J90n16K73K47n02K32L15n47J44M07m83M2M38m52k0M64m06
3477a14j13N21l58k10N43k70k83N35k08l54N26j22m04M94m6m44M37L2m68M10R8
3498B02m97L38K09n13K59K63m89K10K90m83J20L95m67L2M04l93k9M30l99j09N07
$$ plain form
3353 255 -210 -91 362 -202 -241 357 -26 -223 263 -78 -212 345 -23 -337 288 137 -302 194 73 -311
3373 -311 251 180 -393 121 261 -291 62 183 -330 84 305 -371 -78 327 -236 -105 266 -243 -102 349
3393 349 -228 -223 349 -76 -204 274 -125 -214 361 -66 -330 280 84 -269 220 38 -269 282 120 -369 165
3414 165 208 -280 118 163 -310 120 268 -352 -5 310 -247 -44 253 -269 -49 339 -247 -176 335 -140 -195
3435 -195 291 -142 -196 345 -84 -310 284 12 -271 243 18 -269 262 67 -347 198 159 -286 151 143 -295
3456 -295 133 204 -321 60 250 -266 7 254 -248 -16 299 -248 -104 303 -180 -138 300 -152 -172 292 -114
3477 -114 -227 294 -64 -274 269 -1 -284 251 43 -311 215 93 -311 183 137 -307 130 162 -306 104 202
3498 202 -295 43 252 -261 -2 261 -228 -18 272 -211 -91 304 -163 -131 273 -120 -149 281 -118 -227 280
3519B80k96k33M77k26k52M83k13l28N11q7m24M42Lm17M05M6m99L95J65n05K75
3540BK22m51K38K38n07J87L86m92N3L72l73RL83m06n1M77l13j95M34k40j66M37
3562B44k55k77N06j24l68L93k6l32L88l5m30M14J23m84K73J72m19K78J93n08K22
3583e2L54m82O5L39l63O1L48m44jM77l50j65M20k38j27M08k82k47N08j29l40L68
3605A28o8k73M02j09l77M19P4m37K64J16l58K87J21m62K46K85m39Q3K95l55J18
3626d0L07m68L6M54l50j30L93k72p7M05l26j89N03j83k99L68r2k32L92j38l47
3647b85M13M8l96K68P1l25L00N7m18K70K29m19J22K31l38J49K51m35Q4L85l48
3668h6o9L33k74k5L76l41j44M60k01k56L81j28k16L97j63l18M20ql60L03L3l28
$$ plain form
3519 280 -16 -249 228 2 -250 233 20 -308 203 116 -308 134 137 -280 125 171 -328 67 232 -273 2
3540 2 224 -227 11 249 -258 -71 315 -177 -124 248 -125 -116 267 -139 -190 287 -26 -221 213 -27 -193 244
3562 244 -11 -288 218 94 -274 119 93 -239 149 114 -316 98 221 -263 10 182 -237 41 234 -274 -52
3583 -52 302 -180 -115 224 -139 -78 270 -174 -175 302 -48 -213 207 -31 -158 250 -32 -279 229 100 -240 128
3605 128 60 -213 189 80 -297 122 196 -241 23 139 -219 68 189 -273 -27 258 -181 -98 197 -158 -40
3626 -40 267 -201 -165 289 -61 -191 202 -70 -147 258 -68 -257 246 63 -236 132 40 -192 200 62 -285
3647 -285 128 176 -220 48 119 -206 94 151 -267 3 232 -187 -65 166 -172 -23 228 -207 -123 262 -86
3668 -86 -155 178 -96 -121 255 -86 -230 230 29 -227 154 26 -190 207 44 -274 146 138 -222 81 114 -214
3690b14L19N0m25K85K00l94J42K03l52J80K12l98R8L25l41KK90k97PL48l40r5
3712a95M07k13j86L44j81j64M06j98k81M23m5l39L21j1l16L49K1m14L13J54l92
3733a97K01J60l69K29J95m26J31L08l66K6K98l23L1L38l40n9L84k53j40L48k02
3754b6j49L70j87k31L85r0k73L24l9k88L23jl46L17O6l91K69J40m08K29K17m26
3776b15J54L00m19J07K77l63K7L96m02kL17k77j07M88k53k52L75j68j86M39j88
3797D8k64L72l5l85L56pk98L22J6l23K54J05l63K10J60l43J68J77l63J65K42l77
3819a63P4K89l14J3K89l10l3L71k79j14L66k13j41L58k12j94M03j25k92L41k3
3840I1k86L23m1l20L20P1l64K39J18l23K10J13l61K02K23l80Q8K57k96M6K44l30
$$ plain form
3690 -214 105 155 -270 15 215 -179 -37 166 -186 -6 206 -192 -94 231 -110 -108 182 -115 -108 240 -100 -195
3712 -195 212 -1 -187 157 -24 -188 218 20 -261 162 117 -222 99 88 -228 121 142 -272 41 195 -197
3733 -197 4 164 -205 24 219 -207 -76 232 -134 -108 190 -133 -102 236 -104 -163 221 -32 -172 176 -26
3754 -26 -175 195 8 -223 162 72 -201 123 84 -204 119 118 -228 89 155 -236 33 173 -235 -6 211 -215
3776 -215 -61 239 -180 -73 204 -159 -132 264 -138 -140 177 -100 -207 281 28 -224 151 -17 -203 236 48
3797 48 -216 156 121 -264 92 85 -213 109 125 -198 56 161 -202 8 168 -175 -7 170 -193 -28 214 -163
3819 -163 -89 200 -114 -101 188 -122 -155 216 -63 -177 189 -24 -165 193 -19 -213 190 65 -227 114 91
3840 91 -195 128 87 -233 87 158 -206 33 151 -172 38 151 -210 -8 215 -165 -77 180 -116 -70 174 -156
3862a56M3L34k95r4L37k18r3L22k42j52M18j70k54L39o7k22L15r8k86L68K0l64
3884b15K63R0l23K56P5l67K53J88l87R9K47l04J07J98l55R0L15l24n7L07k21m9
3906a14K98k68r6L79j90k16L24j11j65L23j38k59L80j6l34K61N4k80K69L2l71
3927b38K92J64l98J43J98l14J63J82l96J29L26l49k6K93k52jK84l12o6M00k31
3948ij91L38j44j47L18j70k21L83o0l13K88Ok50K91j9l49L04J35l77J78J53l02
3970a58J78J61l77J56K79l67L0K80k92M2K90l38m3L91k76j42L50j89j29L43k05
3991a6j91L77r9k79L11l9k60L16l6l18K99Q5l34J94J16l07K17J24l56J56K47l42
4013a35P1K49l14O7K69l36J0L52k80q5L08k24r9L56k37j73L93j43k43L29r1k42
$$ plain form
3862 -156 -113 221 -74 -168 169 -49 -142 180 -62 -214 204 34 -220 119 52 -170 145 47 -239 129 149 -215
3884 -215 48 138 -185 71 146 -221 32 220 -167 -68 179 -125 -18 180 -175 -85 230 -94 -151 156 -65 -114
3906 -114 184 -84 -180 199 9 -207 117 6 -159 164 26 -233 147 131 -203 58 112 -168 101 133 -238
3927 -238 54 218 -180 -37 161 -153 10 192 -204 -75 251 -98 -124 169 -83 -84 200 -112 -178 222 -9
3948 -9 -200 138 -6 -153 165 -5 -226 157 97 -216 72 78 -172 119 100 -249 55 190 -187 -9 144 -158
3970 -158 20 181 -196 -40 239 -128 -98 182 -110 -68 222 -116 -159 232 -44 -186 164 -25 -154 189 -16
3991 -16 -207 170 71 -208 103 64 -196 120 84 -234 65 150 -184 10 126 -181 36 160 -196 -40 207 -135
4013 -135 -64 185 -129 -62 207 -129 -119 233 -47 -132 176 -48 -147 209 -28 -201 192 49 -194 135 44 -198
4035a98L48o3l22L32K7l27K62O0l21K57J06l72K06J93l43J14K09l18R7K43l31
4056a41N1K96k94l2L09k65n6L41k47j33L64j96j70L34j30k45L47p4k78L50l2l07
4078b08L17J5l41K90P7l58K41J41l69J92K06l77J34K28l59R8K82l40L1L07l06
4099i9l1L19k58o2L31k45j24L63j86k02L54j20k28L49j04k76L50j9l31L03N3l40
4121b03K81O9l62K61J56m01J79K08l54J32K31l68J00K92l58QL29k99k4L31l01
4142i3q1L91k39j87L67j51j81L41j58k27L74n9l16L12Rk93K83K3l45L02J20l99
4164b07K14J68l26J62J62l78J68K67l78M5L02l05RL02l39j2L82k91j40L63j97
4185b9j34L49k04k01M06j24k89L35l5k60L22n6l16L22P9l70K29J36l16J92J19
$$ plain form
4035 -198 150 87 -235 97 124 -203 59 119 -202 55 161 -211 -5 188 -155 -41 168 -150 -53 190 -141
4056 -141 -90 206 -88 -120 189 -76 -132 209 -38 -171 193 -3 -173 161 31 -214 133 59 -219 131 99 -208
4078 -208 109 124 -217 73 150 -208 33 174 -195 -3 203 -174 -40 188 -171 -73 209 -131 -100 207 -99
4099 -99 -130 189 -69 -131 200 -45 -169 194 8 -194 160 40 -188 161 57 -219 131 112 -219 84 137 -203
4121 -203 78 147 -215 46 202 -199 -20 188 -166 -34 197 -171 -71 221 -137 -129 200 -99 -123 208 -93
4142 -93 -174 217 -22 -209 158 7 -174 167 9 -218 156 97 -219 93 102 -191 92 115 -230 72 192 -207
4164 -207 7 175 -151 11 173 -205 -37 230 -148 -103 199 -106 -97 205 -134 -146 236 -55 -195 168 -29
4185 -29 -163 186 -18 -219 187 63 -226 109 74 -186 136 80 -236 86 165 -205 24 160 -156 36 155
4206A55l57J89K45l81O3K73l03N2K64l44J4L73l02j15L34k08q4L23k51j78M39
4227B01j56k67L27n7k34L21q9k93L69J2l42K54J06k97J84J41m00K31J83l73J22
4248e7K40l14P1K12l15J32K92m28j9L65k35j00L25k77r2M46k03k79L31m6k54L24
4270A19o6l41L95jl90L00J33l12K07J08m01K51J64l44J87J89l50J07K76l83L9
4291a13L50l41j3K92k63j9L07k88p3L66k15j77L35j39j76L32j45k36L54l7l12
4312b11K83J7k83K86L0l52K65J47l82J99J68l43J81J90l77J19K86l57L2K97l02
4333a07PL17l09o9L70k40j54L55j83j62L54j67k13L56q9k62L11l7k78L03Ll33
4355b27K81Q8l37K14J36l40J80J93l68J24K61l55Q0K58l15J9L16l01m5L44k64
$$ plain form
4206 155 -202 -13 232 -149 -86 187 -116 -64 200 -144 -130 243 -59 -174 160 -48 -132 191 -60 -238 201
4227 201 45 -222 105 48 -186 135 46 -247 122 134 -208 46 152 -145 39 180 -220 11 194 -179 -57
4248 -57 183 -131 -60 152 -163 -31 261 -167 -186 179 -56 -156 169 -108 -200 246 43 -236 95 49 -205 119
4270 119 53 -288 107 106 -284 16 149 -163 44 152 -249 2 166 -178 9 198 -152 -45 231 -152 -113
4291 -113 237 -104 -117 175 -88 -107 200 -88 -161 205 -10 -187 148 9 -167 165 20 -216 138 101 -211
4312 -211 72 89 -194 92 122 -230 35 182 -200 -1 167 -176 5 195 -182 -63 223 -134 -102 195 -107
4333 -107 -100 217 -92 -161 209 -31 -185 170 -13 -175 179 12 -201 155 66 -196 115 78 -200 103 106 -227
4355 -227 54 142 -195 19 155 -185 -5 188 -180 -56 205 -150 -70 188 -127 -108 208 -93 -138 206 -58
4376e8j00L48k24j50L69j80k06L75j41k47L47o6k82L24ql13K98L5l28K71R1l54
4398a99K16J62l55J65K02l50J20K45l32L9K81k98MK92k79m6L41k47j22L36j78
4419cj75L44j65j99L61j03k89L47l3k85L09j0l31L11O9l57K22J55l51J84J59l57
4441a97J80K39l75P0L22l55K1K76k41l7K71k44j21L61j56j60L27j85j50L63j81
4462B8k46L31m0k59L11o3k91L40K6l63K52J07l13K26R3l62K34K01m00J24K53l15
4484a26R0K24l45O6L26l30o6L38k15q9L20k52j27L94j84k34L39q0k11L02j02k60
4506b22L55j3l44K73P2l01K49N6l45K57J64l88J35K24l20J31K00l65J08L26l64
4527a12k5L30k69l8L12k77q4L91k31k01L54j28j83L22j38k55L94o1l19K96L1k79
$$ plain form
4376 -58 -158 190 -34 -184 185 5 -201 174 33 -214 133 67 -215 109 101 -212 86 121 -207 64 155 -199
4398 -199 17 179 -176 -11 191 -159 -39 206 -126 -87 194 -104 -100 192 -87 -133 208 -39 -161 175 -3
4419 -3 -178 166 1 -198 163 60 -229 118 85 -200 109 99 -232 79 148 -209 13 168 -183 1 160 -197
4441 -197 -17 222 -153 -83 239 -116 -95 181 -60 -97 174 -70 -191 170 14 -146 181 -4 -154 209 28
4462 28 -218 113 73 -186 125 62 -229 111 137 -226 26 133 -180 46 139 -223 11 212 -188 -64 189 -126
4484 -126 -36 188 -157 -91 235 -95 -161 177 -38 -127 193 -59 -186 208 24 -210 129 49 -162 140 38 -222
4506 -222 133 120 -224 49 121 -180 69 125 -220 37 201 -187 -52 172 -148 -17 183 -182 -74 252 -112
4527 -112 -137 193 -76 -114 198 -79 -163 228 -3 -204 150 22 -161 161 23 -232 162 101 -218 78 109 -170
4549a70K59K6l43K88J31l77J66J85l18J47J81l55J16K93l61K1K95k73KK90l13
4570a10m1L69k53j49L47j76j59L54j94k05L77p8k95L12jk95L11l0l17L16P8l60
4592a99K13J37l25J88J64l59J49K54l53N4K67l03L5K81l04k2L42k77j09L41k00
4613b6j34L27j91j65L70j51k36L43p7k57L39o3l07L21M3l43K48J04l34K33J34
4634A78l76K00K01l71J22K44l34P7K75l34J5L22k98n8L27k43q8L32k32j41L53
4655A71j60k08L48j16k33L37p7k81L24j1l06K90M1l25K67Q9l64K36J59l62J81
4676@J92l62J35K48l54P1K84l27QL25l06m6L50k73j09L67k29j52L59j72k16L61
4698A54j06k55L36o4k98L31Ol25K83P1l41K37J16l55K22J70l75J63K29l45R9K48
$$ plain form
4549 -170 89 115 -228 60 191 -186 -20 165 -153 -6 175 -180 -64 229 -132 -111 184 -89 -87 203 -110
4570 -110 -151 218 -35 -184 163 -13 -172 182 -12 -217 160 82 -213 99 98 -197 114 84 -233 83 161 -199
4592 -199 14 151 -174 14 178 -181 -32 222 -131 -77 190 -113 -78 203 -101 -123 219 -58 -167 174 -26
4613 -26 -160 167 -24 -189 181 30 -206 137 60 -197 142 79 -228 93 136 -207 41 145 -189 44 178
4634 178 -198 2 203 -168 -46 198 -136 -59 216 -118 -103 219 -79 -137 190 -53 -141 191 -41 -182 171
4655 171 11 -197 151 35 -198 139 62 -219 105 94 -212 78 119 -206 61 150 -214 22 181 -181 0
4676 0 192 -170 -35 213 -141 -70 214 -113 -105 220 -86 -132 218 -55 -164 203 -26 -178 181 9 -207 154
4698 154 48 -207 129 65 -233 98 104 -221 62 133 -208 29 145 -210 12 182 -193 -30 199 -146 -47 201
4720B01l44N6L15l35k1L49k88o3L42k71j14L98k39j80L66j48k13L36j05k74L69
4741A37m1l14K94L3l09K65N3l42K71J19l64J71J97l25J41J93l60J31K82l58J1
4762a15L15k84mK94l13k7L74k68j58L72j68j83L39j64k16L96j09l09L37qk99L10
4784A12j7l46L44P8l86K17J59l25J76J49l66J88K48l94P1K91l06K6K79l23J3L55
4806B43k89j24L58j95j24L25k34j47L98j65k58L44n9k54L20p3l05L72K0l80K70
4827D3R2l22K53P4l69K41K11m05J18K46l14Q5K41l46N2L33l25m9L30k46o3L18
4849A98k62j17L93j91k27L51j09k04L23j27k48L70k4l30K75M4k98K63L5l40K74
4870D9J47l87J77J83l24J50J98l76J30K87l68J4L10k86j4L18l09n1L66k43j44
$$ plain form
4720 201 -143 -87 228 -107 -128 221 -67 -130 212 -59 -173 225 -14 -194 172 24 -189 147 42 -232 137
4741 137 96 -218 76 109 -200 65 118 -224 47 166 -198 -27 170 -155 -14 179 -181 -50 232 -126 -115
4762 -115 200 -84 -88 206 -107 -134 240 -28 -186 186 18 -165 174 10 -206 190 81 -228 109 101 -198 112
4784 112 95 -251 93 171 -215 2 161 -164 12 161 -205 -17 231 -163 -92 199 -107 -81 198 -125 -112 243
4806 243 -46 -170 188 -7 -131 194 -40 -187 211 46 -212 132 73 -181 139 66 -239 133 153 -227 43
4827 43 135 -187 66 140 -229 12 223 -182 -64 182 -132 -47 194 -152 -100 233 -92 -141 189 -57 -120 198
4849 198 -64 -181 212 21 -206 145 36 -168 155 28 -220 150 126 -204 71 115 -183 80 115 -225 49
4870 49 196 -191 -14 169 -155 -5 193 -183 -53 234 -134 -120 190 -96 -110 208 -101 -152 214 -29 -173
4891a73L32j53j67L31j57k18L66p4k99L14j2k72K84J3l35K90R7l56K00J43l28
4912a74J84J70l64J62K36l56O2K69l05K4K98l19j1L42k81j03L54k17j24L39j98
4933a2j84L72j46k45L48o9k63L29m9k88L02K4l26K60Q9l22K04J37l49J76J88l32
4955a56J18K20l10O4K54k98QL06k89l5L18k58q4L37k20j46L57j91j84L56j31k24
4977a88L32q2k74L22j9k98K96L7l26K48R9l33K12J20l30J78J89l53J28K34l14
4998a22N6K60l07J7L00k89m3L12k32r3L31k22j23L36j75j98L40j06k30L13q1k43
5020a99L17k6l01K91M4l14K40Q2l36K34J36l52J54K06l31J19J97l25J12K64l28
5041a16KK98k50n9L03k45p3L30k08j55L21j18j91L10j33k04L37p9k78K92Pk56
$$ plain form
4891 -173 159 6 -161 170 13 -205 161 87 -212 102 90 -182 102 115 -220 70 167 -189 11 154 -174
4912 -174 10 180 -184 -22 214 -142 -80 189 -116 -92 206 -113 -124 218 -63 -166 188 -29 -153 186 -12
4933 -12 -196 176 30 -215 133 64 -199 130 81 -207 95 119 -207 53 142 -180 24 161 -188 -12 176 -156
4955 -156 -38 182 -128 -64 190 -108 -100 206 -83 -118 200 -58 -142 195 -25 -171 186 -5 -189 167 36 -188
4977 -188 144 62 -212 110 91 -207 89 126 -200 48 147 -186 26 146 -184 -6 183 -170 -42 192 -122
4998 -122 -66 194 -113 -96 204 -85 -128 184 -48 -141 190 -32 -155 181 6 -192 148 42 -188 125 44 -199
5020 -199 118 92 -209 82 126 -188 52 134 -202 32 168 -184 -30 176 -155 -36 161 -164 -52 212 -116
5041 -116 -114 184 -66 -125 178 -67 -140 190 -18 -173 148 30 -161 149 16 -188 149 70 -208 84 91 -165
$$ [...]
8191H1
##END NTUPLES=NMR FID
##END=
